/home/cril/wattez/benchmarks/XCSP17/PseudoBoolean/PseudoBoolean-dec-sptate/Pb-Tate-K108.xml.lzma
/home/cril/wattez/benchmarks/XCSP17/PseudoBoolean/PseudoBoolean-dec-sptate/Pb-Tate-K097.xml.lzma
/home/cril/wattez/benchmarks/XCSP17/PseudoBoolean/PseudoBoolean-dec-spng/Pb-NG-K145.xml.lzma
/home/cril/wattez/benchmarks/XCSP17/PseudoBoolean/PseudoBoolean-dec-queen/Pb-queen-0974553.xml.lzma
/home/cril/wattez/benchmarks/XCSP17/PseudoBoolean/PseudoBoolean-dec-fpga/Pb-chnl15-16.xml.lzma
/home/cril/wattez/benchmarks/XCSP17/PseudoBoolean/PseudoBoolean-dec-pigeon/Pb-pigeon-card-085-080.xml.lzma
/home/cril/wattez/benchmarks/XCSP17/QueensKnights/QueensKnights-m1-s1/QueensKnights-008-05-mul.xml.lzma
/home/cril/wattez/benchmarks/XCSP17/QueensKnights/QueensKnights-m1-s1/QueensKnights-015-05-mul.xml.lzma
/home/cril/wattez/benchmarks/XCSP17/QueensKnights/QueensKnights-m1-s1/QueensKnights-020-05-mul.xml.lzma
/home/cril/wattez/benchmarks/XCSP17/QueensKnights/QueensKnights-m1-s1/QueensKnights-020-05-add.xml.lzma
/home/cril/wattez/benchmarks/XCSP17/QueensKnights/QueensKnights-m1-s1/QueensKnights-080-05-mul.xml.lzma
/home/cril/wattez/benchmarks/XCSP17/QueensKnights/QueensKnights-m1-s1/QueensKnights-012-05-mul.xml.lzma
/home/cril/wattez/benchmarks/XCSP17/SuperSolutions/SuperSolutions-Taillard-os15/SuperTaillard-os-15-22.xml.lzma
/home/cril/wattez/benchmarks/XCSP17/SuperSolutions/SuperSolutions-Taillard-os10/SuperTaillard-os-10-11.xml.lzma
/home/cril/wattez/benchmarks/XCSP17/SuperSolutions/SuperSolutions-Taillard-os07/SuperTaillard-os-07-26.xml.lzma
/home/cril/wattez/benchmarks/XCSP17/SuperSolutions/SuperSolutions-Sadeh-js/SuperSadeh-js-e0ddr1-1.xml.lzma
/home/cril/wattez/benchmarks/XCSP17/SuperSolutions/SuperSolutions-Sadeh-js/SuperSadeh-js-enddr1-9.xml.lzma
/home/cril/wattez/benchmarks/XCSP17/SuperSolutions/SuperSolutions-Sadeh-js/SuperSadeh-js-enddr1-5.xml.lzma
/home/cril/wattez/benchmarks/XCSP17/SuperSolutions/SuperSolutions-Sadeh-js/SuperSadeh-js-ewddr2-3.xml.lzma
/home/cril/wattez/benchmarks/XCSP17/SuperSolutions/SuperSolutions-Sadeh-js/SuperSadeh-js-e0ddr2-1.xml.lzma
/home/cril/wattez/benchmarks/XCSP17/SuperSolutions/SuperSolutions-Sadeh-js/SuperSadeh-js-e0ddr2-7.xml.lzma
/home/cril/wattez/benchmarks/XCSP17/SuperSolutions/SuperSolutions-Queens-s1/SuperQueens-14.xml.lzma
/home/cril/wattez/benchmarks/XCSP17/SuperSolutions/SuperSolutions-Queens-s1/SuperQueens-07.xml.lzma
/home/cril/wattez/benchmarks/XCSP17/SuperSolutions/SuperSolutions-Queens-s1/SuperQueens-12.xml.lzma
/home/cril/wattez/benchmarks/XCSP17/SuperSolutions/SuperSolutions-Queens-s1/SuperQueens-05.xml.lzma
/home/cril/wattez/benchmarks/XCSP17/SuperSolutions/SuperSolutions-Queens-s1/SuperQueens-02.xml.lzma
/home/cril/wattez/benchmarks/XCSP17/SuperSolutions/SuperSolutions-Queens-s1/SuperQueens-13.xml.lzma
/home/cril/wattez/benchmarks/XCSP17/SuperSolutions/SuperSolutions-Taillard-js20-15/SuperTaillard-js-20-15-15.xml.lzma
/home/cril/wattez/benchmarks/XCSP17/SuperSolutions/SuperSolutions-Taillard-os04/SuperTaillard-os-04-26.xml.lzma
/home/cril/wattez/benchmarks/XCSP17/SuperSolutions/SuperSolutions-Taillard-os20/SuperTaillard-os-20-17.xml.lzma
/home/cril/wattez/benchmarks/XCSP17/ColouredQueens/ColouredQueens-m1-s1/ColouredQueens-11.xml.lzma
/home/cril/wattez/benchmarks/XCSP17/ColouredQueens/ColouredQueens-m1-s1/ColouredQueens-12.xml.lzma
/home/cril/wattez/benchmarks/XCSP17/ColouredQueens/ColouredQueens-m1-s1/ColouredQueens-03.xml.lzma
/home/cril/wattez/benchmarks/XCSP17/ColouredQueens/ColouredQueens-m1-s1/ColouredQueens-19.xml.lzma
/home/cril/wattez/benchmarks/XCSP17/ColouredQueens/ColouredQueens-m1-s1/ColouredQueens-14.xml.lzma
/home/cril/wattez/benchmarks/XCSP17/ColouredQueens/ColouredQueens-m1-s1/ColouredQueens-10.xml.lzma
/home/cril/wattez/benchmarks/XCSP17/RenaultMod/RenaultMod-m1-s1/RenaultMod-40.xml.lzma
/home/cril/wattez/benchmarks/XCSP17/RenaultMod/RenaultMod-m1-s1/RenaultMod-12.xml.lzma
/home/cril/wattez/benchmarks/XCSP17/RenaultMod/RenaultMod-m1-s1/RenaultMod-18.xml.lzma
/home/cril/wattez/benchmarks/XCSP17/RenaultMod/RenaultMod-m1-s1/RenaultMod-09.xml.lzma
/home/cril/wattez/benchmarks/XCSP17/RenaultMod/RenaultMod-m1-s1/RenaultMod-21.xml.lzma
/home/cril/wattez/benchmarks/XCSP17/RenaultMod/RenaultMod-m1-s1/RenaultMod-24.xml.lzma
/home/cril/wattez/benchmarks/XCSP17/GracefulGraph/GracefulGraph-m1-s1/GracefulGraph-K10-P04.xml.lzma
/home/cril/wattez/benchmarks/XCSP17/GracefulGraph/GracefulGraph-m1-s1/GracefulGraph-K14-P07.xml.lzma
/home/cril/wattez/benchmarks/XCSP17/GracefulGraph/GracefulGraph-m1-s1/GracefulGraph-K03-P04.xml.lzma
/home/cril/wattez/benchmarks/XCSP17/GracefulGraph/GracefulGraph-m1-s1/GracefulGraph-K10-P09.xml.lzma
/home/cril/wattez/benchmarks/XCSP17/GracefulGraph/GracefulGraph-m1-s1/GracefulGraph-K11-P04.xml.lzma
/home/cril/wattez/benchmarks/XCSP17/GracefulGraph/GracefulGraph-m1-s1/GracefulGraph-K12-P09.xml.lzma
/home/cril/wattez/benchmarks/XCSP17/Steiner3/Steiner3-m1-s1/Steiner3-10.xml.lzma
/home/cril/wattez/benchmarks/XCSP17/Steiner3/Steiner3-m1-s1/Steiner3-14.xml.lzma
/home/cril/wattez/benchmarks/XCSP17/Steiner3/Steiner3-m1-s1/Steiner3-11.xml.lzma
/home/cril/wattez/benchmarks/XCSP17/Steiner3/Steiner3-m1-s1/Steiner3-06.xml.lzma
/home/cril/wattez/benchmarks/XCSP17/Steiner3/Steiner3-m1-s1/Steiner3-08.xml.lzma
/home/cril/wattez/benchmarks/XCSP17/Steiner3/Steiner3-m1-s1/Steiner3-09.xml.lzma
/home/cril/wattez/benchmarks/XCSP17/Knights/Knights-m1-s1/Knights-080-25.xml.lzma
/home/cril/wattez/benchmarks/XCSP17/Knights/Knights-m1-s1/Knights-100-05.xml.lzma
/home/cril/wattez/benchmarks/XCSP17/Knights/Knights-m1-s1/Knights-012-05.xml.lzma
/home/cril/wattez/benchmarks/XCSP17/Knights/Knights-m1-s1/Knights-050-09.xml.lzma
/home/cril/wattez/benchmarks/XCSP17/Knights/Knights-m1-s1/Knights-025-09.xml.lzma
/home/cril/wattez/benchmarks/XCSP17/Knights/Knights-m1-s1/Knights-025-05.xml.lzma
/home/cril/wattez/benchmarks/XCSP17/DiamondFree/DiamondFree-m1-s1/DiamondFree-055.xml.lzma
/home/cril/wattez/benchmarks/XCSP17/DiamondFree/DiamondFree-m1-s1/DiamondFree-039.xml.lzma
/home/cril/wattez/benchmarks/XCSP17/DiamondFree/DiamondFree-m1-s1/DiamondFree-027.xml.lzma
/home/cril/wattez/benchmarks/XCSP17/DiamondFree/DiamondFree-m1-s1/DiamondFree-016.xml.lzma
/home/cril/wattez/benchmarks/XCSP17/DiamondFree/DiamondFree-m1-s1/DiamondFree-013.xml.lzma
/home/cril/wattez/benchmarks/XCSP17/DiamondFree/DiamondFree-m1-s1/DiamondFree-025.xml.lzma
/home/cril/wattez/benchmarks/XCSP17/Fischer/Fischer-m1-s1/Fischer-06-09-fair.xml.lzma
/home/cril/wattez/benchmarks/XCSP17/Fischer/Fischer-m1-s1/Fischer-05-03-fair.xml.lzma
/home/cril/wattez/benchmarks/XCSP17/Fischer/Fischer-m1-s1/Fischer-11-14-fair.xml.lzma
/home/cril/wattez/benchmarks/XCSP17/Fischer/Fischer-m1-s1/Fischer-08-07-fair.xml.lzma
/home/cril/wattez/benchmarks/XCSP17/Fischer/Fischer-m1-s1/Fischer-04-04-fair.xml.lzma
/home/cril/wattez/benchmarks/XCSP17/Fischer/Fischer-m1-s1/Fischer-11-12-fair.xml.lzma
/home/cril/wattez/benchmarks/XCSP17/LatinSquare/LatinSquare-xcsp2-bqwh18-141/bqwh-18-141-83_X2.xml.lzma
/home/cril/wattez/benchmarks/XCSP17/LatinSquare/LatinSquare-xcsp2-bqwh18-141/bqwh-18-141-31_X2.xml.lzma
/home/cril/wattez/benchmarks/XCSP17/LatinSquare/LatinSquare-xcsp2-bqwh18-141/bqwh-18-141-09_X2.xml.lzma
/home/cril/wattez/benchmarks/XCSP17/LatinSquare/LatinSquare-m1-gs/qwh-o035-h405.xml.lzma
/home/cril/wattez/benchmarks/XCSP17/LatinSquare/LatinSquare-xcsp2-qwh10/qwh-10-57-7_X2.xml.lzma
/home/cril/wattez/benchmarks/XCSP17/LatinSquare/LatinSquare-xcsp2-bqwh15-106/bqwh-15-106-35_X2.xml.lzma
/home/cril/wattez/benchmarks/XCSP17/LatinSquare/LatinSquare-xcsp2-bqwh15-106/bqwh-15-106-36_X2.xml.lzma
/home/cril/wattez/benchmarks/XCSP17/LatinSquare/LatinSquare-m1-gp/qwh-o30-h375-04.xml.lzma
/home/cril/wattez/benchmarks/XCSP17/LatinSquare/LatinSquare-m1-gp/qwh-o30-h375-12.xml.lzma
/home/cril/wattez/benchmarks/XCSP17/LatinSquare/LatinSquare-m1-gp/qwh-o30-h375-17.xml.lzma
/home/cril/wattez/benchmarks/XCSP17/LatinSquare/LatinSquare-m1-gp/qwh-o30-h374-13.xml.lzma
/home/cril/wattez/benchmarks/XCSP17/LatinSquare/LatinSquare-m1-gp/qwh-o30-h374-15.xml.lzma
/home/cril/wattez/benchmarks/XCSP17/Domino/Domino-m1-s1/Domino-200-200.xml.lzma
/home/cril/wattez/benchmarks/XCSP17/Domino/Domino-m1-s1/Domino-300-300.xml.lzma
/home/cril/wattez/benchmarks/XCSP17/Domino/Domino-m1-s1/Domino-100-500.xml.lzma
/home/cril/wattez/benchmarks/XCSP17/Domino/Domino-m1-s1/Domino-700-100.xml.lzma
/home/cril/wattez/benchmarks/XCSP17/Domino/Domino-m1-s1/Domino-100-300.xml.lzma
/home/cril/wattez/benchmarks/XCSP17/Domino/Domino-m1-s1/Domino-200-100.xml.lzma
/home/cril/wattez/benchmarks/XCSP17/CostasArray/CostasArray-m1-s1/CostasArray-10.xml.lzma
/home/cril/wattez/benchmarks/XCSP17/CostasArray/CostasArray-m1-s1/CostasArray-13.xml.lzma
/home/cril/wattez/benchmarks/XCSP17/CostasArray/CostasArray-m1-s1/CostasArray-15.xml.lzma
/home/cril/wattez/benchmarks/XCSP17/CostasArray/CostasArray-m1-s1/CostasArray-18.xml.lzma
/home/cril/wattez/benchmarks/XCSP17/CostasArray/CostasArray-m1-s1/CostasArray-16.xml.lzma
/home/cril/wattez/benchmarks/XCSP17/CostasArray/CostasArray-m1-s1/CostasArray-11.xml.lzma
/home/cril/wattez/benchmarks/XCSP17/MagicSquare/MagicSquare-m1-gp/MagicSquare-9-f10-12.xml.lzma
/home/cril/wattez/benchmarks/XCSP17/MagicSquare/MagicSquare-m1-gp/MagicSquare-9-f50-19.xml.lzma
/home/cril/wattez/benchmarks/XCSP17/MagicSquare/MagicSquare-m1-gp/MagicSquare-9-f10-13.xml.lzma
/home/cril/wattez/benchmarks/XCSP17/MagicSquare/MagicSquare-m1-gp/MagicSquare-9-f50-01.xml.lzma
/home/cril/wattez/benchmarks/XCSP17/MagicSquare/MagicSquare-m1-gp/MagicSquare-9-f50-12.xml.lzma
/home/cril/wattez/benchmarks/XCSP17/MagicSquare/MagicSquare-m1-gp/MagicSquare-9-f10-20.xml.lzma
/home/cril/wattez/benchmarks/XCSP17/MagicSquare/MagicSquare-mdd-s1/MagicSquare-13-mdd.xml.lzma
/home/cril/wattez/benchmarks/XCSP17/MagicSquare/MagicSquare-mdd-s1/MagicSquare-3-mdd.xml.lzma
/home/cril/wattez/benchmarks/XCSP17/MagicSquare/MagicSquare-mdd-s1/MagicSquare-4-mdd.xml.lzma
/home/cril/wattez/benchmarks/XCSP17/MagicSquare/MagicSquare-mdd-s1/MagicSquare-6-mdd.xml.lzma
/home/cril/wattez/benchmarks/XCSP17/MagicSquare/MagicSquare-mdd-s1/MagicSquare-15-mdd.xml.lzma
/home/cril/wattez/benchmarks/XCSP17/MagicSquare/MagicSquare-mdd-s1/MagicSquare-7-mdd.xml.lzma
/home/cril/wattez/benchmarks/XCSP17/MagicSquare/MagicSquare-table-s1/MagicSquare-6-table.xml.lzma
/home/cril/wattez/benchmarks/XCSP17/MagicSquare/MagicSquare-table-s1/MagicSquare-3-table.xml.lzma
/home/cril/wattez/benchmarks/XCSP17/MagicSquare/MagicSquare-table-s1/MagicSquare-4-table.xml.lzma
/home/cril/wattez/benchmarks/XCSP17/MagicSquare/MagicSquare-table-s1/MagicSquare-5-table.xml.lzma
/home/cril/wattez/benchmarks/XCSP17/MagicSquare/MagicSquare-sum-s1/MagicSquare-25-sum.xml.lzma
/home/cril/wattez/benchmarks/XCSP17/MagicSquare/MagicSquare-sum-s1/MagicSquare-22-sum.xml.lzma
/home/cril/wattez/benchmarks/XCSP17/MagicSquare/MagicSquare-sum-s1/MagicSquare-26-sum.xml.lzma
/home/cril/wattez/benchmarks/XCSP17/MagicSquare/MagicSquare-sum-s1/MagicSquare-3-sum.xml.lzma
/home/cril/wattez/benchmarks/XCSP17/MagicSquare/MagicSquare-sum-s1/MagicSquare-18-sum.xml.lzma
/home/cril/wattez/benchmarks/XCSP17/MagicSquare/MagicSquare-sum-s1/MagicSquare-23-sum.xml.lzma
/home/cril/wattez/benchmarks/XCSP17/Blackhole/Blackhole-xcsp2-s07/Blackhole-4-07h-9_X2.xml.lzma
/home/cril/wattez/benchmarks/XCSP17/Blackhole/Blackhole-xcsp2-s07/Blackhole-4-07h-5_X2.xml.lzma
/home/cril/wattez/benchmarks/XCSP17/Blackhole/Blackhole-xcsp2-s07/Blackhole-4-07-6_X2.xml.lzma
/home/cril/wattez/benchmarks/XCSP17/Blackhole/Blackhole-xcsp2-s13/Blackhole-4-13-2_X2.xml.lzma
/home/cril/wattez/benchmarks/XCSP17/Blackhole/Blackhole-m1-s07/Blackhole-07-3-10.xml.lzma
/home/cril/wattez/benchmarks/XCSP17/Blackhole/Blackhole-xcsp2-s04/Blackhole-4-04-2_X2.xml.lzma
/home/cril/wattez/benchmarks/XCSP17/Blackhole/Blackhole-xcsp2-s04/Blackhole-4-04-9_X2.xml.lzma
/home/cril/wattez/benchmarks/XCSP17/Blackhole/Blackhole-m1-s04/Blackhole-04-3-09.xml.lzma
/home/cril/wattez/benchmarks/XCSP17/Blackhole/Blackhole-m1-s04/Blackhole-04-3-07.xml.lzma
/home/cril/wattez/benchmarks/XCSP17/Blackhole/Blackhole-m1-s13/Blackhole-13-3-01.xml.lzma
/home/cril/wattez/benchmarks/XCSP17/Blackhole/Blackhole-m1-s10/Blackhole-10-3-01.xml.lzma
/home/cril/wattez/benchmarks/XCSP17/Blackhole/Blackhole-m1-s10/Blackhole-10-3-04.xml.lzma
/home/cril/wattez/benchmarks/XCSP17/SocialGolfers/SocialGolfers-xcsp2-s1/SocialGolfers-06-3-5_X2.xml.lzma
/home/cril/wattez/benchmarks/XCSP17/SocialGolfers/SocialGolfers-xcsp2-s1/SocialGolfers-06-3-8_X2.xml.lzma
/home/cril/wattez/benchmarks/XCSP17/SocialGolfers/SocialGolfers-xcsp2-s1/SocialGolfers-08-4-8_X2.xml.lzma
/home/cril/wattez/benchmarks/XCSP17/SocialGolfers/SocialGolfers-xcsp2-s1/SocialGolfers-06-4-6_X2.xml.lzma
/home/cril/wattez/benchmarks/XCSP17/SocialGolfers/SocialGolfers-xcsp2-s1/SocialGolfers-09-4-8_X2.xml.lzma
/home/cril/wattez/benchmarks/XCSP17/SocialGolfers/SocialGolfers-xcsp2-s1/SocialGolfers-06-3-6_X2.xml.lzma
/home/cril/wattez/benchmarks/XCSP17/SocialGolfers/SocialGolfers-cp-s1/SocialGolfers-6-2-6-cp.xml.lzma
/home/cril/wattez/benchmarks/XCSP17/SocialGolfers/SocialGolfers-cp-s1/SocialGolfers-5-2-4-cp.xml.lzma
/home/cril/wattez/benchmarks/XCSP17/SocialGolfers/SocialGolfers-cp-s1/SocialGolfers-2-3-3-cp.xml.lzma
/home/cril/wattez/benchmarks/XCSP17/SocialGolfers/SocialGolfers-cp-s1/SocialGolfers-9-3-5-cp.xml.lzma
/home/cril/wattez/benchmarks/XCSP17/SocialGolfers/SocialGolfers-cp-s1/SocialGolfers-3-9-4-cp.xml.lzma
/home/cril/wattez/benchmarks/XCSP17/SocialGolfers/SocialGolfers-cp-s1/SocialGolfers-4-2-9-cp.xml.lzma
/home/cril/wattez/benchmarks/XCSP17/KnightTour/KnightTour-ext-s1/KnightTour-10-ext06.xml.lzma
/home/cril/wattez/benchmarks/XCSP17/KnightTour/KnightTour-ext-s1/KnightTour-15-ext06.xml.lzma
/home/cril/wattez/benchmarks/XCSP17/KnightTour/KnightTour-ext-s1/KnightTour-10-ext02.xml.lzma
/home/cril/wattez/benchmarks/XCSP17/KnightTour/KnightTour-ext-s1/KnightTour-04-ext02.xml.lzma
/home/cril/wattez/benchmarks/XCSP17/KnightTour/KnightTour-ext-s1/KnightTour-14-ext03.xml.lzma
/home/cril/wattez/benchmarks/XCSP17/KnightTour/KnightTour-ext-s1/KnightTour-16-ext02.xml.lzma
/home/cril/wattez/benchmarks/XCSP17/KnightTour/KnightTour-int-s1/KnightTour-13-int.xml.lzma
/home/cril/wattez/benchmarks/XCSP17/KnightTour/KnightTour-int-s1/KnightTour-14-int.xml.lzma
/home/cril/wattez/benchmarks/XCSP17/KnightTour/KnightTour-int-s1/KnightTour-06-int.xml.lzma
/home/cril/wattez/benchmarks/XCSP17/KnightTour/KnightTour-int-s1/KnightTour-11-int.xml.lzma
/home/cril/wattez/benchmarks/XCSP17/KnightTour/KnightTour-int-s1/KnightTour-07-int.xml.lzma
/home/cril/wattez/benchmarks/XCSP17/KnightTour/KnightTour-int-s1/KnightTour-10-int.xml.lzma
/home/cril/wattez/benchmarks/XCSP17/Crossword/Crossword-m1c-words-puzzle/Crossword-m1c-words-p20.xml.lzma
/home/cril/wattez/benchmarks/XCSP17/Crossword/Crossword-m1c-uk-vg/Crossword-m1c-uk-vg-4-8.xml.lzma
/home/cril/wattez/benchmarks/XCSP17/Crossword/Crossword-m1c-ogd2008-vg/Crossword-m1c-ogd2008-vg-11-12.xml.lzma
/home/cril/wattez/benchmarks/XCSP17/Crossword/Crossword-m1c-ogd2008-vg/Crossword-m1c-ogd2008-vg-13-13.xml.lzma
/home/cril/wattez/benchmarks/XCSP17/Crossword/Crossword-m1c-lex-herald/Crossword-m1c-lex-h1501.xml.lzma
/home/cril/wattez/benchmarks/XCSP17/Crossword/Crossword-m1c-ogd-herald/Crossword-m1c-ogd-h2310.xml.lzma
/home/cril/wattez/benchmarks/XCSP17/Hanoi/Hanoi-m1-s1/Hanoi-06.xml.lzma
/home/cril/wattez/benchmarks/XCSP17/Hanoi/Hanoi-m1-s1/Hanoi-08.xml.lzma
/home/cril/wattez/benchmarks/XCSP17/Hanoi/Hanoi-m1-s1/Hanoi-07.xml.lzma
/home/cril/wattez/benchmarks/XCSP17/Hanoi/Hanoi-m1-s1/Hanoi-09.xml.lzma
/home/cril/wattez/benchmarks/XCSP17/Hanoi/Hanoi-m1-s1/Hanoi-04.xml.lzma
/home/cril/wattez/benchmarks/XCSP17/Hanoi/Hanoi-m1-s1/Hanoi-03.xml.lzma
/home/cril/wattez/benchmarks/XCSP17/Driver/Driver-m1-s1/driverlogw-09.xml.lzma
/home/cril/wattez/benchmarks/XCSP17/Driver/Driver-m1-s1/driverlogw-08cc.xml.lzma
/home/cril/wattez/benchmarks/XCSP17/Driver/Driver-m1-s1/driverlogw-04c.xml.lzma
/home/cril/wattez/benchmarks/XCSP17/Driver/Driver-m1-s1/driverlogw-01c.xml.lzma
/home/cril/wattez/benchmarks/XCSP17/Driver/Driver-m1-s1/driverlogw-08c.xml.lzma
/home/cril/wattez/benchmarks/XCSP17/Driver/Driver-m1-s1/driverlogw-02c.xml.lzma
/home/cril/wattez/benchmarks/XCSP17/RoomMate/RoomMate-int-s1/RoomMate-sr1000b-int.xml.lzma
/home/cril/wattez/benchmarks/XCSP17/RoomMate/RoomMate-int-s1/RoomMate-sr0008-int.xml.lzma
/home/cril/wattez/benchmarks/XCSP17/RoomMate/RoomMate-int-s1/RoomMate-sr0006-int.xml.lzma
/home/cril/wattez/benchmarks/XCSP17/RoomMate/RoomMate-int-s1/RoomMate-sr0050-int.xml.lzma
/home/cril/wattez/benchmarks/XCSP17/RoomMate/RoomMate-int-s1/RoomMate-sr0090-int.xml.lzma
/home/cril/wattez/benchmarks/XCSP17/RoomMate/RoomMate-int-s1/RoomMate-sr0004-int.xml.lzma
/home/cril/wattez/benchmarks/XCSP17/SchurrLemma/SchurrLemma-nor-s1/SchurrLemma-nor-067-4.xml.lzma
/home/cril/wattez/benchmarks/XCSP17/SchurrLemma/SchurrLemma-nor-s1/SchurrLemma-nor-024-3.xml.lzma
/home/cril/wattez/benchmarks/XCSP17/SchurrLemma/SchurrLemma-nor-s1/SchurrLemma-nor-023-3.xml.lzma
/home/cril/wattez/benchmarks/XCSP17/SchurrLemma/SchurrLemma-nor-s1/SchurrLemma-nor-066-4.xml.lzma
/home/cril/wattez/benchmarks/XCSP17/SchurrLemma/SchurrLemma-mod-s1/SchurrLemma-mod-020-9.xml.lzma
/home/cril/wattez/benchmarks/XCSP17/SchurrLemma/SchurrLemma-mod-s1/SchurrLemma-mod-100-9.xml.lzma
/home/cril/wattez/benchmarks/XCSP17/SchurrLemma/SchurrLemma-mod-s1/SchurrLemma-mod-015-9.xml.lzma
/home/cril/wattez/benchmarks/XCSP17/SchurrLemma/SchurrLemma-mod-s1/SchurrLemma-mod-030-9.xml.lzma
/home/cril/wattez/benchmarks/XCSP17/SchurrLemma/SchurrLemma-mod-s1/SchurrLemma-mod-012-9.xml.lzma
/home/cril/wattez/benchmarks/XCSP17/SchurrLemma/SchurrLemma-mod-s1/SchurrLemma-mod-050-9.xml.lzma
/home/cril/wattez/benchmarks/XCSP17/DeBruijnSequence/DeBruijnSequence-m1-s1/DeBruijnSequence-03-05.xml.lzma
/home/cril/wattez/benchmarks/XCSP17/DeBruijnSequence/DeBruijnSequence-m1-s1/DeBruijnSequence-04-05.xml.lzma
/home/cril/wattez/benchmarks/XCSP17/DeBruijnSequence/DeBruijnSequence-m1-s1/DeBruijnSequence-02-09.xml.lzma
/home/cril/wattez/benchmarks/XCSP17/DeBruijnSequence/DeBruijnSequence-m1-s1/DeBruijnSequence-02-02.xml.lzma
/home/cril/wattez/benchmarks/XCSP17/DeBruijnSequence/DeBruijnSequence-m1-s1/DeBruijnSequence-03-04.xml.lzma
/home/cril/wattez/benchmarks/XCSP17/DeBruijnSequence/DeBruijnSequence-m1-s1/DeBruijnSequence-03-06.xml.lzma
/home/cril/wattez/benchmarks/XCSP17/SportsScheduling/SportsScheduling-m1-s1/SportsScheduling-28.xml.lzma
/home/cril/wattez/benchmarks/XCSP17/SportsScheduling/SportsScheduling-m1-s1/SportsScheduling-32.xml.lzma
/home/cril/wattez/benchmarks/XCSP17/SportsScheduling/SportsScheduling-m1-s1/SportsScheduling-26.xml.lzma
/home/cril/wattez/benchmarks/XCSP17/SportsScheduling/SportsScheduling-m1-s1/SportsScheduling-30.xml.lzma
/home/cril/wattez/benchmarks/XCSP17/SportsScheduling/SportsScheduling-m1-s1/SportsScheduling-14.xml.lzma
/home/cril/wattez/benchmarks/XCSP17/SportsScheduling/SportsScheduling-m1-s1/SportsScheduling-34.xml.lzma
/home/cril/wattez/benchmarks/XCSP17/Primes/Primes-m1-p10/Primes-10-20-3-3.xml.lzma
/home/cril/wattez/benchmarks/XCSP17/Primes/Primes-m1-p10/Primes-10-60-3-3.xml.lzma
/home/cril/wattez/benchmarks/XCSP17/Primes/Primes-m1-p15/Primes-15-60-3-5.xml.lzma
/home/cril/wattez/benchmarks/XCSP17/Primes/Primes-m1-p15/Primes-15-20-2-5.xml.lzma
/home/cril/wattez/benchmarks/XCSP17/Primes/Primes-m1-p20/Primes-20-40-2-1.xml.lzma
/home/cril/wattez/benchmarks/XCSP17/Primes/Primes-m1-p30/Primes-30-60-3-1.xml.lzma
/home/cril/wattez/benchmarks/XCSP17/Queens/Queens-m1-s1/Queens-0150-m1.xml.lzma
/home/cril/wattez/benchmarks/XCSP17/Queens/Queens-m1-s1/Queens-0200-m1.xml.lzma
/home/cril/wattez/benchmarks/XCSP17/Queens/Queens-m1-s1/Queens-0120-m1.xml.lzma
/home/cril/wattez/benchmarks/XCSP17/Queens/Queens-m1-s1/Queens-0015-m1.xml.lzma
/home/cril/wattez/benchmarks/XCSP17/Queens/Queens-m1-s1/Queens-0050-m1.xml.lzma
/home/cril/wattez/benchmarks/XCSP17/Queens/Queens-m1-s1/Queens-0100-m1.xml.lzma
/home/cril/wattez/benchmarks/XCSP17/MagicSequence/MagicSequence-count-s1/MagicSequence-1000-co.xml.lzma
/home/cril/wattez/benchmarks/XCSP17/MagicSequence/MagicSequence-count-s1/MagicSequence-090-co.xml.lzma
/home/cril/wattez/benchmarks/XCSP17/MagicSequence/MagicSequence-count-s1/MagicSequence-004-co.xml.lzma
/home/cril/wattez/benchmarks/XCSP17/MagicSequence/MagicSequence-count-s1/MagicSequence-080-co.xml.lzma
/home/cril/wattez/benchmarks/XCSP17/MagicSequence/MagicSequence-count-s1/MagicSequence-600-co.xml.lzma
/home/cril/wattez/benchmarks/XCSP17/MagicSequence/MagicSequence-count-s1/MagicSequence-012-co.xml.lzma
/home/cril/wattez/benchmarks/XCSP17/MagicSequence/MagicSequence-card-s1/MagicSequence-006-ca.xml.lzma
/home/cril/wattez/benchmarks/XCSP17/MagicSequence/MagicSequence-card-s1/MagicSequence-070-ca.xml.lzma
/home/cril/wattez/benchmarks/XCSP17/MagicSequence/MagicSequence-card-s1/MagicSequence-300-ca.xml.lzma
/home/cril/wattez/benchmarks/XCSP17/MagicSequence/MagicSequence-card-s1/MagicSequence-013-ca.xml.lzma
/home/cril/wattez/benchmarks/XCSP17/MagicSequence/MagicSequence-card-s1/MagicSequence-090-ca.xml.lzma
/home/cril/wattez/benchmarks/XCSP17/MagicSequence/MagicSequence-card-s1/MagicSequence-018-ca.xml.lzma
/home/cril/wattez/benchmarks/XCSP17/QRandom/QRandom-geometric-rw/geometric-50-20-d4-75-14.xml.lzma
/home/cril/wattez/benchmarks/XCSP17/QRandom/QRandom-geometric-rw/geometric-50-20-d4-75-46.xml.lzma
/home/cril/wattez/benchmarks/XCSP17/QRandom/QRandom-geometric-rw/geometric-50-20-d4-75-03.xml.lzma
/home/cril/wattez/benchmarks/XCSP17/QRandom/QRandom-geometric-rw/geometric-50-20-d4-75-54.xml.lzma
/home/cril/wattez/benchmarks/XCSP17/QRandom/QRandom-mdd-7-25-5/mdd-7-25-5-56-02.xml.lzma
/home/cril/wattez/benchmarks/XCSP17/QRandom/QRandom-mdd-7-25-5/mdd-7-25-5-56-16.xml.lzma
/home/cril/wattez/benchmarks/XCSP17/QRandom/QRandom-mdd-7-25-5-p9/mdd-7-25-5-ps05-psh09-3.xml.lzma
/home/cril/wattez/benchmarks/XCSP17/QRandom/QRandom-m1-lard/lard-92-92.xml.lzma
/home/cril/wattez/benchmarks/XCSP17/QRandom/QRandom-m1-lard/lard-90-90.xml.lzma
/home/cril/wattez/benchmarks/XCSP17/QRandom/QRandom-m1-lard/lard-83-83.xml.lzma
/home/cril/wattez/benchmarks/XCSP17/QRandom/QRandom-m1-lard/lard-85-85.xml.lzma
/home/cril/wattez/benchmarks/XCSP17/QRandom/QRandom-composed-s25/composed-25-10-20-5.xml.lzma
/home/cril/wattez/benchmarks/XCSP17/QRandom/QRandom-composed-s25/composed-25-01-25-4.xml.lzma
/home/cril/wattez/benchmarks/XCSP17/QRandom/QRandom-composed-s25/composed-25-01-25-3.xml.lzma
/home/cril/wattez/benchmarks/XCSP17/QRandom/QRandom-mdd-7-25-5-p7/mdd-7-25-5-ps05-psh07-4.xml.lzma
/home/cril/wattez/benchmarks/XCSP17/QRandom/QRandom-ehi-s90/ehi-90-315-37.xml.lzma
/home/cril/wattez/benchmarks/XCSP17/QRandom/QRandom-ehi-s90/ehi-90-315-13.xml.lzma
/home/cril/wattez/benchmarks/XCSP17/QRandom/QRandom-bdd-18-21-2/bdd-18-21-2-133-78-24.xml.lzma
/home/cril/wattez/benchmarks/XCSP17/QRandom/QRandom-bdd-18-21-2/bdd-18-21-2-133-78-06.xml.lzma
/home/cril/wattez/benchmarks/XCSP17/QRandom/QRandom-ehi-s85/ehi-85-297-98.xml.lzma
/home/cril/wattez/benchmarks/XCSP17/QRandom/QRandom-ehi-s85/ehi-85-297-30.xml.lzma
/home/cril/wattez/benchmarks/XCSP17/QRandom/QRandom-composed-s75/composed-75-01-25-6.xml.lzma
/home/cril/wattez/benchmarks/XCSP17/QRandom/QRandom-reg2ext-s1/reg-s20-p03-c20-d10-n10-l5-73.xml.lzma
/home/cril/wattez/benchmarks/XCSP17/QRandom/QRandom-reg2ext-s1/reg-s20-p03-c20-d10-n10-l5-24.xml.lzma
/home/cril/wattez/benchmarks/XCSP17/QRandom/QRandom-reg2ext-s1/reg-s20-p03-c20-d10-n10-l5-40.xml.lzma
/home/cril/wattez/benchmarks/XCSP17/QRandom/QRandom-reg2ext-s1/reg-s20-p03-c20-d10-n10-l5-30.xml.lzma
/home/cril/wattez/benchmarks/XCSP17/QRandom/QRandom-bdd-15-21-2/bdd-15-21-2-2713-79-16.xml.lzma
/home/cril/wattez/benchmarks/XCSP17/QRandom/QRandom-bdd-15-21-2/bdd-15-21-2-2713-79-08.xml.lzma
/home/cril/wattez/benchmarks/XCSP17/MarketSplit/MarketSplit-m1-gp/MarketSplit-05.xml.lzma
/home/cril/wattez/benchmarks/XCSP17/MarketSplit/MarketSplit-m1-gp/MarketSplit-10.xml.lzma
/home/cril/wattez/benchmarks/XCSP17/MarketSplit/MarketSplit-m1-gp/MarketSplit-08.xml.lzma
/home/cril/wattez/benchmarks/XCSP17/MarketSplit/MarketSplit-m1-gp/MarketSplit-07.xml.lzma
/home/cril/wattez/benchmarks/XCSP17/MarketSplit/MarketSplit-m1-gp/MarketSplit-09.xml.lzma
/home/cril/wattez/benchmarks/XCSP17/MarketSplit/MarketSplit-m1-gp/MarketSplit-03.xml.lzma
/home/cril/wattez/benchmarks/XCSP17/Rlfap/Rlfap-m1-scens11/Rlfap-scen-11-f05.xml.lzma
/home/cril/wattez/benchmarks/XCSP17/Rlfap/Rlfap-m1-scens11/Rlfap-scen-11-f03.xml.lzma
/home/cril/wattez/benchmarks/XCSP17/Rlfap/Rlfap-m1-graphsMod/Rlfap-graph-02-f24.xml.lzma
/home/cril/wattez/benchmarks/XCSP17/Rlfap/Rlfap-m1-scensMod/Rlfap-scen-09-w1-f03.xml.lzma
/home/cril/wattez/benchmarks/XCSP17/Rlfap/Rlfap-m1-scens/Rlfap-scen-06.xml.lzma
/home/cril/wattez/benchmarks/XCSP17/Rlfap/Rlfap-m1-scens/Rlfap-scen-05.xml.lzma
/home/cril/wattez/benchmarks/XCSP17/Renault/Renault-m1-s1/Renault-megane-pos.xml.lzma
/home/cril/wattez/benchmarks/XCSP17/Renault/Renault-m1-s1/Renault.xml.lzma
/home/cril/wattez/benchmarks/XCSP17/Renault/Renault-m1-s1/Renault-small.xml.lzma
/home/cril/wattez/benchmarks/XCSP17/Renault/Renault-m1-s1/Renault-medium-pos.xml.lzma
/home/cril/wattez/benchmarks/XCSP17/Renault/Renault-m1-s1/Renault-mgd.xml.lzma
/home/cril/wattez/benchmarks/XCSP17/Renault/Renault-m1-s1/Renault-souffleuse.xml.lzma
/home/cril/wattez/benchmarks/XCSP17/Scheduling/Scheduling-xcsp2-cabinet/Cabinet-5567_X2.xml.lzma
/home/cril/wattez/benchmarks/XCSP17/Scheduling/Scheduling-xcsp2-cabinet/Cabinet-5580_X2.xml.lzma
/home/cril/wattez/benchmarks/XCSP17/Scheduling/Scheduling-xcsp2-cabinet/Cabinet-5585_X2.xml.lzma
/home/cril/wattez/benchmarks/XCSP17/Scheduling/Scheduling-xcsp2-cabinet/Cabinet-5575_X2.xml.lzma
/home/cril/wattez/benchmarks/XCSP17/Scheduling/Scheduling-jsdec-sadeh/Sadeh-e0ddr1-9.xml.lzma
/home/cril/wattez/benchmarks/XCSP17/Scheduling/Scheduling-jsdec-sadeh/Sadeh-enddr1-3.xml.lzma
/home/cril/wattez/benchmarks/XCSP17/Scheduling/Scheduling-jsdec-sadeh/Sadeh-ewddr2-4.xml.lzma
/home/cril/wattez/benchmarks/XCSP17/Scheduling/Scheduling-jsdec-sadeh/Sadeh-ewddr1-9.xml.lzma
/home/cril/wattez/benchmarks/XCSP17/Scheduling/Scheduling-jsdec-sadeh/Sadeh-enddr1-4.xml.lzma
/home/cril/wattez/benchmarks/XCSP17/Scheduling/Scheduling-jsdec-sadeh/Sadeh-e0ddr2-0.xml.lzma
/home/cril/wattez/benchmarks/XCSP17/Scheduling/Scheduling-xcsp2-cjss/la03x2-593_X2.xml.lzma
/home/cril/wattez/benchmarks/XCSP17/Scheduling/Scheduling-xcsp2-os-gp/gp10-05-1070_X2.xml.lzma
/home/cril/wattez/benchmarks/XCSP17/CoveringArray/CoveringArray-elt-s1/CoveringArray-elt-3-10-2-12.xml.lzma
/home/cril/wattez/benchmarks/XCSP17/CoveringArray/CoveringArray-elt-s1/CoveringArray-elt-3-04-2-08.xml.lzma
/home/cril/wattez/benchmarks/XCSP17/CoveringArray/CoveringArray-elt-s1/CoveringArray-elt-3-09-2-12.xml.lzma
/home/cril/wattez/benchmarks/XCSP17/CoveringArray/CoveringArray-elt-s1/CoveringArray-elt-3-04-2-09.xml.lzma
/home/cril/wattez/benchmarks/XCSP17/CoveringArray/CoveringArray-elt-s1/CoveringArray-elt-3-06-2-12.xml.lzma
/home/cril/wattez/benchmarks/XCSP17/CoveringArray/CoveringArray-elt-s1/CoveringArray-elt-3-07-2-12.xml.lzma
/home/cril/wattez/benchmarks/XCSP17/Kakuro/Kakuro-ext-medium/Kakuro-medium-020-ext.xml.lzma
/home/cril/wattez/benchmarks/XCSP17/Kakuro/Kakuro-ext-medium/Kakuro-medium-162-ext.xml.lzma
/home/cril/wattez/benchmarks/XCSP17/Kakuro/Kakuro-ext-medium/Kakuro-medium-016-ext.xml.lzma
/home/cril/wattez/benchmarks/XCSP17/Kakuro/Kakuro-ext-easy/Kakuro-easy-084-ext.xml.lzma
/home/cril/wattez/benchmarks/XCSP17/Kakuro/Kakuro-ext-easy/Kakuro-easy-109-ext.xml.lzma
/home/cril/wattez/benchmarks/XCSP17/Kakuro/Kakuro-ext-easy/Kakuro-easy-150-ext.xml.lzma
/home/cril/wattez/benchmarks/XCSP17/Kakuro/Kakuro-sumdiff-easy/Kakuro-easy-079-sumdiff.xml.lzma
/home/cril/wattez/benchmarks/XCSP17/Kakuro/Kakuro-sumdiff-easy/Kakuro-easy-015-sumdiff.xml.lzma
/home/cril/wattez/benchmarks/XCSP17/Kakuro/Kakuro-sumdiff-easy/Kakuro-easy-164-sumdiff.xml.lzma
/home/cril/wattez/benchmarks/XCSP17/Kakuro/Kakuro-sumdiff-medium/Kakuro-medium-191-sumdiff.xml.lzma
/home/cril/wattez/benchmarks/XCSP17/Kakuro/Kakuro-sumdiff-medium/Kakuro-medium-055-sumdiff.xml.lzma
/home/cril/wattez/benchmarks/XCSP17/Kakuro/Kakuro-sumdiff-hard/Kakuro-hard-179-sumdiff.xml.lzma
/home/cril/wattez/benchmarks/XCSP17/Random/Random-RB-3-28-28f/rand-3-28-28-93-632f-05.xml.lzma
/home/cril/wattez/benchmarks/XCSP17/Random/Random-RB-2-30-15f/rand-2-30-15-306-230f-09.xml.lzma
/home/cril/wattez/benchmarks/XCSP17/Random/Random-m1-5-12-12t/rand-5-12-12-200-t95-3.xml.lzma
/home/cril/wattez/benchmarks/XCSP17/Random/Random-m1-5-12-12/rand-5-12-12-200-12442-38.xml.lzma
/home/cril/wattez/benchmarks/XCSP17/Random/Random-m1-5-2X-05c/rand-5-2X-05c-15.xml.lzma
/home/cril/wattez/benchmarks/XCSP17/Random/Random-D-t080/rand-2-40-80-103-080-39.xml.lzma
/home/cril/wattez/benchmarks/XCSP17/Random/Random-B-2-26-26/rand-2-26-26-325-155-2.xml.lzma
/home/cril/wattez/benchmarks/XCSP17/Random/Random-D-t090/rand-2-40-180-84-090-51.xml.lzma
/home/cril/wattez/benchmarks/XCSP17/Random/Random-B-2-23-23/rand-2-23-23-253-131-1.xml.lzma
/home/cril/wattez/benchmarks/XCSP17/Random/Random-B-2-23-23/rand-2-23-23-253-131-0.xml.lzma
/home/cril/wattez/benchmarks/XCSP17/Random/Random-RB-2-40-19/rand-2-40-19-443-230-30.xml.lzma
/home/cril/wattez/benchmarks/XCSP17/Random/Random-B-2-25-25/rand-2-25-25-300-147-6.xml.lzma
/home/cril/wattez/benchmarks/XCSP17/Random/Random-RB-3-20-20/rand-3-20-20-60-632-40.xml.lzma
/home/cril/wattez/benchmarks/XCSP17/Random/Random-m1-15-23-3/rand-15-23-3-16-150000-18.xml.lzma
/home/cril/wattez/benchmarks/XCSP17/Random/Random-D-t020/rand-2-40-11-414-020-35.xml.lzma
/home/cril/wattez/benchmarks/XCSP17/Random/Random-D-t020/rand-2-40-11-414-020-23.xml.lzma
/home/cril/wattez/benchmarks/XCSP17/RadarSurveillance/RadarSurveillance-m1-s8-24/RadarSurveillance-8-24-3-2-14.xml.lzma
/home/cril/wattez/benchmarks/XCSP17/RadarSurveillance/RadarSurveillance-m1-s8-24/RadarSurveillance-8-24-3-2-26.xml.lzma
/home/cril/wattez/benchmarks/XCSP17/RadarSurveillance/RadarSurveillance-m1-s8-24/RadarSurveillance-8-24-3-2-20.xml.lzma
/home/cril/wattez/benchmarks/XCSP17/RadarSurveillance/RadarSurveillance-m1-s8-30/RadarSurveillance-8-30-3-0-28.xml.lzma
/home/cril/wattez/benchmarks/XCSP17/RadarSurveillance/RadarSurveillance-m1-s8-30/RadarSurveillance-8-30-3-0-10.xml.lzma
/home/cril/wattez/benchmarks/XCSP17/RadarSurveillance/RadarSurveillance-m1-s8-30/RadarSurveillance-8-30-3-0-02.xml.lzma
/home/cril/wattez/benchmarks/XCSP17/PropStress/PropStress-m1-s1/PropStress-0100.xml.lzma
/home/cril/wattez/benchmarks/XCSP17/PropStress/PropStress-m1-s1/PropStress-0600.xml.lzma
/home/cril/wattez/benchmarks/XCSP17/PropStress/PropStress-m1-s1/PropStress-0450.xml.lzma
/home/cril/wattez/benchmarks/XCSP17/PropStress/PropStress-m1-s1/PropStress-0020.xml.lzma
/home/cril/wattez/benchmarks/XCSP17/PropStress/PropStress-m1-s1/PropStress-0150.xml.lzma
/home/cril/wattez/benchmarks/XCSP17/PropStress/PropStress-m1-s1/PropStress-0250.xml.lzma
/home/cril/wattez/benchmarks/XCSP17/Mixed/Mixed-xcsp2-cril/cril-5_X2.xml.lzma
/home/cril/wattez/benchmarks/XCSP17/Mixed/Mixed-xcsp2-cril/cril-7_X2.xml.lzma
/home/cril/wattez/benchmarks/XCSP17/Mixed/Mixed-xcsp2-cril/cril-1_X2.xml.lzma
/home/cril/wattez/benchmarks/XCSP17/Mixed/Mixed-xcsp2-cril/cril-3_X2.xml.lzma
/home/cril/wattez/benchmarks/XCSP17/Mixed/Mixed-xcsp2-nengfa/sudoku368_X2.xml.lzma
/home/cril/wattez/benchmarks/XCSP17/Mixed/Mixed-xcsp2-nengfa/color_X2.xml.lzma
/home/cril/wattez/benchmarks/XCSP17/TravellingSalesman/TravellingSalesman-xcsp2-s25/TravellingSalesman-25-003_X2.xml.lzma
/home/cril/wattez/benchmarks/XCSP17/TravellingSalesman/TravellingSalesman-xcsp2-s25/TravellingSalesman-25-066_X2.xml.lzma
/home/cril/wattez/benchmarks/XCSP17/TravellingSalesman/TravellingSalesman-xcsp2-s20/TravellingSalesman-20-142_X2.xml.lzma
/home/cril/wattez/benchmarks/XCSP17/TravellingSalesman/TravellingSalesman-xcsp2-s20/TravellingSalesman-20-076_X2.xml.lzma
/home/cril/wattez/benchmarks/XCSP17/TravellingSalesman/TravellingSalesman-xcsp2-s20a4/TravellingSalesman-4-20-727-a4_X2.xml.lzma
/home/cril/wattez/benchmarks/XCSP17/TravellingSalesman/TravellingSalesman-xcsp2-s20a4/TravellingSalesman-4-20-001-a4_X2.xml.lzma
/home/cril/wattez/benchmarks/XCSP17/MultiKnapsack/MultiKnapsack-xcsp2-s1/MultiKnapsack-1-5_X2.xml.lzma
/home/cril/wattez/benchmarks/XCSP17/MultiKnapsack/MultiKnapsack-xcsp2-s1/MultiKnapsack-1-6_X2.xml.lzma
/home/cril/wattez/benchmarks/XCSP17/MultiKnapsack/MultiKnapsack-m1-gp/MultiKnapsack-2-41.xml.lzma
/home/cril/wattez/benchmarks/XCSP17/MultiKnapsack/MultiKnapsack-m1-gp/MultiKnapsack-2-48.xml.lzma
/home/cril/wattez/benchmarks/XCSP17/MultiKnapsack/MultiKnapsack-m1-gp/MultiKnapsack-2-22.xml.lzma
/home/cril/wattez/benchmarks/XCSP17/MultiKnapsack/MultiKnapsack-m1-gp/MultiKnapsack-1-03.xml.lzma
/home/cril/wattez/benchmarks/XCSP17/MultiKnapsack/MultiKnapsack-m1-gp/MultiKnapsack-2-16.xml.lzma
/home/cril/wattez/benchmarks/XCSP17/MultiKnapsack/MultiKnapsack-m1-gp/MultiKnapsack-2-21.xml.lzma
/home/cril/wattez/benchmarks/XCSP17/Ortholatin/Ortholatin-m1-s1/Ortholatin-028.xml.lzma
/home/cril/wattez/benchmarks/XCSP17/Ortholatin/Ortholatin-m1-s1/Ortholatin-018.xml.lzma
/home/cril/wattez/benchmarks/XCSP17/Ortholatin/Ortholatin-m1-s1/Ortholatin-016.xml.lzma
/home/cril/wattez/benchmarks/XCSP17/Ortholatin/Ortholatin-m1-s1/Ortholatin-024.xml.lzma
/home/cril/wattez/benchmarks/XCSP17/Ortholatin/Ortholatin-m1-s1/Ortholatin-009.xml.lzma
/home/cril/wattez/benchmarks/XCSP17/Ortholatin/Ortholatin-m1-s1/Ortholatin-019.xml.lzma
/home/cril/wattez/benchmarks/XCSP17/Haystacks/Haystacks-m1-s1/Haystacks-32.xml.lzma
/home/cril/wattez/benchmarks/XCSP17/Haystacks/Haystacks-m1-s1/Haystacks-42.xml.lzma
/home/cril/wattez/benchmarks/XCSP17/Haystacks/Haystacks-m1-s1/Haystacks-47.xml.lzma
/home/cril/wattez/benchmarks/XCSP17/Haystacks/Haystacks-m1-s1/Haystacks-45.xml.lzma
/home/cril/wattez/benchmarks/XCSP17/Haystacks/Haystacks-m1-s1/Haystacks-44.xml.lzma
/home/cril/wattez/benchmarks/XCSP17/Haystacks/Haystacks-m1-s1/Haystacks-46.xml.lzma
/home/cril/wattez/benchmarks/XCSP17/Sat/Sat-m1-aim200/aim-200-1-6-sat-3.xml.lzma
/home/cril/wattez/benchmarks/XCSP17/Sat/Sat-m1-jnh/jnh-302.xml.lzma
/home/cril/wattez/benchmarks/XCSP17/Sat/Sat-m1-jnh/jnh-012.xml.lzma
/home/cril/wattez/benchmarks/XCSP17/Sat/Sat-m1-jnh/jnh-213.xml.lzma
/home/cril/wattez/benchmarks/XCSP17/Sat/Sat-xcsp2-bmc/bmc-ibm-2-02_X2.xml.lzma
/home/cril/wattez/benchmarks/XCSP17/Sat/Sat-xcsp2-bmc/bmc-ibm-2-04_X2.xml.lzma
/home/cril/wattez/benchmarks/XCSP17/Sat/Sat-xcsp2-bmc/bmc-ibm-7-02_X2.xml.lzma
/home/cril/wattez/benchmarks/XCSP17/Sat/Sat-xcsp2-bmc/bmc-ibm-4-02_X2.xml.lzma
/home/cril/wattez/benchmarks/XCSP17/Sat/Sat-xcsp2-bmc/bmc-ibm-7-16_X2.xml.lzma
/home/cril/wattez/benchmarks/XCSP17/Sat/Sat-xcsp2-bmc/bmc-ibm-5-04_X2.xml.lzma
/home/cril/wattez/benchmarks/XCSP17/Sat/Sat-m1-aim050/aim-50-2-0-unsat-2.xml.lzma
/home/cril/wattez/benchmarks/XCSP17/Sat/Sat-dual-flat200-479/Sat-flat200-32-dual.xml.lzma
/home/cril/wattez/benchmarks/XCSP17/Sat/Sat-dual-flat200-479/Sat-flat200-67-dual.xml.lzma
/home/cril/wattez/benchmarks/XCSP17/Sat/Sat-dual-flat200-479/Sat-flat200-80-dual.xml.lzma
/home/cril/wattez/benchmarks/XCSP17/Sat/Sat-dual-flat200-479/Sat-flat200-06-dual.xml.lzma
/home/cril/wattez/benchmarks/XCSP17/Sat/Sat-dual-flat200-479/Sat-flat200-14-dual.xml.lzma
/home/cril/wattez/benchmarks/XCSP17/Sat/Sat-dual-flat200-479/Sat-flat200-55-dual.xml.lzma
/home/cril/wattez/benchmarks/XCSP17/Sat/Sat-m1-aim100/aim-100-2-0-unsat-2.xml.lzma
/home/cril/wattez/benchmarks/XCSP17/Sat/Sat-sum-flat200-479/Sat-flat200-24-sum.xml.lzma
/home/cril/wattez/benchmarks/XCSP17/Sat/Sat-sum-flat200-479/Sat-flat200-23-sum.xml.lzma
/home/cril/wattez/benchmarks/XCSP17/Sat/Sat-sum-flat200-479/Sat-flat200-13-sum.xml.lzma
/home/cril/wattez/benchmarks/XCSP17/Sat/Sat-sum-flat200-479/Sat-flat200-37-sum.xml.lzma
/home/cril/wattez/benchmarks/XCSP17/Sat/Sat-sum-flat200-479/Sat-flat200-65-sum.xml.lzma
/home/cril/wattez/benchmarks/XCSP17/Sat/Sat-sum-flat200-479/Sat-flat200-67-sum.xml.lzma
/home/cril/wattez/benchmarks/XCSP17/MagicHexagon/MagicHexagon-m1-s1/MagicHexagon-08-0051.xml.lzma
/home/cril/wattez/benchmarks/XCSP17/MagicHexagon/MagicHexagon-m1-s1/MagicHexagon-11-0066.xml.lzma
/home/cril/wattez/benchmarks/XCSP17/MagicHexagon/MagicHexagon-m1-s1/MagicHexagon-10-m021.xml.lzma
/home/cril/wattez/benchmarks/XCSP17/MagicHexagon/MagicHexagon-m1-s1/MagicHexagon-11-m186.xml.lzma
/home/cril/wattez/benchmarks/XCSP17/MagicHexagon/MagicHexagon-m1-s1/MagicHexagon-08-0081.xml.lzma
/home/cril/wattez/benchmarks/XCSP17/MagicHexagon/MagicHexagon-m1-s1/MagicHexagon-02-0000.xml.lzma
/home/cril/wattez/benchmarks/XCSP17/PigeonsPlus/PigeonsPlus-m1-s1/pigeonsPlus-08-04.xml.lzma
/home/cril/wattez/benchmarks/XCSP17/PigeonsPlus/PigeonsPlus-m1-s1/pigeonsPlus-11-04.xml.lzma
/home/cril/wattez/benchmarks/XCSP17/PigeonsPlus/PigeonsPlus-m1-s1/pigeonsPlus-07-05.xml.lzma
/home/cril/wattez/benchmarks/XCSP17/PigeonsPlus/PigeonsPlus-m1-s1/pigeonsPlus-07-08.xml.lzma
/home/cril/wattez/benchmarks/XCSP17/PigeonsPlus/PigeonsPlus-m1-s1/pigeonsPlus-09-03.xml.lzma
/home/cril/wattez/benchmarks/XCSP17/PigeonsPlus/PigeonsPlus-m1-s1/pigeonsPlus-07-09.xml.lzma
/home/cril/wattez/benchmarks/XCSP17/QuasiGroups/QuasiGroups-elt-qg7/QuasiGroup-7-28.xml.lzma
/home/cril/wattez/benchmarks/XCSP17/QuasiGroups/QuasiGroups-elt-qg7/QuasiGroup-7-23.xml.lzma
/home/cril/wattez/benchmarks/XCSP17/QuasiGroups/QuasiGroups-elt-qg5/QuasiGroup-5-07.xml.lzma
/home/cril/wattez/benchmarks/XCSP17/QuasiGroups/QuasiGroups-elt-qg4/QuasiGroup-4-17.xml.lzma
/home/cril/wattez/benchmarks/XCSP17/QuasiGroups/QuasiGroups-elt-qg4/QuasiGroup-4-08.xml.lzma
/home/cril/wattez/benchmarks/XCSP17/QuasiGroups/QuasiGroups-elt-qg4/QuasiGroup-4-24.xml.lzma
/home/cril/wattez/benchmarks/XCSP17/AllInterval/AllInterval-m1-s1/AllInterval-012.xml.lzma
/home/cril/wattez/benchmarks/XCSP17/AllInterval/AllInterval-m1-s1/AllInterval-035.xml.lzma
/home/cril/wattez/benchmarks/XCSP17/AllInterval/AllInterval-m1-s1/AllInterval-007.xml.lzma
/home/cril/wattez/benchmarks/XCSP17/AllInterval/AllInterval-m1-s1/AllInterval-016.xml.lzma
/home/cril/wattez/benchmarks/XCSP17/AllInterval/AllInterval-m1-s1/AllInterval-080.xml.lzma
/home/cril/wattez/benchmarks/XCSP17/AllInterval/AllInterval-m1-s1/AllInterval-050.xml.lzma
/home/cril/wattez/benchmarks/XCSP17/Langford/Langford-m1-k3/Langford-3-70.xml.lzma
/home/cril/wattez/benchmarks/XCSP17/Langford/Langford-m1-k3/Langford-3-05.xml.lzma
/home/cril/wattez/benchmarks/XCSP17/Langford/Langford-m1-k4/Langford-4-35.xml.lzma
/home/cril/wattez/benchmarks/XCSP17/Langford/Langford-m1-k4/Langford-4-04.xml.lzma
/home/cril/wattez/benchmarks/XCSP17/Langford/Langford-m1-k4/Langford-4-05.xml.lzma
/home/cril/wattez/benchmarks/XCSP17/Langford/Langford-m2-s1/LangfordBin-45.xml.lzma
/home/cril/wattez/benchmarks/XCSP17/Langford/Langford-m2-s1/LangfordBin-16.xml.lzma
/home/cril/wattez/benchmarks/XCSP17/Langford/Langford-m2-s1/LangfordBin-90.xml.lzma
/home/cril/wattez/benchmarks/XCSP17/Langford/Langford-m2-s1/LangfordBin-30.xml.lzma
/home/cril/wattez/benchmarks/XCSP17/Langford/Langford-m2-s1/LangfordBin-19.xml.lzma
/home/cril/wattez/benchmarks/XCSP17/Langford/Langford-m2-s1/LangfordBin-18.xml.lzma
/home/cril/wattez/benchmarks/XCSP17/Langford/Langford-m1-k2/Langford-2-18.xml.lzma
/home/cril/wattez/benchmarks/XCSP17/Bibd/Bibd-sum-sym/Bibd-sum-07-077-33-03-11.xml.lzma
/home/cril/wattez/benchmarks/XCSP17/Bibd/Bibd-sum-sym/Bibd-sum-09-084-28-03-07.xml.lzma
/home/cril/wattez/benchmarks/XCSP17/Bibd/Bibd-sc-open/Bibd-sc-56-088-33-21-12.xml.lzma
/home/cril/wattez/benchmarks/XCSP17/Bibd/Bibd-sc-open/Bibd-sc-65-104-40-25-15.xml.lzma
/home/cril/wattez/benchmarks/XCSP17/Bibd/Bibd-sc-open/Bibd-sc-85-085-36-36-15.xml.lzma
/home/cril/wattez/benchmarks/XCSP17/Bibd/Bibd-sum-stab1/Bibd-sum-12-03-04.xml.lzma
/home/cril/wattez/benchmarks/XCSP17/Bibd/Bibd-sc-mini/Bibd-sc-03-03-01.xml.lzma
/home/cril/wattez/benchmarks/XCSP17/Bibd/Bibd-sum-stab2/Bibd-sum-07-03-09.xml.lzma
/home/cril/wattez/benchmarks/XCSP17/Bibd/Bibd-sc-stab2/Bibd-sc-10-05-04.xml.lzma
/home/cril/wattez/benchmarks/XCSP17/Bibd/Bibd-sc-stab2/Bibd-sc-06-03-06.xml.lzma
/home/cril/wattez/benchmarks/XCSP17/Bibd/Bibd-sum-open/Bibd-sum-55-099-27-15-07.xml.lzma
/home/cril/wattez/benchmarks/XCSP17/Bibd/Bibd-sum-open/Bibd-sum-39-057-19-13-06.xml.lzma
/home/cril/wattez/benchmarks/XCSP17/StripPacking/StripPacking-m1-seriesT/StripPacking-T1e.xml.lzma
/home/cril/wattez/benchmarks/XCSP17/StripPacking/StripPacking-m1-series1/StripPacking-C4P1.xml.lzma
/home/cril/wattez/benchmarks/XCSP17/StripPacking/StripPacking-m1-seriesN/StripPacking-N1c.xml.lzma
/home/cril/wattez/benchmarks/XCSP17/StripPacking/StripPacking-m1-seriesN/StripPacking-N7a.xml.lzma
/home/cril/wattez/benchmarks/XCSP17/StripPacking/StripPacking-m1-seriesN/StripPacking-N3d.xml.lzma
/home/cril/wattez/benchmarks/XCSP17/StripPacking/StripPacking-m1-seriesN/StripPacking-N7e.xml.lzma
/home/cril/wattez/benchmarks/XCSP17/RectPacking/RectPacking-m1-perf/RectPacking-perfect-129.xml.lzma
/home/cril/wattez/benchmarks/XCSP17/RectPacking/RectPacking-m1-perf/RectPacking-perfect-189.xml.lzma
/home/cril/wattez/benchmarks/XCSP17/RectPacking/RectPacking-m1-perf/RectPacking-perfect-083.xml.lzma
/home/cril/wattez/benchmarks/XCSP17/RectPacking/RectPacking-m1-perf/RectPacking-perfect-096.xml.lzma
/home/cril/wattez/benchmarks/XCSP17/RectPacking/RectPacking-m1-perf/RectPacking-perfect-022.xml.lzma
/home/cril/wattez/benchmarks/XCSP17/RectPacking/RectPacking-m1-perf/RectPacking-perfect-053.xml.lzma
/home/cril/wattez/benchmarks/XCSP17/Sudoku/Sudoku-table-s1/Sudoku-s14b-table.xml.lzma
/home/cril/wattez/benchmarks/XCSP17/Sudoku/Sudoku-table-s1/Sudoku-s03c-table.xml.lzma
/home/cril/wattez/benchmarks/XCSP17/Sudoku/Sudoku-table-s1/Sudoku-s05c-table.xml.lzma
/home/cril/wattez/benchmarks/XCSP17/Sudoku/Sudoku-table-s1/Sudoku-s16-table.xml.lzma
/home/cril/wattez/benchmarks/XCSP17/Sudoku/Sudoku-table-s1/Sudoku-s11b-table.xml.lzma
/home/cril/wattez/benchmarks/XCSP17/Sudoku/Sudoku-table-s1/Sudoku-s12b-table.xml.lzma
/home/cril/wattez/benchmarks/XCSP17/Sudoku/Sudoku-alldiff-s1/Sudoku-s09b-alldiff.xml.lzma
/home/cril/wattez/benchmarks/XCSP17/Sudoku/Sudoku-alldiff-s1/Sudoku-s10b-alldiff.xml.lzma
/home/cril/wattez/benchmarks/XCSP17/Sudoku/Sudoku-alldiff-s1/Sudoku-s13b-alldiff.xml.lzma
/home/cril/wattez/benchmarks/XCSP17/Sudoku/Sudoku-alldiff-s1/Sudoku-s01a-alldiff.xml.lzma
/home/cril/wattez/benchmarks/XCSP17/Sudoku/Sudoku-alldiff-s1/Sudoku-s12a-alldiff.xml.lzma
/home/cril/wattez/benchmarks/XCSP17/Sudoku/Sudoku-alldiff-s1/Sudoku-s11a-alldiff.xml.lzma
/home/cril/wattez/benchmarks/XCSP17/QueenAttacking/QueenAttacking-xcsp2-s1/QueenAttacking-07_X2.xml.lzma
/home/cril/wattez/benchmarks/XCSP17/QueenAttacking/QueenAttacking-xcsp2-s1/QueenAttacking-05_X2.xml.lzma
/home/cril/wattez/benchmarks/XCSP17/QueenAttacking/QueenAttacking-xcsp2-s1/QueenAttacking-11_X2.xml.lzma
/home/cril/wattez/benchmarks/XCSP17/QueenAttacking/QueenAttacking-xcsp2-s1/QueenAttacking-08_X2.xml.lzma
/home/cril/wattez/benchmarks/XCSP17/QueenAttacking/QueenAttacking-xcsp2-s1/QueenAttacking-09_X2.xml.lzma
/home/cril/wattez/benchmarks/XCSP17/QueenAttacking/QueenAttacking-xcsp2-s1/QueenAttacking-10_X2.xml.lzma
/home/cril/wattez/benchmarks/XCSP17/Dubois/Dubois-m1-s1/Dubois-050.xml.lzma
/home/cril/wattez/benchmarks/XCSP17/Dubois/Dubois-m1-s1/Dubois-021.xml.lzma
/home/cril/wattez/benchmarks/XCSP17/Dubois/Dubois-m1-s1/Dubois-022.xml.lzma
/home/cril/wattez/benchmarks/XCSP17/Dubois/Dubois-m1-s1/Dubois-080.xml.lzma
/home/cril/wattez/benchmarks/XCSP17/Dubois/Dubois-m1-s1/Dubois-025.xml.lzma
/home/cril/wattez/benchmarks/XCSP17/Dubois/Dubois-m1-s1/Dubois-090.xml.lzma
/home/cril/wattez/benchmarks/XCSP17/CryptoPuzzle/CryptoPuzzle-m1-s1/CryptoPuzzle-cross-roads-danger.xml.lzma
/home/cril/wattez/benchmarks/XCSP17/CryptoPuzzle/CryptoPuzzle-m1-s1/CryptoPuzzle-black-green-orange.xml.lzma
/home/cril/wattez/benchmarks/XCSP17/CryptoPuzzle/CryptoPuzzle-m1-s1/CryptoPuzzle-kyoto-osaka-tokyo.xml.lzma
/home/cril/wattez/benchmarks/XCSP17/CryptoPuzzle/CryptoPuzzle-m1-s1/CryptoPuzzle-monitor-network-internet.xml.lzma
/home/cril/wattez/benchmarks/XCSP17/CryptoPuzzle/CryptoPuzzle-m1-s1/CryptoPuzzle-summer-school-coolest.xml.lzma
/home/cril/wattez/benchmarks/XCSP17/CryptoPuzzle/CryptoPuzzle-m1-s1/CryptoPuzzle-no-no-yes.xml.lzma
/home/cril/wattez/benchmarks/XCSP17/CarSequencing/CarSequencing-m1-jcr/CarSequencing-80-02.xml.lzma
/home/cril/wattez/benchmarks/XCSP17/CarSequencing/CarSequencing-m1-jcr/CarSequencing-60-02.xml.lzma
/home/cril/wattez/benchmarks/XCSP17/CarSequencing/CarSequencing-m1-jcr/CarSequencing-04-72.xml.lzma
/home/cril/wattez/benchmarks/XCSP17/CarSequencing/CarSequencing-m1-jcr/CarSequencing-85-05.xml.lzma
/home/cril/wattez/benchmarks/XCSP17/CarSequencing/CarSequencing-m1-jcr/CarSequencing-19-71.xml.lzma
/home/cril/wattez/benchmarks/XCSP17/CarSequencing/CarSequencing-m1-gagne/CarSequencing-200-01.xml.lzma
/home/cril/wattez/benchmarks/XCSP17/Wwtpp/Wwtpp-ord-s1/Wwtpp-ord-ex02280.xml.lzma
/home/cril/wattez/benchmarks/XCSP17/Wwtpp/Wwtpp-ord-s1/Wwtpp-ord-ex06460.xml.lzma
/home/cril/wattez/benchmarks/XCSP17/Wwtpp/Wwtpp-ord-s1/Wwtpp-ord-ex03380.xml.lzma
/home/cril/wattez/benchmarks/XCSP17/Wwtpp/Wwtpp-ord-s1/Wwtpp-ord-ex05480.xml.lzma
/home/cril/wattez/benchmarks/XCSP17/Wwtpp/Wwtpp-ord-s1/Wwtpp-ord-ex08540.xml.lzma
/home/cril/wattez/benchmarks/XCSP17/Wwtpp/Wwtpp-ord-s1/Wwtpp-ord-ex07180.xml.lzma
/home/cril/wattez/benchmarks/XCSP17/Nonogram/Nonogram-table-s1/Nonogram-177-table.xml.lzma
/home/cril/wattez/benchmarks/XCSP17/Nonogram/Nonogram-table-s1/Nonogram-180-table.xml.lzma
/home/cril/wattez/benchmarks/XCSP17/Nonogram/Nonogram-table-s1/Nonogram-018-table.xml.lzma
/home/cril/wattez/benchmarks/XCSP17/Nonogram/Nonogram-table-s1/Nonogram-096-table.xml.lzma
/home/cril/wattez/benchmarks/XCSP17/Nonogram/Nonogram-table-s1/Nonogram-035-table.xml.lzma
/home/cril/wattez/benchmarks/XCSP17/Nonogram/Nonogram-table-s1/Nonogram-168-table.xml.lzma
/home/cril/wattez/benchmarks/XCSP17/Nonogram/Nonogram-regular-gp/Nonogram-085-regular.xml.lzma
/home/cril/wattez/benchmarks/XCSP17/Nonogram/Nonogram-regular-gp/Nonogram-108-regular.xml.lzma
/home/cril/wattez/benchmarks/XCSP17/Nonogram/Nonogram-regular-gp/Nonogram-124-regular.xml.lzma
/home/cril/wattez/benchmarks/XCSP17/Nonogram/Nonogram-regular-gp/Nonogram-008-regular.xml.lzma
/home/cril/wattez/benchmarks/XCSP17/Nonogram/Nonogram-regular-gp/Nonogram-109-regular.xml.lzma
/home/cril/wattez/benchmarks/XCSP17/Nonogram/Nonogram-regular-gp/Nonogram-040-regular.xml.lzma
/home/cril/wattez/benchmarks/XCSP17/Subisomorphism/Subisomorphism-m1-si6-bvg/Subisomorphism-si6-b03-m800-07.xml.lzma
/home/cril/wattez/benchmarks/XCSP17/Subisomorphism/Subisomorphism-m1-si2-bvg/Subisomorphism-si2-b09-m200-02.xml.lzma
/home/cril/wattez/benchmarks/XCSP17/Subisomorphism/Subisomorphism-m1-LV/Subisomorphism-g08-g31.xml.lzma
/home/cril/wattez/benchmarks/XCSP17/Subisomorphism/Subisomorphism-m1-LV/Subisomorphism-g10-g35.xml.lzma
/home/cril/wattez/benchmarks/XCSP17/Subisomorphism/Subisomorphism-m1-LV/Subisomorphism-g07-g39.xml.lzma
/home/cril/wattez/benchmarks/XCSP17/Subisomorphism/Subisomorphism-m1-SF/Subisomorphism-A-15.xml.lzma
/home/cril/wattez/benchmarks/XCSP17/NumberPartitioning/NumberPartitioning-m1-s1/NumberPartitioning-124.xml.lzma
/home/cril/wattez/benchmarks/XCSP17/NumberPartitioning/NumberPartitioning-m1-s1/NumberPartitioning-188.xml.lzma
/home/cril/wattez/benchmarks/XCSP17/NumberPartitioning/NumberPartitioning-m1-s1/NumberPartitioning-080.xml.lzma
/home/cril/wattez/benchmarks/XCSP17/NumberPartitioning/NumberPartitioning-m1-s1/NumberPartitioning-048.xml.lzma
/home/cril/wattez/benchmarks/XCSP17/NumberPartitioning/NumberPartitioning-m1-s1/NumberPartitioning-088.xml.lzma
/home/cril/wattez/benchmarks/XCSP17/NumberPartitioning/NumberPartitioning-m1-s1/NumberPartitioning-136.xml.lzma
/home/cril/wattez/benchmarks/XCSP18/ColouredQueens/ColouredQueens-05_c18.xml.lzma
/home/cril/wattez/benchmarks/XCSP18/ColouredQueens/ColouredQueens-07_c18.xml.lzma
/home/cril/wattez/benchmarks/XCSP18/ColouredQueens/ColouredQueens-16_c18.xml.lzma
/home/cril/wattez/benchmarks/XCSP18/ColouredQueens/ColouredQueens-08_c18.xml.lzma
/home/cril/wattez/benchmarks/XCSP18/ColouredQueens/ColouredQueens-13_c18.xml.lzma
/home/cril/wattez/benchmarks/XCSP18/ColouredQueens/ColouredQueens-10_c18.xml.lzma
/home/cril/wattez/benchmarks/XCSP18/ColouredQueens/ColouredQueens-12_c18.xml.lzma
/home/cril/wattez/benchmarks/XCSP18/ColouredQueens/ColouredQueens-11_c18.xml.lzma
/home/cril/wattez/benchmarks/XCSP18/ColouredQueens/ColouredQueens-15_c18.xml.lzma
/home/cril/wattez/benchmarks/XCSP18/ColouredQueens/ColouredQueens-14_c18.xml.lzma
/home/cril/wattez/benchmarks/XCSP18/ColouredQueens/ColouredQueens-06_c18.xml.lzma
/home/cril/wattez/benchmarks/XCSP18/ColouredQueens/ColouredQueens-09_c18.xml.lzma
/home/cril/wattez/benchmarks/XCSP18/GracefulGraph/GracefulGraph-K05-P02_c18.xml.lzma
/home/cril/wattez/benchmarks/XCSP18/GracefulGraph/GracefulGraph-K04-P02_c18.xml.lzma
/home/cril/wattez/benchmarks/XCSP18/GracefulGraph/GracefulGraph-K07-P03_c18.xml.lzma
/home/cril/wattez/benchmarks/XCSP18/GracefulGraph/GracefulGraph-K02-P09_c18.xml.lzma
/home/cril/wattez/benchmarks/XCSP18/GracefulGraph/GracefulGraph-K06-P03_c18.xml.lzma
/home/cril/wattez/benchmarks/XCSP18/GracefulGraph/GracefulGraph-K04-P03_c18.xml.lzma
/home/cril/wattez/benchmarks/XCSP18/GracefulGraph/GracefulGraph-K05-P03_c18.xml.lzma
/home/cril/wattez/benchmarks/XCSP18/GracefulGraph/GracefulGraph-K07-P02_c18.xml.lzma
/home/cril/wattez/benchmarks/XCSP18/GracefulGraph/GracefulGraph-K06-P02_c18.xml.lzma
/home/cril/wattez/benchmarks/XCSP18/GracefulGraph/GracefulGraph-K03-P03_c18.xml.lzma
/home/cril/wattez/benchmarks/XCSP18/GracefulGraph/GracefulGraph-K04-P04_c18.xml.lzma
/home/cril/wattez/benchmarks/XCSP18/MagicSquare/MagicSquare-14-sum_c18.xml.lzma
/home/cril/wattez/benchmarks/XCSP18/MagicSquare/MagicSquare-11-sum_c18.xml.lzma
/home/cril/wattez/benchmarks/XCSP18/MagicSquare/MagicSquare-06-sum_c18.xml.lzma
/home/cril/wattez/benchmarks/XCSP18/MagicSquare/MagicSquare-09-sum_c18.xml.lzma
/home/cril/wattez/benchmarks/XCSP18/MagicSquare/MagicSquare-12-sum_c18.xml.lzma
/home/cril/wattez/benchmarks/XCSP18/MagicSquare/MagicSquare-04-sum_c18.xml.lzma
/home/cril/wattez/benchmarks/XCSP18/MagicSquare/MagicSquare-13-sum_c18.xml.lzma
/home/cril/wattez/benchmarks/XCSP18/MagicSquare/MagicSquare-07-sum_c18.xml.lzma
/home/cril/wattez/benchmarks/XCSP18/MagicSquare/MagicSquare-08-sum_c18.xml.lzma
/home/cril/wattez/benchmarks/XCSP18/MagicSquare/MagicSquare-16-sum_c18.xml.lzma
/home/cril/wattez/benchmarks/XCSP18/MagicSquare/MagicSquare-15-sum_c18.xml.lzma
/home/cril/wattez/benchmarks/XCSP18/MagicSquare/MagicSquare-05-sum_c18.xml.lzma
/home/cril/wattez/benchmarks/XCSP18/MagicSquare/MagicSquare-10-sum_c18.xml.lzma
/home/cril/wattez/benchmarks/XCSP18/SocialGolfers/SocialGolfers-5-5-6-cp_c18.xml.lzma
/home/cril/wattez/benchmarks/XCSP18/SocialGolfers/SocialGolfers-6-6-6-cp_c18.xml.lzma
/home/cril/wattez/benchmarks/XCSP18/SocialGolfers/SocialGolfers-6-6-9-cp_c18.xml.lzma
/home/cril/wattez/benchmarks/XCSP18/SocialGolfers/SocialGolfers-6-6-8-cp_c18.xml.lzma
/home/cril/wattez/benchmarks/XCSP18/SocialGolfers/SocialGolfers-4-4-6-cp_c18.xml.lzma
/home/cril/wattez/benchmarks/XCSP18/SocialGolfers/SocialGolfers-6-6-7-cp_c18.xml.lzma
/home/cril/wattez/benchmarks/XCSP18/SocialGolfers/SocialGolfers-4-4-7-cp_c18.xml.lzma
/home/cril/wattez/benchmarks/XCSP18/SocialGolfers/SocialGolfers-5-5-7-cp_c18.xml.lzma
/home/cril/wattez/benchmarks/XCSP18/SocialGolfers/SocialGolfers-4-4-4-cp_c18.xml.lzma
/home/cril/wattez/benchmarks/XCSP18/SocialGolfers/SocialGolfers-5-5-5-cp_c18.xml.lzma
/home/cril/wattez/benchmarks/XCSP18/SocialGolfers/SocialGolfers-4-4-5-cp_c18.xml.lzma
/home/cril/wattez/benchmarks/XCSP18/SocialGolfers/SocialGolfers-5-5-8-cp_c18.xml.lzma
/home/cril/wattez/benchmarks/XCSP18/Crossword/Crossword-m18-ogd2008-vg-09-10_c18.xml.lzma
/home/cril/wattez/benchmarks/XCSP18/Crossword/Crossword-m18-ogd2008-vg-15-16_c18.xml.lzma
/home/cril/wattez/benchmarks/XCSP18/Crossword/Crossword-m18-ogd2008-vg-06-07_c18.xml.lzma
/home/cril/wattez/benchmarks/XCSP18/Crossword/Crossword-m18-ogd2008-vg-13-14_c18.xml.lzma
/home/cril/wattez/benchmarks/XCSP18/Crossword/Crossword-m18-ogd2008-vg-05-06_c18.xml.lzma
/home/cril/wattez/benchmarks/XCSP18/Crossword/Crossword-m18-ogd2008-vg-04-05_c18.xml.lzma
/home/cril/wattez/benchmarks/XCSP18/Crossword/Crossword-m18-ogd2008-vg-16-17_c18.xml.lzma
/home/cril/wattez/benchmarks/XCSP18/Crossword/Crossword-m18-ogd2008-vg-10-11_c18.xml.lzma
/home/cril/wattez/benchmarks/XCSP18/Crossword/Crossword-m18-ogd2008-vg-14-15_c18.xml.lzma
/home/cril/wattez/benchmarks/XCSP18/Crossword/Crossword-m18-ogd2008-vg-08-09_c18.xml.lzma
/home/cril/wattez/benchmarks/XCSP18/Crossword/Crossword-m18-ogd2008-vg-07-08_c18.xml.lzma
/home/cril/wattez/benchmarks/XCSP18/Crossword/Crossword-m18-ogd2008-vg-12-13_c18.xml.lzma
/home/cril/wattez/benchmarks/XCSP18/Crossword/Crossword-m18-ogd2008-vg-11-12_c18.xml.lzma
/home/cril/wattez/benchmarks/XCSP18/PseudoBoolean-dec/Pb-chnl10-11_c18.xml.lzma
/home/cril/wattez/benchmarks/XCSP18/PseudoBoolean-dec/Pb-robin12_c18.xml.lzma
/home/cril/wattez/benchmarks/XCSP18/PseudoBoolean-dec/Pb-robin08_c18.xml.lzma
/home/cril/wattez/benchmarks/XCSP18/PseudoBoolean-dec/Pb-fpga45-45-sat_c18.xml.lzma
/home/cril/wattez/benchmarks/XCSP18/PseudoBoolean-dec/Pb-chnl15-16_c18.xml.lzma
/home/cril/wattez/benchmarks/XCSP18/PseudoBoolean-dec/Pb-chnl30-31_c18.xml.lzma
/home/cril/wattez/benchmarks/XCSP18/PseudoBoolean-dec/Pb-robin14_c18.xml.lzma
/home/cril/wattez/benchmarks/XCSP18/PseudoBoolean-dec/Pb-fpga25-25-sat_c18.xml.lzma
/home/cril/wattez/benchmarks/XCSP18/PseudoBoolean-dec/Pb-chnl50-51_c18.xml.lzma
/home/cril/wattez/benchmarks/XCSP18/PseudoBoolean-dec/Pb-robin18_c18.xml.lzma
/home/cril/wattez/benchmarks/XCSP18/PseudoBoolean-dec/Pb-robin10_c18.xml.lzma
/home/cril/wattez/benchmarks/XCSP18/PseudoBoolean-dec/Pb-robin16_c18.xml.lzma
/home/cril/wattez/benchmarks/XCSP18/PseudoBoolean-dec/Pb-chnl20-21_c18.xml.lzma
/home/cril/wattez/benchmarks/XCSP18/SportsScheduling/SportsScheduling-08_c18.xml.lzma
/home/cril/wattez/benchmarks/XCSP18/SportsScheduling/SportsScheduling-16_c18.xml.lzma
/home/cril/wattez/benchmarks/XCSP18/SportsScheduling/SportsScheduling-20_c18.xml.lzma
/home/cril/wattez/benchmarks/XCSP18/SportsScheduling/SportsScheduling-26_c18.xml.lzma
/home/cril/wattez/benchmarks/XCSP18/SportsScheduling/SportsScheduling-12_c18.xml.lzma
/home/cril/wattez/benchmarks/XCSP18/SportsScheduling/SportsScheduling-14_c18.xml.lzma
/home/cril/wattez/benchmarks/XCSP18/SportsScheduling/SportsScheduling-18_c18.xml.lzma
/home/cril/wattez/benchmarks/XCSP18/SportsScheduling/SportsScheduling-10_c18.xml.lzma
/home/cril/wattez/benchmarks/XCSP18/SportsScheduling/SportsScheduling-22_c18.xml.lzma
/home/cril/wattez/benchmarks/XCSP18/SportsScheduling/SportsScheduling-24_c18.xml.lzma
/home/cril/wattez/benchmarks/XCSP18/Rlfap/Rlfap-dec-scens11/Rlfap-scen-11-f03_c18.xml.lzma
/home/cril/wattez/benchmarks/XCSP18/Rlfap/Rlfap-dec-scens11/Rlfap-scen-11-f06_c18.xml.lzma
/home/cril/wattez/benchmarks/XCSP18/Rlfap/Rlfap-dec-scens11/Rlfap-scen-11-f02_c18.xml.lzma
/home/cril/wattez/benchmarks/XCSP18/Rlfap/Rlfap-dec-scens11/Rlfap-scen-11-f07_c18.xml.lzma
/home/cril/wattez/benchmarks/XCSP18/Rlfap/Rlfap-dec-scens11/Rlfap-scen-11-f12_c18.xml.lzma
/home/cril/wattez/benchmarks/XCSP18/Rlfap/Rlfap-dec-scens11/Rlfap-scen-11-f10_c18.xml.lzma
/home/cril/wattez/benchmarks/XCSP18/Rlfap/Rlfap-dec-scens11/Rlfap-scen-11-f08_c18.xml.lzma
/home/cril/wattez/benchmarks/XCSP18/Rlfap/Rlfap-dec-scens11/Rlfap-scen-11-f01_c18.xml.lzma
/home/cril/wattez/benchmarks/XCSP18/Rlfap/Rlfap-dec-scens11/Rlfap-scen-11-f11_c18.xml.lzma
/home/cril/wattez/benchmarks/XCSP18/Rlfap/Rlfap-dec-scens11/Rlfap-scen-11-f05_c18.xml.lzma
/home/cril/wattez/benchmarks/XCSP18/Rlfap/Rlfap-dec-scens11/Rlfap-scen-11-f04_c18.xml.lzma
/home/cril/wattez/benchmarks/XCSP18/Rlfap/Rlfap-dec-scens11/Rlfap-scen-11-f09_c18.xml.lzma
/home/cril/wattez/benchmarks/XCSP18/MisteryShopper/MisteryShopper-10d_c18.xml.lzma
/home/cril/wattez/benchmarks/XCSP18/MisteryShopper/MisteryShopper-10b_c18.xml.lzma
/home/cril/wattez/benchmarks/XCSP18/MisteryShopper/MisteryShopper-10a_c18.xml.lzma
/home/cril/wattez/benchmarks/XCSP18/MisteryShopper/MisteryShopper-10c_c18.xml.lzma
/home/cril/wattez/benchmarks/XCSP18/MisteryShopper/MisteryShopper-04_c18.xml.lzma
/home/cril/wattez/benchmarks/XCSP18/MisteryShopper/MisteryShopper-06d_c18.xml.lzma
/home/cril/wattez/benchmarks/XCSP18/MisteryShopper/MisteryShopper-06c_c18.xml.lzma
/home/cril/wattez/benchmarks/XCSP18/MisteryShopper/MisteryShopper-06a_c18.xml.lzma
/home/cril/wattez/benchmarks/XCSP18/MisteryShopper/MisteryShopper-06b_c18.xml.lzma
/home/cril/wattez/benchmarks/XCSP18/MisteryShopper/MisteryShopper-12_c18.xml.lzma
/home/cril/wattez/benchmarks/XCSP18/Rlfap_mini/Rlfap-dec-scens11_mini/Rlfap-ext-scen-11-f02_c18.xml.lzma
/home/cril/wattez/benchmarks/XCSP18/Rlfap_mini/Rlfap-dec-scens11_mini/Rlfap-ext-scen-11-f10_c18.xml.lzma
/home/cril/wattez/benchmarks/XCSP18/Rlfap_mini/Rlfap-dec-scens11_mini/Rlfap-ext-scen-11-f06_c18.xml.lzma
/home/cril/wattez/benchmarks/XCSP18/Rlfap_mini/Rlfap-dec-scens11_mini/Rlfap-ext-scen-11-f01_c18.xml.lzma
/home/cril/wattez/benchmarks/XCSP18/Rlfap_mini/Rlfap-dec-scens11_mini/Rlfap-ext-scen-11-f04_c18.xml.lzma
/home/cril/wattez/benchmarks/XCSP18/Rlfap_mini/Rlfap-dec-scens11_mini/Rlfap-ext-scen-11-f05_c18.xml.lzma
/home/cril/wattez/benchmarks/XCSP18/Rlfap_mini/Rlfap-dec-scens11_mini/Rlfap-ext-scen-11-f12_c18.xml.lzma
/home/cril/wattez/benchmarks/XCSP18/Rlfap_mini/Rlfap-dec-scens11_mini/Rlfap-ext-scen-11-f09_c18.xml.lzma
/home/cril/wattez/benchmarks/XCSP18/Rlfap_mini/Rlfap-dec-scens11_mini/Rlfap-ext-scen-11-f08_c18.xml.lzma
/home/cril/wattez/benchmarks/XCSP18/Rlfap_mini/Rlfap-dec-scens11_mini/Rlfap-ext-scen-11-f03_c18.xml.lzma
/home/cril/wattez/benchmarks/XCSP18/Rlfap_mini/Rlfap-dec-scens11_mini/Rlfap-ext-scen-11-f11_c18.xml.lzma
/home/cril/wattez/benchmarks/XCSP18/Rlfap_mini/Rlfap-dec-scens11_mini/Rlfap-ext-scen-11-f07_c18.xml.lzma
/home/cril/wattez/benchmarks/XCSP18/Eternity/Eternity-11-11_c18.xml.lzma
/home/cril/wattez/benchmarks/XCSP18/Eternity/Eternity-09-09_c18.xml.lzma
/home/cril/wattez/benchmarks/XCSP18/Eternity/Eternity-04-04_c18.xml.lzma
/home/cril/wattez/benchmarks/XCSP18/Eternity/Eternity-15-15_c18.xml.lzma
/home/cril/wattez/benchmarks/XCSP18/Eternity/Eternity-13-13_c18.xml.lzma
/home/cril/wattez/benchmarks/XCSP18/Eternity/Eternity-10-04_c18.xml.lzma
/home/cril/wattez/benchmarks/XCSP18/Eternity/Eternity-12-12_c18.xml.lzma
/home/cril/wattez/benchmarks/XCSP18/Eternity/Eternity-14-14_c18.xml.lzma
/home/cril/wattez/benchmarks/XCSP18/Eternity/Eternity-08-08_c18.xml.lzma
/home/cril/wattez/benchmarks/XCSP18/Eternity/Eternity-10-06_c18.xml.lzma
/home/cril/wattez/benchmarks/XCSP18/Eternity/Eternity-07-07_c18.xml.lzma
/home/cril/wattez/benchmarks/XCSP18/Eternity/Eternity-06-06_c18.xml.lzma
/home/cril/wattez/benchmarks/XCSP18/Eternity/Eternity-10-05_c18.xml.lzma
/home/cril/wattez/benchmarks/XCSP18/Eternity/Eternity-10-10_c18.xml.lzma
/home/cril/wattez/benchmarks/XCSP18/Eternity/Eternity-05-05_c18.xml.lzma
/home/cril/wattez/benchmarks/XCSP18/Haystacks/Haystacks-ext-13_c18.xml.lzma
/home/cril/wattez/benchmarks/XCSP18/Haystacks/Haystacks-ext-07_c18.xml.lzma
/home/cril/wattez/benchmarks/XCSP18/Haystacks/Haystacks-ext-05_c18.xml.lzma
/home/cril/wattez/benchmarks/XCSP18/Haystacks/Haystacks-ext-10_c18.xml.lzma
/home/cril/wattez/benchmarks/XCSP18/Haystacks/Haystacks-ext-06_c18.xml.lzma
/home/cril/wattez/benchmarks/XCSP18/Haystacks/Haystacks-ext-08_c18.xml.lzma
/home/cril/wattez/benchmarks/XCSP18/Haystacks/Haystacks-ext-09_c18.xml.lzma
/home/cril/wattez/benchmarks/XCSP18/Haystacks/Haystacks-ext-04_c18.xml.lzma
/home/cril/wattez/benchmarks/XCSP18/Haystacks/Haystacks-ext-12_c18.xml.lzma
/home/cril/wattez/benchmarks/XCSP18/Haystacks/Haystacks-ext-11_c18.xml.lzma
/home/cril/wattez/benchmarks/XCSP18/MagicHexagon/MagicHexagon-04-m004_c18.xml.lzma
/home/cril/wattez/benchmarks/XCSP18/MagicHexagon/MagicHexagon-08-m009_c18.xml.lzma
/home/cril/wattez/benchmarks/XCSP18/MagicHexagon/MagicHexagon-04-0003_c18.xml.lzma
/home/cril/wattez/benchmarks/XCSP18/MagicHexagon/MagicHexagon-07-0002_c18.xml.lzma
/home/cril/wattez/benchmarks/XCSP18/MagicHexagon/MagicHexagon-04-0017_c18.xml.lzma
/home/cril/wattez/benchmarks/XCSP18/MagicHexagon/MagicHexagon-08-0006_c18.xml.lzma
/home/cril/wattez/benchmarks/XCSP18/MagicHexagon/MagicHexagon-06-0010_c18.xml.lzma
/home/cril/wattez/benchmarks/XCSP18/MagicHexagon/MagicHexagon-07-m011_c18.xml.lzma
/home/cril/wattez/benchmarks/XCSP18/MagicHexagon/MagicHexagon-06-m001_c18.xml.lzma
/home/cril/wattez/benchmarks/XCSP18/MagicHexagon/MagicHexagon-05-0006_c18.xml.lzma
/home/cril/wattez/benchmarks/XCSP18/MagicHexagon/MagicHexagon-05-m003_c18.xml.lzma
/home/cril/wattez/benchmarks/XCSP18/Quasigroups/QuasiGroup-4-09_c18.xml.lzma
/home/cril/wattez/benchmarks/XCSP18/Quasigroups/QuasiGroup-7-09_c18.xml.lzma
/home/cril/wattez/benchmarks/XCSP18/Quasigroups/QuasiGroup-4-08_c18.xml.lzma
/home/cril/wattez/benchmarks/XCSP18/Quasigroups/QuasiGroup-4-16_c18.xml.lzma
/home/cril/wattez/benchmarks/XCSP18/Quasigroups/QuasiGroup-7-07_c18.xml.lzma
/home/cril/wattez/benchmarks/XCSP18/Quasigroups/QuasiGroup-4-10_c18.xml.lzma
/home/cril/wattez/benchmarks/XCSP18/Quasigroups/QuasiGroup-4-20_c18.xml.lzma
/home/cril/wattez/benchmarks/XCSP18/Quasigroups/QuasiGroup-4-12_c18.xml.lzma
/home/cril/wattez/benchmarks/XCSP18/Quasigroups/QuasiGroup-4-14_c18.xml.lzma
/home/cril/wattez/benchmarks/XCSP18/Quasigroups/QuasiGroup-7-16_c18.xml.lzma
/home/cril/wattez/benchmarks/XCSP18/Quasigroups/QuasiGroup-7-08_c18.xml.lzma
/home/cril/wattez/benchmarks/XCSP18/Quasigroups/QuasiGroup-7-12_c18.xml.lzma
/home/cril/wattez/benchmarks/XCSP18/Quasigroups/QuasiGroup-7-20_c18.xml.lzma
/home/cril/wattez/benchmarks/XCSP18/Quasigroups/QuasiGroup-7-10_c18.xml.lzma
/home/cril/wattez/benchmarks/XCSP18/Quasigroups/QuasiGroup-7-14_c18.xml.lzma
/home/cril/wattez/benchmarks/XCSP18/Quasigroups/QuasiGroup-4-07_c18.xml.lzma
/home/cril/wattez/benchmarks/XCSP18/Langford/LangfordBin-10_c18.xml.lzma
/home/cril/wattez/benchmarks/XCSP18/Langford/LangfordBin-09_c18.xml.lzma
/home/cril/wattez/benchmarks/XCSP18/Langford/LangfordBin-06_c18.xml.lzma
/home/cril/wattez/benchmarks/XCSP18/Langford/LangfordBin-07_c18.xml.lzma
/home/cril/wattez/benchmarks/XCSP18/Langford/LangfordBin-11_c18.xml.lzma
/home/cril/wattez/benchmarks/XCSP18/Langford/LangfordBin-08_c18.xml.lzma
/home/cril/wattez/benchmarks/XCSP18/Langford/LangfordBin-14_c18.xml.lzma
/home/cril/wattez/benchmarks/XCSP18/Langford/LangfordBin-16_c18.xml.lzma
/home/cril/wattez/benchmarks/XCSP18/Langford/LangfordBin-12_c18.xml.lzma
/home/cril/wattez/benchmarks/XCSP18/Langford/LangfordBin-15_c18.xml.lzma
/home/cril/wattez/benchmarks/XCSP18/Langford/LangfordBin-13_c18.xml.lzma
/home/cril/wattez/benchmarks/XCSP18/Bibd/Bibd-sum-10-03-08_c18.xml.lzma
/home/cril/wattez/benchmarks/XCSP18/Bibd/Bibd-sc-22-033-12-08-04_c18.xml.lzma
/home/cril/wattez/benchmarks/XCSP18/Bibd/Bibd-sum-22-033-12-08-04_c18.xml.lzma
/home/cril/wattez/benchmarks/XCSP18/Bibd/Bibd-sum-09-03-09_c18.xml.lzma
/home/cril/wattez/benchmarks/XCSP18/Bibd/Bibd-sum-07-03-01_c18.xml.lzma
/home/cril/wattez/benchmarks/XCSP18/Bibd/Bibd-sum-12-06-05_c18.xml.lzma
/home/cril/wattez/benchmarks/XCSP18/Bibd/Bibd-sc-07-03-01_c18.xml.lzma
/home/cril/wattez/benchmarks/XCSP18/Bibd/Bibd-sc-34-085-30-12-10_c18.xml.lzma
/home/cril/wattez/benchmarks/XCSP18/Bibd/Bibd-sum-34-085-30-12-10_c18.xml.lzma
/home/cril/wattez/benchmarks/XCSP18/Bibd/Bibd-sc-09-03-09_c18.xml.lzma
/home/cril/wattez/benchmarks/XCSP18/Bibd/Bibd-sc-10-03-08_c18.xml.lzma
/home/cril/wattez/benchmarks/XCSP18/Bibd/Bibd-sc-12-06-05_c18.xml.lzma
/home/cril/wattez/benchmarks/XCSP18/StripPacking/StripPacking-T1d_c18.xml.lzma
/home/cril/wattez/benchmarks/XCSP18/StripPacking/StripPacking-N1c_c18.xml.lzma
/home/cril/wattez/benchmarks/XCSP18/StripPacking/StripPacking-C1P3_c18.xml.lzma
/home/cril/wattez/benchmarks/XCSP18/StripPacking/StripPacking-C1P2_c18.xml.lzma
/home/cril/wattez/benchmarks/XCSP18/StripPacking/StripPacking-1a_c18.xml.lzma
/home/cril/wattez/benchmarks/XCSP18/StripPacking/StripPacking-T1c_c18.xml.lzma
/home/cril/wattez/benchmarks/XCSP18/StripPacking/StripPacking-T1a_c18.xml.lzma
/home/cril/wattez/benchmarks/XCSP18/StripPacking/StripPacking-N1a_c18.xml.lzma
/home/cril/wattez/benchmarks/XCSP18/StripPacking/StripPacking-C1P1_c18.xml.lzma
/home/cril/wattez/benchmarks/XCSP18/StripPacking/StripPacking-1b_c18.xml.lzma
/home/cril/wattez/benchmarks/XCSP18/StripPacking/StripPacking-N1b_c18.xml.lzma
/home/cril/wattez/benchmarks/XCSP18/StripPacking/StripPacking-C2P1_c18.xml.lzma
/home/cril/wattez/benchmarks/XCSP18/Dubois/Dubois-020_c18.xml.lzma
/home/cril/wattez/benchmarks/XCSP18/Dubois/Dubois-050_c18.xml.lzma
/home/cril/wattez/benchmarks/XCSP18/Dubois/Dubois-075_c18.xml.lzma
/home/cril/wattez/benchmarks/XCSP18/Dubois/Dubois-030_c18.xml.lzma
/home/cril/wattez/benchmarks/XCSP18/Dubois/Dubois-100_c18.xml.lzma
/home/cril/wattez/benchmarks/XCSP18/Dubois/Dubois-021_c18.xml.lzma
/home/cril/wattez/benchmarks/XCSP18/Dubois/Dubois-040_c18.xml.lzma
/home/cril/wattez/benchmarks/XCSP18/Dubois/Dubois-023_c18.xml.lzma
/home/cril/wattez/benchmarks/XCSP18/Dubois/Dubois-025_c18.xml.lzma
/home/cril/wattez/benchmarks/XCSP18/Dubois/Dubois-018_c18.xml.lzma
/home/cril/wattez/benchmarks/XCSP18/Dubois/Dubois-022_c18.xml.lzma
/home/cril/wattez/benchmarks/XCSP18/Dubois/Dubois-024_c18.xml.lzma
/home/cril/wattez/benchmarks/XCSP18/CarSequencing/CarSequencing-70-01_c18.xml.lzma
/home/cril/wattez/benchmarks/XCSP18/CarSequencing/CarSequencing-75-01_c18.xml.lzma
/home/cril/wattez/benchmarks/XCSP18/CarSequencing/CarSequencing-60-02_c18.xml.lzma
/home/cril/wattez/benchmarks/XCSP18/CarSequencing/CarSequencing-80-02_c18.xml.lzma
/home/cril/wattez/benchmarks/XCSP18/CarSequencing/CarSequencing-85-02_c18.xml.lzma
/home/cril/wattez/benchmarks/XCSP18/CarSequencing/CarSequencing-90-01_c18.xml.lzma
/home/cril/wattez/benchmarks/XCSP18/CarSequencing/CarSequencing-60-01_c18.xml.lzma
/home/cril/wattez/benchmarks/XCSP18/CarSequencing/CarSequencing-65-01_c18.xml.lzma
/home/cril/wattez/benchmarks/XCSP18/CarSequencing/CarSequencing-65-02_c18.xml.lzma
/home/cril/wattez/benchmarks/XCSP18/CarSequencing/CarSequencing-70-02_c18.xml.lzma
/home/cril/wattez/benchmarks/XCSP18/CarSequencing/CarSequencing-85-01_c18.xml.lzma
/home/cril/wattez/benchmarks/XCSP18/CarSequencing/CarSequencing-06-76_c18.xml.lzma
/home/cril/wattez/benchmarks/XCSP18/CarSequencing/CarSequencing-90-02_c18.xml.lzma
/home/cril/wattez/benchmarks/XCSP18/CarSequencing/CarSequencing-80-01_c18.xml.lzma
/home/cril/wattez/benchmarks/XCSP18/CarSequencing/CarSequencing-75-02_c18.xml.lzma
/home/cril/wattez/benchmarks/XCSP18/CarSequencing/CarSequencing-dingbas_c18.xml.lzma
/home/cril/wattez/benchmarks/XCSP18/CarSequencing/CarSequencing-04-72_c18.xml.lzma
/home/cril/wattez/benchmarks/XCSP18/Quasigroups_mini/QuasiGroup-v4-10_mini_c18.xml.lzma
/home/cril/wattez/benchmarks/XCSP18/Quasigroups_mini/QuasiGroup-v7-10_mini_c18.xml.lzma
/home/cril/wattez/benchmarks/XCSP18/Quasigroups_mini/QuasiGroup-v7-08_mini_c18.xml.lzma
/home/cril/wattez/benchmarks/XCSP18/Quasigroups_mini/QuasiGroup-v4-08_mini_c18.xml.lzma
/home/cril/wattez/benchmarks/XCSP18/Quasigroups_mini/QuasiGroup-v7-07_mini_c18.xml.lzma
/home/cril/wattez/benchmarks/XCSP18/Quasigroups_mini/QuasiGroup-v7-20_mini_c18.xml.lzma
/home/cril/wattez/benchmarks/XCSP18/Quasigroups_mini/QuasiGroup-v7-12_mini_c18.xml.lzma
/home/cril/wattez/benchmarks/XCSP18/Quasigroups_mini/QuasiGroup-v4-14_mini_c18.xml.lzma
/home/cril/wattez/benchmarks/XCSP18/Quasigroups_mini/QuasiGroup-v4-16_mini_c18.xml.lzma
/home/cril/wattez/benchmarks/XCSP18/Quasigroups_mini/QuasiGroup-v4-07_mini_c18.xml.lzma
/home/cril/wattez/benchmarks/XCSP18/Quasigroups_mini/QuasiGroup-v7-16_mini_c18.xml.lzma
/home/cril/wattez/benchmarks/XCSP18/Quasigroups_mini/QuasiGroup-v4-12_mini_c18.xml.lzma
/home/cril/wattez/benchmarks/XCSP18/Quasigroups_mini/QuasiGroup-v7-14_mini_c18.xml.lzma
/home/cril/wattez/benchmarks/XCSP18/Quasigroups_mini/QuasiGroup-v4-09_mini_c18.xml.lzma
/home/cril/wattez/benchmarks/XCSP18/Quasigroups_mini/QuasiGroup-v7-09_mini_c18.xml.lzma
/home/cril/wattez/benchmarks/XCSP18/Quasigroups_mini/QuasiGroup-v4-20_mini_c18.xml.lzma
/home/cril/wattez/benchmarks/XCSP18/Subisomorphism/Subisomorphism-g08-g43_c18.xml.lzma
/home/cril/wattez/benchmarks/XCSP18/Subisomorphism/Subisomorphism-g11-g44_c18.xml.lzma
/home/cril/wattez/benchmarks/XCSP18/Subisomorphism/Subisomorphism-g10-g23_c18.xml.lzma
/home/cril/wattez/benchmarks/XCSP18/Subisomorphism/Subisomorphism-g29-g50_c18.xml.lzma
/home/cril/wattez/benchmarks/XCSP18/Subisomorphism/Subisomorphism-g10-g27_c18.xml.lzma
/home/cril/wattez/benchmarks/XCSP18/Subisomorphism/Subisomorphism-g19-g43_c18.xml.lzma
/home/cril/wattez/benchmarks/XCSP18/Subisomorphism/Subisomorphism-g11-g30_c18.xml.lzma
/home/cril/wattez/benchmarks/XCSP18/Subisomorphism/Subisomorphism-g19-g45_c18.xml.lzma
/home/cril/wattez/benchmarks/XCSP18/Subisomorphism/Subisomorphism-g17-g42_c18.xml.lzma
/home/cril/wattez/benchmarks/XCSP18/Subisomorphism/Subisomorphism-g17-g37_c18.xml.lzma
/home/cril/wattez/benchmarks/XCSP18/Subisomorphism/Subisomorphism-g34-g36_c18.xml.lzma
/home/cril/wattez/benchmarks/XCSP18/Frb/frb-59-26-2-mgd_c18.xml.lzma
/home/cril/wattez/benchmarks/XCSP18/Frb/frb-45-21-1_c18.xml.lzma
/home/cril/wattez/benchmarks/XCSP18/Frb/frb-50-23-3-mgd_c18.xml.lzma
/home/cril/wattez/benchmarks/XCSP18/Frb/frb-56-25-3-mgd_c18.xml.lzma
/home/cril/wattez/benchmarks/XCSP18/Frb/frb-56-25-1-mgd_c18.xml.lzma
/home/cril/wattez/benchmarks/XCSP18/Frb/frb-53-24-3-mgd_c18.xml.lzma
/home/cril/wattez/benchmarks/XCSP18/Frb/frb-59-26-1-mgd_c18.xml.lzma
/home/cril/wattez/benchmarks/XCSP18/Frb/frb-56-25-2-mgd_c18.xml.lzma
/home/cril/wattez/benchmarks/XCSP18/Frb/frb-40-19-1-mgd_c18.xml.lzma
/home/cril/wattez/benchmarks/XCSP18/Frb/frb-53-24-1-mgd_c18.xml.lzma
/home/cril/wattez/benchmarks/XCSP18/Frb/frb-50-23-1-mgd_c18.xml.lzma
/home/cril/wattez/benchmarks/XCSP18/Frb/frb-59-26-3-mgd_c18.xml.lzma
/home/cril/wattez/benchmarks/XCSP18/Frb/frb-53-24-2-mgd_c18.xml.lzma
/home/cril/wattez/benchmarks/XCSP18/Frb/frb-35-17-1_c18.xml.lzma
/home/cril/wattez/benchmarks/XCSP18/Frb/frb-50-23-2-mgd_c18.xml.lzma
/home/cril/wattez/benchmarks/XCSP18/Frb/frb-30-15-1_c18.xml.lzma
/home/cril/wattez/benchmarks/XCSP19/ConsecutiveSquarePacking/ConsecutiveSquarePacking-sp-28-088.xml.lzma
/home/cril/wattez/benchmarks/XCSP19/ConsecutiveSquarePacking/ConsecutiveSquarePacking-sp-29-092.xml.lzma
/home/cril/wattez/benchmarks/XCSP19/ConsecutiveSquarePacking/ConsecutiveSquarePacking-sp-26-080.xml.lzma
/home/cril/wattez/benchmarks/XCSP19/ConsecutiveSquarePacking/ConsecutiveSquarePacking-sp-20-054.xml.lzma
/home/cril/wattez/benchmarks/XCSP19/ConsecutiveSquarePacking/ConsecutiveSquarePacking-sp-15-036.xml.lzma
/home/cril/wattez/benchmarks/XCSP19/ConsecutiveSquarePacking/ConsecutiveSquarePacking-sp-18-047.xml.lzma
/home/cril/wattez/benchmarks/XCSP19/ConsecutiveSquarePacking/ConsecutiveSquarePacking-sp-27-083.xml.lzma
/home/cril/wattez/benchmarks/XCSP19/ConsecutiveSquarePacking/ConsecutiveSquarePacking-sp-29-093.xml.lzma
/home/cril/wattez/benchmarks/XCSP19/ConsecutiveSquarePacking/ConsecutiveSquarePacking-sp-15-035.xml.lzma
/home/cril/wattez/benchmarks/XCSP19/ConsecutiveSquarePacking/ConsecutiveSquarePacking-sp-35-123.xml.lzma
/home/cril/wattez/benchmarks/XCSP19/ConsecutiveSquarePacking/ConsecutiveSquarePacking-sp-30-098.xml.lzma
/home/cril/wattez/benchmarks/XCSP19/ConsecutiveSquarePacking/ConsecutiveSquarePacking-sp-17-042.xml.lzma
/home/cril/wattez/benchmarks/XCSP19/ConsecutiveSquarePacking/ConsecutiveSquarePacking-sp-18-046.xml.lzma
/home/cril/wattez/benchmarks/XCSP19/ConsecutiveSquarePacking/ConsecutiveSquarePacking-sp-24-071.xml.lzma
/home/cril/wattez/benchmarks/XCSP19/hcp/graph171.xml.lzma
/home/cril/wattez/benchmarks/XCSP19/hcp/graph237.xml.lzma
/home/cril/wattez/benchmarks/XCSP19/hcp/graph197.xml.lzma
/home/cril/wattez/benchmarks/XCSP19/hcp/graph255.xml.lzma
/home/cril/wattez/benchmarks/XCSP19/hcp/graph252.xml.lzma
/home/cril/wattez/benchmarks/XCSP19/hcp/graph249.xml.lzma
/home/cril/wattez/benchmarks/XCSP19/hcp/graph223.xml.lzma
/home/cril/wattez/benchmarks/XCSP19/hcp/graph254.xml.lzma
/home/cril/wattez/benchmarks/XCSP19/hcp/graph162.xml.lzma
/home/cril/wattez/benchmarks/XCSP19/hcp/graph48.xml.lzma