{
  "compilerOptions": {
    "noUnusedLocals": true,
    "noUnusedParameters": true,
    "lib": ["dom", "esnext", "deno.ns"]
  },
  "files": [
    "./ide.user.ts",
    "./build.ts"
  ],
  "lint": {
    "files": {
      "include": ["./ide.user.ts", "./build.ts"]
    },
    "rules": {
      "tags": ["recommended"],
      "exclude": ["ban-types"]
    }
  }
}
