{
	"compilerOptions": {
		"lib": ["esnext", "dom"],
    "noUnusedLocals": true,
    "noUnusedParameters": true
	},
  "files": [
    "./v2/index.ts"
  ],
  "lint": {
    "files": {
      "include": [
        "./v2/index.ts"
      ]
    },
    "rules": {
      "tags": ["recommended"],
      "exclude": ["ban-types"]
    }
  },
  "tasks": {
  	"build-v2": "deno bundle ./v2/index.ts ./v2/index.js"
  }
}
