module gitlab.com/prochac/talks

go 1.18

require (
	github.com/cheekybits/genny v1.0.0
	golang.org/x/exp v0.0.0-20220518171630-0b5c67f07fdf
	golang.org/x/tools v0.1.10
)

require (
	github.com/yuin/goldmark v1.4.1 // indirect
	golang.org/x/net v0.0.0-20211015210444-4f30a5c0130f // indirect
	golang.org/x/sys v0.0.0-20211019181941-9d821ace8654 // indirect
)
