module gitlab.com/prochac.dataddo/pseudo-commons/pgq

go 1.20

replace gitlab.com/prochac.dataddo/pseudo-commons => ../.

require gitlab.com/prochac.dataddo/pseudo-commons v0.0.0-00010101000000-000000000000
