\relax 
\@writefile{toc}{\contentsline {section}{\numberline {1}Overview}{1}{}\protected@file@percent }
\@writefile{toc}{\contentsline {paragraph}{}{1}{}\protected@file@percent }
\@writefile{toc}{\contentsline {paragraph}{}{1}{}\protected@file@percent }
\@writefile{toc}{\contentsline {section}{\numberline {2}Le regole del gioco}{1}{}\protected@file@percent }
\@writefile{toc}{\contentsline {paragraph}{}{1}{}\protected@file@percent }
\@writefile{toc}{\contentsline {section}{\numberline {3}Vincoli dell'assignment}{2}{}\protected@file@percent }
\@writefile{toc}{\contentsline {paragraph}{User}{2}{}\protected@file@percent }
\@writefile{toc}{\contentsline {paragraph}{Building}{2}{}\protected@file@percent }
\@writefile{toc}{\contentsline {paragraph}{Level}{2}{}\protected@file@percent }
\@writefile{toc}{\contentsline {paragraph}{SpecialBuilding}{2}{}\protected@file@percent }
\@writefile{toc}{\contentsline {section}{\numberline {4}La struttura del software}{3}{}\protected@file@percent }
\@writefile{toc}{\contentsline {paragraph}{Clicker}{3}{}\protected@file@percent }
\@writefile{toc}{\contentsline {paragraph}{Controllers}{3}{}\protected@file@percent }
\@writefile{toc}{\contentsline {paragraph}{Etities}{3}{}\protected@file@percent }
\@writefile{toc}{\contentsline {paragraph}{Exceptions}{3}{}\protected@file@percent }
\@writefile{toc}{\contentsline {paragraph}{Repositories}{3}{}\protected@file@percent }
\@writefile{toc}{\contentsline {paragraph}{Services}{3}{}\protected@file@percent }
\@writefile{toc}{\contentsline {paragraph}{Services.Impl}{3}{}\protected@file@percent }
\@writefile{toc}{\contentsline {section}{\numberline {5}Database}{3}{}\protected@file@percent }
\@writefile{toc}{\contentsline {section}{\numberline {6}Cosa abbiamo implementato}{4}{}\protected@file@percent }
\@writefile{toc}{\contentsline {subsection}{\numberline {6.1}Username Controller}{4}{}\protected@file@percent }
\@writefile{toc}{\contentsline {subsection}{\numberline {6.2}Building Controller}{5}{}\protected@file@percent }
\@writefile{toc}{\contentsline {subsection}{\numberline {6.3}Level Controller}{5}{}\protected@file@percent }
\@writefile{toc}{\contentsline {subsection}{\numberline {6.4}Special Building Controller}{5}{}\protected@file@percent }
\@writefile{toc}{\contentsline {section}{\numberline {7}Sequence Diagrams}{6}{}\protected@file@percent }
\@writefile{toc}{\contentsline {subsection}{\numberline {7.1}Add new user}{6}{}\protected@file@percent }
\@writefile{toc}{\contentsline {subsection}{\numberline {7.2}Get Special Building By Name}{6}{}\protected@file@percent }
\@writefile{toc}{\contentsline {section}{\numberline {8}Come si effettua il deploy}{7}{}\protected@file@percent }
\@writefile{toc}{\contentsline {section}{\numberline {9}Come si verifica il funzionamento}{8}{}\protected@file@percent }
\@writefile{toc}{\contentsline {subsection}{\numberline {9.1}Collection Postman}{8}{}\protected@file@percent }
\@writefile{toc}{\contentsline {subsection}{\numberline {9.2}Classe Clicker Experience}{8}{}\protected@file@percent }
\@writefile{lof}{\contentsline {figure}{\numberline {1}{\ignorespaces I log della classe automatica.}}{10}{}\protected@file@percent }
\@writefile{toc}{\contentsline {section}{\numberline {10}Limitazioni Database}{11}{}\protected@file@percent }
\gdef \@abspage@last{12}
