,file_name,mean,max,max4x4
0,4_temperature_session_aurel_cold.csv,32.48688147094752,34.42349991270753,34.1384943558206
1,9_temperature_session.csv,32.318810359501555,34.8812745427646,34.68204185895917
2,10_temperature_session.csv,33.33801302241129,34.740067976337386,34.61886436859852
3,8_temperature_session.csv,32.24672532113837,34.902909729960484,34.778499069788836
4,5_temperature_session_aurel.csv,32.19922314312789,34.86956432874892,34.490143465091066
5,2_temperature_session_beate.csv,32.17573464858796,35.22855156789922,34.98930530378199
6,1_temperature_session_aurel.csv,31.959359807000737,34.915698195455306,34.777972394034286
7,3_temperature_session_stefan.csv,32.192585149316514,34.53996385008192,34.336435971399005
8,6_temperature_session.csv,33.187517809580505,34.931177812782394,34.75453190216737
9,11_temperature_session_chiara.csv,33.11658139586615,35.209460229978816,34.976885853306605
10,0_temperature_sessionaurel.csv,32.59897719849564,34.65788473997954,34.51143812345761
11,12_temperature_session_sara.csv,33.1464829438395,35.29723717087519,34.99348165507186
12,7_temperature_session.csv,32.87324710349269,34.50826455385548,34.38292638062639
