time_stamp,time_stamp,mean_temperature,max_temperature,max_2x2_temperature
2021/1/7/15:4547,2021/1/7/15:4547,-1.0,-1.0,-1.0
2021/1/7/15:4548,2021/1/7/15:4548,32.566707658080745,34.94150016571871,34.01196865382725
2021/1/7/15:4549,2021/1/7/15:4549,33.18187473345542,35.274989378372595,34.87867392311061
2021/1/7/15:4551,2021/1/7/15:4551,33.062262023036745,35.07463743779971,34.78738582375402
2021/1/7/15:4552,2021/1/7/15:4552,33.119082385426694,35.23599127947733,35.04192392402443
2021/1/7/15:4554,2021/1/7/15:4554,33.083848552136665,35.05990136734363,34.81813114494939
2021/1/7/15:4554,2021/1/7/15:4554,33.11659428126789,35.102963436769585,34.95106717659456
2021/1/7/15:4555,2021/1/7/15:4555,33.12159936431987,35.19655537037073,35.04368363691779
2021/1/7/15:4558,2021/1/7/15:4558,33.23230585918566,35.50697038019035,35.092319167259035
2021/1/7/15:460,2021/1/7/15:460,33.11543227058458,35.16750513988433,34.886856639516054
2021/1/7/15:461,2021/1/7/15:461,32.85768124247668,35.31791779305536,34.72120382389879
2021/1/7/15:462,2021/1/7/15:462,-1.0,-1.0,-1.0
