time_stamp,time_stamp,mean_temperature,max_temperature,max_2x2_temperature
2021/1/6/18:4322,2021/1/6/18:4322,32.00129553746198,35.0350455473386,34.83528399309516
2021/1/6/18:4323,2021/1/6/18:4323,31.948388782131172,34.72003834334777,34.63067432178789
2021/1/6/18:4325,2021/1/6/18:4325,31.992851440367552,34.815865025069854,34.41995867562393
2021/1/6/18:4327,2021/1/6/18:4327,31.948835574942546,34.86048987676304,34.45816037649429
2021/1/6/18:4329,2021/1/6/18:4329,32.00272016302286,34.87755663698886,34.7053543443196
2021/1/6/18:4331,2021/1/6/18:4331,31.966620120136653,34.97118663223665,34.73097023626744
2021/1/6/18:4333,2021/1/6/18:4333,32.040912210731534,34.76264887771953,34.67580987249171
2021/1/6/18:4335,2021/1/6/18:4335,31.95030242668888,34.72471282148939,34.6160329827579
2021/1/6/18:4337,2021/1/6/18:4337,31.981950910865113,34.75516480511948,34.65465665897703
2021/1/6/18:4339,2021/1/6/18:4339,32.00013993546872,34.77062613901393,34.557219701540944
2021/1/6/18:4342,2021/1/6/18:4342,32.08919349948501,34.73371630363954,34.5740315961464
2021/1/6/18:4344,2021/1/6/18:4344,32.16685762735123,34.68389261325575,34.51399008592031
2021/1/6/18:4345,2021/1/6/18:4345,32.126660802611106,34.709860907658765,34.57969817791157
2021/1/6/18:4347,2021/1/6/18:4347,32.18670945873595,34.76251919787245,34.53266662532636
2021/1/6/18:4349,2021/1/6/18:4349,32.15754265138436,34.86035545485788,34.56869428072848
2021/1/6/18:4351,2021/1/6/18:4351,32.32833439446553,34.666544526647954,34.501954024966324
2021/1/6/18:4353,2021/1/6/18:4353,32.27230016659607,34.68511496898151,34.50558928026993
2021/1/6/18:4355,2021/1/6/18:4355,32.34191211675809,34.612001648849684,34.506500383982996
2021/1/6/18:4356,2021/1/6/18:4356,32.3326947601865,34.58097603758864,34.40575332467985
2021/1/6/18:4358,2021/1/6/18:4358,32.26630223908659,34.57912603183638,34.44841691343751
2021/1/6/18:4359,2021/1/6/18:4359,32.24299321585675,34.628446020716865,34.496873048154285
2021/1/6/18:440,2021/1/6/18:440,32.31414275904565,34.55061639805905,34.462359081492934
2021/1/6/18:442,2021/1/6/18:442,32.24732806384976,34.70498522233828,34.539002971132575
2021/1/6/18:443,2021/1/6/18:443,32.12684193554816,34.65980606997357,34.54585402222136
2021/1/6/18:445,2021/1/6/18:445,32.24066428332522,34.72248024649963,34.52585262400932
2021/1/6/18:447,2021/1/6/18:447,32.23915241921291,34.539079354695616,34.41004630787428
2021/1/6/18:449,2021/1/6/18:449,32.25854059019025,34.814627181562,34.55081814318393
2021/1/6/18:4411,2021/1/6/18:4411,32.3427261356476,34.53981096259707,34.38908766235302
2021/1/6/18:4413,2021/1/6/18:4413,32.407223329564815,34.61524417168778,34.4424226671386
2021/1/6/18:4415,2021/1/6/18:4415,32.26485618459513,34.74389012297894,34.577717776264365
2021/1/6/18:4417,2021/1/6/18:4417,32.21746547485436,34.715801487178226,34.56876375731689
2021/1/6/18:4419,2021/1/6/18:4419,31.49424096508584,33.396374607825976,31.711339556754865
