time_stamp,time_stamp,mean_temperature,max_temperature,max_2x2_temperature
2021/1/7/15:3714,2021/1/7/15:3714,33.415859876006316,34.861762366560356,34.667254397783026
2021/1/7/15:3715,2021/1/7/15:3715,33.36405521029471,34.83168289681112,34.71359310724736
2021/1/7/15:3717,2021/1/7/15:3717,33.27129455270529,34.625393534680825,34.56020074415781
2021/1/7/15:3718,2021/1/7/15:3718,33.30084245063884,34.641433107297246,34.53440922520592
2021/1/7/15:3720,2021/1/7/15:3720,33.1769918808944,34.52838805471163,34.51318033563528
2021/1/7/15:3722,2021/1/7/15:3722,33.27753807741311,34.9419360995081,34.71284976524838
2021/1/7/15:3724,2021/1/7/15:3724,33.40879937240755,34.73656807404558,34.59285604496357
