{
    "todo-tree.tree.showScanModeButton": false,
    "workbench.iconTheme": "material-icon-theme",
    "workbench.colorTheme": "Gruvbox Dark Hard",
    "editor.tabSize": 2,
    "editor.fontFamily": "'Jetbrains Mono', 'Droid Sans Mono', 'monospace', monospace, 'Droid Sans Fallback'",
    "editor.fontSize": 20,
    "tabnine.experimentalAutoImports": true,
    "[typescript]": {
        "editor.defaultFormatter": "esbenp.prettier-vscode"
    },
    "typescript.updateImportsOnFileMove.enabled": "always",
    "[javascript]": {
        "editor.defaultFormatter": "esbenp.prettier-vscode"
    },
    "[json]": {
        "editor.defaultFormatter": "esbenp.prettier-vscode"
    }
}