<svg xmlns="http://www.w3.org/2000/svg" width="17.975" height="29.095" viewBox="0 0 17.975 29.095">
  <g id="Groupe_120" data-name="Groupe 120" transform="translate(15.856 26.977) rotate(180)">
    <line id="Ligne_14" data-name="Ligne 14" y1="12.429" x2="13.737" transform="translate(0)" fill="none" stroke="#ac3328" stroke-linecap="round" stroke-width="3"/>
    <line id="Ligne_15" data-name="Ligne 15" x2="13.737" y2="12.429" transform="translate(0 12.429)" fill="none" stroke="#ac3328" stroke-linecap="round" stroke-width="3"/>
  </g>
</svg>
