{
  "blogs": [
    {
      "id": 1,
      "title": "My first blogg",
      "description": "some description of blog 2",
      "authorName": "Priyanshu bhardwaj"
    },
    {
      "id": 2,
      "title": "title blog 2",
      "description": "some description of blog 2",
      "authorName": "dev bhardwaj"
    }
  ]
}