<?xml version="1.0" encoding="UTF-8" standalone="no"?>
<svg
   xmlns:dc="http://purl.org/dc/elements/1.1/"
   xmlns:cc="http://creativecommons.org/ns#"
   xmlns:rdf="http://www.w3.org/1999/02/22-rdf-syntax-ns#"
   xmlns:svg="http://www.w3.org/2000/svg"
   xmlns="http://www.w3.org/2000/svg"
   xmlns:sodipodi="http://sodipodi.sourceforge.net/DTD/sodipodi-0.dtd"
   xmlns:inkscape="http://www.inkscape.org/namespaces/inkscape"
   id="svgRoot"
   viewBox="0 0 200 200"
   xml:space="preserve"
   sodipodi:version="0.32"
   inkscape:version="0.46"
   width="255.99998"
   height="89.235817"
   sodipodi:docname="Korean Broadcasting System.svg"
   inkscape:output_extension="org.inkscape.output.svg.inkscape"
   version="1.0"><metadata
   id="metadata102"><rdf:RDF><cc:Work
       rdf:about=""><dc:format>image/svg+xml</dc:format><dc:type
         rdf:resource="http://purl.org/dc/dcmitype/StillImage" /></cc:Work></rdf:RDF></metadata><sodipodi:namedview
   inkscape:window-height="667"
   inkscape:window-width="829"
   inkscape:pageshadow="2"
   inkscape:pageopacity="0.0"
   guidetolerance="10.0"
   gridtolerance="10.0"
   objecttolerance="10.0"
   borderopacity="1.0"
   bordercolor="#666666"
   pagecolor="#ffffff"
   id="base"
   showgrid="false"
   inkscape:zoom="2.8632814"
   inkscape:cx="127.99999"
   inkscape:cy="44.617908"
   inkscape:window-x="44"
   inkscape:window-y="0"
   inkscape:current-layer="svgRoot" />
<defs
   id="defs3"><inkscape:perspective
   sodipodi:type="inkscape:persp3d"
   inkscape:vp_x="0 : 526.18109 : 1"
   inkscape:vp_y="0 : 1000 : 0"
   inkscape:vp_z="744.09448 : 526.18109 : 1"
   inkscape:persp3d-origin="372.04724 : 350.78739 : 1"
   id="perspective104" />
</defs>
<g
   transform="matrix(7.1467641,0,0,-7.1467641,-358.83145,916.66391)"
   id="g7">
<g
   id="q1"
   class="">
<clipPath
   id="clp1"
   clip-rule="evenodd">
<path
   d="M 15.835,141.26 L 107.2,141.26 L 107.2,89.806 L 15.835,89.806 L 15.835,141.26 z"
   id="path11" />
</clipPath>
<g
   clip-path="url(#clp1)"
   id="g13">
<clipPath
   id="clp2"
   clip-rule="nonzero">
<path
   d="M -14.025,894.86 L 580.98,894.86 L 580.98,53.856 L -14.025,53.856 L -14.025,894.86 z"
   id="path16" />
</clipPath>
<g
   clip-path="url(#clp2)"
   id="g18">
<clipPath
   id="clp3"
   clip-rule="nonzero">
<path
   d="M -14.025,895.18 L 580.7,895.18 L 580.7,54.216 L -14.025,54.216 L -14.025,895.18 z"
   id="path21" />
</clipPath>
<g
   clip-path="url(#clp3)"
   id="g23">
<path
   d="M 24.204,122.43 L 24.06,105.46 L 27.696,105.46 L 27.706,122.41 L 24.204,122.43"
   class="ps01"
   id="path25"
   style="fill:#2449a4;" />
</g>
</g>
</g>
</g>
<g
   id="q2"
   class="">
<clipPath
   id="clp4"
   clip-rule="evenodd">
<path
   d="M 15.835,141.26 L 107.2,141.26 L 107.2,89.806 L 15.835,89.806 L 15.835,141.26 z"
   id="path29" />
</clipPath>
<g
   clip-path="url(#clp4)"
   id="g31">
<clipPath
   id="clp5"
   clip-rule="nonzero">
<path
   d="M -14.025,894.86 L 580.98,894.86 L 580.98,53.856 L -14.025,53.856 L -14.025,894.86 z"
   id="path34" />
</clipPath>
<g
   clip-path="url(#clp5)"
   id="g36">
<clipPath
   id="clp6"
   clip-rule="nonzero">
<path
   d="M -14.025,895.18 L 580.7,895.18 L 580.7,54.216 L -14.025,54.216 L -14.025,895.18 z"
   id="path39" />
</clipPath>
<g
   clip-path="url(#clp6)"
   id="g41">
<path
   d="M 27.669,114.2 L 34.229,105.41 L 39.01,105.39 L 31.978,114.11 L 38.818,122.43 L 34.239,122.45 L 27.669,114.2"
   class="ps01 ps10"
   id="path43"
   style="fill:#2449a4;" />
</g>
</g>
</g>
</g>
<g
   id="q3"
   class="">
<clipPath
   id="clp7"
   clip-rule="evenodd">
<path
   d="M 15.835,141.26 L 107.2,141.26 L 107.2,89.806 L 15.835,89.806 L 15.835,141.26 z"
   id="path47" />
</clipPath>
<g
   clip-path="url(#clp7)"
   id="g49">
<clipPath
   id="clp8"
   clip-rule="nonzero">
<path
   d="M -14.025,894.86 L 580.98,894.86 L 580.98,53.856 L -14.025,53.856 L -14.025,894.86 z"
   id="path52" />
</clipPath>
<g
   clip-path="url(#clp8)"
   id="g54">
<clipPath
   id="clp9"
   clip-rule="nonzero">
<path
   d="M -14.025,895.18 L 580.7,895.18 L 580.7,54.216 L -14.025,54.216 L -14.025,895.18 z"
   id="path57" />
</clipPath>
<g
   clip-path="url(#clp9)"
   id="g59">
<path
   d="M 53.733,114.48 C 53.733,114.48 55.422,115.62 55.432,117.84 L 55.433,118.18 C 55.115,122.09 51.142,122.44 51.142,122.44 L 40.973,122.47 L 40.912,105.4 L 51.67,105.33 C 51.67,105.33 55.779,105.45 56.273,110.23 L 56.274,110.57 C 56.284,112.79 53.733,114.48 53.733,114.48 z M 44.396,119.75 C 44.396,119.75 47.898,119.9 49.783,119.69 C 51.668,119.48 51.66,117.72 51.66,117.72 C 51.246,115.57 49.766,115.78 49.766,115.78 L 44.377,115.8 L 44.396,119.75 z M 50,108.1 L 44.343,108.13 L 44.365,113.04 L 49.955,113.02 C 49.955,113.02 52.446,112.87 52.301,110.45 C 52.17,108.3 50,108.1 50,108.1"
   class="ps01 ps10"
   id="path61"
   style="fill:#2449a4;" />
</g>
</g>
</g>
</g>
<g
   id="q4"
   class="">
<clipPath
   id="clp10"
   clip-rule="evenodd">
<path
   d="M 15.835,141.26 L 107.2,141.26 L 107.2,89.806 L 15.835,89.806 L 15.835,141.26 z"
   id="path65" />
</clipPath>
<g
   clip-path="url(#clp10)"
   id="g67">
<clipPath
   id="clp11"
   clip-rule="nonzero">
<path
   d="M -14.025,894.86 L 580.98,894.86 L 580.98,53.856 L -14.025,53.856 L -14.025,894.86 z"
   id="path70" />
</clipPath>
<g
   clip-path="url(#clp11)"
   id="g72">
<clipPath
   id="clp12"
   clip-rule="nonzero">
<path
   d="M -14.025,895.18 L 580.7,895.18 L 580.7,54.216 L -14.025,54.216 L -14.025,895.18 z"
   id="path75" />
</clipPath>
<g
   clip-path="url(#clp12)"
   id="g77">
<path
   d="M 71.884,122.32 L 61.984,122.39 C 61.984,122.39 57.269,122.08 57.316,117.5 C 57.362,112.92 62.549,113.03 62.749,112.89 L 65.915,112.95 C 65.915,112.95 68.475,113 68.937,111.11 C 69.4,109.23 67.578,108.22 67.578,108.22 L 66.769,108.03 L 58.081,108.07 L 58.069,105.44 L 68.171,105.39 C 68.171,105.39 72.482,105.51 73.107,109.82 C 73.733,114.12 69.362,115.49 69.362,115.49 L 67.409,115.63 L 63.099,115.68 C 63.099,115.68 61.283,116 61.358,117.75 C 61.433,119.5 63.454,119.69 63.454,119.69 L 71.873,119.69 L 71.884,122.32"
   class="ps01 ps10"
   id="path79"
   style="fill:#2449a4;" />
</g>
</g>
</g>
</g>
<g
   id="q5"
   class="">
<clipPath
   id="clp13"
   clip-rule="evenodd">
<path
   d="M 15.835,141.26 L 107.2,141.26 L 107.2,89.806 L 15.835,89.806 L 15.835,141.26 z"
   id="path83" />
</clipPath>
<g
   clip-path="url(#clp13)"
   id="g85">
<clipPath
   id="clp14"
   clip-rule="nonzero">
<path
   d="M -14.025,894.86 L 580.98,894.86 L 580.98,53.856 L -14.025,53.856 L -14.025,894.86 z"
   id="path88" />
</clipPath>
<g
   clip-path="url(#clp14)"
   id="g90">
<clipPath
   id="clp15"
   clip-rule="nonzero">
<path
   d="M -14.025,895.18 L 580.7,895.18 L 580.7,54.216 L -14.025,54.216 L -14.025,895.18 z"
   id="path93" />
</clipPath>
<g
   clip-path="url(#clp15)"
   id="g95">
<path
   d="M 102.8,120.72 C 98.799,128.98 91.304,128.22 91.304,128.22 C 86.28,128.64 84.406,125.83 84.406,125.83 C 78.956,124.38 77.422,119.53 77.422,119.53 C 74.612,112.63 78.87,106.58 78.87,106.58 C 82.532,100.45 89.601,100.28 89.601,100.28 C 94.796,100.2 96.329,102.67 96.329,102.67 C 100.67,103.77 102.89,107.95 102.89,107.95 C 106.21,114.51 102.8,120.72 102.8,120.72 z M 84.15,125.07 C 96.158,129.32 101.44,122.17 101.44,122.17 L 101.01,122.34 C 93.433,128.81 83.98,124.38 83.98,124.38 C 83.469,124.72 84.15,125.07 84.15,125.07 z M 83.725,122.68 C 97.436,128.22 102.97,119.36 102.97,119.36 C 94.115,127.79 83.81,121.83 83.81,121.83 C 83.129,121.83 83.725,122.68 83.725,122.68 z M 103.57,116.38 C 96.84,125.32 83.98,119.87 83.98,119.87 C 83.555,119.96 83.98,120.81 83.98,120.81 C 100.25,126.34 103.57,116.38 103.57,116.38 z M 96.84,103.43 C 84.832,99.175 79.552,106.33 79.552,106.33 L 79.978,106.16 C 87.557,99.686 97.01,104.11 97.01,104.11 C 97.521,103.77 96.84,103.43 96.84,103.43 z M 97.266,105.82 C 83.555,100.28 78.019,109.14 78.019,109.14 C 86.875,100.71 97.181,106.67 97.181,106.67 C 97.862,106.67 97.266,105.82 97.266,105.82 z M 77.422,112.12 C 84.15,103.18 97.01,108.63 97.01,108.63 C 97.436,108.54 97.01,107.69 97.01,107.69 C 80.744,102.16 77.422,112.12 77.422,112.12 z M 103.57,110.42 C 103.57,110.42 101.69,120.12 88.494,116.89 C 88.494,116.89 89.771,116.63 90.282,116.72 C 90.282,116.72 98.883,118.59 101.86,112.8 C 101.86,112.8 100.42,110.07 97.095,108.88 L 96.329,109.48 C 96.329,109.48 80.063,103.6 77.082,115.44 C 77.082,115.44 80.744,105.31 95.477,110.33 C 95.477,110.33 95.307,111.1 94.284,110.93 C 94.284,110.93 78.797,105.82 77.51,118.41 C 77.558,118.02 78.899,108.36 92.667,111.69 C 92.667,111.69 92.667,112.12 90.879,111.95 C 90.879,111.95 81.936,109.65 79.041,116.04 C 79.041,116.04 81.17,118.68 83.725,119.79 L 84.662,119.02 C 84.662,119.02 100.08,124.81 103.91,113.57 C 103.91,113.57 99.735,122.77 85.513,118.08 L 86.535,117.4 C 86.535,117.4 99.054,121.83 103.23,112.8 C 103.23,112.8 103.82,111.61 103.57,110.42"
   class="ps02 ps10"
   id="path97"
   style="fill:#0d87d3;" />
<g
   id="xfrm6"
   transform="scale(200,200)">
<g
   id="frm7"
   transform="scale(1e-2,1e-2)">
</g>
</g>
</g>
</g>
</g>
</g>
</g>
</svg>