<svg id="adv1" xmlns="http://www.w3.org/2000/svg" width="89.4" height="84.483" viewBox="0 0 89.4 84.483">
  <g id="Group_305" data-name="Group 305" transform="translate(31.064 0)">
    <circle id="Ellipse_25" data-name="Ellipse 25" cx="8.576" cy="8.576" r="8.576" transform="matrix(0.403, -0.915, 0.915, 0.403, 4.779, 20.475)" fill="none" stroke="#39e5be" stroke-width="2"/>
    <g id="Group_297" data-name="Group 297" transform="translate(19.434)">
      <path id="Path_836" data-name="Path 836" d="M239.163,325.817a1.365,1.365,0,0,1-1.276-1.842l1-2.677a1.363,1.363,0,0,1,2.552.957l-1,2.676A1.363,1.363,0,0,1,239.163,325.817Z" transform="translate(-237.801 -320.413)" fill="#39e5be"/>
    </g>
    <g id="Group_298" data-name="Group 298" transform="translate(8.412 0.408)">
      <path id="Path_837" data-name="Path 837" d="M224.175,326.342a1.364,1.364,0,0,1-1.242-.8l-1.183-2.6a1.363,1.363,0,0,1,2.482-1.128l1.183,2.6a1.365,1.365,0,0,1-1.24,1.928Z" transform="translate(-221.627 -321.012)" fill="#39e5be"/>
    </g>
    <g id="Group_299" data-name="Group 299" transform="translate(0 9.2)">
      <path id="Path_838" data-name="Path 838" d="M213.325,337.643a1.356,1.356,0,0,1-.478-.087l-2.677-1a1.363,1.363,0,0,1,.958-2.552l2.676,1a1.363,1.363,0,0,1-.479,2.64Z" transform="translate(-209.285 -333.912)" fill="#39e5be"/>
    </g>
    <g id="Group_300" data-name="Group 300" transform="translate(0.408 20.044)">
      <path id="Path_839" data-name="Path 839" d="M211.249,353.733a1.364,1.364,0,0,1-.565-2.6l2.6-1.183a1.363,1.363,0,0,1,1.128,2.482l-2.6,1.183A1.355,1.355,0,0,1,211.249,353.733Z" transform="translate(-209.884 -349.822)" fill="#39e5be"/>
    </g>
    <g id="Group_301" data-name="Group 301" transform="translate(9.201 26.765)">
      <path id="Path_840" data-name="Path 840" d="M224.148,365.088a1.364,1.364,0,0,1-1.276-1.842l1-2.676a1.363,1.363,0,1,1,2.552.958l-1,2.676A1.364,1.364,0,0,1,224.148,365.088Z" transform="translate(-222.785 -359.685)" fill="#39e5be"/>
    </g>
    <g id="Group_302" data-name="Group 302" transform="translate(20.044 26.431)">
      <path id="Path_841" data-name="Path 841" d="M241.242,364.524a1.363,1.363,0,0,1-1.242-.8l-1.183-2.6a1.363,1.363,0,1,1,2.482-1.128l1.183,2.6a1.364,1.364,0,0,1-.677,1.8A1.348,1.348,0,0,1,241.242,364.524Z" transform="translate(-238.694 -359.194)" fill="#39e5be"/>
    </g>
    <g id="Group_303" data-name="Group 303" transform="translate(26.765 19.237)">
      <path id="Path_842" data-name="Path 842" d="M252.6,352.37a1.359,1.359,0,0,1-.478-.087l-2.676-1a1.363,1.363,0,0,1,.957-2.552l2.676,1a1.363,1.363,0,0,1-.478,2.64Z" transform="translate(-248.557 -348.639)" fill="#39e5be"/>
    </g>
    <g id="Group_304" data-name="Group 304" transform="translate(26.431 8.216)">
      <path id="Path_843" data-name="Path 843" d="M249.431,336.377a1.364,1.364,0,0,1-.565-2.6l2.6-1.182a1.363,1.363,0,0,1,1.128,2.482l-2.6,1.183A1.361,1.361,0,0,1,249.431,336.377Z" transform="translate(-248.066 -332.468)" fill="#39e5be"/>
    </g>
  </g>
  <g id="Group_306" data-name="Group 306" transform="translate(51.073 64.488)">
    <path id="Path_844" data-name="Path 844" d="M232.76,430.806H222.707a1.085,1.085,0,0,1-1.085-1.085V411.9a1.086,1.086,0,0,1,1.085-1.085H232.76a1.086,1.086,0,0,1,1.085,1.085v17.825A1.085,1.085,0,0,1,232.76,430.806Zm-8.968-2.171h7.883V412.982h-7.883Z" transform="translate(-221.622 -410.811)" fill="#131ca2"/>
  </g>
  <g id="Group_309" data-name="Group 309" transform="translate(0 82.313)">
    <path id="Path_849" data-name="Path 849" d="M234.315,445.83H147.085a1.085,1.085,0,0,1,0-2.171h87.229a1.085,1.085,0,0,1,0,2.171Z" transform="translate(-146 -443.659)" fill="#131ca2"/>
  </g>
  <g id="Group_311" data-name="Group 311" transform="translate(35.867 58.039)">
    <path id="Path_851" data-name="Path 851" d="M251.927,425.371H213.181a1.085,1.085,0,0,1-1.085-1.085V400.012a1.085,1.085,0,0,1,1.085-1.085h38.746a1.086,1.086,0,0,1,1.085,1.085v24.274A1.085,1.085,0,0,1,251.927,425.371Zm-37.66-2.171h36.575V401.1H214.267Z" transform="translate(-212.096 -398.927)" fill="#131ca2"/>
  </g>
  <g id="Group_312" data-name="Group 312" transform="translate(24.149 39.263)">
    <path id="Path_852" data-name="Path 852" d="M246.378,385.273H204.893a1.086,1.086,0,0,1-.884-.456l-13.3-18.684a1.086,1.086,0,0,1,.882-1.715l43.165-.092h0a1.084,1.084,0,0,1,.922.514L247.3,383.616a1.086,1.086,0,0,1-.923,1.657ZM205.452,383.1H244.43l-10.28-16.6-40.459.087Z" transform="translate(-190.503 -364.326)" fill="#131ca2"/>
  </g>
  <g id="Group_313" data-name="Group 313" transform="translate(33.608 44.152)">
    <path id="Path_853" data-name="Path 853" d="M245.582,384.51h-30.2a1.085,1.085,0,0,1-.884-.456l-6.364-8.936a1.085,1.085,0,0,1,.881-1.715l30.99-.067h0a1.086,1.086,0,0,1,.923.514l5.574,9a1.086,1.086,0,0,1-.923,1.657Zm-29.64-2.171h27.692l-4.229-6.831-28.284.061Z" transform="translate(-207.934 -373.336)" fill="#39e5be"/>
  </g>
  <g id="Group_314" data-name="Group 314" transform="translate(43.696 44.197)">
    <path id="Path_854" data-name="Path 854" d="M233.665,384.547a1.084,1.084,0,0,1-.9-.478l-6.055-8.958a1.085,1.085,0,0,1,1.8-1.216l6.055,8.958a1.085,1.085,0,0,1-.9,1.693Z" transform="translate(-226.524 -373.419)" fill="#39e5be"/>
  </g>
  <g id="Group_315" data-name="Group 315" transform="translate(54.662 44.197)">
    <path id="Path_855" data-name="Path 855" d="M253.969,384.548a1.085,1.085,0,0,1-.9-.47l-6.151-8.959a1.085,1.085,0,1,1,1.789-1.229l6.152,8.958a1.085,1.085,0,0,1-.893,1.7Z" transform="translate(-246.731 -373.419)" fill="#39e5be"/>
  </g>
  <g id="Group_316" data-name="Group 316" transform="translate(10.544 39.355)">
    <path id="Path_856" data-name="Path 856" d="M168.589,385.35h-2.073a1.085,1.085,0,0,1-.877-1.724l13.6-18.684A1.085,1.085,0,0,1,181,366.22l-12.351,16.962a1.085,1.085,0,0,1-.059,2.169Z" transform="translate(-165.431 -364.496)" fill="#131ca2"/>
  </g>
  <g id="Group_317" data-name="Group 317" transform="translate(12.617 58.039)">
    <path id="Path_857" data-name="Path 857" d="M193.586,425.371h-23.25a1.085,1.085,0,0,1-1.085-1.085V400.012a1.085,1.085,0,0,1,1.085-1.085h23.25a1.086,1.086,0,0,1,1.085,1.085v24.274A1.085,1.085,0,0,1,193.586,425.371ZM171.422,423.2H192.5V401.1H171.422Z" transform="translate(-169.251 -398.927)" fill="#131ca2"/>
  </g>
  <g id="Group_318" data-name="Group 318" transform="translate(54.823 73.718)">
    <path id="Path_858" data-name="Path 858" d="M229.619,431.3a1.085,1.085,0,0,1-1.085-1.085v-1.311a1.085,1.085,0,0,1,2.171,0v1.311A1.086,1.086,0,0,1,229.619,431.3Z" transform="translate(-228.534 -427.82)" fill="#131ca2"/>
  </g>
  <g id="Group_319" data-name="Group 319" transform="translate(37.421 48.508)">
    <path id="Path_859" data-name="Path 859" d="M245.812,383.534H216.044a1.085,1.085,0,0,1,0-2.171h29.768a1.085,1.085,0,1,1,0,2.171Z" transform="translate(-214.959 -381.364)" fill="#39e5be"/>
  </g>
</svg>
