<svg xmlns="http://www.w3.org/2000/svg" viewBox="0 0 61 80" width="61" height="80"> 
	<g id="Folder 1">
		<path id="Path_1346" fill-rule="evenodd" fill="#131ca2" d="M56.42 0.54C57.27 0.89 58.04 1.41 58.69 2.06C59.34 2.71 59.86 3.48 60.21 4.32C60.56 5.17 60.74 6.08 60.75 7L60.75 53.75C60.74 54.67 60.56 55.58 60.21 56.43C59.86 57.27 59.34 58.04 58.69 58.69C58.04 59.34 57.27 59.86 56.42 60.21C55.58 60.56 54.67 60.75 53.75 60.75L41.14 60.75C41.1 60.9 41.06 61.05 41 61.2C40.94 61.34 40.87 61.48 40.78 61.62C40.7 61.75 40.61 61.88 40.51 62C40.41 62.11 40.3 62.23 40.18 62.33C39.99 62.5 39.79 62.64 39.57 62.76C39.35 62.88 39.11 62.97 38.87 63.03C38.62 63.09 38.37 63.12 38.12 63.12C37.87 63.12 37.62 63.09 37.38 63.03L39.57 79.49L30.38 72.05L21.1 79.4L23.37 62.94C23.13 63 22.88 63.03 22.63 63.03C22.38 63.03 22.13 63 21.88 62.94C21.64 62.88 21.4 62.79 21.18 62.67C20.96 62.55 20.76 62.41 20.57 62.24C20.45 62.13 20.35 62.02 20.25 61.9C20.15 61.78 20.06 61.65 19.97 61.52C19.89 61.39 19.82 61.25 19.76 61.1C19.7 60.96 19.65 60.81 19.61 60.66L7 60.66C6.08 60.66 5.17 60.47 4.32 60.12C3.48 59.77 2.71 59.25 2.06 58.6C1.41 57.95 0.89 57.18 0.54 56.34C0.19 55.49 0 54.58 0 53.66L0 7C0 6.08 0.19 5.17 0.54 4.32C0.89 3.48 1.41 2.71 2.06 2.06C2.71 1.41 3.48 0.89 4.32 0.54C5.17 0.19 6.08 0 7 0L53.75 0C54.67 0 55.58 0.19 56.42 0.54ZM58.3 53.66L58.3 7C58.3 6.39 58.17 5.79 57.94 5.23C57.7 4.67 57.36 4.16 56.93 3.73C56.5 3.3 55.99 2.96 55.43 2.72C54.87 2.49 54.27 2.37 53.66 2.36L7 2.36C6.39 2.37 5.79 2.49 5.23 2.72C4.67 2.96 4.16 3.3 3.73 3.73C3.3 4.16 2.96 4.67 2.72 5.23C2.49 5.79 2.37 6.39 2.36 7L2.36 53.66C2.37 54.27 2.49 54.87 2.72 55.43C2.96 55.99 3.3 56.5 3.73 56.93C4.16 57.36 4.67 57.7 5.23 57.94C5.79 58.17 6.39 58.3 7 58.3L18.82 58.3C18.6 58.23 18.39 58.13 18.2 58.02C18 57.9 17.82 57.76 17.65 57.6C17.48 57.44 17.34 57.27 17.21 57.07C17.08 56.88 16.98 56.68 16.89 56.46C16.79 56.22 16.72 55.97 16.69 55.71C16.65 55.45 16.65 55.19 16.68 54.93C16.71 54.67 16.77 54.42 16.87 54.17C16.96 53.93 17.09 53.7 17.24 53.49L17.24 53.4C17.31 53.31 17.35 53.21 17.38 53.11C17.4 53.01 17.41 52.9 17.39 52.79C17.38 52.69 17.34 52.58 17.28 52.49C17.23 52.4 17.16 52.32 17.07 52.25C16.87 52.09 16.69 51.9 16.53 51.68C16.38 51.47 16.25 51.24 16.15 51C16.05 50.76 15.98 50.5 15.94 50.24C15.91 49.98 15.9 49.72 15.93 49.45C15.97 49.2 16.05 48.95 16.14 48.7C16.24 48.46 16.37 48.24 16.52 48.02C16.67 47.81 16.85 47.62 17.04 47.45C17.24 47.27 17.45 47.13 17.68 47L17.77 47C17.87 46.97 17.97 46.91 18.04 46.84C18.12 46.76 18.18 46.67 18.22 46.58C18.26 46.48 18.28 46.37 18.28 46.26C18.28 46.16 18.26 46.05 18.21 45.95C18.1 45.72 18.03 45.47 17.98 45.21C17.94 44.95 17.93 44.69 17.95 44.43C17.97 44.17 18.03 43.92 18.12 43.67C18.21 43.43 18.33 43.19 18.47 42.98C18.62 42.76 18.79 42.57 18.98 42.4C19.17 42.22 19.39 42.08 19.61 41.95C19.84 41.83 20.08 41.74 20.33 41.68C20.58 41.61 20.84 41.58 21.1 41.58L21.19 41.58C21.29 41.57 21.4 41.55 21.5 41.51C21.59 41.47 21.68 41.41 21.76 41.34C21.84 41.27 21.91 41.18 21.96 41.09C22.01 41 22.04 40.9 22.06 40.79C22.08 40.53 22.13 40.26 22.21 40.01C22.3 39.76 22.41 39.52 22.56 39.3C22.7 39.08 22.88 38.88 23.07 38.7C23.27 38.52 23.49 38.37 23.72 38.25C23.95 38.12 24.19 38.02 24.44 37.96C24.69 37.89 24.95 37.86 25.21 37.86C25.47 37.86 25.73 37.89 25.98 37.96C26.23 38.02 26.47 38.12 26.7 38.25L26.79 38.25C26.88 38.31 26.98 38.35 27.09 38.36C27.19 38.38 27.3 38.38 27.41 38.35C27.51 38.33 27.61 38.28 27.7 38.22C27.79 38.16 27.87 38.08 27.92 37.99L27.92 37.9C28.21 37.47 28.6 37.12 29.06 36.87C29.52 36.63 30.03 36.5 30.55 36.5C31.07 36.5 31.58 36.63 32.04 36.87C32.5 37.12 32.89 37.47 33.18 37.9L33.18 37.99C33.24 38.08 33.32 38.15 33.41 38.2C33.5 38.26 33.6 38.3 33.7 38.32C33.8 38.34 33.91 38.35 34.01 38.34C34.12 38.33 34.22 38.3 34.31 38.26L34.4 38.26C34.63 38.13 34.87 38.03 35.12 37.96C35.37 37.9 35.63 37.86 35.89 37.86C36.15 37.86 36.41 37.9 36.66 37.96C36.91 38.03 37.15 38.13 37.38 38.26C37.61 38.37 37.83 38.51 38.03 38.68C38.22 38.85 38.4 39.04 38.54 39.26C38.69 39.47 38.8 39.71 38.89 39.95C38.97 40.2 39.02 40.45 39.04 40.71C39.06 40.81 39.09 40.92 39.14 41.01C39.19 41.1 39.26 41.19 39.34 41.26C39.42 41.33 39.51 41.39 39.61 41.43C39.7 41.47 39.81 41.49 39.92 41.5L40 41.5C40.26 41.5 40.52 41.53 40.77 41.59C41.02 41.66 41.26 41.75 41.49 41.87C41.72 41.99 41.93 42.14 42.12 42.32C42.31 42.49 42.48 42.68 42.63 42.9C42.78 43.11 42.91 43.34 43.01 43.58C43.1 43.82 43.17 44.08 43.2 44.34C43.23 44.6 43.22 44.86 43.19 45.12C43.15 45.38 43.08 45.63 42.98 45.87C42.92 45.97 42.88 46.08 42.86 46.19C42.84 46.3 42.85 46.42 42.89 46.52C42.92 46.63 42.98 46.73 43.05 46.82C43.13 46.9 43.22 46.97 43.33 47.01L43.42 47.01C43.66 47.12 43.88 47.26 44.08 47.43C44.29 47.6 44.47 47.79 44.62 48C44.77 48.22 44.9 48.45 44.99 48.7C45.08 48.94 45.14 49.2 45.17 49.46C45.19 49.72 45.18 49.98 45.14 50.24C45.1 50.5 45.03 50.75 44.93 51C44.83 51.24 44.7 51.47 44.55 51.68C44.4 51.89 44.23 52.09 44.03 52.26C43.95 52.33 43.88 52.41 43.82 52.5C43.77 52.59 43.73 52.69 43.71 52.8C43.7 52.9 43.7 53.01 43.73 53.11C43.75 53.22 43.79 53.31 43.86 53.4L43.86 53.49C44 53.7 44.12 53.93 44.21 54.18C44.3 54.42 44.36 54.67 44.39 54.93C44.42 55.19 44.42 55.45 44.39 55.71C44.36 55.97 44.3 56.22 44.21 56.46C44.12 56.68 44.02 56.88 43.89 57.07C43.77 57.26 43.62 57.44 43.45 57.6C43.29 57.76 43.1 57.9 42.91 58.02C42.71 58.13 42.5 58.23 42.28 58.3L53.75 58.3C54.36 58.3 54.96 58.17 55.52 57.94C56.08 57.7 56.59 57.36 57.02 56.93C57.45 56.5 57.79 55.99 58.03 55.43C58.26 54.87 58.38 54.27 58.39 53.66L58.3 53.66ZM38.93 58.63C39.02 58.25 39.17 57.89 39.37 57.56C39.58 57.23 39.83 56.93 40.14 56.69C40.44 56.44 40.78 56.25 41.14 56.11C41.58 56.03 41.67 55.68 41.76 55.59C41.79 55.53 41.82 55.46 41.83 55.39C41.84 55.32 41.85 55.25 41.84 55.18C41.83 55.11 41.81 55.04 41.78 54.98C41.76 54.91 41.72 54.85 41.67 54.8L41.67 54.71C41.44 54.39 41.28 54.02 41.18 53.64C41.09 53.26 41.06 52.86 41.11 52.47C41.16 52.07 41.28 51.69 41.46 51.34C41.65 50.99 41.9 50.68 42.19 50.42C42.25 50.38 42.31 50.32 42.35 50.26C42.4 50.21 42.44 50.14 42.47 50.07C42.5 50 42.52 49.93 42.53 49.86C42.55 49.78 42.55 49.71 42.54 49.63C42.54 49.56 42.53 49.49 42.51 49.42C42.49 49.35 42.46 49.28 42.42 49.22C42.38 49.16 42.34 49.11 42.28 49.06C42.23 49.01 42.17 48.97 42.1 48.93L42.02 48.93C41.67 48.76 41.35 48.51 41.09 48.22C40.83 47.92 40.62 47.58 40.48 47.21C40.35 46.84 40.28 46.45 40.29 46.06C40.3 45.66 40.38 45.27 40.53 44.91C40.56 44.84 40.58 44.78 40.59 44.71C40.6 44.64 40.61 44.57 40.6 44.5C40.59 44.43 40.57 44.36 40.55 44.3C40.52 44.23 40.48 44.17 40.44 44.12C40.4 44.06 40.35 44.01 40.3 43.97C40.25 43.93 40.19 43.89 40.13 43.86C40.07 43.83 40.01 43.81 39.94 43.79C39.88 43.78 39.81 43.77 39.74 43.77L39.65 43.77C39.26 43.77 38.87 43.7 38.5 43.56C38.14 43.42 37.8 43.21 37.51 42.94C37.22 42.68 36.99 42.36 36.81 42.01C36.64 41.65 36.53 41.27 36.5 40.88C36.5 40.81 36.48 40.74 36.46 40.67C36.44 40.6 36.41 40.54 36.37 40.48C36.33 40.41 36.29 40.36 36.24 40.31C36.18 40.26 36.13 40.22 36.06 40.18C36 40.15 35.94 40.12 35.87 40.1C35.81 40.08 35.74 40.08 35.67 40.08C35.6 40.08 35.53 40.08 35.47 40.1C35.4 40.12 35.34 40.15 35.28 40.18L35.19 40.18C34.84 40.37 34.46 40.5 34.06 40.55C33.67 40.6 33.27 40.58 32.88 40.48C32.5 40.38 32.13 40.22 31.81 39.98C31.48 39.75 31.2 39.46 30.99 39.13L30.99 39.04C30.91 38.93 30.8 38.85 30.68 38.78C30.56 38.72 30.42 38.69 30.29 38.69C30.15 38.69 30.02 38.72 29.9 38.78C29.78 38.85 29.67 38.93 29.59 39.04L29.59 39.13C29.38 39.46 29.11 39.75 28.8 39.98C28.48 40.21 28.12 40.38 27.74 40.48C27.36 40.58 26.97 40.6 26.58 40.55C26.19 40.5 25.82 40.37 25.47 40.18L25.39 40.18C25.33 40.15 25.26 40.12 25.2 40.1C25.13 40.08 25.06 40.08 24.99 40.08C24.92 40.08 24.85 40.08 24.79 40.1C24.72 40.12 24.66 40.15 24.6 40.18C24.54 40.22 24.48 40.26 24.43 40.31C24.38 40.36 24.33 40.41 24.29 40.48C24.25 40.54 24.22 40.6 24.2 40.67C24.18 40.74 24.17 40.81 24.16 40.88C24.13 41.27 24.02 41.65 23.85 42.01C23.68 42.36 23.44 42.68 23.15 42.94C22.86 43.21 22.52 43.42 22.16 43.56C21.79 43.7 21.4 43.77 21.01 43.77L20.92 43.77C20.85 43.77 20.78 43.78 20.72 43.79C20.65 43.81 20.59 43.83 20.53 43.86C20.47 43.89 20.41 43.93 20.36 43.97C20.31 44.01 20.26 44.06 20.22 44.12C20.18 44.17 20.14 44.23 20.11 44.3C20.09 44.36 20.07 44.43 20.06 44.5C20.06 44.57 20.06 44.64 20.07 44.71C20.08 44.78 20.1 44.84 20.13 44.91C20.28 45.27 20.36 45.66 20.36 46.05C20.37 46.45 20.3 46.84 20.17 47.21C20.03 47.58 19.83 47.92 19.57 48.21C19.31 48.51 18.99 48.75 18.64 48.93L18.56 48.93C18.49 48.97 18.44 49.01 18.39 49.06C18.34 49.11 18.29 49.17 18.25 49.23C18.21 49.29 18.18 49.36 18.16 49.42C18.14 49.49 18.12 49.56 18.12 49.63C18.09 49.7 18.08 49.78 18.07 49.85C18.07 49.93 18.08 50 18.11 50.08C18.13 50.15 18.17 50.21 18.21 50.27C18.26 50.33 18.32 50.38 18.38 50.42C18.68 50.68 18.93 50.99 19.11 51.34C19.3 51.69 19.42 52.07 19.46 52.47C19.51 52.86 19.49 53.26 19.39 53.64C19.3 54.02 19.13 54.39 18.91 54.71L18.91 54.8C18.86 54.85 18.82 54.91 18.79 54.98C18.76 55.04 18.74 55.11 18.73 55.18C18.73 55.25 18.73 55.32 18.74 55.39C18.76 55.46 18.78 55.53 18.82 55.59C18.91 55.67 18.99 56.02 19.43 56.11C19.82 56.2 20.19 56.36 20.52 56.59C20.85 56.81 21.13 57.1 21.36 57.43C21.58 57.76 21.74 58.13 21.83 58.52C21.92 58.9 21.94 59.31 21.88 59.7C21.87 59.77 21.86 59.84 21.87 59.92C21.87 59.99 21.89 60.06 21.91 60.13C21.93 60.2 21.96 60.26 22 60.32C22.04 60.39 22.09 60.44 22.14 60.49C22.2 60.53 22.26 60.57 22.32 60.6C22.38 60.64 22.45 60.66 22.52 60.67C22.59 60.69 22.66 60.7 22.73 60.69C22.8 60.69 22.87 60.68 22.93 60.66C23 60.65 23.08 60.63 23.15 60.62C23.22 60.6 23.29 60.59 23.37 60.59C23.44 60.58 23.51 60.58 23.59 60.57C23.66 60.57 23.73 60.57 23.81 60.58C24.13 60.57 24.46 60.62 24.77 60.71C25.08 60.81 25.37 60.96 25.64 61.14C25.9 61.33 26.14 61.56 26.33 61.82C26.53 62.08 26.68 62.37 26.78 62.68C26.96 63.11 27.22 63.29 27.4 63.29C27.46 63.32 27.53 63.33 27.6 63.34C27.68 63.34 27.75 63.34 27.82 63.32C27.89 63.31 27.95 63.28 28.02 63.25C28.08 63.21 28.14 63.17 28.18 63.11C28.48 62.84 28.82 62.63 29.2 62.48C29.57 62.34 29.97 62.26 30.37 62.26C30.78 62.26 31.17 62.34 31.55 62.48C31.92 62.63 32.27 62.84 32.56 63.11C32.62 63.16 32.68 63.19 32.74 63.22C32.8 63.25 32.87 63.27 32.94 63.29C33.01 63.3 33.07 63.31 33.14 63.31C33.21 63.31 33.28 63.3 33.35 63.29C33.42 63.27 33.49 63.25 33.55 63.22C33.61 63.19 33.67 63.15 33.72 63.11C33.78 63.06 33.83 63.01 33.87 62.95C33.91 62.89 33.94 62.83 33.96 62.76C34.1 62.39 34.3 62.04 34.56 61.74C34.82 61.44 35.14 61.19 35.49 61C35.85 60.82 36.23 60.7 36.63 60.66C37.03 60.61 37.43 60.65 37.81 60.75C37.88 60.77 37.95 60.78 38.02 60.78C38.09 60.78 38.16 60.78 38.23 60.76C38.3 60.75 38.37 60.72 38.43 60.69C38.49 60.66 38.55 60.62 38.6 60.58C38.66 60.53 38.7 60.47 38.74 60.41C38.78 60.35 38.82 60.29 38.84 60.22C38.86 60.15 38.88 60.08 38.88 60C38.89 59.93 38.88 59.86 38.87 59.79C38.82 59.4 38.85 59.01 38.93 58.63ZM36.5 73.97L35.19 64.87C35.05 64.99 34.89 65.11 34.73 65.21C34.57 65.31 34.39 65.39 34.21 65.46C34.03 65.53 33.85 65.58 33.66 65.61C33.47 65.64 33.28 65.66 33.09 65.65C32.89 65.65 32.69 65.62 32.49 65.58C32.3 65.54 32.1 65.48 31.92 65.41C31.73 65.33 31.55 65.24 31.38 65.14C31.21 65.03 31.05 64.91 30.9 64.78C30.82 64.72 30.73 64.67 30.63 64.63C30.54 64.6 30.43 64.58 30.33 64.58C30.23 64.58 30.13 64.6 30.03 64.63C29.93 64.67 29.84 64.72 29.76 64.78C29.57 64.97 29.35 65.13 29.12 65.26C28.89 65.39 28.64 65.5 28.38 65.57C28.12 65.63 27.85 65.67 27.58 65.67C27.31 65.67 27.05 65.64 26.79 65.57C26.66 65.54 26.54 65.51 26.42 65.47C26.3 65.43 26.19 65.38 26.07 65.32C25.96 65.26 25.86 65.19 25.76 65.12C25.66 65.04 25.56 64.96 25.47 64.87L24.25 73.97L30.37 69.07L36.5 73.97Z" />
		<path id="Path_1347" fill="#39e5be" d="M45.52 12.25L45.52 11.12L15.23 11.12L15.23 13.39L45.52 13.39L45.52 12.25Z" />
		<path id="Path_1348" fill="#39e5be" d="M13.39 20.13L13.39 22.5L47.36 22.5L47.36 20.13L13.39 20.13Z" />
		<path id="Path_1349" fill="#39e5be" d="M18.64 29.15L18.64 31.51L42.1 31.51L42.1 29.15L18.64 29.15Z" />
	</g>
</svg>