<svg xmlns="http://www.w3.org/2000/svg" xmlns:xlink="http://www.w3.org/1999/xlink" width="556.227" height="197.117" viewBox="0 0 556.227 197.117">
  <defs>
    <linearGradient id="linear-gradient" x1="-0.053" y1="-0.342" x2="0.307" y2="0.703" gradientUnits="objectBoundingBox">
      <stop offset="0" stop-color="#fff"/>
      <stop offset="0.439" stop-color="#68edcf"/>
      <stop offset="1" stop-color="#51d1b4"/>
    </linearGradient>
    <linearGradient id="linear-gradient-2" x1="0.093" y1="-0.072" x2="0.587" y2="0.94" gradientUnits="objectBoundingBox">
      <stop offset="0" stop-color="#b2ffee"/>
      <stop offset="1" stop-color="#68edcf"/>
    </linearGradient>
  </defs>
  <g id="home" transform="translate(0 0.354)">
    <path id="Path_1810" data-name="Path 1810" d="M1100.981,778.713c-5.231-9.122-31.375-27.058-64.558-22.2-36.22,5.305-44.178-6.269-59.11-11.081-27.339-8.812-48.439,20.258-57.889,1.814-12.064-23.549-31.651-35.19-91.375-12.026-14.186,5.5-13.212-6.688-19.67-13.805-12.54-13.823-27.727,11.692-34.695,10.291-7.912-1.59-5.5-12.451-10.129-21.751-9.653-19.376-26.314-1.166-37.8-2.765-11.435-1.591-17.389-14.77-30.5-18.6-24.87-7.271-34.044,13.29-46.462,13.29-13.477,0-57.122-21.511-42.712,76.834Z" transform="translate(-552.522 -583.797)" fill="url(#linear-gradient)"/>
    <rect id="Rectangle_634" data-name="Rectangle 634" width="361" height="100" transform="translate(43.511 95)" fill="#fff" stroke="#131ca2" stroke-width="1"/>
    <rect id="Rectangle_637" data-name="Rectangle 637" width="140" height="100" transform="translate(43.511 95)" fill="#fff" stroke="#131ca2" stroke-width="1"/>
    <rect id="Rectangle_638" data-name="Rectangle 638" width="33" height="30" transform="translate(65.511 124)" fill="#fff" stroke="#131ca2" stroke-width="1"/>
    <rect id="Rectangle_642" data-name="Rectangle 642" width="34" height="30" transform="translate(285.511 124)" fill="#fff" stroke="#131ca2" stroke-width="1"/>
    <rect id="Rectangle_639" data-name="Rectangle 639" width="33" height="30" transform="translate(131.511 124)" fill="#fff" stroke="#131ca2" stroke-width="1"/>
    <rect id="Rectangle_641" data-name="Rectangle 641" width="32" height="30" transform="translate(352.511 124)" fill="#fff" stroke="#131ca2" stroke-width="1"/>
    <rect id="Rectangle_640" data-name="Rectangle 640" width="40" height="72" transform="translate(218.511 124)" fill="#fff" stroke="#131ca2" stroke-width="1"/>
    <path id="Path_1198" data-name="Path 1198" d="M4884.848,610.067h400.838l-89.549-93.719H4974.009Z" transform="translate(-4860.996 -510.494)" fill="#fff" stroke="#131ca2" stroke-width="1"/>
    <path id="Path_1199" data-name="Path 1199" d="M4884.848,608.012H5065.5l-91.841-93.352Z" transform="translate(-4860.996 -508.439)" fill="#fff" stroke="#131ca2" stroke-width="1"/>
    <g id="Path_1200" data-name="Path 1200" transform="translate(127.739 0)" fill="#fff">
      <path d="M 79.04413604736328 81.61309814453125 L 2.332048654556274 0.9999883770942688 L 180.2250061035156 0.9999883770942688 L 256.619140625 81.4393310546875 L 79.04413604736328 81.61309814453125 Z" stroke="none"/>
      <path d="M 4.6640625 1.999984741210938 L 79.4725341796875 80.61267852783203 L 254.2924957275391 80.44160461425781 L 179.7956237792969 1.999984741210938 L 4.6640625 1.999984741210938 M 0 -1.52587890625e-05 L 180.6544036865234 -1.52587890625e-05 L 258.94580078125 82.43705749511719 L 78.61570739746094 82.613525390625 L 0 -1.52587890625e-05 Z" stroke="none" fill="#1abdfc"/>
    </g>
    <line id="Line_1" data-name="Line 1" x2="81.341" y2="82.042" transform="translate(193.303 0.351)" fill="none" stroke="#1abdfc" stroke-width="2"/>
    <line id="Line_2" data-name="Line 2" x2="81.341" y2="82.042" transform="translate(252.205 0.351)" fill="none" stroke="#1abdfc" stroke-width="2"/>
    <path id="Path_1201" data-name="Path 1201" d="M5093.611,572.136h179.377" transform="translate(-4927.578 -532.772)" fill="none" stroke="#1abdfc" stroke-width="2"/>
    <path id="Path_1196" data-name="Path 1196" d="M4721.419,784.331h555.92" transform="translate(-4721.419 -588.568)" fill="none" stroke="#131ca2" stroke-width="2"/>
    <g id="Group_1025" data-name="Group 1025" transform="translate(436.109 31.034)">
      <path id="Path_1552" data-name="Path 1552" d="M1479.32,558.022c-.243-14.329,12.876-18.835,25.605-14.836,9.633,3.027,10.412,4.341,34.79-9.141,6.816-3.769,19.5-4.951,25.19,2.212,3.329,4.192,4.183,10.289,3.253,15.366-.9,4.885-4.606,11.936-.483,16.326,3.916,4.17,10.737,2.85,15.489,5.5,4.827,2.689,6.72,8.125,6.832,13.246.261,11.96-4.4,25.3-12.678,33.98-12.278,12.887-30.455,23.23-49.944,23.23-20.519,0-34.626-8.949-42.1-22.338a101.359,101.359,0,0,0-12.28-17.9c-4.8-5.967-3.682-13.724.967-19.633C1482.187,573.574,1479.488,567.9,1479.32,558.022Z" transform="translate(-1469.89 -531.042)" fill="url(#linear-gradient-2)"/>
      <path id="Path_1554" data-name="Path 1554" d="M1557.97,653.5l-9.639-15.554.892-.672,8.649,13.55-.815-22.41,2.316-1.844.748,13.282,3.8-8.083.646.281-4.346,9.541,2.753,48.92,10.373-39.669,1.707,1.848-2.285,9.738,6.844-6.431.616.471-7.812,7.456-7.64,32.562.293,35.969h-6.164l.5-39.445Z" transform="translate(-1507.562 -568.783)" fill="#131ca2"/>
    </g>
  </g>
</svg>
