module gorestapi

go 1.22.4

require (
	github.com/go-sql-driver/mysql v1.7.0 // indirect
	github.com/gorilla/mux v1.8.1
	github.com/jinzhu/inflection v1.0.0 // indirect
	github.com/jinzhu/now v1.1.5 // indirect
	gorm.io/driver/mysql v1.5.7 // indirect
	gorm.io/gorm v1.25.10 // indirect
)
