{
    "$schema": "https://schemas.wp.org/trunk/block.json",
    "name":"cryptocoin/service-grid",
    "description":"Pour afficher les services",
    "title":"Containeur des services",
    "attributes":{

        "title":{
            "type":"string",
            "default":""
        },

        "sousTitle":{
            "type":"string",
            "default":""
        },

        "titre1":{
            "type":"string",
            "default":""
        },
        "titre2":{
            "type":"string",
            "default":""
        },
        "titre3":{
            "type":"string",
            "default":""
        },
        "titre4":{
            "type":"string",
            "default":""
        },
        "titre5":{
            "type":"string",
            "default":""
        },
        "titre6":{
            "type":"string",
            "default":""
        },

        "description1":{
            "type":"string",
            "default":""
        },
        "description2":{
            "type":"string",
            "default":""
        },
        "description3":{
            "type":"string",
            "default":""
        },
        "description4":{
            "type":"string",
            "default":""
        },

        "description5":{
            "type":"string",
            "default":""
        },

        "description6":{
            "type":"string",
            "default":""
        },

        "url1":{
            "type":"string",
            "default":""
        },

        "url2":{
            "type":"string",
            "default":""
        },

        "url3":{
            "type":"string",
            "default":""
        },

        "url4":{
            "type":"string",
            "default":""
        },

        "url5":{
            "type":"string",
            "default":""
        },

        "url6":{
            "type":"string",
            "default":""
        },

        
        "image1":{
            "type":"string"
        },

        "image2":{
            "type":"string"
        },

        "image3":{
            "type":"string"
        },

        "image4":{
            "type":"string"
        },

        "image5":{
            "type":"string"
        },

        "image6":{
            "type":"string"
        },

        "alt1":{
            "type":"string",
            "default":""
        },

        "alt2":{
            "type":"string",
            "default":""
        },

        "alt3":{
            "type":"string",
            "default":""
        },

        "alt4":{
            "type":"string",
            "default":""
        },

        "alt5":{
            "type":"string",
            "default":""
        },

        "alt6":{
            "type":"string",
            "default":""
        },


        "imageUrl1":{
            "type":"string"
        },

        "imageUrl2":{
            "type":"string"
        },

        "imageUrl3":{
            "type":"string"
        },

        "imageUrl4":{
            "type":"string"
        },

        "imageUrl5":{
            "type":"string"
        },

        "imageUrl6":{
            "type":"string"
        },


        "background":{
            "type":"string",
            "default":"teal"
        },
        "color":{
            "type":"string",
            "default":"blue"
        }
    },
    
    "editorScript": "file:./index.js",
	"editorStyle": "file:./index.css",
	"style": "file:./style-index.css"
}