^E:\GTA\GTA SAMP\MC_HUD 2.0\SFPLUGIN\TARGET.CPP
/c /ISFAPI /Igame_api\sdk /Zi /nologo /W0 /WX- /O2 /Ob2 /Oi /Os /Oy /D _CRT_SECURE_NO_WARNINGS /D _USE_MATH_DEFINES /D _WINDOWS /D _USRDLL /D WIN32 /D _USING_V110_SDK71_ /D _WINDLL /D _MBCS /GF /Gm- /EHsc /MT /GS- /fp:fast /Zc:wchar_t /Zc:forScope /Fo"RELEASE\\" /Fd"RELEASE\VC120.PDB" /Gd /TP /analyze- E:\GTA\GTA SAMP\MC_HUD 2.0\SFPLUGIN\TARGET.CPP
^E:\GTA\GTA SAMP\MC_HUD 2.0\SFPLUGIN\CHAT.CPP
/c /ISFAPI /Igame_api\sdk /Zi /nologo /W0 /WX- /O2 /Ob2 /Oi /Os /Oy /D _CRT_SECURE_NO_WARNINGS /D _USE_MATH_DEFINES /D _WINDOWS /D _USRDLL /D WIN32 /D _USING_V110_SDK71_ /D _WINDLL /D _MBCS /GF /Gm- /EHsc /MT /GS- /fp:fast /Zc:wchar_t /Zc:forScope /Fo"RELEASE\\" /Fd"RELEASE\VC120.PDB" /Gd /TP /analyze- E:\GTA\GTA SAMP\MC_HUD 2.0\SFPLUGIN\CHAT.CPP
^E:\GTA\GTA SAMP\MC_HUD 2.0\SFPLUGIN\HUD.CPP
/c /ISFAPI /Igame_api\sdk /Zi /nologo /W0 /WX- /O2 /Ob2 /Oi /Os /Oy /D _CRT_SECURE_NO_WARNINGS /D _USE_MATH_DEFINES /D _WINDOWS /D _USRDLL /D WIN32 /D _USING_V110_SDK71_ /D _WINDLL /D _MBCS /GF /Gm- /EHsc /MT /GS- /fp:fast /Zc:wchar_t /Zc:forScope /Fo"RELEASE\\" /Fd"RELEASE\VC120.PDB" /Gd /TP /analyze- E:\GTA\GTA SAMP\MC_HUD 2.0\SFPLUGIN\HUD.CPP
^E:\GTA\GTA SAMP\MC_HUD 2.0\SFPLUGIN\INIFILE.CPP
/c /ISFAPI /Igame_api\sdk /Zi /nologo /W0 /WX- /O2 /Ob2 /Oi /Os /Oy /D _CRT_SECURE_NO_WARNINGS /D _USE_MATH_DEFINES /D _WINDOWS /D _USRDLL /D WIN32 /D _USING_V110_SDK71_ /D _WINDLL /D _MBCS /GF /Gm- /EHsc /MT /GS- /fp:fast /Zc:wchar_t /Zc:forScope /Fo"RELEASE\\" /Fd"RELEASE\VC120.PDB" /Gd /TP /analyze- E:\GTA\GTA SAMP\MC_HUD 2.0\SFPLUGIN\INIFILE.CPP
^E:\GTA\GTA SAMP\MC_HUD 2.0\SFPLUGIN\KEYS.CPP
/c /ISFAPI /Igame_api\sdk /Zi /nologo /W0 /WX- /O2 /Ob2 /Oi /Os /Oy /D _CRT_SECURE_NO_WARNINGS /D _USE_MATH_DEFINES /D _WINDOWS /D _USRDLL /D WIN32 /D _USING_V110_SDK71_ /D _WINDLL /D _MBCS /GF /Gm- /EHsc /MT /GS- /fp:fast /Zc:wchar_t /Zc:forScope /Fo"RELEASE\\" /Fd"RELEASE\VC120.PDB" /Gd /TP /analyze- E:\GTA\GTA SAMP\MC_HUD 2.0\SFPLUGIN\KEYS.CPP
^E:\GTA\GTA SAMP\MC_HUD 2.0\SFPLUGIN\PROC.CPP
/c /ISFAPI /Igame_api\sdk /Zi /nologo /W0 /WX- /O2 /Ob2 /Oi /Os /Oy /D _CRT_SECURE_NO_WARNINGS /D _USE_MATH_DEFINES /D _WINDOWS /D _USRDLL /D WIN32 /D _USING_V110_SDK71_ /D _WINDLL /D _MBCS /GF /Gm- /EHsc /MT /GS- /fp:fast /Zc:wchar_t /Zc:forScope /Fo"RELEASE\\" /Fd"RELEASE\VC120.PDB" /Gd /TP /analyze- E:\GTA\GTA SAMP\MC_HUD 2.0\SFPLUGIN\PROC.CPP
^E:\GTA\GTA SAMP\MC_HUD 2.0\SFPLUGIN\RADAR.CPP
/c /ISFAPI /Igame_api\sdk /Zi /nologo /W0 /WX- /O2 /Ob2 /Oi /Os /Oy /D _CRT_SECURE_NO_WARNINGS /D _USE_MATH_DEFINES /D _WINDOWS /D _USRDLL /D WIN32 /D _USING_V110_SDK71_ /D _WINDLL /D _MBCS /GF /Gm- /EHsc /MT /GS- /fp:fast /Zc:wchar_t /Zc:forScope /Fo"RELEASE\\" /Fd"RELEASE\VC120.PDB" /Gd /TP /analyze- E:\GTA\GTA SAMP\MC_HUD 2.0\SFPLUGIN\RADAR.CPP
^E:\GTA\GTA SAMP\MC_HUD 2.0\SFPLUGIN\MAIN.CPP
/c /ISFAPI /Igame_api\sdk /Zi /nologo /W0 /WX- /O2 /Ob2 /Oi /Os /Oy /D _CRT_SECURE_NO_WARNINGS /D _USE_MATH_DEFINES /D _WINDOWS /D _USRDLL /D WIN32 /D _USING_V110_SDK71_ /D _WINDLL /D _MBCS /GF /Gm- /EHsc /MT /GS- /fp:fast /Zc:wchar_t /Zc:forScope /Fo"RELEASE\\" /Fd"RELEASE\VC120.PDB" /Gd /TP /analyze- E:\GTA\GTA SAMP\MC_HUD 2.0\SFPLUGIN\MAIN.CPP
^E:\_GTA\GTA SAMP\MC_HUD 2.0\SFPLUGIN\CHAT.CPP
/c /ISFAPI /Igame_api\sdk /Zi /nologo /W0 /WX- /O2 /Ob2 /Oi /Os /Oy /D _CRT_SECURE_NO_WARNINGS /D _USE_MATH_DEFINES /D _WINDOWS /D _USRDLL /D WIN32 /D _USING_V110_SDK71_ /D _WINDLL /D _MBCS /GF /Gm- /EHsc /MT /GS- /fp:fast /Zc:wchar_t /Zc:forScope /Fo"RELEASE\\" /Fd"RELEASE\VC120.PDB" /Gd /TP /analyze- E:\_GTA\GTA SAMP\MC_HUD 2.0\SFPLUGIN\CHAT.CPP
^E:\_GTA\GTA SAMP\MC_HUD 2.0\SFPLUGIN\HUD.CPP
/c /ISFAPI /Igame_api\sdk /Zi /nologo /W0 /WX- /O2 /Ob2 /Oi /Os /Oy /D _CRT_SECURE_NO_WARNINGS /D _USE_MATH_DEFINES /D _WINDOWS /D _USRDLL /D WIN32 /D _USING_V110_SDK71_ /D _WINDLL /D _MBCS /GF /Gm- /EHsc /MT /GS- /fp:fast /Zc:wchar_t /Zc:forScope /Fo"RELEASE\\" /Fd"RELEASE\VC120.PDB" /Gd /TP /analyze- E:\_GTA\GTA SAMP\MC_HUD 2.0\SFPLUGIN\HUD.CPP
^E:\_GTA\GTA SAMP\MC_HUD 2.0\SFPLUGIN\INIFILE.CPP
/c /ISFAPI /Igame_api\sdk /Zi /nologo /W0 /WX- /O2 /Ob2 /Oi /Os /Oy /D _CRT_SECURE_NO_WARNINGS /D _USE_MATH_DEFINES /D _WINDOWS /D _USRDLL /D WIN32 /D _USING_V110_SDK71_ /D _WINDLL /D _MBCS /GF /Gm- /EHsc /MT /GS- /fp:fast /Zc:wchar_t /Zc:forScope /Fo"RELEASE\\" /Fd"RELEASE\VC120.PDB" /Gd /TP /analyze- E:\_GTA\GTA SAMP\MC_HUD 2.0\SFPLUGIN\INIFILE.CPP
^E:\_GTA\GTA SAMP\MC_HUD 2.0\SFPLUGIN\KEYS.CPP
/c /ISFAPI /Igame_api\sdk /Zi /nologo /W0 /WX- /O2 /Ob2 /Oi /Os /Oy /D _CRT_SECURE_NO_WARNINGS /D _USE_MATH_DEFINES /D _WINDOWS /D _USRDLL /D WIN32 /D _USING_V110_SDK71_ /D _WINDLL /D _MBCS /GF /Gm- /EHsc /MT /GS- /fp:fast /Zc:wchar_t /Zc:forScope /Fo"RELEASE\\" /Fd"RELEASE\VC120.PDB" /Gd /TP /analyze- E:\_GTA\GTA SAMP\MC_HUD 2.0\SFPLUGIN\KEYS.CPP
^E:\_GTA\GTA SAMP\MC_HUD 2.0\SFPLUGIN\PROC.CPP
/c /ISFAPI /Igame_api\sdk /Zi /nologo /W0 /WX- /O2 /Ob2 /Oi /Os /Oy /D _CRT_SECURE_NO_WARNINGS /D _USE_MATH_DEFINES /D _WINDOWS /D _USRDLL /D WIN32 /D _USING_V110_SDK71_ /D _WINDLL /D _MBCS /GF /Gm- /EHsc /MT /GS- /fp:fast /Zc:wchar_t /Zc:forScope /Fo"RELEASE\\" /Fd"RELEASE\VC120.PDB" /Gd /TP /analyze- E:\_GTA\GTA SAMP\MC_HUD 2.0\SFPLUGIN\PROC.CPP
^E:\_GTA\GTA SAMP\MC_HUD 2.0\SFPLUGIN\RADAR.CPP
/c /ISFAPI /Igame_api\sdk /Zi /nologo /W0 /WX- /O2 /Ob2 /Oi /Os /Oy /D _CRT_SECURE_NO_WARNINGS /D _USE_MATH_DEFINES /D _WINDOWS /D _USRDLL /D WIN32 /D _USING_V110_SDK71_ /D _WINDLL /D _MBCS /GF /Gm- /EHsc /MT /GS- /fp:fast /Zc:wchar_t /Zc:forScope /Fo"RELEASE\\" /Fd"RELEASE\VC120.PDB" /Gd /TP /analyze- E:\_GTA\GTA SAMP\MC_HUD 2.0\SFPLUGIN\RADAR.CPP
^E:\_GTA\GTA SAMP\MC_HUD 2.0\SFPLUGIN\MAIN.CPP
/c /ISFAPI /Igame_api\sdk /Zi /nologo /W0 /WX- /O2 /Ob2 /Oi /Os /Oy /D _CRT_SECURE_NO_WARNINGS /D _USE_MATH_DEFINES /D _WINDOWS /D _USRDLL /D WIN32 /D _USING_V110_SDK71_ /D _WINDLL /D _MBCS /GF /Gm- /EHsc /MT /GS- /fp:fast /Zc:wchar_t /Zc:forScope /Fo"RELEASE\\" /Fd"RELEASE\VC120.PDB" /Gd /TP /analyze- E:\_GTA\GTA SAMP\MC_HUD 2.0\SFPLUGIN\MAIN.CPP
^F:\_GTA\GTA SAMP\MC_HUD 2.0\SFPLUGIN\ADVANCEDFONT.CPP
/c /ISFAPI /Igame_api\sdk /Zi /nologo /W0 /WX- /O2 /Ob2 /Oi /Os /Oy /D _CRT_SECURE_NO_WARNINGS /D _USE_MATH_DEFINES /D _WINDOWS /D _USRDLL /D WIN32 /D _USING_V110_SDK71_ /D _WINDLL /D _MBCS /GF /Gm- /EHsc /MT /GS- /fp:fast /Zc:wchar_t /Zc:forScope /Fo"RELEASE\\" /Fd"RELEASE\VC120.PDB" /Gd /TP /analyze- F:\_GTA\GTA SAMP\MC_HUD 2.0\SFPLUGIN\ADVANCEDFONT.CPP
^F:\_GTA\GTA SAMP\MC_HUD 2.0\SFPLUGIN\CHAT.CPP
/c /ISFAPI /Igame_api\sdk /Zi /nologo /W0 /WX- /O2 /Ob2 /Oi /Os /Oy /D _CRT_SECURE_NO_WARNINGS /D _USE_MATH_DEFINES /D _WINDOWS /D _USRDLL /D WIN32 /D _USING_V110_SDK71_ /D _WINDLL /D _MBCS /GF /Gm- /EHsc /MT /GS- /fp:fast /Zc:wchar_t /Zc:forScope /Fo"RELEASE\\" /Fd"RELEASE\VC120.PDB" /Gd /TP /analyze- F:\_GTA\GTA SAMP\MC_HUD 2.0\SFPLUGIN\CHAT.CPP
^F:\_GTA\GTA SAMP\MC_HUD 2.0\SFPLUGIN\CREATETEXTURE.CPP
/c /ISFAPI /Igame_api\sdk /Zi /nologo /W0 /WX- /O2 /Ob2 /Oi /Os /Oy /D _CRT_SECURE_NO_WARNINGS /D _USE_MATH_DEFINES /D _WINDOWS /D _USRDLL /D WIN32 /D _USING_V110_SDK71_ /D _WINDLL /D _MBCS /GF /Gm- /EHsc /MT /GS- /fp:fast /Zc:wchar_t /Zc:forScope /Fo"RELEASE\\" /Fd"RELEASE\VC120.PDB" /Gd /TP /analyze- F:\_GTA\GTA SAMP\MC_HUD 2.0\SFPLUGIN\CREATETEXTURE.CPP
^F:\_GTA\GTA SAMP\MC_HUD 2.0\SFPLUGIN\HUD.CPP
/c /ISFAPI /Igame_api\sdk /Zi /nologo /W0 /WX- /O2 /Ob2 /Oi /Os /Oy /D _CRT_SECURE_NO_WARNINGS /D _USE_MATH_DEFINES /D _WINDOWS /D _USRDLL /D WIN32 /D _USING_V110_SDK71_ /D _WINDLL /D _MBCS /GF /Gm- /EHsc /MT /GS- /fp:fast /Zc:wchar_t /Zc:forScope /Fo"RELEASE\\" /Fd"RELEASE\VC120.PDB" /Gd /TP /analyze- F:\_GTA\GTA SAMP\MC_HUD 2.0\SFPLUGIN\HUD.CPP
^F:\_GTA\GTA SAMP\MC_HUD 2.0\SFPLUGIN\INIFILE.CPP
/c /ISFAPI /Igame_api\sdk /Zi /nologo /W0 /WX- /O2 /Ob2 /Oi /Os /Oy /D _CRT_SECURE_NO_WARNINGS /D _USE_MATH_DEFINES /D _WINDOWS /D _USRDLL /D WIN32 /D _USING_V110_SDK71_ /D _WINDLL /D _MBCS /GF /Gm- /EHsc /MT /GS- /fp:fast /Zc:wchar_t /Zc:forScope /Fo"RELEASE\\" /Fd"RELEASE\VC120.PDB" /Gd /TP /analyze- F:\_GTA\GTA SAMP\MC_HUD 2.0\SFPLUGIN\INIFILE.CPP
^F:\_GTA\GTA SAMP\MC_HUD 2.0\SFPLUGIN\KEYS.CPP
/c /ISFAPI /Igame_api\sdk /Zi /nologo /W0 /WX- /O2 /Ob2 /Oi /Os /Oy /D _CRT_SECURE_NO_WARNINGS /D _USE_MATH_DEFINES /D _WINDOWS /D _USRDLL /D WIN32 /D _USING_V110_SDK71_ /D _WINDLL /D _MBCS /GF /Gm- /EHsc /MT /GS- /fp:fast /Zc:wchar_t /Zc:forScope /Fo"RELEASE\\" /Fd"RELEASE\VC120.PDB" /Gd /TP /analyze- F:\_GTA\GTA SAMP\MC_HUD 2.0\SFPLUGIN\KEYS.CPP
^F:\_GTA\GTA SAMP\MC_HUD 2.0\SFPLUGIN\PROC.CPP
/c /ISFAPI /Igame_api\sdk /Zi /nologo /W0 /WX- /O2 /Ob2 /Oi /Os /Oy /D _CRT_SECURE_NO_WARNINGS /D _USE_MATH_DEFINES /D _WINDOWS /D _USRDLL /D WIN32 /D _USING_V110_SDK71_ /D _WINDLL /D _MBCS /GF /Gm- /EHsc /MT /GS- /fp:fast /Zc:wchar_t /Zc:forScope /Fo"RELEASE\\" /Fd"RELEASE\VC120.PDB" /Gd /TP /analyze- F:\_GTA\GTA SAMP\MC_HUD 2.0\SFPLUGIN\PROC.CPP
^F:\_GTA\GTA SAMP\MC_HUD 2.0\SFPLUGIN\RADAR.CPP
/c /ISFAPI /Igame_api\sdk /Zi /nologo /W0 /WX- /O2 /Ob2 /Oi /Os /Oy /D _CRT_SECURE_NO_WARNINGS /D _USE_MATH_DEFINES /D _WINDOWS /D _USRDLL /D WIN32 /D _USING_V110_SDK71_ /D _WINDLL /D _MBCS /GF /Gm- /EHsc /MT /GS- /fp:fast /Zc:wchar_t /Zc:forScope /Fo"RELEASE\\" /Fd"RELEASE\VC120.PDB" /Gd /TP /analyze- F:\_GTA\GTA SAMP\MC_HUD 2.0\SFPLUGIN\RADAR.CPP
^F:\_GTA\GTA SAMP\MC_HUD 2.0\SFPLUGIN\MAIN.CPP
/c /ISFAPI /Igame_api\sdk /Zi /nologo /W0 /WX- /O2 /Ob2 /Oi /Os /Oy /D _CRT_SECURE_NO_WARNINGS /D _USE_MATH_DEFINES /D _WINDOWS /D _USRDLL /D WIN32 /D _USING_V110_SDK71_ /D _WINDLL /D _MBCS /GF /Gm- /EHsc /MT /GS- /fp:fast /Zc:wchar_t /Zc:forScope /Fo"RELEASE\\" /Fd"RELEASE\VC120.PDB" /Gd /TP /analyze- F:\_GTA\GTA SAMP\MC_HUD 2.0\SFPLUGIN\MAIN.CPP
^Z:\GTA SAMP\MC_HUD 2.0\SFPLUGIN\ADVANCEDFONT.CPP
/c /ISFAPI /IGAME_API\SDK /Zi /nologo /W0 /WX- /diagnostics:classic /O2 /Ob2 /Oi /Os /Oy /D _CRT_SECURE_NO_WARNINGS /D _USE_MATH_DEFINES /D _WINDOWS /D _USRDLL /D WIN32 /D _USING_V110_SDK71_ /D _WINDLL /D _MBCS /GF /Gm- /EHsc /MT /GS- /fp:fast /Zc:wchar_t /Zc:forScope /Zc:inline /Fo"RELEASE\\" /Fd"RELEASE\VC141.PDB" /Gd /TP /analyze- /FC Z:\GTA SAMP\MC_HUD 2.0\SFPLUGIN\ADVANCEDFONT.CPP
^Z:\GTA SAMP\MC_HUD 2.0\SFPLUGIN\CHAT.CPP
/c /ISFAPI /IGAME_API\SDK /Zi /nologo /W0 /WX- /diagnostics:classic /O2 /Ob2 /Oi /Os /Oy /D _CRT_SECURE_NO_WARNINGS /D _USE_MATH_DEFINES /D _WINDOWS /D _USRDLL /D WIN32 /D _USING_V110_SDK71_ /D _WINDLL /D _MBCS /GF /Gm- /EHsc /MT /GS- /fp:fast /Zc:wchar_t /Zc:forScope /Zc:inline /Fo"RELEASE\\" /Fd"RELEASE\VC141.PDB" /Gd /TP /analyze- /FC Z:\GTA SAMP\MC_HUD 2.0\SFPLUGIN\CHAT.CPP
^Z:\GTA SAMP\MC_HUD 2.0\SFPLUGIN\CREATETEXTURE.CPP
/c /ISFAPI /IGAME_API\SDK /Zi /nologo /W0 /WX- /diagnostics:classic /O2 /Ob2 /Oi /Os /Oy /D _CRT_SECURE_NO_WARNINGS /D _USE_MATH_DEFINES /D _WINDOWS /D _USRDLL /D WIN32 /D _USING_V110_SDK71_ /D _WINDLL /D _MBCS /GF /Gm- /EHsc /MT /GS- /fp:fast /Zc:wchar_t /Zc:forScope /Zc:inline /Fo"RELEASE\\" /Fd"RELEASE\VC141.PDB" /Gd /TP /analyze- /FC Z:\GTA SAMP\MC_HUD 2.0\SFPLUGIN\CREATETEXTURE.CPP
^Z:\GTA SAMP\MC_HUD 2.0\SFPLUGIN\HUD.CPP
/c /ISFAPI /IGAME_API\SDK /Zi /nologo /W0 /WX- /diagnostics:classic /O2 /Ob2 /Oi /Os /Oy /D _CRT_SECURE_NO_WARNINGS /D _USE_MATH_DEFINES /D _WINDOWS /D _USRDLL /D WIN32 /D _USING_V110_SDK71_ /D _WINDLL /D _MBCS /GF /Gm- /EHsc /MT /GS- /fp:fast /Zc:wchar_t /Zc:forScope /Zc:inline /Fo"RELEASE\\" /Fd"RELEASE\VC141.PDB" /Gd /TP /analyze- /FC Z:\GTA SAMP\MC_HUD 2.0\SFPLUGIN\HUD.CPP
^Z:\GTA SAMP\MC_HUD 2.0\SFPLUGIN\INIFILE.CPP
/c /ISFAPI /IGAME_API\SDK /Zi /nologo /W0 /WX- /diagnostics:classic /O2 /Ob2 /Oi /Os /Oy /D _CRT_SECURE_NO_WARNINGS /D _USE_MATH_DEFINES /D _WINDOWS /D _USRDLL /D WIN32 /D _USING_V110_SDK71_ /D _WINDLL /D _MBCS /GF /Gm- /EHsc /MT /GS- /fp:fast /Zc:wchar_t /Zc:forScope /Zc:inline /Fo"RELEASE\\" /Fd"RELEASE\VC141.PDB" /Gd /TP /analyze- /FC Z:\GTA SAMP\MC_HUD 2.0\SFPLUGIN\INIFILE.CPP
^Z:\GTA SAMP\MC_HUD 2.0\SFPLUGIN\KEYS.CPP
/c /ISFAPI /IGAME_API\SDK /Zi /nologo /W0 /WX- /diagnostics:classic /O2 /Ob2 /Oi /Os /Oy /D _CRT_SECURE_NO_WARNINGS /D _USE_MATH_DEFINES /D _WINDOWS /D _USRDLL /D WIN32 /D _USING_V110_SDK71_ /D _WINDLL /D _MBCS /GF /Gm- /EHsc /MT /GS- /fp:fast /Zc:wchar_t /Zc:forScope /Zc:inline /Fo"RELEASE\\" /Fd"RELEASE\VC141.PDB" /Gd /TP /analyze- /FC Z:\GTA SAMP\MC_HUD 2.0\SFPLUGIN\KEYS.CPP
^Z:\GTA SAMP\MC_HUD 2.0\SFPLUGIN\MAIN.CPP
/c /ISFAPI /IGAME_API\SDK /Zi /nologo /W0 /WX- /diagnostics:classic /O2 /Ob2 /Oi /Os /Oy /D _CRT_SECURE_NO_WARNINGS /D _USE_MATH_DEFINES /D _WINDOWS /D _USRDLL /D WIN32 /D _USING_V110_SDK71_ /D _WINDLL /D _MBCS /GF /Gm- /EHsc /MT /GS- /fp:fast /Zc:wchar_t /Zc:forScope /Zc:inline /Fo"RELEASE\\" /Fd"RELEASE\VC141.PDB" /Gd /TP /analyze- /FC Z:\GTA SAMP\MC_HUD 2.0\SFPLUGIN\MAIN.CPP
^Z:\GTA SAMP\MC_HUD 2.0\SFPLUGIN\PROC.CPP
/c /ISFAPI /IGAME_API\SDK /Zi /nologo /W0 /WX- /diagnostics:classic /O2 /Ob2 /Oi /Os /Oy /D _CRT_SECURE_NO_WARNINGS /D _USE_MATH_DEFINES /D _WINDOWS /D _USRDLL /D WIN32 /D _USING_V110_SDK71_ /D _WINDLL /D _MBCS /GF /Gm- /EHsc /MT /GS- /fp:fast /Zc:wchar_t /Zc:forScope /Zc:inline /Fo"RELEASE\\" /Fd"RELEASE\VC141.PDB" /Gd /TP /analyze- /FC Z:\GTA SAMP\MC_HUD 2.0\SFPLUGIN\PROC.CPP
^Z:\GTA SAMP\MC_HUD 2.0\SFPLUGIN\RADAR.CPP
/c /ISFAPI /IGAME_API\SDK /Zi /nologo /W0 /WX- /diagnostics:classic /O2 /Ob2 /Oi /Os /Oy /D _CRT_SECURE_NO_WARNINGS /D _USE_MATH_DEFINES /D _WINDOWS /D _USRDLL /D WIN32 /D _USING_V110_SDK71_ /D _WINDLL /D _MBCS /GF /Gm- /EHsc /MT /GS- /fp:fast /Zc:wchar_t /Zc:forScope /Zc:inline /Fo"RELEASE\\" /Fd"RELEASE\VC141.PDB" /Gd /TP /analyze- /FC Z:\GTA SAMP\MC_HUD 2.0\SFPLUGIN\RADAR.CPP
