{
 "charts": [],
 "content": "[{\"id\":\"eKqnqGv4Uh\",\"type\":\"header\",\"data\":{\"text\":\"<span style=\\\"font-size: 18px;\\\">Dormitory</span>\",\"col\":12}},{\"id\":\"pU16-8IYLL\",\"type\":\"card\",\"data\":{\"card_name\":\"Master\",\"col\":4}},{\"id\":\"IBpHB-vN_l\",\"type\":\"card\",\"data\":{\"card_name\":\"Inspection\",\"col\":4}},{\"id\":\"6qz-ZQPm8J\",\"type\":\"card\",\"data\":{\"card_name\":\"Report\",\"col\":4}}]",
 "creation": "2024-04-22 10:10:28.372275",
 "custom_blocks": [],
 "docstatus": 0,
 "doctype": "Workspace",
 "for_user": "",
 "hide_custom": 0,
 "icon": "organization",
 "idx": 0,
 "is_hidden": 0,
 "label": "Dormitory",
 "links": [
  {
   "hidden": 0,
   "is_query_report": 0,
   "label": "Report",
   "link_count": 3,
   "link_type": "DocType",
   "onboard": 0,
   "type": "Card Break"
  },
  {
   "hidden": 0,
   "is_query_report": 0,
   "label": "Dormitory Resident Report",
   "link_count": 0,
   "link_to": "dormitory-resident-r",
   "link_type": "Page",
   "onboard": 0,
   "type": "Link"
  },
  {
   "hidden": 0,
   "is_query_report": 0,
   "label": "Dormitory Resident By Date",
   "link_count": 0,
   "link_to": "dormitory_resident_d",
   "link_type": "Page",
   "onboard": 0,
   "type": "Link"
  },
  {
   "hidden": 0,
   "is_query_report": 0,
   "label": "Dormitory Inspection",
   "link_count": 0,
   "link_to": "dormitory-building-i",
   "link_type": "Page",
   "onboard": 0,
   "type": "Link"
  },
  {
   "hidden": 0,
   "is_query_report": 0,
   "label": "Inspection",
   "link_count": 1,
   "link_type": "DocType",
   "onboard": 0,
   "type": "Card Break"
  },
  {
   "hidden": 0,
   "is_query_report": 0,
   "label": "Inspection All",
   "link_count": 0,
   "link_to": "Dormitory Inspection All",
   "link_type": "DocType",
   "onboard": 0,
   "type": "Link"
  },
  {
   "hidden": 0,
   "is_query_report": 0,
   "label": "Master",
   "link_count": 6,
   "link_type": "DocType",
   "onboard": 0,
   "type": "Card Break"
  },
  {
   "hidden": 0,
   "is_query_report": 0,
   "label": "Building",
   "link_count": 0,
   "link_to": "Dormitory Building",
   "link_type": "DocType",
   "onboard": 0,
   "type": "Link"
  },
  {
   "hidden": 0,
   "is_query_report": 0,
   "label": "Room",
   "link_count": 0,
   "link_to": "Dormitory Room",
   "link_type": "DocType",
   "onboard": 0,
   "type": "Link"
  },
  {
   "hidden": 0,
   "is_query_report": 0,
   "label": "Resident",
   "link_count": 0,
   "link_to": "Dormitory Resident",
   "link_type": "DocType",
   "onboard": 0,
   "type": "Link"
  },
  {
   "hidden": 0,
   "is_query_report": 0,
   "label": "Tool Kit Item",
   "link_count": 0,
   "link_to": "Dormitory Tool Kit Item",
   "link_type": "DocType",
   "onboard": 0,
   "type": "Link"
  },
  {
   "hidden": 0,
   "is_query_report": 0,
   "label": "Tool Kit",
   "link_count": 0,
   "link_to": "Dormitory Tool Kit",
   "link_type": "DocType",
   "onboard": 0,
   "type": "Link"
  },
  {
   "hidden": 0,
   "is_query_report": 0,
   "label": "Inspection Parameter",
   "link_count": 0,
   "link_to": "Dormitory Inspection Parameter",
   "link_type": "DocType",
   "onboard": 0,
   "type": "Link"
  }
 ],
 "modified": "2024-09-18 08:28:21.608559",
 "modified_by": "Administrator",
 "module": "Dormitory",
 "name": "Dormitory",
 "number_cards": [],
 "parent_page": "",
 "public": 1,
 "quick_lists": [],
 "roles": [],
 "sequence_id": 25.1,
 "shortcuts": [],
 "title": "Dormitory"
}