[
 {
  "docstatus": 0,
  "doctype": "Workflow State",
  "icon": "question-sign",
  "modified": "2024-01-08 12:17:43.243533",
  "name": "Pending",
  "style": "",
  "workflow_state_name": "Pending"
 },
 {
  "docstatus": 0,
  "doctype": "Workflow State",
  "icon": "ok-sign",
  "modified": "2024-01-08 12:17:43.250666",
  "name": "Approved",
  "style": "Success",
  "workflow_state_name": "Approved"
 },
 {
  "docstatus": 0,
  "doctype": "Workflow State",
  "icon": "remove",
  "modified": "2024-01-08 12:17:43.261564",
  "name": "Rejected",
  "style": "Danger",
  "workflow_state_name": "Rejected"
 },
 {
  "docstatus": 0,
  "doctype": "Workflow State",
  "icon": "",
  "modified": "2024-12-16 10:54:29.265751",
  "name": "Validated",
  "style": "",
  "workflow_state_name": "Validated"
 },
 {
  "docstatus": 0,
  "doctype": "Workflow State",
  "icon": "",
  "modified": "2024-12-16 10:54:46.040424",
  "name": "Reviewed",
  "style": "",
  "workflow_state_name": "Reviewed"
 },
 {
  "docstatus": 0,
  "doctype": "Workflow State",
  "icon": "",
  "modified": "2024-12-16 10:55:00.486989",
  "name": "Evaluated",
  "style": "",
  "workflow_state_name": "Evaluated"
 }
]