{
 "actions": [],
 "allow_rename": 1,
 "creation": "2024-01-24 01:58:29.503305",
 "default_view": "List",
 "doctype": "DocType",
 "editable_grid": 1,
 "engine": "InnoDB",
 "field_order": [
  "she_observation_tools_id",
  "company_id",
  "employee_id",
  "she_site_id",
  "she_location_id",
  "she_detail_location_id",
  "she_area_pja_bc_id",
  "she_area_pja_work_partners_id",
  "she_nonconformity_id",
  "she_sub_nonconformity_id",
  "she_quick_action_id"
 ],
 "fields": [
  {
   "fieldname": "she_observation_tools_id",
   "fieldtype": "Link",
   "label": "Observation Tools",
   "options": "SHE Observation Tools"
  },
  {
   "fieldname": "company_id",
   "fieldtype": "Link",
   "in_list_view": 1,
   "label": "Company",
   "options": "Company",
   "print_hide": 1,
   "reqd": 1
  },
  {
   "fieldname": "employee_id",
   "fieldtype": "Link",
   "in_list_view": 1,
   "label": "PIC Area",
   "options": "Employee",
   "reqd": 1
  },
  {
   "fieldname": "she_site_id",
   "fieldtype": "Link",
   "label": "Site",
   "options": "SHE Site"
  },
  {
   "fieldname": "she_location_id",
   "fieldtype": "Link",
   "label": "Location",
   "options": "SHE Location"
  },
  {
   "fieldname": "she_detail_location_id",
   "fieldtype": "Link",
   "label": "Detail Location",
   "options": "SHE Detail Location"
  },
  {
   "fieldname": "she_area_pja_bc_id",
   "fieldtype": "Link",
   "label": "Area PJA BC",
   "options": "SHE Area PJA BC"
  },
  {
   "fieldname": "she_area_pja_work_partners_id",
   "fieldtype": "Link",
   "label": "Area PJA Work Partners",
   "options": "SHE Area PJA Work Partners"
  },
  {
   "fieldname": "she_nonconformity_id",
   "fieldtype": "Link",
   "label": "Nonconformity",
   "options": "SHE Nonconformity"
  },
  {
   "fieldname": "she_sub_nonconformity_id",
   "fieldtype": "Link",
   "label": "Sub Nonconformity",
   "options": "SHE Sub Nonconformity"
  },
  {
   "fieldname": "she_quick_action_id",
   "fieldtype": "Data",
   "label": "Quick Action",
   "options": "SHE Quick Action"
  }
 ],
 "index_web_pages_for_search": 1,
 "links": [],
 "modified": "2024-01-24 01:58:39.358072",
 "modified_by": "Administrator",
 "module": "SHE",
 "name": "SHE Hazard",
 "owner": "Administrator",
 "permissions": [
  {
   "create": 1,
   "delete": 1,
   "email": 1,
   "export": 1,
   "print": 1,
   "read": 1,
   "report": 1,
   "role": "System Manager",
   "share": 1,
   "write": 1
  }
 ],
 "sort_field": "modified",
 "sort_order": "DESC",
 "states": [],
 "track_changes": 1
}