{
 "content": null,
 "creation": "2024-05-14 09:27:29.738480",
 "docstatus": 0,
 "doctype": "Page",
 "idx": 0,
 "modified": "2024-05-14 09:27:29.738480",
 "modified_by": "Administrator",
 "module": "SHE",
 "name": "she-insp-report",
 "owner": "Administrator",
 "page_name": "she-insp-report",
 "roles": [],
 "script": null,
 "standard": "Yes",
 "style": null,
 "system_page": 0,
 "title": "Inspection Report"
}