{
 "actions": [],
 "allow_rename": 1,
 "creation": "2024-01-26 07:38:03.673639",
 "default_view": "List",
 "doctype": "DocType",
 "editable_grid": 1,
 "engine": "InnoDB",
 "field_order": [
  "hazard_code",
  "hazard_name",
  "description",
  "action"
 ],
 "fields": [
  {
   "fieldname": "hazard_code",
   "fieldtype": "Data",
   "in_list_view": 1,
   "label": "Hazard Code",
   "reqd": 1,
   "unique": 1
  },
  {
   "fieldname": "hazard_name",
   "fieldtype": "Data",
   "in_list_view": 1,
   "label": "Hazard Name",
   "reqd": 1
  },
  {
   "fieldname": "description",
   "fieldtype": "Data",
   "label": "Description"
  },
  {
   "fieldname": "action",
   "fieldtype": "Data",
   "label": "Action",
   "reqd": 1
  }
 ],
 "index_web_pages_for_search": 1,
 "links": [],
 "modified": "2024-05-20 14:40:30.521842",
 "modified_by": "Administrator",
 "module": "SHE",
 "name": "SHE Hazard Category",
 "owner": "Administrator",
 "permissions": [
  {
   "create": 1,
   "delete": 1,
   "email": 1,
   "export": 1,
   "print": 1,
   "read": 1,
   "report": 1,
   "role": "System Manager",
   "share": 1,
   "write": 1
  }
 ],
 "quick_entry": 1,
 "show_title_field_in_link": 1,
 "sort_field": "modified",
 "sort_order": "DESC",
 "states": [],
 "title_field": "hazard_code",
 "track_changes": 1
}