<svg width="30" height="30" viewBox="0 0 30 30" fill="none" xmlns="http://www.w3.org/2000/svg">
<g clip-path="url(#clip0)">
<path d="M24.9819 24.2159C24.308 23.1579 23.2968 22.0028 21.7993 21.0864C24.741 18.9716 26.6602 15.5244 26.6602 11.6378C26.6602 5.2207 21.4294 0 15 0C8.57058 0 3.33985 5.2207 3.33985 11.6378C3.33985 15.5244 5.25898 18.9716 8.20062 21.0864C6.70314 22.0028 5.69198 23.1579 5.01804 24.2159C3.50064 26.5979 3.34706 28.9703 3.34132 29.0702C3.32732 29.3118 3.41345 29.5484 3.5795 29.7243C3.74562 29.9003 3.97683 30 4.21876 30H25.7813C26.0232 30 26.2544 29.9003 26.4205 29.7243C26.5865 29.5484 26.6727 29.3117 26.6586 29.0702C26.6529 28.9703 26.4994 26.5979 24.9819 24.2159ZM15 1.75781C20.4602 1.75781 24.9024 6.18996 24.9024 11.6378C24.9024 17.0857 20.4602 21.5179 15 21.5179C9.53983 21.5179 5.09767 17.0857 5.09767 11.6378C5.09767 6.18996 9.53983 1.75781 15 1.75781ZM5.24503 28.2422C5.41747 27.4535 5.78187 26.2683 6.5386 25.1013C7.3936 23.7829 8.53454 22.79 9.9514 22.1273C11.4798 22.863 13.1925 23.2757 15 23.2757C16.8075 23.2757 18.5202 22.863 20.0486 22.1273C21.4655 22.79 22.6064 23.7829 23.4614 25.1013C24.2183 26.2685 24.5827 27.454 24.7551 28.2422H5.24503Z" fill="#4AC985"/>
<path d="M14.998 17.2236C18.0835 17.2236 20.5938 14.7178 20.5938 11.6377C20.5938 8.55758 18.0835 6.05176 14.998 6.05176C11.9126 6.05176 9.40234 8.55764 9.40234 11.6377C9.40234 14.7177 11.9126 17.2236 14.998 17.2236ZM14.998 7.80957C17.1143 7.80957 18.8359 9.52689 18.8359 11.6377C18.8359 13.7485 17.1143 15.4658 14.998 15.4658C12.8818 15.4658 11.1602 13.7485 11.1602 11.6377C11.1602 9.52684 12.8818 7.80957 14.998 7.80957Z" fill="#4AC985"/>
<path d="M15.0007 12.5166C15.4605 12.5166 15.9009 12.1124 15.8796 11.6377C15.8583 11.1615 15.4935 10.7588 15.0007 10.7588C14.541 10.7588 14.1006 11.163 14.1218 11.6377C14.1432 12.1139 14.508 12.5166 15.0007 12.5166Z" fill="#DD4D39"/>
</g>
<defs>
<clipPath id="clip0">
<rect width="30" height="30" fill="white"/>
</clipPath>
</defs>
</svg>
