<svg width="96" height="96" viewBox="0 0 96 96" fill="none" xmlns="http://www.w3.org/2000/svg">
<g clip-path="url(#clip0)">
<path d="M92.6996 31.4414H91.7833L83.1919 8.31044C82.4396 6.28525 80.4829 4.92456 78.3225 4.92456H17.6773C15.5171 4.92456 13.5602 6.28525 12.8079 8.31044L4.21669 31.4414H3.30037C1.4805 31.4414 0 32.9219 0 34.7417V37.3934C0 39.2132 1.4805 40.6938 3.30037 40.6938H3.78825V71.5169C3.78825 72.2935 4.41769 72.9231 5.1945 72.9231C5.97131 72.9231 6.60075 72.2935 6.60075 71.5169V40.6938H28.6808C29.9164 40.6938 31.0781 40.2126 31.9521 39.3387L48 23.2904L64.0483 39.3387C64.9221 40.2124 66.0838 40.6936 67.3194 40.6936H89.3994V44.4218C89.3994 45.1984 90.0289 45.8281 90.8057 45.8281C91.5825 45.8281 92.2119 45.1984 92.2119 44.4218V40.6936H92.6998C94.5195 40.6936 96.0002 39.2131 96.0002 37.3932V34.7416C96 32.9219 94.5195 31.4414 92.6996 31.4414ZM15.4444 9.28956C15.7894 8.36087 16.6868 7.73706 17.6773 7.73706H78.3225C79.3131 7.73706 80.2104 8.36106 80.5554 9.28956L88.7831 31.4414H69.2357L51.2711 13.477C50.3974 12.6032 49.2358 12.1219 48 12.1219C46.7642 12.1219 45.6026 12.6031 44.7289 13.477L26.7643 31.4414H7.21669L15.4444 9.28956ZM93.1875 37.3934C93.1875 37.6624 92.9687 37.8813 92.6996 37.8813H67.3194C66.8349 37.8813 66.3793 37.6926 66.0369 37.3501L48.9943 20.3074C48.7305 20.0436 48.3729 19.8955 47.9998 19.8955C47.6267 19.8955 47.2693 20.0436 47.0053 20.3074L29.9629 37.3501C29.6203 37.6926 29.1647 37.8813 28.6802 37.8813H3.30037C3.03131 37.8813 2.8125 37.6624 2.8125 37.3934V34.7417C2.8125 34.4727 3.03131 34.2539 3.30037 34.2539H27.3469C27.7198 34.2539 28.0774 34.1058 28.3414 33.8419L46.7179 15.4656C47.0602 15.1231 47.5157 14.9344 48.0002 14.9344C48.4847 14.9344 48.9401 15.1231 49.2825 15.4656L67.659 33.8419C67.9228 34.1058 68.2804 34.2539 68.6535 34.2539H92.7C92.9691 34.2539 93.1879 34.4727 93.1879 34.7417V37.3934H93.1875Z" fill="#43C093"/>
<path d="M84.5555 79.7112C85.3324 79.7112 85.9618 79.0815 85.9618 78.3049V53.3035C85.9618 52.5268 85.3324 51.8972 84.5555 51.8972H65.6149C64.8381 51.8972 64.2086 52.5268 64.2086 53.3035V78.3049C64.2086 79.0815 64.8381 79.7112 65.6149 79.7112H84.5555ZM83.1493 70.8377H76.4914V64.18H83.1493V70.8377ZM73.6789 70.8377H67.0211V64.18H73.6789V70.8377ZM83.1493 76.8987H67.0211V73.6502H83.1493V76.8987ZM83.1493 61.3673H76.4914V54.7095H83.1493V61.3673ZM73.6789 54.7097V61.3675H67.0211V54.7097H73.6789Z" fill="#43C093"/>
<path d="M30.3851 79.7112C31.162 79.7112 31.7914 79.0815 31.7914 78.3049V53.3035C31.7914 52.5268 31.162 51.8972 30.3851 51.8972H11.4445C10.6676 51.8972 10.0382 52.5268 10.0382 53.3035V78.3049C10.0382 79.0815 10.6676 79.7112 11.4445 79.7112H30.3851ZM28.9789 70.8377H22.3211V64.18H28.9789V70.8377ZM19.5086 70.8377H12.8507V64.18H19.5086V70.8377ZM28.9789 76.8987H12.8507V73.6502H28.9789V76.8987ZM28.9789 61.3673H22.3211V54.7095H28.9789V61.3673ZM19.5086 54.7097V61.3675H12.8507V54.7097H19.5086Z" fill="#43C093"/>
<path d="M52.5459 57.9583H43.4543C42.6775 57.9583 42.0481 58.5879 42.0481 59.3645V65.4254C42.0481 66.2021 42.6775 66.8317 43.4543 66.8317H52.5459C53.3227 66.8317 53.9521 66.2021 53.9521 65.4254V59.3645C53.9521 58.5879 53.3227 57.9583 52.5459 57.9583ZM51.1396 64.0192H44.8606V60.7708H51.1396V64.0192Z" fill="#43C093"/>
<path d="M55.4674 40.2344C55.4674 36.1171 52.1178 32.7672 48.0003 32.7672C43.8828 32.7672 40.5331 36.1171 40.5331 40.2344C40.5331 44.3517 43.8828 47.7018 48.0003 47.7018C52.1178 47.7018 55.4674 44.3519 55.4674 40.2344ZM43.3456 40.2344C43.3456 37.6679 45.4338 35.5797 48.0003 35.5797C50.5668 35.5797 52.6549 37.6679 52.6549 40.2344C52.6549 42.8009 50.5668 44.8893 48.0003 44.8893C45.4338 44.8893 43.3456 42.8011 43.3456 40.2344Z" fill="#CC5748"/>
<path d="M94.5938 81.8231H92.2119V51C92.2119 50.2234 91.5825 49.5938 90.8057 49.5938C90.0289 49.5938 89.3994 50.2234 89.3994 51V81.8231H60.0129V53.3034C60.0129 52.5268 59.3835 51.8972 58.6067 51.8972H37.3933C36.6165 51.8972 35.9871 52.5268 35.9871 53.3034V81.8231H6.60056V78.0949C6.60056 77.3183 5.97112 76.6886 5.19431 76.6886C4.4175 76.6886 3.78806 77.3183 3.78806 78.0949V81.8231H1.40625C0.629437 81.8231 0 82.4528 0 83.2294V89.6693C0 90.4459 0.629437 91.0755 1.40625 91.0755H94.5938C95.3706 91.0755 96 90.4459 96 89.6693V83.2294C96 82.4528 95.3706 81.8231 94.5938 81.8231ZM38.7996 71.5667H40.8028C41.5796 71.5667 42.2091 70.9371 42.2091 70.1604C42.2091 69.3838 41.5796 68.7542 40.8028 68.7542H38.7996V54.7097H57.2006V81.8231H38.7996V71.5667ZM93.1875 88.263H2.8125V84.6356H93.1875V88.263Z" fill="#43C093"/>
</g>
<defs>
<clipPath id="clip0">
<rect width="96" height="96" fill="white"/>
</clipPath>
</defs>
</svg>
