<svg width="27" height="8" viewBox="0 0 27 8" fill="none" xmlns="http://www.w3.org/2000/svg">
<path d="M26.3536 4.35355C26.5488 4.15829 26.5488 3.84171 26.3536 3.64645L23.1716 0.464466C22.9763 0.269204 22.6597 0.269204 22.4645 0.464466C22.2692 0.659728 22.2692 0.976311 22.4645 1.17157L25.2929 4L22.4645 6.82843C22.2692 7.02369 22.2692 7.34027 22.4645 7.53553C22.6597 7.7308 22.9763 7.7308 23.1716 7.53553L26.3536 4.35355ZM0 4.5H26V3.5H0V4.5Z" fill="#CC5748"/>
</svg>
