<svg width="12" height="19" viewBox="0 0 12 19" fill="none" xmlns="http://www.w3.org/2000/svg">
<path d="M5.46967 18.5303C5.76256 18.8232 6.23744 18.8232 6.53033 18.5303L11.3033 13.7574C11.5962 13.4645 11.5962 12.9896 11.3033 12.6967C11.0104 12.4038 10.5355 12.4038 10.2426 12.6967L6 16.9393L1.75736 12.6967C1.46447 12.4038 0.989592 12.4038 0.696699 12.6967C0.403805 12.9896 0.403805 13.4645 0.696699 13.7574L5.46967 18.5303ZM5.25 -3.27835e-08L5.25 18L6.75 18L6.75 3.27835e-08L5.25 -3.27835e-08Z" fill="#4AC985"/>
</svg>
