<svg width="20" height="20" viewBox="0 0 20 20" fill="none" xmlns="http://www.w3.org/2000/svg">
<path d="M10.5785 12.527C10.3896 12.645 10.1771 12.6923 9.98819 12.6923C9.79929 12.6923 9.58678 12.645 9.39787 12.527L0 6.78906V14.416C0 16.0453 1.32231 17.3676 2.95159 17.3676H17.0484C18.6777 17.3676 20 16.0453 20 14.416V6.78906L10.5785 12.527Z" fill="#4C4855"/>
<path d="M17.0477 2.63281H2.95089C1.55774 2.63281 0.377103 3.62455 0.09375 4.94686L10.0111 10.9917L19.9048 4.94686C19.6215 3.62455 18.4409 2.63281 17.0477 2.63281Z" fill="#4C4855"/>
</svg>
