<svg width="45" height="45" viewBox="0 0 45 45" fill="none" xmlns="http://www.w3.org/2000/svg">
<path d="M0 10C0 4.47715 4.47715 0 10 0H45V35C45 40.5228 40.5228 45 35 45H0V10Z" fill="#43C093"/>
<line x1="14" y1="19" x2="32" y2="19" stroke="#F9F4D7" stroke-width="2" stroke-linecap="round"/>
<line x1="14" y1="27" x2="32" y2="27" stroke="#F9F4D7" stroke-width="2" stroke-linecap="round"/>
</svg>
