<svg width="72" height="72" viewBox="0 0 72 72" fill="none" xmlns="http://www.w3.org/2000/svg">
<path d="M36 0L67.1769 54H4.82309L36 0Z" fill="#FFE7E7"/>
<g clip-path="url(#clip0)">
<path d="M36.2357 13.6788C31.4743 13.6364 26.8857 15.4604 23.4529 18.76C20.02 22.0597 18.016 26.5725 17.87 31.3318C17.7552 35.2532 18.9252 39.1046 21.2018 42.2995C23.6093 45.7438 24.8802 49.8543 24.837 54.0563V58.8988C24.8369 59.0266 24.8648 59.1528 24.9186 59.2687C24.9723 59.3846 25.0508 59.4873 25.1484 59.5698L28.3446 62.2733V65.5705C28.3454 66.2527 28.6169 66.9068 29.0994 67.3891C29.582 67.8714 30.2362 68.1425 30.9185 68.1429H41.0827C41.7649 68.1422 42.4189 67.8709 42.9013 67.3886C43.3837 66.9062 43.655 66.2521 43.6556 65.57V62.2728L46.8518 59.5693C46.9494 59.4868 47.0279 59.3841 47.0816 59.2682C47.1354 59.1523 47.1633 59.0261 47.1632 58.8983V54.0543C47.1642 49.7914 48.4734 45.6315 50.9139 42.1363C52.7857 39.4313 53.8866 36.2681 54.0988 32.9855C54.311 29.7028 53.6265 26.4242 52.1186 23.5007C50.6106 20.5772 48.336 18.1188 45.5382 16.3887C42.7405 14.6585 39.5249 13.7218 36.2357 13.6788ZM42.4553 60.9891H29.5479L27.0096 58.8426H44.9936L42.4553 60.9891ZM45.4059 57.0848H26.5953V54.9342H45.4059V57.0848ZM41.8983 65.5725C41.8981 65.7886 41.8121 65.9958 41.6593 66.1486C41.5065 66.3014 41.2993 66.3873 41.0832 66.3876H30.9185C30.7024 66.3873 30.4952 66.3014 30.3424 66.1486C30.1896 65.9958 30.1037 65.7886 30.1034 65.5725V62.7469H41.8978L41.8983 65.5725ZM49.4695 41.1349C46.9962 44.6788 45.5918 48.858 45.423 53.1764H26.5792C26.4581 48.9105 25.0866 44.7742 22.6352 41.281C20.5808 38.3963 19.5248 34.9195 19.6278 31.3795C19.7565 27.1168 21.5366 23.0709 24.5922 20.0959C27.6479 17.1209 31.74 15.4497 36.0046 15.4351H36.213C39.1836 15.4736 42.0877 16.3191 44.6146 17.8813C47.1414 19.4434 49.1959 21.6634 50.558 24.3034C51.9202 26.9435 52.5387 29.9043 52.3474 32.8689C52.1561 35.8335 51.1621 38.6902 49.472 41.1334L49.4695 41.1349Z" fill="black"/>
<path d="M45.6654 31.8225C45.4246 30.8313 45.0335 29.8828 44.5057 29.01L45.6578 27.8574C45.7395 27.7758 45.8043 27.6789 45.8485 27.5723C45.8927 27.4656 45.9155 27.3513 45.9155 27.2359C45.9155 27.1204 45.8927 27.0061 45.8485 26.8995C45.8043 26.7928 45.7395 26.6959 45.6578 26.6144L43.566 24.5226C43.4845 24.4409 43.3876 24.3761 43.2809 24.3319C43.1743 24.2877 43.06 24.2649 42.9445 24.2649C42.8291 24.2649 42.7148 24.2877 42.6081 24.3319C42.5015 24.3761 42.4046 24.4409 42.323 24.5226L41.1774 25.6682C40.3041 25.1357 39.3542 24.7405 38.3609 24.4964V22.8798C38.3609 22.6467 38.2683 22.4231 38.1035 22.2583C37.9387 22.0935 37.7151 22.0009 37.482 22.0009H34.5213C34.2882 22.0009 34.0647 22.0935 33.8999 22.2583C33.735 22.4231 33.6424 22.6467 33.6424 22.8798V24.4964C32.6483 24.7403 31.6975 25.1355 30.8234 25.6682L29.6773 24.5221C29.5957 24.4404 29.4989 24.3756 29.3922 24.3314C29.2856 24.2872 29.1712 24.2644 29.0558 24.2644C28.9404 24.2644 28.826 24.2872 28.7194 24.3314C28.6128 24.3756 28.5159 24.4404 28.4343 24.5221L26.3425 26.6139C26.2608 26.6954 26.196 26.7923 26.1518 26.899C26.1076 27.0056 26.0848 27.1199 26.0848 27.2354C26.0848 27.3508 26.1076 27.4651 26.1518 27.5718C26.196 27.6784 26.2608 27.7753 26.3425 27.8569L27.4946 29.0095C26.9668 29.8823 26.5757 30.8308 26.335 31.822H24.7002C24.4671 31.822 24.2435 31.9146 24.0787 32.0794C23.9139 32.2443 23.8213 32.4678 23.8213 32.7009V35.6591C23.8213 35.8922 23.9139 36.1157 24.0787 36.2805C24.2435 36.4454 24.4671 36.538 24.7002 36.538H26.349C26.593 37.5231 26.986 38.4653 27.5142 39.3319L26.3425 40.5036C26.2608 40.5852 26.196 40.6821 26.1518 40.7887C26.1076 40.8953 26.0848 41.0097 26.0848 41.1251C26.0848 41.2405 26.1076 41.3549 26.1518 41.4615C26.196 41.5681 26.2608 41.665 26.3425 41.7466L28.4343 43.8384C28.6022 43.9974 28.8246 44.0859 29.0558 44.0859C29.287 44.0859 29.5094 43.9974 29.6773 43.8384L30.8556 42.6602C31.72 43.1829 32.6589 43.5713 33.6399 43.8123V45.4802C33.6399 45.7133 33.7325 45.9369 33.8974 46.1017C34.0622 46.2665 34.2857 46.3591 34.5188 46.3591H37.4775C37.7106 46.3591 37.9341 46.2665 38.099 46.1017C38.2638 45.9369 38.3564 45.7133 38.3564 45.4802V43.8123C39.3383 43.5716 40.278 43.1831 41.1433 42.6602L42.3215 43.8384C42.4031 43.9201 42.5 43.9849 42.6066 44.0291C42.7133 44.0733 42.8276 44.0961 42.943 44.0961C43.0585 44.0961 43.1728 44.0733 43.2794 44.0291C43.3861 43.9849 43.483 43.9201 43.5645 43.8384L45.6563 41.7466C45.738 41.665 45.8028 41.5681 45.847 41.4615C45.8912 41.3549 45.914 41.2405 45.914 41.1251C45.914 41.0097 45.8912 40.8953 45.847 40.7887C45.8028 40.6821 45.738 40.5852 45.6563 40.5036L44.4881 39.3319C45.0163 38.4654 45.4093 37.5234 45.6533 36.5385H47.3006C47.5337 36.5385 47.7573 36.4459 47.9221 36.281C48.0869 36.1162 48.1795 35.8927 48.1795 35.6596V32.7014C48.1795 32.4683 48.0869 32.2448 47.9221 32.0799C47.7573 31.9151 47.5337 31.8225 47.3006 31.8225H45.6654ZM46.4217 34.7807H44.9371C44.7292 34.7805 44.5279 34.8542 44.3692 34.9886C44.2104 35.123 44.1045 35.3093 44.0703 35.5144C43.8615 36.7468 43.3734 37.915 42.6434 38.9296C42.5205 39.0992 42.4622 39.3071 42.4791 39.5159C42.4959 39.7246 42.5868 39.9205 42.7354 40.0682L43.7941 41.1228L42.9453 41.9716L41.8831 40.9089C41.736 40.7617 41.5414 40.6715 41.334 40.6543C41.1266 40.6371 40.9199 40.694 40.7505 40.815C39.7344 41.5393 38.5664 42.022 37.3354 42.2262C37.1301 42.2609 36.9438 42.3673 36.8097 42.5265C36.6755 42.6857 36.6023 42.8874 36.6031 43.0956V44.6023H35.3977V43.0956C35.3981 42.8875 35.3245 42.686 35.1901 42.527C35.0557 42.3681 34.8693 42.262 34.664 42.2278C33.433 42.0235 32.2649 41.5408 31.2488 40.8165C31.0795 40.6955 30.8727 40.6386 30.6653 40.6558C30.4579 40.673 30.2634 40.7632 30.1163 40.9104L29.054 41.9731L28.2053 41.1243L29.2655 40.0682C29.4132 39.9207 29.5037 39.7254 29.5205 39.5173C29.5373 39.3092 29.4795 39.1019 29.3574 38.9326C28.6274 37.918 28.1394 36.7498 27.9306 35.5174C27.8963 35.3123 27.7904 35.126 27.6317 34.9916C27.4729 34.8572 27.2717 34.7836 27.0637 34.7837H25.5791V33.5833H27.0542C27.263 33.5834 27.465 33.5091 27.6241 33.3737C27.7831 33.2383 27.8887 33.0507 27.922 32.8445C28.1242 31.6056 28.6084 30.4298 29.3373 29.4078C29.4583 29.2384 29.5152 29.0317 29.498 28.8243C29.4808 28.6169 29.3906 28.4223 29.2434 28.2752L28.2068 27.2386L29.0556 26.3899L30.0881 27.4225C30.2357 27.5701 30.4309 27.6605 30.639 27.6773C30.8471 27.6941 31.0543 27.6364 31.2237 27.5144C32.2449 26.7792 33.4221 26.2897 34.6635 26.084C34.8693 26.0497 35.0563 25.9432 35.1908 25.7836C35.3253 25.6241 35.3987 25.4218 35.3977 25.2131V23.7567H36.6031V25.2131C36.6031 25.4216 36.6772 25.6233 36.8121 25.7822C36.9471 25.941 37.1342 26.0468 37.3399 26.0805C38.5805 26.287 39.7568 26.777 40.7771 27.5123C40.9464 27.6346 41.1537 27.6925 41.3619 27.6756C41.57 27.6588 41.7653 27.5683 41.9127 27.4204L42.9453 26.3879L43.7941 27.2366L42.7575 28.2732C42.6103 28.4203 42.52 28.6149 42.5028 28.8223C42.4856 29.0297 42.5426 29.2364 42.6635 29.4058C43.3924 30.4278 43.8766 31.6036 44.0788 32.8425C44.1121 33.0487 44.2177 33.2363 44.3768 33.3717C44.5358 33.507 44.7378 33.5814 44.9467 33.5813H46.4217V34.7807Z" fill="black"/>
<path d="M36.0007 27.9769C34.7789 27.9769 33.5846 28.3392 32.5687 29.018C31.5528 29.6968 30.761 30.6616 30.2935 31.7904C29.8259 32.9192 29.7036 34.1612 29.9419 35.3595C30.1803 36.5578 30.7686 37.6586 31.6326 38.5225C32.4965 39.3864 33.5972 39.9748 34.7955 40.2131C35.9939 40.4515 37.2359 40.3292 38.3647 39.8616C39.4935 39.394 40.4583 38.6023 41.1371 37.5864C41.8159 36.5705 42.1782 35.3762 42.1782 34.1544C42.1759 32.5167 41.5243 30.9468 40.3663 29.7888C39.2083 28.6307 37.6384 27.9792 36.0007 27.9769ZM36.0007 38.577C35.1266 38.577 34.2721 38.3178 33.5453 37.8322C32.8185 37.3466 32.252 36.6563 31.9175 35.8487C31.583 35.0411 31.4954 34.1525 31.666 33.2952C31.8365 32.4378 32.2574 31.6503 32.8755 31.0322C33.4936 30.4141 34.2811 29.9932 35.1385 29.8227C35.9958 29.6521 36.8844 29.7397 37.692 30.0742C38.4996 30.4087 39.1899 30.9752 39.6755 31.702C40.1611 32.4288 40.4204 33.2833 40.4204 34.1574C40.4188 35.3291 39.9526 36.4524 39.1241 37.281C38.2956 38.1095 37.1724 38.5758 36.0007 38.5775V38.577Z" fill="black"/>
<path d="M36 10.679C36.2331 10.679 36.4567 10.5864 36.6215 10.4216C36.7863 10.2567 36.8789 10.0332 36.8789 9.80009V4.73608C36.8789 4.50298 36.7863 4.27943 36.6215 4.1146C36.4567 3.94978 36.2331 3.85718 36 3.85718C35.7669 3.85718 35.5433 3.94978 35.3785 4.1146C35.2137 4.27943 35.1211 4.50298 35.1211 4.73608V9.80009C35.1211 10.0332 35.2137 10.2567 35.3785 10.4216C35.5433 10.5864 35.7669 10.679 36 10.679Z" fill="black"/>
<path d="M57.4858 13.2715L53.9049 16.8524C53.8233 16.934 53.7585 17.0309 53.7144 17.1375C53.6702 17.2442 53.6475 17.3585 53.6475 17.4739C53.6475 17.5893 53.6702 17.7036 53.7144 17.8103C53.7585 17.9169 53.8233 18.0138 53.9049 18.0954C53.9865 18.177 54.0834 18.2418 54.1901 18.286C54.2967 18.3301 54.411 18.3529 54.5264 18.3529C54.6418 18.3529 54.7561 18.3301 54.8628 18.286C54.9694 18.2418 55.0663 18.177 55.1479 18.0954L58.7288 14.5145C58.8105 14.4329 58.8752 14.336 58.9194 14.2293C58.9635 14.1227 58.9863 14.0084 58.9863 13.893C58.9863 13.7776 58.9635 13.6633 58.9194 13.5566C58.8752 13.45 58.8105 13.3531 58.7288 13.2715C58.6472 13.1899 58.5503 13.1251 58.4437 13.0809C58.3371 13.0368 58.2228 13.014 58.1073 13.014C57.9919 13.014 57.8776 13.0368 57.771 13.0809C57.6643 13.1251 57.5674 13.1899 57.4858 13.2715Z" fill="black"/>
<path d="M67.2642 35.1211H62.2002C61.9671 35.1211 61.7435 35.2137 61.5787 35.3785C61.4139 35.5433 61.3213 35.7669 61.3213 36C61.3213 36.2331 61.4139 36.4567 61.5787 36.6215C61.7435 36.7863 61.9671 36.8789 62.2002 36.8789H67.2642C67.4973 36.8789 67.7208 36.7863 67.8857 36.6215C68.0505 36.4567 68.1431 36.2331 68.1431 36C68.1431 35.7669 68.0505 35.5433 67.8857 35.3785C67.7208 35.2137 67.4973 35.1211 67.2642 35.1211Z" fill="black"/>
<path d="M9.80033 35.1211H4.73633C4.50323 35.1211 4.27967 35.2137 4.11485 35.3785C3.95002 35.5433 3.85742 35.7669 3.85742 36C3.85742 36.2331 3.95002 36.4567 4.11485 36.6215C4.27967 36.7863 4.50323 36.8789 4.73633 36.8789H9.80033C10.0334 36.8789 10.257 36.7863 10.4218 36.6215C10.5866 36.4567 10.6792 36.2331 10.6792 36C10.6792 35.7669 10.5866 35.5433 10.4218 35.3785C10.257 35.2137 10.0334 35.1211 9.80033 35.1211Z" fill="black"/>
<path d="M18.096 16.8524L14.5151 13.2715C14.3503 13.1066 14.1267 13.014 13.8936 13.014C13.6605 13.014 13.4369 13.1066 13.2721 13.2715C13.1073 13.4363 13.0146 13.6599 13.0146 13.893C13.0146 14.1261 13.1073 14.3497 13.2721 14.5145L16.853 18.0954C17.0178 18.2603 17.2414 18.3529 17.4745 18.3529C17.7076 18.3529 17.9312 18.2603 18.096 18.0954C18.2609 17.9306 18.3535 17.707 18.3535 17.4739C18.3535 17.2408 18.2609 17.0172 18.096 16.8524Z" fill="black"/>
</g>
<defs>
<clipPath id="clip0">
<rect width="64.2857" height="64.2857" fill="white" transform="translate(3.85742 3.85718)"/>
</clipPath>
</defs>
</svg>
