<svg width="112" height="112" viewBox="0 0 112 112" fill="none" xmlns="http://www.w3.org/2000/svg">
<path d="M56 0L104.497 84H7.50258L56 0Z" fill="#FFE7E7"/>
<g clip-path="url(#clip0)">
<path d="M75.272 36.3152H70.8357C70.5648 35.4554 70.2202 34.623 69.8044 33.8244L72.9411 30.6875C73.3331 30.2955 73.5489 29.7742 73.5489 29.2197C73.5489 28.665 73.3331 28.1437 72.9411 27.7517L69.2495 24.06C68.4402 23.2512 67.1234 23.2508 66.3138 24.0601L63.1769 27.1971C62.3783 26.7812 61.5456 26.4365 60.6861 26.1658V21.7293C60.6859 20.5848 59.7546 19.6533 58.6099 19.6533H53.389C52.2445 19.6533 51.3132 20.5846 51.3132 21.7293V26.1658C50.4535 26.4367 49.6211 26.7812 48.8222 27.1971L45.6851 24.06C44.8758 23.251 43.559 23.2512 42.7496 24.0601L39.0582 27.7515C38.666 28.1435 38.45 28.6648 38.45 29.2195C38.45 29.774 38.666 30.2953 39.058 30.6873L42.1949 33.8242C41.7791 34.6228 41.4344 35.4554 41.1637 36.315H36.7271C35.5826 36.315 34.6514 37.2463 34.6514 38.391V43.6119C34.6514 44.7564 35.5826 45.6876 36.7271 45.6876H41.1637C41.4346 46.5472 41.7791 47.38 42.1949 48.1785L39.058 51.3154C38.2486 52.1247 38.2486 53.4417 39.058 54.2511L42.7496 57.9427C43.559 58.7523 44.8761 58.7521 45.6853 57.9427L48.8222 54.8058C49.6209 55.2216 50.4537 55.5663 51.3132 55.837V60.2735C51.3132 61.4181 52.2445 62.3493 53.389 62.3493H58.6099C59.7544 62.3493 60.6859 61.4181 60.6859 60.2735V55.837C61.5452 55.5663 62.3781 55.2216 63.1767 54.8058L66.3136 57.9427C67.1232 58.7523 68.4402 58.7521 69.2495 57.9427L72.9409 54.2511C73.3329 53.8591 73.5487 53.3378 73.5487 52.7833C73.5487 52.2288 73.3329 51.7076 72.9409 51.3154L69.804 48.1785C70.2198 47.3798 70.5646 46.5472 70.8353 45.6876H75.2718C76.4163 45.6876 77.3478 44.7564 77.3478 43.6119V38.391C77.3479 37.2465 76.4165 36.3152 75.272 36.3152ZM74.4185 42.758H69.7195C69.039 42.758 68.4482 43.2265 68.2931 43.8892C67.9808 45.2242 67.4566 46.4904 66.7349 47.6523C66.3757 48.2304 66.4622 48.9796 66.9433 49.4611L70.2657 52.7835L67.7818 55.2675L64.4593 51.945C63.9781 51.4638 63.2288 51.3771 62.6503 51.7365C61.4882 52.4581 60.222 52.9824 58.8874 53.2949C58.2248 53.4497 57.7562 54.0406 57.7562 54.7212V59.4204H54.2435V54.7212C54.2435 54.0408 53.775 53.4499 53.1123 53.2949C51.7777 52.9827 50.5115 52.4585 49.3492 51.7365C48.7713 51.3779 48.0218 51.4638 47.5404 51.945L44.2179 55.2675L41.734 52.7835L45.0564 49.4611C45.5377 48.9798 45.624 48.2306 45.265 47.6523C44.5433 46.4902 44.0191 45.224 43.7068 43.8892C43.5519 43.2265 42.9609 42.758 42.2804 42.758H37.5814V39.2453H42.2804C42.9609 39.2453 43.5517 38.7767 43.7068 38.114C44.0191 36.7793 44.5433 35.5131 45.265 34.3509C45.624 33.7728 45.5377 33.0236 45.0564 32.5422L41.734 29.2197L44.2179 26.7357L47.5404 30.0582C48.0213 30.5394 48.7709 30.626 49.3492 30.2668C50.5111 29.5451 51.7773 29.0209 53.1123 28.7086C53.775 28.5537 54.2435 27.9629 54.2435 27.2822V22.583H57.7562V27.2822C57.7562 27.9627 58.2248 28.5535 58.8874 28.7086C60.2222 29.0209 61.4882 29.5451 62.6505 30.2668C63.2283 30.6256 63.9779 30.539 64.4593 30.0582L67.7818 26.7357L70.2657 29.2197L66.9433 32.5422C66.462 33.0234 66.3757 33.7726 66.7349 34.3509C67.4564 35.5127 67.9806 36.7789 68.2931 38.114C68.4482 38.7767 69.0388 39.2453 69.7195 39.2453H74.4185V42.758Z" fill="black"/>
<path d="M56 33.1538C51.6726 33.1538 48.1523 36.6743 48.1523 41.0015C48.1523 45.3286 51.6728 48.8491 56 48.8491C60.3271 48.8491 63.8476 45.3286 63.8476 41.0015C63.8476 36.6743 60.3273 33.1538 56 33.1538ZM56 45.9194C53.2883 45.9194 51.082 43.7132 51.082 41.0015C51.082 38.2897 53.2883 36.0835 56 36.0835C58.7117 36.0835 60.9179 38.2897 60.9179 41.0015C60.9179 43.7132 58.7117 45.9194 56 45.9194Z" fill="black"/>
<path d="M22.3226 39.5366H17.4629C16.6539 39.5366 15.998 40.1925 15.998 41.0015C15.998 41.8104 16.6539 42.4663 17.4629 42.4663H22.3226C23.1316 42.4663 23.7875 41.8104 23.7875 41.0015C23.7875 40.1925 23.1316 39.5366 22.3226 39.5366Z" fill="black"/>
<path d="M94.5365 39.5366H89.6768C88.8676 39.5366 88.2119 40.1925 88.2119 41.0015C88.2119 41.8104 88.8676 42.4663 89.6768 42.4663H94.5365C95.3457 42.4663 96.0013 41.8104 96.0013 41.0015C96.0013 40.1925 95.3455 39.5366 94.5365 39.5366Z" fill="black"/>
<path d="M33.2222 63.7792C32.6503 63.2071 31.7228 63.2071 31.1505 63.7792L27.7142 67.2155C27.1421 67.7875 27.1421 68.7151 27.7142 69.2872C28.2863 69.8592 29.2138 69.8592 29.7859 69.2872L33.2222 65.8508C33.7943 65.2788 33.7943 64.3512 33.2222 63.7792Z" fill="black"/>
<path d="M84.2859 12.7162C83.7136 12.1441 82.7863 12.1441 82.214 12.7162L78.7777 16.1525C78.2056 16.7245 78.2056 17.6521 78.7777 18.2242C79.35 18.7962 80.2773 18.796 80.8496 18.2242L84.2859 14.7878C84.858 14.2156 84.858 13.288 84.2859 12.7162Z" fill="black"/>
<path d="M56 1C55.1908 1 54.5352 1.65586 54.5352 2.46484V7.3246C54.5352 8.13358 55.1908 8.78944 56 8.78944C56.8092 8.78944 57.4648 8.13358 57.4648 7.3246V2.46484C57.4648 1.65586 56.8092 1 56 1Z" fill="black"/>
<path d="M84.2859 67.2155L80.8496 63.7792C80.2773 63.2071 79.35 63.2071 78.7777 63.7792C78.2056 64.3512 78.2056 65.279 78.7777 65.8508L82.214 69.2872C82.7863 69.8592 83.7136 69.8592 84.2859 69.2872C84.858 68.7151 84.858 67.7875 84.2859 67.2155Z" fill="black"/>
<path d="M33.2222 16.1525L29.7859 12.7162C29.2138 12.1441 28.2863 12.1441 27.7142 12.7162C27.1421 13.2882 27.1421 14.2158 27.7142 14.7878L31.1505 18.2242C31.7226 18.7962 32.6501 18.7962 33.2222 18.2242C33.7943 17.6519 33.7943 16.7244 33.2222 16.1525Z" fill="black"/>
<path d="M85.2245 37.413C83.6482 23.9608 72.9847 13.2964 59.5957 11.6644C58.7939 11.5657 58.0621 12.1382 57.964 12.9411C57.8662 13.7443 58.4379 14.4747 59.241 14.5728C71.4005 16.0548 80.8888 25.5874 82.3144 37.754C82.4017 38.4995 83.0347 39.0483 83.7673 39.0483C83.8243 39.0483 83.8818 39.045 83.9398 39.0383C84.7437 38.9444 85.3187 38.2167 85.2245 37.413Z" fill="black"/>
<path d="M83.9218 42.9662C83.1179 42.8638 82.386 43.4328 82.2845 44.2355C81.2858 52.1238 76.8335 59.0841 70.0691 63.3312C67.1529 65.1622 65.412 68.2958 65.412 71.7134V77.7421H46.5873V71.58C46.5873 68.2706 44.8578 65.1441 42.074 63.4208C34.2017 58.5478 29.5018 50.1187 29.5016 40.8728C29.5016 27.5228 39.5011 16.217 52.7615 14.5744C53.5644 14.475 54.1345 13.7434 54.0351 12.9404C53.9357 12.1377 53.2044 11.566 52.4011 11.6668C37.7498 13.4818 26.5711 26.0814 26.5713 40.8728C26.5713 45.9769 27.8988 51.0058 30.4107 55.4159C32.8457 59.6913 36.3455 63.3206 40.5314 65.9118C42.4593 67.1052 43.6568 69.2771 43.6568 71.5798V77.9554C42.1674 78.4729 41.0933 79.8874 41.0933 81.5509V83.6391C41.0933 84.5233 41.3988 85.336 41.906 85.9831C41.3986 86.6301 41.0933 87.4426 41.0933 88.327V90.4151C41.0933 92.5153 42.8021 94.2239 44.9021 94.2239H49.5076V97.5354C49.5076 99.4458 51.0617 101 52.9718 101H59.0259C60.9363 101 62.4902 99.4458 62.4902 97.5354V94.2239H67.0956C69.1958 94.2239 70.9044 92.5151 70.9044 90.4151V88.327C70.9044 87.4428 70.5989 86.6301 70.0915 85.9831C70.5989 85.336 70.9044 84.5235 70.9044 83.6391V81.5509C70.9044 79.8872 69.8306 78.4729 68.3409 77.9554V71.7132C68.3409 69.3099 69.5689 67.104 71.6261 65.8124C79.1366 61.0968 84.0808 53.3663 85.1899 44.6035C85.2925 43.8007 84.7243 43.0677 83.9218 42.9662ZM59.5609 97.5352C59.5609 97.8249 59.3162 98.0698 59.0265 98.0698H52.9724C52.6828 98.0698 52.438 97.8251 52.438 97.5352V94.2237H59.5609V97.5352ZM67.9753 90.4149C67.9753 90.8913 67.5728 91.2938 67.0964 91.2938C64.5105 91.2938 47.3429 91.2938 44.9027 91.2938C44.4263 91.2938 44.0238 90.8913 44.0238 90.4149V88.3268C44.0238 87.8505 44.4263 87.4479 44.9027 87.4479H67.0964C67.5728 87.4479 67.9753 87.8505 67.9753 88.3268V90.4149ZM67.9753 83.6389C67.9753 84.1153 67.5728 84.5178 67.0964 84.5178H44.9027C44.4263 84.5178 44.0238 84.1153 44.0238 83.6389V81.5507C44.0238 81.0743 44.4263 80.6718 44.9027 80.6718H67.0964C67.5728 80.6718 67.9753 81.0743 67.9753 81.5507V83.6389Z" fill="black"/>
</g>
<defs>
<clipPath id="clip0">
<rect width="100" height="100" fill="white" transform="translate(6 1)"/>
</clipPath>
</defs>
</svg>
