<svg width="112" height="118" viewBox="0 0 112 118" fill="none" xmlns="http://www.w3.org/2000/svg">
<path d="M56 6L104.497 90H7.50258L56 6Z" fill="#FFE7E7"/>
<g clip-path="url(#clip0)">
<path d="M56.0244 76.4318C59.7211 76.4318 62.7285 73.4244 62.7285 69.7275C62.7285 66.0309 59.7211 63.0234 56.0244 63.0234C52.3277 63.0234 49.3203 66.0309 49.3203 69.7275C49.3203 73.4244 52.3277 76.4318 56.0244 76.4318ZM56.0244 65.9531C58.1057 65.9531 59.7988 67.6463 59.7988 69.7275C59.7988 71.8088 58.1057 73.5022 56.0244 73.5022C53.9432 73.5022 52.25 71.8088 52.25 69.7275C52.25 67.6463 53.9432 65.9531 56.0244 65.9531Z" fill="black"/>
<path d="M101.042 90.2496H96.3111L97.7711 88.8443C100.045 86.6555 100.889 83.4193 99.9733 80.3986L94.9303 63.766C93.3682 58.6137 89.0986 54.8658 83.7873 53.9848L81.7611 53.6484C80.6385 52.3441 78.9764 51.5168 77.1244 51.5168H68.994C67.8037 51.2027 66.9395 50.1883 66.8256 48.951L66.5516 45.9766C70.1859 43.2529 73.1107 39.1426 73.6602 33.8104H74.2762C76.707 33.8104 78.6846 31.8326 78.6846 29.4018V26.1397C78.6846 24.4053 77.6779 22.9018 76.2182 22.1824C76.2176 21.4793 76.2172 20.2994 76.2172 18.3203C76.2172 17.5111 75.5615 16.8555 74.7523 16.8555C73.9432 16.8555 73.2875 17.5111 73.2875 18.3203C73.2875 19.923 73.2877 21.0031 73.2881 21.7313H72.2014C71.3897 21.7313 70.6557 21.1295 70.6557 20.2486V17.3131C70.6557 14.765 68.5828 12.6922 66.0348 12.6922C65.8008 12.7088 64.2619 12.5818 62.2971 13.2484C62.0356 13.3164 59.6111 14.3268 56.1801 14.3268C52.7607 14.3268 50.3158 13.3141 50.0629 13.2484C47.9975 12.5477 46.4104 12.7174 46.0139 12.6922C43.4658 12.6922 41.393 14.765 41.393 17.3131V20.2486C41.393 21.1139 40.6471 21.7313 39.8467 21.7313H38.7584V10.9746C38.7584 8.56309 40.8906 6.57832 43.4664 6.97949C45.5217 7.3002 47.3496 5.97578 47.5615 3.90195C47.9838 3.29629 48.6756 2.93027 49.4268 2.93008L65.8916 2.92969C69.9768 2.92969 73.2865 6.23438 73.2865 10.3215C73.2865 10.8305 73.2869 11.0852 73.2873 11.2125C73.2906 12.4684 74.2473 12.8002 74.7527 12.8002C75.5619 12.8002 76.2176 12.1445 76.2176 11.3354C76.2176 11.3258 76.2176 11.3164 76.2174 11.3068C76.217 11.2672 76.2162 11.0924 76.2162 10.3215C76.2162 4.6168 71.5973 -0.0003906 65.8916 2.4784e-08L49.4266 0.00039065C47.4885 0.000585962 45.7236 1.06602 44.8207 2.78086C44.6264 3.15039 44.6547 3.48145 44.6523 3.50312C44.6523 3.96328 44.3613 4.15371 43.918 4.08477C39.6238 3.41465 35.8287 6.71172 35.8287 10.9744V22.1828C34.3699 22.9023 33.3641 24.4055 33.3641 26.1391V29.4012C33.3641 31.832 35.3416 33.8098 37.7725 33.8098H38.3898C38.7178 36.9422 39.8975 39.8914 41.8418 42.4115C42.8707 43.7449 44.1014 44.9479 45.4955 45.9914L45.2229 48.9504C45.109 50.1877 44.2449 51.2021 43.0547 51.5162H34.9238C33.0719 51.5162 31.4098 52.3436 30.2871 53.648L28.2611 53.9842C22.9502 54.8652 18.6803 58.6131 17.118 63.7654L12.075 80.3986C11.1594 83.4193 12.0031 86.6555 14.2771 88.8443L15.7371 90.2496H10.9574C8.26914 90.2496 6.08203 92.4365 6.08203 95.1248C6.08203 97.8131 8.26914 100 10.9574 100H101.042C103.731 100 105.918 97.8131 105.918 95.1248C105.918 92.4365 103.731 90.2496 101.042 90.2496ZM73.7518 24.6607H74.2762C75.0877 24.6607 75.7549 25.3203 75.7549 26.1395V29.4016C75.7549 30.2172 75.0916 30.8805 74.2764 30.8805H73.7496L73.7518 24.6607ZM37.7723 30.8805C36.9568 30.8805 36.2936 30.2172 36.2936 29.4016V26.1395C36.2936 25.3213 36.9598 24.6607 37.7723 24.6607H38.2967L38.2986 30.8807H37.7723V30.8805ZM83.3078 56.8746C87.5111 57.5721 90.8902 60.5383 92.1264 64.6158L97.1693 81.2484C97.7643 83.2104 97.2162 85.3121 95.7393 86.7336L92.0865 90.2496H88.9051C89.202 89.4502 89.3572 88.5969 89.3572 87.7227C89.3572 86.0484 87.9949 84.6863 86.3207 84.6863H83.2408V57.6332C83.2408 57.3697 83.224 57.1102 83.1916 56.8555L83.3078 56.8746ZM86.3209 87.6162C86.3799 87.6162 86.4277 87.6641 86.4277 87.7229C86.4277 88.6397 86.1414 89.518 85.6123 90.2498H26.4359C25.9068 89.518 25.6207 88.6397 25.6207 87.7229C25.6207 87.6641 25.6686 87.6162 25.7273 87.6162H86.3209ZM41.2287 32.3287L41.2264 24.4475C42.9955 23.885 44.3225 22.259 44.3225 20.2482V17.3127C44.3225 16.3803 45.0813 15.6215 46.0137 15.6215C46.443 15.6465 47.5871 15.5016 49.1215 16.0225C49.4002 16.0943 52.2061 17.2559 56.1801 17.2559C60.0828 17.2559 63.0477 16.0707 63.2387 16.0225C64.6904 15.5297 65.8154 15.6363 66.0348 15.6215C66.9672 15.6215 67.726 16.3803 67.726 17.3127V20.2482C67.726 22.2619 69.0574 23.8838 70.8221 24.4467L70.8195 32.3289C70.7024 37.5408 67.9244 40.9947 65.6133 42.975C62.8232 45.3658 59.1506 46.8742 56.0242 46.9141C49.8701 46.8375 41.4314 41.3398 41.2287 32.3287ZM64.6088 51.5168H47.4397C47.8199 50.8248 48.0641 50.0473 48.1402 49.2197L48.276 47.7469C50.7299 49.041 53.2238 49.8127 56.008 49.8439H56.0408C58.4158 49.8174 61.1613 49.0959 63.7711 47.7295L63.9084 49.2197C63.9844 50.0471 64.2285 50.8246 64.6088 51.5168ZM14.8789 81.2484L19.9217 64.6158C21.158 60.5383 24.5371 57.5721 28.7404 56.8746L28.8564 56.8553C28.824 57.11 28.8072 57.3695 28.8072 57.633V66.6219C28.8072 67.4311 29.4629 68.0867 30.2721 68.0867C31.0813 68.0867 31.7369 67.4311 31.7369 66.6219V57.633C31.7369 55.8758 33.1664 54.4463 34.9236 54.4463H77.1242C78.8815 54.4463 80.3111 55.8758 80.3111 57.633V84.6863H31.7369V73.5512C31.7369 72.742 31.0813 72.0863 30.2721 72.0863C29.4629 72.0863 28.8072 72.742 28.8072 73.5512V84.6863H25.7271C24.0529 84.6863 22.6908 86.0484 22.6908 87.7227C22.6908 88.5969 22.8459 89.4502 23.1428 90.2496H19.9617L16.309 86.7336C14.832 85.3121 14.284 83.2104 14.8789 81.2484ZM101.042 97.0705H10.9574C9.88457 97.0705 9.01172 96.1977 9.01172 95.1248C9.01172 94.0521 9.88457 93.1793 10.9574 93.1793H101.042C102.115 93.1793 102.988 94.0521 102.988 95.1248C102.988 96.1977 102.115 97.0705 101.042 97.0705Z" fill="black"/>
</g>
<defs>
<clipPath id="clip0">
<rect width="100" height="100" fill="white" transform="translate(6)"/>
</clipPath>
</defs>
</svg>
