0.125 0.003 -0.004 0.002
0.375 -0.015 -0.010 0.050
0.625 0.007 -0.021 0.260
0.875 -0.014 -0.045 0.711
1.125 -0.038 -0.085 1.392
1.375 -0.043 -0.135 2.445
1.625 -0.069 -0.181 3.202
1.875 -0.159 -0.184 4.182
2.125 -0.240 -0.207 4.832
2.375 -0.156 -0.308 5.513
2.625 -0.246 -0.182 5.911
2.875 -0.249 -0.199 6.466
3.125 -0.191 -0.415 6.616
3.375 -0.270 -0.318 6.952
3.625 -0.306 -0.336 7.439
3.875 -0.286 -0.301 7.544
4.125 -0.313 -0.329 7.842
4.375 -0.320 -0.294 7.576
4.625 -0.190 -0.383 7.665
4.875 -0.302 -0.364 7.672
5.125 -0.105 -0.481 7.672
5.375 -0.236 -0.382 8.267
5.625 -0.253 -0.291 8.336
5.875 -0.200 -0.287 8.745
6.125 -0.220 -0.292 8.940
6.375 -0.287 -0.270 8.838
6.625 -0.273 -0.200 9.536
6.875 -0.249 -0.316 9.918
7.125 -0.318 -0.287 10.490
7.375 -0.398 -0.234 10.797
7.625 -0.418 -0.374 12.012
7.875 -0.473 -0.385 13.566
8.125 -0.473 -0.432 14.603
8.375 -0.604 -0.491 16.725
8.625 -0.640 -0.537 17.358
8.875 -0.621 -0.571 19.324
9.125 -0.584 -0.626 21.081
9.375 -0.614 -0.627 21.771
9.625 -0.672 -0.697 22.853
9.875 -0.802 -0.660 25.047
10.125 -0.724 -0.527 23.365
10.375 -0.698 -0.592 24.353
10.625 -0.723 -0.627 23.242
10.875 -0.666 -0.591 22.471
11.125 -0.658 -0.509 21.979
11.375 -0.611 -0.509 20.889
11.625 -0.647 -0.542 20.771
11.875 -0.664 -0.506 20.321
12.125 -0.662 -0.442 19.614
12.375 -0.615 -0.404 18.949
12.625 -0.579 -0.335 18.036
12.875 -0.622 -0.291 17.815
13.125 -0.664 -0.327 18.139
13.375 -0.688 -0.374 18.448
13.625 -0.595 -0.319 17.598
13.875 -0.648 -0.354 18.064
14.125 -0.608 -0.336 17.235
14.375 -0.593 -0.322 17.046
14.625 -0.586 -0.304 16.869
14.875 -0.574 -0.264 16.097
15.125 -0.585 -0.334 15.908
15.375 -0.492 -0.324 14.650
15.625 -0.560 -0.356 15.056
15.875 -0.513 -0.354 13.970
16.125 -0.506 -0.375 13.992
16.375 -0.456 -0.367 12.989
16.625 -0.400 -0.278 12.357
16.875 -0.349 -0.251 10.960
17.125 -0.356 -0.253 11.039
17.375 -0.342 -0.234 10.441
17.625 -0.292 -0.228 9.366
17.875 -0.327 -0.216 9.257
18.125 -0.274 -0.170 8.215
18.375 -0.293 -0.135 7.939
18.625 -0.257 -0.182 7.855
18.875 -0.264 -0.159 7.188
19.125 -0.253 -0.144 6.846
19.375 -0.269 -0.104 6.634
19.625 -0.217 -0.143 6.273
19.875 -0.213 -0.126 6.165
