0.125 0.006 -0.004 0.026
0.375 -0.010 0.004 0.307
0.625 -0.032 -0.017 0.976
0.875 -0.061 -0.039 1.651
1.125 -0.151 -0.126 2.408
1.375 -0.082 -0.010 3.343
1.625 -0.096 -0.084 4.418
1.875 -0.143 -0.104 5.634
2.125 -0.169 -0.124 6.935
2.375 -0.123 -0.168 8.111
2.625 -0.271 -0.087 9.849
2.875 -0.280 -0.059 11.316
3.125 -0.326 -0.112 12.963
3.375 -0.408 -0.181 14.539
3.625 -0.348 -0.158 16.093
3.875 -0.497 -0.195 17.162
4.125 -0.463 -0.160 18.397
4.375 -0.391 -0.057 19.327
4.625 -0.399 -0.121 19.456
4.875 -0.427 -0.134 19.755
5.125 -0.430 -0.056 19.462
5.375 -0.559 -0.103 19.527
5.625 -0.467 -0.059 19.585
5.875 -0.515 -0.071 20.288
6.125 -0.377 -0.045 19.685
6.375 -0.548 -0.003 20.694
6.625 -0.664 0.104 20.935
6.875 -0.554 -0.124 21.869
7.125 -0.642 -0.093 22.172
7.375 -0.667 -0.105 22.783
7.625 -0.657 -0.226 22.549
7.875 -0.694 -0.201 22.777
8.125 -0.647 -0.207 22.386
8.375 -0.652 -0.137 21.710
8.625 -0.704 -0.266 21.099
8.875 -0.637 -0.153 21.542
9.125 -0.585 -0.097 20.186
9.375 -0.525 -0.186 19.579
9.625 -0.541 -0.204 19.941
9.875 -0.452 -0.180 19.223
10.125 -0.432 -0.083 18.042
10.375 -0.415 -0.125 17.591
10.625 -0.314 -0.183 17.062
10.875 -0.389 -0.122 16.657
11.125 -0.411 -0.124 16.476
11.375 -0.317 -0.095 15.899
11.625 -0.325 -0.097 14.960
11.875 -0.345 -0.155 14.101
12.125 -0.304 -0.063 14.002
12.375 -0.354 -0.067 13.266
12.625 -0.248 -0.107 12.549
12.875 -0.234 -0.096 11.313
13.125 -0.242 -0.123 11.808
13.375 -0.196 -0.110 10.642
13.625 -0.084 -0.064 10.221
13.875 -0.090 -0.045 9.826
14.125 -0.074 0.012 8.583
14.375 -0.084 0.017 8.291
14.625 -0.114 0.058 7.969
14.875 -0.050 0.093 7.556
15.125 -0.154 0.059 7.779
15.375 -0.145 0.096 7.129
15.625 -0.151 0.051 6.641
15.875 -0.159 0.077 6.252
16.125 -0.188 0.062 6.438
16.375 -0.178 0.071 5.719
16.625 -0.238 0.039 5.908
16.875 -0.213 0.042 5.403
17.125 -0.161 -0.011 4.780
17.375 -0.171 -0.014 4.486
17.625 -0.149 -0.061 4.283
17.875 -0.148 -0.053 4.663
18.125 -0.150 -0.066 3.899
18.375 -0.112 -0.061 3.363
18.625 -0.080 -0.105 3.967
18.875 -0.047 -0.067 3.679
19.125 -0.020 -0.037 2.942
19.375 -0.027 -0.046 3.013
19.625 -0.023 -0.045 2.661
19.875 -0.022 -0.034 2.186
