0.05000 2920.80840
0.15000 4396.51391
0.25000 5900.98138
0.35000 7394.29875
0.45000 8322.48365
0.55000 9176.42028
0.65000 9724.64058
0.75000 9930.80021
0.85000 10012.85007
0.95000 10093.11062
1.05000 9803.40882
1.15000 9574.07654
1.25000 9219.82702
1.35000 8907.90111
1.45000 8545.58429
1.55000 8258.75323
1.65000 7910.54703
1.75000 7625.07796
1.85000 7236.89396
1.95000 6871.99469
2.05000 6639.28715
2.15000 6450.14369
2.25000 6172.52709
2.35000 5873.48246
2.45000 5660.00696
2.55000 5463.56482
2.65000 5274.92246
2.75000 5040.52024
2.85000 4852.81510
2.95000 4744.10013
3.05000 4554.83482
3.15000 4402.70830
3.25000 4275.54472
3.35000 4106.96851
3.45000 4042.35662
3.55000 3800.91904
3.65000 3727.88240
3.75000 3621.08753
3.85000 3516.46271
3.95000 3368.63950
4.05000 3322.33942
4.15000 3226.81974
4.25000 3194.59353
4.35000 3115.09510
4.45000 2954.74612
4.55000 2846.08920
4.65000 2836.31964
4.75000 2668.06841
4.85000 2620.94533
4.95000 2555.20787
5.05000 2482.04625
5.15000 2341.75253
5.25000 2266.44392
5.35000 2233.96813
5.45000 2135.41449
5.55000 2024.76170
5.65000 1920.95790
5.75000 1888.90827
5.85000 1825.68171
5.95000 1751.35290
6.05000 1689.12162
6.15000 1611.62175
6.25000 1557.50704
6.35000 1490.18373
6.45000 1459.14395
6.55000 1377.18322
6.65000 1380.92584
6.75000 1305.62486
6.85000 1284.11114
6.95000 1243.35958
7.05000 1178.83473
7.15000 1155.11458
7.25000 1118.90121
7.35000 1097.77626
7.45000 1096.32678
7.55000 1063.62968
7.65000 996.27954
7.75000 1016.36818
7.85000 989.85739
7.95000 947.64962
8.05000 930.87515
8.15000 914.99253
8.25000 880.31404
8.35000 869.14467
8.45000 843.34586
8.55000 829.93607
8.65000 799.03173
8.75000 799.13686
8.85000 779.64594
8.95000 765.37796
9.05000 728.26119
9.15000 734.30490
9.25000 710.51154
9.35000 689.10055
9.45000 691.43872
9.55000 660.04239
9.65000 651.23322
9.75000 647.41540
9.85000 615.91092
9.95000 603.96231
10.05000 600.77794
10.15000 600.81462
10.25000 579.23250
10.35000 573.80812
10.45000 557.87082
10.55000 553.09900
10.65000 536.23108
10.75000 541.70632
10.85000 526.03453
10.95000 506.14323
11.05000 498.79894
11.15000 490.05416
11.25000 483.60009
11.35000 479.32637
11.45000 459.58755
11.55000 464.41898
11.65000 450.92060
11.75000 433.92172
11.85000 427.44830
11.95000 419.83255
12.05000 418.07707
12.15000 402.55069
12.25000 405.80404
12.35000 401.20386
12.45000 385.27562
12.55000 382.50955
12.65000 370.64787
12.75000 365.09366
12.85000 354.20333
12.95000 348.28387
13.05000 345.70292
13.15000 338.20515
13.25000 328.53275
13.35000 324.63121
13.45000 322.47053
13.55000 315.75359
13.65000 306.66028
13.75000 299.95615
13.85000 283.85680
13.95000 291.40986
14.05000 273.37255
14.15000 274.93556
14.25000 266.92119
14.35000 257.54908
14.45000 260.36947
14.55000 254.11237
14.65000 246.95391
14.75000 249.36237
14.85000 236.02184
14.95000 235.82206
15.05000 231.58891
15.15000 222.02914
15.25000 231.15393
15.35000 231.47027
15.45000 219.37033
15.55000 219.81240
15.65000 222.48439
15.75000 216.98370
15.85000 214.77127
15.95000 211.59741
16.05000 209.67629
16.15000 207.92506
16.25000 204.33456
16.35000 198.28574
16.45000 195.67673
16.55000 189.92489
16.65000 187.53079
16.75000 185.02974
16.85000 182.12515
16.95000 181.12847
17.05000 178.61401
17.15000 175.56516
17.25000 165.87309
17.35000 177.89425
17.45000 173.78214
17.55000 173.44405
17.65000 163.49116
17.75000 160.02762
17.85000 156.63485
17.95000 157.24800
18.05000 151.82558
18.15000 156.26377
18.25000 147.78859
18.35000 149.95872
18.45000 137.52316
18.55000 142.73760
18.65000 135.50759
18.75000 133.88317
18.85000 133.38763
18.95000 131.30448
19.05000 128.17782
19.15000 118.80474
19.25000 117.18516
19.35000 125.63703
19.45000 116.15259
19.55000 114.19937
19.65000 111.65953
19.75000 118.26859
19.85000 111.02119
19.95000 116.11311
