0.12500 0.01180
0.37500 0.02466
0.62500 0.02478
0.87500 0.00557
1.12500 0.00432
1.37500 0.00475
1.62500 0.01434
1.87500 0.00635
2.12500 0.00897
2.37500 0.00438
2.62500 0.00133
2.87500 0.00335
3.12500 0.00353
3.37500 0.00378
3.62500 0.00811
3.87500 0.01891
4.12500 0.00944
4.37500 0.00496
4.62500 0.00764
4.87500 0.00379
5.12500 0.00943
5.37500 0.01778
5.62500 0.01009
5.87500 0.01504
6.12500 0.01963
6.37500 0.01742
6.62500 0.01089
6.87500 0.01151
7.12500 0.01156
7.37500 0.01028
7.62500 0.01193
7.87500 0.01653
8.12500 0.00809
8.37500 0.00252
8.62500 0.00905
8.87500 0.01922
9.12500 0.00603
9.37500 0.01490
9.62500 0.00519
9.87500 0.00759
10.12500 0.01268
10.37500 0.02141
10.62500 0.01807
10.87500 0.01756
11.12500 0.01460
11.37500 0.02590
11.62500 0.02068
11.87500 0.01274
12.12500 0.00759
12.37500 0.00102
12.62500 0.00898
12.87500 0.00826
13.12500 0.00765
13.37500 0.01657
13.62500 0.00832
13.87500 0.00698
14.12500 0.02638
14.37500 0.01896
14.62500 0.01198
14.87500 0.02028
15.12500 0.01234
15.37500 0.00826
15.62500 0.03880
15.87500 0.01936
16.12500 0.02016
16.37500 0.02419
16.62500 0.04511
16.87500 0.00595
17.12500 0.01371
17.37500 0.00313
17.62500 0.00759
17.87500 0.02394
18.12500 0.02959
18.37500 0.00751
18.62500 0.01675
18.87500 0.04440
19.12500 0.02444
19.37500 0.03289
19.62500 0.00955
19.87500 0.03461
