0.12500 0.01512
0.37500 0.01351
0.62500 0.02575
0.87500 0.02723
1.12500 0.04009
1.37500 0.07270
1.62500 0.08348
1.87500 0.11687
2.12500 0.15282
2.37500 0.16627
2.62500 0.18031
2.87500 0.20028
3.12500 0.21486
3.37500 0.21198
3.62500 0.21145
3.87500 0.20112
4.12500 0.18106
4.37500 0.15746
4.62500 0.14461
4.87500 0.11909
5.12500 0.09867
5.37500 0.07309
5.62500 0.07101
5.87500 0.05877
6.12500 0.06137
6.37500 0.04293
6.62500 0.03610
6.87500 0.04124
7.12500 0.02787
7.37500 0.03035
7.62500 0.01672
7.87500 0.02321
8.12500 0.01900
8.37500 0.04069
8.62500 0.03523
8.87500 0.02907
9.12500 0.02434
9.37500 0.03222
9.62500 0.05491
9.87500 0.04745
10.12500 0.04578
10.37500 0.05573
10.62500 0.05602
10.87500 0.07425
11.12500 0.05815
11.37500 0.05437
11.62500 0.06671
11.87500 0.05945
12.12500 0.03673
12.37500 0.03673
12.62500 0.02109
12.87500 0.03393
13.12500 0.02741
13.37500 0.01316
13.62500 0.02344
13.87500 0.06846
14.12500 0.04445
14.37500 0.04461
14.62500 0.03936
14.87500 0.03795
