0.1875 -1.5733 15.32817 -0.53391 120.56269 122.63821 100.08003
0.5625 -0.4638 37.64947 0.96779 122.06568 115.73482 94.95786
0.9375 1.17966 57.65342 -0.28139 120.65436 107.76554 91.06618
1.3125 0.84762 69.80164 -0.34581 118.29328 100.28174 86.26199
1.6875 -0.41762 79.96167 1.04612 116.22585 92.37871 82.12577
2.0625 1.88746 84.48126 -0.64816 110.46751 88.13951 77.1175
2.4375 -0.11106 90.19272 0.25603 108.06673 82.89052 74.24362
2.8125 0.36276 92.78698 0.64377 102.66284 78.56351 72.14852
3.1875 0.2463 96.96852 0.47531 99.93115 75.22426 68.99765
3.5625 -1.02703 101.62339 -0.69488 95.26078 72.18332 67.04309
3.9375 0.98513 107.24675 -0.12697 92.06307 70.3855 64.09097
4.3125 1.91411 114.03126 -0.97352 87.90344 68.33457 61.30383
4.6875 -0.08167 122.74451 -2.01221 83.75367 65.91552 58.16468
5.0625 0.98178 131.01172 -2.10837 78.30813 64.84959 55.05828
5.4375 0.30901 140.47127 -1.79866 71.93098 62.55471 52.03396
5.8125 -1.05578 148.00364 -1.34344 66.07331 61.05307 48.29617
6.1875 -0.45336 159.35962 0.24152 61.19377 57.47725 45.7778
6.5625 -0.06455 167.59905 1.11415 55.59215 54.1147 41.39991
6.9375 -0.49442 173.73768 2.94337 49.58326 49.82058 38.48974
7.3125 -0.53945 179.52012 2.99636 45.36093 44.56304 36.46866
7.6875 -1.53786 183.40991 1.62322 41.53628 41.6048 33.04686
8.0625 -1.55429 188.06833 0.26096 38.1284 36.99008 31.07715
8.4375 -1.82194 193.62939 0.68641 37.09696 32.56268 29.60556
8.8125 -0.90629 196.25672 0.39161 35.45688 29.91796 27.97216
9.1875 -1.9159 198.33127 0.20537 34.49078 27.34382 26.81001
9.5625 -0.95097 199.90255 -0.6553 33.03392 26.0533 25.73115
9.9375 -0.03538 201.17885 -0.89596 31.66904 24.97235 25.28844
10.3125 -0.86216 202.12443 0.07876 30.63265 24.74241 24.09225
10.6875 0.06929 203.11899 -0.44339 30.39936 23.63336 23.29887
11.0625 -0.34734 203.70151 -1.67274 29.56179 23.12579 22.53527
11.4375 -0.22581 204.20372 -1.1618 28.71771 22.59803 23.1162
11.8125 -0.31437 206.01397 -2.16017 27.5324 21.92808 21.61305
12.1875 -0.07624 206.24129 -1.89621 26.29186 20.89358 21.94131
12.5625 -0.08225 206.19042 -1.31761 26.7376 19.78778 20.88089
12.9375 0.65936 205.97039 -1.46225 26.04996 18.76975 20.95201
13.3125 0.60906 206.27816 -0.10536 26.03766 18.88665 20.0125
13.6875 0.39076 206.15121 -0.95449 24.49455 18.44335 19.66125
14.0625 1.06925 206.18995 -1.13031 24.0623 18.98968 18.88353
14.4375 0.4443 207.04566 -0.78303 23.95656 18.49834 18.53522
14.8125 0.68253 207.45539 -0.01703 23.97377 18.38435 18.15163
15.1875 1.708 208.444 -0.23461 22.399 18.4892 17.55348
15.5625 0.88086 209.82581 0.21718 22.37041 17.3841 17.5655
15.9375 1.93795 209.97121 -0.36621 22.65596 17.09964 16.64239
16.3125 1.98489 210.14106 0.06122 21.6356 16.15955 16.60777
16.6875 2.90312 210.24601 1.33294 21.16963 14.5329 16.23872
17.0625 4.02137 209.33841 0.39014 21.15929 14.3489 15.69691
17.4375 3.70013 208.84602 1.09533 21.63678 12.11701 15.54232
17.8125 3.33039 207.93747 1.68161 20.75215 12.94832 14.74947
18.1875 1.70317 207.04586 2.16119 19.92964 13.0504 14.80897
18.5625 0.55781 206.53994 1.5169 19.27052 13.14046 14.10401
18.9375 2.35897 205.4752 1.75457 18.50378 13.35392 13.54545
19.3125 0.69312 204.65621 1.55274 17.83963 13.35072 13.57394
19.6875 0.34189 205.10455 2.10184 17.43788 13.98889 13.32794
20.0625 0.20161 206.68228 1.3353 16.71397 13.52037 12.49041
20.4375 0.52519 206.71667 1.67298 14.92124 12.89473 11.28967
20.8125 0.67021 207.76129 1.30834 15.14866 12.90579 11.96838
21.1875 1.0187 208.55979 0.19994 16.32486 11.46543 11.75197
21.5625 0.06868 207.54803 0.52818 15.33883 11.98378 11.3226
21.9375 1.66877 207.27203 0.89277 14.8458 11.41426 11.29039
22.3125 0.31545 208.57727 -0.42783 15.47587 10.37587 11.15115
22.6875 0.80803 208.43073 -0.61423 13.80982 10.13432 12.63156
23.0625 0.07627 208.21835 -1.50614 14.62158 10.0659 12.54435
23.4375 0.82406 208.37383 -0.50135 13.83146 9.13031 11.85939
23.8125 0.79439 207.31793 -0.63582 12.95754 10.12079 11.48679
24.1875 1.45681 207.8749 -2.02983 13.63751 8.64846 11.34548
24.5625 1.70092 208.27637 -1.31475 13.30325 9.17747 12.2595
24.9375 -1.0447 206.36161 -1.44506 14.1006 8.27601 11.29545
25.3125 0.89784 205.60194 -2.85748 12.15351 8.35701 9.96999
25.6875 0.99768 207.01352 -2.36256 12.47598 8.71577 9.99251
26.0625 -0.90603 207.20379 -1.29701 11.51539 8.45365 8.45611
26.4375 1.88058 205.86509 -1.79639 11.10454 8.83468 8.80927
26.8125 1.78847 205.11115 -1.00017 11.41955 6.17835 7.11833
27.1875 -0.45884 206.68379 -1.26707 11.14735 6.67791 7.52815
27.5625 1.7279 205.09904 -0.73679 11.0423 7.68128 8.37001
27.9375 0.45282 204.78185 -1.52783 11.08692 8.32177 7.59283
28.3125 0.81607 203.85829 -0.89104 10.17208 7.27289 7.34347
28.6875 0.11091 205.42519 1.19519 8.77511 6.85706 8.01005
29.0625 -0.08552 203.00048 2.89614 8.17155 6.29867 6.58892
29.4375 2.90468 204.16482 0.90735 9.42875 7.7913 6.4891
29.8125 -0.49294 203.03555 1.0877 9.72933 8.30315 6.67388
