0.05000 2324.21611 -1538.89221 3979.07114 0.00000 0.00000 0.00000
0.15000 -461.15701 -454.20304 3653.91115 1641.05473 2079.97191 262.86499
0.25000 34.20765 761.27823 3707.40278 1741.02459 1861.77108 426.95109
0.35000 -171.81991 -523.20598 3563.22002 1656.01906 2096.71796 805.63978
0.45000 -770.18837 -208.55645 3539.20738 1880.25226 1903.95947 546.94418
0.55000 -815.78036 40.98116 3496.35295 1814.24289 2029.63400 713.80251
0.65000 -1139.14267 181.48201 3337.07086 1911.15310 1968.47571 800.92870
0.75000 -1337.12361 -26.74791 3301.07215 1910.14002 2063.96146 1051.02890
0.85000 -1267.91394 20.73470 3214.26572 1750.40773 2148.72454 1241.43361
0.95000 -1702.29709 -54.27046 2991.99520 1887.10485 2284.74025 1284.81652
1.05000 -1557.63069 101.58520 2842.44411 2413.97478 2525.49435 1406.37402
1.15000 -1754.96066 -29.62533 2624.11132 2020.10923 2277.54571 1437.15052
1.25000 -2085.51752 103.55588 2408.67730 1826.23325 2349.03367 1567.83339
1.35000 -2258.15536 48.75131 2068.88889 1957.29103 2356.83996 1857.94913
1.45000 -2502.25709 -116.80080 1475.78568 2001.75911 2486.14033 2215.63887
1.55000 -2718.92303 27.05295 1370.71964 1755.11317 2321.00179 2263.91794
1.65000 -2864.73343 28.81731 1024.77190 1849.75755 2052.14476 2641.01111
1.75000 -3024.56445 46.05668 976.92153 1706.73231 1858.81510 2604.66598
1.85000 -3099.09231 -134.66301 938.85871 1390.20903 1746.11580 2427.25829
1.95000 -3182.88200 23.48550 837.96848 1736.81981 1693.96972 2504.93154
2.05000 -3170.49615 -26.99544 792.84247 1339.05975 1602.02233 2530.75315
2.15000 -3201.06621 -12.90208 637.12101 1336.37689 1405.71536 2600.43324
2.25000 -3312.51202 -0.71710 726.93777 1203.02563 1276.19405 2422.49253
2.35000 -3310.87008 -18.09560 595.41886 1268.02701 1355.53379 2628.29932
2.45000 -3307.25216 -2.60019 505.52525 1308.55263 1197.82141 2576.19835
2.55000 -3308.13222 7.75267 471.52770 1265.49907 1182.16661 2528.42401
2.65000 -3305.26365 -20.93219 397.54378 1189.61499 1075.32602 2535.20949
2.75000 -3325.02765 -11.20164 404.35746 1138.58495 1012.70099 2519.59992
2.85000 -3321.07210 -67.45037 338.49974 1138.27832 992.02603 2570.73460
2.95000 -3325.07881 8.47354 216.76662 1118.06270 958.64505 2524.60656
3.05000 -3274.73091 -2.43306 315.98782 1227.57530 917.91035 2520.73159
3.15000 -3313.81298 -1.36880 246.10542 1116.15751 855.51334 2509.02937
3.25000 -3296.65415 0.15298 384.32030 1090.06621 800.20670 2441.47542
3.35000 -3240.98010 12.67314 329.09803 1131.98538 836.80877 2486.64194
3.45000 -3289.47534 -22.60641 308.21253 1064.04181 775.03200 2422.69756
3.55000 -3248.84649 18.85831 202.65427 1078.06026 798.63500 2488.65200
3.65000 -3242.01610 -29.99287 225.61882 1034.99040 822.80019 2402.51035
3.75000 -3189.79551 6.79605 276.62333 1070.15049 756.56148 2428.86100
3.85000 -3176.81899 -5.91929 150.52569 1026.04411 684.26378 2417.90127
3.95000 -3094.89096 0.62780 198.50463 1031.54125 728.18832 2453.97570
4.05000 -3159.15017 -5.32588 131.42649 1037.83930 632.67364 2378.72531
4.15000 -3157.74547 -8.42560 123.03747 1022.38080 680.97804 2413.66026
4.25000 -3140.75748 -2.70188 234.58756 1069.73582 620.53224 2429.53940
4.35000 -3169.77753 18.48726 174.03999 1088.04712 766.37395 2299.36794
4.45000 -3081.26422 17.53446 237.05203 1046.36300 656.49757 2379.28878
4.55000 -3098.18671 -7.35665 9.80343 1007.12781 610.45894 2343.55165
4.65000 -3056.95688 -9.18241 118.88766 964.10271 531.48722 2329.73453
4.75000 -3042.10773 7.03419 10.40388 967.60279 564.61119 2339.76583
4.85000 -3053.42058 -5.84811 220.60417 937.66519 547.92222 2256.95504
4.95000 -3051.65424 -2.09329 99.86143 937.04086 476.15486 2248.67075
5.05000 -3005.52729 -10.20666 108.67462 934.70987 480.89373 2280.86716
5.15000 -3021.23350 20.87490 95.53711 1066.40539 717.47930 2257.92880
5.25000 -2972.94727 1.58542 132.33292 955.72879 542.45385 2254.53587
5.35000 -2972.75692 -6.63904 155.28054 925.52595 454.80710 2207.74494
5.45000 -2961.75811 0.12185 47.66720 899.95248 469.84035 2206.02421
5.55000 -2925.88000 -8.41399 103.59132 932.90187 472.36393 2270.09357
5.65000 -2926.40457 0.62419 72.10355 899.92849 486.56378 2183.41247
5.75000 -2917.40736 1.81308 2.36896 912.72507 492.89167 2151.79112
5.85000 -2916.35385 9.79140 126.07989 893.85467 401.91596 2124.89912
5.95000 -2865.37391 -17.00943 78.09324 888.72988 381.17945 2147.80616
6.05000 -2908.74827 -4.35656 19.67608 874.06623 390.86220 2080.67521
6.15000 -2817.55551 -0.75760 65.51804 890.15664 430.37868 2230.18195
6.25000 -2857.15821 -4.42735 92.75393 847.53370 363.86517 2083.38594
6.35000 -2811.43170 1.20793 16.48049 878.67453 386.16775 2132.54450
6.45000 -2776.04501 6.51647 6.53053 880.25494 337.96008 2116.21697
6.55000 -2804.82877 -2.16355 44.70413 835.62230 352.63508 2069.27456
6.65000 -2809.10472 0.03788 -5.16226 823.92032 356.12259 2039.49512
6.75000 -2775.73349 8.53224 66.94403 822.74075 371.08131 2042.59366
6.85000 -2754.78325 4.39333 124.70415 816.00213 321.51585 2026.76201
6.95000 -2754.76885 6.53437 20.30986 822.15699 379.12723 2025.79035
7.05000 -2732.21598 1.04175 60.68329 879.39395 353.34749 2009.76027
7.15000 -2689.53819 -14.49282 48.03304 819.53223 359.68309 2041.92552
7.25000 -2718.59900 4.58788 -24.18376 763.81175 295.23911 1983.83933
7.35000 -2682.88419 4.30275 8.74396 801.25665 293.63346 1991.62640
7.45000 -2693.03995 1.28348 5.80773 788.05196 300.61431 1951.43690
7.55000 -2652.49940 -0.01593 57.00075 829.79057 312.10330 1970.40991
7.65000 -2633.82444 -6.56177 29.15882 814.71358 285.68807 1952.98520
7.75000 -2646.95328 -7.28270 9.71240 865.09413 337.84179 1958.78503
7.85000 -2630.76573 -2.44445 -30.63439 875.12400 425.48697 2000.27080
7.95000 -2619.40425 0.96857 -38.07850 752.73242 267.81810 1916.72657
8.05000 -2587.80292 5.48558 -75.00765 898.67006 339.13282 1954.40681
8.15000 -2572.57445 7.34190 -50.29533 797.02931 251.74172 1916.71984
8.25000 -2555.03553 0.05540 -49.70929 753.57243 237.26715 1895.88662
8.35000 -2553.97428 3.33487 -75.41160 757.24070 261.38272 1893.65030
8.45000 -2554.81898 6.08102 -13.18220 739.47679 239.84050 1852.95159
8.55000 -2523.44396 -9.21909 -56.31814 752.30269 234.92900 1874.86045
8.65000 -2529.39598 2.01711 -4.62765 746.51727 248.57400 1833.08577
8.75000 -2503.04396 3.69283 -54.20997 746.38616 246.51926 1843.04314
8.85000 -2481.85616 -2.16864 -72.10029 739.06165 232.80975 1844.35410
8.95000 -2470.48976 -5.36218 -30.13925 763.20402 248.18203 1827.51627
9.05000 -2476.04175 -0.58715 -46.16275 752.70963 239.25583 1799.61168
9.15000 -2440.52171 -1.17251 26.96246 750.19557 230.15233 1815.93925
9.25000 -2467.13938 -1.93522 4.12747 703.37014 231.20678 1762.90169
9.35000 -2440.79077 -2.42108 -120.46023 711.46927 216.27061 1774.95278
9.45000 -2410.25618 -6.02513 -14.79268 782.11269 376.23302 1792.00570
9.55000 -2380.91738 -3.06405 -13.78417 723.37990 240.49608 1791.10512
9.65000 -2379.11900 -2.38271 -57.70704 702.94447 238.36230 1769.00476
9.75000 -2379.24710 3.35820 -32.74860 689.16673 200.31999 1743.99313
9.85000 -2349.56289 -2.38340 -45.28998 721.83472 198.13233 1754.01195
9.95000 -2345.61069 -3.81346 25.66786 686.20835 196.55859 1731.86587
10.05000 -2304.10197 5.70155 2.14750 712.09261 194.64279 1752.16766
10.15000 -2327.61938 -0.28108 -22.26682 672.48545 189.13276 1715.18144
10.25000 -2316.64331 3.87197 -44.51092 665.74627 199.68900 1706.00676
10.35000 -2299.70516 -3.03708 -61.95740 755.08767 216.11694 1761.79926
10.45000 -2295.81247 -4.72469 33.41929 678.90143 176.97002 1666.68080
10.55000 -2266.27829 2.79399 -113.80560 671.41909 204.92204 1697.31631
10.65000 -2249.33938 0.01017 -3.35633 681.23614 640.69051 1679.87398
10.75000 -2231.29341 2.92228 -61.84112 673.26041 168.70271 1682.32200
10.85000 -2249.72596 1.21894 -25.52477 666.13621 261.81604 1639.82547
10.95000 -2209.71381 3.98150 -30.23856 648.22137 177.58296 1673.29024
11.05000 -2227.10241 -0.03694 -55.94818 643.75981 157.93955 1625.64037
11.15000 -2214.23377 -0.86134 -18.81215 647.73775 167.39455 1616.16666
11.25000 -2176.38736 -0.52185 -8.11838 652.52539 196.50162 1643.96750
11.35000 -2193.48833 0.10880 4.64416 634.62426 168.75651 1599.98201
11.45000 -2184.49230 1.80624 -82.45898 633.83977 168.53228 1595.12589
11.55000 -2150.47157 1.03483 -38.51911 648.97872 145.76468 1603.01732
11.65000 -2142.30984 -1.15360 8.45384 633.63103 152.51936 1590.34953
11.75000 -2136.98304 1.72608 2.33872 624.15119 152.35565 1570.68336
11.85000 -2111.58979 -1.45584 7.32927 636.34110 168.94331 1578.45558
11.95000 -2143.46202 -0.36632 -23.15501 604.33085 139.18926 1529.60672
12.05000 -2090.07799 -2.83119 -41.84793 628.59550 196.62618 1573.28675
12.15000 -2098.11651 -0.13068 -57.43399 608.36328 147.27225 1546.28788
12.25000 -2080.53077 1.28831 -80.62568 627.90344 613.84857 1544.91215
12.35000 -2093.86641 -1.44354 -59.94230 612.54989 137.72890 1511.71145
12.45000 -2075.94481 -2.11332 -51.62774 591.18653 159.30299 1514.41710
12.55000 -2042.26318 2.26392 -58.00870 615.69569 139.18697 1526.60862
12.65000 -2025.59570 3.46342 -26.82562 626.17887 249.20175 1526.20988
12.75000 -2035.34390 -1.92904 -52.97210 596.87681 135.49533 1493.37256
12.85000 -2034.33248 -0.97949 -77.60540 605.20867 205.77344 1482.89955
12.95000 -2036.53891 -1.09712 -32.48653 611.16579 176.23908 1458.53295
13.05000 -2029.44636 1.23603 -80.26825 589.47522 211.62203 1446.62163
13.15000 -1990.33762 2.26313 -70.32007 577.63388 140.66448 1483.06936
13.25000 -1990.51764 -0.19606 -71.12086 572.53164 184.30943 1459.35973
13.35000 -1951.76838 -0.17355 -59.36764 588.28224 144.57109 1485.54634
13.45000 -1969.48851 -0.30055 -80.79963 629.07157 257.62473 1447.73710
13.55000 -1929.59655 2.15087 -60.84461 593.24774 121.35154 1463.28059
13.65000 -1965.84019 3.96101 -75.78283 628.33578 140.89616 1423.52375
13.75000 -1908.78359 0.64313 -37.86846 569.56825 117.89507 1457.96216
13.85000 -1922.73809 0.34237 -54.50102 559.85758 119.58873 1424.81815
13.95000 -1893.34257 -0.77815 -42.95826 572.69814 118.04155 1436.98330
14.05000 -1894.83433 0.76296 -0.24384 557.39329 121.20708 1413.16932
14.15000 -1881.18938 -3.68940 -21.57220 581.62164 131.59723 1419.47433
14.25000 -1869.60559 0.73672 -30.37198 562.01251 116.93258 1427.00411
14.35000 -1889.45872 1.12355 -83.11108 536.45033 125.64466 1381.46327
14.45000 -1884.09086 1.05697 -49.72601 541.75037 121.65055 1366.51797
14.55000 -1859.13988 -1.02369 31.96130 527.02070 246.06701 1494.78274
14.65000 -1845.23188 -0.38595 -66.76809 544.84234 102.83387 1377.86453
14.75000 -1840.28268 2.38039 -30.77357 580.48867 105.99090 1383.35194
14.85000 -1848.41348 0.20653 -38.00124 516.11533 104.73270 1342.58702
14.95000 -1829.94775 -1.19007 -48.05975 530.98003 161.60085 1344.52309
15.05000 -1820.61693 -0.35437 -62.25367 600.37063 220.95650 1337.74476
15.15000 -1820.21958 0.90124 -83.64425 519.82277 158.38650 1328.90358
15.25000 -1811.38932 1.65075 4.20767 518.56927 99.76435 1308.67418
15.35000 -1798.67595 -0.00255 -29.84273 533.15741 202.71606 1314.24235
15.45000 -1807.14869 -2.01456 -67.75406 506.31402 218.98916 1307.52403
15.55000 -1795.89664 1.70936 -131.03338 540.31746 98.40719 1289.07635
15.65000 -1756.02023 -1.38109 -64.67313 525.35822 94.37551 1320.27748
15.75000 -1753.19800 0.35596 -45.84584 516.77932 96.77787 1298.52236
15.85000 -1746.76493 0.98939 -54.27444 536.37728 107.98653 1299.17193
15.95000 -1746.85694 -0.55251 -86.43004 548.19269 123.30591 1296.00750
16.05000 -1747.40835 1.28634 -47.98838 492.21399 144.76594 1282.31534
16.15000 -1716.83355 1.23043 -20.45809 495.40200 95.86882 1285.66678
16.25000 -1714.80212 3.76272 -89.53060 500.22377 85.67224 1273.06967
16.35000 -1717.55193 -2.25559 -81.20464 497.02278 89.43573 1257.54798
16.45000 -1722.85433 -0.82776 -35.90669 514.58195 225.31402 1240.45871
16.55000 -1706.07413 -0.17181 -23.88944 495.97193 88.35004 1231.33825
16.65000 -1688.31558 1.18391 -93.86957 493.16014 88.03525 1243.63333
16.75000 -1686.18275 -1.02621 -28.69712 494.73610 158.69487 1234.88932
16.85000 -1675.19972 -1.53179 -63.46813 488.96174 190.27882 1236.08469
16.95000 -1667.21352 1.69123 -73.22994 502.44191 91.84357 1231.55603
17.05000 -1660.62483 -0.51038 -11.79648 484.61475 103.85445 1215.61247
17.15000 -1661.83026 2.45365 -53.71940 480.26353 103.96210 1209.07779
17.25000 -1653.85291 1.21049 -30.53067 500.90835 103.35076 1195.30786
17.35000 -1640.03072 -0.00032 -64.65635 473.59876 95.41071 1200.30945
17.45000 -1638.37182 0.37166 -25.32961 518.87902 276.13857 1190.83150
17.55000 -1627.74212 -2.65291 -58.96236 459.47625 84.74185 1194.43119
17.65000 -1626.48923 1.53633 -54.08595 458.56190 112.30093 1179.01920
17.75000 -1627.56540 0.10656 -90.51356 454.61858 82.11063 1160.59803
17.85000 -1597.51877 0.48712 -61.47398 525.77564 392.87439 1202.00632
17.95000 -1603.28741 1.82035 -96.21074 457.89044 74.04622 1162.79642
18.05000 -1596.02292 0.15889 -41.70156 459.93613 71.88252 1153.01472
18.15000 -1576.67393 -1.94653 -42.43577 466.26540 131.13371 1167.33025
18.25000 -1566.75618 -0.36301 -45.00897 506.00347 84.78706 1187.19616
18.35000 -1546.40166 1.52582 -30.17002 474.09217 104.67813 1168.67994
18.45000 -1542.70493 3.11803 -46.77216 466.13115 84.59508 1164.35409
18.55000 -1531.65793 0.78316 -4.16386 490.56164 91.36994 1172.04939
18.65000 -1546.47865 -0.20500 -27.17590 498.56312 477.20777 1162.65300
18.75000 -1532.66852 -1.80682 -33.55948 463.02040 101.98020 1147.11304
18.85000 -1523.14880 1.60601 -86.50397 451.20770 77.87539 1139.54334
18.95000 -1509.79259 1.97297 -12.62216 450.70204 178.34716 1137.80853
19.05000 -1525.84332 -0.41769 -58.33274 438.97549 106.03907 1109.60617
19.15000 -1518.55642 0.57127 -24.44438 574.37448 355.72832 1108.36664
19.25000 -1510.68890 1.37694 -36.52057 427.93095 74.80671 1099.12424
19.35000 -1488.36080 0.17573 -43.06597 457.45999 86.71814 1118.14081
19.45000 -1486.64902 0.57670 -59.17453 438.48901 77.66094 1103.70676
19.55000 -1486.21073 0.13738 -49.71194 426.60301 72.43931 1094.26263
19.65000 -1472.21015 0.19646 -21.90746 428.20318 64.10447 1096.31476
19.75000 -1481.68529 0.20378 -34.17610 421.87195 96.04725 1072.08669
19.85000 -1456.44180 1.14736 -62.06840 430.50888 90.17194 1088.89904
19.95000 -1453.91997 -1.66957 -9.45318 446.05078 177.02382 1083.88611
