0.120000 2.644610
0.380000 2.746450
0.620000 2.777370
0.880000 2.739610
1.120000 2.739580
1.380000 2.749860
1.620000 2.726260
1.880000 2.728640
2.120000 2.744790
2.380000 2.741240
2.620000 2.738240
2.880000 2.720450
3.120000 2.732630
3.380000 2.738490
3.620000 2.740920
3.880000 2.740560
4.120000 2.745430
4.380000 2.768430
4.620000 2.778990
4.880000 2.805100
5.120000 2.826990
5.380000 2.829290
5.620000 2.938530
5.880000 2.948550
6.120000 3.036520
6.380000 3.080240
6.620000 3.032740
6.880000 2.970670
7.120000 2.917720
7.380000 2.830190
7.620000 2.809670
7.880000 2.585810
8.120000 2.437180
8.380000 2.090500
8.620000 1.899270
8.880000 1.709060
9.120000 1.499740
9.380000 1.525770
9.620000 0.866260
9.880000 1.347410
10.120000 1.345140
10.380000 1.034720
10.620000 0.962050
10.880000 2.803900
11.120000 2.232970
11.380000 1.860430
11.620000 1.826930
11.880000 2.009990
12.120000 2.312210
12.380000 2.035290
12.620000 2.127110
12.880000 1.581250
13.120000 1.072570
13.380000 -2.951230
13.620000 -1.052850
13.880000 -1.924180
14.120000 -2.441920
14.380000 -2.981840
14.620000 2.628280
14.880000 2.361450
