0.125 -0.000 -0.001 0.009
0.375 0.001 -0.002 0.094
0.625 -0.005 -0.008 0.378
0.875 -0.025 -0.015 0.806
1.125 -0.010 0.001 1.347
1.375 -0.025 -0.000 1.898
1.625 -0.054 0.016 2.556
1.875 -0.073 0.009 3.184
2.125 -0.090 -0.025 3.954
2.375 -0.046 -0.019 4.641
2.625 -0.136 -0.023 5.659
2.875 -0.141 -0.031 6.924
3.125 -0.147 -0.020 8.369
3.375 -0.194 -0.010 9.967
3.625 -0.213 -0.079 11.662
3.875 -0.202 -0.038 13.231
4.125 -0.237 -0.061 14.350
4.375 -0.264 -0.037 15.491
4.625 -0.180 -0.067 16.641
4.875 -0.254 -0.008 17.352
5.125 -0.275 -0.028 18.265
5.375 -0.222 -0.101 19.364
5.625 -0.306 -0.032 19.696
5.875 -0.239 -0.084 20.996
6.125 -0.278 -0.089 22.124
6.375 -0.283 -0.091 22.633
6.625 -0.276 -0.086 23.523
6.875 -0.255 -0.110 24.149
7.125 -0.288 -0.072 24.436
7.375 -0.302 -0.001 24.849
7.625 -0.266 -0.051 25.313
7.875 -0.305 -0.020 25.432
8.125 -0.320 -0.035 25.962
8.375 -0.390 -0.012 26.293
8.625 -0.349 -0.072 26.534
8.875 -0.362 -0.007 26.542
9.125 -0.378 0.008 26.237
9.375 -0.373 -0.024 26.139
9.625 -0.364 -0.040 26.859
9.875 -0.349 0.013 26.232
10.125 -0.374 -0.001 26.776
10.375 -0.378 -0.017 26.265
10.625 -0.380 0.010 26.561
10.875 -0.361 -0.020 25.980
11.125 -0.386 -0.049 25.892
11.375 -0.391 -0.002 25.305
11.625 -0.450 -0.069 24.561
11.875 -0.406 0.008 23.954
12.125 -0.375 -0.069 23.777
12.375 -0.336 -0.023 22.786
12.625 -0.337 -0.072 21.853
12.875 -0.345 -0.071 21.801
13.125 -0.361 -0.084 21.596
13.375 -0.295 -0.090 20.331
13.625 -0.282 -0.037 19.409
13.875 -0.306 -0.052 19.574
14.125 -0.266 -0.081 19.520
14.375 -0.270 -0.049 18.612
14.625 -0.277 -0.077 18.030
14.875 -0.223 -0.097 16.839
15.125 -0.218 -0.082 17.399
15.375 -0.203 -0.097 16.729
15.625 -0.185 -0.071 16.437
15.875 -0.160 -0.062 15.609
16.125 -0.148 -0.063 15.347
16.375 -0.153 -0.059 14.008
16.625 -0.134 -0.047 13.562
16.875 -0.136 -0.055 13.579
17.125 -0.104 -0.032 12.316
17.375 -0.089 -0.015 12.212
17.625 -0.069 -0.003 11.668
17.875 -0.074 -0.007 10.965
18.125 -0.090 0.024 10.626
18.375 -0.072 0.017 10.582
18.625 -0.062 0.029 10.095
18.875 -0.092 0.033 10.163
19.125 -0.087 0.026 9.702
19.375 -0.073 0.034 9.184
19.625 -0.061 0.021 9.032
19.875 -0.068 0.028 8.490
