0.2 1.47923 22.11 1.17642 86.62237 85.54088 70.22174
0.6 -0.26248 45.7805 -0.99285 85.90978 82.0689 68.16605
1.0 0.01108 65.14567 -0.63605 84.27159 77.28099 65.86539
1.4 -1.17904 80.01017 0.28642 82.98632 72.97555 62.48925
1.8 0.63071 90.17019 -0.86103 80.61556 69.69625 59.52345
2.2 -0.0471 100.16102 0.09088 77.11842 64.93786 57.18917
2.6 -0.06414 109.35419 0.20976 73.0256 62.56647 54.74352
3.0 -0.27375 119.25693 -0.64672 68.27237 59.56268 52.65219
3.4 0.63469 130.34897 0.51021 63.53912 56.60707 50.29658
3.8 0.81641 140.19414 0.67373 57.87177 53.92971 47.94736
4.2 0.05317 151.35911 0.75766 52.29952 50.10648 45.58951
4.6 0.60686 159.97354 0.26757 48.45488 45.63021 43.28216
5.0 0.10746 168.52229 0.25407 45.52139 41.52581 40.5109
5.4 0.72653 174.85167 0.1999 43.31516 38.34085 38.4111
5.8 -0.09761 180.02339 -0.05502 41.7059 35.74988 36.63279
6.2 0.24787 184.26059 0.42364 39.94924 33.91338 34.46972
6.6 0.33408 188.15795 0.20033 38.67921 32.23017 32.90794
7.0 0.42369 190.99205 0.09944 37.02057 30.84608 31.70393
7.4 0.17241 193.93763 0.06177 35.80649 29.505 30.35244
7.8 0.04409 196.5939 0.08943 34.90096 28.08651 28.99341
8.2 -0.11415 198.68395 -0.25821 33.10457 26.92218 27.91899
8.6 -0.45447 200.40443 0.11067 32.27463 25.77082 26.6639
9.0 0.06435 201.52005 -0.783 30.72164 24.53838 25.6197
9.4 -0.37738 202.9385 -0.57088 29.68389 23.3834 24.51257
9.8 -0.57663 203.79923 -0.67127 28.90266 22.57901 23.59846
10.2 -0.96918 205.12377 -0.69769 27.81643 22.17297 22.81636
10.6 -0.44819 206.2229 -0.71826 26.75514 21.08686 21.75598
11.0 0.08993 207.65334 -0.50349 26.01928 20.25941 21.08369
11.4 0.1446 208.5297 -0.10368 25.38272 19.62263 20.11145
11.8 0.18249 209.35446 -0.01718 24.10583 18.84235 19.42582
12.2 -0.12508 210.44177 -0.4433 23.74023 18.0155 18.87589
12.6 0.36667 210.30878 -0.67394 23.07144 17.61976 18.20013
13.0 0.23948 210.6201 -0.86024 22.56121 16.70035 17.66027
13.4 0.18768 210.85941 -0.32367 21.58493 15.89181 17.08928
13.8 0.52453 210.91173 0.29553 21.25252 15.4514 16.47034
14.2 -0.30209 210.50442 0.33318 20.35976 15.36688 15.81899
14.6 0.16881 210.22594 0.55156 19.92354 14.82302 15.30484
15.0 -0.16912 210.72742 1.04753 19.00096 14.6789 14.94166
15.4 0.60125 210.63963 1.04782 18.59177 14.163 14.1014
15.8 0.44044 210.88513 1.1696 18.00592 13.51623 13.91034
16.2 0.23346 210.6533 1.35357 17.08259 13.29945 13.5398
16.6 0.4317 210.95117 1.21931 17.27512 12.82729 12.73849
17.0 0.64329 211.46521 0.75065 16.04838 12.41049 12.31385
17.4 0.87996 211.3786 0.74142 16.46221 12.19833 11.8139
17.8 0.74566 211.89025 0.39407 15.36943 11.99571 11.55097
18.2 1.16589 211.98674 -0.01883 15.17819 11.16792 11.27822
18.6 1.14832 211.73989 -0.00528 14.70759 10.68972 10.46059
19.0 0.8177 211.12657 -0.42631 14.84325 10.79486 10.50056
19.4 0.62379 211.1202 -0.42493 14.07666 9.87422 10.38811
19.8 -0.03653 210.44773 -0.6012 14.28814 10.01149 10.28998
