0.125 0.005 -0.005 0.052
0.375 0.014 -0.010 0.552
0.625 0.016 -0.042 1.171
0.875 -0.025 -0.013 1.651
1.125 -0.040 -0.059 1.981
1.375 -0.011 -0.064 2.185
1.625 -0.011 -0.060 2.445
1.875 -0.007 -0.036 2.641
2.125 0.005 -0.019 2.986
2.375 -0.009 -0.070 3.442
2.625 -0.003 -0.083 4.161
2.875 -0.032 -0.087 5.168
3.125 -0.042 -0.108 6.277
3.375 -0.060 -0.126 7.891
3.625 -0.077 -0.213 9.901
3.875 -0.090 -0.235 12.145
4.125 -0.132 -0.245 14.176
4.375 -0.094 -0.296 16.555
4.625 -0.072 -0.299 18.638
4.875 -0.132 -0.367 20.364
5.125 -0.150 -0.338 21.605
5.375 -0.187 -0.374 23.173
5.625 -0.161 -0.391 23.711
5.875 -0.222 -0.435 24.353
6.125 -0.211 -0.377 24.526
6.375 -0.218 -0.346 24.139
6.625 -0.292 -0.319 24.125
6.875 -0.249 -0.317 23.868
7.125 -0.284 -0.322 23.831
7.375 -0.247 -0.309 23.881
7.625 -0.274 -0.259 23.291
7.875 -0.273 -0.270 23.616
8.125 -0.237 -0.248 23.130
8.375 -0.260 -0.304 23.150
8.625 -0.301 -0.234 21.915
8.875 -0.295 -0.243 21.831
9.125 -0.285 -0.260 21.863
9.375 -0.295 -0.207 21.323
9.625 -0.296 -0.277 20.612
9.875 -0.356 -0.258 20.981
10.125 -0.345 -0.248 20.888
10.375 -0.311 -0.245 20.721
10.625 -0.283 -0.270 21.092
10.875 -0.334 -0.206 19.613
11.125 -0.338 -0.287 19.997
11.375 -0.335 -0.223 18.842
11.625 -0.319 -0.224 18.508
11.875 -0.337 -0.228 17.995
12.125 -0.326 -0.214 17.210
12.375 -0.265 -0.191 15.787
12.625 -0.308 -0.225 15.488
12.875 -0.273 -0.181 14.435
13.125 -0.276 -0.209 13.730
13.375 -0.233 -0.183 12.874
13.625 -0.230 -0.182 12.042
13.875 -0.203 -0.158 11.017
14.125 -0.204 -0.168 11.081
14.375 -0.170 -0.150 10.149
14.625 -0.154 -0.156 9.562
14.875 -0.142 -0.162 9.504
