0.05000 -1082.02083 -70.41042 -63952.63165 1212.23020 1167.38099 526396.55790
0.15000 -2705.83525 56.35871 79372.84976 1618.97169 1388.57277 468413.90710
0.25000 -4679.21743 115.53973 -74.32188 1617.67485 1289.72793 388353.93093
0.35000 -5617.53661 61.44086 -7175.53528 1326.87935 1159.82364 414448.83381
0.45000 -6350.75047 51.73342 22551.56083 1509.25419 1037.17784 360647.16426
0.55000 -7001.57598 23.75831 15217.76453 1451.91008 939.30191 380217.67848
0.65000 -7428.61806 8.59754 -12285.15578 1508.90789 855.21630 429709.97138
0.75000 -7713.98439 43.32893 -2581.66586 1525.25648 865.56018 364611.36025
0.85000 -7945.14394 24.85446 1526.16818 1497.92465 810.77735 384333.92081
0.95000 -8180.55251 14.54250 -2783.37186 1528.28850 717.66242 301845.89504
1.05000 -8307.12040 13.12218 -10028.41910 1442.91266 681.82484 272782.56023
1.15000 -8381.91589 20.94532 2495.51924 1436.14035 721.24470 278233.37470
1.25000 -8445.98311 29.82446 4753.45119 1348.61249 657.13202 290275.09476
1.35000 -8424.27285 41.48711 -4529.36360 1285.47906 653.65681 266104.17218
1.45000 -8458.91594 46.12087 2652.40526 1245.30050 644.02116 265898.53361
1.55000 -8441.43454 38.83165 2382.31903 1156.60972 624.96988 261695.59933
1.65000 -8365.09690 24.41283 5265.23560 1060.02447 618.25236 229327.55325
1.75000 -8321.18546 36.06688 -1623.22731 1043.56410 641.54995 244513.56492
1.85000 -8287.39349 38.03043 -2858.29598 984.29746 651.35671 213569.10884
1.95000 -8236.06590 26.62973 -1339.84611 915.65901 648.48696 219486.59042
2.05000 -8214.48581 35.57531 -2076.63576 847.09000 631.57212 239349.54023
2.15000 -8184.03919 36.34501 -1796.36117 783.06051 640.41216 191630.46129
2.25000 -8156.01748 56.35469 -7974.89780 740.46788 642.90283 199872.53040
2.35000 -8131.90494 49.49749 1147.45777 698.81270 654.52615 192391.53506
2.45000 -8092.42152 49.93326 -2156.91377 667.12680 627.24612 179133.83585
2.55000 -8061.31921 35.38359 -1597.80671 624.32793 627.19153 185378.79392
2.65000 -8030.58853 40.61881 -3059.12825 607.47645 615.39902 155351.62341
2.75000 -8018.95470 38.47251 -155.36632 552.57282 631.33969 164359.60328
2.85000 -7967.88303 41.78278 -801.36697 519.99491 606.99939 158613.87769
2.95000 -7916.68672 42.95814 -2077.04830 502.08765 602.96558 141822.30698
3.05000 -7870.03647 47.03410 -2484.01456 472.95300 600.60799 140189.93480
3.15000 -7828.73615 29.12270 960.26795 434.37109 582.72610 141312.67302
3.25000 -7765.53028 30.58493 -58.41932 437.26751 581.57676 124970.96036
3.35000 -7705.35575 42.05266 -350.65506 411.78215 575.32019 134914.03632
3.45000 -7657.16941 29.31438 -1373.65291 374.08026 552.92289 124058.48085
3.55000 -7598.67468 39.08476 -784.18843 372.42129 546.96039 123034.07742
3.65000 -7541.64402 38.57472 2131.88504 339.75127 530.79832 112253.92417
3.75000 -7499.12905 21.36322 -1657.46450 366.40848 522.92601 106742.34668
3.85000 -7459.60344 28.79119 -1386.19159 357.85562 515.79306 108734.01538
3.95000 -7424.10090 23.15393 -322.12284 376.45395 515.86384 116013.87491
4.05000 -7363.00373 18.69585 2241.64752 362.84540 488.35352 91253.48625
4.15000 -7317.54993 27.83555 763.55319 372.25702 472.69638 102981.46739
4.25000 -7261.59234 29.59612 -223.24296 350.27598 446.75754 92241.08474
4.35000 -7221.06985 19.63245 401.36390 372.39997 445.77739 90272.86414
4.45000 -7169.13219 31.09340 -2147.91596 347.42985 413.68392 87072.73694
4.55000 -7101.32019 29.69740 -53.30422 353.48716 407.40274 85974.99963
4.65000 -7035.04640 30.30049 1090.21418 367.04490 395.01058 101653.98519
4.75000 -6965.52363 21.29471 -435.47125 341.97462 373.15093 80146.86321
4.85000 -6914.22264 23.27197 1353.09068 344.19531 354.00639 74092.60749
4.95000 -6868.11817 31.63971 2781.67060 353.97144 347.60412 73818.33742
5.05000 -6805.52886 26.90933 675.46905 336.59988 341.07243 66943.66371
5.15000 -6757.20456 19.05319 218.99591 347.14848 340.24492 72895.46298
5.25000 -6695.32683 25.06400 819.88426 348.38149 340.58563 64515.53749
5.35000 -6652.86759 26.43518 210.12804 343.50766 315.77912 58940.46953
5.45000 -6602.40829 22.14003 84.68816 334.65189 304.18708 63519.19678
5.55000 -6553.21145 21.02793 -634.67868 321.53076 288.15317 56295.89133
5.65000 -6499.02856 28.50193 375.72138 328.87686 305.66947 58163.75366
5.75000 -6459.73298 28.65137 772.91727 317.95739 284.16068 54098.21638
5.85000 -6419.76555 24.88507 1874.31395 287.69253 286.40757 115631.14928
5.95000 -6365.21667 22.49911 -540.86292 275.84076 273.45042 50373.27454
6.05000 -6319.89629 25.29618 402.33113 308.25658 269.34042 51114.87385
6.15000 -6271.46321 22.49239 581.84343 277.11702 266.81240 57055.51204
6.25000 -6227.86287 19.22293 319.09045 283.81054 256.32978 43183.30357
6.35000 -6173.51641 13.72093 346.11263 291.77433 265.40707 50332.57245
6.45000 -6131.84174 20.17660 890.51968 277.72452 251.99409 43745.68030
6.55000 -6083.70562 19.38177 -125.29668 245.22366 244.71001 39840.31681
6.65000 -6035.44070 18.38393 1019.13283 246.15791 243.30618 41513.63151
6.75000 -5985.08441 20.21016 -1063.42615 234.33628 260.20546 40542.17197
6.85000 -5932.02186 17.08679 74.08843 230.43347 237.91325 39243.65594
6.95000 -5887.66182 15.41652 431.30683 226.90088 201.39490 35700.89190
7.05000 -5841.77698 18.18281 146.58057 247.86995 212.80951 34439.81823
7.15000 -5787.77804 19.49509 44.63640 215.73385 214.73292 44558.84612
7.25000 -5740.12022 18.59451 123.16092 229.91541 224.30126 31668.64461
7.35000 -5699.23734 11.49690 188.04532 203.92750 206.12355 45645.23631
7.45000 -5654.34302 12.78230 -334.60153 198.95153 203.29340 35383.03826
7.55000 -5598.22897 14.62522 -331.55638 230.21564 200.16378 30307.85003
7.65000 -5565.35065 11.02432 -683.77656 221.77358 201.28430 27604.56370
7.75000 -5518.40363 15.16176 789.48707 193.97837 183.12341 77098.72136
7.85000 -5484.05010 13.11853 -426.23777 225.34828 186.78317 33773.80226
7.95000 -5431.99388 11.05543 -74.40005 204.49284 201.07096 30502.74362
8.05000 -5385.24052 12.94702 -290.84073 180.74580 179.50713 44834.48117
8.15000 -5334.74431 10.18308 597.53966 187.12898 162.71518 37256.59268
8.25000 -5291.26431 12.18529 -588.14665 163.02362 169.10913 27258.86101
8.35000 -5252.80072 12.62378 332.72488 172.99897 173.17973 22538.86992
8.45000 -5206.86641 11.06984 -48.85308 177.15785 158.01598 22493.54919
8.55000 -5162.48754 15.25561 1063.65341 184.36025 161.36300 24294.75895
8.65000 -5126.68505 13.99442 -924.00124 158.41767 160.91795 25427.83042
8.75000 -5087.13340 13.42741 -158.54441 225.95380 169.91372 25827.78782
8.85000 -5047.94484 13.05785 -1.67887 183.82950 190.05494 36168.28463
8.95000 -4993.56724 9.39629 -353.30824 194.19327 154.92201 22828.19697
9.05000 -4959.86531 10.02195 113.68471 186.79032 168.17693 20569.77027
9.15000 -4910.94366 13.48797 -268.50769 145.61723 134.42455 22200.34733
9.25000 -4861.14940 9.84806 -119.21206 189.47523 185.14353 19834.64619
9.35000 -4824.14258 10.90903 258.75227 167.83992 161.61989 21228.75785
9.45000 -4778.25961 7.87917 223.09061 138.97235 165.90108 17001.92486
9.55000 -4733.07942 13.10771 -214.79529 198.19677 145.39087 18453.84453
9.65000 -4698.42067 9.29662 11.70990 191.03268 152.08013 17619.97440
9.75000 -4657.92914 10.12309 32.60926 176.25296 141.02038 16071.03600
9.85000 -4621.23868 8.47246 -63.30236 212.40174 163.23297 17566.84446
9.95000 -4593.04832 9.86642 233.37528 156.20370 153.66983 17533.99956
10.05000 -4554.50027 12.32935 -306.28918 138.11833 135.66581 18220.91398
10.15000 -4522.06332 13.75699 208.53585 152.82986 144.31621 14386.77500
10.25000 -4487.51852 10.90943 -305.80726 191.11034 184.38461 14151.31040
10.35000 -4453.84486 13.66882 -17.40115 143.46284 129.43751 13079.76694
10.45000 -4416.13324 8.53553 238.56962 153.67483 128.12826 12210.93803
10.55000 -4381.96147 7.08033 280.35587 135.32962 108.11199 15108.31049
10.65000 -4348.19707 10.15089 284.55028 168.38087 147.31342 14888.27433
10.75000 -4311.47159 10.69399 -15.36706 161.41655 139.55555 10543.09730
10.85000 -4278.55493 12.97561 -60.23735 144.61798 137.71862 14204.81149
10.95000 -4248.15763 12.44267 193.81272 153.59303 146.24478 11954.92060
11.05000 -4212.30239 11.85956 299.54452 164.73240 146.69835 12286.39370
11.15000 -4179.43330 9.60958 449.75091 153.70909 129.24940 12648.74503
11.25000 -4152.16747 8.11103 -12.94012 137.21164 139.38728 10988.49941
11.35000 -4119.20986 9.29751 192.59617 115.40789 112.38380 10303.57713
11.45000 -4083.70283 5.85539 -359.44129 132.00567 189.23655 10720.63987
11.55000 -4047.03006 11.95286 389.30250 149.37336 145.96455 12411.95228
11.65000 -4020.54963 2.59264 -242.98263 131.55948 133.52007 11657.14125
11.75000 -3984.63580 14.02008 90.75447 157.43602 148.59296 9242.82767
11.85000 -3957.50924 9.60185 212.23100 141.77707 110.48572 9974.37838
11.95000 -3923.34860 10.78592 90.15303 176.22180 153.96633 10297.60779
12.05000 -3902.79054 9.62687 -372.33462 160.05995 96.85894 9416.19926
12.15000 -3871.52274 7.52855 1666.47390 139.57847 115.41895 65236.48224
12.25000 -3840.47263 9.45787 12.36119 127.70532 107.02694 8453.74212
12.35000 -3810.10207 9.21190 -78.09361 123.07383 109.50142 7183.11014
12.45000 -3786.14702 11.67257 113.74160 127.14312 100.72099 8063.30416
12.55000 -3753.44913 7.99167 -85.61480 120.68877 122.78529 7440.29844
12.65000 -3728.71781 12.36374 -191.36602 134.53100 96.55402 7688.47838
12.75000 -3698.44685 14.25196 156.76959 151.45468 131.40339 7254.44179
12.85000 -3675.58325 19.28231 -164.67225 91.22874 119.25895 6777.01649
12.95000 -3651.27551 14.58593 150.79282 120.59191 87.13023 6763.12439
13.05000 -3622.38995 17.48945 143.53941 87.29454 78.66335 6334.96448
13.15000 -3596.44982 15.67844 -7.93158 82.29403 78.55612 6107.26711
13.25000 -3572.38701 16.48294 -16.68967 78.81926 97.29640 6770.78362
13.35000 -3544.06046 13.20001 290.69416 101.86290 107.05268 5359.49638
13.45000 -3518.50874 14.38369 66.15867 84.39897 84.58569 8636.25754
13.55000 -3492.64599 16.18008 85.31648 100.54673 84.68562 6095.03817
13.65000 -3472.23049 13.47880 89.40843 89.45627 93.22704 5890.50427
13.75000 -3443.49851 16.52805 116.68954 80.56406 73.20947 5413.26596
13.85000 -3422.14517 16.64809 122.46848 90.14599 79.40295 5433.34007
13.95000 -3398.66891 15.31516 9.56634 90.40836 85.67496 6344.65472
14.05000 -3370.97610 13.43370 -56.43827 87.34245 88.38148 4602.50784
14.15000 -3351.25407 13.94669 -0.60369 74.39991 78.91510 5681.44942
14.25000 -3326.90250 11.91849 208.64223 76.70602 74.45383 5496.39348
14.35000 -3305.45103 12.80844 -93.80424 87.62192 88.79920 4290.43424
14.45000 -3281.96297 10.36512 -4.29323 99.33231 99.87338 4687.73398
14.55000 -3265.35460 11.95551 -68.64710 79.42058 68.74647 4478.49708
14.65000 -3238.76780 13.52921 142.09068 77.39221 70.39756 4943.83999
14.75000 -3217.78596 9.93549 141.48482 62.32954 84.83950 4202.54682
14.85000 -3192.71817 11.67328 271.48971 74.07519 71.28778 3887.07487
14.95000 -3173.31239 14.45321 47.85149 79.99287 66.79088 3991.95779
15.05000 -3149.18675 13.83978 13.66043 63.31965 75.81033 3806.54134
15.15000 -3128.39570 13.25064 31.39926 101.07175 70.06673 4682.63735
15.25000 -3106.47390 11.37278 31.40943 62.02811 63.23276 4120.69405
15.35000 -3086.61336 14.24092 -64.54082 63.61544 61.95979 3975.74476
15.45000 -3062.96848 10.22209 -72.95674 60.75543 56.72393 3762.00849
15.55000 -3041.24197 9.05225 47.70270 69.91897 71.77767 4342.66388
15.65000 -3022.49781 14.41935 -36.93892 63.19408 70.09576 3891.08533
15.75000 -3001.08941 13.33172 -95.59212 71.58828 67.31237 3528.38441
15.85000 -2978.98271 12.24902 -159.37518 86.26722 65.96859 3742.10892
15.95000 -2958.71540 11.32887 107.26354 56.43593 63.26979 3215.44258
16.05000 -2939.08336 11.07101 -155.19342 62.98359 71.77772 3504.27233
16.15000 -2921.36396 6.64455 57.81275 112.80539 100.54831 3267.86736
16.25000 -2898.50989 14.42983 20.57168 152.50651 116.06080 2849.10780
16.35000 -2881.19914 13.40851 -48.89786 54.07392 68.78640 2983.15348
16.45000 -2868.68321 13.65545 -11.03565 50.24511 52.78903 2833.88546
16.55000 -2848.60740 7.46520 96.65375 70.52767 77.12364 3160.70984
16.65000 -2826.89639 9.32820 72.92439 62.67834 51.75675 2815.29896
16.75000 -2808.51705 4.26740 272.34842 106.20442 174.56027 4691.50337
16.85000 -2792.88368 9.67103 -109.99267 69.98124 64.13402 2427.74049
16.95000 -2771.70482 4.14274 43.74595 129.95244 117.00149 3815.08712
17.05000 -2757.24743 11.29073 26.52224 52.39417 53.65361 2637.13585
17.15000 -2740.87568 8.25779 -44.39398 53.43764 58.77784 2586.89883
17.25000 -2722.92595 3.64100 108.63056 61.65666 75.12987 2286.38327
17.35000 -2706.50693 11.54286 71.40271 43.79849 55.49495 2496.94306
17.45000 -2685.43557 9.70273 -18.53132 56.88339 57.41023 2158.40950
17.55000 -2672.22994 7.69865 -56.70470 58.29531 51.83727 2237.93707
17.65000 -2647.90356 11.14422 -184.42703 120.16887 66.43878 2593.87205
17.75000 -2636.33480 7.95920 -10.64426 48.54540 65.06803 2075.90213
17.85000 -2615.03976 8.59246 -205.80255 150.65965 78.99523 1742.06099
17.95000 -2604.61629 10.50651 17.84517 44.71297 41.26165 2280.20369
18.05000 -2587.76524 5.04890 -119.06985 48.98345 89.32498 1947.52521
18.15000 -2571.78423 7.82906 150.35413 52.99816 44.72988 2898.69521
18.25000 -2562.65362 11.37838 17.50189 89.50400 88.21388 1659.48213
18.35000 -2542.13255 8.08511 -51.47355 50.17547 60.56911 1868.17057
18.45000 -2526.05047 9.50342 8.91241 42.53406 44.22044 1629.45686
18.55000 -2507.65724 8.33825 -93.81746 63.73179 58.27193 1618.45628
18.65000 -2493.81989 6.99712 -80.03666 41.15206 58.12808 2118.46184
18.75000 -2482.11896 9.19936 44.35845 53.97801 40.67359 1285.79532
18.85000 -2460.56769 9.21155 -82.81191 144.42416 46.08984 1988.02804
18.95000 -2448.14896 6.63861 -22.69875 44.65016 60.46764 1265.44992
19.05000 -2438.21293 11.44622 -63.87783 52.46267 50.09808 1675.37442
19.15000 -2418.86518 5.10280 -29.48298 41.55679 46.35523 1398.66027
19.25000 -2402.21845 7.77750 10.51641 69.87901 72.03870 1968.42883
19.35000 -2390.86484 6.41868 -68.12555 74.69298 48.74397 1672.05180
19.45000 -2382.95086 11.03196 -59.59856 53.08736 56.72195 1589.79615
19.55000 -2370.46373 4.75334 -91.49267 40.49542 29.23345 1451.47221
19.65000 -2355.35530 10.44412 -8.10166 57.32575 47.83096 1372.00103
19.75000 -2341.73023 5.69424 -95.26633 46.07079 39.39470 1686.07136
19.85000 -2326.23344 6.25482 -63.69612 36.66731 51.87595 1275.98828
19.95000 -2316.37540 6.80115 -147.92359 30.19842 27.84130 1324.32513
