0.125 -0.000 -0.000 0.000
0.375 0.001 0.000 0.015
0.625 0.003 -0.003 0.085
0.875 0.001 0.014 0.296
1.125 -0.000 -0.001 0.656
1.375 -0.010 0.009 1.242
1.625 0.023 0.018 1.972
1.875 0.002 0.005 2.934
2.125 0.006 0.001 4.044
2.375 0.045 0.016 5.273
2.625 0.004 0.023 6.617
2.875 0.044 0.030 7.903
3.125 0.025 0.010 9.465
3.375 0.015 0.024 10.751
3.625 -0.010 0.012 12.263
3.875 0.070 0.022 13.774
4.125 0.058 0.045 14.758
4.375 0.001 0.058 16.424
4.625 0.021 0.044 17.683
4.875 0.011 0.083 18.681
5.125 0.005 0.079 20.190
5.375 -0.064 0.038 20.906
5.625 0.047 0.127 21.770
5.875 0.083 0.079 22.529
6.125 -0.015 0.037 23.884
6.375 0.021 0.068 24.688
6.625 0.020 0.116 25.228
6.875 0.027 0.100 26.241
7.125 0.028 0.116 26.742
7.375 0.027 0.103 26.654
7.625 0.007 0.061 27.387
7.875 0.018 0.103 27.531
8.125 0.023 0.151 27.567
8.375 -0.022 0.174 27.549
8.625 -0.032 0.134 27.605
8.875 -0.040 0.087 26.563
9.125 -0.026 0.150 26.789
9.375 -0.017 0.154 26.262
9.625 -0.016 0.162 26.399
9.875 -0.027 0.151 26.124
10.125 -0.027 0.090 26.379
10.375 -0.052 0.183 26.630
10.625 -0.080 0.113 26.684
10.875 -0.014 0.134 26.653
11.125 -0.073 0.142 25.803
11.375 -0.103 0.145 25.672
11.625 -0.081 0.123 25.400
11.875 -0.029 0.115 24.528
12.125 -0.036 0.119 24.113
12.375 -0.003 0.088 23.102
12.625 -0.052 0.131 21.778
12.875 -0.011 0.111 21.418
13.125 -0.021 0.069 20.376
13.375 0.004 0.112 20.437
13.625 -0.057 0.143 21.064
13.875 -0.043 0.138 21.634
14.125 -0.067 0.126 20.424
14.375 -0.081 0.121 20.645
14.625 -0.021 0.069 19.701
14.875 -0.078 0.118 17.430
