0.125 0.000 0.001 0.003
0.375 0.001 0.003 0.068
0.625 -0.004 -0.000 0.321
0.875 -0.005 0.001 0.904
1.125 0.006 -0.014 1.793
1.375 -0.020 -0.025 3.016
1.625 -0.021 -0.052 4.306
1.875 -0.010 -0.060 5.841
2.125 -0.021 -0.043 7.463
2.375 -0.031 -0.059 9.220
2.625 -0.007 -0.052 10.990
2.875 -0.009 -0.080 12.646
3.125 0.022 -0.115 14.142
3.375 -0.030 -0.085 15.577
3.625 -0.021 -0.060 16.828
3.875 -0.057 -0.064 17.877
4.125 -0.027 -0.063 19.136
4.375 -0.030 -0.089 20.688
4.625 -0.089 -0.044 21.845
4.875 -0.044 -0.051 22.918
5.125 -0.026 -0.045 24.011
5.375 -0.004 -0.049 24.771
5.625 -0.017 -0.076 24.508
5.875 -0.082 -0.058 25.042
6.125 -0.110 -0.061 24.963
6.375 -0.074 -0.086 24.842
6.625 -0.115 -0.069 25.445
6.875 -0.135 -0.070 25.347
7.125 -0.130 -0.124 25.566
7.375 -0.125 -0.045 25.842
7.625 -0.139 -0.099 24.409
7.875 -0.073 -0.097 23.644
8.125 -0.075 -0.095 22.819
8.375 -0.076 -0.115 21.997
8.625 -0.067 -0.087 21.428
8.875 -0.072 -0.098 21.291
9.125 -0.086 -0.057 20.631
9.375 -0.071 -0.059 20.726
9.625 -0.058 -0.077 20.018
9.875 -0.034 -0.066 19.093
10.125 -0.096 -0.083 18.993
10.375 -0.107 -0.075 19.321
10.625 -0.118 -0.130 19.090
10.875 -0.096 -0.135 18.342
11.125 -0.061 -0.120 16.936
11.375 -0.099 -0.146 15.595
11.625 -0.052 -0.131 14.501
11.875 -0.023 -0.124 13.194
12.125 -0.010 -0.134 13.208
12.375 -0.014 -0.119 13.477
12.625 -0.005 -0.160 14.181
12.875 0.024 -0.152 13.925
13.125 0.037 -0.119 12.867
13.375 0.028 -0.097 10.863
13.625 0.006 -0.084 9.924
13.875 0.025 -0.068 8.563
14.125 0.023 -0.034 7.950
14.375 0.044 -0.039 7.812
14.625 0.042 -0.025 8.268
14.875 0.040 -0.038 8.865
