0.05000 -262462.54250 -181.91078 9911.88294 139458.71091 154898.64697 240897.74986
0.15000 -141508.89500 190.94847 -1102.56090 57808.12101 30387.89128 113639.39537
0.25000 -84550.99191 20.80968 -997.42737 29273.25036 12687.15240 67522.76558
0.35000 -61021.94983 -23.48863 -1292.49128 19580.59445 10591.92087 47955.57993
0.45000 -48354.90571 95.91538 -173.98863 14401.09223 5933.02829 37030.74960
0.55000 -39705.36116 56.66656 -512.68719 11070.66584 4223.35571 30625.57711
0.65000 -33864.64079 44.45948 -129.87728 9454.65787 3154.83089 25532.61413
0.75000 -29778.09648 -68.78446 -109.43866 9861.92776 6315.35349 22261.97882
0.85000 -26360.34539 -30.82633 158.78614 6894.67679 3086.63950 19189.51159
0.95000 -23903.69853 21.06523 -225.05994 5852.09823 2213.46581 16999.66320
1.05000 -21911.67184 26.52518 -91.54173 5536.01895 2285.81235 15263.52153
1.15000 -20167.22709 -10.31312 68.73880 4719.43788 1873.37148 13821.07972
1.25000 -18615.29747 27.43590 92.85779 4219.37245 1797.45709 12758.39472
1.35000 -17379.90467 -1.35618 -189.00760 3810.45169 1953.14108 11730.40395
1.45000 -16339.47444 -18.61452 22.60296 3484.95626 1832.69719 10797.92149
1.55000 -15371.47415 -5.49339 67.82882 3123.33677 1527.23902 10043.81775
1.65000 -14537.44792 6.82748 322.65584 2980.67637 1856.97061 9361.31013
1.75000 -13780.99573 -1.52743 -25.40113 2610.94246 1326.15579 8826.80711
1.85000 -13111.72731 29.40847 -24.48345 2459.29764 1379.00206 8334.58103
1.95000 -12542.38266 17.38322 133.26181 2477.19237 1482.16431 8386.36214
2.05000 -12013.23776 -21.55523 -27.70734 2105.29526 1263.03344 7408.90769
2.15000 -11477.14183 5.08058 50.38203 2171.44198 1250.86759 7166.60098
2.25000 -11120.12861 4.46190 79.41870 1688.57411 1279.74296 6669.43796
2.35000 -10750.28858 27.52336 72.62862 1684.87359 1622.78978 6384.05427
2.45000 -10411.95458 -11.25475 -160.37411 1371.45179 1124.04095 6039.43646
2.55000 -10133.34383 -9.37554 -52.55131 1781.86140 1513.82068 5813.39721
2.65000 -9900.57732 2.84072 59.67376 1390.54902 970.33418 5384.98611
2.75000 -9622.33919 -3.51432 26.48511 1147.24977 960.07221 5169.93514
2.85000 -9415.35314 17.00499 15.60124 3099.73969 1224.44550 4936.06628
2.95000 -9182.03703 14.68749 -27.09689 1048.74911 980.58576 4638.87503
3.05000 -8982.91486 13.43104 65.05202 1020.69601 917.36866 4478.88236
3.15000 -8824.75212 11.02321 -21.07141 1886.22073 1259.21246 4324.77053
3.25000 -8624.07634 11.17408 -67.86562 940.58321 1050.34861 4020.72049
3.35000 -8506.66951 11.03106 87.46848 950.78266 890.26805 3835.48354
3.45000 -8359.49989 -2.43747 33.18268 682.72443 779.83248 3692.93474
3.55000 -8247.03242 0.55495 45.82511 810.71511 980.85144 3633.06865
3.65000 -8144.37769 5.73589 68.90797 792.01930 1395.29326 3790.99207
3.75000 -8049.87088 6.28628 45.60270 657.88348 736.50130 3379.61428
3.85000 -7960.51892 -11.42610 -37.68781 846.46345 809.86970 3314.90814
3.95000 -7917.50568 -16.91198 43.75868 3956.20886 986.48511 5820.95807
4.05000 -7794.35773 9.92768 48.22272 950.35339 698.25317 3089.51998
4.15000 -7695.03073 3.76170 33.42541 572.04683 670.94221 3021.39445
4.25000 -7634.12674 3.57179 1.92062 639.56831 890.52721 2993.56852
4.35000 -7565.37832 5.83511 72.22092 727.02068 784.62678 3028.19262
4.45000 -7505.05815 -0.22973 8.13072 989.51123 660.52937 3150.04647
4.55000 -7456.36117 17.42595 29.45354 686.09219 693.90764 2754.39497
4.65000 -7394.70162 7.04479 47.98901 598.71281 668.53915 2684.90603
4.75000 -7342.41187 -5.18214 65.78064 793.20769 620.30153 2674.55013
4.85000 -7285.63587 10.59182 -8.97820 516.79169 498.75154 2562.16354
4.95000 -7214.77711 -2.31601 -25.94453 574.23135 560.32583 2508.15846
5.05000 -7166.35026 7.17059 -2.38130 847.63714 549.08461 2484.17747
5.15000 -7117.59248 0.46781 -9.61841 593.13071 539.70366 2356.34161
5.25000 -7065.96852 -1.96995 5.49995 713.48341 698.17923 2407.75496
5.35000 -7009.88311 -0.27079 43.76685 645.74110 449.55106 2312.60428
5.45000 -6952.85733 4.37602 1.53042 701.49891 714.01687 2214.45672
5.55000 -6892.23706 4.42276 19.92048 482.84562 513.57212 2268.07933
5.65000 -6839.69732 -4.99695 9.38535 481.40634 646.13177 2132.96206
5.75000 -6791.74998 -1.48659 57.04288 1430.42134 450.53754 2237.66900
5.85000 -6728.10096 14.67019 13.92695 676.03960 623.18041 2076.23313
5.95000 -6701.44019 1.56771 -56.80326 873.87473 662.84299 1987.22816
6.05000 -6630.29148 11.20366 37.30732 553.10976 384.08966 1973.26914
6.15000 -6592.32850 -1.60508 12.67182 458.53333 394.24964 1878.68347
6.25000 -6543.57106 4.98777 10.19416 427.22157 314.11525 1799.75262
6.35000 -6475.60403 -5.70512 32.70680 497.49319 435.24447 1826.43775
6.45000 -6418.35793 8.10578 -32.26969 479.70931 480.51876 1751.31175
6.55000 -6372.49314 1.65400 16.79707 391.52769 444.53262 1701.90506
6.65000 -6326.62556 -0.53222 30.06077 565.97004 374.93252 1656.83308
6.75000 -6268.70145 8.94188 15.05591 390.72554 336.79673 1613.31098
6.85000 -6230.64932 -2.31932 67.19234 792.88674 630.71194 1987.44674
6.95000 -6152.43094 33.13830 18.07870 623.22285 2059.09083 1941.28353
7.05000 -6095.26260 4.00281 5.89081 479.81357 317.68905 1536.08518
7.15000 -6039.52152 -4.26370 3.21735 321.57757 325.76234 1485.68934
7.25000 -5987.65271 -1.53051 39.38914 332.28319 245.84887 1422.74019
7.35000 -5930.49914 2.42238 51.25257 499.93716 272.15172 2174.04476
7.45000 -5872.02753 2.74237 15.57252 357.78815 278.01611 1402.87969
7.55000 -5814.43407 23.38035 24.57694 462.14272 907.97411 1424.27181
7.65000 -5785.47923 7.07695 38.17698 1176.89688 929.81100 1736.95821
7.75000 -5715.72122 7.87884 15.59267 270.84086 267.10043 1281.76481
7.85000 -5654.51637 -3.26465 8.40133 473.86602 317.88227 1316.03234
7.95000 -5613.95870 0.32501 -3.50854 516.55230 522.68001 1214.94482
8.05000 -5560.68242 7.85638 5.09969 323.18678 221.94498 1194.04139
8.15000 -5508.84002 4.10465 16.68351 295.91299 244.42138 1167.90713
8.25000 -5480.12697 -0.87026 42.51585 908.18607 518.86336 1298.57810
8.35000 -5414.83421 14.28996 23.13662 291.64406 868.37458 1262.69166
8.45000 -5364.59879 0.85690 22.06417 281.66704 209.81314 1101.53128
8.55000 -5355.22595 -88.23859 14.68646 3341.37420 6458.43143 1315.31079
8.65000 -5266.82285 2.61659 -2.99971 665.91204 393.66521 1290.12202
8.75000 -5212.47591 3.92060 36.84906 298.91277 283.98674 1193.20725
8.85000 -5166.37053 6.27060 26.08798 241.35670 284.29218 998.54634
8.95000 -5112.81389 5.82979 6.15367 227.42062 222.28998 972.04200
9.05000 -5073.86906 -0.08301 37.67739 274.55570 195.48750 972.23187
9.15000 -5022.76603 -3.25337 32.83756 428.38658 397.60769 992.02760
9.25000 -4990.47672 1.15884 -15.91012 245.28822 184.28632 944.99646
9.35000 -4943.42439 2.24047 -4.02663 346.18256 424.32070 1048.39102
9.45000 -4900.21954 4.16459 26.94655 246.47414 173.94598 884.06516
9.55000 -4868.46344 1.66173 -2.09940 285.39808 207.19941 883.63565
9.65000 -4826.60378 6.05189 14.30906 327.80844 238.24730 867.81478
9.75000 -4778.21045 5.86631 20.46299 214.29303 151.28041 842.07939
9.85000 -4738.96113 4.92186 -7.97867 300.54697 173.29889 858.27484
9.95000 -4691.10087 -19.76845 34.38130 840.55435 1059.01713 922.32669
10.05000 -4665.72880 -1.22703 1.07280 235.46476 288.49449 847.76219
10.15000 -4631.04591 -9.40949 64.54278 327.88570 455.55997 813.50860
10.25000 -4592.39546 2.93986 10.14240 261.31647 157.18211 765.78495
10.35000 -4554.76265 1.01037 15.50063 187.43141 166.26123 735.49895
10.45000 -4527.36840 2.98778 9.93711 389.14245 144.59455 734.83265
10.55000 -4486.34869 1.65168 15.64087 287.39037 160.28852 722.49705
10.65000 -4459.63401 3.73228 17.99909 330.34785 237.81141 943.56337
10.75000 -4414.97620 4.17647 1.30859 259.51559 122.19448 699.74079
10.85000 -4375.41484 4.43064 29.16293 255.40199 319.02090 695.63446
10.95000 -4348.28558 -0.75354 12.00090 211.87172 212.33585 674.15030
11.05000 -4313.36799 2.92509 14.90991 402.46118 220.61673 666.39783
11.15000 -4279.56087 1.02520 22.48404 306.61276 169.34448 652.15204
11.25000 -4279.17169 -17.00235 21.98609 1627.38357 1049.71755 955.99318
11.35000 -4208.25186 3.77815 5.86357 147.10247 114.32457 622.46787
11.45000 -4178.13397 2.18721 -12.47445 173.47956 106.41800 614.35340
11.55000 -4145.26514 1.39188 10.16377 158.86037 108.74018 602.81812
11.65000 -4123.94417 -2.57689 14.24788 274.66100 399.52875 584.24912
11.75000 -4086.29498 -1.36498 11.46308 116.50839 121.95011 569.03765
11.85000 -4059.75938 5.47524 -13.88561 420.35369 256.17421 721.48278
11.95000 -4025.08431 5.00266 14.21626 141.93161 111.25803 545.69612
12.05000 -3994.20141 3.11067 10.29794 133.39178 170.31983 533.48677
12.15000 -3959.37024 1.80441 -26.22311 123.73796 95.55464 520.34023
12.25000 -3931.74702 1.54748 18.56124 148.42966 93.41335 499.21019
12.35000 -3898.43286 2.86132 -15.43743 178.16001 141.19175 497.89578
12.45000 -3866.81854 4.19338 -2.27060 91.48649 94.74752 480.86425
12.55000 -3832.23958 3.72294 8.02418 152.45118 164.13843 483.36188
12.65000 -3803.11207 5.12385 11.82114 171.96800 203.60274 498.21473
12.75000 -3770.07617 -0.96236 15.56675 190.60107 145.12400 465.62826
12.85000 -3738.13515 0.63654 13.65569 200.89816 139.59552 469.10444
12.95000 -3714.66100 3.39253 -6.80991 119.48003 108.08854 465.77636
13.05000 -3693.38817 1.64655 -8.91663 103.52095 147.16435 427.78414
13.15000 -3661.63930 -0.13981 19.96144 103.65216 95.33523 415.85556
13.25000 -3627.54848 2.57619 -3.18894 264.89913 187.86667 465.25608
13.35000 -3614.10798 2.16440 8.33307 411.24983 104.59130 504.71264
13.45000 -3584.76546 6.05129 -10.26684 103.64529 114.31949 418.58218
13.55000 -3555.30259 0.46617 19.18770 91.41894 93.41431 381.56890
13.65000 -3529.42528 4.51044 5.34501 106.55113 85.08635 378.43736
13.75000 -3504.92658 -1.75084 -13.85028 117.11374 192.17091 383.15099
13.85000 -3483.47513 3.14385 -1.00322 111.27514 86.45133 368.44971
13.95000 -3457.14437 2.43498 -2.94381 109.26893 113.30373 367.88645
14.05000 -3429.46126 3.67696 -1.67342 73.47641 84.73896 358.82307
14.15000 -3405.81005 3.16641 -12.84510 119.42028 101.90536 358.86569
14.25000 -3377.28405 0.51554 -2.32351 109.10055 158.88132 344.17474
14.35000 -3351.88709 4.95929 17.77731 289.47104 162.84528 399.34355
14.45000 -3336.73157 2.01978 -5.26073 76.17111 85.77581 329.89305
14.55000 -3313.20773 2.82984 -5.04335 66.45476 53.33485 324.05463
14.65000 -3287.37253 4.23893 3.34689 104.58494 96.99896 339.44617
14.75000 -3263.92309 4.43318 1.24472 76.29262 99.96170 317.94289
14.85000 -3242.01173 -4.18214 11.75526 85.47150 159.78807 306.40092
14.95000 -3223.55016 2.62847 9.41656 79.76549 137.62368 292.25308
15.05000 -3197.92023 0.46728 -0.12417 71.93321 71.68057 309.78890
15.15000 -3175.88902 2.63535 -1.28345 103.91885 111.46622 297.93243
15.25000 -3155.19219 0.11949 4.03332 105.30864 153.49292 288.13632
15.35000 -3128.96271 -0.91599 10.82881 116.05635 137.33924 304.37478
15.45000 -3110.18450 3.08855 3.47632 69.71108 83.15955 307.24315
15.55000 -3090.29370 1.63958 6.01889 94.92105 69.30553 271.76073
15.65000 -3068.74468 0.94992 10.60365 90.76746 76.27227 275.63739
15.75000 -3053.43061 -0.11519 17.78125 75.29159 92.00920 267.32768
15.85000 -3030.89370 5.06758 1.57986 69.16384 72.33190 262.08638
15.95000 -3005.82596 -0.67516 5.58662 64.31603 55.72646 250.45646
16.05000 -2985.46656 3.55914 13.85967 60.11422 53.73346 251.15875
16.15000 -2968.34490 2.40794 10.24054 70.00086 95.30122 246.52218
16.25000 -2947.64046 4.62221 13.04560 63.71201 66.35040 247.29972
16.35000 -2923.97980 0.58104 18.26330 67.06641 109.52090 235.99212
16.45000 -2904.46628 4.02519 19.06114 74.41221 102.74760 239.03061
16.55000 -2888.10741 1.71724 3.81127 79.01262 54.77566 234.84516
16.65000 -2869.30876 1.79970 14.42216 71.40655 47.10803 227.73254
16.75000 -2850.25732 0.69978 19.42703 163.99357 65.83076 238.27185
16.85000 -2829.69408 3.16308 15.77329 64.25358 76.80845 217.71783
16.95000 -2810.84196 -0.20464 18.39883 61.49192 119.78750 226.53403
17.05000 -2794.28428 4.79109 20.07477 86.54720 107.34213 233.96626
17.15000 -2772.15772 -0.71445 23.89134 68.98278 90.13346 212.82927
17.25000 -2755.24123 -0.18766 16.74626 76.41943 81.87847 203.82571
17.35000 -2739.97719 5.04232 19.66469 65.31942 52.72809 208.67687
17.45000 -2721.54883 2.53042 20.30789 57.28965 43.36996 191.67608
17.55000 -2706.28035 3.26820 22.05859 80.60010 56.31794 196.79588
17.65000 -2688.81520 -1.81669 26.50663 64.14423 76.33098 201.24455
17.75000 -2674.56184 -0.19633 29.52882 91.12019 87.04414 195.15324
17.85000 -2655.61101 2.21107 18.95297 46.95310 40.51588 181.26454
17.95000 -2637.85425 2.98133 20.55464 42.24037 36.08482 186.78482
18.05000 -2620.88138 3.15960 16.92069 81.68765 181.65515 194.68915
18.15000 -2603.72837 4.43198 42.47454 53.89098 41.51905 190.81666
18.25000 -2583.99627 3.14509 29.27698 214.25476 76.41332 280.52476
18.35000 -2572.44437 -0.02472 9.49389 44.73518 49.87439 175.08440
18.45000 -2557.29470 0.32273 20.88640 49.46050 44.78486 183.35503
18.55000 -2540.47173 3.15129 34.22752 63.38642 58.93899 170.51352
18.65000 -2526.84170 2.44374 15.47084 58.07476 45.47487 173.80082
18.75000 -2508.93470 -0.86735 20.30653 104.84482 79.62341 179.57984
18.85000 -2490.33990 8.38641 0.55073 70.12776 112.48597 167.80577
18.95000 -2476.84255 2.61060 29.46213 58.86621 75.38138 169.65163
19.05000 -2460.19124 3.90336 21.16745 90.58199 65.85577 157.62961
19.15000 -2449.78075 2.00623 19.26497 48.34253 54.68303 154.51604
19.25000 -2434.67992 3.02264 26.85846 35.76979 30.60807 148.97882
19.35000 -2419.35240 6.61470 0.62733 44.93465 46.42490 151.16065
19.45000 -2406.54280 1.28509 18.53019 29.26324 27.05454 146.23983
19.55000 -2392.68104 0.26193 2.95207 39.67847 54.84706 156.04265
19.65000 -2374.48403 3.29949 28.74088 58.01217 81.46653 161.72936
19.75000 -2362.91475 -1.55312 7.40370 55.30326 48.44670 161.26910
19.85000 -2349.75613 0.30344 14.89128 141.79985 93.15311 150.05933
19.95000 -2335.18096 0.67780 8.92754 219.17955 346.63118 258.95335
