0.2 0.92648 13.75078 0.37494 121.4 121.04685 95.67676
0.6 0.38892 31.35622 -0.01046 122.14087 115.28478 90.93239
1.0 0.53266 50.7122 -0.04242 123.63336 107.31449 85.18159
1.4 0.42783 63.66501 0.67846 123.3577 100.38945 79.91827
1.8 -0.29223 71.65808 -0.1418 122.32031 93.85681 74.74488
2.2 0.09811 75.49706 0.68314 119.3888 87.29924 70.65362
2.6 -0.55369 78.93307 0.13499 116.07448 82.60365 66.05051
3.0 -0.7877 80.69501 0.75333 110.66136 78.23582 61.05811
3.4 -0.24728 82.89787 0.66365 105.05242 74.67931 57.59835
3.8 -0.21498 83.38655 0.24523 100.57776 71.70061 53.66676
4.2 1.08884 88.75432 -0.08049 96.27381 70.66461 50.70596
4.6 1.47273 96.41147 0.18741 94.35266 68.98929 48.39734
5.0 1.02609 105.32768 0.66418 93.78168 68.83725 46.82126
5.4 0.64654 114.65605 0.94846 91.48206 67.09078 45.16783
5.8 -0.38601 123.79811 0.92754 85.84177 66.13414 43.82321
6.2 1.50421 130.80919 0.94821 78.79248 65.36628 41.00923
6.6 1.0603 137.45662 0.36587 70.3643 63.78681 39.15877
7.0 1.58151 145.12629 -0.34046 62.58832 62.3252 36.92025
7.4 0.87967 151.78441 -0.20616 56.68285 59.77789 34.76889
7.8 1.32394 158.82331 -0.00425 51.04925 56.88512 31.89288
8.2 1.62978 165.96398 -0.68729 45.30021 52.59882 29.5827
8.6 0.90713 173.14767 -0.50484 41.02754 47.61363 27.05887
9.0 0.73961 180.54697 -0.51451 38.0292 40.50085 25.08267
9.4 0.92069 187.15187 -0.77404 35.32784 32.62973 23.57314
9.8 0.78323 191.15214 -0.89994 33.51141 28.26899 22.2192
10.2 0.56418 193.64665 -1.13527 31.61838 26.27218 21.1213
10.6 -0.07955 193.9404 -1.31883 30.52949 25.29051 20.00865
11.0 0.04214 195.16656 -1.13556 28.91656 24.26526 19.16903
11.4 -0.1729 195.79552 -1.16122 28.06748 23.17061 18.1971
11.8 0.20705 196.13729 -1.24796 26.93969 21.95356 17.45025
12.2 0.24272 197.54019 -0.93296 26.4351 21.03427 16.31083
12.6 0.12453 198.64908 -1.10266 25.11506 19.83914 15.96654
13.0 -0.04524 199.58227 -0.51734 24.70996 18.8899 15.29123
13.4 0.04776 199.47409 -0.451 23.86604 18.85178 14.98464
13.8 0.35682 200.25022 -0.23641 22.67823 18.06768 14.66738
14.2 0.03711 200.37912 -0.09707 22.54918 17.45389 14.31325
14.6 -0.62384 201.31963 0.17754 21.70273 16.5953 13.90292
15.0 -1.05135 202.03478 0.24101 21.27037 15.00225 13.67965
15.4 -0.82089 201.26057 0.05621 20.03541 14.1929 12.91422
15.8 -1.36777 201.26824 0.25224 19.10142 13.51418 12.42623
16.2 -0.63633 201.00295 -0.22991 17.89779 13.45581 11.98309
16.6 -0.97004 200.30124 -0.35709 18.14601 13.74672 11.65701
17.0 -0.41674 200.75995 -0.35459 16.34775 13.24581 11.67425
17.4 0.13207 202.43801 -0.65275 16.2117 14.11087 11.31324
17.8 -0.38531 204.46398 -1.29979 14.67623 14.09662 11.46624
18.2 0.15369 206.71902 -0.65313 15.44937 13.76043 10.99706
18.6 0.35403 207.66417 -1.34766 14.79772 11.78917 11.16079
19.0 0.18787 207.89292 -0.96974 14.07186 10.38281 11.1007
19.4 0.86735 207.00144 -1.35767 14.29988 9.62347 11.13909
19.8 0.64591 206.29604 -1.30056 14.83601 8.40233 11.14792
