0.05000 0.00000 0.00000 0.00000 0.00000 0.00000 0.00000
0.15000 -799.66163 -236.88428 -8027.59530 2219.49633 854.76132 496426.28159
0.25000 758.41275 257.65998 -358672.03904 2099.52868 1186.76879 1808152.83686
0.35000 -1293.96069 703.61081 -155904.10269 2034.86108 1018.33944 670792.80038
0.45000 -557.27581 60.86223 240263.12697 2604.03482 1220.60359 1839605.18206
0.55000 -370.97568 -103.03468 164473.53975 2549.29627 1179.70679 2393278.45253
0.65000 -813.13456 -203.40456 129135.79266 2279.25565 1213.59467 881228.49259
0.75000 -723.60775 90.29264 -57110.51623 2505.76005 1224.30312 1022377.71392
0.85000 -818.72348 37.46892 -26022.03908 2353.72928 1319.59906 1022751.12457
0.95000 -902.60270 63.51609 33349.91150 2367.68862 1322.92703 1674272.00528
1.05000 -1113.99087 146.21596 -111689.88102 2218.93146 1361.37051 1925409.40283
1.15000 -1238.28377 25.02375 -29147.29507 2076.71263 1475.47490 1435157.13571
1.25000 -1507.14750 37.58246 30233.44804 1828.79574 1466.47403 2352396.50445
1.35000 -1757.20848 -59.93783 46846.21758 1620.88076 1506.18611 1555477.60805
1.45000 -2185.27401 22.45813 -33028.46278 1326.29107 1452.81524 1325698.44740
1.55000 -2430.19894 -28.01628 -30173.14887 1063.63153 1414.07022 1361643.18279
1.65000 -2771.82299 40.78675 -71705.80982 852.93686 1277.40764 1643431.55295
1.75000 -2954.48638 -33.81817 9880.71525 737.14794 1267.69851 1330827.83641
1.85000 -3121.53571 8.89476 -12739.96099 572.27818 1199.58115 1333266.46406
1.95000 -3336.31047 -17.91922 52709.35575 458.01094 1158.46775 2038766.31556
2.05000 -3479.03842 53.18107 5283.54316 400.57023 1021.33501 1678023.54188
2.15000 -3573.68061 19.16005 -65670.63809 355.51353 941.17611 2116141.92746
2.25000 -3610.12508 -7.97390 61318.09448 341.10137 916.31708 2032993.73374
2.35000 -3664.77908 1.53812 33495.00588 306.97171 859.57041 1575024.02224
2.45000 -3714.74390 -10.41320 6856.91856 277.20205 838.90999 1760888.05990
2.55000 -3773.44093 -11.02431 -29463.05261 265.01828 787.77369 1978389.88362
2.65000 -3800.38715 -11.05335 3343.62280 243.01390 734.94963 1851933.00654
2.75000 -3835.25104 2.24592 -110756.75467 244.71729 706.83508 2217081.80793
2.85000 -3860.13905 9.18770 47935.96015 228.93421 686.55422 1940177.78907
2.95000 -3879.87471 -20.32801 3159.27206 225.58979 638.93748 1576012.16747
3.05000 -3892.23745 -25.72335 31343.70396 227.54395 622.69437 1541368.73576
3.15000 -3914.11268 17.77203 12880.86911 235.55044 603.48283 2192627.90132
3.25000 -3934.29401 -9.38000 -99843.66926 231.52211 567.54867 1936325.78732
3.35000 -3925.56600 13.28446 54396.58309 225.92001 550.64789 2066617.53496
3.45000 -3921.41753 -8.07290 22551.91644 231.56460 520.72823 2154672.81437
3.55000 -3919.22709 -15.90157 102036.16932 223.23924 495.19734 2291226.31833
3.65000 -3921.99052 11.30557 25360.60707 225.17664 474.42156 2389494.65964
3.75000 -3912.82907 14.68903 -28103.74168 218.59050 461.60445 2364278.49687
3.85000 -3904.29437 0.03667 -53598.64626 215.47776 452.62621 2067199.39249
3.95000 -3902.62929 22.41092 53805.86966 211.68730 422.95350 2177041.45964
4.05000 -3894.36668 13.31781 -77514.62987 208.65456 416.06963 2230170.28310
4.15000 -3887.86613 2.55155 -3995.37360 212.20143 415.79565 2839951.19482
4.25000 -3863.75750 -1.28001 72348.05788 214.79089 395.06781 2570287.13591
4.35000 -3861.80821 -5.73986 57388.27863 220.59135 372.69014 2242605.68426
4.45000 -3844.04157 -12.63772 794.05552 227.16074 371.68048 2224952.93202
4.55000 -3830.01533 0.98130 51246.09158 218.16427 363.27447 2338834.64036
4.65000 -3814.00682 -3.18740 25670.18462 222.17698 342.53403 2258150.29815
4.75000 -3811.53882 5.01124 4786.52345 231.11115 339.37809 2332449.75234
4.85000 -3796.97936 -3.76273 -70875.34337 227.30764 325.81481 2294922.59196
4.95000 -3777.78428 -1.85836 -878.46545 220.27832 314.46962 1934998.13930
5.05000 -3761.01967 1.87088 60757.80849 225.63219 310.98556 2250979.07097
5.15000 -3749.51775 7.73905 54593.59901 219.21733 306.07229 2023596.86068
5.25000 -3717.68272 -3.70660 10236.71309 220.31958 295.00401 2058339.11324
5.35000 -3706.16973 -2.91590 56719.12494 223.05661 280.56494 2664854.41545
5.45000 -3676.03044 -5.83916 -2843.93889 211.66706 279.83018 2493334.12329
5.55000 -3659.36321 0.14199 -3177.25141 207.17469 272.15907 2608686.55954
5.65000 -3640.48057 1.86867 -5994.17969 194.57724 261.81837 2073158.03392
5.75000 -3620.95691 -2.72557 56846.68396 194.46870 254.96165 2254907.33521
5.85000 -3608.22399 -4.47585 880.49192 190.87450 254.34297 2190491.35633
5.95000 -3595.99508 5.31604 67152.45232 188.90466 243.51258 2319841.02082
6.05000 -3574.88867 -0.97324 -41807.57474 186.32867 240.78403 2373667.13164
6.15000 -3563.35776 4.82722 115125.88303 182.71621 234.14265 2228759.23238
6.25000 -3546.64919 8.18566 2267.27535 183.56097 232.43831 2331662.33347
6.35000 -3521.45981 18.84797 -10452.22612 182.28088 228.25677 2374401.27043
6.45000 -3514.57318 -1.44925 14231.78918 181.88561 226.87416 2376425.60589
6.55000 -3496.48999 3.17417 -45872.83511 184.68183 219.70529 2381938.74609
6.65000 -3485.13948 -6.97826 -9112.50593 182.67347 215.52909 2103282.60080
6.75000 -3470.81573 1.39646 24741.16110 183.33562 211.28048 2366747.27351
6.85000 -3454.08114 -2.55938 52367.36696 178.77257 207.01082 2078328.35042
6.95000 -3442.40292 3.31861 -6401.44819 179.74250 206.70476 2252465.19025
7.05000 -3409.07815 4.73034 32437.98252 177.48831 196.09896 2200218.69220
7.15000 -3400.59099 1.36887 76337.84995 175.22982 194.81398 2064744.31786
7.25000 -3386.70772 -0.86748 12286.79704 180.09346 192.32932 2469670.63078
7.35000 -3368.87682 1.39106 7753.07922 176.43497 190.09294 2184145.06188
7.45000 -3355.78990 -5.72049 15208.22067 181.06594 185.22506 2155717.61741
7.55000 -3342.55654 8.84966 -6384.95651 182.65800 178.53888 2227561.14695
7.65000 -3323.29925 -1.96678 -55427.59035 179.73879 177.42823 2413048.13725
7.75000 -3304.15181 5.12949 -51079.63174 181.65495 178.31014 2280304.77020
7.85000 -3293.12458 7.82618 47940.86087 174.55292 174.67626 2686522.92789
7.95000 -3273.65878 -7.93985 -5521.34299 173.39836 173.48971 2311089.46377
8.05000 -3254.99978 -5.74252 37026.93352 172.84845 166.43563 2060172.32309
8.15000 -3237.86421 -0.03288 7749.36178 169.57939 161.28183 2376816.13116
8.25000 -3221.87788 -1.01157 -42018.64420 167.10843 161.55702 2216009.74518
8.35000 -3208.89366 0.70513 66817.96945 166.50229 158.70975 2363001.91817
8.45000 -3187.11725 1.30927 -22434.73862 162.82976 156.01905 2203263.09249
8.55000 -3173.80899 1.08490 75718.35264 166.04152 152.49385 2165944.89971
8.65000 -3156.73866 -5.50613 28869.15148 161.00848 152.88790 2118863.99685
8.75000 -3144.44054 3.27367 -2109.08600 161.81616 147.39763 2345359.20744
8.85000 -3125.67645 -2.37666 91505.27768 154.69666 146.69984 2327244.24757
8.95000 -3112.87722 -1.51320 -25601.41083 159.28335 144.59436 2361603.61854
9.05000 -3099.44917 -3.04667 38309.74114 159.39203 143.33926 2190702.22766
9.15000 -3080.65292 2.13856 39859.93862 158.39312 137.55926 2134057.78353
9.25000 -3063.55424 -3.48724 37513.11679 158.50326 137.44635 2268734.39456
9.35000 -3052.64987 -0.52697 -46305.02750 155.56968 136.07050 2125176.64512
9.45000 -3035.42807 2.03860 83105.14673 156.01326 131.38791 2023765.17918
9.55000 -3021.60878 -0.45513 13041.87049 156.99330 130.84023 2379316.13965
9.65000 -2999.23563 -0.00010 30298.24710 154.42766 127.33888 2177257.15102
9.75000 -2982.05991 -1.85212 -50556.44937 156.16445 128.30771 2340444.85955
9.85000 -2969.60365 0.81635 12740.25475 155.02415 126.68803 2437596.58959
9.95000 -2951.13190 1.77747 -20137.12204 151.75137 123.38807 2143512.78328
10.05000 -2936.45092 0.37174 33461.59525 149.85389 122.02915 2138828.31527
10.15000 -2926.23077 1.03353 54947.23615 151.51534 119.41941 2081900.05371
10.25000 -2910.50826 -1.66032 -16893.49584 148.84605 119.26858 2332960.11481
10.35000 -2891.16182 -2.96132 -5473.10242 149.53841 116.95169 2053694.52849
10.45000 -2876.56644 2.44433 48258.01277 147.09326 114.50251 2249230.34493
10.55000 -2859.32537 1.28424 32228.16735 146.12725 114.10601 2150967.90382
10.65000 -2849.71368 -1.69970 39502.50327 142.08810 110.79715 2231951.45227
10.75000 -2832.76523 -1.94150 -62338.33608 142.12620 111.09819 2194853.04088
10.85000 -2820.49751 -0.67280 -37844.23295 141.65037 110.18791 2297790.23820
10.95000 -2806.17386 -0.33905 31269.71455 143.94392 108.00682 2296270.25540
11.05000 -2791.00110 0.01313 13023.88172 140.99354 106.60925 2393481.71183
11.15000 -2776.81485 1.23107 -16429.26637 140.70415 105.08342 2670102.17456
11.25000 -2766.73499 -2.61670 69091.14756 140.28245 105.25261 2131141.68531
11.35000 -2748.66759 1.38842 -34473.99238 139.88027 103.48992 2036179.98761
11.45000 -2732.26706 0.90095 -24175.24460 138.07894 99.25449 2221596.08772
11.55000 -2712.55528 -0.21092 55114.38890 135.81985 99.08813 2170885.53877
11.65000 -2703.24113 2.96760 -43055.39986 133.36722 99.19342 2329432.60081
11.75000 -2689.21478 -2.51818 22353.47377 133.75115 98.41722 2171737.89615
11.85000 -2677.16122 1.95570 77979.59009 128.36856 96.27767 2061794.44304
11.95000 -2664.51214 -2.17372 36887.19552 127.66157 96.53430 2427360.01577
12.05000 -2651.01529 -1.46083 48048.75886 131.35274 94.89697 2205512.84519
12.15000 -2635.47454 1.96870 -2742.03552 127.71260 94.53823 2214287.70927
12.25000 -2626.74846 -0.82219 55555.50016 123.66803 91.29920 1751562.48405
12.35000 -2610.54322 -0.92690 -15371.62001 124.11066 92.05522 2173839.92180
12.45000 -2599.14774 0.48660 22572.90472 123.94944 93.30619 2228334.49678
12.55000 -2586.81194 -2.25475 -25191.38584 121.47860 90.42611 2138377.83961
12.65000 -2572.43977 -1.80834 23716.94306 120.13847 87.92813 2100182.00153
12.75000 -2565.00986 1.63055 -22756.38153 121.24936 87.79602 2208568.01548
12.85000 -2549.08150 -0.79103 17840.09164 120.56394 85.84927 2128875.58665
12.95000 -2537.03588 0.14036 51008.27487 119.83319 86.63911 1956131.63524
13.05000 -2520.33146 0.40158 86637.22787 121.50003 84.55450 2172382.71747
13.15000 -2508.99195 0.69414 33393.70760 118.39201 82.58721 1747578.95174
13.25000 -2498.01016 -1.39397 -54104.99206 115.07423 84.27714 2050024.55781
13.35000 -2482.57328 0.18398 -23268.71717 114.33939 83.08071 2150804.04950
13.45000 -2471.83001 0.73030 -17740.26137 114.95727 80.47575 2223653.17293
13.55000 -2464.71874 -0.01266 59412.79051 114.30272 80.03907 2118905.60826
13.65000 -2450.41085 -0.64055 17550.08107 112.11820 78.28922 2030570.76954
13.75000 -2443.08373 -1.58704 -9141.34390 111.78836 77.77809 2175621.38152
13.85000 -2425.88269 0.12107 20271.44327 112.25515 78.93539 2012454.91704
13.95000 -2412.33275 1.45431 -90864.05701 111.20463 77.05375 2049969.23127
14.05000 -2406.84977 -0.00441 -9290.55577 110.13635 76.76902 2157071.44725
14.15000 -2392.19398 -1.01220 -9345.76821 110.22829 73.52780 2148592.13425
14.25000 -2384.01622 0.45477 37636.32237 107.74491 73.90396 2305968.61990
14.35000 -2368.16807 0.29854 -16387.97913 107.34254 74.09291 2087610.74930
14.45000 -2357.97202 -0.23123 76882.27301 109.38339 71.52976 2151886.06425
14.55000 -2345.50073 -1.14909 4918.08546 105.86812 72.33780 1824398.21684
14.65000 -2333.81460 -0.11194 -20614.95353 105.16770 71.14543 2143045.53640
14.75000 -2326.62807 -0.85170 -13016.51031 103.17970 72.00960 1834338.14026
14.85000 -2311.00694 1.03637 -15508.96355 102.30518 69.91141 1993986.26717
14.95000 -2302.35696 -0.41379 11821.34020 102.35285 67.70679 2003054.92636
15.05000 -2290.65654 -0.44871 4188.36193 101.65900 66.92385 2293422.55551
15.15000 -2284.09104 -0.12479 -15234.43595 100.55373 68.66823 1849774.26157
15.25000 -2274.30011 -0.78753 4002.57620 102.69387 69.19309 1936241.67395
15.35000 -2259.71304 1.63776 -28888.18641 99.83262 65.03587 1827532.91347
15.45000 -2249.98409 0.31176 17348.25136 99.53144 65.72045 1966722.59228
15.55000 -2239.59996 -0.26974 10859.75543 97.70943 63.72730 1934432.75838
15.65000 -2228.05389 0.93848 27782.10297 97.66097 63.14628 1922541.84467
15.75000 -2219.21730 1.69549 -38946.62430 97.12400 63.70233 1871802.96907
15.85000 -2210.72299 -1.28275 43500.82731 96.22206 61.43283 1754174.85783
15.95000 -2198.95361 0.41938 -80305.72445 95.26716 63.60065 1899326.04723
16.05000 -2186.39880 1.13126 -24734.50631 95.14034 60.75200 1929100.23373
16.15000 -2180.10674 2.63914 6334.01848 96.14989 62.49976 1961460.89735
16.25000 -2168.01158 -0.05097 -18496.59672 95.95621 62.05114 2037116.53318
16.35000 -2159.37641 -1.76637 -38872.93639 95.87142 60.86198 1773775.36010
16.45000 -2148.20524 0.28464 37874.95178 93.28825 57.32290 1761804.33052
16.55000 -2140.42408 -0.89662 71646.09220 91.99464 59.60596 1878585.84398
16.65000 -2131.16301 0.68008 26234.31081 94.22680 59.49666 1921516.09026
16.75000 -2117.47157 -0.80059 -21262.52980 91.56693 59.95668 1914220.66854
16.85000 -2106.53944 1.41581 -15105.99676 91.10629 57.72635 1948730.10229
16.95000 -2096.87656 0.22291 -22525.17317 88.98287 58.09497 1920814.09709
17.05000 -2087.22528 2.05651 -732.94738 88.42711 57.15137 1872386.23965
17.15000 -2079.00970 0.96199 6534.64781 87.33557 56.40305 2041968.85563
17.25000 -2071.27310 -1.35349 23547.53562 86.51502 54.75778 1911701.46651
17.35000 -2061.52420 1.41965 -18479.20665 86.79914 55.10289 1783651.40843
17.45000 -2053.87727 -0.33409 31099.99608 86.51397 54.56801 2195926.48171
17.55000 -2045.76180 -1.23004 42911.28138 87.87671 55.07651 1743405.10472
17.65000 -2034.97741 1.13910 27012.26546 85.21692 54.79298 1909907.80462
17.75000 -2026.02574 -0.48363 19004.15767 87.03566 52.85137 1787115.70575
17.85000 -2016.41600 -1.46144 59423.08637 85.05283 52.76453 1923913.14923
17.95000 -2006.31354 0.90796 -24806.27878 85.50191 51.23250 1753790.17457
18.05000 -1997.64428 -0.08950 26232.55116 83.17938 51.14397 1886246.06262
18.15000 -1989.37924 -0.27662 -79946.66632 81.68948 51.73821 1727533.71982
18.25000 -1977.79089 1.95397 -27835.85252 82.43091 51.09771 1807997.17404
18.35000 -1969.45692 -0.45436 3594.78870 80.01691 51.80075 1881610.44259
18.45000 -1964.24152 -0.77270 -7843.94250 80.71526 49.60431 1682972.73084
18.55000 -1953.63057 -0.74750 19455.33410 80.10677 49.55038 1932525.49056
18.65000 -1945.84439 -1.89149 -18058.84988 81.42080 49.04743 2043744.61734
18.75000 -1938.16726 1.40986 -12257.75079 78.82383 48.04340 2064272.69549
18.85000 -1930.16580 0.52390 -21112.80677 76.90044 48.90388 1967707.27275
18.95000 -1918.60115 -0.10006 39566.47424 78.26174 48.45207 1933972.44368
19.05000 -1910.54285 1.34583 39358.73382 77.30730 47.11109 1753312.36489
19.15000 -1904.85668 -0.14898 24968.95588 77.86217 45.66402 1840023.29711
19.25000 -1893.53103 0.44636 -1839.32562 76.68639 46.22331 1821882.13579
19.35000 -1888.74047 1.84144 -21015.96849 76.06220 46.88930 2015372.39907
19.45000 -1878.82789 -0.09464 19045.94192 76.23642 45.46522 1651548.58272
19.55000 -1873.83307 -0.81534 -40869.22940 76.10377 47.83862 1860833.61089
19.65000 -1864.89513 3.05422 21065.36393 74.51828 46.01969 1686903.30588
19.75000 -1853.74513 0.34715 -52606.97826 74.79428 46.02304 1796394.68122
19.85000 -1846.09935 0.20870 -2985.89102 73.09387 44.40572 1945524.21369
19.95000 -1839.54408 0.06699 37838.29572 74.91290 44.31610 1834958.37309
