0.12500 0.01476
0.37500 0.03058
0.62500 0.08330
0.87500 0.16271
1.12500 0.24126
1.37500 0.30573
1.62500 0.36596
1.87500 0.42143
2.12500 0.46775
2.37500 0.50255
2.62500 0.53125
2.87500 0.55039
3.12500 0.57656
3.37500 0.58372
3.62500 0.59160
3.87500 0.58443
4.12500 0.57060
4.37500 0.54820
4.62500 0.51047
4.87500 0.46555
5.12500 0.41485
5.37500 0.36042
5.62500 0.32602
5.87500 0.32014
6.12500 0.30843
6.37500 0.30561
6.62500 0.30331
6.87500 0.29162
7.12500 0.29912
7.37500 0.26944
7.62500 0.24077
7.87500 0.19692
8.12500 0.15929
8.37500 0.13237
8.62500 0.10006
8.87500 0.08547
9.12500 0.09470
9.37500 0.07413
9.62500 0.04775
9.87500 0.04417
10.12500 0.04740
10.37500 0.03201
10.62500 0.05766
10.87500 0.06183
11.12500 0.06879
11.37500 0.09011
11.62500 0.09594
11.87500 0.09763
12.12500 0.11197
12.37500 0.07261
12.62500 0.05774
12.87500 0.06073
13.12500 0.03501
13.37500 0.03768
13.62500 0.01282
13.87500 0.02326
14.12500 0.03374
14.37500 0.05147
14.62500 0.07731
14.87500 0.10132
