0.120000 -0.407970
0.380000 1.272690
0.620000 0.492910
0.880000 0.294330
1.120000 0.442630
1.380000 0.529890
1.620000 0.446650
1.880000 0.609810
2.120000 0.439050
2.380000 0.527300
2.620000 0.556950
2.880000 0.599080
3.120000 0.678390
3.380000 0.677320
3.620000 0.663290
3.880000 0.648660
4.120000 0.850530
4.380000 1.049800
4.620000 0.934650
4.880000 1.299150
5.120000 0.926220
5.380000 0.928760
5.620000 0.959550
5.880000 0.822060
6.120000 0.962450
6.380000 0.802480
6.620000 0.626110
6.880000 0.660340
7.120000 0.663540
7.380000 1.003370
7.620000 1.387880
7.880000 1.077430
8.120000 0.873600
8.380000 0.210340
8.620000 1.243150
8.880000 0.511510
9.120000 1.355900
9.380000 0.670310
9.620000 -0.190100
9.880000 -1.502000
10.120000 -2.060550
10.380000 -2.568530
10.620000 -2.672770
10.880000 -2.606550
11.120000 2.581900
11.380000 -2.285870
11.620000 2.214570
11.880000 2.220890
12.120000 2.619570
12.380000 0.845560
12.620000 -0.565430
12.880000 2.495860
13.120000 1.798460
13.380000 -0.761080
13.620000 0.487070
13.880000 -1.863080
14.120000 -0.398020
14.380000 -1.271100
14.620000 -0.760410
14.880000 -1.231550
15.120000 -0.721460
15.380000 -1.766970
15.620000 -0.756690
15.880000 -1.269430
16.120000 -1.347540
16.380000 -2.182960
16.620000 -2.576080
16.880000 1.019450
17.120000 -2.952550
17.380000 2.903130
17.620000 2.913650
17.880000 2.380890
18.120000 2.169730
18.380000 2.059550
18.620000 1.949790
18.880000 2.373280
19.120000 2.914770
19.380000 1.300830
19.620000 1.910030
19.880000 0.258920
