0.12500 0.03184
0.37500 0.02359
0.62500 0.00728
0.87500 0.02711
1.12500 0.01428
1.37500 0.01250
1.62500 0.01310
1.87500 0.01304
2.12500 0.01611
2.37500 0.00957
2.62500 0.00803
2.87500 0.02124
3.12500 0.03242
3.37500 0.03169
3.62500 0.00375
3.87500 0.00302
4.12500 0.00893
4.37500 0.01692
4.62500 0.00863
4.87500 0.01675
5.12500 0.00975
5.37500 0.02922
5.62500 0.03088
5.87500 0.03423
6.12500 0.03242
6.37500 0.03590
6.62500 0.01052
6.87500 0.01516
7.12500 0.03293
7.37500 0.01655
7.62500 0.01835
7.87500 0.03681
8.12500 0.00666
8.37500 0.02689
8.62500 0.01146
8.87500 0.02965
9.12500 0.03187
9.37500 0.04567
9.62500 0.06280
9.87500 0.05138
10.12500 0.05901
10.37500 0.03690
10.62500 0.03652
10.87500 0.03974
11.12500 0.02650
11.37500 0.03743
11.62500 0.04963
11.87500 0.04894
12.12500 0.02936
12.37500 0.00921
12.62500 0.02328
12.87500 0.03964
13.12500 0.03164
13.37500 0.02860
13.62500 0.02278
13.87500 0.03392
14.12500 0.02006
14.37500 0.01480
14.62500 0.04690
14.87500 0.03421
15.12500 0.07671
15.37500 0.03181
15.62500 0.04947
15.87500 0.03043
16.12500 0.02329
16.37500 0.05101
16.62500 0.06142
16.87500 0.04667
17.12500 0.01230
17.37500 0.06007
17.62500 0.02639
17.87500 0.09604
18.12500 0.07818
18.37500 0.08508
18.62500 0.01233
18.87500 0.07670
19.12500 0.08136
19.37500 0.06164
19.62500 0.10664
19.87500 0.12354
