0.12500 0.00578
0.37500 0.05158
0.62500 0.12706
0.87500 0.20759
1.12500 0.26838
1.37500 0.32673
1.62500 0.38416
1.87500 0.41852
2.12500 0.44646
2.37500 0.47348
2.62500 0.49579
2.87500 0.52093
3.12500 0.53036
3.37500 0.54947
3.62500 0.55700
3.87500 0.56549
4.12500 0.55183
4.37500 0.52976
4.62500 0.48211
4.87500 0.43246
5.12500 0.37548
5.37500 0.33245
5.62500 0.30085
5.87500 0.27816
6.12500 0.27546
6.37500 0.27145
6.62500 0.27522
6.87500 0.28059
7.12500 0.29187
7.37500 0.27906
7.62500 0.26999
7.87500 0.23396
8.12500 0.20202
8.37500 0.18033
8.62500 0.18688
8.87500 0.16632
9.12500 0.16138
9.37500 0.15057
9.62500 0.15156
9.87500 0.13094
10.12500 0.11821
10.37500 0.10352
10.62500 0.11902
10.87500 0.09727
11.12500 0.09963
11.37500 0.09581
11.62500 0.06919
11.87500 0.06794
12.12500 0.08432
12.37500 0.08170
12.62500 0.07449
12.87500 0.06527
13.12500 0.07148
13.37500 0.07962
13.62500 0.08855
13.87500 0.10255
14.12500 0.10051
14.37500 0.13355
14.62500 0.13327
14.87500 0.14125
