0.12500 0.02010
0.37500 0.05788
0.62500 0.12207
0.87500 0.21217
1.12500 0.28386
1.37500 0.33411
1.62500 0.39321
1.87500 0.43810
2.12500 0.46715
2.37500 0.48829
2.62500 0.52215
2.87500 0.54075
3.12500 0.56017
3.37500 0.58537
3.62500 0.59392
3.87500 0.60918
4.12500 0.60076
4.37500 0.59974
4.62500 0.57552
4.87500 0.54866
5.12500 0.51493
5.37500 0.45613
5.62500 0.42925
5.87500 0.39355
6.12500 0.36210
6.37500 0.36658
6.62500 0.34848
6.87500 0.32656
7.12500 0.34168
7.37500 0.34634
7.62500 0.34493
7.87500 0.34515
8.12500 0.33480
8.37500 0.30940
8.62500 0.27345
8.87500 0.22294
9.12500 0.20193
9.37500 0.16968
9.62500 0.15327
9.87500 0.13167
10.12500 0.10425
10.37500 0.09350
10.62500 0.06976
10.87500 0.05440
11.12500 0.07085
11.37500 0.05961
11.62500 0.07925
11.87500 0.05226
12.12500 0.05678
12.37500 0.04397
12.62500 0.04700
12.87500 0.02939
13.12500 0.00736
13.37500 0.00676
13.62500 0.01078
13.87500 0.01752
14.12500 0.00744
14.37500 0.03408
14.62500 0.05644
14.87500 0.08895
