0.2 0.39484 22.53512 0.67602 73.24456 72.31197 64.98829
0.6 -0.70462 47.765 0.21631 71.10188 68.90211 61.63473
1.0 -1.16852 68.81008 -0.48769 68.58243 64.78467 58.71249
1.4 -1.19266 85.86193 -0.34139 66.85765 61.08272 54.85665
1.8 -1.19633 98.32365 -0.28071 64.35947 58.19224 52.28478
2.2 -0.26006 109.72228 0.14702 60.85083 54.43008 49.58214
2.6 -0.07616 121.88105 0.28396 56.68623 51.66226 47.05386
3.0 0.42904 134.33667 0.42344 52.04591 47.89675 44.30015
3.4 0.91517 144.75471 0.13466 47.99839 44.13997 41.81394
3.8 0.84943 154.00478 0.04679 44.20733 40.83884 39.05224
4.2 -0.02393 162.39392 -0.25356 41.89677 37.06196 36.91415
4.6 0.04642 168.7523 -0.17844 39.73061 34.51046 34.95304
5.0 -0.23545 174.24972 -0.01632 37.43695 31.93542 32.65582
5.4 -0.18783 179.37124 -0.65448 35.16005 30.21953 30.89746
5.8 0.20585 184.12992 -0.25338 33.36534 28.58348 29.21627
6.2 1.02921 187.86787 -0.41641 32.21088 26.93119 27.61013
6.6 1.30763 189.98486 0.02006 30.93035 25.81569 26.45552
7.0 0.89872 192.24029 0.3252 30.23377 24.20429 24.94977
7.4 -0.2974 193.79851 0.6312 28.6526 22.91743 23.77332
7.8 -0.84328 195.85893 0.36654 27.43188 21.72555 22.39995
8.2 -0.99524 197.23545 -0.18865 25.88729 20.83058 21.2638
8.6 -0.544 199.16412 -0.40717 24.50656 19.75231 20.15405
9.0 -0.48072 200.71993 -0.68419 23.34523 18.58491 19.09726
9.4 -0.26787 202.09506 -0.13889 22.80185 17.40491 18.61041
9.8 0.38529 202.87492 0.05768 21.88802 16.42242 17.63252
10.2 0.68401 203.6312 -0.0139 21.20367 15.67356 16.63255
10.6 1.18638 203.66878 0.14385 20.45314 15.28341 15.87999
11.0 0.95112 203.73625 0.00936 19.44805 15.07754 15.27475
11.4 0.63602 203.94854 -0.00358 19.0245 14.97316 14.51919
11.8 0.05694 204.66754 -0.04568 17.48611 13.96311 13.83113
12.2 0.49536 205.63987 0.16196 16.84068 13.32935 13.22687
12.6 0.64464 206.16977 0.4123 16.21034 12.84352 12.96654
13.0 0.87385 206.14497 0.86391 15.66409 11.39726 12.21773
13.4 -0.04995 205.77878 1.66078 15.00105 11.14749 11.74042
13.8 0.03827 206.40753 1.70903 14.36001 11.13989 11.12552
14.2 0.27672 206.8483 1.86684 13.53168 10.99343 10.73822
14.6 -0.10182 207.18094 1.09523 13.27038 9.51703 10.15608
15.0 0.13557 206.11833 0.61273 13.26746 9.37303 9.82674
15.4 0.58589 206.83674 -0.20586 12.63723 9.75105 9.52451
15.8 1.43551 207.84542 -0.45781 12.01089 9.30812 9.20608
16.2 1.57093 207.77466 -0.90974 11.36066 8.52288 9.00967
16.6 0.90852 206.99513 -1.32719 11.46737 7.99691 8.47836
17.0 0.45061 205.85828 -1.81697 11.26119 7.90724 8.42738
17.4 -0.96316 205.18496 -1.34762 11.08613 8.1526 8.01335
17.8 -2.14112 206.34055 -1.38765 10.18855 7.34973 7.79618
18.2 -2.0285 206.41692 -0.88639 9.91476 7.13583 7.38933
18.6 -0.2105 207.03581 0.08981 8.95195 6.32602 7.07626
19.0 -0.02627 205.90134 0.79882 9.19889 6.30487 6.7902
19.4 0.74809 205.02658 1.8368 8.59931 6.15595 7.16762
19.8 -0.07329 204.59907 1.87238 8.33801 6.31322 6.34835
