0.125 -0.000 -0.001 0.001
0.375 0.003 -0.004 0.047
0.625 0.018 -0.006 0.269
0.875 0.021 0.010 0.784
1.125 0.018 -0.029 1.487
1.375 0.051 0.008 2.252
1.625 0.039 0.006 2.983
1.875 0.085 -0.006 3.680
2.125 0.090 0.026 4.300
2.375 0.103 -0.022 4.835
2.625 0.090 -0.049 5.268
2.875 0.090 0.034 5.612
3.125 0.084 -0.076 5.985
3.375 0.142 -0.011 6.355
3.625 0.130 -0.031 6.573
3.875 0.175 0.012 7.161
4.125 0.159 -0.026 7.923
4.375 0.163 0.003 8.656
4.625 0.089 -0.024 9.441
4.875 0.162 -0.030 10.181
5.125 0.140 -0.064 11.370
5.375 0.191 -0.018 12.102
5.625 0.262 0.000 13.735
5.875 0.230 -0.077 15.353
6.125 0.256 -0.046 17.157
6.375 0.298 -0.050 18.686
6.625 0.291 0.035 20.815
6.875 0.320 0.052 22.928
7.125 0.323 -0.052 24.615
7.375 0.338 0.006 26.018
7.625 0.328 -0.019 26.795
7.875 0.254 -0.041 27.348
8.125 0.355 0.014 27.889
8.375 0.264 -0.053 27.669
8.625 0.250 -0.045 27.864
8.875 0.216 -0.085 26.914
9.125 0.254 -0.052 26.083
9.375 0.262 -0.103 25.596
9.625 0.207 -0.105 24.999
9.875 0.291 -0.110 23.386
10.125 0.199 -0.059 22.932
10.375 0.195 -0.069 22.410
10.625 0.173 -0.032 22.219
10.875 0.205 -0.092 21.700
11.125 0.211 -0.111 20.913
11.375 0.276 -0.092 20.621
11.625 0.243 -0.049 20.621
11.875 0.257 -0.024 20.013
12.125 0.293 -0.064 20.410
12.375 0.249 -0.067 19.882
12.625 0.239 -0.031 19.228
12.875 0.236 -0.107 19.612
13.125 0.226 -0.026 18.849
13.375 0.244 -0.034 18.714
13.625 0.265 -0.055 18.394
13.875 0.232 -0.046 17.431
14.125 0.221 -0.025 17.965
14.375 0.196 -0.035 17.524
14.625 0.215 -0.025 16.824
14.875 0.214 -0.005 16.514
