0.05000 5782.91534
0.15000 7953.99680
0.25000 9880.47373
0.35000 10353.29985
0.45000 10430.38928
0.55000 9642.06830
0.65000 9610.13888
0.75000 8993.88809
0.85000 8602.67772
0.95000 8474.07288
1.05000 7888.09832
1.15000 7702.88340
1.25000 7262.53471
1.35000 7035.05997
1.45000 6663.01337
1.55000 6520.63255
1.65000 6190.84444
1.75000 5855.51418
1.85000 5755.79176
1.95000 5324.55059
2.05000 5232.00106
2.15000 5016.29027
2.25000 4879.71835
2.35000 4784.97565
2.45000 4690.64703
2.55000 4371.01440
2.65000 4197.29085
2.75000 4027.69013
2.85000 3970.23909
2.95000 3791.94226
3.05000 3666.20930
3.15000 3658.05543
3.25000 3476.54108
3.35000 3477.10495
3.45000 3330.11147
3.55000 3196.86536
3.65000 3079.10552
3.75000 3132.69441
3.85000 2942.99226
3.95000 2911.45736
4.05000 2812.61145
4.15000 2760.84922
4.25000 2762.97676
4.35000 2638.75072
4.45000 2519.87030
4.55000 2475.88858
4.65000 2425.67421
4.75000 2335.92398
4.85000 2286.45500
4.95000 2228.44070
5.05000 2191.60733
5.15000 2181.35172
5.25000 2110.52108
5.35000 1999.65243
5.45000 1974.20306
5.55000 1933.13962
5.65000 1869.01641
5.75000 1847.14310
5.85000 1804.90886
5.95000 1746.01251
6.05000 1756.45695
6.15000 1662.55376
6.25000 1630.91862
6.35000 1571.27572
6.45000 1535.75741
6.55000 1535.17385
6.65000 1514.36958
6.75000 1459.61536
6.85000 1455.55719
6.95000 1400.53332
7.05000 1400.28769
7.15000 1321.13675
7.25000 1332.26616
7.35000 1267.03945
7.45000 1264.45708
7.55000 1206.99109
7.65000 1190.33747
7.75000 1151.29263
7.85000 1161.93439
7.95000 1086.86953
8.05000 1086.03653
8.15000 1044.23580
8.25000 1035.40350
8.35000 1015.73786
8.45000 985.69893
8.55000 974.84516
8.65000 966.22017
8.75000 908.69151
8.85000 882.30453
8.95000 886.24742
9.05000 892.61513
9.15000 878.44078
9.25000 856.39099
9.35000 822.30993
9.45000 793.19151
9.55000 772.44364
9.65000 757.30180
9.75000 741.68509
9.85000 760.00650
9.95000 733.37745
10.05000 701.67763
10.15000 683.67631
10.25000 651.33633
10.35000 655.83142
10.45000 622.01713
10.55000 668.15157
10.65000 618.91885
10.75000 607.39384
10.85000 566.91014
10.95000 596.09253
11.05000 571.36416
11.15000 568.76218
11.25000 528.52215
11.35000 531.67659
11.45000 533.70169
11.55000 526.46013
11.65000 510.32740
11.75000 509.14479
11.85000 492.72755
11.95000 479.28439
12.05000 486.93187
12.15000 458.47851
12.25000 487.01436
12.35000 448.00747
12.45000 440.97550
12.55000 444.30953
12.65000 414.82752
12.75000 410.08980
12.85000 416.34024
12.95000 407.17548
13.05000 413.09677
13.15000 379.52316
13.25000 390.07114
13.35000 381.53291
13.45000 381.46635
13.55000 378.23073
13.65000 358.72271
13.75000 357.21636
13.85000 350.87773
13.95000 343.77805
14.05000 347.73082
14.15000 332.71914
14.25000 324.72601
14.35000 321.40932
14.45000 316.63897
14.55000 303.69321
14.65000 318.56229
14.75000 289.42815
14.85000 305.98449
14.95000 291.37936
15.05000 282.35570
15.15000 274.48950
15.25000 263.86988
15.35000 265.68004
15.45000 261.41871
15.55000 271.53808
15.65000 263.84044
15.75000 273.02784
15.85000 258.38692
15.95000 236.20589
16.05000 234.29548
16.15000 236.67467
16.25000 241.93489
16.35000 229.37173
16.45000 234.64451
16.55000 228.20357
16.65000 227.82469
16.75000 214.44076
16.85000 211.05700
16.95000 215.61151
17.05000 199.07641
17.15000 202.93454
17.25000 202.67714
17.35000 190.81493
17.45000 199.26155
17.55000 208.73482
17.65000 191.02350
17.75000 178.80149
17.85000 179.35698
17.95000 175.13052
18.05000 196.10717
18.15000 168.09134
18.25000 167.92669
18.35000 200.39574
18.45000 186.37443
18.55000 158.41483
18.65000 156.11809
18.75000 158.36624
18.85000 149.95687
18.95000 153.92129
19.05000 149.03938
19.15000 139.13245
19.25000 136.76642
19.35000 155.25400
19.45000 147.83632
19.55000 140.08808
19.65000 152.61061
19.75000 137.94343
19.85000 137.66624
19.95000 129.60680
