0.2 1.83714 13.98005 -0.88547 130.01799 127.30253 98.35241
0.6 -0.25115 28.15837 0.11543 127.94182 120.77135 94.84877
1.0 -1.5041 45.20901 0.90981 126.65351 114.57963 90.71171
1.4 0.17486 57.56472 0.21965 127.88517 107.44557 86.35966
1.8 0.4644 67.28661 0.15775 127.48018 102.10798 82.40831
2.2 -0.09683 74.83347 -0.71813 127.27233 97.4843 79.0368
2.6 1.137 80.00569 -0.2775 123.63931 91.23017 74.24099
3.0 0.76076 82.33603 1.0078 123.1183 88.6778 70.15878
3.4 1.06034 84.7245 0.7003 120.64893 83.49522 67.4055
3.8 1.00534 85.94242 -0.38748 116.03528 79.2954 64.05836
4.2 -0.72033 89.4742 0.40191 112.24953 76.75124 60.52575
4.6 -2.4071 90.12664 -0.18446 108.64764 74.07447 58.1879
5.0 0.62994 93.23499 0.28853 103.95964 71.92923 56.44136
5.4 0.50503 95.06458 -0.18934 99.86783 70.48298 54.25108
5.8 -0.36927 99.90419 -0.03469 97.12772 69.32611 52.9962
6.2 -0.21869 106.093 0.23353 94.60552 69.88171 51.01977
6.6 -0.92411 112.70982 0.46295 91.46045 68.1436 48.92956
7.0 0.62649 118.85383 0.20046 87.47524 67.71908 47.25334
7.4 -2.04141 127.84103 -2.01505 81.6091 67.56308 45.6867
7.8 -0.6829 133.41529 -0.3617 76.2402 66.7374 44.7187
8.2 -1.85675 138.94786 -0.62912 70.30957 65.75316 41.86553
8.6 -0.76495 146.05974 -0.65134 63.08383 64.33141 39.54309
9.0 -1.03374 154.16074 -0.78559 56.7787 62.38628 37.79564
9.4 -1.42415 160.77098 0.07248 52.32877 59.12832 34.61412
9.8 0.90529 167.48611 0.10282 47.50231 54.91195 32.66515
10.2 0.6338 173.56412 -0.22392 42.7864 49.864 30.59472
10.6 1.03421 179.26726 -0.5312 39.85717 45.59201 28.76951
11.0 0.5105 183.61057 -1.02231 36.74844 40.72386 27.09846
11.4 0.66541 189.10229 -0.4807 33.69084 34.4489 25.42473
11.8 0.45967 193.27814 0.00735 32.80009 29.71697 24.41589
12.2 1.10321 195.0667 -0.29569 31.31672 26.13362 23.84406
12.6 0.82734 196.33491 -0.19625 30.49424 23.65718 23.17726
13.0 1.09412 196.31627 -0.48859 28.59053 22.9204 22.54954
13.4 1.40398 197.23269 -0.55345 28.24533 22.96449 21.26882
13.8 0.60971 198.25536 -0.44896 26.95807 21.86986 20.83561
14.2 0.22557 198.82028 -0.56949 25.92884 22.07618 19.55967
14.6 0.51608 199.45377 -0.56721 25.78185 21.44687 19.5168
15.0 -0.59296 201.96854 -0.49889 24.39454 21.26432 19.03356
15.4 0.34216 203.49349 -0.2633 22.81644 18.93715 18.68359
15.8 -0.20813 204.10832 -1.61084 22.79277 18.21985 17.95823
16.2 -0.57874 204.31308 -0.49621 22.20247 17.42651 17.13653
16.6 0.602 204.36323 -0.48552 21.98828 16.40636 17.25079
17.0 1.26777 204.59572 -0.78116 20.68621 15.57741 16.37787
17.4 0.46323 203.60263 -0.52082 21.08296 14.74511 16.30771
17.8 -0.02932 203.18689 1.16602 20.26588 14.67771 15.0916
18.2 0.13788 202.69599 0.17406 19.76278 13.75089 14.51199
18.6 -0.85076 202.63448 0.45097 20.4245 14.28052 14.39508
19.0 -1.30017 201.85679 1.27161 19.06927 12.79185 14.64628
19.4 0.49834 200.84246 0.95501 19.80963 13.28194 13.6493
19.8 1.34806 201.2181 1.46024 18.46341 13.24913 13.43188
