0.125 0.000 0.000 0.003
0.375 0.002 0.001 0.079
0.625 0.004 0.001 0.316
0.875 0.014 0.002 0.739
1.125 -0.016 0.008 1.339
1.375 -0.005 0.022 2.009
1.625 0.005 0.010 2.817
1.875 -0.027 -0.006 3.861
2.125 0.025 0.045 5.018
2.375 0.027 0.025 6.319
2.625 -0.028 0.062 7.859
2.875 -0.013 0.039 9.278
3.125 -0.015 0.053 10.470
3.375 0.002 0.043 11.690
3.625 -0.047 0.077 12.710
3.875 -0.063 0.079 14.134
4.125 -0.111 0.079 15.223
4.375 -0.115 0.097 16.407
4.625 -0.112 0.090 17.762
4.875 -0.064 0.062 18.840
5.125 -0.125 0.090 19.510
5.375 -0.030 0.077 20.537
5.625 -0.069 0.157 21.054
5.875 -0.115 0.106 22.025
6.125 -0.087 0.096 22.845
6.375 -0.161 0.123 23.333
6.625 -0.142 0.125 23.857
6.875 -0.123 0.098 24.568
7.125 -0.172 0.124 24.411
7.375 -0.152 0.236 24.227
7.625 -0.130 0.108 24.313
7.875 -0.112 0.129 24.179
8.125 -0.152 0.057 24.795
8.375 -0.167 0.168 24.190
8.625 -0.132 0.184 24.614
8.875 -0.159 0.139 24.950
9.125 -0.212 0.102 24.705
9.375 -0.207 0.139 25.288
9.625 -0.160 0.103 25.409
9.875 -0.142 0.124 25.360
10.125 -0.180 0.129 25.561
10.375 -0.236 0.148 26.097
10.625 -0.195 0.143 25.730
10.875 -0.131 0.143 25.634
11.125 -0.137 0.110 24.740
11.375 -0.200 0.119 24.896
11.625 -0.158 0.100 24.185
11.875 -0.189 0.104 23.515
12.125 -0.161 0.095 22.245
12.375 -0.172 0.092 22.121
12.625 -0.200 0.112 22.370
12.875 -0.199 0.102 21.561
13.125 -0.170 0.067 20.940
13.375 -0.221 0.084 20.923
13.625 -0.177 0.086 19.895
13.875 -0.189 0.094 20.028
14.125 -0.153 0.054 18.783
14.375 -0.146 0.075 18.749
14.625 -0.155 0.076 18.160
14.875 -0.150 0.052 16.933
15.125 -0.143 0.093 15.940
15.375 -0.146 0.059 16.529
15.625 -0.163 0.039 15.342
15.875 -0.156 0.064 15.785
16.125 -0.140 0.034 15.473
16.375 -0.188 0.002 15.347
16.625 -0.176 0.008 13.990
16.875 -0.161 -0.025 13.416
17.125 -0.157 0.008 13.324
17.375 -0.143 -0.015 12.553
17.625 -0.103 -0.016 11.782
17.875 -0.115 -0.045 11.849
18.125 -0.094 -0.025 11.864
18.375 -0.103 -0.026 11.648
18.625 -0.079 -0.013 11.567
18.875 -0.056 -0.007 10.259
19.125 -0.045 0.007 9.670
19.375 -0.052 0.017 9.044
19.625 -0.042 0.008 7.971
19.875 -0.053 0.016 7.760
