0.05000 -873.05809 158.35502 1500.67726 1620.14102 1603.33040 1263.02964
0.15000 -2243.38414 76.33576 1264.17926 1422.25583 1425.07113 2589.61859
0.25000 -2873.12633 61.59212 746.29711 1505.38330 1313.79028 3579.59591
0.35000 -3589.96990 126.00942 567.90348 1587.31079 1279.18130 4735.03083
0.45000 -4261.46889 104.47650 273.96243 1533.96189 1281.82473 5521.36853
0.55000 -4634.56785 56.80896 392.95303 1558.87712 1266.79707 5889.59418
0.65000 -5039.93314 95.38666 136.45967 1611.60371 1235.49049 6247.32290
0.75000 -5436.13652 103.24410 306.44837 1652.62931 1222.48607 6509.44833
0.85000 -5711.39017 92.42189 -83.80006 1640.17167 1209.22111 6580.39957
0.95000 -5901.72271 46.55954 -135.58141 1651.09531 1225.14624 6727.24808
1.05000 -6132.38243 61.63897 14.81868 1649.00752 1235.61195 6720.02656
1.15000 -6315.92180 52.98680 216.86954 1675.82076 1239.61645 6700.72159
1.25000 -6511.26279 66.35636 -117.00131 1629.47422 1242.02418 6555.97505
1.35000 -6657.65658 91.93929 -192.36002 1594.56160 1242.81320 6412.71014
1.45000 -6830.74586 75.40758 -222.22331 1550.53583 1229.22778 6270.22388
1.55000 -6846.08170 54.68203 22.66024 1498.40272 1222.23299 6164.02806
1.65000 -6882.72859 83.41623 1.47789 1432.84150 1235.29685 5978.58251
1.75000 -6915.85602 60.28507 -110.24784 1386.70769 1222.78477 5824.96287
1.85000 -6997.08447 39.83711 -222.01481 1300.25425 1235.93081 5646.18582
1.95000 -7041.90233 47.67054 -40.33629 1217.25368 1240.55737 5457.93732
2.05000 -7040.43141 64.81729 -340.73712 1176.14476 1227.83596 5389.78129
2.15000 -7091.80560 30.08789 -149.40990 1111.10283 1214.03500 5183.00345
2.25000 -7066.51180 58.57512 -165.14617 1080.24531 1196.53074 5092.13085
2.35000 -7046.24867 35.01047 -183.05644 1002.72804 1185.34995 4996.35293
2.45000 -7075.39309 77.91242 -118.93857 974.13889 1182.00949 4822.45880
2.55000 -7090.55285 43.87468 -240.87689 876.33383 1156.63971 4698.34697
2.65000 -7074.03752 31.88837 -94.68016 880.54410 1134.27699 4602.52467
2.75000 -7093.57966 58.39066 -52.01927 808.81923 1123.01478 4466.35356
2.85000 -7061.89021 67.37856 -35.16739 811.74700 1086.27611 4371.55040
2.95000 -7064.50005 55.50382 -119.77253 733.49457 1066.02855 4223.14135
3.05000 -7055.72511 64.22745 -13.59132 709.76356 1050.45650 4104.65157
3.15000 -7034.42550 57.34770 -104.53193 688.48364 1014.77328 4038.88833
3.25000 -7018.31741 66.20446 -22.27555 668.85771 984.22706 3966.07625
3.35000 -7009.45457 69.22035 41.86647 646.32449 952.43253 3812.88374
3.45000 -6992.10130 67.76168 -30.27226 613.75028 923.03845 3695.94784
3.55000 -6971.25052 62.29468 -40.05883 614.18453 885.94523 3645.91336
3.65000 -6961.02752 75.73795 -93.43941 581.99568 863.50033 3525.64075
3.75000 -6926.50761 65.13403 -52.80515 592.74990 830.84748 3455.08595
3.85000 -6911.84184 50.43676 32.58158 581.61442 798.26303 3362.15400
3.95000 -6872.26618 73.10484 -78.64480 572.93080 757.78455 3273.41038
4.05000 -6836.02447 58.96775 -36.27583 547.46450 734.50573 3184.05298
4.15000 -6794.45003 44.51073 57.05597 536.99374 709.24172 3115.65679
4.25000 -6759.24921 47.60062 -18.71851 540.91929 677.17171 3042.85336
4.35000 -6745.99861 44.97707 -76.90530 545.25972 655.25855 2919.12922
4.45000 -6692.98845 52.07386 -37.08149 544.60347 622.74777 2902.04043
4.55000 -6666.67713 44.92630 -49.05108 524.44323 598.07916 2797.39272
4.65000 -6625.23659 62.33161 -22.55250 512.52383 574.69303 2732.96911
4.75000 -6597.11391 48.89476 -60.11785 524.61738 553.58101 2665.02489
4.85000 -6553.22985 66.04436 -41.02010 505.96000 525.15036 2621.55416
4.95000 -6526.41998 62.13160 -42.74274 507.48198 507.96336 2527.26197
5.05000 -6481.53480 57.98773 -25.45694 503.27021 482.23539 2481.07935
5.15000 -6442.17333 53.05139 1.83401 490.05522 463.46050 2408.80847
5.25000 -6419.70770 54.32938 -34.46527 476.63311 446.87900 2348.45398
5.35000 -6360.25878 66.31814 11.85873 465.39253 425.42950 2321.29892
5.45000 -6345.65616 59.83562 -7.40324 458.25304 405.52839 2252.82220
5.55000 -6284.63071 57.82388 6.85033 460.50512 390.37493 2197.73161
5.65000 -6256.93921 61.33610 51.62100 438.82121 368.56268 2169.95030
5.75000 -6206.23159 57.93700 28.35455 435.66850 356.90897 2112.92179
5.85000 -6153.89130 66.00327 35.71570 434.68844 339.63793 2091.43783
5.95000 -6126.16939 56.63820 62.46722 415.81086 322.70062 2022.02716
6.05000 -6085.16054 60.23848 24.59430 405.09276 310.08667 1970.10038
6.15000 -6049.88878 61.33797 72.65041 387.64208 301.99040 1918.76609
6.25000 -6011.97968 60.11085 34.92484 383.03531 287.52473 1865.19761
6.35000 -5980.95454 53.20561 -2.12894 374.74186 276.66847 1811.77518
6.45000 -5925.54946 54.96252 38.24600 368.28603 263.98501 1808.38523
6.55000 -5888.43075 61.17413 34.09343 360.00284 258.04633 1741.09994
6.65000 -5847.91963 53.05078 70.10423 354.96110 242.73653 1717.81192
6.75000 -5811.00028 57.05914 71.11188 345.18495 237.58927 1673.23053
6.85000 -5772.35228 55.19224 56.59921 329.91308 228.73664 1653.64102
6.95000 -5731.35426 49.42080 19.01985 318.88162 221.10736 1609.67927
7.05000 -5696.89353 53.26771 60.01080 306.71132 211.98435 1552.83803
7.15000 -5648.41369 52.95012 71.15940 298.99842 200.13264 1537.94186
7.25000 -5611.02056 48.89545 25.82596 300.28234 202.01726 1492.12169
7.35000 -5579.22911 42.79148 26.07864 288.89748 191.65737 1473.40368
7.45000 -5525.73471 46.34917 36.03831 278.43985 185.83072 1447.48074
7.55000 -5483.50095 44.70426 52.72844 274.48938 183.70066 1416.89599
7.65000 -5457.66990 40.66824 52.87543 268.92387 171.16962 1370.78467
7.75000 -5417.97015 38.23505 13.53775 257.31214 168.98179 1348.69170
7.85000 -5385.94876 40.09546 26.95285 254.56584 166.35387 1304.65268
7.95000 -5348.06824 40.16451 22.46321 240.57500 157.49840 1288.87750
8.05000 -5302.48834 39.15243 21.00966 239.96791 156.64155 1274.44981
8.15000 -5281.00135 36.66953 48.98721 244.73554 151.29718 1230.54774
8.25000 -5230.42969 35.77826 70.78924 229.09337 149.82078 1195.74752
8.35000 -5190.76874 33.21803 73.15324 229.98382 140.60613 1166.82060
8.45000 -5151.18860 35.97784 21.06111 217.19873 140.18310 1150.92888
8.55000 -5104.55554 35.01389 70.53765 220.52412 133.70370 1123.54393
8.65000 -5060.01475 33.93097 75.13280 202.18416 134.07218 1097.12289
8.75000 -5027.89011 33.69720 33.89482 201.43687 131.27473 1064.85507
8.85000 -4986.29370 31.06578 62.21373 188.59381 122.13682 1055.06847
8.95000 -4940.68049 32.08738 30.49201 195.10087 123.53321 1050.32120
9.05000 -4909.43333 28.79560 51.05789 190.06002 117.95289 1013.31942
9.15000 -4870.18035 31.26420 45.91853 183.48749 120.39816 1001.27324
9.25000 -4834.10167 30.53322 38.52944 176.36127 116.70380 978.67405
9.35000 -4802.51835 27.75853 9.24717 170.56576 112.81541 946.95216
9.45000 -4765.59683 29.79294 21.43801 169.63414 110.19985 940.25147
9.55000 -4733.79891 29.52887 47.44916 157.85007 108.45369 905.45592
9.65000 -4692.91906 29.39210 43.72106 163.42431 108.66288 901.86401
9.75000 -4664.33389 27.48757 4.36593 160.58042 105.89386 863.42156
9.85000 -4625.08381 27.72921 11.32133 154.27307 103.20406 854.88807
9.95000 -4593.50329 27.61478 53.08042 149.73642 103.03136 825.33878
10.05000 -4559.87884 26.85877 41.97794 154.17481 103.05668 826.07140
10.15000 -4529.11498 24.32204 27.80477 149.93301 103.54302 807.16696
10.25000 -4498.18131 23.73191 29.39662 151.04459 99.64079 780.79810
10.35000 -4460.76336 24.59588 13.68634 148.63206 94.83620 784.36285
10.45000 -4420.09181 27.30869 27.31626 144.50182 99.36302 764.00876
10.55000 -4385.89430 22.87552 3.54055 146.52100 91.24081 753.97149
10.65000 -4350.83886 26.74317 46.89669 134.53389 88.51322 722.25974
10.75000 -4315.55764 22.70726 12.01946 128.27176 90.04860 726.24952
10.85000 -4283.76101 27.44983 42.30645 129.16819 93.40057 707.98338
10.95000 -4254.84293 21.78661 24.34125 128.44751 90.34260 682.66149
11.05000 -4211.92727 23.32493 28.74500 123.53235 82.64316 685.37226
11.15000 -4181.66280 24.13262 34.02863 144.94859 93.32201 663.99845
11.25000 -4152.77584 23.40857 24.99651 126.16938 86.88189 643.99614
11.35000 -4112.30358 22.96983 27.95922 122.24198 83.09777 635.42702
11.45000 -4089.81766 23.64267 24.60721 121.22588 89.11008 612.68290
11.55000 -4057.68718 22.82088 24.11085 123.56526 85.76998 614.85638
11.65000 -4025.23532 23.82457 18.69864 113.65200 78.12090 598.86254
11.75000 -3996.89251 21.55201 19.01620 107.15180 81.81847 590.99103
11.85000 -3963.51808 23.02734 14.09557 115.21727 78.36158 587.69299
11.95000 -3933.39492 23.43129 9.84111 111.84616 80.32407 561.57518
12.05000 -3902.90363 20.33401 34.78558 115.18323 83.97142 558.56618
12.15000 -3880.14434 20.33565 4.72271 109.82542 77.83855 546.24233
12.25000 -3850.09310 19.25538 11.91934 104.48324 78.94903 539.82808
12.35000 -3819.51096 20.55628 5.22192 101.13776 70.19322 527.16838
12.45000 -3789.28681 17.97770 4.64588 99.30180 83.76115 524.70128
12.55000 -3763.49024 19.50652 31.80763 90.20082 74.21331 502.35411
12.65000 -3738.17355 18.83948 20.23468 92.13228 75.25064 484.88502
12.75000 -3714.97332 16.90557 23.30871 96.78718 78.67389 476.69835
12.85000 -3682.48841 19.59535 28.07786 90.78325 72.23869 485.17290
12.95000 -3656.07730 20.52324 1.15118 89.28484 69.41044 468.15384
13.05000 -3634.66480 17.18369 32.32871 87.73460 69.14421 459.36349
13.15000 -3607.04014 19.88289 17.27309 88.85836 67.60999 459.54391
13.25000 -3584.88459 15.64662 30.09115 90.28794 73.44733 443.22224
13.35000 -3551.86284 15.91697 30.12566 89.55300 65.99175 445.02339
13.45000 -3530.81334 15.78306 49.62110 82.95575 69.04221 422.86588
13.55000 -3502.94788 15.48279 28.78702 82.01294 71.91211 423.29577
13.65000 -3479.96920 18.13446 36.15426 80.58200 68.05560 408.29144
13.75000 -3458.38141 15.53542 30.21846 79.19668 63.85071 409.75380
13.85000 -3431.96258 16.99130 42.77145 81.81453 64.86322 399.40305
13.95000 -3413.95992 15.27022 33.54837 77.28921 63.38788 393.10846
14.05000 -3390.87643 14.68521 45.29857 83.97413 62.05247 391.32733
14.15000 -3367.84279 16.29593 48.40324 77.98893 76.70200 370.38686
14.25000 -3349.24873 13.89719 50.63933 72.80947 64.13113 364.80609
14.35000 -3324.03973 17.56493 49.69047 76.24388 57.79355 368.00284
14.45000 -3300.87483 16.53356 55.56635 73.36626 63.82140 360.93634
14.55000 -3279.02844 13.70071 38.68577 72.49523 56.87913 349.71283
14.65000 -3251.57742 11.94690 43.52573 74.13765 60.40480 351.19133
14.75000 -3230.53279 13.53471 33.94497 72.07664 60.24375 338.16722
14.85000 -3209.93191 12.98237 45.89669 66.91968 58.62711 334.68907
14.95000 -3188.05640 12.54332 25.35895 62.18173 57.82387 325.65394
15.05000 -3166.43700 13.64590 34.56373 72.93225 58.46144 321.92073
15.15000 -3151.20668 11.43241 23.69472 69.09104 54.87364 316.38697
15.25000 -3131.96010 12.87020 46.88360 65.64097 54.51628 314.57975
15.35000 -3106.50535 13.53607 44.49097 66.27709 64.40000 309.20894
15.45000 -3083.39885 12.18556 29.14945 69.46924 51.01267 302.60851
15.55000 -3067.45898 12.24590 21.12508 66.06959 60.28638 296.52204
15.65000 -3042.81212 10.84133 32.74567 65.33486 55.32808 283.03572
15.75000 -3025.04562 11.53710 20.15944 69.85698 54.84812 286.97802
15.85000 -3004.25077 12.35583 32.06949 62.48118 54.06037 284.52003
15.95000 -2991.03927 12.54444 39.09869 65.40527 62.72492 283.90632
16.05000 -2968.74956 11.55540 23.40334 65.80023 66.15099 273.68372
16.15000 -2951.22726 11.55055 32.17600 63.52372 68.96474 259.37805
16.25000 -2929.99082 10.85439 18.36875 56.86349 53.22028 262.36659
16.35000 -2909.74733 10.05156 24.96875 61.54598 46.31430 260.07396
16.45000 -2892.52499 12.88714 30.07142 56.31344 46.19652 249.62547
16.55000 -2875.97075 10.08318 33.85479 57.70627 46.90034 246.95734
16.65000 -2856.68515 11.26078 23.42368 56.77955 56.94896 240.81782
16.75000 -2837.81837 11.42090 22.63882 64.85442 51.89035 239.69241
16.85000 -2818.68350 12.11667 21.78328 52.34254 47.97307 232.75506
16.95000 -2797.40592 11.07623 21.07058 61.47916 53.51645 233.22263
17.05000 -2781.43228 11.05590 29.39855 49.64428 44.85866 224.24563
17.15000 -2761.73540 10.80670 25.83005 47.90975 46.67290 219.93394
17.25000 -2741.38011 11.54664 28.46187 60.23696 47.75312 219.27994
17.35000 -2720.84617 11.38434 23.87857 61.43854 56.59026 217.78535
17.45000 -2705.43067 9.73285 30.08579 53.09136 48.19509 213.15150
17.55000 -2689.89694 8.13422 34.53694 56.25506 53.31586 218.65233
17.65000 -2673.58684 8.19350 36.24400 56.56619 52.14357 203.66202
17.75000 -2657.96399 9.58670 26.31372 41.79682 37.32503 201.58729
17.85000 -2643.48902 9.88817 35.06368 49.11237 43.80375 194.92192
17.95000 -2626.26872 9.00882 22.73600 46.95980 35.45219 196.72677
18.05000 -2609.42667 7.97872 35.68941 51.81441 48.92267 191.15579
18.15000 -2590.76510 11.15893 40.78609 50.07271 51.83513 180.98109
18.25000 -2574.93879 8.69331 30.65687 55.69112 56.32858 184.27207
18.35000 -2565.66898 7.27870 38.09731 43.01858 45.07698 186.41066
18.45000 -2547.90417 11.13360 37.24269 60.51172 42.53263 180.78001
18.55000 -2532.59764 7.04642 30.43789 45.89406 38.34883 176.40421
18.65000 -2518.41252 7.89718 13.70096 52.41951 45.89233 180.88164
18.75000 -2500.60371 9.36808 32.49142 60.01783 43.30252 171.53769
18.85000 -2487.46169 6.95748 27.58890 52.31049 43.93294 170.67991
18.95000 -2475.42896 9.72799 18.40694 41.85589 41.02846 168.94348
19.05000 -2456.16047 8.35741 32.34706 44.32595 52.00994 167.29820
19.15000 -2443.13022 8.71430 28.00207 52.57889 36.31063 159.00773
19.25000 -2427.51082 10.88337 29.09997 46.29901 36.73564 164.65506
19.35000 -2416.86621 5.80382 30.42522 47.96574 45.08918 159.20774
19.45000 -2400.93203 7.87201 40.00533 37.31091 32.29734 154.60524
19.55000 -2389.55850 9.00403 23.40490 47.07018 41.05197 153.23168
19.65000 -2371.55649 8.66047 21.80374 50.64266 58.21577 155.77331
19.75000 -2360.08182 8.92019 26.77938 46.32574 38.02610 149.77734
19.85000 -2347.31187 5.88235 28.08417 38.06732 48.80754 148.07965
19.95000 -2334.11573 8.43956 26.88276 50.95241 34.75827 157.17120
