0.2 0.24613 15.37602 -1.99357 69.46065 70.70747 69.89846
0.6 0.95066 37.91113 1.2063 67.11179 68.02739 66.35394
1.0 1.46578 61.78671 0.33508 63.91299 64.07417 62.60148
1.4 1.88184 83.05133 0.15188 60.52126 60.75915 59.01856
1.8 1.90857 98.29595 0.36923 58.93296 57.89937 56.41417
2.2 1.3379 112.5743 0.01464 56.47817 55.15508 53.59356
2.6 1.19137 124.59612 0.25769 54.42691 52.48317 51.27662
3.0 0.67948 134.91805 0.55099 51.96023 49.8817 49.50546
3.4 0.43021 143.75872 0.48216 50.21077 47.16003 47.0015
3.8 -0.25402 152.32369 0.87461 48.40944 45.03673 45.03896
4.2 -0.19138 160.18975 0.77913 46.34621 42.17578 42.75731
4.6 -0.83988 166.12601 0.43173 44.15799 39.84188 40.86395
5.0 -0.47545 172.31227 -0.16229 42.57285 37.93558 38.77617
5.4 -0.76805 177.06284 -0.42843 40.89396 35.37934 37.28141
5.8 -0.70757 180.82922 -0.63185 39.26283 33.28495 35.5511
6.2 -0.91611 184.72346 -1.59763 38.31943 31.85334 34.00766
6.6 -1.3042 188.84258 -0.85084 36.64684 31.06452 32.69518
7.0 -0.28193 192.29238 -1.1 35.12981 29.52791 31.20689
7.4 -0.16408 194.92791 -1.13362 33.84707 28.03278 29.72068
7.8 -0.5074 197.60638 -0.50158 32.83093 26.35394 28.31057
8.2 -0.31359 199.12573 -0.37805 31.76134 25.92305 27.09136
8.6 -0.46506 200.61671 -0.87567 30.79348 24.49332 25.9118
9.0 -1.11127 202.32779 -0.69978 29.62048 23.48264 25.01526
9.4 -0.4974 204.39303 -0.71898 28.5772 22.81862 23.95197
9.8 -0.57543 206.20764 -0.56271 27.32444 21.72085 22.95152
10.2 -0.17557 206.60251 0.00746 26.24447 20.52537 22.10656
10.6 0.08825 207.60478 -0.14137 25.68046 19.85981 21.25305
11.0 0.77171 208.69944 0.03403 24.59175 19.87785 20.44169
11.4 0.46139 210.30962 0.1549 23.55919 19.16253 19.3607
11.8 0.70235 210.8514 0.17688 22.7843 17.97804 18.81859
12.2 0.41675 210.413 0.11347 22.44488 16.64678 18.14615
12.6 -0.1459 210.15294 -0.02442 21.93544 16.35321 17.35406
13.0 -0.74178 210.62905 0.72809 21.09191 16.41774 16.43257
13.4 -0.63774 212.48639 1.18751 19.9675 15.92595 16.18615
13.8 0.16394 213.70786 1.6351 19.34587 15.18149 15.51096
14.2 0.0468 213.75877 1.32499 18.65755 14.40381 14.64863
14.6 0.63844 213.24692 0.86692 18.03203 13.82578 14.27252
15.0 0.37608 213.19933 0.38068 17.49085 13.41628 13.55748
15.4 -0.47122 212.94391 -0.17647 17.15127 12.66146 13.27832
15.8 -1.80588 212.31864 0.07621 17.10421 11.97507 13.27938
16.2 -2.55157 211.47179 0.04585 16.87762 11.63294 12.71462
16.6 -2.92003 211.78619 0.53844 15.48579 10.95916 12.10382
17.0 -1.27474 212.3256 0.79313 14.81722 10.89425 11.72879
17.4 -0.60042 211.76757 0.92953 14.2082 10.45644 11.03758
17.8 0.60633 211.71874 0.41572 13.64724 10.44381 10.5304
18.2 0.7527 211.6438 0.1271 13.52866 10.0468 10.13501
18.6 1.17236 212.05474 0.00243 12.69189 10.14904 9.89314
19.0 1.70632 212.52321 -0.01266 12.66776 10.36347 9.38003
19.4 2.95102 213.23793 0.44279 12.5513 9.31457 9.5834
19.8 3.55583 212.84767 0.85671 12.76598 9.12873 9.2043
