0.05000 -1981.12997 -31.41493 73267.58306 1850.71439 1557.52168 953283.39552
0.15000 -4239.82124 -32.49258 -29953.29193 1850.77736 1630.63596 1023604.57428
0.25000 -6702.51807 109.73323 -36126.55573 1749.91115 1746.05045 1023605.54524
0.35000 -8526.80160 163.62164 8480.89131 1933.94411 1862.31935 933174.98930
0.45000 -10165.04154 101.12665 -9071.86013 2054.23941 2018.93994 855507.32847
0.55000 -11268.36894 146.58099 -2696.65510 1999.87196 2235.09359 785484.76422
0.65000 -12129.74886 135.37273 7812.44736 1982.12866 2369.19393 762499.23232
0.75000 -12773.21784 92.29634 22707.85636 1916.13489 2442.78835 768132.49557
0.85000 -13096.06875 191.85751 11578.57545 1848.46964 2488.43018 693041.85411
0.95000 -13324.80169 53.11169 -7559.14039 1750.78648 2555.85830 681823.19348
1.05000 -13457.25849 146.87423 -161.55699 1633.06036 2545.07693 661521.05653
1.15000 -13425.31656 130.13009 -13910.55156 1510.51810 2548.28380 645034.82033
1.25000 -13362.06437 129.28226 -1464.40591 1363.71903 2510.06815 613360.93243
1.35000 -13209.33065 95.58606 -6546.13446 1228.62722 2494.14566 572611.36111
1.45000 -13037.88748 102.71676 10893.85380 1102.41686 2445.45109 531556.33945
1.55000 -12852.16316 129.92441 1102.15423 978.66674 2418.85025 493000.88009
1.65000 -12633.58153 38.21963 -3011.22823 849.25900 2327.85136 507674.07708
1.75000 -12425.10621 40.43956 4779.80879 746.82145 2293.74876 488047.65756
1.85000 -12191.92357 110.91955 -1072.72301 659.59958 2216.62267 440508.86686
1.95000 -11952.34727 80.52698 -1345.05796 601.00948 2156.54540 440877.68642
2.05000 -11723.21889 59.14702 7319.17235 540.69153 2112.62782 432070.94677
2.15000 -11492.11732 81.36273 -1336.25690 492.75684 2041.74529 395589.07283
2.25000 -11249.36611 39.05766 3620.30027 463.38716 1999.18330 381167.19103
2.35000 -10991.21615 31.37848 -6535.41793 442.29620 1933.42327 354558.09046
2.45000 -10766.61198 21.67645 2906.05550 414.57278 1896.60322 349727.19483
2.55000 -10535.41077 66.84686 2697.71869 378.29057 1863.35615 326727.61423
2.65000 -10299.85332 -13.77984 4644.62318 361.10320 1798.76504 334240.72084
2.75000 -10094.46792 8.74457 6939.77609 342.67684 1751.01234 294559.47918
2.85000 -9883.28293 -1.54871 699.70546 348.13435 1698.99236 296797.99130
2.95000 -9673.39402 0.55610 5361.70366 338.02053 1673.37997 285227.42119
3.05000 -9464.11736 51.21930 2052.18219 345.87188 1612.26306 267654.16334
3.15000 -9270.99928 31.50300 -3071.39949 323.85353 1586.15908 259952.69964
3.25000 -9082.15337 34.35241 1695.76363 302.65574 1541.31310 251863.68000
3.35000 -8907.06446 58.75572 5479.95207 293.91997 1515.78770 231076.45094
3.45000 -8744.04280 113.78754 -29.38613 288.88494 1470.86222 220675.69659
3.55000 -8584.56264 65.19217 4957.15984 296.17530 1433.01821 211343.84889
3.65000 -8428.68250 78.84335 1108.11434 312.54756 1400.99597 199328.90572
3.75000 -8287.97562 87.13802 2021.50936 320.94063 1373.35105 188394.47657
3.85000 -8149.83927 96.76122 3782.66184 331.92125 1339.96302 199880.61483
3.95000 -8015.20689 84.22326 5856.81003 347.57504 1295.10465 183513.36306
4.05000 -7885.10291 71.86754 3799.66864 352.68484 1265.61953 184866.70986
4.15000 -7758.75748 91.74722 3485.31049 365.90245 1242.21210 175940.96073
4.25000 -7625.00559 116.68005 65.69429 367.37448 1219.50955 158433.34790
4.35000 -7503.44094 157.62259 5074.83906 374.50029 1185.62598 162914.88097
4.45000 -7384.19908 142.77859 2914.93124 378.21881 1166.76517 156644.90681
4.55000 -7268.95011 152.19077 646.25189 373.31630 1121.57931 159135.26427
4.65000 -7160.60549 155.00941 3444.02912 366.46127 1110.38745 161905.87750
4.75000 -7066.42299 175.16300 2356.40116 367.89464 1080.57655 137704.25876
4.85000 -6970.68031 166.38427 -674.94946 357.27932 1057.10733 124472.83195
4.95000 -6881.91528 183.09292 578.11031 362.24804 1042.82483 123992.83442
5.05000 -6787.24348 151.71776 -464.84796 361.72838 1025.37027 117755.37082
5.15000 -6702.61386 148.33143 -1940.51656 360.57631 1007.85862 113530.39698
5.25000 -6617.02905 133.15579 -3008.64164 368.82162 971.17904 123322.28181
5.35000 -6540.88499 124.95641 -2074.01368 376.66245 954.71823 106952.28468
5.45000 -6448.81327 93.58543 -3121.68211 378.16193 936.17576 105803.07048
5.55000 -6365.34485 99.70053 -5912.12392 383.01936 903.10209 102419.04300
5.65000 -6288.19093 73.19762 -6227.00873 385.03751 884.21529 95591.03488
5.75000 -6198.73112 64.55406 -6379.27055 381.65888 865.98386 81474.97857
5.85000 -6149.81287 54.13662 -6320.36953 377.42435 841.44928 90262.61373
5.95000 -6101.17579 36.87886 -8400.49432 386.09501 826.16720 104055.51424
6.05000 -6050.54243 41.02304 -9040.60488 393.45913 809.43643 99288.73182
6.15000 -6018.15272 32.34491 -7458.25508 398.70073 783.51218 74145.51105
6.25000 -5983.30998 40.61576 -10766.31332 417.55006 761.42452 76035.31172
6.35000 -5955.08112 67.79188 -7770.32141 432.77784 729.06405 58117.58523
6.45000 -5916.63012 46.76077 -8112.10317 449.46834 710.77810 60013.13060
6.55000 -5891.89285 58.28257 -8025.49927 465.09381 681.94223 55516.46979
6.65000 -5865.16566 76.93559 -6653.27776 477.89454 656.49756 53192.23874
6.75000 -5830.94686 64.20477 -6913.09647 495.76235 633.30211 53844.28226
6.85000 -5784.10678 76.18992 -6428.10643 502.89979 603.32732 57618.03737
6.95000 -5749.44049 77.25694 -6622.69973 507.97316 580.51156 44251.55914
7.05000 -5725.10461 75.12877 -5727.24820 521.16816 551.62185 43917.95864
7.15000 -5678.70845 88.18911 -5250.50589 518.60664 525.64974 37306.83844
7.25000 -5628.49059 95.63711 -5174.40586 513.47542 495.47754 36193.87784
7.35000 -5587.12589 95.45015 -4799.09807 506.04049 476.84731 32664.81708
7.45000 -5530.07190 88.66271 -4687.21386 490.33002 453.68447 36005.37283
7.55000 -5486.98799 83.51301 -4875.94679 476.64146 435.59746 35449.66584
7.65000 -5451.04824 77.39265 -3734.94369 471.77742 411.63007 52293.14551
7.75000 -5417.68317 71.53437 -4706.09416 453.94182 397.59697 31965.11011
7.85000 -5400.25118 77.20754 -3421.83160 446.95220 378.15351 30075.66998
7.95000 -5343.92448 74.78677 -4148.31393 433.62959 363.19861 56770.14890
8.05000 -5302.96914 75.00238 -3466.35499 422.25862 346.70444 31190.04690
8.15000 -5266.96147 64.61965 -3596.43112 422.07628 331.24564 30608.82642
8.25000 -5209.42715 61.21791 -2571.02074 408.09645 314.60884 26560.23897
8.35000 -5177.06807 62.97131 -2862.96983 394.06818 302.36946 26687.13244
8.45000 -5132.64712 67.40936 -2044.58839 376.58869 290.13032 25839.75245
8.55000 -5094.27154 66.16117 -3208.49566 368.16859 277.74698 84496.72642
8.65000 -5042.07999 58.53136 -2611.80747 352.79388 263.14440 24702.64830
8.75000 -5000.62533 68.35569 -1988.99294 337.73117 253.66797 25194.76826
8.85000 -4951.22694 59.79765 -1899.38742 322.32760 245.23535 20916.65151
8.95000 -4904.56792 57.88692 -1641.33378 307.06738 237.35748 21172.83851
9.05000 -4868.91898 61.77797 -1947.09853 296.54160 226.18942 18425.39095
9.15000 -4822.18145 54.65376 -1235.55851 288.52800 219.12514 19316.11406
9.25000 -4782.35767 62.42342 -1442.39383 282.00937 209.34857 18434.36042
9.35000 -4740.38834 60.33615 -1742.57403 273.93825 203.61844 21015.35742
9.45000 -4696.39595 55.29383 -1601.57591 262.97221 195.75150 20287.33326
9.55000 -4646.44711 59.79891 -1129.42218 248.84453 187.10503 18193.97789
9.65000 -4607.01481 58.11020 -435.48008 240.70739 182.78215 23694.31347
9.75000 -4566.00986 56.54479 -1043.57028 233.78873 174.05293 18138.24129
9.85000 -4528.94503 55.86811 -1063.17194 217.50096 172.44198 15859.62061
9.95000 -4494.55974 57.33602 -1059.08724 208.94407 165.67171 16726.59693
10.05000 -4458.89295 50.09343 -1067.89312 201.95230 157.03449 14289.06730
10.15000 -4418.51029 58.44981 -800.40515 195.35936 153.48554 15766.62775
10.25000 -4381.08061 55.44325 -739.18683 187.56812 149.28293 14768.39856
10.35000 -4346.78910 53.14335 -861.39371 183.94369 145.69964 15111.28782
10.45000 -4311.77213 54.30027 -1330.11161 179.24872 141.00126 15361.32641
10.55000 -4278.96666 50.27183 -478.69802 176.29585 136.94900 13994.01154
10.65000 -4228.50862 52.04539 -714.25166 169.33056 130.63075 12703.22800
10.75000 -4199.46102 56.00812 -668.95913 159.38727 131.44073 11108.99453
10.85000 -4165.05487 55.04494 -182.07219 153.06246 126.68165 13251.54126
10.95000 -4139.66456 52.21630 -501.86775 149.42938 123.28248 13336.42430
11.05000 -4100.82016 53.57847 -255.43017 142.25277 120.77758 14379.57147
11.15000 -4066.82240 52.87802 -163.14668 138.05316 116.28310 10848.96331
11.25000 -4034.89728 50.35290 -35.71462 135.87576 113.90338 10333.40483
11.35000 -4002.59630 48.20398 -530.44060 135.33784 112.15946 10451.65745
11.45000 -3969.10802 45.09446 -356.36284 131.55822 107.13861 10711.48393
11.55000 -3940.00585 42.31270 -246.32271 127.60945 104.69719 11056.87194
11.65000 -3909.10696 43.23404 -284.16417 128.92401 100.44073 11317.50080
11.75000 -3875.45944 42.86676 -302.56331 128.09045 98.42587 8946.61541
11.85000 -3848.52290 41.87354 -131.24140 128.50273 98.28915 9082.68689
11.95000 -3812.43116 42.57025 -45.42880 125.06914 92.66773 7505.39416
12.05000 -3786.64026 46.49643 -367.00131 125.75477 92.14014 8744.37742
12.15000 -3765.74164 37.05679 -84.65988 124.25011 92.25744 8879.61572
12.25000 -3731.71083 39.20491 29.79132 122.39307 89.48819 10600.19269
12.35000 -3703.78744 38.93330 -791.29836 121.92487 86.98047 8075.93475
12.45000 -3674.71281 38.91652 -518.65426 119.94351 83.45317 8410.53182
12.55000 -3642.80568 39.44053 2.42892 116.63522 81.04133 7309.19637
12.65000 -3614.24513 38.58323 -254.95445 113.92792 78.82378 8579.51626
12.75000 -3587.67570 36.05376 -533.07701 110.44899 76.15548 7864.17414
12.85000 -3556.24785 35.99486 -312.80123 106.34619 74.93944 8235.17049
12.95000 -3532.88547 35.24932 -161.85953 102.64144 70.64549 9695.77460
13.05000 -3501.46728 33.50012 -316.51447 97.67067 71.15124 8517.31541
13.15000 -3479.54512 35.40931 -172.10798 95.09453 70.21835 7826.12909
13.25000 -3455.34861 34.89595 -744.50828 98.44627 68.04313 10135.50947
13.35000 -3425.50890 34.56448 -238.34894 98.94229 65.31114 7460.68646
13.45000 -3408.81682 35.37719 -200.71087 96.98398 63.58696 7874.46434
13.55000 -3377.87016 33.67361 -218.33022 95.37697 61.73635 9959.96446
13.65000 -3355.33855 33.77853 -186.71797 92.89959 62.68974 6385.34719
13.75000 -3332.33448 31.22956 -149.73607 90.87511 60.51370 6770.25574
13.85000 -3310.25214 32.76643 -128.17653 91.10101 59.42933 6675.20857
13.95000 -3282.66806 29.18158 183.34969 90.61266 58.74708 13071.66410
14.05000 -3260.77360 31.61939 -87.59306 89.90360 59.32601 6366.72664
14.15000 -3235.69949 31.65994 -51.40829 88.21887 56.71124 6496.28111
14.25000 -3214.48518 28.76201 -308.47812 89.38565 54.81436 6124.00752
14.35000 -3190.91612 29.25951 135.49461 87.73737 52.62641 5534.77549
14.45000 -3168.69078 28.83754 159.55256 85.45966 53.11397 6125.22228
14.55000 -3146.26723 29.62092 -193.31704 80.90517 51.88780 5817.36182
14.65000 -3127.07252 28.35286 235.59420 84.58112 51.02022 6579.67279
14.75000 -3102.80763 30.36719 -7.07015 83.61895 49.29601 4917.88209
14.85000 -3082.22186 29.83972 93.85214 79.66777 47.55589 6364.39368
14.95000 -3065.51111 30.72376 15.84636 79.28749 46.99139 4682.50293
15.05000 -3046.39803 30.28696 17.42958 80.06444 45.80398 4437.69870
15.15000 -3016.83313 30.76057 49.44024 75.08060 43.75417 4017.39771
15.25000 -3002.60862 29.55721 -5.58323 73.06583 44.48390 4284.22642
15.35000 -2985.01863 27.78206 -217.30859 70.41808 44.59905 6442.45123
15.45000 -2962.93246 29.80517 77.42215 68.75928 41.60024 5036.72644
15.55000 -2939.04419 30.52250 217.35018 67.69020 40.96536 5601.92759
15.65000 -2924.80121 28.79827 -103.06895 64.87289 41.42626 4747.20645
15.75000 -2903.95404 27.39221 58.90815 62.50957 40.82302 4181.74567
15.85000 -2885.88496 28.53059 126.05379 60.45243 39.45124 5041.30721
15.95000 -2870.24220 25.57971 -118.49805 59.26664 40.58363 4951.09558
16.05000 -2850.56625 29.10768 97.54369 54.93142 39.51957 4308.47700
16.15000 -2836.02751 26.80091 -145.18853 55.35135 40.08033 4462.49093
16.25000 -2818.35883 26.61760 138.62558 51.64951 39.55602 4244.02419
16.35000 -2799.06473 26.72884 81.23125 50.63095 37.26287 4017.00598
16.45000 -2789.03635 26.88989 64.96100 48.75159 38.32239 4276.21374
16.55000 -2772.01385 25.60371 -79.44584 48.25744 38.25997 3837.13970
16.65000 -2756.23018 25.18164 67.55882 45.60254 36.65361 5432.16373
16.75000 -2738.27520 24.24496 228.76414 44.98989 35.73344 4767.68784
16.85000 -2719.13530 25.09842 92.47151 44.41957 33.86930 3060.28690
16.95000 -2706.64194 22.41833 75.17773 40.87688 35.14469 4113.59488
17.05000 -2687.02152 23.42510 -37.72610 41.55723 34.20242 3994.54583
17.15000 -2675.97579 22.06073 80.81488 41.56130 34.72838 2856.68881
17.25000 -2657.74568 23.79567 109.18562 41.71261 34.16817 3576.87015
17.35000 -2642.88551 21.52653 61.41208 38.97251 33.72702 2460.09801
17.45000 -2625.45806 21.12224 92.79275 39.44649 33.41502 2782.13676
17.55000 -2607.94153 20.93954 4.03854 39.02369 31.95883 3181.23620
17.65000 -2591.72299 22.02095 -165.94351 36.61612 31.91167 2853.80070
17.75000 -2579.54647 21.59173 99.62196 36.63711 31.86551 2477.69383
17.85000 -2564.18864 21.30952 28.29199 36.14745 32.74761 2274.97295
17.95000 -2549.27806 18.82315 188.55183 36.88970 33.76573 2397.91282
18.05000 -2533.91208 17.83578 77.41750 37.20382 31.79440 2329.80417
18.15000 -2521.19290 20.25789 32.69793 36.39751 32.31013 2288.06405
18.25000 -2504.59485 17.58652 152.91590 36.10576 32.20273 3006.99068
18.35000 -2490.54344 21.22543 -53.33711 37.17935 30.26660 2428.52084
18.45000 -2473.63760 18.86167 129.23180 36.80634 29.73742 2461.92864
18.55000 -2457.88536 16.00085 -144.86334 35.76668 29.97567 2620.19878
18.65000 -2442.60432 17.37406 66.67800 36.22846 29.44159 2098.29294
18.75000 -2429.64804 16.82558 133.65557 37.21062 29.85445 1823.00606
18.85000 -2412.76978 19.53300 14.39668 38.19305 29.51341 2007.90576
18.95000 -2393.68262 15.45403 161.95063 36.97668 29.33322 2030.75649
19.05000 -2381.54892 14.45340 125.75093 35.65759 30.48156 1595.03328
19.15000 -2365.09080 15.83607 -110.72646 36.22941 28.71399 2359.67193
19.25000 -2350.88828 15.53370 109.96324 34.47051 28.72501 2502.34051
19.35000 -2337.76601 16.38210 152.16344 33.51791 29.21940 1977.63793
19.45000 -2323.21255 16.09977 -7.94447 34.30556 27.59466 1392.66778
19.55000 -2310.80376 14.74811 -11.56145 28.98990 29.28893 1463.11318
19.65000 -2301.21668 14.48699 120.02152 30.80562 29.91560 1594.57591
19.75000 -2285.43287 14.17629 168.36322 31.53473 29.44896 1688.44315
19.85000 -2272.26949 15.24865 -47.37835 30.47391 28.78751 1636.25413
19.95000 -2262.86265 12.48413 141.84094 30.26915 27.61317 1242.71427
