0.120000 -0.051410
0.380000 0.007010
0.620000 0.076320
0.880000 0.038960
1.120000 -0.000100
1.380000 0.011780
1.620000 0.016560
1.880000 0.000860
2.120000 0.009730
2.380000 0.010820
2.620000 0.007390
2.880000 -0.039040
3.120000 -0.014180
3.380000 -0.018710
3.620000 0.006740
3.880000 -0.029190
4.120000 -0.031400
4.380000 -0.028870
4.620000 -0.028470
4.880000 0.011810
5.120000 0.128510
5.380000 0.011320
5.620000 0.219540
5.880000 0.168930
6.120000 -0.016510
6.380000 -0.189060
6.620000 -0.333130
6.880000 -0.352930
7.120000 -0.434060
7.380000 -0.511970
7.620000 -0.658260
7.880000 -0.652140
8.120000 -0.824510
8.380000 -0.747790
8.620000 -0.923800
8.880000 -0.870640
9.120000 -0.914030
9.380000 -0.944280
9.620000 -1.020040
9.880000 -0.812830
10.120000 -0.841910
10.380000 -0.929210
10.620000 -0.739270
10.880000 -0.948140
11.120000 -0.378170
11.380000 -2.099090
11.620000 -2.924520
11.880000 2.814680
12.120000 -2.339330
12.380000 -2.927880
12.620000 -1.685730
12.880000 -2.234070
13.120000 2.486540
13.380000 -2.133180
13.620000 -1.397150
13.880000 -2.552250
14.120000 -2.660430
14.380000 2.733370
14.620000 2.761930
14.880000 2.405280
