0.125 -0.006 -0.004 0.020
0.375 -0.005 -0.005 0.264
0.625 0.007 -0.057 0.851
0.875 -0.001 -0.040 1.764
1.125 0.013 -0.135 2.895
1.375 -0.063 -0.206 4.178
1.625 -0.014 -0.346 5.702
1.875 -0.038 -0.314 7.118
2.125 -0.086 -0.400 8.561
2.375 -0.008 -0.412 10.067
2.625 -0.095 -0.514 11.245
2.875 -0.080 -0.628 12.488
3.125 -0.165 -0.586 13.675
3.375 -0.099 -0.655 14.478
3.625 -0.242 -0.612 15.154
3.875 -0.150 -0.658 16.196
4.125 -0.123 -0.894 17.550
4.375 -0.112 -0.881 18.176
4.625 -0.085 -0.947 19.105
4.875 -0.112 -0.874 19.308
5.125 -0.178 -0.969 20.140
5.375 -0.152 -1.061 20.197
5.625 -0.109 -0.970 20.577
5.875 -0.111 -1.082 21.518
6.125 -0.005 -1.148 21.350
6.375 -0.029 -1.182 22.199
6.625 -0.043 -1.244 22.868
6.875 0.042 -1.148 22.756
7.125 -0.067 -1.204 22.983
7.375 -0.008 -1.332 23.134
7.625 0.024 -1.174 22.886
7.875 0.057 -1.192 22.819
8.125 -0.022 -1.265 22.730
8.375 0.100 -1.275 21.806
8.625 0.025 -1.124 21.778
8.875 0.009 -1.164 21.069
9.125 0.085 -1.133 20.607
9.375 0.014 -1.052 20.010
9.625 0.063 -1.124 20.727
9.875 0.075 -1.009 18.192
10.125 0.092 -0.987 19.128
10.375 0.116 -0.949 17.861
10.625 0.087 -0.936 17.251
10.875 -0.002 -0.986 16.849
11.125 0.057 -0.889 15.971
11.375 0.107 -0.944 16.147
11.625 0.125 -0.809 14.068
11.875 0.116 -0.732 13.507
12.125 0.170 -0.815 13.133
12.375 0.177 -0.818 12.719
12.625 0.181 -0.727 11.758
12.875 0.176 -0.701 11.006
13.125 0.183 -0.579 10.435
13.375 0.224 -0.592 10.066
13.625 0.238 -0.491 9.500
13.875 0.143 -0.465 8.458
14.125 0.158 -0.405 9.172
14.375 0.152 -0.339 7.281
14.625 0.112 -0.339 7.275
14.875 0.119 -0.336 7.362
15.125 0.141 -0.314 6.785
15.375 0.102 -0.249 6.323
15.625 0.075 -0.255 5.801
15.875 0.085 -0.299 6.425
16.125 0.085 -0.225 5.199
16.375 0.063 -0.185 4.835
16.625 0.060 -0.169 4.498
16.875 0.060 -0.180 4.453
17.125 0.085 -0.173 4.085
17.375 0.064 -0.155 4.161
17.625 0.067 -0.181 4.137
17.875 0.063 -0.127 3.412
18.125 0.049 -0.140 3.031
18.375 0.038 -0.107 3.377
18.625 0.046 -0.089 2.804
18.875 0.036 -0.088 3.210
19.125 0.041 -0.074 2.474
19.375 0.035 -0.070 2.737
19.625 0.026 -0.066 2.332
19.875 0.026 -0.067 2.229
