0.2 0.54724 19.21056 -0.50979 65.94798 66.776 65.55638
0.6 -0.73738 42.00761 0.27322 63.31531 64.3921 62.56741
1.0 -0.62612 67.36601 0.03487 60.05341 61.60035 58.71614
1.4 -0.2419 88.12087 0.39931 57.61106 57.58464 55.8272
1.8 -0.3207 103.86552 0.56361 55.07732 54.31463 53.09499
2.2 -0.86701 117.31775 0.05957 52.06071 51.11492 50.08285
2.6 -1.25244 129.08769 -0.18978 49.93301 47.94046 47.38447
3.0 -0.61444 139.25706 -0.56139 47.63854 45.042 44.73778
3.4 -0.57569 148.3744 -0.28074 45.33439 42.40795 42.61042
3.8 -0.34831 155.51203 -0.47311 43.57283 39.68433 39.88788
4.2 0.30877 163.3559 0.32076 41.74645 37.04755 37.83714
4.6 0.49619 169.57059 -0.06824 39.92146 34.47649 35.86771
5.0 0.71796 174.49139 -0.3582 38.01177 32.90524 33.84189
5.4 0.76584 179.38806 -0.62474 36.48863 31.23433 32.0906
5.8 0.81123 183.2312 -0.19723 35.00077 29.72339 30.39384
6.2 0.73598 187.07746 -0.68999 33.5943 28.0269 29.00319
6.6 0.25132 189.89231 -0.35126 32.30554 27.08923 27.78073
7.0 -0.55463 192.60152 -0.34692 30.53913 24.81664 26.31015
7.4 -0.47953 195.17537 -0.43545 29.13942 23.92476 24.87023
7.8 0.44291 198.16232 -0.16717 28.04482 22.78605 23.51222
8.2 0.38122 199.9682 -0.0635 26.91344 21.33766 22.49539
8.6 -0.15367 200.09453 -0.10441 25.86261 19.5589 21.39486
9.0 -0.55954 200.77749 -0.24051 24.95857 19.53478 20.75985
9.4 0.02688 203.52921 0.29394 23.89541 19.36524 19.49718
9.8 0.51 205.91301 0.23923 22.33147 18.32008 18.49335
10.2 1.2485 206.1559 0.76872 21.66199 16.69139 17.55403
10.6 0.55045 205.70362 0.61102 21.35846 16.11769 17.004
11.0 -0.46214 205.41953 0.85206 20.58517 15.42621 16.23239
11.4 -2.44663 205.9334 0.08548 19.94308 14.28939 15.72183
11.8 -2.69674 206.11168 0.93524 18.99513 13.52244 15.14451
12.2 -1.84684 207.50336 1.18141 17.71129 12.95509 14.10556
12.6 0.16935 207.87099 1.32686 16.4799 12.39019 12.92755
13.0 0.65688 207.43198 1.53543 16.06271 12.17906 12.50161
13.4 1.04859 207.90814 0.7501 15.2666 12.24591 12.14687
13.8 1.48133 208.74664 0.37689 14.7709 11.76944 11.67294
14.2 1.47032 209.37609 0.39405 14.84397 10.82744 11.52459
14.6 1.3776 208.55395 0.71531 15.1685 10.41034 11.19009
15.0 0.63675 207.79479 1.42303 13.84682 10.06862 10.463
15.4 -0.96115 207.62637 1.92668 12.73003 10.02252 10.10004
15.8 -0.82237 207.49212 2.42072 12.03099 9.58089 9.39347
16.2 -0.47114 208.13321 2.18374 11.79844 8.56124 9.28644
16.6 0.76713 207.7722 1.24622 11.48566 8.29007 8.89664
17.0 1.62069 207.80164 0.33599 11.40559 7.69891 8.72774
17.4 1.45291 207.86845 0.18599 10.99621 7.99949 8.1954
17.8 1.04001 207.91938 -0.72198 10.16078 7.10291 7.90399
18.2 0.24929 207.92044 -1.36925 9.3043 6.89149 7.46429
18.6 0.68711 207.48999 -1.39132 9.10683 6.73946 7.84298
19.0 1.86596 207.33709 -1.57934 8.74079 7.04857 7.36109
19.4 2.97864 207.67179 -0.93889 8.89522 7.10776 7.16564
19.8 4.81694 207.55678 -0.71248 9.17636 7.54318 7.00894
