0.05000 -1236.84173 175.18023 389.74633 1525.09661 1490.39084 1921.50002
0.15000 -1891.25944 163.86360 50.33369 1423.00184 1523.34891 2977.64323
0.25000 -3235.36663 -84.12479 125.08826 1799.78726 1545.85113 4397.24717
0.35000 -3862.63113 44.70986 -135.07938 1887.35143 1611.39433 5706.82782
0.45000 -4771.98035 53.62911 284.33356 2072.69058 1807.54360 6513.94396
0.55000 -5343.18681 1.83991 82.67025 2232.82330 1926.47157 7089.56749
0.65000 -5801.78332 -0.94590 -345.06086 2303.40088 1973.02738 7383.37202
0.75000 -6269.87252 19.52596 -10.89843 2406.88282 2117.87124 7651.48354
0.85000 -6514.27309 -47.33716 80.71966 2430.34353 2221.78899 7732.15619
0.95000 -6764.29037 14.40766 -124.91093 2444.75808 2340.15476 7722.92562
1.05000 -6924.50446 8.61720 220.65109 2353.52966 2414.53439 7681.85082
1.15000 -7072.24888 95.37419 119.12066 2300.47229 2466.24201 7577.71250
1.25000 -7284.64709 -44.05005 55.03081 2279.02863 2492.73043 7446.37767
1.35000 -7344.31646 -32.21648 -70.28121 2183.25075 2512.55343 7283.94709
1.45000 -7417.69398 -58.00371 -138.17715 2109.72093 2580.84596 7015.01709
1.55000 -7417.29076 47.16688 -34.34369 2064.38273 2573.67758 6876.05815
1.65000 -7462.78957 42.54992 -43.04219 1999.84774 2606.07061 6660.92178
1.75000 -7505.92795 19.30059 95.56162 1902.57140 2608.85864 6552.10628
1.85000 -7579.63333 38.27040 -104.00758 1806.11724 2612.84111 6355.96470
1.95000 -7552.16365 10.86554 -37.14792 1707.42447 2597.79790 6210.01295
2.05000 -7527.95587 56.00781 -193.26856 1635.01824 2582.69168 6050.89484
2.15000 -7577.33006 -9.70359 -70.33221 1508.93556 2600.34667 5807.19863
2.25000 -7489.41379 19.15764 -65.09175 1464.02256 2547.31889 5740.94018
2.35000 -7524.74151 6.12663 -3.28979 1379.58658 2536.88381 5552.18666
2.45000 -7498.46078 37.50016 5.44890 1279.03722 2522.56410 5381.16547
2.55000 -7423.73651 35.02679 15.94041 1255.49928 2421.64704 5304.71672
2.65000 -7426.55710 0.85077 -6.05764 1157.23123 2431.17508 5113.24249
2.75000 -7363.08321 72.02937 -73.17438 1103.38458 2401.29854 5041.71987
2.85000 -7338.59519 -11.28359 1.27274 1055.11422 2378.73482 4921.99140
2.95000 -7340.58287 71.96147 -153.54231 1009.51452 2337.43158 4768.79406
3.05000 -7304.16035 39.97304 52.16050 981.10677 2296.07916 4636.82758
3.15000 -7279.18300 52.66953 -100.67521 928.24600 2269.35999 4489.89185
3.25000 -7228.43767 16.84793 3.26785 892.45274 2217.02057 4474.88548
3.35000 -7199.19255 42.74211 -24.15410 839.59803 2184.70407 4317.06812
3.45000 -7155.29549 -9.61424 3.37121 793.98704 2153.18060 4260.76848
3.55000 -7106.18248 22.89002 -21.85109 773.04202 2064.63842 4162.36052
3.65000 -7077.48181 40.81911 -112.98120 741.87364 2052.93274 4000.71607
3.75000 -7006.33047 26.06503 -49.24686 713.54727 1991.09802 3967.57224
3.85000 -6963.25447 44.73360 -2.50419 677.21105 1934.13524 3843.47389
3.95000 -6886.04582 15.50996 69.72454 647.48335 1891.74583 3778.78570
4.05000 -6828.86029 69.08736 -2.19603 632.17007 1835.36401 3686.74467
4.15000 -6772.50227 -4.26750 32.02143 633.61732 1803.36369 3587.67681
4.25000 -6740.79568 39.98083 -16.51319 625.55682 1756.48088 3532.55690
4.35000 -6707.32394 -0.95441 21.09726 624.13827 1738.10561 3410.60053
4.45000 -6661.44409 8.48888 -44.91721 584.61510 1677.98087 3305.99711
4.55000 -6601.46480 11.04621 13.77067 620.60062 1618.88566 3282.96132
4.65000 -6580.19216 -17.80282 -21.11832 586.87949 1580.54873 3157.21678
4.75000 -6521.77238 -41.03815 -4.21292 589.54309 1555.67411 3093.51436
4.85000 -6510.32368 -20.23431 -16.47022 593.47766 1515.18050 3021.57647
4.95000 -6445.69873 -30.92854 47.44177 589.35884 1438.61500 2950.88216
5.05000 -6411.05983 -72.20905 -9.01165 571.42261 1408.60548 2897.95795
5.15000 -6361.06099 -37.51316 80.23593 596.71698 1366.17878 2846.09845
5.25000 -6341.37296 -34.46246 -6.46919 584.47865 1323.33548 2788.85703
5.35000 -6311.65470 -33.79482 -46.07270 621.98655 1293.16770 2696.09264
5.45000 -6276.08789 -42.47852 89.19557 606.89765 1247.68775 2660.49322
5.55000 -6248.17395 -39.18698 48.83006 624.06794 1190.13419 2609.01457
5.65000 -6240.31504 -22.37309 76.73304 630.29541 1175.64572 2493.99627
5.75000 -6217.99693 -15.99198 -3.11754 648.44225 1121.40294 2471.87096
5.85000 -6201.42920 -57.84339 -7.89857 674.51743 1076.75549 2396.53905
5.95000 -6189.69806 -50.70228 42.32971 687.39127 1048.18840 2334.76164
6.05000 -6165.08333 -30.52228 16.80828 723.79543 1001.69699 2287.51617
6.15000 -6145.97340 -17.35596 36.73667 748.39471 964.98361 2206.55964
6.25000 -6098.71478 -7.72883 4.47249 748.45390 909.05291 2177.76464
6.35000 -6062.26284 -8.11405 65.30276 774.87110 882.35843 2087.10187
6.45000 -6020.96525 -12.97399 16.79712 757.08494 832.61642 2024.73205
6.55000 -5992.95893 2.63937 53.27368 761.28633 792.76613 1982.29670
6.65000 -5954.81943 0.69097 -5.52572 752.46317 761.22395 1927.13364
6.75000 -5886.77026 -5.98241 -13.12165 732.21619 712.08631 1857.54236
6.85000 -5843.16344 17.83396 15.85916 723.51027 681.60409 1806.40895
6.95000 -5789.36612 19.05697 20.99690 697.67540 665.88733 1768.70313
7.05000 -5747.51692 9.17835 35.28212 686.22515 621.22717 1718.79991
7.15000 -5715.62557 11.26917 -13.31869 676.89655 600.08725 1648.25990
7.25000 -5659.43142 20.70983 29.71989 645.73900 564.80491 1634.97845
7.35000 -5623.74480 13.83279 22.81916 614.09654 538.12411 1569.92511
7.45000 -5579.13143 23.00047 -8.44612 579.33105 520.37110 1532.58003
7.55000 -5534.95151 12.82126 18.34200 577.12505 503.09027 1502.90873
7.65000 -5499.80713 19.40199 -3.02853 556.32085 482.95866 1450.72414
7.75000 -5472.26116 17.44104 8.02713 535.43325 460.69954 1413.93545
7.85000 -5412.58210 19.24338 14.76411 523.36642 431.21562 1382.38836
7.95000 -5388.27783 19.84472 1.42703 499.26880 422.43194 1337.15200
8.05000 -5334.98325 12.13264 -1.16404 479.09375 407.12990 1340.07991
8.15000 -5287.13306 12.26223 5.26116 473.49204 411.19502 1306.00906
8.25000 -5253.21748 4.90288 16.86687 454.01477 393.33548 1250.05039
8.35000 -5213.76494 12.08872 17.32499 459.79578 366.22951 1245.13133
8.45000 -5178.55057 7.46348 -46.71397 429.52444 356.27800 1187.41467
8.55000 -5132.84492 12.36873 -15.23696 414.46832 347.07400 1164.62284
8.65000 -5095.45504 5.18804 -1.01428 403.02341 330.42200 1156.60421
8.75000 -5063.43600 2.72898 1.77903 383.23818 323.16084 1119.86894
8.85000 -5026.38257 6.10966 2.00456 372.58618 294.60989 1109.67282
8.95000 -4984.18325 6.55546 -13.71837 357.66250 289.37978 1085.12243
9.05000 -4922.49484 7.55518 -8.87138 361.94380 285.68936 1042.41909
9.15000 -4883.98377 5.85877 -23.37982 354.67915 277.02544 1013.18413
9.25000 -4843.49196 13.46573 -22.35436 349.47665 270.46581 1013.04996
9.35000 -4811.80677 0.83172 -5.56471 338.09830 293.13303 996.24059
9.45000 -4767.17231 1.33627 -23.36356 330.66838 257.35701 966.80509
9.55000 -4724.12613 2.70507 -15.20696 338.14852 243.24461 933.12918
9.65000 -4672.36838 1.74025 -6.96661 312.19254 240.45068 926.04690
9.75000 -4635.06761 8.53563 -13.24949 315.51352 231.67162 890.40406
9.85000 -4587.67652 9.47537 -21.23172 282.75769 227.40705 877.24676
9.95000 -4551.37077 5.16220 -12.26004 285.00435 205.91583 852.61214
10.05000 -4516.26213 3.42742 -16.70830 312.11368 228.10269 843.67926
10.15000 -4471.32468 12.61632 -17.80591 252.06371 211.22770 822.31408
10.25000 -4427.63974 2.06669 -18.84835 272.91534 191.75210 814.72773
10.35000 -4399.42032 5.64416 -6.87383 265.39187 212.26267 786.99345
10.45000 -4362.10788 6.87229 2.89424 258.53199 210.41561 778.64899
10.55000 -4320.90251 8.98698 3.87228 271.78938 193.48090 758.86538
10.65000 -4295.95713 8.54334 -15.03421 259.36241 198.33948 741.45212
10.75000 -4265.63384 2.91026 -17.17576 225.55967 190.03210 736.71147
10.85000 -4229.45381 11.58103 -22.05096 229.39020 171.75204 714.05470
10.95000 -4188.15292 6.50813 -16.30923 290.77371 205.24233 707.54545
11.05000 -4160.86915 7.32457 -8.87949 231.57197 175.91053 690.46080
11.15000 -4138.63797 9.42586 3.98297 209.81876 151.88099 680.62715
11.25000 -4103.76832 6.54367 -9.72522 214.80654 148.78213 658.71383
11.35000 -4063.72350 5.78375 14.18473 196.00589 142.05606 653.73307
11.45000 -4036.23515 5.51484 2.18763 203.40124 173.11058 643.12304
11.55000 -4011.87891 7.87887 -15.10702 210.10926 188.51531 608.38956
11.65000 -3979.03237 5.30501 -4.19450 192.81302 172.86921 624.16344
11.75000 -3951.49549 2.74801 19.96256 210.48445 151.11218 607.18624
11.85000 -3924.83090 2.77854 1.03469 189.54481 159.97775 577.74868
11.95000 -3884.33376 5.84620 3.59587 232.56741 167.97611 576.50888
12.05000 -3864.24322 5.48536 -17.19164 190.86274 136.29694 571.54644
12.15000 -3838.58786 9.97741 6.22591 188.47262 163.44538 566.24390
12.25000 -3811.77337 1.42808 1.61638 183.85652 142.31164 556.48463
12.35000 -3778.29412 9.62356 -9.22990 184.08382 158.89541 547.02253
12.45000 -3746.29688 9.88311 20.95850 198.03209 139.19420 521.39482
12.55000 -3722.25931 13.17078 16.58735 188.51437 124.41089 534.22611
12.65000 -3693.87350 10.80079 18.19155 174.14565 130.08396 505.96513
12.75000 -3667.43682 9.55945 5.91124 162.59952 119.92544 510.32373
12.85000 -3634.27684 11.93876 10.14467 161.10232 96.84616 507.90111
12.95000 -3610.15419 10.34240 4.04809 155.41758 122.60882 488.21020
13.05000 -3590.81692 11.21500 9.22821 164.90083 120.62970 483.61230
13.15000 -3557.46769 11.62750 -3.82604 157.97700 125.74171 470.78720
13.25000 -3533.35464 13.67617 15.98457 164.43452 117.85957 461.81352
13.35000 -3506.04159 12.16253 4.75707 144.08846 86.42928 452.94059
13.45000 -3482.63273 11.58017 15.43092 140.39003 98.10902 436.50984
13.55000 -3455.88115 15.36772 19.24198 149.77827 112.83567 432.05559
13.65000 -3431.92600 14.91686 28.02231 161.29824 109.73843 421.33369
13.75000 -3409.61104 14.03485 29.01453 149.00178 87.83755 416.92864
13.85000 -3380.78460 13.41823 18.66831 139.59538 99.03039 419.23766
13.95000 -3363.12817 14.67756 24.25700 132.02072 93.43196 392.59674
14.05000 -3338.04136 13.14924 20.49811 128.75773 100.47459 396.97670
14.15000 -3314.61133 14.43881 29.91098 122.73519 88.02581 397.83450
14.25000 -3290.00236 11.99738 33.44030 134.93871 78.82035 385.81580
14.35000 -3272.34399 12.92160 33.97797 117.90232 83.16941 382.08895
14.45000 -3247.50677 7.68801 36.46770 151.72649 118.81317 395.51082
14.55000 -3230.32423 8.35727 33.75376 127.99220 69.50133 385.81532
14.65000 -3213.56080 10.47282 18.42492 107.71176 83.94062 369.61597
14.75000 -3196.05715 13.13425 32.23264 107.63999 78.21986 364.31547
14.85000 -3175.33456 13.07437 24.98406 136.29940 82.67025 363.83786
14.95000 -3155.55090 10.07137 26.54835 116.86020 100.92215 343.95934
15.05000 -3138.15291 8.35798 40.70317 101.52099 89.01507 343.58344
15.15000 -3116.56871 13.94265 33.52280 105.96368 87.15260 350.01167
15.25000 -3099.54056 12.24432 43.74305 105.65905 86.97984 335.35259
15.35000 -3077.68280 11.49541 29.44175 96.67092 92.36927 327.85676
15.45000 -3062.78638 10.18398 29.15102 96.70807 79.08035 318.01245
15.55000 -3045.51975 12.16219 14.15958 93.79417 68.08153 319.41750
15.65000 -3024.22988 10.89161 33.84282 88.36235 74.28699 315.20084
15.75000 -3005.93895 8.19264 25.99406 91.80465 85.43431 327.02920
15.85000 -2985.70246 10.28591 18.07760 90.13368 60.52841 310.09732
15.95000 -2965.69346 11.23982 30.68256 105.08662 83.57708 299.02543
16.05000 -2949.31227 7.17931 25.82801 87.79787 77.59335 301.54528
16.15000 -2931.90814 6.81307 26.77328 73.34548 74.03786 293.55713
16.25000 -2914.09220 9.56573 20.60378 87.55760 64.69687 287.69409
16.35000 -2893.33000 7.15273 25.31599 78.10567 62.82533 276.34030
16.45000 -2876.80487 8.13969 23.97198 152.00479 72.75986 282.42956
16.55000 -2860.28217 10.91400 16.94483 77.51656 83.95922 282.89587
16.65000 -2841.27357 7.95799 13.00013 77.97399 74.15394 266.34571
16.75000 -2826.52963 8.98754 24.97586 62.65462 57.92119 254.22403
16.85000 -2802.02959 9.34564 18.44988 106.70366 84.04905 256.54928
16.95000 -2785.11128 6.12903 14.55529 72.65144 56.35171 248.04787
17.05000 -2772.42661 9.09979 12.16715 63.08740 62.72044 245.70394
17.15000 -2755.52781 5.65339 21.37840 61.30187 64.42753 237.36681
17.25000 -2734.89708 4.46845 15.87017 72.95509 137.07976 252.26691
17.35000 -2719.72659 6.98144 19.71905 61.92564 62.83913 229.48264
17.45000 -2701.06029 7.37345 21.83883 60.81661 56.25428 232.27437
17.55000 -2685.25158 6.32881 13.33516 66.48121 58.37885 223.44732
17.65000 -2665.51655 10.26453 9.23110 69.52960 82.08291 236.65696
17.75000 -2650.39705 8.26787 22.59161 58.37259 57.60982 220.63760
17.85000 -2634.78883 5.47244 3.64562 74.21511 75.96093 221.69071
17.95000 -2617.70505 10.31600 15.05270 66.54479 72.99777 211.37567
18.05000 -2602.49933 5.77547 5.01763 51.20770 45.84451 204.51729
18.15000 -2585.61390 7.72571 10.76842 66.73533 58.57258 203.89708
18.25000 -2570.96814 2.00459 13.88318 64.13234 64.24300 205.04886
18.35000 -2556.82665 1.76879 15.75681 68.31456 83.77362 217.81590
18.45000 -2539.53871 2.90495 5.10325 119.08446 105.64465 214.66219
18.55000 -2528.20003 7.32124 18.04595 43.81479 39.75237 195.88532
18.65000 -2512.28363 1.93911 14.39136 56.04933 99.16001 174.57143
18.75000 -2497.02858 7.50987 16.97596 51.34053 51.31573 178.95944
18.85000 -2482.31767 9.07384 14.36714 63.90508 49.81072 177.87831
18.95000 -2472.25598 4.16220 18.14744 49.19413 58.14561 174.92903
19.05000 -2456.59799 4.40605 15.46749 44.16983 43.53803 172.11883
19.15000 -2440.13895 4.38120 15.39586 78.18123 63.14243 173.50554
19.25000 -2428.34398 7.04359 14.79619 70.32510 89.49572 174.46290
19.35000 -2414.19692 5.83298 18.48397 47.06317 50.48456 156.41657
19.45000 -2395.67542 6.09800 10.45954 40.66105 38.35208 165.01621
19.55000 -2388.59781 5.30388 15.25484 56.05177 36.61829 160.10538
19.65000 -2376.30118 6.71571 8.35143 44.42634 39.38636 157.11003
19.75000 -2366.12391 3.02587 23.15294 48.27717 66.14116 157.74969
19.85000 -2347.65373 2.81396 16.93323 76.32111 80.06392 165.11767
19.95000 -2333.87108 4.64417 24.08901 66.60464 58.26834 158.57016
