0.125 0.004 -0.005 0.019
0.375 -0.002 -0.025 0.232
0.625 0.009 -0.023 0.789
0.875 -0.021 -0.001 1.568
1.125 0.015 -0.006 2.213
1.375 -0.062 -0.039 2.948
1.625 -0.089 -0.087 3.750
1.875 -0.089 -0.063 4.554
2.125 -0.052 -0.070 5.545
2.375 -0.093 -0.101 6.649
2.625 -0.093 -0.133 8.105
2.875 -0.229 -0.264 9.571
3.125 -0.061 -0.163 11.453
3.375 -0.166 -0.273 13.065
3.625 -0.190 -0.325 15.172
3.875 -0.265 -0.358 16.350
4.125 -0.200 -0.372 18.275
4.375 -0.284 -0.432 19.298
4.625 -0.331 -0.405 20.040
4.875 -0.217 -0.366 21.028
5.125 -0.225 -0.378 22.097
5.375 -0.261 -0.482 23.117
5.625 -0.417 -0.429 23.766
5.875 -0.377 -0.325 25.578
6.125 -0.329 -0.421 25.054
6.375 -0.508 -0.385 25.870
6.625 -0.510 -0.331 24.881
6.875 -0.607 -0.503 24.816
7.125 -0.641 -0.407 24.386
7.375 -0.561 -0.439 22.167
7.625 -0.509 -0.364 22.014
7.875 -0.628 -0.438 22.453
8.125 -0.624 -0.440 21.796
8.375 -0.541 -0.484 21.295
8.625 -0.572 -0.491 21.839
8.875 -0.604 -0.455 21.821
9.125 -0.542 -0.481 21.589
9.375 -0.564 -0.476 21.692
9.625 -0.566 -0.464 21.503
9.875 -0.617 -0.435 22.172
10.125 -0.604 -0.387 21.181
10.375 -0.523 -0.391 19.895
10.625 -0.549 -0.428 19.166
10.875 -0.495 -0.423 18.142
11.125 -0.524 -0.387 16.803
11.375 -0.579 -0.395 16.693
11.625 -0.521 -0.373 15.282
11.875 -0.518 -0.400 15.101
12.125 -0.445 -0.416 13.877
12.375 -0.398 -0.387 12.444
12.625 -0.393 -0.375 12.188
12.875 -0.337 -0.350 11.270
13.125 -0.320 -0.373 11.053
13.375 -0.304 -0.423 10.698
13.625 -0.262 -0.339 9.539
13.875 -0.207 -0.308 9.186
14.125 -0.192 -0.314 8.478
14.375 -0.124 -0.281 8.086
14.625 -0.134 -0.290 8.340
14.875 -0.125 -0.228 7.439
15.125 -0.115 -0.225 7.672
15.375 -0.139 -0.179 6.902
15.625 -0.145 -0.191 7.044
15.875 -0.113 -0.146 7.251
16.125 -0.117 -0.139 6.438
16.375 -0.080 -0.129 5.235
16.625 -0.117 -0.083 4.886
16.875 -0.111 -0.100 5.397
17.125 -0.094 -0.088 4.256
17.375 -0.095 -0.066 3.866
17.625 -0.095 -0.060 3.824
17.875 -0.110 -0.077 3.993
18.125 -0.086 -0.061 3.473
18.375 -0.075 -0.043 3.234
18.625 -0.101 -0.047 3.423
18.875 -0.104 -0.054 3.474
19.125 -0.098 -0.055 3.321
19.375 -0.103 -0.046 3.093
19.625 -0.104 -0.033 3.281
19.875 -0.070 -0.035 2.652
