0.2 -0.75063 18.10433 -0.09462 69.62851 69.07999 64.77787
0.6 1.71425 37.58138 -0.14676 66.02497 66.71604 65.11306
1.0 1.32727 61.6795 0.70224 64.03731 64.63263 61.58738
1.4 4.19237 81.50102 -1.51022 61.51673 61.37557 60.46508
1.8 4.0987 99.29741 -0.82552 58.97972 56.28419 55.39983
2.2 3.14454 115.53068 -0.21652 55.60664 51.82128 52.27134
2.6 1.61454 128.06111 0.07919 53.29823 50.0272 50.62078
3.0 1.13061 138.24956 -0.75156 51.46868 46.29842 47.92798
3.4 0.59746 146.79928 -1.86894 49.77149 43.90079 44.97856
3.8 -0.89981 155.49602 -1.32762 46.60507 41.48032 43.07905
4.2 0.16967 163.12055 -1.2849 45.48432 39.4979 40.96198
4.6 0.17153 168.21249 -0.86237 44.2789 37.02428 39.51857
5.0 -0.88238 174.00402 -0.13413 41.95393 35.77844 36.9869
5.4 -1.48396 178.72154 0.85507 40.07256 34.19665 35.00603
5.8 -1.39702 182.36182 1.4175 38.9645 32.55802 33.35558
6.2 -1.59675 186.82729 0.69625 36.91815 30.22409 32.03117
6.6 -1.63148 189.6909 0.44142 36.30666 29.60911 30.5571
7.0 -2.39255 193.04306 0.59171 34.7027 27.39516 29.57069
7.4 -1.12463 196.43537 -0.31379 33.17545 26.3567 27.80244
7.8 -0.76071 198.85815 -0.39192 31.40547 25.48401 26.59475
8.2 -0.58654 200.61854 -0.81358 30.60904 24.65105 25.29368
8.6 -0.02991 202.05158 -0.9164 29.91655 23.29951 24.33326
9.0 0.01888 202.9363 -0.26031 29.02315 22.40989 23.00758
9.4 -0.38159 204.13533 0.31142 27.93265 21.86145 22.16993
9.8 0.15981 205.08329 1.20965 26.37037 21.50965 21.3363
10.2 -0.13465 206.9015 1.33771 25.38471 20.25391 20.27673
10.6 -0.70391 207.92387 2.13423 24.75044 19.10868 19.37621
11.0 0.21854 208.7352 1.9581 23.66688 18.0972 18.60712
11.4 -0.45012 208.94198 3.14962 22.94314 16.96998 18.12197
11.8 -0.20967 208.91833 2.34623 21.95438 16.45638 16.97253
12.2 -0.22162 209.34513 1.78342 21.17031 16.85276 16.63134
12.6 -0.60445 209.92906 1.902 20.57637 15.68115 15.88624
13.0 -0.93433 210.34652 1.87871 19.57258 15.88682 14.56263
13.4 0.04459 210.86488 1.26857 18.82279 14.51068 14.51903
13.8 -0.24338 211.07405 0.77298 18.49544 13.56165 13.78645
14.2 -0.63747 210.99227 0.68794 17.4599 12.77981 13.34811
14.6 0.06223 210.89715 -0.16093 16.06359 12.38755 13.13328
15.0 -0.54741 210.19141 -0.86028 16.2516 12.09233 12.73034
15.4 -1.05846 210.45273 -1.01708 15.97748 11.6329 12.23374
15.8 -1.0327 210.14251 -1.80105 15.24169 11.7794 11.90781
16.2 -1.23425 210.98881 -1.86147 14.25469 11.09553 11.30014
16.6 -0.18299 211.70646 -1.28599 13.73348 10.91111 10.43825
17.0 0.55954 211.67655 -0.96221 14.29389 9.60828 10.77191
17.4 1.97887 211.38915 -0.97998 13.99147 9.45712 9.70964
17.8 1.1312 210.00635 0.01055 13.491 9.57836 10.33448
18.2 1.01291 209.53312 0.33456 12.75287 9.67673 9.98494
18.6 0.28534 209.81709 1.2871 12.39379 9.75144 9.22604
19.0 -0.03756 210.31396 1.58634 12.04566 9.06645 9.47309
19.4 -0.06816 209.65573 1.79118 11.72707 9.07991 8.94695
19.8 -0.3429 210.06134 1.95396 12.13382 8.177 7.92699
