0.05000 -1132.64225 -249.24755 381.26476 1243.75355 1202.50912 1449.82359
0.15000 -2477.68987 249.95056 -126.57633 1096.68443 1104.67228 2685.29204
0.25000 -3363.66637 210.03658 -53.36465 1201.51668 953.21877 3676.28899
0.35000 -3990.35562 212.73307 305.27004 1034.41535 804.56940 4227.32966
0.45000 -4229.03750 214.13783 36.87932 1143.18544 726.17288 4964.34642
0.55000 -4492.60259 198.21852 181.10342 1169.35927 630.29890 5420.40807
0.65000 -4737.42800 209.78783 91.30699 1210.54450 554.59047 5715.35443
0.75000 -4948.53279 214.67828 4.28441 1224.97057 497.42410 5906.04277
0.85000 -5194.56338 194.92895 306.19645 1200.54604 446.48631 5925.48924
0.95000 -5327.84321 183.98108 182.86358 1237.15922 404.83099 6073.35191
1.05000 -5526.16298 202.77709 95.68334 1203.92587 384.66867 6008.14895
1.15000 -5640.87986 197.33899 -31.41402 1210.01782 372.88974 6043.21759
1.25000 -5820.02699 202.77082 -48.30925 1159.40206 353.34018 5946.28326
1.35000 -5917.76779 206.91517 -37.37452 1191.33912 350.10367 5948.68175
1.45000 -6081.36143 205.62803 -78.30064 1153.88108 341.06293 5776.56088
1.55000 -6233.86377 208.69720 14.45498 1092.12114 326.77145 5623.25133
1.65000 -6340.82971 210.23116 -53.58759 1071.78753 320.83162 5535.16824
1.75000 -6446.37038 218.30787 -76.82932 1024.87692 308.18157 5387.72298
1.85000 -6527.71044 215.77898 -16.51108 995.45915 291.60091 5278.11336
1.95000 -6578.39171 212.18698 -44.16576 947.94585 285.86021 5173.67162
2.05000 -6617.49734 214.62560 -152.09671 965.43559 272.19786 5028.69567
2.15000 -6663.68256 218.84507 -51.88857 918.98335 263.26825 4943.98845
2.25000 -6732.11511 219.29213 -126.13607 872.40157 250.56778 4803.28949
2.35000 -6788.67758 217.56790 -62.95176 835.03761 247.15713 4676.76634
2.45000 -6831.13510 224.28466 17.71290 804.38477 239.49963 4537.93355
2.55000 -6859.35373 217.58333 -14.27396 788.80532 234.06693 4436.56933
2.65000 -6875.84940 215.17695 -86.26540 771.26350 226.15375 4340.07612
2.75000 -6900.20422 214.88049 3.32334 748.44907 222.43202 4210.04550
2.85000 -6914.59979 210.93507 -63.41710 689.50441 216.63602 4118.13030
2.95000 -6925.67070 205.28113 5.07596 658.26535 210.09774 4007.21530
3.05000 -6918.01611 208.23226 -72.02057 661.44750 206.35440 3932.66102
3.15000 -6936.53245 206.80882 -91.73674 604.46398 201.07299 3785.63300
3.25000 -6924.16827 203.49675 50.83931 591.69276 197.10878 3708.42115
3.35000 -6916.64356 200.50757 -42.60853 570.56534 190.01411 3610.02849
3.45000 -6909.41082 192.72266 12.80816 544.04959 189.54722 3490.55334
3.55000 -6887.16995 190.79431 -13.95576 549.63896 186.07492 3435.23651
3.65000 -6870.62810 188.72170 -29.43926 514.01937 179.78038 3358.54367
3.75000 -6852.57859 186.19792 -25.51875 497.94531 180.71474 3267.06039
3.85000 -6827.69019 180.38449 -75.11005 477.67020 174.27547 3196.17940
3.95000 -6788.36808 181.03734 -16.49975 465.55706 170.45528 3138.69129
4.05000 -6769.54981 175.06365 -11.07898 441.55278 165.00794 3048.10965
4.15000 -6731.52184 174.93648 25.80006 457.62252 159.64539 2981.89059
4.25000 -6714.56640 170.63124 13.05014 415.24841 152.04764 2884.66140
4.35000 -6684.63578 169.61230 4.66764 405.15587 147.81881 2823.00261
4.45000 -6646.99829 168.41434 37.69365 400.31236 143.58215 2753.48547
4.55000 -6608.49810 162.48966 -11.04247 376.35157 140.67901 2715.66169
4.65000 -6564.41164 159.60789 9.77855 374.58869 138.45747 2637.27579
4.75000 -6514.44693 157.19681 5.33877 371.29611 134.22240 2586.45731
4.85000 -6474.14264 154.21105 15.50141 350.80894 130.08980 2513.26147
4.95000 -6434.41161 149.63856 52.46194 353.38469 127.60003 2441.49081
5.05000 -6385.74400 148.06743 57.07907 356.71610 120.20676 2430.27927
5.15000 -6356.53518 144.43441 20.64263 331.68337 117.89411 2334.55083
5.25000 -6311.22567 141.68059 54.40189 316.28891 113.64209 2283.47470
5.35000 -6272.17218 139.89477 14.60354 313.34609 108.72400 2220.97245
5.45000 -6227.98045 137.69296 57.23723 300.81709 109.25673 2178.37106
5.55000 -6183.07165 134.09828 25.99606 305.94076 103.16821 2152.14960
5.65000 -6153.79005 132.05786 67.57320 290.58598 102.92711 2091.85733
5.75000 -6132.44642 130.76166 42.84992 273.67846 99.31274 2020.14521
5.85000 -6100.13857 126.92403 15.01015 255.45111 97.09606 1995.92874
5.95000 -6072.24878 125.56966 47.16055 259.14470 94.29152 1942.12901
6.05000 -6037.11752 121.10486 55.07248 261.53525 93.42637 1912.18903
6.15000 -5998.91560 120.80349 3.77822 254.69573 91.79385 1877.60023
6.25000 -5964.01235 116.66977 44.64199 246.38712 92.14395 1839.10014
6.35000 -5935.05587 117.75980 14.90554 240.98970 90.08096 1773.94643
6.45000 -5892.42057 114.19849 59.27997 237.32096 89.15778 1765.85455
6.55000 -5860.81472 112.44752 40.78289 227.09436 89.29441 1727.21222
6.65000 -5821.82320 113.15722 -15.59779 217.09130 88.06495 1682.35461
6.75000 -5780.85083 111.35732 21.18631 217.92437 86.18361 1643.57502
6.85000 -5745.44588 108.69226 32.38517 200.88345 84.20665 1593.25797
6.95000 -5706.31337 107.28492 20.18797 210.76790 81.82873 1571.43839
7.05000 -5670.68874 104.06448 -1.32518 199.11930 78.40962 1541.37962
7.15000 -5633.32222 103.39045 7.35852 208.75719 78.83601 1506.75413
7.25000 -5596.10468 101.73468 38.55080 189.98397 78.44488 1473.66177
7.35000 -5558.21299 100.72411 15.01794 196.79311 77.12315 1452.14386
7.45000 -5522.12985 98.37084 -6.83901 193.49416 78.41275 1424.73179
7.55000 -5493.63847 94.39945 -1.07975 178.26715 76.09161 1371.05089
7.65000 -5456.62377 96.24960 -3.72125 178.37816 74.48770 1359.83153
7.75000 -5423.50304 93.08955 17.72559 175.28383 73.50023 1310.56003
7.85000 -5382.12770 92.48325 10.84544 186.35401 72.96991 1298.50926
7.95000 -5347.35044 90.24574 -23.82789 177.69996 72.48959 1268.61414
8.05000 -5313.04368 90.61673 0.88620 172.95097 69.54029 1232.49217
8.15000 -5274.16815 88.00477 21.69369 185.62244 69.11356 1216.13215
8.25000 -5235.15197 86.66433 9.77104 168.41716 67.02940 1182.58725
8.35000 -5194.36536 85.95891 8.74517 177.50662 67.16653 1152.77252
8.45000 -5155.62551 84.12829 -21.38402 151.97915 65.56123 1124.97905
8.55000 -5117.20554 82.42440 -17.61647 170.53287 64.11207 1120.18519
8.65000 -5078.72493 80.56588 2.69031 154.15406 61.89083 1086.72493
8.75000 -5032.04046 77.38574 -24.48138 154.38916 59.15614 1080.88217
8.85000 -4999.18648 78.97899 -9.02759 142.40138 57.19802 1018.05177
8.95000 -4952.38057 77.63122 5.12395 157.69397 57.45673 1013.66081
9.05000 -4910.08898 76.87752 -2.26130 140.01869 54.78343 1000.23906
9.15000 -4867.13840 75.28074 -4.02458 136.75163 54.75681 974.23590
9.25000 -4831.59680 74.44295 12.10519 129.03535 52.99280 950.04909
9.35000 -4787.52665 71.34141 -18.55973 139.88783 51.50624 940.98886
9.45000 -4754.42400 71.77355 23.87675 124.81963 52.98987 905.62805
9.55000 -4715.73171 69.36605 3.32955 118.59492 51.41044 893.71189
9.65000 -4675.34205 68.72744 12.97696 114.72665 50.76872 878.76745
9.75000 -4638.60294 67.00649 1.95514 109.03437 50.51789 846.29988
9.85000 -4597.77248 65.81851 1.83032 108.91493 49.59762 855.82449
9.95000 -4565.62128 65.79076 25.40291 114.77624 49.01861 823.03757
10.05000 -4529.73828 63.99427 -13.87084 107.64854 49.06597 797.39260
10.15000 -4492.64567 63.28170 -9.57028 106.22146 47.15280 784.79590
10.25000 -4457.39963 60.29924 4.89725 102.44819 47.14841 768.12666
10.35000 -4424.33328 61.87708 8.84494 97.68491 47.40505 745.84889
10.45000 -4392.99760 60.07883 -4.52646 94.61154 47.33414 726.48412
10.55000 -4358.45880 59.93096 5.32556 95.41073 47.45429 717.43001
10.65000 -4325.50332 57.75097 12.74703 90.12952 45.58095 708.82575
10.75000 -4296.65352 57.78619 14.05482 90.70987 47.23033 694.54221
10.85000 -4271.78726 57.34763 -6.36846 82.67377 46.92128 673.78489
10.95000 -4241.45111 56.17298 3.78081 86.56464 47.29430 661.64218
11.05000 -4213.76914 54.62806 -20.02895 86.04564 45.51854 660.74358
11.15000 -4183.93390 53.20134 -14.38456 85.16339 45.70454 645.11262
11.25000 -4150.19476 53.12584 -14.11436 87.31784 45.11855 643.97229
11.35000 -4124.28402 50.98298 1.79016 84.33761 45.85947 616.12210
11.45000 -4092.20415 49.15895 -17.55319 75.75880 45.39926 606.50883
11.55000 -4059.63485 50.15019 -6.00880 76.81891 46.87736 603.19989
11.65000 -4027.82959 49.69505 -8.06871 73.18339 45.24490 594.03509
11.75000 -3998.46328 48.40534 -17.83450 75.11369 45.03578 577.46480
11.85000 -3965.97573 47.04534 -3.52110 73.61265 44.42849 564.35183
11.95000 -3939.39769 47.50108 15.22711 66.81567 43.15140 536.29585
12.05000 -3904.47327 46.79210 0.48735 67.40178 42.07131 541.79332
12.15000 -3874.31178 45.36078 -6.01332 62.52283 42.37372 528.17021
12.25000 -3838.96853 44.87473 5.67533 63.70231 40.80925 536.89377
12.35000 -3809.11358 43.87958 -20.33834 62.00896 41.50607 521.00099
12.45000 -3782.57253 42.87799 -17.08207 58.82803 41.21438 498.33139
12.55000 -3752.80896 44.13651 2.85416 56.47664 39.67659 490.07487
12.65000 -3724.65691 42.84169 -8.91497 57.35198 40.53909 482.88639
12.75000 -3699.62493 41.03909 5.39617 55.81982 39.46773 469.92712
12.85000 -3673.41118 41.56561 -13.83077 56.00124 40.10476 465.48911
12.95000 -3648.35144 41.09210 -27.15477 55.92022 39.88700 456.48226
13.05000 -3628.00556 38.96801 -12.28107 56.44179 40.43049 437.94753
13.15000 -3606.88724 38.65985 -23.10570 56.36729 38.76214 434.73440
13.25000 -3584.86025 37.72982 -8.35565 54.76475 38.56565 423.06995
13.35000 -3565.06879 38.73730 -2.02032 56.06466 36.80482 413.71166
13.45000 -3543.38547 37.69645 -12.55902 57.68700 38.28781 411.69221
13.55000 -3523.31956 38.34589 -17.55279 58.32231 38.32283 408.37971
13.65000 -3501.73306 38.86408 2.53631 60.52785 38.01975 403.14355
13.75000 -3483.36203 36.91985 -3.50746 56.86101 36.93038 389.26787
13.85000 -3460.58647 36.85345 -5.53248 57.25527 36.66102 385.09090
13.95000 -3439.01925 36.30167 -8.37897 57.91938 35.26265 381.11366
14.05000 -3419.22923 35.71133 -13.25652 56.32372 35.16594 367.40476
14.15000 -3396.27732 34.13662 -7.14725 55.62426 35.29480 361.03886
14.25000 -3373.45097 34.58812 -3.63251 55.45050 33.86526 360.13667
14.35000 -3350.00278 34.00391 -14.27260 55.50945 32.67631 350.88469
14.45000 -3324.83158 33.53104 -12.08930 52.36786 31.25581 343.46210
14.55000 -3304.91218 32.51509 -17.71270 50.70437 32.24642 334.25354
14.65000 -3275.36474 31.20398 -3.45474 49.62061 31.72727 339.45734
14.75000 -3253.38951 31.94927 -5.85229 47.79047 31.89707 326.75285
14.85000 -3229.56250 32.61343 7.05876 47.08835 32.16364 313.72299
14.95000 -3203.53115 31.47386 -16.52684 47.77223 30.14165 320.29717
15.05000 -3179.60926 30.11683 16.03579 46.58026 29.41367 313.38184
15.15000 -3154.00486 28.97078 -14.60373 43.01047 28.64210 300.96649
15.25000 -3129.57179 29.08935 6.15614 43.76234 30.04634 298.78880
15.35000 -3104.71872 29.44505 -24.71010 42.30746 27.24476 288.41626
15.45000 -3081.05489 29.99815 -14.97584 40.45569 30.10375 278.23443
15.55000 -3057.41713 28.34463 -8.40559 39.14175 29.50453 275.38824
15.65000 -3032.51766 27.98745 -2.66489 37.18747 28.65092 278.65651
15.75000 -3012.33023 27.74773 13.43475 35.79918 30.30828 265.48704
15.85000 -2991.24695 26.07000 -10.19208 34.22108 28.99837 258.57313
15.95000 -2969.80403 24.97062 4.02070 34.52302 30.17351 251.24833
16.05000 -2950.12669 25.74790 12.21335 32.09225 28.20681 251.41697
16.15000 -2930.42207 25.72995 10.23135 30.79042 27.38276 248.76277
16.25000 -2912.09583 26.15896 10.86658 30.66675 28.48098 234.47798
16.35000 -2892.28431 25.83674 6.19536 29.77896 29.41526 233.10027
16.45000 -2873.85532 25.43891 8.10142 28.84130 26.84389 232.18178
16.55000 -2856.03539 25.35694 20.06978 30.04894 28.46045 226.54889
16.65000 -2839.69979 23.25924 19.22170 30.22813 27.18352 222.71303
16.75000 -2822.96942 23.81934 11.68659 29.14261 29.27028 216.96552
16.85000 -2806.68641 23.43515 21.75945 29.98493 26.54961 220.81156
16.95000 -2791.49957 24.24704 15.66226 30.43676 27.06643 209.45096
17.05000 -2773.34680 22.41659 24.26464 31.26243 26.89971 215.87960
17.15000 -2759.09141 22.93907 26.20270 32.19933 25.00293 209.55837
17.25000 -2741.55596 23.90688 16.08440 31.92691 25.53591 205.44485
17.35000 -2727.42834 22.53636 15.94862 31.49988 25.67683 202.97052
17.45000 -2710.30954 21.68907 31.85103 31.51580 24.81789 202.66618
17.55000 -2693.79194 23.78236 22.10952 31.91675 24.65626 203.04407
17.65000 -2679.11457 22.21947 21.95633 30.56269 25.59946 197.39319
17.75000 -2664.31547 21.98892 9.59760 30.21590 27.53267 190.05516
17.85000 -2650.96826 21.48432 14.18033 29.21065 26.66581 180.90657
17.95000 -2634.57264 21.28918 8.73695 29.89064 25.01402 189.81164
18.05000 -2621.08200 22.51271 17.00301 30.44536 25.26915 186.78555
18.15000 -2607.10632 20.42895 -5.17761 28.20023 24.35527 174.29517
18.25000 -2590.99250 20.81076 11.23612 28.62141 24.68787 183.35492
18.35000 -2575.31604 20.92035 -6.89375 27.91563 25.21642 182.60913
18.45000 -2561.60528 20.13581 4.11215 29.49038 23.89528 179.14904
18.55000 -2548.09396 21.06745 0.05838 29.07852 23.80639 171.24909
18.65000 -2533.06480 19.09000 -6.12140 28.94884 23.52939 169.66108
18.75000 -2518.98938 18.14505 -11.93948 25.01330 22.96574 162.14287
18.85000 -2504.39903 19.20392 -10.54762 25.11713 22.53538 162.49001
18.95000 -2488.97289 18.36331 -3.76483 26.91270 22.67540 162.28827
19.05000 -2472.89639 18.55976 -8.31290 27.57055 23.91430 167.34714
19.15000 -2459.84273 20.56091 -8.14487 26.50420 21.77510 156.21374
19.25000 -2444.25156 19.00204 -18.53077 25.15338 22.94874 156.82322
19.35000 -2427.78076 18.81951 -6.68968 24.65182 21.69771 154.71001
19.45000 -2412.42280 18.55082 -23.81653 25.56584 22.34225 156.48156
19.55000 -2399.93804 17.14833 -15.42740 24.03833 21.96755 142.81524
19.65000 -2384.36544 17.99789 -13.25075 23.89514 22.31607 145.48153
19.75000 -2369.40247 17.36638 -16.80185 25.32423 22.18803 139.45160
19.85000 -2354.46827 17.61672 -4.84965 23.89560 20.24660 144.30544
19.95000 -2342.72418 18.44103 -10.83770 24.13227 22.03180 139.68328
