0.12500 0.00895
0.37500 0.02735
0.62500 0.03472
0.87500 0.06645
1.12500 0.09478
1.37500 0.11880
1.62500 0.16891
1.87500 0.18283
2.12500 0.20534
2.37500 0.22008
2.62500 0.22308
2.87500 0.22376
3.12500 0.23331
3.37500 0.24216
3.62500 0.25127
3.87500 0.26722
4.12500 0.26834
4.37500 0.27205
4.62500 0.27129
4.87500 0.25526
5.12500 0.22983
5.37500 0.19974
5.62500 0.18082
5.87500 0.13836
6.12500 0.09458
6.37500 0.06574
6.62500 0.04858
6.87500 0.02783
7.12500 0.02820
7.37500 0.02403
7.62500 0.01576
7.87500 0.01845
8.12500 0.01096
8.37500 0.01343
8.62500 0.01542
8.87500 0.00777
9.12500 0.02160
9.37500 0.02911
9.62500 0.03280
9.87500 0.02416
10.12500 0.02559
10.37500 0.02820
10.62500 0.04714
10.87500 0.04130
11.12500 0.02452
11.37500 0.03813
11.62500 0.02915
11.87500 0.02846
12.12500 0.03110
12.37500 0.03481
12.62500 0.01735
12.87500 0.03022
13.12500 0.02948
13.37500 0.05264
13.62500 0.05335
13.87500 0.06979
14.12500 0.05888
14.37500 0.05545
14.62500 0.05882
14.87500 0.06262
15.12500 0.04723
15.37500 0.02945
15.62500 0.06960
15.87500 0.07367
16.12500 0.06015
16.37500 0.05368
16.62500 0.04925
16.87500 0.05283
17.12500 0.05615
17.37500 0.06602
17.62500 0.06611
17.87500 0.11526
18.12500 0.08463
18.37500 0.02165
18.62500 0.06902
18.87500 0.06702
19.12500 0.08171
19.37500 0.05129
19.62500 0.06146
19.87500 0.02627
