0.12500 0.02399
0.37500 0.00491
0.62500 0.01285
0.87500 0.01531
1.12500 0.02363
1.37500 0.01534
1.62500 0.02992
1.87500 0.03012
2.12500 0.03313
2.37500 0.01609
2.62500 0.01538
2.87500 0.01557
3.12500 0.01983
3.37500 0.01093
3.62500 0.03140
3.87500 0.03325
4.12500 0.01735
4.37500 0.01349
4.62500 0.03582
4.87500 0.02026
5.12500 0.03341
5.37500 0.02710
5.62500 0.02264
5.87500 0.00482
6.12500 0.01835
6.37500 0.02312
6.62500 0.03223
6.87500 0.03006
7.12500 0.01620
7.37500 0.01003
7.62500 0.00712
7.87500 0.02857
8.12500 0.00422
8.37500 0.03259
8.62500 0.04625
8.87500 0.02866
9.12500 0.01696
9.37500 0.01817
9.62500 0.03542
9.87500 0.05817
10.12500 0.05813
10.37500 0.09159
10.62500 0.05545
10.87500 0.06036
11.12500 0.05859
11.37500 0.03839
11.62500 0.02150
11.87500 0.06220
12.12500 0.04693
12.37500 0.04141
12.62500 0.03821
12.87500 0.08605
13.12500 0.04441
13.37500 0.02935
13.62500 0.05840
13.87500 0.06640
14.12500 0.04363
14.37500 0.02017
14.62500 0.00933
14.87500 0.04982
15.12500 0.02402
15.37500 0.02997
15.62500 0.01698
15.87500 0.03394
16.12500 0.00712
16.37500 0.07142
16.62500 0.06212
16.87500 0.06325
17.12500 0.07184
17.37500 0.08818
17.62500 0.05489
17.87500 0.03179
18.12500 0.08351
18.37500 0.06474
18.62500 0.06792
18.87500 0.04575
19.12500 0.06330
19.37500 0.08194
19.62500 0.04130
19.87500 0.16034
