0.05000 3139.95480
0.15000 3064.06532
0.25000 4991.14630
0.35000 5580.94709
0.45000 6115.85234
0.55000 6536.60302
0.65000 6653.83570
0.75000 6722.22193
0.85000 6525.58957
0.95000 6524.01612
1.05000 6289.48051
1.15000 6161.64698
1.25000 5914.53441
1.35000 5754.83153
1.45000 5607.01555
1.55000 5462.07077
1.65000 5292.33750
1.75000 5049.40683
1.85000 4947.47924
1.95000 4782.74025
2.05000 4619.99128
2.15000 4443.05946
2.25000 4312.08502
2.35000 4131.16744
2.45000 4027.92193
2.55000 3893.03456
2.65000 3763.39246
2.75000 3611.71047
2.85000 3514.50098
2.95000 3416.92133
3.05000 3351.46600
3.15000 3177.91028
3.25000 3091.53760
3.35000 2971.13440
3.45000 2933.07859
3.55000 2823.59067
3.65000 2757.16460
3.75000 2680.53334
3.85000 2577.88276
3.95000 2519.83698
4.05000 2441.65740
4.15000 2371.88478
4.25000 2304.34511
4.35000 2254.64074
4.45000 2193.64076
4.55000 2134.62304
4.65000 2065.16918
4.75000 2016.99846
4.85000 1982.58280
4.95000 1901.48743
5.05000 1836.57409
5.15000 1770.26721
5.25000 1736.67756
5.35000 1703.32596
5.45000 1628.41065
5.55000 1628.28958
5.65000 1558.19846
5.75000 1507.17325
5.85000 1474.68863
5.95000 1442.69888
6.05000 1383.33140
6.15000 1352.50382
6.25000 1331.87005
6.35000 1292.34607
6.45000 1262.38853
6.55000 1225.78686
6.65000 1181.71958
6.75000 1152.61359
6.85000 1115.98992
6.95000 1079.80922
7.05000 1060.03826
7.15000 1032.29133
7.25000 991.77618
7.35000 975.29407
7.45000 959.73907
7.55000 908.01908
7.65000 907.19180
7.75000 871.71407
7.85000 847.21328
7.95000 832.56231
8.05000 795.71681
8.15000 782.31205
8.25000 754.95297
8.35000 743.50093
8.45000 723.05990
8.55000 702.41859
8.65000 677.34027
8.75000 666.38247
8.85000 657.60670
8.95000 637.18739
9.05000 626.30052
9.15000 595.17479
9.25000 588.34695
9.35000 574.31160
9.45000 574.39645
9.55000 555.41684
9.65000 541.95011
9.75000 523.88435
9.85000 511.67779
9.95000 504.05208
10.05000 475.11848
10.15000 492.97122
10.25000 466.24379
10.35000 455.75829
10.45000 444.04265
10.55000 436.95153
10.65000 433.79437
10.75000 416.25218
10.85000 403.55543
10.95000 392.03360
11.05000 383.18967
11.15000 384.48187
11.25000 365.85776
11.35000 363.88891
11.45000 358.52568
11.55000 337.34063
11.65000 342.49410
11.75000 335.17451
11.85000 334.33307
11.95000 318.77731
12.05000 313.46712
12.15000 309.71787
12.25000 314.45357
12.35000 286.87782
12.45000 289.13653
12.55000 275.19628
12.65000 266.55704
12.75000 268.97973
12.85000 259.34015
12.95000 249.97848
13.05000 252.25223
13.15000 236.86535
13.25000 244.20273
13.35000 234.72317
13.45000 219.29523
13.55000 218.73686
13.65000 216.39686
13.75000 208.37624
13.85000 203.49518
13.95000 202.92967
14.05000 185.76834
14.15000 185.65268
14.25000 185.38720
14.35000 178.49752
14.45000 172.22544
14.55000 167.78844
14.65000 169.97070
14.75000 158.94228
14.85000 152.94705
14.95000 157.55834
15.05000 163.00200
15.15000 155.31250
15.25000 148.26174
15.35000 145.89482
15.45000 140.68760
15.55000 139.28389
15.65000 143.29517
15.75000 133.86810
15.85000 141.39483
15.95000 138.09500
16.05000 132.34615
16.15000 124.48317
16.25000 132.17169
16.35000 129.50621
16.45000 124.53598
16.55000 129.89578
16.65000 118.64874
16.75000 114.44624
16.85000 113.05767
16.95000 120.49001
17.05000 113.80678
17.15000 109.68988
17.25000 110.02819
17.35000 105.22190
17.45000 160.58841
17.55000 106.72559
17.65000 103.10445
17.75000 102.34033
17.85000 98.64193
17.95000 91.84818
18.05000 91.96668
18.15000 94.04810
18.25000 108.80790
18.35000 96.57725
18.45000 93.76627
18.55000 86.56873
18.65000 89.56107
18.75000 81.21032
18.85000 92.87559
18.95000 82.43015
19.05000 84.85662
19.15000 82.78276
19.25000 115.17253
19.35000 79.34067
19.45000 75.36241
19.55000 80.87348
19.65000 78.40227
19.75000 75.56793
19.85000 74.91644
19.95000 75.32736
