0.125 -0.001 -0.002 0.004
0.375 0.003 0.003 0.110
0.625 -0.020 -0.017 0.576
0.875 -0.067 -0.007 1.420
1.125 -0.062 0.007 2.421
1.375 -0.093 -0.020 3.387
1.625 -0.055 0.020 4.174
1.875 -0.111 0.012 5.089
2.125 -0.125 0.040 5.868
2.375 -0.183 0.021 6.676
2.625 -0.214 0.049 7.173
2.875 -0.231 0.076 7.926
3.125 -0.187 0.034 8.326
3.375 -0.202 0.017 8.966
3.625 -0.228 0.066 9.313
3.875 -0.290 0.102 9.653
4.125 -0.244 0.048 9.833
4.375 -0.252 0.070 9.939
4.625 -0.228 0.038 10.170
4.875 -0.260 0.054 10.361
5.125 -0.270 0.076 11.673
5.375 -0.328 0.062 13.527
5.625 -0.408 0.037 15.267
5.875 -0.401 0.034 17.402
6.125 -0.495 0.055 19.252
6.375 -0.508 0.053 20.551
6.625 -0.484 -0.019 21.021
6.875 -0.488 0.016 21.376
7.125 -0.451 0.037 20.748
7.375 -0.488 0.012 19.858
7.625 -0.479 0.034 18.831
7.875 -0.387 0.029 17.525
8.125 -0.408 0.035 17.313
8.375 -0.456 0.030 17.655
8.625 -0.428 0.083 18.116
8.875 -0.471 0.045 19.275
9.125 -0.507 0.002 21.029
9.375 -0.517 0.056 22.445
9.625 -0.545 0.071 23.066
9.875 -0.561 0.019 24.053
10.125 -0.551 0.019 23.883
10.375 -0.533 0.020 23.963
10.625 -0.536 -0.027 22.703
10.875 -0.496 -0.024 22.007
11.125 -0.497 -0.001 20.567
11.375 -0.422 0.002 18.589
11.625 -0.408 -0.032 17.591
11.875 -0.375 -0.028 16.777
12.125 -0.410 -0.053 16.254
12.375 -0.379 -0.055 15.586
12.625 -0.362 -0.064 15.210
12.875 -0.340 -0.042 13.882
13.125 -0.324 -0.079 13.556
13.375 -0.295 -0.109 12.818
13.625 -0.300 -0.094 12.588
13.875 -0.274 -0.121 12.265
14.125 -0.293 -0.087 12.205
14.375 -0.271 -0.130 12.332
14.625 -0.231 -0.140 11.754
14.875 -0.221 -0.112 11.386
