0.1875 -0.58297 17.30804 1.1088 71.09554 72.34216 70.96188
0.5625 1.20853 41.18144 -0.407 71.67118 70.39522 67.59071
0.9375 0.20283 62.67376 -1.77138 67.77548 67.85032 62.47433
1.3125 2.43483 83.05101 -1.91263 64.92365 62.32917 60.84893
1.6875 0.79232 99.65843 -1.70912 60.30288 58.61322 57.05445
2.0625 -1.23406 113.45334 -1.2929 56.80246 55.22037 54.38608
2.4375 -0.7327 124.72442 -0.66904 54.65208 51.98172 52.21111
2.8125 0.46681 133.96242 -0.19288 51.62851 48.9587 49.27826
3.1875 0.42443 141.34382 -0.21416 49.73249 47.08188 47.36165
3.5625 1.84656 149.53042 -0.23371 47.74661 45.26903 45.07974
3.9375 0.54293 156.82136 0.27989 46.05771 42.69787 43.17249
4.3125 1.11534 162.87066 1.09158 44.24175 39.4184 41.1048
4.6875 1.43371 167.82811 0.0262 43.20075 38.01662 39.23003
5.0625 1.03336 173.40415 0.45343 41.29601 35.66852 37.50095
5.4375 2.05538 177.82238 0.02555 40.63104 34.14859 35.68336
5.8125 2.50403 181.9379 -0.22007 38.85415 32.65241 34.20798
6.1875 2.01197 185.10162 -0.57851 37.34096 31.43434 32.63986
6.5625 2.28828 188.46027 -0.77064 36.21964 30.14521 31.66213
6.9375 2.65489 191.94043 -0.8702 35.35181 29.28706 30.26662
7.3125 2.46856 195.22817 -0.17882 34.02382 27.94917 29.01743
7.6875 1.69788 197.52072 0.1914 32.56943 25.86196 28.04435
8.0625 1.33683 198.93228 0.90036 31.71155 25.20117 25.80774
8.4375 -0.11472 201.22754 0.67991 30.84789 24.7024 25.88401
8.8125 0.41251 203.71797 2.05146 29.25756 23.48101 24.28757
9.1875 -0.35254 204.95205 1.24072 28.4332 22.61081 23.98636
9.5625 0.13831 206.45392 1.48323 27.23714 21.35879 22.53697
9.9375 -0.06715 206.35597 1.22528 26.01303 19.99494 21.68873
10.3125 -1.40306 206.514 0.35414 26.2981 18.5439 21.38447
10.6875 -2.2652 206.52824 1.07897 25.44782 17.87149 20.45708
11.0625 -2.09074 207.85633 0.07931 23.71721 17.27398 19.07384
11.4375 -2.42044 208.72096 0.65139 23.15373 16.70715 18.64827
11.8125 0.07574 208.8473 0.12942 22.66944 17.24333 17.9195
12.1875 0.88474 209.91937 0.3511 21.45078 16.70952 17.36025
12.5625 2.19091 209.89639 0.31839 20.95102 16.11173 16.39041
12.9375 2.76871 210.46216 0.82119 20.27084 15.56055 16.06978
13.3125 2.21838 210.3537 -0.04894 19.59722 15.79063 15.29584
13.6875 0.88548 210.67451 -0.84023 19.55077 15.5592 15.09768
14.0625 0.7415 211.19902 -0.63341 19.53565 14.25812 14.53413
14.4375 -0.86079 211.27121 0.27358 18.52979 13.04828 13.72469
14.8125 -1.36513 210.8804 1.06726 17.58292 12.38944 13.0145
15.1875 -2.29345 210.11363 1.68788 17.22639 12.05811 12.8389
15.5625 -1.82028 210.50904 2.19601 15.97545 12.01408 12.54689
15.9375 -1.08333 210.6479 2.71495 15.12215 11.17938 11.75076
16.3125 0.24628 210.89489 2.35378 15.25002 10.66705 11.20617
16.6875 0.99043 210.53326 2.0294 13.9205 10.74827 11.09819
17.0625 0.79053 210.80799 1.11063 13.16683 9.74386 10.14444
17.4375 0.79074 211.09829 -0.31064 13.12264 9.32381 10.46663
17.8125 0.73 210.05968 -0.48928 12.7527 9.73141 9.80585
18.1875 1.19089 210.42159 -0.94918 12.34007 9.35692 10.05301
18.5625 2.1212 210.73394 -1.67017 12.54723 9.67266 10.11312
18.9375 3.71936 210.98954 -1.38446 12.29876 9.42049 9.25971
19.3125 5.15002 210.67399 -1.76294 12.81689 9.69311 9.00793
19.6875 5.43751 210.69479 -1.02299 12.63457 10.19127 8.49625
20.0625 4.33147 210.70995 -1.19187 11.90556 9.97707 7.84057
20.4375 3.52628 210.37749 -0.25334 11.62183 9.67834 7.99073
20.8125 3.18719 210.94573 0.20903 10.95835 9.85814 8.05106
21.1875 -0.00782 212.23955 1.4704 9.13662 8.97602 8.06409
21.5625 -0.30561 211.64616 1.35755 9.75759 7.82604 7.47796
21.9375 -1.31901 212.49049 1.60522 8.37712 6.06735 7.16771
22.3125 -1.38172 212.06945 2.47021 9.65513 6.1591 7.13015
22.6875 -0.95611 210.84403 2.58581 8.91385 5.24122 6.94738
23.0625 -0.12951 210.05012 2.07111 9.74381 6.41581 6.62588
23.4375 -0.21826 210.25682 2.56205 9.48305 5.30036 6.51513
23.8125 -1.23219 209.45934 2.69171 9.78309 4.9109 6.78755
24.1875 -1.98884 209.77179 3.07906 9.16224 5.03017 6.90085
24.5625 -0.8046 209.49561 2.55006 9.56197 4.88177 6.21441
24.9375 -1.09664 209.00914 2.57729 8.11243 4.85613 6.43782
25.3125 -1.54483 208.44128 2.68521 8.08234 4.49761 5.46062
25.6875 -2.31404 208.36055 2.86653 7.80374 4.4077 5.6003
26.0625 -4.25838 206.64785 2.63178 7.28708 5.21891 5.3471
26.4375 -2.77455 207.90453 2.91361 7.07522 4.39293 4.96276
26.8125 -1.64117 206.3217 1.3464 7.32277 4.71021 5.76278
27.1875 -4.17215 205.95462 1.21944 5.76859 4.93916 4.67476
27.5625 -3.92488 205.0606 2.15377 7.17331 4.68419 4.83122
27.9375 -1.05242 204.49394 1.57452 5.76448 4.27511 5.96807
28.3125 -0.14418 205.15311 1.08902 6.70854 4.26272 5.50885
28.6875 -0.64381 204.16866 2.20936 6.10603 4.82958 4.98366
29.0625 -1.3546 203.25443 1.2413 5.54226 5.21048 5.33274
29.4375 0.80106 202.70812 1.87375 5.22805 4.51446 4.36756
29.8125 -1.24073 203.0283 2.01327 5.14584 4.72701 4.3626
