0.120000 1.470030
0.380000 1.910100
0.620000 1.699610
0.880000 1.707180
1.120000 1.743520
1.380000 1.674040
1.620000 1.729880
1.880000 1.709300
2.120000 1.718830
2.380000 1.706090
2.620000 1.734120
2.880000 1.764850
3.120000 1.701780
3.380000 1.708410
3.620000 1.703840
3.880000 1.697420
4.120000 1.749040
4.380000 1.763990
4.620000 1.774210
4.880000 1.762990
5.120000 1.808950
5.380000 1.864610
5.620000 1.892860
5.880000 1.955990
6.120000 2.015490
6.380000 2.103670
6.620000 2.146750
6.880000 2.248420
7.120000 2.341050
7.380000 2.677400
7.620000 2.800760
7.880000 3.122340
8.120000 -2.927630
8.380000 -2.858380
8.620000 -3.025270
8.880000 3.062100
9.120000 1.947500
9.380000 0.711380
9.620000 0.554040
9.880000 0.266820
10.120000 0.144990
10.380000 0.122050
10.620000 0.078980
10.880000 -0.013640
11.120000 0.014320
11.380000 -0.052330
11.620000 0.020060
11.880000 0.171250
12.120000 0.232340
12.380000 0.260720
12.620000 0.320880
12.880000 0.905860
13.120000 1.675360
13.380000 2.670790
13.620000 2.418340
13.880000 2.729370
14.120000 3.044940
14.380000 2.774950
14.620000 2.880530
14.880000 2.859270
