0.12500 0.03872
0.37500 0.04087
0.62500 0.06350
0.87500 0.09876
1.12500 0.15409
1.37500 0.19701
1.62500 0.22955
1.87500 0.26398
2.12500 0.29834
2.37500 0.31726
2.62500 0.32472
2.87500 0.31531
3.12500 0.30697
3.37500 0.28658
3.62500 0.27107
3.87500 0.24667
4.12500 0.22347
4.37500 0.19652
4.62500 0.14741
4.87500 0.12165
5.12500 0.10631
5.37500 0.07883
5.62500 0.07353
5.87500 0.05618
6.12500 0.05375
6.37500 0.06520
6.62500 0.07799
6.87500 0.09575
7.12500 0.10106
7.37500 0.11217
7.62500 0.10340
7.87500 0.11251
8.12500 0.10373
8.37500 0.09684
8.62500 0.08340
8.87500 0.06238
9.12500 0.07021
9.37500 0.06506
9.62500 0.05639
9.87500 0.06974
10.12500 0.08796
10.37500 0.08543
10.62500 0.09064
10.87500 0.06523
11.12500 0.05555
11.37500 0.06237
11.62500 0.05472
11.87500 0.05935
12.12500 0.05836
12.37500 0.03949
12.62500 0.04220
12.87500 0.03218
13.12500 0.01117
13.37500 0.02056
13.62500 0.04989
13.87500 0.03281
14.12500 0.05254
14.37500 0.07605
14.62500 0.03456
14.87500 0.04370
