0.12500 0.05468
0.37500 0.00731
0.62500 0.04022
0.87500 0.05998
1.12500 0.09911
1.37500 0.12436
1.62500 0.14234
1.87500 0.17236
2.12500 0.20411
2.37500 0.22677
2.62500 0.23048
2.87500 0.20642
3.12500 0.18144
3.37500 0.13534
3.62500 0.09727
3.87500 0.06906
4.12500 0.05219
4.37500 0.04373
4.62500 0.04600
4.87500 0.06325
5.12500 0.06747
5.37500 0.06636
5.62500 0.07141
5.87500 0.05806
6.12500 0.05242
6.37500 0.06601
6.62500 0.07198
6.87500 0.06376
7.12500 0.07395
7.37500 0.07240
7.62500 0.05631
7.87500 0.04116
8.12500 0.02206
8.37500 0.02079
8.62500 0.01763
8.87500 0.02922
9.12500 0.04419
9.37500 0.02266
9.62500 0.02510
9.87500 0.00906
10.12500 0.02332
10.37500 0.01425
10.62500 0.01564
10.87500 0.02047
11.12500 0.01611
11.37500 0.01805
11.62500 0.00766
11.87500 0.00974
12.12500 0.01551
12.37500 0.02270
12.62500 0.02113
12.87500 0.02485
13.12500 0.01904
13.37500 0.00646
13.62500 0.02569
13.87500 0.01410
14.12500 0.02320
14.37500 0.05938
14.62500 0.01271
14.87500 0.03869
