0.125 -0.000 -0.001 0.004
0.375 -0.003 -0.007 0.108
0.625 0.008 0.010 0.538
0.875 -0.003 -0.015 1.249
1.125 0.015 0.000 2.084
1.375 0.008 -0.040 2.945
1.625 0.013 -0.035 3.744
1.875 0.050 -0.028 4.604
2.125 0.054 -0.031 5.749
2.375 0.031 -0.104 6.819
2.625 0.028 -0.092 8.107
2.875 -0.004 -0.136 9.440
3.125 0.037 -0.151 10.764
3.375 0.043 -0.195 12.479
3.625 0.020 -0.250 14.524
3.875 -0.002 -0.250 16.256
4.125 0.037 -0.283 18.272
4.375 0.038 -0.303 19.975
4.625 0.047 -0.331 21.269
4.875 0.054 -0.392 21.881
5.125 0.046 -0.374 22.964
5.375 0.038 -0.385 23.658
5.625 0.081 -0.455 24.825
5.875 0.029 -0.498 25.419
6.125 0.058 -0.487 25.096
6.375 0.110 -0.449 24.941
6.625 0.111 -0.432 24.041
6.875 0.146 -0.421 23.938
7.125 0.140 -0.299 23.328
7.375 0.162 -0.330 24.069
7.625 0.172 -0.351 23.869
7.875 0.167 -0.306 23.428
8.125 0.157 -0.233 22.637
8.375 0.149 -0.229 21.424
8.625 0.143 -0.256 21.077
8.875 0.133 -0.264 20.841
9.125 0.073 -0.247 20.065
9.375 0.059 -0.242 20.189
9.625 0.070 -0.262 20.196
9.875 0.035 -0.248 20.636
10.125 0.005 -0.280 21.501
10.375 -0.010 -0.296 21.084
10.625 0.026 -0.301 20.133
10.875 0.000 -0.297 19.252
11.125 0.016 -0.269 18.334
11.375 -0.016 -0.311 17.627
11.625 0.005 -0.253 16.993
11.875 0.017 -0.284 16.028
12.125 0.003 -0.244 15.153
12.375 0.028 -0.247 13.838
12.625 0.035 -0.232 12.909
12.875 0.051 -0.228 12.208
13.125 0.075 -0.165 11.310
13.375 0.050 -0.164 10.637
13.625 0.092 -0.158 10.354
13.875 0.070 -0.128 9.824
14.125 0.081 -0.119 9.240
14.375 0.099 -0.082 8.962
14.625 0.084 -0.082 8.462
14.875 0.082 -0.041 8.441
