0.05000 1674.16926
0.15000 2977.51614
0.25000 4305.57709
0.35000 5283.71460
0.45000 5901.85236
0.55000 6288.14023
0.65000 6446.92424
0.75000 6694.17325
0.85000 6622.36716
0.95000 6558.71609
1.05000 6510.80335
1.15000 6280.83845
1.25000 6193.59284
1.35000 5929.21880
1.45000 5756.26356
1.55000 5551.01452
1.65000 5458.75154
1.75000 5241.36495
1.85000 5030.61761
1.95000 4935.24968
2.05000 4762.11212
2.15000 4604.74644
2.25000 4408.28671
2.35000 4253.47017
2.45000 4171.35856
2.55000 3996.05352
2.65000 3910.12160
2.75000 3781.41823
2.85000 3701.37283
2.95000 3591.65381
3.05000 3487.60703
3.15000 3395.00813
3.25000 3300.70906
3.35000 3213.88868
3.45000 3125.81717
3.55000 3024.81152
3.65000 2973.76853
3.75000 2826.31052
3.85000 2753.91959
3.95000 2694.08956
4.05000 2648.55759
4.15000 2553.00001
4.25000 2454.63665
4.35000 2391.51149
4.45000 2335.74425
4.55000 2244.38416
4.65000 2198.03511
4.75000 2119.81168
4.85000 2060.09333
4.95000 2012.21106
5.05000 1929.48539
5.15000 1886.16476
5.25000 1814.03573
5.35000 1790.04221
5.45000 1740.15247
5.55000 1693.75656
5.65000 1637.15732
5.75000 1603.66866
5.85000 1574.38920
5.95000 1511.76568
6.05000 1482.02679
6.15000 1419.20804
6.25000 1395.34363
6.35000 1366.68553
6.45000 1333.93299
6.55000 1297.65669
6.65000 1220.26785
6.75000 1205.49059
6.85000 1161.56556
6.95000 1132.98743
7.05000 1101.22526
7.15000 1085.56710
7.25000 1057.56853
7.35000 1029.85460
7.45000 995.86200
7.55000 976.40214
7.65000 950.54223
7.75000 930.70826
7.85000 912.95872
7.95000 879.17322
8.05000 867.36566
8.15000 839.86175
8.25000 828.91389
8.35000 814.80161
8.45000 780.71075
8.55000 763.65466
8.65000 751.12445
8.75000 738.46725
8.85000 715.89404
8.95000 706.62325
9.05000 675.10301
9.15000 665.89171
9.25000 641.19346
9.35000 622.98221
9.45000 612.59886
9.55000 599.40477
9.65000 590.35815
9.75000 578.33229
9.85000 560.48337
9.95000 551.26829
10.05000 541.35260
10.15000 533.04206
10.25000 522.14241
10.35000 508.91662
10.45000 504.58136
10.55000 495.28310
10.65000 470.91787
10.75000 462.20931
10.85000 458.72096
10.95000 450.23174
11.05000 440.08116
11.15000 436.93607
11.25000 415.82800
11.35000 411.66004
11.45000 403.23505
11.55000 385.52377
11.65000 387.36642
11.75000 375.23752
11.85000 365.05938
11.95000 378.11502
12.05000 342.75734
12.15000 341.31237
12.25000 339.13985
12.35000 324.06788
12.45000 319.37657
12.55000 317.11395
12.65000 311.69097
12.75000 305.11344
12.85000 304.22094
12.95000 291.13624
13.05000 278.81318
13.15000 279.77270
13.25000 264.26335
13.35000 264.61680
13.45000 259.78439
13.55000 251.22194
13.65000 250.03667
13.75000 244.08770
13.85000 243.68953
13.95000 238.34302
14.05000 233.53353
14.15000 228.80565
14.25000 219.41545
14.35000 215.01389
14.45000 208.25204
14.55000 215.82325
14.65000 200.64759
14.75000 203.63578
14.85000 199.78557
14.95000 189.97319
15.05000 188.47802
15.15000 191.37575
15.25000 183.27589
15.35000 179.31892
15.45000 175.26805
15.55000 176.22735
15.65000 175.24903
15.75000 163.16848
15.85000 165.94048
15.95000 165.11752
16.05000 161.22263
16.15000 159.65390
16.25000 148.32259
16.35000 146.00238
16.45000 140.42886
16.55000 140.80867
16.65000 142.55014
16.75000 124.79524
16.85000 143.29865
16.95000 129.97003
17.05000 129.70154
17.15000 122.24089
17.25000 116.83738
17.35000 124.41213
17.45000 123.43566
17.55000 120.00611
17.65000 111.66473
17.75000 117.05882
17.85000 114.50424
17.95000 104.47722
18.05000 111.48676
18.15000 112.25260
18.25000 105.25187
18.35000 106.72933
18.45000 99.31968
18.55000 95.89345
18.65000 94.94735
18.75000 93.81106
18.85000 92.25159
18.95000 91.32197
19.05000 89.04024
19.15000 94.61666
19.25000 86.29500
19.35000 89.65973
19.45000 83.32963
19.55000 95.58697
19.65000 81.63914
19.75000 86.59426
19.85000 83.86368
19.95000 82.86452
