0.05000 21160.46801
0.15000 27271.44592
0.25000 28992.37397
0.35000 26538.87057
0.45000 23570.54120
0.55000 20926.94335
0.65000 18886.18165
0.75000 17018.32550
0.85000 15481.76753
0.95000 14342.19003
1.05000 13280.99244
1.15000 11918.41381
1.25000 11155.87091
1.35000 10409.36807
1.45000 9610.27111
1.55000 9010.08364
1.65000 8531.77328
1.75000 7995.63184
1.85000 7474.48298
1.95000 7021.21208
2.05000 6778.02820
2.15000 6415.03971
2.25000 6111.59070
2.35000 5945.39214
2.45000 5495.42772
2.55000 5343.09944
2.65000 5093.06663
2.75000 4983.79669
2.85000 4664.32406
2.95000 4566.52339
3.05000 4415.18813
3.15000 4175.97759
3.25000 4036.06650
3.35000 3927.70623
3.45000 3813.52234
3.55000 3539.05079
3.65000 3494.68660
3.75000 3313.46916
3.85000 3209.73128
3.95000 3066.86284
4.05000 3004.64128
4.15000 2854.73789
4.25000 2734.13746
4.35000 2656.23361
4.45000 2512.66636
4.55000 2443.99410
4.65000 2391.50388
4.75000 2249.85341
4.85000 2211.22510
4.95000 2203.28755
5.05000 2058.83543
5.15000 1959.07122
5.25000 1891.83279
5.35000 1848.06298
5.45000 1770.27558
5.55000 1740.13511
5.65000 1667.02047
5.75000 1640.96545
5.85000 1545.32871
5.95000 1487.38931
6.05000 1488.94854
6.15000 1434.46410
6.25000 1402.82285
6.35000 1326.82907
6.45000 1344.82236
6.55000 1290.22261
6.65000 1224.29757
6.75000 1241.31507
6.85000 1183.12689
6.95000 1122.21473
7.05000 1113.77447
7.15000 1062.24857
7.25000 1034.17823
7.35000 1010.18010
7.45000 985.56786
7.55000 935.10912
7.65000 914.30264
7.75000 913.66322
7.85000 855.78128
7.95000 862.95415
8.05000 834.49801
8.15000 842.92759
8.25000 777.75871
8.35000 750.11237
8.45000 751.70869
8.55000 725.58008
8.65000 721.36666
8.75000 730.11952
8.85000 657.27244
8.95000 641.20277
9.05000 640.53283
9.15000 645.87184
9.25000 601.62083
9.35000 589.03409
9.45000 582.11622
9.55000 591.78100
9.65000 566.49936
9.75000 556.22582
9.85000 560.95380
9.95000 527.67763
10.05000 513.57616
10.15000 489.08613
10.25000 475.79196
10.35000 493.82114
10.45000 482.35165
10.55000 466.53278
10.65000 447.11931
10.75000 443.79019
10.85000 451.04456
10.95000 418.93312
11.05000 428.13038
11.15000 444.39400
11.25000 410.04696
11.35000 394.49965
11.45000 386.77690
11.55000 388.43809
11.65000 368.65758
11.75000 377.56915
11.85000 389.37850
11.95000 345.27211
12.05000 357.47520
12.15000 332.34323
12.25000 330.04633
12.35000 323.93037
12.45000 344.17377
12.55000 324.55133
12.65000 317.00171
12.75000 312.76579
12.85000 299.09693
12.95000 290.67884
13.05000 297.83560
13.15000 298.84217
13.25000 273.49243
13.35000 306.34595
13.45000 293.67187
13.55000 300.81028
13.65000 268.49021
13.75000 295.89931
13.85000 310.06310
13.95000 276.02353
14.05000 263.20881
14.15000 263.56716
14.25000 261.01190
14.35000 251.63479
14.45000 240.20688
14.55000 231.06952
14.65000 226.32164
14.75000 238.41196
14.85000 233.23572
14.95000 222.66205
15.05000 231.15687
15.15000 239.13742
15.25000 216.39159
15.35000 211.57760
15.45000 239.35542
15.55000 202.81827
15.65000 206.70611
15.75000 201.23903
15.85000 184.59272
15.95000 200.30436
16.05000 200.78760
16.15000 171.02101
16.25000 172.42071
16.35000 193.27693
16.45000 171.80143
16.55000 175.08859
16.65000 184.63341
16.75000 173.87011
16.85000 203.74306
16.95000 154.09977
17.05000 204.68506
17.15000 165.57905
17.25000 164.16721
17.35000 140.36203
17.45000 152.27908
17.55000 193.50461
17.65000 163.70262
17.75000 156.50598
17.85000 158.95088
17.95000 134.06494
18.05000 123.78568
18.15000 172.26681
18.25000 160.50744
18.35000 149.30722
18.45000 127.83090
18.55000 157.34437
18.65000 168.90989
18.75000 162.30601
18.85000 143.57356
18.95000 154.82871
19.05000 147.41574
19.15000 152.74624
19.25000 126.75971
19.35000 153.56464
19.45000 153.11903
19.55000 138.78240
19.65000 150.63021
19.75000 137.30006
19.85000 145.70672
19.95000 184.00012
