0.2 0.73996 19.08045 0.50889 110.17147 107.13695 90.65336
0.6 1.30762 41.50046 0.21458 109.26165 101.64101 88.6478
1.0 1.19658 60.32324 0.53319 107.8295 93.01295 84.16137
1.4 0.59563 69.35135 0.3016 106.22846 86.9838 80.64929
1.8 -0.37303 76.94758 -0.02685 103.08222 81.24374 77.49604
2.2 0.97279 82.36297 0.53957 100.09716 76.74219 74.80242
2.6 2.22317 86.70132 0.04535 99.127 73.04051 71.6936
3.0 -0.51957 93.03999 0.94432 96.67017 69.52838 68.07807
3.4 0.0305 97.74822 0.26363 92.0356 67.82226 63.22204
3.8 -1.31662 102.99809 -0.30296 87.17663 65.45654 60.0744
4.2 2.0513 110.79683 -0.10921 81.21643 63.95521 56.58103
4.6 0.5209 120.60394 -0.14682 75.26624 63.49213 53.37293
5.0 0.97519 134.77902 -0.82032 68.16926 62.79563 48.34804
5.4 1.15562 146.48044 -0.45265 61.77659 59.94851 45.28562
5.8 1.617 159.33758 -0.53053 54.88499 55.66468 42.12891
6.2 2.04866 168.22433 -0.21052 49.42737 49.87336 39.25459
6.6 2.36693 174.08648 0.39551 44.40334 44.49465 35.92428
7.0 1.01957 178.94816 -0.14354 40.59295 40.11586 33.84754
7.4 0.26805 184.42739 -0.00092 38.1499 36.01664 31.06655
7.8 -0.43468 189.81133 -0.10841 36.1111 31.76169 29.35687
8.2 -0.86938 193.62906 0.10029 34.70836 29.0204 27.61673
8.6 -0.08434 196.12184 -0.15794 33.51682 27.10564 26.92069
9.0 0.37072 197.61017 -0.21686 32.06843 25.68072 25.78644
9.4 0.84264 199.16167 -0.4409 31.28093 24.69332 24.59563
9.8 0.21193 200.61831 -0.47914 30.6238 23.55866 23.8775
10.2 -0.24684 202.14484 -0.69507 29.4876 23.00532 22.74021
10.6 -0.34958 203.15395 -0.7191 28.31071 22.0611 21.77983
11.0 -0.35316 204.13361 -0.65966 27.22225 21.79469 20.80434
11.4 -0.99402 205.04889 -0.16941 25.85882 21.14334 20.03886
11.8 -0.79822 206.14704 -0.03911 25.2071 20.18524 19.72192
12.2 -0.55385 207.0375 -0.1407 24.4792 18.92454 18.64493
12.6 -1.10688 207.11208 0.37216 24.03795 17.793 18.4092
13.0 -1.22238 207.31405 0.71115 22.99286 16.86996 17.65089
13.4 -0.86907 207.05295 0.5639 22.7113 16.755 17.21443
13.8 -0.64468 207.34464 0.55988 21.51184 16.65054 16.61653
14.2 -0.59257 207.80789 0.63963 21.14164 16.80639 16.16818
14.6 -0.75313 208.42807 0.53595 20.3109 16.42848 15.75646
15.0 -0.567 209.65198 0.8173 20.05134 16.07666 15.17225
15.4 -0.48304 210.85784 -0.00219 19.51893 14.63097 15.18081
15.8 0.20407 211.13204 -0.43584 19.46163 13.56953 14.78475
16.2 0.05573 210.80386 -0.32213 19.42645 12.36344 14.57239
16.6 0.10952 209.78884 -0.35637 18.99881 11.75786 14.32435
17.0 -0.03983 208.42672 -0.79496 18.08548 11.76425 13.66801
17.4 0.06501 207.72589 -0.41852 18.12249 11.68836 13.33159
17.8 0.06513 207.1492 -1.04279 17.41296 12.39839 13.41639
18.2 -0.45514 206.58997 -0.60723 16.10545 12.59238 12.58742
18.6 -0.58958 206.45875 -0.7769 16.42986 12.96843 12.36284
19.0 -0.05613 207.51316 -0.34935 14.95587 12.52595 12.24128
19.4 0.45519 207.89052 -0.55916 14.9922 11.96986 11.70746
19.8 0.43663 208.25383 -0.26231 14.56837 10.85652 11.85267
