0.05000 13975.47800 2187.38643 -55960.10097 136449.20424 155852.79780 4194640.87003
0.15000 -41480.58802 5330.21929 -62824.69642 118380.97100 197905.91570 3807913.94052
0.25000 -154664.42254 2043.48800 -12329.36641 79915.71372 130157.87437 3297482.65359
0.35000 -125948.08410 189.47646 15414.37021 51647.13445 54628.46318 2430840.56023
0.45000 -92838.52418 341.58257 -3269.69241 28606.24947 29227.08523 2037771.99160
0.55000 -73282.94241 -159.92763 21521.90733 18395.24143 18314.24444 1751611.60405
0.65000 -59788.06074 199.80055 6630.53934 12734.10852 12742.93867 1590685.85833
0.75000 -50872.43421 70.44883 -7356.31862 9591.85333 9287.41434 1315438.68223
0.85000 -43733.31317 -8.00518 -29405.21425 7099.85211 7324.34187 1121030.56693
0.95000 -38721.09476 104.70560 14144.53717 5778.68770 6605.00610 989537.03736
1.05000 -34484.50182 66.99419 6680.93936 4574.25300 4541.07158 963539.59333
1.15000 -31038.82285 -23.71089 756.94147 4013.49917 4067.64124 857120.55768
1.25000 -28236.14561 55.61226 5148.07998 3908.21062 3223.81599 744429.92481
1.35000 -25892.92949 -69.09228 -9618.31591 2807.65351 2723.18248 628368.18040
1.45000 -23961.30729 41.23296 2324.34626 2444.02648 2395.62241 620176.84743
1.55000 -22240.54227 -48.33846 9887.01757 2138.29468 2280.79697 543726.36471
1.65000 -20792.39503 7.65186 3478.62775 2034.63285 2060.11474 511948.49080
1.75000 -19547.18771 23.66178 7818.09400 2623.26201 3267.82057 469441.04448
1.85000 -18425.51827 32.17829 8584.28063 2888.48841 1937.17039 427369.75729
1.95000 -17332.83435 15.11620 14106.75910 1436.58188 1409.18599 420200.04452
2.05000 -16479.57992 -68.59965 4305.80948 2144.22000 5632.82813 347019.45504
2.15000 -15683.07194 40.31969 -1457.48238 1829.66437 4110.97619 380762.33035
2.25000 -14897.13960 20.29758 -2048.76706 1305.03151 1128.77298 331536.56170
2.35000 -14254.61221 -61.66858 1577.38664 4728.71074 3738.62430 334694.12032
2.45000 -13574.93855 4.14855 1151.05654 1108.70545 1127.35559 294505.55705
2.55000 -13004.11098 5.96362 -3633.35846 1530.37385 1468.44176 314073.73489
2.65000 -12552.26138 13.13866 -1221.44021 1049.77781 1058.01562 257938.71732
2.75000 -12080.92915 12.44478 4688.54539 909.89069 860.87052 252472.11593
2.85000 -11651.01834 -17.41122 1781.44386 1252.50428 1992.04679 219314.79787
2.95000 -11286.82387 18.24326 939.46225 932.37406 886.41855 230517.70361
3.05000 -10940.35743 14.38510 -3205.83754 829.65369 777.42348 215129.10407
3.15000 -10613.61124 11.07043 3321.47121 1004.02675 833.09021 198131.20149
3.25000 -10299.59290 7.39902 -470.33293 1365.68736 1425.86121 221003.99956
3.35000 -10063.83638 11.30471 4255.06372 850.74090 963.10765 190200.36405
3.45000 -9816.40193 -5.95497 -576.99389 894.42814 945.53723 166555.70861
3.55000 -9596.65708 12.23974 3077.53169 673.59855 688.69066 160860.84096
3.65000 -9376.31681 18.12091 -800.29532 858.14743 797.67231 159736.31788
3.75000 -9185.16989 20.98029 -1434.02524 670.33658 660.71166 138458.26734
3.85000 -9020.58456 -1.76668 1999.12683 688.82265 678.02956 147712.45893
3.95000 -8861.93691 -1.29645 983.96411 561.02527 614.27589 169788.41289
4.05000 -8701.17336 12.45050 -74.10535 829.50231 1034.99173 138833.49074
4.15000 -8532.76500 -5.83922 -2627.58451 650.53998 592.76766 117489.43323
4.25000 -8397.40779 19.51465 -856.53908 642.35166 601.77843 136874.61817
4.35000 -8268.94167 -5.91691 1575.57066 594.21475 516.02272 110041.46428
4.45000 -8167.53680 6.47598 505.90359 900.13607 1041.00887 100936.40682
4.55000 -8075.49153 -4.04829 1974.87719 838.53384 732.55033 110678.46210
4.65000 -7993.84325 -0.28912 642.96822 941.53515 2044.78150 96934.96688
4.75000 -7890.84087 17.18691 1970.91470 735.28149 1005.27832 110888.07189
4.85000 -7808.59426 -2.93949 -1093.77786 488.66468 470.67348 109449.16307
4.95000 -7712.74264 5.24221 -278.73463 616.82249 854.37698 107924.46953
5.05000 -7644.08800 3.47983 120.25784 466.76755 568.53506 95544.91216
5.15000 -7566.48149 5.32481 1473.54799 656.90777 652.48489 150850.64124
5.25000 -7497.34704 5.59387 867.91697 415.11081 451.97948 78335.78369
5.35000 -7419.97432 7.09984 -937.16601 689.61657 455.07058 91443.62359
5.45000 -7359.46178 -5.63125 777.74721 464.11018 487.81221 77723.70411
5.55000 -7274.43370 -2.58708 2160.43124 632.88598 692.38566 94301.16821
5.65000 -7215.43848 16.08521 -385.12745 636.01747 880.60577 68610.84190
5.75000 -7134.35617 6.77699 11.32237 420.41903 395.96574 86401.39824
5.85000 -7072.50396 0.78393 282.31746 413.41114 397.60018 79574.42446
5.95000 -6995.59576 9.76286 2509.43656 473.52876 395.55707 66816.19911
6.05000 -6933.25206 3.98298 2031.24809 435.42746 439.09335 57167.43574
6.15000 -6871.83633 12.96315 348.85028 325.66733 889.67027 88100.67338
6.25000 -6809.15302 5.87232 339.51317 409.32204 748.90772 60780.05596
6.35000 -6740.17438 -5.87133 106.36308 967.92830 644.88797 56569.93424
6.45000 -6682.70518 9.08109 191.54664 337.85537 457.75502 56923.50694
6.55000 -6633.83414 2.69582 -363.11090 427.43481 521.31828 54432.74542
6.65000 -6573.99154 3.12171 -483.00394 661.27599 619.35632 57171.21762
6.75000 -6526.31864 6.92314 754.64057 1003.29997 650.53400 47851.29561
6.85000 -6463.44765 10.96448 743.56608 882.68378 726.69871 55899.13488
6.95000 -6395.66445 -3.72970 620.54695 317.77644 743.17300 44144.96611
7.05000 -6336.53877 9.51851 1146.91074 1724.51094 923.86357 56634.24746
7.15000 -6264.17224 3.77274 72.40142 467.21971 574.63196 46009.99004
7.25000 -6222.23273 11.57459 -93.68593 265.20141 315.20170 42073.10773
7.35000 -6169.82685 27.16727 177.40664 723.73434 761.02290 40836.97462
7.45000 -6106.65403 2.27087 887.99333 361.62170 390.66841 40179.82682
7.55000 -6045.72846 17.38108 -898.90552 233.28036 253.44871 38684.52431
7.65000 -5990.28384 9.96160 -397.23629 275.03046 335.19993 36308.75814
7.75000 -5940.94584 -1.85233 -23.80909 1062.37749 639.90143 39163.43589
7.85000 -5846.87489 2.09830 103.07088 956.47044 309.49485 35303.90528
7.95000 -5799.26137 3.02668 -961.30485 271.98622 273.58897 38152.81652
8.05000 -5735.63645 -10.46371 -872.46070 332.43273 1009.23451 39970.63885
8.15000 -5689.39334 3.89507 1001.61566 230.72979 266.95845 44393.85272
8.25000 -5644.64682 6.17276 -278.79387 237.83131 265.05885 34470.61044
8.35000 -5594.67753 7.96348 286.81211 465.69038 505.33833 30372.46499
8.45000 -5551.00805 -1.76484 398.88892 522.83802 474.76602 29224.74763
8.55000 -5492.60002 1.63700 -709.11084 227.84700 285.46297 28478.84236
8.65000 -5443.52604 -0.44466 -530.21342 227.04739 191.28612 30546.54627
8.75000 -5393.89527 -1.31646 631.66665 310.68417 289.43816 42744.23050
8.85000 -5335.25994 0.65436 579.22459 211.49489 221.65504 28545.90211
8.95000 -5287.02495 -0.92853 151.74730 222.55423 195.12356 32925.15389
9.05000 -5234.70322 3.66081 1058.29035 213.44840 198.84444 25078.67556
9.15000 -5184.57409 4.39018 441.99148 209.38797 205.69877 31103.13079
9.25000 -5137.35791 -3.86187 161.12589 204.32147 182.56819 28451.80296
9.35000 -5088.26873 -6.74752 200.48368 261.55311 351.35797 25761.08837
9.45000 -5052.10901 -2.80405 -640.79167 228.38045 212.23678 26005.28431
9.55000 -5000.68352 1.35040 -92.07030 298.21081 324.52964 25196.79953
9.65000 -4959.87364 4.20392 46.95404 224.82572 240.61827 22269.90393
9.75000 -4906.17569 1.40534 -574.06424 544.41101 178.27534 25220.16532
9.85000 -4864.00136 1.86795 -629.91490 262.30693 364.23812 30251.38018
9.95000 -4811.78073 -0.23054 250.25650 210.92826 169.94194 22310.91838
10.05000 -4775.67928 -0.14438 108.00972 196.07156 174.80814 22890.41370
10.15000 -4737.07930 -0.20318 -459.26779 301.95827 257.84296 26679.32867
10.25000 -4696.52366 11.23855 -107.22167 240.09330 249.37404 20852.86022
10.35000 -4660.84354 1.19466 932.59214 221.36307 228.93773 103583.47095
10.45000 -4623.26883 0.24616 -243.36827 448.44336 260.55165 20211.18260
10.55000 -4578.23976 0.22702 -842.31315 192.42558 162.88779 20290.18471
10.65000 -4547.46559 1.13686 341.15950 256.09627 200.23854 18941.16092
10.75000 -4500.66656 7.17921 -374.32483 248.20121 183.69955 20723.24193
10.85000 -4473.60126 1.47107 -166.13717 180.77283 153.96084 18789.62914
10.95000 -4426.99327 3.69518 -152.82241 211.14595 215.10877 16994.94931
11.05000 -4390.12261 5.65903 -740.60104 242.26597 241.52818 16534.42663
11.15000 -4356.12782 7.42981 277.04905 189.43565 334.52519 16262.68182
11.25000 -4325.43998 -0.99552 422.73531 167.81480 128.52931 19729.43018
11.35000 -4288.49655 0.96811 -134.46768 151.12865 117.30788 14429.10592
11.45000 -4250.88651 3.49390 -159.51270 170.65082 151.41186 20722.83211
11.55000 -4212.51176 -1.44406 388.90278 268.17852 370.93490 19102.63798
11.65000 -4192.64100 5.77143 -265.77752 254.97401 374.75201 14635.49931
11.75000 -4156.44760 5.22066 -131.20611 255.45928 296.95532 15927.71464
11.85000 -4127.64157 -0.98948 -129.29195 171.99153 144.98235 14378.99614
11.95000 -4100.64716 5.79305 -231.29838 158.48120 140.52452 14905.88774
12.05000 -4066.64310 5.25217 -398.30793 186.71678 131.98709 12738.10548
12.15000 -4041.08424 -0.20815 -1.32444 169.83248 124.29760 13777.78807
12.25000 -4005.57218 2.90838 150.36965 196.33537 147.34595 11796.19072
12.35000 -3979.70916 -0.55089 297.77966 163.45848 119.74916 12194.26348
12.45000 -3941.53799 -1.16519 211.16384 2350.66005 1075.51092 13397.38390
12.55000 -3912.09136 3.46318 287.21222 142.79090 148.77466 15799.94274
12.65000 -3888.99594 -3.58210 120.85555 154.85587 160.12570 11677.96662
12.75000 -3839.08174 3.55764 -374.05394 1081.68758 202.68137 11320.27387
12.85000 -3832.66092 -3.36616 7.64598 166.30549 216.28221 11540.14495
12.95000 -3800.88628 -1.88000 561.45176 165.63030 148.16671 10301.24623
13.05000 -3769.39838 0.63890 157.25009 120.90406 118.66544 11824.11192
13.15000 -3744.44858 -0.64302 138.38322 128.92329 83.57906 11202.93845
13.25000 -3715.33919 -0.98864 -103.76663 134.29355 114.21179 9709.63197
13.35000 -3684.66844 4.31135 257.07827 173.15930 135.22326 10586.74800
13.45000 -3653.11935 10.11438 112.44160 221.65317 185.48299 9160.39136
13.55000 -3629.34649 -7.12033 -45.77187 292.63337 375.12539 9252.10645
13.65000 -3608.51550 3.67224 288.66984 238.65344 272.87331 10283.34470
13.75000 -3580.73925 2.36425 316.51999 105.30297 109.36025 10073.08684
13.85000 -3547.16351 1.03949 102.45920 253.67722 210.14442 9868.87817
13.95000 -3529.32447 -11.66067 -517.18999 336.57019 473.53011 10397.36324
14.05000 -3495.84566 5.98716 92.33974 121.87859 147.34948 9398.93626
14.15000 -3478.71050 -1.42392 22.34933 116.92077 94.52940 9257.72772
14.25000 -3451.93004 2.28127 209.14843 116.42374 130.45295 8215.90865
14.35000 -3428.64766 0.18214 -60.92670 178.90306 109.23184 8354.58128
14.45000 -3405.72854 6.14432 -61.57779 140.57467 182.91355 8305.86429
14.55000 -3377.28052 6.98896 -200.46844 134.49100 117.31080 7467.47034
14.65000 -3356.77457 3.03828 239.27413 97.35026 92.05196 7737.77356
14.75000 -3327.14814 1.06285 -40.47154 216.65966 105.86790 6715.70595
14.85000 -3304.86390 4.70665 -44.64724 101.65500 79.32494 6878.14672
14.95000 -3282.50121 0.69263 41.49914 105.01762 95.07908 6980.69961
15.05000 -3255.21193 -3.63969 217.23039 194.12718 188.71743 8712.52044
15.15000 -3234.14457 -2.32447 126.01432 161.92260 168.33620 8485.03902
15.25000 -3210.42230 -2.10018 158.94058 105.12492 106.19720 8241.90295
15.35000 -3190.47313 -0.19312 -169.45276 100.06672 145.07738 6601.86573
15.45000 -3167.86695 6.78476 180.09136 92.87352 85.79740 7857.06674
15.55000 -3144.78649 3.82806 158.76081 130.47346 73.78287 7056.55748
15.65000 -3128.93150 -0.21878 -37.90537 117.26106 166.26982 5345.48915
15.75000 -3100.01136 5.06177 -260.21246 83.95725 85.04600 6124.84736
15.85000 -3082.90743 3.92065 -264.53864 90.03119 71.74837 5550.77482
15.95000 -3060.42154 4.41176 61.03204 118.96938 161.55414 5642.00187
16.05000 -3042.41375 4.00282 54.14919 82.21077 71.73477 5857.36604
16.15000 -3013.49157 8.52172 193.55568 118.35149 102.36635 6485.63430
16.25000 -2997.35108 5.68503 141.64497 95.51493 77.23443 4974.93117
16.35000 -2976.22997 6.07177 39.98450 116.07594 104.38614 5593.56342
16.45000 -2960.50575 4.27543 234.54446 108.43301 74.31637 4843.66151
16.55000 -2938.93482 0.36511 -181.71832 81.62065 93.76467 4308.06132
16.65000 -2917.44891 7.70490 -180.37200 80.01538 154.42274 5383.18424
16.75000 -2894.82913 11.25092 25.87949 92.70315 183.51234 4738.63540
16.85000 -2873.38006 3.90729 54.79745 119.25874 77.74098 5776.55061
16.95000 -2856.90753 1.54403 109.68252 75.53752 70.69519 4756.64879
17.05000 -2842.91702 5.43783 -10.62684 254.58680 116.41085 4635.01996
17.15000 -2821.57117 7.50238 14.33988 117.37657 68.82885 4213.43027
17.25000 -2801.24919 -0.24593 316.45062 78.94419 69.75843 5723.15964
17.35000 -2775.31273 6.05503 214.15265 83.34705 72.66814 5331.88155
17.45000 -2755.19379 3.51378 196.58202 133.23704 94.32316 5418.34904
17.55000 -2735.30551 5.19711 291.03399 98.68199 85.72689 5428.46772
17.65000 -2720.10108 -1.37651 21.36062 113.12182 77.88592 4170.67933
17.75000 -2703.87736 5.89594 -107.59087 90.05503 114.87284 3825.28976
17.85000 -2682.91167 5.88035 -30.74888 91.05280 89.81322 4783.72822
17.95000 -2665.71685 2.84941 -172.80077 77.79394 112.94232 4332.36772
18.05000 -2654.13630 0.47440 -158.71615 65.02744 62.38923 4730.11886
18.15000 -2636.44867 0.99531 103.55489 401.93448 572.13292 4613.48077
18.25000 -2618.74419 -0.47739 -199.87391 97.82387 112.12745 4233.03666
18.35000 -2601.63851 -0.20801 214.24969 75.68844 78.44593 4151.23860
18.45000 -2587.21700 -2.49601 83.69084 70.96181 62.85983 4244.31829
18.55000 -2577.68308 2.80511 45.85203 103.29894 154.88180 3256.57299
18.65000 -2551.22297 3.85818 -330.93843 76.20106 68.18550 3442.32744
18.75000 -2539.74954 1.35322 62.21171 113.05451 69.71305 3047.45470
18.85000 -2528.08180 1.52919 -317.58585 68.32130 62.14904 8343.16448
18.95000 -2511.24801 -3.32644 306.97833 67.19573 63.47833 3622.49768
19.05000 -2497.54092 3.19392 126.72909 90.27176 90.22882 3135.84701
19.15000 -2489.15534 -3.01769 149.53084 84.07251 63.25986 3266.54572
19.25000 -2469.73314 1.29160 -221.92114 66.89240 74.62391 3634.64884
19.35000 -2461.10876 -5.06504 -37.25358 73.69209 75.94900 2949.93969
19.45000 -2452.52942 3.80617 -112.66117 121.35286 185.62134 3128.19960
19.55000 -2432.89956 1.92063 -47.26586 73.35854 65.24203 3361.28290
19.65000 -2417.85557 1.58710 -128.84168 67.31459 59.87242 3200.60975
19.75000 -2408.32098 8.47239 -120.22808 128.84642 190.73658 2952.50610
19.85000 -2389.28726 -7.70604 -134.07602 88.17279 123.32838 3059.88965
19.95000 -2375.63740 -1.95841 54.85672 59.87540 89.61791 3412.42148
