0.05000 -127362.33227 -12674.94959 -9558.27138 206688.29414 267624.55086 240784.22013
0.15000 -186222.54565 370.09368 365.93833 98833.30949 103990.54842 174892.55128
0.25000 -126465.34965 48.57437 1019.47780 51822.91652 35342.50754 102275.77428
0.35000 -90845.01123 203.44754 830.84906 31414.13929 17213.69302 70509.35485
0.45000 -70279.52676 -14.11201 -142.69140 22162.35099 11039.02721 52884.73772
0.55000 -57446.38841 44.68834 -12.82301 17240.73699 7833.22980 42388.25023
0.65000 -48148.29623 1.11470 -33.15880 14021.03904 5228.06816 34961.10116
0.75000 -41531.98309 72.96545 -109.72890 11503.91298 3908.45780 29488.78243
0.85000 -36418.26897 -22.28236 226.59980 9909.33354 4180.84710 25390.25170
0.95000 -32564.53508 29.54754 221.29392 8718.20228 3082.04433 22265.16834
1.05000 -29097.94118 60.14504 187.36215 7752.59976 3495.85027 20161.69441
1.15000 -26469.02612 29.64128 539.63690 6707.43380 1866.86349 17801.04967
1.25000 -24369.55703 9.88766 489.07789 6056.97166 2114.33019 15971.01467
1.35000 -22473.21647 9.03837 93.16632 5556.27953 2788.72146 14576.37394
1.45000 -20779.96142 -37.88690 -284.05333 5192.47250 2418.95601 13425.65125
1.55000 -19271.81566 -2.49774 162.64040 5291.62168 2868.72594 12538.26121
1.65000 -17915.13871 -5.37102 -247.23069 4598.79212 1737.29181 11804.06078
1.75000 -17015.31706 33.67356 -151.44727 3824.51637 1145.69582 10582.57473
1.85000 -16005.94334 -4.94011 -42.74138 4077.50507 1346.19809 10073.30833
1.95000 -15090.62901 7.24270 74.39046 3375.30930 1017.86356 9633.05872
2.05000 -14348.16678 2.75559 147.35285 3199.12559 867.30611 8958.34477
2.15000 -13670.24240 5.76947 -76.06796 2846.07086 1152.65034 8369.38429
2.25000 -13046.67801 28.57095 19.36398 2888.67231 1348.33727 7964.08061
2.35000 -12428.43697 -2.13276 -64.32469 2492.24666 795.36156 7600.21845
2.45000 -11951.29522 41.15079 -53.11973 2319.02119 1567.01404 7223.18604
2.55000 -11522.56393 7.44079 98.93975 2129.80869 1703.70583 6778.14755
2.65000 -11063.86586 10.23559 -24.42388 2031.68010 719.25360 6489.96021
2.75000 -10752.45329 10.00005 5.17057 1871.49895 695.80708 6063.54660
2.85000 -10369.88014 -0.07267 -158.60315 1686.83095 823.08608 5830.04074
2.95000 -10045.57114 6.61001 54.94249 1535.32139 713.29235 5510.85870
3.05000 -9742.23046 -27.18806 17.03659 2078.85387 1317.01774 5273.68634
3.15000 -9527.19433 2.24046 -26.64257 1268.24734 596.55310 4916.21492
3.25000 -9295.61361 -8.68716 -17.11696 1075.20856 560.80543 4642.45257
3.35000 -9066.19238 4.21681 53.11067 1036.60053 723.40548 4469.75482
3.45000 -8867.01871 1.15414 8.16060 1062.58372 885.41060 4128.79316
3.55000 -8678.70810 17.17246 -36.76955 899.99855 790.58510 3961.09005
3.65000 -8518.24337 -2.02694 -28.75875 713.70656 566.39603 3700.18823
3.75000 -8370.69338 -23.76111 -51.78583 791.09626 1492.92114 3587.16388
3.85000 -8218.10656 16.09355 -42.27481 668.67999 563.39472 3339.45390
3.95000 -8076.84086 -2.03799 -0.63002 968.12738 1047.46379 3280.51516
4.05000 -7956.88740 16.74316 -26.92594 743.66242 819.37091 3069.77111
4.15000 -7852.84064 21.12022 -42.69033 638.23671 510.20207 2881.89799
4.25000 -7760.25825 6.70777 -80.23519 892.83286 721.29976 2821.43017
4.35000 -7675.58115 19.20215 -67.93252 942.74405 884.94556 2656.68948
4.45000 -7590.99471 14.50907 -51.59697 798.97927 671.46854 2578.60542
4.55000 -7513.00890 20.87394 -84.16831 541.54779 541.54601 2426.12952
4.65000 -7427.36458 8.50777 -5.15637 570.94865 487.36271 2476.29656
4.75000 -7365.30460 8.73255 -70.85064 563.70774 490.80799 2297.56784
4.85000 -7312.16191 2.98526 -21.55320 608.53336 421.09511 2207.20839
4.95000 -7264.11468 4.30563 -22.65620 616.29767 505.45658 2173.57925
5.05000 -7196.96551 15.91743 -50.04768 914.28221 1512.47817 2305.84335
5.15000 -7133.41538 5.44481 -34.54090 536.03208 477.28957 2089.91083
5.25000 -7077.63608 4.37683 -31.71698 760.47441 649.86182 2001.57983
5.35000 -7023.89255 4.70242 -32.94106 454.47091 397.92353 1942.60499
5.45000 -6965.80093 5.76612 12.37669 533.62046 623.44034 2118.36173
5.55000 -6924.77053 -0.36739 -70.55916 701.87948 695.37037 1859.36442
5.65000 -6845.67853 15.26209 -3.76732 775.15530 501.27193 1792.37827
5.75000 -6799.55170 0.73747 -33.79354 546.62068 640.86954 1771.85364
5.85000 -6738.12889 3.77911 -77.58155 433.24855 314.64849 1701.04013
5.95000 -6665.93518 6.84077 -39.18322 424.93251 344.82521 1675.52228
6.05000 -6615.05524 -0.71523 -80.05027 436.09031 312.19799 1615.28500
6.15000 -6548.02224 8.41997 -69.79070 607.02827 382.05920 1610.54990
6.25000 -6481.21489 -2.20069 -34.40610 358.75875 347.63955 1558.52780
6.35000 -6428.15876 -14.75758 -69.16096 693.34380 1041.84686 1673.00466
6.45000 -6350.46185 6.11224 -31.46015 360.86526 284.23182 1447.28283
6.55000 -6309.45630 -1.61925 -20.92605 411.99042 301.48358 1442.39176
6.65000 -6241.08482 0.64308 -20.38553 363.84366 629.09910 1465.88825
6.75000 -6181.34465 0.60981 -49.72331 287.17712 269.38556 1361.26117
6.85000 -6127.18570 2.36888 -43.02583 385.12442 389.53984 1325.58297
6.95000 -6059.36921 -2.51934 -54.89966 416.89571 526.08362 1310.75860
7.05000 -6008.44235 -0.89487 -23.99806 296.46090 234.67627 1271.28662
7.15000 -5940.28167 1.90794 -35.16378 413.38486 300.24365 1227.59817
7.25000 -5888.11638 2.13448 5.29378 288.51673 213.18045 1201.91830
7.35000 -5824.70493 2.72302 -21.89960 311.88693 268.26534 1190.13991
7.45000 -5771.10168 4.03085 -18.43625 965.86010 751.63662 1157.89518
7.55000 -5717.13995 1.22262 -7.15020 443.09194 357.58807 1147.93792
7.65000 -5658.80714 3.09110 -29.09470 342.25999 227.07891 1135.33440
7.75000 -5618.55134 11.56802 21.17386 1169.34487 613.23735 1496.14401
7.85000 -5544.78244 -2.48300 -31.35312 279.38530 285.29147 1045.15671
7.95000 -5500.01457 4.58785 -6.79446 305.08486 272.17735 1008.37150
8.05000 -5442.48767 -3.01073 -3.59057 299.15197 329.55755 995.71504
8.15000 -5388.96736 1.15220 0.39866 213.44863 176.30240 967.58660
8.25000 -5343.93444 5.27486 -31.43485 227.36652 347.16718 957.79757
8.35000 -5293.26949 3.57960 -11.30296 226.46877 180.34156 917.39351
8.45000 -5243.94453 1.08666 -23.93109 287.98862 206.83345 906.56372
8.55000 -5192.86638 2.28918 -16.66198 312.33461 209.15162 888.49121
8.65000 -5139.38430 2.69373 -23.31593 184.38178 224.67854 853.12701
8.75000 -5094.04566 -0.22399 -1.11463 211.43608 213.49036 830.22641
8.85000 -5037.16505 8.90172 -14.40203 285.74908 535.92245 918.59903
8.95000 -4999.12089 0.35102 -33.74947 431.08648 321.79356 872.37612
9.05000 -4946.76208 6.36311 -25.74496 237.31686 249.54431 822.15505
9.15000 -4901.78626 1.55278 -28.52336 178.39738 172.77997 756.87493
9.25000 -4855.55747 -0.68510 -26.31052 178.73570 249.28118 741.51114
9.35000 -4810.41753 10.73329 -26.84929 197.23146 172.73681 733.35445
9.45000 -4763.46391 5.17584 -18.74705 156.13978 160.17798 722.27839
9.55000 -4722.75986 -6.42659 -43.99676 320.00959 257.42367 720.97129
9.65000 -4666.00715 -2.56997 -38.76699 354.42208 388.95706 809.13752
9.75000 -4638.09368 4.49060 -32.21807 151.44544 176.15265 674.13359
9.85000 -4582.76224 -0.94987 -32.51867 735.59795 472.15557 689.13790
9.95000 -4551.48008 5.84729 -37.50603 215.20581 164.10141 649.80668
10.05000 -4508.07284 4.85122 -31.97963 160.14102 148.39612 636.16954
10.15000 -4469.56279 3.52647 -25.09222 207.17448 156.81212 628.33125
10.25000 -4423.76479 2.75906 -56.39069 226.32199 202.20630 758.57502
10.35000 -4389.89890 1.24065 -21.71715 158.82599 169.28197 598.40363
10.45000 -4350.61483 4.79495 -32.28725 163.25500 157.25956 595.91320
10.55000 -4317.93789 2.21153 -29.63946 448.05867 201.62430 594.84819
10.65000 -4274.65571 6.13469 -5.64940 154.18209 122.51556 560.67175
10.75000 -4235.96203 3.57077 -14.48231 1083.94995 436.97886 904.19368
10.85000 -4210.28542 1.78272 -14.46725 135.37545 176.53678 551.25607
10.95000 -4180.34848 -1.07640 -23.44996 159.83910 131.96691 581.98031
11.05000 -4152.04362 1.78239 -19.18690 356.67237 160.54434 536.69141
11.15000 -4116.25092 0.71870 -0.45834 124.59729 142.08229 518.58020
11.25000 -4084.90445 10.01036 -9.45580 237.86388 845.50648 1139.60669
11.35000 -4051.12783 5.85923 9.08169 138.01368 123.62709 493.23935
11.45000 -4015.65527 1.00132 -15.31270 233.07686 147.19396 481.05361
11.55000 -3987.32642 6.11557 -10.41549 145.95337 252.27697 488.33146
11.65000 -3964.09179 -0.86078 -4.68619 174.42439 161.01952 476.62577
11.75000 -3931.80543 0.06731 -3.63387 130.45376 176.69547 463.30663
11.85000 -3898.28546 0.79402 -11.08199 113.80243 129.98265 456.86285
11.95000 -3882.93661 6.79741 9.58755 736.85347 217.14113 548.07993
12.05000 -3838.50699 -4.84134 0.24286 1044.75719 472.46159 603.37659
12.15000 -3802.97917 -6.94892 -15.21538 382.87896 219.43832 447.35737
12.25000 -3777.81600 4.90201 -7.00772 115.12475 108.00536 418.60734
12.35000 -3748.06820 0.95498 -14.28954 109.54990 114.87768 415.26614
12.45000 -3724.86633 -3.28563 19.21957 188.91963 204.94451 449.32162
12.55000 -3697.47578 4.05677 7.57934 143.90857 131.22975 405.51723
12.65000 -3665.80960 0.01709 -9.51721 93.51267 114.97058 409.15721
12.75000 -3638.45552 -0.13574 -11.25459 147.65451 120.82613 379.86695
12.85000 -3614.91927 6.75395 -6.63269 108.61555 125.33240 389.73861
12.95000 -3592.54494 1.65764 -19.19376 101.09830 130.37948 364.90412
13.05000 -3567.64424 3.59996 4.82720 112.40908 141.98635 368.69672
13.15000 -3530.51887 0.53092 -13.52469 116.81282 98.35826 346.25794
13.25000 -3510.72100 -0.93886 -1.08712 144.34260 131.54185 330.98114
13.35000 -3485.14411 4.20395 10.66853 92.00880 89.15898 332.44592
13.45000 -3452.57387 4.56844 -5.02712 111.78010 111.97165 318.14107
13.55000 -3431.25821 3.77739 -12.28666 121.80580 123.88254 348.32975
13.65000 -3400.97521 6.65617 -28.40557 115.86726 99.18530 506.49876
13.75000 -3380.40595 4.66211 -20.92577 91.94598 102.91435 299.06807
13.85000 -3356.68261 12.76861 -19.01030 122.61190 171.10475 309.34150
13.95000 -3328.12596 4.96881 -34.15311 88.36061 82.86883 285.68388
14.05000 -3303.59871 -3.17197 -10.05958 94.69055 193.27000 283.44306
14.15000 -3279.10236 8.38925 -10.18522 102.75457 83.01584 284.00962
14.25000 -3255.76686 10.94013 -12.85859 100.39974 101.80681 272.75371
14.35000 -3226.82631 10.24608 -15.54805 104.38213 108.32548 258.72894
14.45000 -3205.48423 -3.31554 -17.55603 91.75437 223.88235 271.68505
14.55000 -3185.57163 3.26345 -10.11326 84.23248 88.63712 244.73387
14.65000 -3158.40029 1.36334 -21.23145 128.80305 118.46761 286.38773
14.75000 -3133.95097 1.67253 -15.70400 88.49781 78.34158 244.00241
14.85000 -3113.87632 1.94496 -14.17923 70.29185 82.07066 240.00339
14.95000 -3090.81457 5.27824 -14.99919 80.11316 84.15907 230.39385
15.05000 -3073.41187 -0.89511 -26.92852 99.02848 85.45671 255.88255
15.15000 -3050.55072 0.83840 -18.16006 121.42264 83.53760 345.74007
15.25000 -3031.08301 -2.03396 -7.99513 90.32269 162.50467 261.96332
15.35000 -3005.32690 6.15323 -8.94733 103.45415 84.40154 211.03215
15.45000 -2988.90561 -3.48785 -19.44003 129.34331 178.28105 237.45542
15.55000 -2962.92858 2.71075 -11.44224 122.22988 108.74308 231.49795
15.65000 -2938.41034 1.95582 -15.88799 88.87693 77.45936 222.09609
15.75000 -2920.16352 4.33893 -11.88671 67.14101 114.19214 206.16920
15.85000 -2901.11710 3.60458 -5.81820 75.08764 81.88367 211.01179
15.95000 -2877.74839 2.20389 -8.78377 74.86481 80.18390 204.52170
16.05000 -2867.06952 -0.74532 -19.77422 76.74676 72.70956 189.75056
16.15000 -2842.02920 -7.11539 -17.70757 75.33083 86.66324 179.68616
16.25000 -2819.78382 0.60262 -7.17656 71.71279 77.41823 192.44307
16.35000 -2808.76697 -0.69376 -0.21053 68.16810 77.52081 184.04081
16.45000 -2784.31623 -1.58321 -1.93776 86.76131 117.13271 204.89322
16.55000 -2766.91508 -0.33221 4.75086 64.19280 80.92603 185.59561
16.65000 -2752.49530 -4.43060 -15.78999 70.61494 78.30057 177.11441
16.75000 -2730.67920 -5.23523 2.52282 116.45083 81.97686 167.83931
16.85000 -2721.79215 4.89169 8.74651 112.15384 79.23420 174.96618
16.95000 -2693.50578 -0.29626 -2.59030 71.07759 87.85054 223.69962
17.05000 -2676.55084 3.88974 13.18045 96.52601 85.67565 161.69180
17.15000 -2663.87798 3.16781 -9.67593 63.34662 65.81526 164.98085
17.25000 -2644.11045 -3.98397 -5.33071 86.01596 80.46836 159.53227
17.35000 -2628.44219 1.02417 -13.76076 61.04077 69.59928 161.90103
17.45000 -2629.37618 112.69795 -74.07637 356.82500 2352.58688 1448.41764
17.55000 -2593.21855 -2.14005 -3.48748 74.05597 79.17245 155.08443
17.65000 -2575.88629 0.83789 -19.31569 106.29974 74.56672 199.91477
17.75000 -2568.03574 -2.28449 -18.98588 70.05183 85.23723 296.40964
17.85000 -2552.36795 9.00056 -27.37909 126.69152 259.41378 612.99219
17.95000 -2535.43691 5.08058 -10.30287 65.56077 71.75680 153.31811
18.05000 -2520.96607 3.58202 8.82567 60.45317 60.67387 137.81516
18.15000 -2498.79680 10.11352 -6.69057 72.33338 61.74609 203.40597
18.25000 -2484.09861 3.47500 -15.22897 67.22693 66.38362 141.83893
18.35000 -2469.98307 11.59898 -7.65317 59.62011 73.46065 163.71378
18.45000 -2455.54873 6.11485 -12.27807 61.62099 84.88820 161.47240
18.55000 -2439.76143 3.34718 -14.64685 64.45418 73.94060 136.47113
18.65000 -2429.78345 -9.24048 -1.54334 93.01752 233.26458 242.60716
18.75000 -2417.64590 1.99443 -6.23877 58.82755 63.01422 129.67526
18.85000 -2401.13246 3.95125 -16.60475 65.97550 62.78937 129.72726
18.95000 -2383.80386 10.71179 1.75105 57.36762 62.06689 132.09019
19.05000 -2371.62815 11.16304 -1.51699 74.43448 63.67601 134.74656
19.15000 -2356.46017 12.92622 -12.10085 73.58112 83.77885 126.58044
19.25000 -2343.87804 11.84284 -15.73799 72.53282 80.42960 131.06136
19.35000 -2326.27852 4.38103 -4.84220 74.59003 58.79285 126.10671
19.45000 -2316.11209 12.84776 -12.44051 62.62060 61.91804 120.68659
19.55000 -2291.24312 -8.37071 -27.88839 85.38865 119.70359 178.48761
19.65000 -2280.96270 7.94747 -11.91589 70.26902 67.41408 125.83907
19.75000 -2273.24625 -0.68826 -2.19415 72.26290 60.84572 129.77540
19.85000 -2255.27991 4.31241 -4.02287 60.76686 59.39733 122.41267
19.95000 -2237.57773 2.96428 -9.66397 91.28585 75.59139 116.50796
