0.2 0.25084 16.05217 -8.05019 92.89985 91.27848 73.15683
0.6 1.10977 44.22164 -7.24191 93.3106 90.34968 69.45287
1.0 1.29779 70.39434 -7.71529 93.20859 84.98497 66.00984
1.4 2.59711 88.10808 -5.50842 91.26546 79.3086 62.25364
1.8 2.09008 94.97105 -3.79379 89.3091 73.30246 60.09747
2.2 0.00075 97.21279 -3.68185 89.56458 68.55467 57.52123
2.6 -1.98787 97.53987 -0.91139 88.3211 68.03083 55.0349
3.0 -2.43434 98.69918 1.52438 83.78769 68.85028 52.32516
3.4 -6.0431 106.75435 3.79673 77.36333 69.6549 50.73564
3.8 -7.20853 119.58705 4.57765 69.25918 69.53842 48.78749
4.2 -5.70928 133.03023 5.4729 61.37987 67.55165 45.83411
4.6 -3.07518 147.10488 5.47332 54.59361 62.54643 43.59623
5.0 0.61713 158.3106 5.42927 50.17022 55.12521 40.47138
5.4 3.23743 166.55888 4.06984 46.48777 47.88011 38.11789
5.8 4.86639 172.35149 2.97587 43.56335 41.29027 35.60276
6.2 5.81326 175.91092 1.88546 41.4219 37.87343 33.37419
6.6 4.99032 179.86639 1.08826 39.65001 36.09822 31.12949
7.0 3.32488 184.83809 0.1107 37.83034 34.10076 29.434
7.4 2.14607 190.78534 -0.10262 36.10203 30.22641 27.34504
7.8 2.14056 193.80598 0.11152 34.20537 26.62982 26.2706
8.2 1.38772 194.17439 -0.22032 33.05297 23.96418 25.15972
8.6 0.65587 194.74209 -0.30866 31.68444 23.91453 23.76147
9.0 -0.12926 196.57186 -0.05269 29.95966 23.50383 22.68104
9.4 -0.46124 198.91152 0.43221 28.51266 22.12752 21.59407
9.8 -0.78538 200.49583 0.65579 26.38686 21.84487 20.57872
10.2 -0.18627 201.84235 0.58808 25.14299 21.14915 19.72503
10.6 -1.06907 203.33639 0.84252 24.42813 20.7249 18.99339
11.0 -0.71761 204.81743 0.46011 23.33911 19.57404 18.522
11.4 -0.7868 206.31328 0.50166 22.6388 17.94421 17.89987
11.8 -0.55344 206.86236 0.41864 21.97414 16.34893 17.32054
12.2 -1.01324 206.62516 0.45565 21.4052 15.49339 16.59137
12.6 -0.86267 206.60584 -0.14927 20.70602 14.90245 16.35021
13.0 -0.25815 206.32407 0.04147 20.16584 14.33453 15.81743
13.4 -0.24126 206.2472 0.52172 19.9464 14.06491 15.14041
13.8 -0.00056 206.50433 0.29456 18.90003 14.24314 14.22039
14.2 0.28876 206.18087 -0.16978 18.61612 14.01799 13.4983
14.6 1.03465 206.58762 -0.65036 18.06823 13.85294 13.29913
15.0 1.12346 207.12458 -0.98459 17.3151 13.78398 13.14061
15.4 0.49173 207.24066 -1.18105 16.56764 13.84933 12.53479
15.8 1.33852 208.13648 -1.39468 15.98622 12.60004 11.46701
16.2 1.40609 208.65461 -1.08471 14.89897 12.45418 11.30358
16.6 1.67628 208.80646 -0.74291 14.31279 12.10335 10.99803
17.0 2.1461 209.09761 -0.77334 14.2474 11.49267 10.64727
17.4 1.83215 209.42094 -0.3411 13.96468 11.53555 10.27169
17.8 2.23009 209.78063 -0.07801 13.93275 11.00393 9.98928
18.2 1.42722 209.75224 -0.0417 13.9168 9.86156 9.75993
18.6 0.75316 209.03686 -0.15531 13.79456 9.2612 9.24039
19.0 0.26337 208.80565 0.12623 13.49799 9.23854 8.96239
19.4 -0.16869 209.51168 -0.13793 12.3279 8.70166 8.76895
19.8 0.05706 209.10642 -0.38623 11.82438 8.3298 8.2949
