0.125 -0.000 0.000 0.002
0.375 -0.000 -0.006 0.039
0.625 -0.001 -0.003 0.216
0.875 -0.002 -0.019 0.584
1.125 -0.022 -0.025 1.135
1.375 0.019 -0.029 1.808
1.625 -0.020 -0.052 2.480
1.875 -0.029 -0.093 3.298
2.125 -0.007 -0.085 4.005
2.375 -0.022 -0.083 4.783
2.625 -0.001 -0.114 5.455
2.875 -0.001 -0.087 5.962
3.125 -0.008 -0.119 6.730
3.375 0.014 -0.056 7.544
3.625 -0.047 -0.132 8.454
3.875 -0.051 -0.131 9.498
4.125 -0.015 -0.135 10.239
4.375 -0.051 -0.197 11.307
4.625 -0.069 -0.144 12.735
4.875 -0.087 -0.230 13.752
5.125 -0.078 -0.215 15.594
5.375 -0.036 -0.189 17.328
5.625 -0.091 -0.234 19.448
5.875 -0.117 -0.308 21.370
6.125 -0.111 -0.295 22.728
6.375 -0.198 -0.329 24.346
6.625 -0.169 -0.346 25.429
6.875 -0.249 -0.340 26.278
7.125 -0.189 -0.386 26.449
7.375 -0.150 -0.386 26.403
7.625 -0.202 -0.340 26.819
7.875 -0.213 -0.311 26.946
8.125 -0.188 -0.202 26.320
8.375 -0.166 -0.230 26.549
8.625 -0.156 -0.289 25.517
8.875 -0.150 -0.249 25.388
9.125 -0.249 -0.279 25.550
9.375 -0.260 -0.261 25.498
9.625 -0.240 -0.207 25.027
9.875 -0.185 -0.169 24.861
10.125 -0.215 -0.173 24.684
10.375 -0.244 -0.182 24.659
10.625 -0.238 -0.198 24.438
10.875 -0.313 -0.143 24.127
11.125 -0.269 -0.165 23.633
11.375 -0.332 -0.211 22.698
11.625 -0.290 -0.201 22.174
11.875 -0.282 -0.201 22.098
12.125 -0.300 -0.201 21.803
12.375 -0.295 -0.196 21.480
12.625 -0.275 -0.183 21.308
12.875 -0.293 -0.190 21.336
13.125 -0.276 -0.253 21.296
13.375 -0.287 -0.238 21.291
13.625 -0.256 -0.198 21.237
13.875 -0.251 -0.204 21.204
14.125 -0.238 -0.168 20.992
14.375 -0.255 -0.218 21.131
14.625 -0.209 -0.177 19.644
14.875 -0.222 -0.228 19.951
