0.05000 -6048.45900 425.67337 -161.81464 7519.76973 7361.67135 11855.46919
0.15000 -8299.28421 594.74771 1887.61096 8690.31352 8818.39935 13811.92693
0.25000 -12516.63655 151.78815 -1081.90710 9179.76187 7961.24551 16240.18138
0.35000 -14564.33033 230.57929 -623.57630 9122.22448 7012.00331 17305.30686
0.45000 -15488.72014 104.06586 178.45776 6430.43445 6338.92986 17029.30206
0.55000 -15591.94452 36.96955 -465.65267 5680.42763 6047.50011 16553.52091
0.65000 -15656.04111 -16.31784 103.00507 7515.83711 5660.92954 16862.53098
0.75000 -15323.50339 -96.93713 -274.95661 5792.96410 7497.87859 15038.91102
0.85000 -14953.05606 52.65515 52.28441 7622.06168 5780.27686 14277.21579
0.95000 -14709.13837 58.79500 -73.21554 4839.20078 5883.16880 12883.45631
1.05000 -14374.67892 -86.02796 -93.30936 4198.80490 4933.60480 11859.97249
1.15000 -13707.86578 97.16907 -463.18047 4030.11579 4547.03086 11213.08891
1.25000 -13405.05610 -58.74323 -418.40577 3621.52452 4420.33433 10499.79317
1.35000 -12979.63286 -118.80974 9.33632 3491.19650 4032.27980 9732.15319
1.45000 -12636.60398 18.38086 -122.50257 2845.64441 4134.00949 9249.46121
1.55000 -12262.74680 -58.72230 -283.05508 2538.48821 3829.88436 8632.38010
1.65000 -11796.23624 -284.82786 93.38828 2317.51344 3542.98836 8243.36831
1.75000 -11483.72304 -125.21942 -41.90961 2258.12146 3364.56327 7917.50405
1.85000 -11274.64692 -145.00539 -52.94438 2777.90706 3391.30081 7610.23851
1.95000 -10957.54756 -176.33248 -102.66263 1905.10947 3168.55807 6993.28119
2.05000 -10617.93615 -132.83876 -239.98744 2503.50923 3132.91833 6872.48648
2.15000 -10404.48226 -15.25122 -195.42383 1767.01660 2998.50148 6619.73512
2.25000 -10235.78538 -38.03767 -49.86015 1506.36078 2734.24244 6201.17588
2.35000 -10051.81172 -47.99816 -122.22950 1557.29973 2638.03944 5876.99092
2.45000 -9907.17163 -118.36462 30.81405 1434.39942 2721.43803 5751.41288
2.55000 -9857.07770 -76.24594 78.78618 1295.55116 2516.41545 5353.63877
2.65000 -9680.58660 -67.12527 98.41685 1872.39696 3243.81286 5367.45449
2.75000 -9534.85103 -112.54504 6.99554 2323.87201 2656.17119 4988.38772
2.85000 -9536.98204 -17.80531 263.81523 2231.38675 2851.00315 4757.15260
2.95000 -9353.64880 -97.59153 99.04779 1772.66745 2429.83198 4864.18033
3.05000 -9263.16905 -75.64039 -67.79586 1626.66280 2038.25391 4427.86047
3.15000 -9231.50596 -25.72201 -4.08107 1566.80978 1917.26948 4600.87812
3.25000 -9153.58788 35.41823 0.81864 1717.04207 2140.89630 4274.60964
3.35000 -9022.06184 9.92843 -28.26499 2232.28462 2721.61489 4565.03107
3.45000 -8956.79670 -22.41885 46.77872 1342.85358 1496.13446 4118.68069
3.55000 -8896.04322 4.45523 100.67667 1436.93306 1507.78863 3660.08007
3.65000 -8808.04169 -46.37679 59.16329 1835.78056 1578.79049 3807.35369
3.75000 -8690.42078 30.64757 53.45086 1318.92415 1414.17184 3446.83578
3.85000 -8591.14771 -44.35910 -29.98024 1612.35200 2626.43917 3280.68960
3.95000 -8513.57357 -53.16316 -2.70866 2656.71743 3278.38471 3781.13739
4.05000 -8364.11945 49.63149 51.43219 1254.33207 1500.47143 3278.09618
4.15000 -8231.29230 50.97178 -24.86508 1561.59593 1006.18384 3010.00889
4.25000 -8151.62649 34.24474 109.04813 1064.54995 849.44662 2815.10588
4.35000 -8028.13167 105.01820 112.74595 1081.17133 3603.71765 2863.08324
4.45000 -7896.03348 -9.28173 13.87357 1433.14346 1562.67253 2856.28962
4.55000 -7791.00464 31.37943 57.18700 964.07609 794.75252 2431.33663
4.65000 -7750.36509 11.27833 87.64912 1043.77836 900.19971 2408.60331
4.75000 -7597.22922 13.73344 87.70021 779.88863 665.92277 2256.38591
4.85000 -7492.95685 11.45854 -13.23179 794.83747 614.51675 2198.24269
4.95000 -7367.64417 24.26921 -66.91784 955.38044 609.75212 2343.38839
5.05000 -7318.56012 53.19901 92.44972 922.63816 632.87408 2208.91347
5.15000 -7200.77822 29.56423 103.07591 1073.79181 652.18540 2059.90409
5.25000 -7086.59153 -3.65088 6.53741 1231.02077 559.16828 1945.16243
5.35000 -7025.32230 10.87158 55.12456 1124.97055 575.63456 2023.37493
5.45000 -6939.57396 13.71895 113.38499 1245.70539 834.08466 1825.60900
5.55000 -6899.05626 9.37137 87.41648 568.46213 636.84716 2097.52721
5.65000 -6806.95116 2.07664 94.22418 545.52983 546.79557 1768.12829
5.75000 -6721.26335 5.84057 77.25692 669.50473 571.89457 1771.99997
5.85000 -6640.71743 64.77193 11.56051 1064.55390 2341.28518 1701.66608
5.95000 -6596.99743 20.18934 15.88601 802.06081 463.44128 1592.95775
6.05000 -6499.40306 9.76373 114.04489 479.22435 428.95682 1587.31094
6.15000 -6459.83998 -3.47267 59.43315 469.36479 358.35936 1491.74606
6.25000 -6377.56547 -11.72438 82.62402 625.28203 616.77824 2464.69230
6.35000 -6244.62437 -85.59416 236.76798 3233.88643 3858.16968 6608.22341
6.45000 -6252.61241 4.42478 22.81384 438.30161 329.75020 1389.59618
6.55000 -6258.00588 30.02922 52.04328 2734.55847 1277.78340 1531.48835
6.65000 -6110.37823 -7.39664 22.16151 470.50408 340.59683 1354.07862
6.75000 -6048.76376 3.98298 44.31469 557.59683 531.07122 1369.87051
6.85000 -5995.64875 -13.34228 41.81624 348.79171 310.97227 1204.73021
6.95000 -5909.53140 -9.64399 10.72966 472.88741 887.52435 1309.16127
7.05000 -5837.78055 9.64692 46.96264 486.29986 442.03252 1243.38290
7.15000 -5763.12618 -1.35017 14.96495 341.12342 301.48519 1137.07883
7.25000 -5701.66857 7.88819 15.09170 385.54913 493.48095 1136.27252
7.35000 -5631.52489 6.56131 13.21225 483.23422 273.13363 1176.27581
7.45000 -5582.31158 2.37186 100.86719 322.07415 351.54213 1020.00921
7.55000 -5505.67722 -28.01621 51.72102 474.05506 525.08132 1209.70690
7.65000 -5451.22405 -2.24563 57.14942 630.74099 285.84613 1076.84676
7.75000 -5387.98522 -11.46123 65.43116 455.42066 283.59123 992.38149
7.85000 -5314.75477 6.44770 71.92816 442.61652 245.95493 1043.23152
7.95000 -5260.33609 11.52532 23.66961 542.35439 335.87100 1033.25856
8.05000 -5219.20564 -9.96918 77.26759 287.55826 207.46174 887.20876
8.15000 -5161.35735 2.34930 58.55176 317.20653 248.49478 883.66600
8.25000 -5116.18169 9.74447 79.42531 284.06534 319.88029 869.17740
8.35000 -5067.03448 8.28944 52.52356 393.29826 263.72272 882.27412
8.45000 -5006.94418 2.72708 65.36271 629.84636 315.00854 995.89580
8.55000 -4968.80992 7.98813 45.98651 435.42032 813.34771 822.44259
8.65000 -4923.50342 10.66390 49.53969 276.61246 478.13578 800.69573
8.75000 -4892.63177 12.54304 61.03778 683.76401 334.27101 909.03570
8.85000 -4832.67182 -2.77792 67.18912 226.78940 164.23411 777.55750
8.95000 -4777.93050 9.12649 -19.68254 255.93873 267.61523 779.93719
9.05000 -4748.93419 3.50732 85.20472 213.81872 221.61925 727.57157
9.15000 -4696.24550 -4.25401 31.90041 320.29840 376.34711 725.81579
9.25000 -4664.55553 17.64564 14.87896 588.20334 310.99063 1374.19740
9.35000 -4630.33352 -0.24849 25.42199 207.20779 212.90310 694.69736
9.45000 -4598.26029 -2.09026 20.08880 254.68656 579.87108 675.41122
9.55000 -4529.56067 25.74085 12.06916 912.10501 693.10319 766.91223
9.65000 -4521.91213 12.45057 15.52118 200.05150 226.07133 667.25133
9.75000 -4482.89338 9.43874 4.26409 170.56279 192.47781 608.47918
9.85000 -4440.02635 2.73039 2.61116 369.79639 351.91229 677.16297
9.95000 -4405.35085 0.80774 21.80130 228.57196 289.83316 598.92108
10.05000 -4371.24442 9.46725 15.33678 323.33746 309.37212 631.42768
10.15000 -4320.83710 2.12442 -2.47689 232.81167 194.18080 579.29662
10.25000 -4293.84922 11.56826 11.55633 173.83278 128.96677 555.00535
10.35000 -4231.00677 3.98709 38.85053 430.94605 162.69792 569.96586
10.45000 -4231.41854 -1.60658 1.29616 222.45885 205.36658 533.29804
10.55000 -4181.98059 0.82556 -14.39579 234.77358 151.73530 622.24957
10.65000 -4145.61698 0.37309 -32.78970 319.58934 229.49589 593.54512
10.75000 -4123.80367 -8.78233 -8.12462 171.91474 164.11432 505.07211
10.85000 -4098.19779 -15.58925 -20.91166 158.71921 202.61430 512.92481
10.95000 -4077.07257 -2.99493 -2.79232 324.41873 179.38153 476.39734
11.05000 -4034.51456 2.06571 5.92261 188.59218 149.59917 495.54154
11.15000 -4000.02038 -4.72800 4.66284 186.08809 173.10473 454.92619
11.25000 -3978.52988 2.74193 -4.91033 192.48918 157.39143 473.32634
11.35000 -3951.05929 -0.14492 -44.54271 144.47513 135.48607 419.14201
11.45000 -3907.17133 7.76208 -14.84859 182.34894 198.80712 631.07542
11.55000 -3865.38489 6.81676 -16.78389 190.53860 282.79145 435.42613
11.65000 -3813.17867 -24.53560 30.59533 329.47070 491.01502 617.73629
11.75000 -3804.02062 0.86180 -26.53033 157.54038 134.52139 387.98471
11.85000 -3778.19273 -2.10732 3.61565 166.59080 196.86119 389.63951
11.95000 -3749.20883 4.35832 -17.41595 109.44307 123.38761 374.18359
12.05000 -3696.27600 -16.71187 -3.91832 717.13941 441.46628 710.86126
12.15000 -3694.24968 -1.17254 20.20378 138.13791 93.23886 340.72280
12.25000 -3660.57041 -0.37505 -4.01558 126.15717 98.29580 341.67213
12.35000 -3624.71755 1.32349 19.23941 115.46147 88.47895 328.48214
12.45000 -3607.14800 -1.02855 -9.44807 123.08641 110.77968 316.36657
12.55000 -3564.67214 13.43911 12.58368 145.53131 287.70446 357.94050
12.65000 -3532.48007 -1.23975 25.15115 92.38321 73.52076 300.39084
12.75000 -3495.44047 -5.42071 22.54278 131.71672 128.16486 309.48091
12.85000 -3471.59313 -16.16543 -5.03273 257.64091 354.86624 334.13478
12.95000 -3454.63410 -0.66732 45.22477 242.84008 104.61380 312.27163
13.05000 -3416.65379 0.27314 62.78646 127.18856 103.17387 275.26983
13.15000 -3381.54344 0.36575 45.88649 129.68108 105.87869 303.84865
13.25000 -3359.78482 1.86443 60.69865 96.73425 95.69525 287.89913
13.35000 -3324.88270 3.62764 60.93267 249.96861 413.89926 277.61501
13.45000 -3307.93392 3.90423 41.10814 109.81568 88.75241 282.55262
13.55000 -3286.82861 -8.49670 38.27889 131.77646 163.30084 271.13527
13.65000 -3263.50130 0.32414 33.42131 129.72295 118.50789 297.88601
13.75000 -3239.96878 6.19490 58.81945 135.28742 79.95685 240.22414
13.85000 -3197.38285 -12.21949 72.70855 302.88838 171.40070 353.16978
13.95000 -3221.33203 10.65373 37.17528 333.48725 192.89996 241.29726
14.05000 -3183.54921 -10.90544 26.41687 185.72404 201.80510 271.44329
14.15000 -3166.37038 -13.05833 45.57665 164.31432 184.03921 291.08355
14.25000 -3129.22677 6.51401 41.47590 115.87832 108.47459 236.63149
14.35000 -3117.24722 -4.25637 42.78964 108.88187 105.03391 243.05831
14.45000 -3084.72739 -1.20378 48.44096 108.54463 75.96864 249.94305
14.55000 -3063.73942 -2.51989 64.35044 69.42505 140.43093 243.44815
14.65000 -3048.99728 -0.00192 43.65857 101.66072 94.86969 234.33852
14.75000 -3025.70819 3.35940 44.41509 66.84262 63.52525 197.61372
14.85000 -2987.58555 -3.07201 68.87202 140.81091 109.13329 215.45487
14.95000 -2978.82059 0.37051 59.70697 73.11784 61.46240 199.52588
15.05000 -2960.23970 -3.66656 24.21540 172.49148 75.23512 205.46264
15.15000 -2939.65852 -1.20261 54.45035 83.75511 81.12151 186.30806
15.25000 -2917.51081 -9.15385 36.81590 104.13188 107.36399 222.56042
15.35000 -2891.07748 15.01727 76.01269 240.14886 188.08257 279.66280
15.45000 -2870.21694 8.30816 52.00451 99.19253 92.45263 216.21679
15.55000 -2862.66043 -11.74456 71.77640 148.30567 300.31900 201.61147
15.65000 -2847.49440 2.95071 63.14273 85.71717 86.10744 174.47296
15.75000 -2820.62226 0.51494 58.91381 88.91551 65.00378 189.07901
15.85000 -2885.86572 28.10381 47.75279 1143.45262 302.60833 230.47874
15.95000 -2788.27061 -2.96864 46.11622 95.53070 55.49469 178.59590
16.05000 -2770.23366 8.03474 58.73437 76.84242 67.32824 180.70184
16.15000 -2759.21055 23.91565 57.98534 126.26442 568.63475 213.14695
16.25000 -2729.35668 -3.62040 61.59434 81.46081 68.96973 165.93223
16.35000 -2708.02133 -7.14941 79.80121 61.36528 41.65266 153.19415
16.45000 -2688.66034 2.56144 59.08774 48.67071 52.43109 140.91550
16.55000 -2665.77999 14.70214 62.71244 121.64834 121.81692 155.31911
16.65000 -2656.77028 1.74138 89.49606 58.31321 62.91391 149.58949
16.75000 -2639.70448 5.83876 45.76477 74.28008 77.78414 164.31822
16.85000 -2626.48140 1.82529 75.77004 57.34900 72.30055 140.21281
16.95000 -2607.40549 1.77663 86.22850 62.70514 44.71459 123.38236
17.05000 -2584.26858 7.93517 90.02380 71.27298 59.80416 164.34497
17.15000 -2573.57903 8.25896 81.63025 55.91055 57.78324 143.15885
17.25000 -2542.72096 8.63644 56.49107 95.00995 72.96040 149.55952
17.35000 -2551.14615 0.73166 71.31501 72.19224 61.83123 148.52461
17.45000 -2527.98094 8.22232 71.42094 51.57660 51.45525 125.61959
17.55000 -2496.67452 -10.79598 39.04766 62.93035 118.12199 151.21253
17.65000 -2495.40634 3.63180 61.56319 59.11305 37.57717 135.75801
17.75000 -2468.54783 -1.25459 37.37653 78.25849 47.06827 163.97244
17.85000 -2458.14008 1.47712 57.14349 47.70366 43.73557 137.81609
17.95000 -2440.19727 12.54101 58.63459 46.82841 63.96367 125.58848
18.05000 -2435.95328 3.58747 38.50151 59.62885 54.50680 121.89007
18.15000 -2420.72573 4.11937 61.53411 43.99722 41.13489 117.73573
18.25000 -2409.93692 -0.82581 54.60353 51.28314 50.52620 101.59001
18.35000 -2392.97988 -4.67668 44.62056 56.61205 72.86261 152.03303
18.45000 -2375.54219 0.06414 9.98945 45.83707 90.06898 171.83792
18.55000 -2368.09157 0.55059 40.00996 49.84816 39.68980 106.09363
18.65000 -2350.97656 3.58196 31.89563 74.32826 78.44391 110.85763
18.75000 -2334.17681 -0.28705 61.44944 52.09764 54.57386 105.09057
18.85000 -2314.84095 -3.37008 56.47041 47.76736 36.76851 113.87267
18.95000 -2320.62514 -10.60264 66.99857 57.25767 45.86757 116.37366
19.05000 -2306.93557 6.19763 70.13042 50.23753 50.45955 113.73800
19.15000 -2281.13949 -3.71602 81.63319 39.56445 36.01086 97.10239
19.25000 -2273.70347 15.51591 73.51938 77.87990 73.78126 108.11008
19.35000 -2250.48872 6.89831 93.73332 62.70708 48.40582 110.97135
19.45000 -2254.09080 -4.32472 57.25608 67.10781 51.80599 87.93445
19.55000 -2249.56604 1.39358 64.36858 74.99611 56.83671 122.61762
19.65000 -2227.24446 -0.73101 66.57251 51.26003 42.10664 86.89192
19.75000 -2200.36307 9.27525 70.58142 43.21050 27.92655 94.04484
19.85000 -2199.31288 -19.81000 68.58689 36.18024 205.06843 114.06388
19.95000 -2184.38900 -2.47233 62.49738 40.67285 35.46991 92.87863
