0.2 2.48089 16.30128 2.14716 66.91388 67.4798 67.47882
0.6 -1.30838 43.84064 -1.04166 63.03655 63.84727 62.85738
1.0 0.6154 68.74621 0.37982 58.93953 59.6483 59.02891
1.4 -0.29595 90.01186 -1.26111 55.6322 55.93489 55.48667
1.8 -0.27387 107.24695 -0.73416 52.18178 52.85908 52.18779
2.2 -0.76569 120.83556 0.71646 49.22343 49.44108 49.30455
2.6 0.52797 131.99978 -0.08867 46.60559 47.3834 46.6301
3.0 -0.66673 141.63446 0.17283 44.01018 44.30861 44.13742
3.4 -0.29335 150.26427 0.05205 41.95102 42.0084 41.71656
3.8 -0.03915 156.83378 0.0558 39.34304 39.91986 39.59323
4.2 0.27347 164.0995 -0.08315 37.52201 37.62287 37.3664
4.6 0.21675 169.76319 -0.16319 35.28231 35.69637 35.43733
5.0 0.2959 175.10174 0.28139 33.66841 33.82417 33.56113
5.4 -0.5498 179.71262 0.03935 31.74213 31.94966 31.77575
5.8 0.31314 183.07923 0.42099 30.02094 30.4853 30.00843
6.2 0.08159 187.06554 0.34178 28.48547 28.39054 28.60488
6.6 -0.63449 189.74355 -0.09278 26.90439 27.25876 26.75165
7.0 0.01897 192.06837 -0.43003 25.62021 25.59939 25.56825
7.4 -0.47138 194.09788 0.10917 24.2084 24.72188 24.44077
7.8 -0.29798 196.817 0.06935 23.11019 22.982 22.77299
8.2 0.11564 198.14635 -0.3792 21.82418 21.71552 21.84863
8.6 -0.72065 199.70952 0.28638 20.8988 21.15725 20.73335
9.0 -0.0511 200.66409 -0.15882 19.70864 19.68981 19.65858
9.4 -0.52355 202.43064 0.3095 18.83731 19.02749 18.49089
9.8 0.54336 203.35381 -0.07644 18.02535 17.98303 17.91979
10.2 0.39794 204.06425 -0.0967 16.92345 17.14151 17.15861
10.6 -0.04057 205.00628 0.10347 16.27004 16.36878 16.02195
11.0 0.01758 205.13601 -0.10844 15.52888 15.39595 15.39894
11.4 -0.04628 206.07626 0.28652 14.74986 14.87835 14.7718
11.8 0.12567 206.39212 -0.02281 14.33407 13.95177 13.80461
12.2 0.04972 206.67552 0.16936 13.27719 13.57053 13.2618
12.6 -0.23027 206.61969 -0.18594 13.15689 12.97151 12.90741
13.0 0.17217 207.15823 -0.17799 12.35536 12.07858 11.91308
13.4 -0.57983 207.00524 0.36152 11.63295 11.88921 11.61673
13.8 -0.38638 207.06384 0.50988 11.39004 11.2293 11.1974
14.2 -0.00544 207.5429 0.26228 10.72205 10.76164 11.09236
14.6 0.45549 207.94384 0.02508 10.37681 10.52742 10.35215
15.0 0.02256 207.80355 -0.17231 10.10382 9.78019 9.92294
15.4 0.01949 207.50509 0.21436 9.83381 9.71964 9.67766
15.8 -0.09102 207.5285 0.10147 9.23443 9.33202 9.00399
16.2 -0.12671 207.52082 0.05239 8.98661 8.6639 9.07537
16.6 -0.1564 207.48553 -0.2986 8.41682 8.49058 8.52446
17.0 -0.28055 207.6335 0.53533 8.14855 8.23187 8.18511
17.4 0.01828 208.26731 0.20186 8.27023 7.83995 8.08389
17.8 -0.17738 207.53629 0.20098 7.49653 7.71152 7.37398
18.2 -0.31809 208.27752 -0.20914 7.40653 7.67895 7.5009
18.6 -0.00341 208.56312 0.53822 7.481 7.16935 7.28287
19.0 -0.51273 206.89881 0.22 7.30561 7.2504 7.18865
19.4 -0.2606 207.48555 -0.08408 6.16221 6.54711 6.78906
19.8 0.25445 207.90532 0.301 7.00423 6.81515 6.59113
