0.05000 3118.21689
0.15000 5378.05611
0.25000 6441.77642
0.35000 7002.99363
0.45000 7322.36788
0.55000 7503.59816
0.65000 7368.92117
0.75000 7239.77709
0.85000 7184.88448
0.95000 7073.97779
1.05000 6877.83517
1.15000 6527.90973
1.25000 6361.03915
1.35000 6229.30003
1.45000 5977.93958
1.55000 5714.91534
1.65000 5652.88487
1.75000 5430.33207
1.85000 5273.64935
1.95000 5177.53084
2.05000 4913.90583
2.15000 4768.57451
2.25000 4653.45085
2.35000 4487.71689
2.45000 4369.34437
2.55000 4214.01784
2.65000 4159.74710
2.75000 4001.12691
2.85000 3882.11466
2.95000 3825.35791
3.05000 3772.44051
3.15000 3588.24206
3.25000 3535.35796
3.35000 3417.84355
3.45000 3378.36266
3.55000 3331.53247
3.65000 3233.01020
3.75000 3140.83688
3.85000 3071.49276
3.95000 3033.53856
4.05000 2975.25628
4.15000 2909.89076
4.25000 2816.86900
4.35000 2742.96390
4.45000 2689.79406
4.55000 2666.99555
4.65000 2579.45866
4.75000 2486.90010
4.85000 2462.45203
4.95000 2401.92171
5.05000 2326.49288
5.15000 2254.61954
5.25000 2209.28145
5.35000 2135.05867
5.45000 2069.99076
5.55000 2014.96428
5.65000 1947.81141
5.75000 1901.61062
5.85000 1833.22352
5.95000 1779.52267
6.05000 1728.24770
6.15000 1677.21046
6.25000 1615.96819
6.35000 1563.97892
6.45000 1518.56832
6.55000 1479.91219
6.65000 1427.40055
6.75000 1396.61146
6.85000 1355.63967
6.95000 1296.16041
7.05000 1267.33097
7.15000 1234.88915
7.25000 1185.06632
7.35000 1145.11676
7.45000 1123.03223
7.55000 1094.20255
7.65000 1068.45982
7.75000 1034.21767
7.85000 992.58052
7.95000 984.07974
8.05000 956.92140
8.15000 925.16455
8.25000 915.08707
8.35000 887.93550
8.45000 866.08685
8.55000 850.25813
8.65000 819.21238
8.75000 803.28940
8.85000 774.91074
8.95000 775.37327
9.05000 744.51651
9.15000 748.14723
9.25000 717.65321
9.35000 708.02382
9.45000 684.87053
9.55000 673.08199
9.65000 651.21461
9.75000 633.42146
9.85000 626.02344
9.95000 605.86155
10.05000 604.97794
10.15000 589.00120
10.25000 584.35451
10.35000 546.32891
10.45000 546.65730
10.55000 538.21433
10.65000 514.50524
10.75000 501.27665
10.85000 503.00006
10.95000 483.83182
11.05000 476.23279
11.15000 459.84533
11.25000 451.53282
11.35000 460.35995
11.45000 431.70969
11.55000 430.67889
11.65000 414.67645
11.75000 406.13419
11.85000 405.23406
11.95000 393.98588
12.05000 385.06669
12.15000 392.07058
12.25000 389.33804
12.35000 371.15611
12.45000 353.01236
12.55000 347.15129
12.65000 347.51277
12.75000 351.44514
12.85000 347.34757
12.95000 336.60354
13.05000 324.72625
13.15000 324.65842
13.25000 316.20600
13.35000 321.20610
13.45000 309.37682
13.55000 311.25624
13.65000 301.42948
13.75000 301.47583
13.85000 289.79391
13.95000 284.13503
14.05000 268.89868
14.15000 285.95909
14.25000 264.06780
14.35000 268.85452
14.45000 253.50707
14.55000 256.44752
14.65000 248.75030
14.75000 233.24252
14.85000 236.31590
14.95000 231.49178
15.05000 225.80361
15.15000 230.30200
15.25000 221.16295
15.35000 221.27671
15.45000 210.24914
15.55000 202.89699
15.65000 205.40803
15.75000 201.82153
15.85000 190.11338
15.95000 196.25116
16.05000 192.88527
16.15000 187.53889
16.25000 182.36427
16.35000 181.20657
16.45000 181.17060
16.55000 175.96907
16.65000 168.62789
16.75000 166.68913
16.85000 159.76720
16.95000 156.98017
17.05000 163.17326
17.15000 152.85665
17.25000 153.57872
17.35000 145.36612
17.45000 136.71630
17.55000 142.56310
17.65000 145.83225
17.75000 139.82906
17.85000 145.66683
17.95000 137.51850
18.05000 145.44293
18.15000 129.96375
18.25000 138.27895
18.35000 120.91948
18.45000 120.78977
18.55000 127.82109
18.65000 117.84409
18.75000 121.87448
18.85000 133.50685
18.95000 122.24610
19.05000 117.85323
19.15000 115.91926
19.25000 122.69609
19.35000 121.00662
19.45000 106.84923
19.55000 111.41416
19.65000 109.65240
19.75000 98.51063
19.85000 102.14585
19.95000 86.94436
