0.120000 0.107930
0.380000 0.170200
0.620000 0.092610
0.880000 0.137850
1.120000 0.085040
1.380000 0.130660
1.620000 0.102500
1.880000 0.101600
2.120000 0.108850
2.380000 0.118090
2.620000 0.130010
2.880000 0.123190
3.120000 0.140050
3.380000 0.166170
3.620000 0.131930
3.880000 0.136290
4.120000 0.138770
4.380000 0.128900
4.620000 0.130970
4.880000 0.149000
5.120000 0.154500
5.380000 0.163350
5.620000 0.189390
5.880000 0.206490
6.120000 0.223730
6.380000 0.284790
6.620000 0.237780
6.880000 0.257180
7.120000 0.312080
7.380000 0.288480
7.620000 0.270090
7.880000 0.204200
8.120000 0.121700
8.380000 0.064420
8.620000 -0.083090
8.880000 -0.286970
9.120000 -0.403790
9.380000 -0.514270
9.620000 -0.698050
9.880000 -0.787950
10.120000 -0.868500
10.380000 -1.009640
10.620000 -1.028500
10.880000 -1.123940
11.120000 -1.132510
11.380000 -1.066600
11.620000 -1.047530
11.880000 -1.032330
12.120000 -1.054270
12.380000 -1.244310
12.620000 -1.046340
12.880000 -1.514690
13.120000 -1.006190
13.380000 -1.045490
13.620000 -1.276610
13.880000 -0.242440
14.120000 1.921800
14.380000 2.389880
14.620000 2.912820
14.880000 2.770890
