0.05000 111479.30028
0.15000 50026.16823
0.25000 33000.09484
0.35000 25432.57308
0.45000 20951.78800
0.55000 18061.99437
0.65000 15801.86617
0.75000 14166.57330
0.85000 12896.66009
0.95000 11709.09423
1.05000 10770.43716
1.15000 10000.38946
1.25000 9322.39685
1.35000 8681.03115
1.45000 8143.13641
1.55000 7633.09948
1.65000 7319.78334
1.75000 6967.13436
1.85000 6610.19166
1.95000 6301.48200
2.05000 6062.29879
2.15000 5803.80774
2.25000 5572.85427
2.35000 5333.49479
2.45000 5111.97951
2.55000 4863.17230
2.65000 4696.45209
2.75000 4432.58974
2.85000 4306.36626
2.95000 4075.18009
3.05000 3917.57879
3.15000 3679.48859
3.25000 3590.65711
3.35000 3346.06186
3.45000 3218.11961
3.55000 3117.20300
3.65000 3043.83673
3.75000 2875.34260
3.85000 2793.29099
3.95000 2742.34101
4.05000 2677.14381
4.15000 2589.31505
4.25000 2543.77461
4.35000 2472.23977
4.45000 2428.74509
4.55000 2366.97653
4.65000 2333.49685
4.75000 2262.15111
4.85000 2192.81679
4.95000 2176.60676
5.05000 2097.20426
5.15000 2051.76501
5.25000 2024.31769
5.35000 1948.18055
5.45000 1910.84536
5.55000 1874.50383
5.65000 1820.55478
5.75000 1785.79473
5.85000 1740.13490
5.95000 1709.86775
6.05000 1669.61777
6.15000 1622.84329
6.25000 1588.26138
6.35000 1541.07273
6.45000 1519.54192
6.55000 1493.09197
6.65000 1470.70785
6.75000 1429.33742
6.85000 1394.18615
6.95000 1371.39540
7.05000 1323.41068
7.15000 1296.86325
7.25000 1262.55419
7.35000 1244.18081
7.45000 1207.36174
7.55000 1190.15801
7.65000 1154.53233
7.75000 1124.24644
7.85000 1099.52665
7.95000 1068.15729
8.05000 1052.37339
8.15000 1018.11920
8.25000 1015.67625
8.35000 996.82915
8.45000 973.09101
8.55000 941.91686
8.65000 928.73007
8.75000 907.48074
8.85000 880.84761
8.95000 861.72347
9.05000 830.64202
9.15000 818.98780
9.25000 802.32413
9.35000 791.72740
9.45000 765.15899
9.55000 748.91308
9.65000 754.62808
9.75000 723.37192
9.85000 715.64544
9.95000 707.62455
10.05000 674.25144
10.15000 671.14372
10.25000 647.92845
10.35000 642.18413
10.45000 634.96868
10.55000 621.65808
10.65000 613.72158
10.75000 603.30736
10.85000 586.60591
10.95000 580.76051
11.05000 569.82657
11.15000 556.87580
11.25000 549.23033
11.35000 540.71957
11.45000 527.04000
11.55000 519.95960
11.65000 496.69433
11.75000 496.59984
11.85000 481.00201
11.95000 474.06133
12.05000 468.83491
12.15000 457.64472
12.25000 449.20402
12.35000 442.92054
12.45000 431.07555
12.55000 430.17799
12.65000 418.64932
12.75000 415.13725
12.85000 404.37469
12.95000 392.09335
13.05000 385.91890
13.15000 378.85887
13.25000 366.97291
13.35000 360.05057
13.45000 361.39145
13.55000 353.06066
13.65000 348.13720
13.75000 338.73427
13.85000 322.37006
13.95000 323.34281
14.05000 322.53971
14.15000 312.50552
14.25000 326.12563
14.35000 298.39952
14.45000 298.12486
14.55000 294.02551
14.65000 276.40716
14.75000 283.14035
14.85000 272.06090
14.95000 268.17390
15.05000 274.66252
15.15000 260.74883
15.25000 250.15343
15.35000 255.66403
15.45000 247.13189
15.55000 246.20635
15.65000 239.96424
15.75000 233.99666
15.85000 230.54210
15.95000 226.31487
16.05000 220.03467
16.15000 217.88190
16.25000 215.33970
16.35000 212.65773
16.45000 204.79886
16.55000 209.63918
16.65000 198.05195
16.75000 197.74443
16.85000 192.60157
16.95000 189.24535
17.05000 192.65560
17.15000 184.18443
17.25000 180.96613
17.35000 174.22285
17.45000 180.45686
17.55000 166.75337
17.65000 171.15631
17.75000 170.63950
17.85000 166.82050
17.95000 162.60700
18.05000 163.94392
18.15000 157.12878
18.25000 158.46282
18.35000 148.19839
18.45000 151.93902
18.55000 148.70696
18.65000 146.98651
18.75000 146.95962
18.85000 144.60402
18.95000 139.15047
19.05000 142.98865
19.15000 131.58714
19.25000 163.84851
19.35000 140.14727
19.45000 130.53212
19.55000 134.89817
19.65000 130.99404
19.75000 122.94882
19.85000 121.44476
19.95000 123.40875
