0.12500 0.02149
0.37500 0.02020
0.62500 0.06736
0.87500 0.13295
1.12500 0.17743
1.37500 0.25016
1.62500 0.29306
1.87500 0.33842
2.12500 0.38868
2.37500 0.43462
2.62500 0.44424
2.87500 0.45865
3.12500 0.46030
3.37500 0.44399
3.62500 0.43226
3.87500 0.41439
4.12500 0.39852
4.37500 0.37294
4.62500 0.34280
4.87500 0.32411
5.12500 0.30549
5.37500 0.27587
5.62500 0.23982
5.87500 0.20279
6.12500 0.16636
6.37500 0.13311
6.62500 0.10634
6.87500 0.09729
7.12500 0.05865
7.37500 0.05571
7.62500 0.05026
7.87500 0.05436
8.12500 0.05000
8.37500 0.04516
8.62500 0.05489
8.87500 0.04845
9.12500 0.05165
9.37500 0.06692
9.62500 0.07000
9.87500 0.05766
10.12500 0.04952
10.37500 0.04379
10.62500 0.03545
10.87500 0.04056
11.12500 0.03312
11.37500 0.01736
11.62500 0.02726
11.87500 0.03217
12.12500 0.04961
12.37500 0.05285
12.62500 0.08526
12.87500 0.06054
13.12500 0.08818
13.37500 0.10339
13.62500 0.08237
13.87500 0.09866
14.12500 0.11171
14.37500 0.09699
14.62500 0.07745
14.87500 0.07513
