0.12500 0.03678
0.37500 0.00953
0.62500 0.01366
0.87500 0.01170
1.12500 0.01784
1.37500 0.03125
1.62500 0.03170
1.87500 0.04437
2.12500 0.06010
2.37500 0.07295
2.62500 0.08342
2.87500 0.08305
3.12500 0.11345
3.37500 0.10731
3.62500 0.12346
3.87500 0.12249
4.12500 0.12172
4.37500 0.10589
4.62500 0.10371
4.87500 0.08767
5.12500 0.07303
5.37500 0.05785
5.62500 0.04771
5.87500 0.02882
6.12500 0.01885
6.37500 0.02589
6.62500 0.01766
6.87500 0.01877
7.12500 0.01865
7.37500 0.03355
7.62500 0.04144
7.87500 0.05432
8.12500 0.03184
8.37500 0.02980
8.62500 0.03154
8.87500 0.03163
9.12500 0.02988
9.37500 0.02685
9.62500 0.01591
9.87500 0.03474
10.12500 0.02270
10.37500 0.03064
10.62500 0.03506
10.87500 0.04966
11.12500 0.03814
11.37500 0.02448
11.62500 0.01392
11.87500 0.02606
12.12500 0.02561
12.37500 0.02581
12.62500 0.02776
12.87500 0.02089
13.12500 0.02517
13.37500 0.05547
13.62500 0.04673
13.87500 0.05326
14.12500 0.05325
14.37500 0.06816
14.62500 0.06931
14.87500 0.05270
