0.12500 0.01603
0.37500 0.00249
0.62500 0.03938
0.87500 0.05284
1.12500 0.08742
1.37500 0.11595
1.62500 0.14278
1.87500 0.17417
2.12500 0.20306
2.37500 0.22431
2.62500 0.25794
2.87500 0.28834
3.12500 0.30388
3.37500 0.32102
3.62500 0.32086
3.87500 0.30991
4.12500 0.29880
4.37500 0.27979
4.62500 0.28287
4.87500 0.27170
5.12500 0.26137
5.37500 0.23868
5.62500 0.23576
5.87500 0.22645
6.12500 0.20870
6.37500 0.19121
6.62500 0.16786
6.87500 0.12709
7.12500 0.10245
7.37500 0.08426
7.62500 0.05859
7.87500 0.04471
8.12500 0.01595
8.37500 0.01342
8.62500 0.02373
8.87500 0.02683
9.12500 0.01402
9.37500 0.00927
9.62500 0.00881
9.87500 0.01627
10.12500 0.01242
10.37500 0.01464
10.62500 0.02737
10.87500 0.02007
11.12500 0.02244
11.37500 0.00901
11.62500 0.00308
11.87500 0.00479
12.12500 0.01489
12.37500 0.00324
12.62500 0.00510
12.87500 0.01312
13.12500 0.01480
13.37500 0.03454
13.62500 0.02626
13.87500 0.03933
14.12500 0.03331
14.37500 0.02343
14.62500 0.00968
14.87500 0.00814
15.12500 0.01717
15.37500 0.01099
15.62500 0.01443
15.87500 0.02838
16.12500 0.02720
16.37500 0.03221
16.62500 0.03868
16.87500 0.04776
17.12500 0.05574
17.37500 0.06646
17.62500 0.07224
17.87500 0.05179
18.12500 0.06737
18.37500 0.07970
18.62500 0.03907
18.87500 0.02569
19.12500 0.04107
19.37500 0.06882
19.62500 0.03350
19.87500 0.01438
