0.05000 -2707.20562 233.57523 -3590.55546 2513.16520 2072.01636 403010.41300
0.15000 -4385.25934 273.83232 -23417.43980 2193.30103 2076.32458 429532.37474
0.25000 -5661.90412 -42.28844 14005.61651 1777.08292 1536.94649 310829.71681
0.35000 -7072.63032 31.12785 -12228.11981 2014.22526 1729.53538 362647.55538
0.45000 -7687.64844 -8.63088 -1281.07178 1856.46871 1385.85719 398572.57097
0.55000 -7955.53597 -31.31983 923.87370 1815.64676 1354.57588 401619.81949
0.65000 -8083.62930 19.08630 -6459.24908 1724.99017 1345.90938 298922.81474
0.75000 -8230.09211 26.83140 -6710.47728 1574.07967 1104.65772 328106.08271
0.85000 -8292.86989 32.13706 -7249.58471 1434.28767 1081.91724 325254.19555
0.95000 -8447.35680 46.08960 -2531.17021 1538.86856 954.25920 316121.19314
1.05000 -8476.00979 56.19452 2338.93625 1370.13077 848.55497 348873.12879
1.15000 -8476.27637 45.79797 7656.43443 1416.71442 892.89025 315797.99706
1.25000 -8416.81129 37.55393 4682.13608 1277.87960 826.62587 298451.26130
1.35000 -8425.17763 44.61928 3606.69447 1379.40887 820.84828 271416.03996
1.45000 -8414.93256 41.02657 -5724.76053 1328.82048 745.56362 284055.28354
1.55000 -8379.61330 43.13732 1693.37192 1242.52122 704.11926 261869.73001
1.65000 -8297.08794 33.55588 -5108.84245 1093.03405 665.98999 238783.21466
1.75000 -8220.51754 30.70977 946.71806 1086.94428 715.98528 226655.91966
1.85000 -8144.74950 38.25269 2405.39839 1051.97510 669.74395 258720.23477
1.95000 -8056.93402 33.57462 -1493.39115 1002.72193 617.02200 232960.53486
2.05000 -7965.20497 41.58379 1187.15162 943.72132 741.32237 194165.87145
2.15000 -7887.79027 26.54717 -220.23596 892.61062 601.75673 226902.12484
2.25000 -7813.32150 39.56917 2233.30658 868.07471 585.68406 209296.87781
2.35000 -7754.50667 33.54335 -2279.84672 809.22344 577.97809 192229.43227
2.45000 -7712.11966 36.71081 850.12082 772.37575 636.90474 187889.65040
2.55000 -7680.82713 35.77693 134.80327 785.33234 652.27365 182886.30511
2.65000 -7637.22774 25.79575 388.47824 778.57248 537.83706 164490.81259
2.75000 -7625.30842 31.38833 -425.17529 694.49062 612.97154 162024.74777
2.85000 -7597.76146 32.06873 634.00546 663.76717 556.51290 152597.43207
2.95000 -7565.90920 33.54591 -1928.98552 645.60905 582.98680 158306.51157
3.05000 -7541.86186 30.86511 2479.64979 659.81627 553.11927 153837.06969
3.15000 -7514.16433 24.33494 951.93023 602.65229 557.47154 144667.27655
3.25000 -7489.81420 17.80337 1044.68967 673.49913 578.91388 149214.91844
3.35000 -7490.19157 32.48449 2880.92121 550.07901 442.62278 126011.54436
3.45000 -7459.44003 24.28622 -1143.17746 538.84460 466.20104 128052.05314
3.55000 -7423.84212 30.91883 2143.39739 541.35607 459.60905 130191.54832
3.65000 -7378.57040 20.44672 -481.84116 623.98372 499.68920 123257.35585
3.75000 -7357.62459 36.50488 -569.78613 505.77671 454.75650 128960.83814
3.85000 -7310.79276 27.17696 -1373.02431 501.16420 418.14308 112909.22097
3.95000 -7287.69327 33.33779 864.00944 562.92047 468.59274 111414.42178
4.05000 -7247.95538 32.32038 1345.37904 594.88347 499.03012 102479.93029
4.15000 -7221.31058 26.73497 -382.26131 447.24829 450.25387 100809.25492
4.25000 -7182.29452 31.64804 -346.03165 413.18269 371.41918 93143.43505
4.35000 -7138.98604 47.36512 333.71667 424.64834 437.10168 96240.40253
4.45000 -7098.44085 39.63096 -1502.64576 362.29947 329.39370 93811.52201
4.55000 -7068.51975 29.80830 -37.61216 420.97009 375.11565 86427.73354
4.65000 -7023.30269 37.23956 -780.81295 375.42512 401.03507 103308.96086
4.75000 -6995.57177 33.19123 -588.81300 368.08051 323.05934 99455.90818
4.85000 -6957.29816 35.59643 321.38861 370.89951 313.77735 118640.33118
4.95000 -6919.02768 41.07243 197.11791 369.06988 395.55682 87023.50766
5.05000 -6879.08153 32.91984 13.25531 362.15073 393.06942 94613.42525
5.15000 -6840.10030 38.96867 447.51829 352.48598 400.26735 81862.53217
5.25000 -6808.67191 37.29845 358.51465 387.20755 382.61466 68513.05290
5.35000 -6784.84184 44.47378 -1302.40549 323.20699 311.02681 68215.45243
5.45000 -6731.40818 38.35641 607.13227 339.59009 395.79194 83656.75671
5.55000 -6693.43860 28.00529 -1300.92450 319.07434 398.01429 75091.40913
5.65000 -6647.60630 31.21942 -432.41266 263.22892 326.44047 66870.69818
5.75000 -6589.72661 35.04450 315.62460 260.08973 276.16521 62508.53902
5.85000 -6524.96231 34.72259 -466.68985 278.77769 265.40231 58890.38114
5.95000 -6475.35094 28.69437 -189.84404 268.70079 265.18587 55400.03585
6.05000 -6414.92330 32.16333 -146.82531 273.29187 390.14629 63597.10481
6.15000 -6364.91535 33.95293 -418.01383 238.25477 232.94093 52998.33403
6.25000 -6302.86809 33.21728 -993.05722 286.37692 316.25384 74193.19277
6.35000 -6254.69894 26.56500 -88.88340 274.13187 273.69985 46352.03350
6.45000 -6204.92120 26.98280 -781.22893 248.38426 270.38271 52511.53899
6.55000 -6145.00814 30.61521 -186.49691 243.65076 254.80078 47881.45920
6.65000 -6099.86859 28.95896 97.78522 322.46593 249.19359 41173.87166
6.75000 -6051.08595 30.18098 -1227.81263 202.79229 215.09854 47320.87909
6.85000 -6006.86894 26.07647 112.67511 248.44489 210.20984 40656.96297
6.95000 -5963.33002 30.48099 376.97607 244.62521 218.40406 38357.06735
7.05000 -5909.73220 25.31807 -948.90184 236.89152 364.12448 40168.90487
7.15000 -5868.15043 25.85417 -230.68636 226.65737 228.81385 41667.25856
7.25000 -5815.47045 26.69780 -131.77031 429.72483 289.96357 35717.38853
7.35000 -5766.33064 30.14571 -912.07713 227.35254 244.66085 46622.11130
7.45000 -5724.63871 28.57327 -101.61515 276.73230 245.84635 36883.71152
7.55000 -5674.85404 23.29269 142.74421 200.02799 231.38241 35142.70930
7.65000 -5629.15877 27.10397 -999.01495 210.70640 261.85671 32704.16494
7.75000 -5577.17327 30.25487 -645.02984 200.40329 200.88383 34602.63889
7.85000 -5527.05513 21.69712 885.18539 180.22642 192.65555 35569.66157
7.95000 -5477.28170 28.26001 -544.82155 234.63199 233.97807 30425.68039
8.05000 -5433.47951 23.47398 461.20105 198.39948 191.50751 29860.14075
8.15000 -5385.45938 23.81100 -532.20754 184.51039 188.70327 29125.21355
8.25000 -5338.46878 25.25290 -585.56668 181.96715 171.62358 28890.30943
8.35000 -5288.25426 20.47597 -330.98548 186.83111 195.34052 34191.58820
8.45000 -5236.45990 17.67219 -582.86343 217.83627 222.44647 31528.61121
8.55000 -5191.69968 22.18766 -200.89832 201.78330 190.75442 25410.34806
8.65000 -5147.99267 23.78805 37.15670 169.04903 208.80611 25637.39455
8.75000 -5103.32957 19.58990 -376.92070 192.71147 226.56181 26123.58427
8.85000 -5060.24519 17.18689 255.17769 194.30732 181.39231 26763.23510
8.95000 -5019.24794 22.06529 106.06197 142.11491 169.90148 27204.47877
9.05000 -4982.14917 17.91110 -293.16657 173.92746 174.45046 21686.77270
9.15000 -4933.28543 19.66502 -136.45369 187.22734 161.31031 22187.11500
9.25000 -4894.65272 20.10015 57.98613 197.85041 191.13573 29832.89924
9.35000 -4864.77719 17.85452 -147.73446 281.48253 185.40390 20874.21934
9.45000 -4823.00751 19.13730 -67.48185 152.18203 164.11014 19955.40723
9.55000 -4781.70232 13.25859 -440.50801 133.51400 165.21591 20418.93299
9.65000 -4740.22332 21.41510 40.50979 159.04470 167.06911 18934.51070
9.75000 -4701.70548 16.23667 -414.59008 326.41343 216.58324 19816.00435
9.85000 -4665.61005 15.57856 495.26241 188.45039 165.61214 19358.71230
9.95000 -4639.11992 15.94485 -429.37915 164.10639 161.89767 18531.86380
10.05000 -4601.30930 16.47098 -131.15081 155.85867 127.85130 16552.33400
10.15000 -4561.02389 8.49332 -194.93793 300.65045 254.62290 17748.87167
10.25000 -4536.84078 14.05469 246.70546 133.24223 137.25984 16079.33289
10.35000 -4495.75522 21.77527 218.38976 272.70103 307.53139 16886.48771
10.45000 -4481.72203 17.85124 478.92341 164.97093 183.58018 18791.88000
10.55000 -4444.44113 15.77416 245.58187 191.18128 168.61609 19276.79189
10.65000 -4415.55249 19.26498 -417.48807 127.16524 154.60000 15735.31978
10.75000 -4380.56663 14.21019 -96.11697 123.79483 127.65621 13889.33410
10.85000 -4350.62261 15.87313 -101.69966 157.40295 161.28722 13150.57361
10.95000 -4313.19043 15.34143 -136.24057 128.19960 142.71893 13422.55141
11.05000 -4278.73576 13.96191 -122.51222 147.80349 151.89565 13879.18222
11.15000 -4254.51879 11.36426 182.91695 200.91648 205.21353 12686.59338
11.25000 -4214.25183 13.66673 -131.49867 164.11568 140.79723 11939.41430
11.35000 -4183.72213 16.71581 -308.32897 135.90488 133.11543 14454.36905
11.45000 -4148.21913 10.08540 -236.51370 168.95548 146.01165 12472.87900
11.55000 -4116.24171 17.53631 3.16549 113.36016 120.78610 12642.86491
11.65000 -4087.13139 11.04682 -210.92668 114.83888 121.31273 12839.01631
11.75000 -4051.66596 13.07115 -42.12210 136.23889 138.06736 11349.80396
11.85000 -4017.84167 17.76888 76.42301 207.58504 182.11244 11843.45523
11.95000 -3993.76994 12.87598 -279.27551 126.02845 120.06777 10261.59219
12.05000 -3961.08954 12.73809 -165.72493 123.79102 151.94449 12544.28707
12.15000 -3923.99403 13.18465 -178.64371 89.25832 105.62091 9792.94056
12.25000 -3895.43180 13.53365 24.00045 127.92317 104.99088 10176.96242
12.35000 -3864.28156 9.82595 -259.94393 122.16570 141.97016 8385.04067
12.45000 -3842.25986 5.80992 145.26342 155.24327 203.36883 12089.58945
12.55000 -3809.76417 9.81976 -431.01010 145.48742 145.48127 10236.02920
12.65000 -3782.83202 14.27228 -61.81103 102.83231 158.42462 8762.27477
12.75000 -3755.32268 6.98800 -313.95776 146.38470 154.66839 10239.95881
12.85000 -3722.69669 12.79138 -421.62875 134.62886 148.06012 10468.39690
12.95000 -3701.29161 6.96476 385.93632 128.05890 162.97884 10094.52029
13.05000 -3672.37528 13.75726 -19.60876 123.58765 100.36098 9118.00195
13.15000 -3646.39390 11.58557 69.23429 94.63673 89.70626 8413.98187
13.25000 -3620.13403 10.42282 -106.55159 134.04250 104.18394 9498.76323
13.35000 -3591.91853 10.46739 -332.33992 141.04268 138.01796 8803.58817
13.45000 -3563.92451 11.89582 80.34538 126.85264 127.26169 9499.65624
13.55000 -3540.19572 11.27545 -45.70839 97.12287 81.39710 7438.39322
13.65000 -3515.47053 9.61803 -516.35212 100.78028 83.16921 9694.02825
13.75000 -3492.68516 7.71254 28.69400 96.93313 112.70642 7030.70581
13.85000 -3468.50346 7.08955 -176.48459 130.00336 196.47360 6282.40960
13.95000 -3446.89319 8.98429 -349.90641 86.42413 94.68775 6215.85883
14.05000 -3422.24328 7.86587 -92.05237 127.43297 92.22686 5201.70617
14.15000 -3398.61291 8.53184 -23.69498 91.00727 77.72319 5471.86398
14.25000 -3374.16613 6.94699 -20.35151 84.58572 104.78360 7035.06327
14.35000 -3350.58488 11.60164 -211.24812 81.29563 67.36250 6443.39857
14.45000 -3319.77306 5.68687 7.72329 118.00152 137.29289 4974.45406
14.55000 -3301.97386 5.80211 -12.14543 68.70604 87.60642 10482.59302
14.65000 -3275.22051 10.84261 -176.89848 124.79891 102.28318 5604.07253
14.75000 -3253.56700 10.41958 -197.99069 102.06794 109.54528 5629.19453
14.85000 -3230.74912 8.14310 -54.61648 75.70550 70.94957 4449.45818
14.95000 -3205.29967 7.60469 -64.65794 68.44564 67.30372 4838.29990
15.05000 -3185.09395 5.79290 175.52192 93.00082 85.42575 4729.23878
15.15000 -3162.20623 9.48180 -8.75179 92.03061 96.71888 6787.99752
15.25000 -3135.07250 7.99163 69.62784 108.83482 70.40864 10741.06174
15.35000 -3112.78041 -2.03919 96.24763 96.41559 355.49174 5384.13520
15.45000 -3091.97070 6.44724 -54.58538 103.30826 73.52895 5076.01014
15.55000 -3067.46229 10.21892 171.57812 179.05605 90.46727 5516.68786
15.65000 -3047.93455 8.20103 -58.41083 66.71998 89.14778 5343.96022
15.75000 -3024.91275 5.52528 -211.09424 102.22960 70.37448 4019.12267
15.85000 -3011.07966 8.06348 -71.29897 79.04495 123.86572 4287.54378
15.95000 -2993.62621 4.11782 228.85282 107.69405 74.18415 6075.76959
16.05000 -2974.05207 2.68406 -38.43226 96.32108 98.04394 4548.19413
16.15000 -2952.25748 6.78026 143.63434 61.61219 70.98944 4174.45940
16.25000 -2932.15078 5.29554 150.06243 63.68304 61.65595 4916.29064
16.35000 -2906.83029 4.68048 -47.50352 87.26058 86.73632 3917.16555
16.45000 -2889.00633 6.31337 -177.43502 47.54672 57.14706 4320.84214
16.55000 -2870.15127 7.57846 -29.31874 99.49710 77.81343 3656.56282
16.65000 -2854.88288 8.89683 104.62922 50.20519 50.30346 4227.50094
16.75000 -2834.08388 7.21180 -5.13328 77.97131 61.30943 3307.53425
16.85000 -2815.75296 4.76407 49.03733 66.15720 57.40501 4322.87336
16.95000 -2802.29071 2.24386 -100.27368 74.89010 102.03339 4529.35833
17.05000 -2780.18854 4.48560 180.97893 61.57399 58.41374 3543.44699
17.15000 -2763.38932 2.93445 -113.89287 76.06104 61.57760 3319.17056
17.25000 -2741.28450 6.27242 -107.01041 59.55184 62.69864 4086.92752
17.35000 -2728.31680 7.59774 71.88797 52.73657 57.52487 3466.90454
17.45000 -2710.37916 6.24376 -24.37083 101.14161 68.31215 2585.78375
17.55000 -2693.41597 4.08858 74.58778 80.12622 89.97238 2753.60241
17.65000 -2671.06056 4.70532 57.73685 96.92063 123.06242 2642.01843
17.75000 -2661.83110 1.23911 -57.82191 71.78035 78.54195 3014.39081
17.85000 -2639.25691 5.32393 28.87579 117.43286 54.31520 2520.05773
17.95000 -2621.84336 -3.56646 7.95530 79.71741 207.26152 2545.64258
18.05000 -2610.15769 5.57192 130.61050 109.84457 82.67368 2680.00121
18.15000 -2594.74348 4.91274 -148.39541 48.51934 54.72741 2962.63445
18.25000 -2578.01781 6.30447 91.41967 68.42611 61.88493 2342.60819
18.35000 -2563.16322 10.26793 -170.03636 127.79135 120.48109 2911.40926
18.45000 -2552.67241 6.75582 18.44942 65.15863 54.21507 2373.02718
18.55000 -2537.51681 8.16321 22.80382 51.63724 69.65802 2176.31937
18.65000 -2519.69144 3.16835 -153.26065 56.11155 64.63785 2517.86499
18.75000 -2505.48273 3.65452 126.83932 40.19532 45.50104 2348.52945
18.85000 -2492.37615 2.97122 96.38000 60.00004 180.29071 2355.94837
18.95000 -2481.58754 5.89505 -253.85378 70.46714 63.36519 2568.91996
19.05000 -2463.64562 2.81238 16.10375 57.25323 82.96686 2046.16615
19.15000 -2446.03027 3.71107 110.19135 65.41614 57.19189 2095.23911
19.25000 -2431.51129 1.47462 63.84649 54.91426 66.06087 2526.15368
19.35000 -2417.46947 7.69699 45.26431 78.70616 47.72063 2022.27094
19.45000 -2403.78417 8.22376 7.44664 37.78426 37.76130 1849.91184
19.55000 -2384.20877 5.18622 37.53543 46.41326 44.30547 1568.08559
19.65000 -2361.74291 2.83122 51.79585 254.09817 73.78227 1687.02689
19.75000 -2359.04538 3.81680 -112.19746 44.56916 42.41585 1859.44495
19.85000 -2347.67223 1.45198 80.55142 60.50491 40.24704 1964.40530
19.95000 -2333.44973 3.46851 -14.97458 40.85660 45.17631 1786.36993
