0.05000 1697.18256
0.15000 2644.11029
0.25000 5284.30065
0.35000 4846.31889
0.45000 5644.03032
0.55000 6123.20491
0.65000 6218.86985
0.75000 6247.02869
0.85000 6341.47661
0.95000 6057.74029
1.05000 6023.59968
1.15000 6036.78312
1.25000 5777.07999
1.35000 5573.84179
1.45000 5476.16917
1.55000 5270.78264
1.65000 5153.64924
1.75000 4913.71056
1.85000 4835.17143
1.95000 4700.82502
2.05000 4565.68831
2.15000 4429.73788
2.25000 4332.22781
2.35000 4106.83852
2.45000 4094.11207
2.55000 3913.77548
2.65000 3857.33069
2.75000 3681.93903
2.85000 3577.06201
2.95000 3453.31532
3.05000 3402.06938
3.15000 3236.36010
3.25000 3239.36094
3.35000 3074.40740
3.45000 3076.24070
3.55000 2935.55570
3.65000 2836.62800
3.75000 2794.59715
3.85000 2721.74001
3.95000 2684.26979
4.05000 2588.40019
4.15000 2536.00885
4.25000 2464.64868
4.35000 2370.76686
4.45000 2292.44840
4.55000 2259.15427
4.65000 2193.47092
4.75000 2147.94184
4.85000 2103.48547
4.95000 2096.78466
5.05000 2033.11953
5.15000 1935.62450
5.25000 1901.02724
5.35000 1880.66174
5.45000 1833.57626
5.55000 1748.27042
5.65000 1752.74019
5.75000 1677.28258
5.85000 1629.41487
5.95000 1626.79222
6.05000 1558.70849
6.15000 1536.36045
6.25000 1440.14340
6.35000 1448.73324
6.45000 1429.34121
6.55000 1353.93742
6.65000 1291.37612
6.75000 1277.97267
6.85000 1275.24355
6.95000 1237.25632
7.05000 1205.13191
7.15000 1187.17702
7.25000 1136.04901
7.35000 1123.31835
7.45000 1083.67102
7.55000 1080.65650
7.65000 1044.59326
7.75000 1017.10828
7.85000 976.71366
7.95000 946.26236
8.05000 967.11598
8.15000 927.93687
8.25000 926.13528
8.35000 880.66018
8.45000 867.80234
8.55000 856.75357
8.65000 849.22106
8.75000 816.34120
8.85000 805.42579
8.95000 782.55895
9.05000 801.84619
9.15000 745.28905
9.25000 748.63879
9.35000 722.00536
9.45000 689.40443
9.55000 688.18832
9.65000 666.47388
9.75000 642.70217
9.85000 622.88279
9.95000 590.31549
10.05000 608.97494
10.15000 600.24353
10.25000 603.81216
10.35000 571.13889
10.45000 539.33548
10.55000 547.33741
10.65000 540.43686
10.75000 516.75546
10.85000 512.40170
10.95000 502.99967
11.05000 497.55874
11.15000 508.98219
11.25000 463.92913
11.35000 480.66849
11.45000 445.09260
11.55000 454.88111
11.65000 430.09236
11.75000 430.77026
11.85000 450.25939
11.95000 439.79762
12.05000 393.62835
12.15000 400.25179
12.25000 392.43607
12.35000 394.82414
12.45000 377.27599
12.55000 367.94661
12.65000 350.74435
12.75000 363.27913
12.85000 347.67567
12.95000 384.54537
13.05000 317.37717
13.15000 316.13636
13.25000 288.61131
13.35000 319.18606
13.45000 311.02824
13.55000 293.77813
13.65000 278.13642
13.75000 293.36422
13.85000 258.86957
13.95000 264.57187
14.05000 259.28779
14.15000 221.77137
14.25000 269.93512
14.35000 253.57879
14.45000 219.23172
14.55000 233.67833
14.65000 221.93351
14.75000 223.70618
14.85000 210.74921
14.95000 203.12675
15.05000 216.49457
15.15000 203.65250
15.25000 186.47897
15.35000 190.53054
15.45000 206.03934
15.55000 200.26846
15.65000 183.35770
15.75000 178.09275
15.85000 194.46715
15.95000 174.95895
16.05000 164.20688
16.15000 161.95645
16.25000 172.60498
16.35000 173.21846
16.45000 177.98598
16.55000 157.84659
16.65000 167.07268
16.75000 147.27210
16.85000 138.08401
16.95000 153.26091
17.05000 133.21625
17.15000 143.74820
17.25000 131.17635
17.35000 130.97941
17.45000 120.39081
17.55000 129.22246
17.65000 149.95423
17.75000 119.04242
17.85000 121.82783
17.95000 126.93340
18.05000 130.86261
18.15000 123.32154
18.25000 119.10023
18.35000 123.75871
18.45000 110.09207
18.55000 116.44816
18.65000 117.22329
18.75000 102.33898
18.85000 102.02296
18.95000 103.96843
19.05000 103.17868
19.15000 295.93662
19.25000 106.89958
19.35000 104.03395
19.45000 93.33151
19.55000 89.96038
19.65000 96.75426
19.75000 88.02856
19.85000 89.21708
19.95000 86.84198
