0.05000 19202.42037
0.15000 23621.32887
0.25000 24105.01395
0.35000 21165.30503
0.45000 19259.55525
0.55000 17850.90194
0.65000 15692.58940
0.75000 14341.02460
0.85000 13135.90934
0.95000 11811.18804
1.05000 10803.95150
1.15000 9735.19813
1.25000 9389.50271
1.35000 8902.34178
1.45000 7991.33568
1.55000 7836.15416
1.65000 7404.54496
1.75000 7044.96310
1.85000 6518.04733
1.95000 6269.62611
2.05000 5965.70754
2.15000 5963.94920
2.25000 5584.18050
2.35000 5269.55966
2.45000 5126.56493
2.55000 4956.10220
2.65000 4737.06123
2.75000 4510.80236
2.85000 4341.95051
2.95000 4236.13634
3.05000 4093.46977
3.15000 4076.74035
3.25000 3875.34389
3.35000 3650.55043
3.45000 3599.36019
3.55000 3445.96187
3.65000 3280.49862
3.75000 3138.16338
3.85000 3134.00633
3.95000 3019.19888
4.05000 2944.45695
4.15000 2890.90215
4.25000 2732.42629
4.35000 2754.10301
4.45000 2668.65556
4.55000 2597.07727
4.65000 2474.32033
4.75000 2432.37497
4.85000 2409.03741
4.95000 2268.13443
5.05000 2224.93664
5.15000 2189.76597
5.25000 2160.87026
5.35000 2070.68729
5.45000 1986.97209
5.55000 2017.47009
5.65000 1904.51463
5.75000 1858.10929
5.85000 1836.88499
5.95000 1790.72071
6.05000 1793.20988
6.15000 1670.22392
6.25000 1674.06065
6.35000 1601.00272
6.45000 1580.02122
6.55000 1505.44314
6.65000 1488.67768
6.75000 1488.59947
6.85000 1424.20115
6.95000 1397.97422
7.05000 1358.16257
7.15000 1346.56042
7.25000 1325.81468
7.35000 1222.43125
7.45000 1242.65340
7.55000 1199.97491
7.65000 1170.97340
7.75000 1142.92595
7.85000 1121.28389
7.95000 1121.75641
8.05000 1089.18385
8.15000 1046.90022
8.25000 1035.47162
8.35000 972.88061
8.45000 990.19672
8.55000 977.64065
8.65000 939.92712
8.75000 905.58568
8.85000 893.62521
8.95000 891.62418
9.05000 850.20678
9.15000 825.99139
9.25000 873.16245
9.35000 823.35687
9.45000 810.58337
9.55000 767.21039
9.65000 757.67461
9.75000 735.50281
9.85000 745.11664
9.95000 718.76438
10.05000 718.88998
10.15000 692.51801
10.25000 664.85793
10.35000 630.36573
10.45000 656.18048
10.55000 629.93422
10.65000 635.92270
10.75000 623.75820
10.85000 600.52258
10.95000 593.59978
11.05000 575.83154
11.15000 560.38651
11.25000 563.95577
11.35000 540.02673
11.45000 529.57167
11.55000 523.57094
11.65000 506.88527
11.75000 510.57081
11.85000 504.03443
11.95000 503.79747
12.05000 511.64436
12.15000 514.80620
12.25000 487.89648
12.35000 472.37824
12.45000 434.74707
12.55000 464.18372
12.65000 443.27917
12.75000 447.22399
12.85000 438.03671
12.95000 415.36791
13.05000 409.32234
13.15000 407.61132
13.25000 401.16025
13.35000 386.94308
13.45000 388.03846
13.55000 376.25113
13.65000 376.43895
13.75000 377.57175
13.85000 356.67066
13.95000 339.91574
14.05000 336.62468
14.15000 333.01237
14.25000 335.97254
14.35000 315.96395
14.45000 315.67995
14.55000 326.07332
14.65000 308.35031
14.75000 296.82416
14.85000 307.12370
14.95000 295.14923
15.05000 302.72568
15.15000 299.28961
15.25000 296.19570
15.35000 266.45040
15.45000 278.91563
15.55000 251.25255
15.65000 254.83762
15.75000 247.82361
15.85000 258.63226
15.95000 247.01491
16.05000 232.60846
16.15000 243.19258
16.25000 230.65991
16.35000 221.82836
16.45000 246.92592
16.55000 201.01651
16.65000 220.63777
16.75000 205.84124
16.85000 206.43667
16.95000 207.55842
17.05000 213.43815
17.15000 205.16610
17.25000 208.24698
17.35000 189.01802
17.45000 223.15607
17.55000 193.31576
17.65000 193.09126
17.75000 190.13168
17.85000 185.42394
17.95000 187.11445
18.05000 188.20700
18.15000 169.30827
18.25000 178.05619
18.35000 196.09687
18.45000 176.44895
18.55000 161.55779
18.65000 178.59569
18.75000 192.67477
18.85000 167.89560
18.95000 169.50747
19.05000 165.84993
19.15000 166.18109
19.25000 164.73278
19.35000 151.43185
19.45000 161.34574
19.55000 159.44481
19.65000 150.68724
19.75000 143.20319
19.85000 142.51998
19.95000 152.27845
