0.125 -0.000 -0.000 -0.000
0.375 0.000 -0.000 -0.000
0.625 -0.000 0.000 0.001
0.875 -0.002 0.001 0.004
1.125 0.001 -0.002 0.004
1.375 0.004 -0.001 0.006
1.625 0.003 0.001 0.008
1.875 0.001 -0.007 0.017
2.125 0.000 0.006 0.024
2.375 0.007 0.007 0.011
2.625 -0.004 -0.004 0.026
2.875 -0.003 0.011 0.035
3.125 0.010 -0.002 0.027
3.375 -0.002 0.012 0.037
3.625 -0.010 -0.012 0.042
3.875 0.003 0.003 0.026
4.125 -0.008 0.012 0.069
4.375 0.017 0.005 0.081
4.625 -0.003 -0.045 0.072
4.875 -0.007 0.018 0.066
5.125 -0.018 -0.010 0.071
5.375 -0.018 0.042 0.066
5.625 -0.029 -0.023 0.107
5.875 -0.005 -0.024 0.103
6.125 0.017 0.017 0.066
6.375 -0.001 0.011 0.066
6.625 -0.027 0.010 0.084
6.875 -0.040 0.014 0.127
7.125 -0.054 0.004 0.057
7.375 -0.016 -0.024 0.090
7.625 -0.024 -0.003 0.074
7.875 0.007 -0.008 0.090
8.125 -0.049 -0.055 0.085
8.375 0.029 -0.090 0.097
8.625 -0.039 -0.003 0.075
8.875 0.004 -0.053 0.071
9.125 0.027 0.039 0.091
9.375 -0.037 0.004 0.101
9.625 -0.029 0.001 0.053
9.875 0.014 0.009 0.063
10.125 0.061 0.011 0.104
10.375 0.054 0.034 -0.012
10.625 -0.002 -0.053 0.095
10.875 0.039 -0.022 0.088
11.125 0.022 0.013 0.030
11.375 -0.029 0.025 0.088
11.625 0.033 0.007 0.023
11.875 -0.028 -0.052 0.047
12.125 0.012 -0.061 0.062
12.375 -0.009 0.077 0.084
12.625 0.000 -0.058 0.129
12.875 -0.038 -0.007 0.072
13.125 0.039 0.008 0.136
13.375 -0.026 -0.022 0.017
13.625 0.041 -0.003 0.068
13.875 0.001 0.036 0.070
14.125 0.065 -0.078 0.047
14.375 -0.069 0.057 0.049
14.625 0.023 0.055 -0.047
14.875 0.054 -0.063 0.013
