0.2 0.41167 14.6876 0.0353 122.87425 120.65729 94.55292
0.6 -0.51552 38.07108 0.45862 124.27106 112.87726 89.15379
1.0 0.83517 57.38796 0.89771 123.50821 102.17323 83.84548
1.4 -0.09163 67.41623 -0.02991 120.07446 93.95311 78.26854
1.8 -0.65046 73.54938 0.57047 114.9813 87.27679 73.13216
2.2 0.38449 77.93927 0.4792 110.18168 82.68746 68.81941
2.6 -1.03937 81.83885 -0.04129 104.6728 78.52911 64.47047
3.0 0.27636 86.18538 -0.66023 99.84403 75.05377 60.35809
3.4 -1.61652 90.58339 -0.67786 93.78223 72.9929 56.40517
3.8 -1.58009 96.05368 -0.6685 87.68059 72.26023 53.82017
4.2 0.02783 104.8371 -0.8725 82.20184 71.60075 50.68944
4.6 0.36933 116.44436 -0.5424 77.65747 71.44212 48.50782
5.0 -0.58934 128.06383 0.30355 72.513 70.11972 46.2993
5.4 -1.11406 144.23015 -0.23206 67.68834 66.03042 43.54243
5.8 -0.5545 155.34083 0.19404 61.52854 60.92136 40.48058
6.2 -1.22906 163.61702 0.03166 56.41256 55.11369 37.36896
6.6 -0.57209 169.91248 -0.80421 50.38514 50.17641 34.18201
7.0 -0.04844 173.74608 -0.98863 46.34383 45.45082 31.86401
7.4 0.24936 176.12815 -0.68458 43.04929 41.67737 29.56715
7.8 -0.08409 180.44956 -0.34861 41.34775 37.27175 27.28704
8.2 0.24099 182.9501 0.21238 39.98001 33.51598 25.54607
8.6 0.60468 186.57404 0.24066 38.9504 30.39136 23.89141
9.0 -0.30552 189.02411 -0.05916 37.34645 27.62835 23.05591
9.4 -0.79551 190.78423 -0.08557 35.33873 26.3847 21.29099
9.8 -0.66448 192.21639 -0.07144 33.36924 25.99273 20.27961
10.2 -0.47796 193.43314 -0.49981 31.51824 25.20197 19.42855
10.6 -0.55374 194.6937 -0.19725 29.96479 24.81758 18.15573
11.0 0.07371 196.3323 0.33781 28.23028 24.95787 17.79752
11.4 0.19638 197.23038 0.52467 27.16027 24.03441 16.9385
11.8 -0.09501 198.57129 1.03436 26.19983 22.05343 16.07092
12.2 0.25539 198.52952 0.78499 25.64503 20.28486 15.60899
12.6 -0.25352 199.16387 0.89006 25.05583 19.48934 15.34554
13.0 -0.3765 198.99767 0.98648 24.26563 18.50992 14.83617
13.4 -0.79295 200.20071 0.62216 23.108 17.00595 14.00729
13.8 -0.59747 200.55547 0.37 22.3299 16.27298 13.73469
14.2 -0.32006 200.88211 0.47726 20.72753 15.23748 13.26968
14.6 -0.31295 200.54397 -0.18393 19.99079 15.22102 12.88918
15.0 1.105 201.13135 -0.19027 18.33511 15.43773 12.43325
15.4 0.44005 202.80404 0.03708 18.18852 16.09727 12.27345
15.8 1.43102 204.61335 -0.14337 16.8917 15.67914 11.62351
16.2 1.81394 206.42697 -0.17353 16.84416 14.46158 11.31985
16.6 2.42711 207.67287 -0.20244 17.02652 12.82505 11.59944
17.0 2.96213 207.49718 -0.07607 16.73736 10.93491 11.3245
17.4 3.44028 205.84871 -0.02096 16.40721 10.03062 11.28491
17.8 2.42091 204.80976 -0.31448 15.3889 9.23486 11.16661
18.2 2.07454 203.52411 -0.39529 15.66463 9.28416 10.98601
18.6 2.19816 202.57879 -0.32621 14.88408 9.30094 10.50708
19.0 1.97133 201.98182 -0.69417 14.58269 10.4381 10.68355
19.4 1.30807 201.58484 0.11757 13.93873 11.04822 10.26431
19.8 0.33107 203.94708 -0.22519 13.17496 10.31998 9.42221
