0.05000 898.51418 1937.58151 4002.56311 0.00000 0.00000 0.00000
0.15000 -160.52540 615.83926 3963.64664 1234.65268 1638.18296 140.94886
0.25000 -348.57183 238.44947 3874.17774 1695.83857 1525.41528 221.78082
0.35000 -568.03696 -70.50253 3824.18353 1406.20139 1615.25817 318.68452
0.45000 -737.89442 283.91239 3744.39536 1374.79356 1628.10998 371.11685
0.55000 -952.90553 -23.47993 3632.01124 1516.35895 1643.48515 512.86129
0.65000 -1366.18792 -197.73478 3426.56213 1512.78250 1662.19398 623.17246
0.75000 -1364.28464 122.39299 3383.80365 1458.52019 1676.54141 783.73506
0.85000 -1564.01362 112.73692 3215.90132 1455.96068 1690.87278 855.92749
0.95000 -1646.80057 4.64182 3030.71690 1490.59077 1787.49038 927.82588
1.05000 -1988.57360 -71.30016 2815.11936 1432.89527 1740.66273 1062.34733
1.15000 -2116.16188 107.85272 2582.91763 1437.41924 1725.64237 1221.83899
1.25000 -2333.69063 109.88750 2247.75155 1438.99613 1741.68115 1407.05703
1.35000 -2426.99652 -74.91165 1964.37528 1429.72450 1686.22090 1699.01009
1.45000 -2744.83876 -76.52330 1541.84466 1314.38480 1680.36103 1903.20646
1.55000 -2913.04191 -43.04214 1327.61382 1266.71598 1544.12467 2071.63767
1.65000 -3020.03849 -63.43053 1249.97333 1207.42696 1418.36748 2183.91094
1.75000 -3123.37540 35.67597 1169.81052 1196.13716 1251.65514 2199.46869
1.85000 -3154.99039 2.82468 1069.36943 1145.29454 1210.91807 2265.59032
1.95000 -3247.50904 1.78387 924.07134 1103.48385 1125.38266 2274.61848
2.05000 -3238.33577 -8.91341 840.17818 1143.01920 1085.70290 2298.95044
2.15000 -3286.50698 26.79106 758.29002 1073.76397 1029.79992 2309.89991
2.25000 -3357.39702 25.06063 791.27496 1079.74119 948.29267 2236.76821
2.35000 -3267.25090 2.50218 599.82544 1142.38326 948.08629 2394.36129
2.45000 -3315.42453 -4.75306 600.43702 1081.36981 901.70038 2379.50462
2.55000 -3256.58446 17.28983 631.86527 1106.72476 837.75046 2432.38900
2.65000 -3333.97173 -31.51210 425.53516 1094.41036 815.93476 2399.68408
2.75000 -3296.89339 -15.33702 486.17356 1066.40761 787.67689 2426.14496
2.85000 -3329.10797 11.21143 267.56612 1047.45296 757.37150 2442.64448
2.95000 -3351.81523 -34.70079 352.58053 1011.24316 721.38725 2418.93630
3.05000 -3324.42830 2.12732 251.66216 1036.70432 691.87573 2447.69962
3.15000 -3299.89170 -15.86126 230.92260 1043.17194 659.93771 2464.86631
3.25000 -3245.16736 -32.32732 282.98543 1045.11319 630.97647 2482.05002
3.35000 -3274.18794 3.91375 251.43870 976.43976 601.54557 2435.63478
3.45000 -3314.87569 25.69907 227.73881 971.85898 578.57196 2330.53713
3.55000 -3253.93840 -14.45690 262.62614 989.13398 563.34997 2356.07692
3.65000 -3257.74970 -4.62839 234.42020 966.68758 534.53768 2328.38774
3.75000 -3240.03301 13.02626 212.89242 951.20618 530.31521 2326.34613
3.85000 -3201.51500 4.42893 278.04996 975.86037 502.48835 2322.93999
3.95000 -3148.92332 0.41103 295.63356 982.07620 481.69200 2350.50486
4.05000 -3188.85757 0.91742 212.33879 913.93715 468.65304 2310.72693
4.15000 -3147.82174 -0.30086 134.31230 964.81850 450.48431 2323.74488
4.25000 -3117.66661 0.79257 268.72874 937.16174 439.53876 2302.81270
4.35000 -3142.92938 -7.65572 217.59151 931.97114 417.58773 2255.02408
4.45000 -3085.12563 -1.88919 130.18455 948.07557 420.55275 2298.72814
4.55000 -3089.78977 -20.45267 9.01442 916.17572 413.30158 2283.11470
4.65000 -3089.64358 -7.95209 84.23868 915.78546 392.94371 2240.44654
4.75000 -3062.13439 12.35356 233.72492 918.07552 382.13473 2216.84855
4.85000 -3058.94067 -14.89612 163.78137 898.70931 364.42638 2201.76425
4.95000 -3022.72250 -3.01528 58.16171 902.65549 360.43605 2234.01090
5.05000 -2977.32778 -16.51728 95.79748 905.43870 355.09052 2258.35767
5.15000 -2990.22724 1.91337 51.76636 871.77173 341.79106 2220.97218
5.25000 -3012.32957 -22.68764 108.80049 867.19974 333.80295 2151.10641
5.35000 -2969.07967 8.05681 89.83264 887.60410 325.32168 2168.24980
5.45000 -2945.28169 7.30536 105.79203 868.54832 316.30522 2171.67306
5.55000 -2922.21221 -1.08166 136.10971 864.80211 309.95214 2157.21733
5.65000 -2923.04972 -6.68418 67.41856 850.99591 303.47334 2139.41553
5.75000 -2887.78734 4.74098 79.50362 857.81139 300.10682 2136.03571
5.85000 -2877.99101 16.74484 97.01812 849.14739 287.32063 2115.14946
5.95000 -2869.85042 -0.34081 133.13941 846.78935 283.58363 2088.94215
6.05000 -2836.29053 3.54848 62.96122 848.61026 278.97680 2108.92273
6.15000 -2832.41989 -1.80285 116.55879 826.11635 271.72397 2083.23395
6.25000 -2857.07914 -2.07207 39.94165 803.22706 266.08031 2036.16537
6.35000 -2770.04595 1.55185 38.43402 851.94685 259.72443 2116.73083
6.45000 -2776.83948 0.94828 38.07826 821.96413 254.53392 2087.09412
6.55000 -2784.71288 -1.24911 100.18900 811.05341 246.95299 2040.32848
6.65000 -2775.61467 1.45999 -4.15256 798.25196 244.46744 2037.48314
6.75000 -2757.78402 4.84150 46.75500 793.81574 243.59838 2019.10127
6.85000 -2725.67047 4.77389 -29.84470 811.25072 235.96405 2035.73124
6.95000 -2735.33370 -0.58594 2.25563 788.24734 230.01452 1987.74129
7.05000 -2738.07212 -3.25158 101.56897 767.26790 224.19236 1950.32594
7.15000 -2679.59096 -3.13366 23.70924 795.95679 221.62833 1988.84928
7.25000 -2692.29783 -0.67830 23.05878 768.71352 218.83004 1955.16346
7.35000 -2672.74419 3.66741 -9.94557 773.24138 214.25086 1953.40956
7.45000 -2687.29629 -3.27085 -28.49537 750.38421 213.15940 1918.55067
7.55000 -2657.78078 -10.67241 -55.57468 768.98402 206.51550 1931.10995
7.65000 -2658.08487 0.43083 -52.11110 746.55015 204.65071 1907.16177
7.75000 -2608.07512 2.46067 -14.96274 769.34805 203.10100 1923.53560
7.85000 -2601.59221 -5.94929 -55.85418 766.93251 196.77272 1909.17130
7.95000 -2586.17106 4.26106 6.44023 743.37451 191.90920 1898.23818
8.05000 -2553.89045 -1.23744 -49.13858 760.75938 191.51064 1911.60529
8.15000 -2531.25959 -2.48675 24.54249 758.87172 184.19727 1905.49176
8.25000 -2547.76346 3.39727 -12.07050 749.24534 187.75835 1863.54853
8.35000 -2551.88255 2.01146 -26.40347 708.85642 179.27973 1850.11874
8.45000 -2521.61668 2.08327 40.44057 737.61944 174.56942 1840.11802
8.55000 -2485.05942 -1.18268 -31.70224 725.52256 174.07436 1872.30876
8.65000 -2494.51002 -2.13769 33.23731 724.01899 169.80782 1824.66457
8.75000 -2472.26840 -1.19543 4.27150 715.47773 166.98416 1827.74904
8.85000 -2476.64292 -4.95583 -55.24432 723.17037 163.10322 1800.26714
8.95000 -2458.73213 -2.23869 76.05626 711.34987 158.04092 1787.20501
9.05000 -2453.80539 -0.84772 -27.85851 692.23472 159.36751 1779.98026
9.15000 -2425.85170 -0.83246 -4.98086 699.50145 156.20291 1781.95199
9.25000 -2417.47460 -3.91895 0.50855 705.36076 157.47967 1765.82362
9.35000 -2381.26102 -0.72917 -79.29668 714.62990 151.66007 1786.59536
9.45000 -2379.80684 -3.95334 -111.87372 685.98602 150.43654 1775.41001
9.55000 -2391.01431 -0.21380 -62.86695 680.69104 148.34700 1733.10812
9.65000 -2381.43168 1.91391 4.60818 683.46281 144.61088 1708.02605
9.75000 -2357.10552 -0.45647 -15.29069 686.47410 142.09913 1716.93113
9.85000 -2339.29650 3.38191 -19.11243 684.38016 142.56654 1711.80907
9.95000 -2319.94919 2.48452 -84.21755 670.44763 142.08081 1720.30504
10.05000 -2309.23584 -6.38602 -12.40545 668.99769 137.29214 1706.14204
10.15000 -2303.47655 -1.59866 -75.55394 667.42782 136.03695 1691.04841
10.25000 -2286.32427 3.25122 -20.31463 665.43776 133.33410 1682.95578
10.35000 -2285.52976 -0.24285 -19.60249 656.36865 131.14444 1662.08468
10.45000 -2260.78675 2.57031 -47.70391 654.05643 131.04937 1670.64116
10.55000 -2254.24893 0.03213 -80.61926 643.40417 129.24274 1655.32494
10.65000 -2238.16310 1.04888 -62.66185 646.85010 126.13412 1654.92763
10.75000 -2203.60052 0.34655 -48.07056 647.10651 124.15309 1667.51009
10.85000 -2200.35246 4.26997 -61.79552 641.74428 124.07183 1651.07380
10.95000 -2229.63313 -0.24092 -48.38670 631.91455 120.35893 1591.53996
11.05000 -2200.13802 2.47078 -82.63867 616.89009 120.31929 1615.83452
11.15000 -2172.49480 3.12503 -71.43922 635.12231 115.82761 1617.59379
11.25000 -2176.04251 1.49606 -46.56574 614.87038 114.98376 1588.89068
11.35000 -2165.66150 1.19491 -60.03173 627.43476 117.26884 1578.24383
11.45000 -2150.97667 -1.68787 -30.58516 615.35034 113.63844 1575.02990
11.55000 -2149.26645 2.60581 -39.36607 607.18542 109.50196 1552.93980
11.65000 -2118.52053 -1.19609 -25.16489 611.31637 108.89329 1571.77911
11.75000 -2142.14498 -0.58652 -32.88566 591.17203 109.06477 1527.44269
11.85000 -2072.98629 2.48862 -37.87915 621.93004 106.45706 1583.40264
11.95000 -2079.64668 -0.60981 -37.52350 605.28832 106.32136 1557.12623
12.05000 -2068.49507 3.34115 -54.93221 612.29304 105.73329 1552.44126
12.15000 -2071.74989 1.14095 -69.71224 594.69589 102.08781 1528.56951
12.25000 -2056.43130 2.71989 -27.90554 597.37792 101.32996 1519.49885
12.35000 -2054.17928 1.14324 -59.89506 584.59192 100.91667 1506.98712
12.45000 -2043.49822 0.58054 -81.13467 591.05577 99.12693 1503.48862
12.55000 -2035.49005 -1.73342 -32.29559 582.20885 98.40740 1492.06073
12.65000 -2021.89122 -2.84371 -55.97702 568.84149 96.93106 1493.83330
12.75000 -2028.01640 -1.82741 -93.34665 580.20940 97.52623 1464.96676
12.85000 -2000.49877 0.35731 -101.51313 573.95477 94.84907 1479.56612
12.95000 -1979.63329 -1.89283 -54.49403 575.21394 92.05115 1479.98716
13.05000 -2007.67446 -0.14465 -51.66688 565.76942 93.18291 1426.16960
13.15000 -1971.17447 -0.22745 -64.65631 559.70230 90.88819 1454.56791
13.25000 -1961.06667 2.77692 -94.75502 570.69910 90.09225 1446.54892
13.35000 -1940.79472 0.92868 -40.18373 566.83214 88.26887 1449.48041
13.45000 -1953.61680 1.77297 -13.67902 557.37176 87.38018 1409.81638
13.55000 -1924.35683 -1.53083 -78.93465 559.54611 87.84329 1432.74391
13.65000 -1934.94139 -0.99919 -104.00471 535.85054 86.50204 1406.05053
13.75000 -1905.53678 1.00836 -60.28060 557.49793 85.84435 1416.76614
13.85000 -1909.41446 1.36485 -93.70504 545.71559 84.84392 1393.73736
13.95000 -1868.72889 1.35240 -45.65972 558.66103 82.82632 1423.46725
14.05000 -1890.11521 -0.00319 -63.49906 529.38904 81.89275 1384.54796
14.15000 -1861.11379 3.68928 -43.39426 536.97900 81.58548 1400.45701
14.25000 -1878.08983 1.57893 -82.94543 533.38172 80.77408 1358.73952
14.35000 -1843.67102 -1.50244 -100.70306 540.03539 79.72691 1386.11263
14.45000 -1846.52896 -1.71448 -32.99735 524.60689 77.82277 1361.22877
14.55000 -1822.85469 0.79529 -60.18330 526.23145 77.37256 1374.34793
14.65000 -1824.48322 1.59741 -10.35849 523.42328 76.17344 1348.14810
14.75000 -1831.02555 0.97781 -40.32290 511.99191 77.46423 1325.21857
14.85000 -1811.94124 0.45903 -20.76398 512.50551 75.31801 1333.03102
14.95000 -1800.42912 -2.39183 -56.91999 511.38984 74.74071 1333.70491
15.05000 -1777.31961 -0.31519 -104.46728 516.74585 74.26659 1342.88031
15.15000 -1785.33432 -1.19829 -32.22805 506.45298 72.45099 1315.87872
15.25000 -1788.73388 -1.40347 -17.97485 501.52361 72.04798 1290.47440
15.35000 -1757.81129 -0.07284 -45.15188 508.05712 72.13811 1310.53684
15.45000 -1765.61530 -0.75526 -72.86599 506.94165 70.26901 1285.21961
15.55000 -1748.33905 0.99477 -37.59238 505.29077 71.08001 1293.37044
15.65000 -1756.62835 0.14586 -53.66345 498.26399 69.69019 1265.61913
15.75000 -1739.50558 1.82597 -79.43081 494.70453 69.21898 1270.27728
15.85000 -1729.62739 -1.58788 -75.38802 492.25576 68.97360 1270.03920
15.95000 -1723.63283 -1.06457 -6.08256 495.71573 69.58095 1256.85627
16.05000 -1706.26919 1.03227 -85.98602 486.70148 66.38616 1270.33345
16.15000 -1713.88283 1.33534 -24.00258 487.95342 66.76812 1235.92429
16.25000 -1701.87504 0.58583 -72.89133 488.86704 65.93416 1240.36127
16.35000 -1688.28073 -1.05837 -110.07565 486.00105 65.58902 1243.61710
16.45000 -1681.37935 0.32542 -28.31938 478.41957 65.57993 1233.23975
16.55000 -1674.52475 -0.39820 -67.49570 470.45138 63.61523 1233.46419
16.65000 -1672.03002 0.55903 -65.47741 468.72017 63.84804 1219.64198
16.75000 -1654.21645 -0.32228 -48.36623 471.53025 62.21580 1224.00255
16.85000 -1656.74189 0.31291 -55.58023 460.61613 62.25616 1205.67911
16.95000 -1650.58323 0.55767 -34.03072 466.20470 60.69335 1197.11804
17.05000 -1620.78878 1.28277 -31.04215 467.92798 60.79516 1219.26266
17.15000 -1624.15482 -3.34818 -106.67816 463.51331 59.84366 1206.33258
17.25000 -1628.10147 2.22940 -29.94796 457.15068 58.68136 1181.56092
17.35000 -1614.23958 0.30823 -72.64892 460.44447 59.32171 1183.32140
17.45000 -1605.19135 0.05186 -12.92498 453.24145 57.15392 1182.36715
17.55000 -1591.68452 1.06247 -12.75956 460.60890 56.47430 1179.38412
17.65000 -1590.23267 1.49751 -9.04714 455.10949 57.03142 1167.66802
17.75000 -1580.65902 0.36255 -48.86512 454.13955 57.68173 1168.99919
17.85000 -1590.63128 0.73295 -24.96950 444.88943 55.75526 1140.83090
17.95000 -1574.83315 0.21776 -27.55550 445.37028 56.12817 1145.87480
18.05000 -1566.36983 -0.49770 -14.64609 443.71989 54.63600 1141.60613
18.15000 -1553.10125 0.02096 -65.45864 453.87370 55.84643 1145.16523
18.25000 -1552.72121 0.13355 -54.29877 442.10634 54.64618 1134.16957
18.35000 -1544.46144 0.44644 8.91351 433.43745 53.01939 1128.27600
18.45000 -1526.09718 -0.96995 -78.24472 451.45100 53.85389 1139.01001
18.55000 -1545.70081 1.52145 -68.92877 428.22811 53.20534 1104.68769
18.65000 -1519.84244 0.37982 -38.05417 438.37781 52.57494 1120.58826
18.75000 -1513.56322 0.40957 -31.56933 440.50023 52.07732 1110.91201
18.85000 -1501.66136 -0.48583 -78.57885 430.09943 51.71209 1122.29318
18.95000 -1516.06415 1.06386 -12.96496 428.75117 51.23950 1085.10889
19.05000 -1489.59825 0.07930 -23.00513 428.97639 50.31286 1107.34390
19.15000 -1486.20262 0.95211 -25.20182 432.17978 49.90526 1095.65495
19.25000 -1480.85418 1.15150 -13.50776 432.83062 48.96568 1087.63447
19.35000 -1471.02251 -0.04569 -44.86580 422.44389 50.07724 1091.44831
19.45000 -1468.91147 0.04509 -41.16941 419.55872 49.07959 1081.83770
19.55000 -1471.14552 0.54206 -26.15543 416.29095 48.18376 1066.08227
19.65000 -1444.11032 -0.57863 -28.73871 420.27770 48.51305 1086.97285
19.75000 -1442.93700 -0.75759 -19.69808 421.48107 48.20392 1073.76329
19.85000 -1447.21346 -0.22452 -58.39164 419.65909 46.38305 1057.29878
19.95000 -1430.10797 2.36847 -35.36080 408.79511 47.13001 1067.82625
