0.12500 0.02123
0.37500 0.03217
0.62500 0.08017
0.87500 0.12387
1.12500 0.18306
1.37500 0.22026
1.62500 0.27649
1.87500 0.29891
2.12500 0.35184
2.37500 0.38505
2.62500 0.42516
2.87500 0.44310
3.12500 0.45948
3.37500 0.48284
3.62500 0.49843
3.87500 0.50570
4.12500 0.49837
4.37500 0.50295
4.62500 0.48508
4.87500 0.46290
5.12500 0.44116
5.37500 0.41201
5.62500 0.36855
5.87500 0.32763
6.12500 0.29393
6.37500 0.23962
6.62500 0.22166
6.87500 0.19427
7.12500 0.16356
7.37500 0.13661
7.62500 0.14682
7.87500 0.15376
8.12500 0.16560
8.37500 0.16786
8.62500 0.15857
8.87500 0.16745
9.12500 0.14581
9.37500 0.12571
9.62500 0.11035
9.87500 0.09770
10.12500 0.06797
10.37500 0.06105
10.62500 0.04189
10.87500 0.04693
11.12500 0.05193
11.37500 0.06122
11.62500 0.03782
11.87500 0.04811
12.12500 0.06089
12.37500 0.06174
12.62500 0.06215
12.87500 0.05449
13.12500 0.04972
13.37500 0.06721
13.62500 0.04077
13.87500 0.06744
14.12500 0.05864
14.37500 0.08754
14.62500 0.07731
14.87500 0.08703
