0.120000 -0.458790
0.380000 -0.127140
0.620000 -0.152300
0.880000 -0.302450
1.120000 -0.259110
1.380000 -0.185250
1.620000 -0.198270
1.880000 -0.232320
2.120000 -0.169850
2.380000 -0.204740
2.620000 -0.214820
2.880000 -0.203280
3.120000 -0.219770
3.380000 -0.233680
3.620000 -0.213540
3.880000 -0.223650
4.120000 -0.234660
4.380000 -0.233870
4.620000 -0.213080
4.880000 -0.216570
5.120000 -0.225950
5.380000 -0.207450
5.620000 -0.197860
5.880000 -0.210850
6.120000 -0.165100
6.380000 -0.215440
6.620000 -0.211700
6.880000 -0.175930
7.120000 -0.187400
7.380000 -0.128630
7.620000 -0.140870
7.880000 -0.084060
8.120000 -0.007760
8.380000 0.048500
8.620000 0.021760
8.880000 0.018900
9.120000 0.064200
9.380000 0.064630
9.620000 0.054800
9.880000 -0.051680
10.120000 -0.095480
10.380000 -0.039010
10.620000 -0.192780
10.880000 -0.568260
11.120000 -0.349230
11.380000 -0.725350
11.620000 -0.983060
11.880000 -0.660060
12.120000 -1.377620
12.380000 -0.517620
12.620000 -0.918020
12.880000 -1.324640
13.120000 -0.580030
13.380000 -1.043430
13.620000 -0.564950
13.880000 -0.712980
14.120000 -0.647800
14.380000 -0.954140
14.620000 -0.663540
14.880000 -0.812650
15.120000 0.168370
15.380000 -0.989110
15.620000 0.020350
15.880000 -0.514910
16.120000 -0.460730
16.380000 -0.255970
16.620000 -0.839230
16.880000 -0.686710
17.120000 -0.713760
17.380000 -0.894010
17.620000 -1.164470
17.880000 -0.588610
18.120000 -0.209260
18.380000 -0.984010
18.620000 -0.814680
18.880000 -1.386000
19.120000 -1.392460
19.380000 -1.497390
19.620000 -1.647740
19.880000 -1.810340
