0.05000 807.56879
0.15000 1254.00068
0.25000 2134.67343
0.35000 3054.08981
0.45000 3587.21161
0.55000 4017.57390
0.65000 4332.85218
0.75000 4515.32352
0.85000 4799.04622
0.95000 4852.22458
1.05000 4952.27641
1.15000 5004.33521
1.25000 4909.61892
1.35000 4928.65676
1.45000 4844.48992
1.55000 4764.31678
1.65000 4669.80792
1.75000 4639.76479
1.85000 4509.68629
1.95000 4465.66558
2.05000 4354.57759
2.15000 4233.45894
2.25000 4179.75641
2.35000 4060.38974
2.45000 3971.00393
2.55000 3870.95362
2.65000 3776.97372
2.75000 3701.06893
2.85000 3595.40695
2.95000 3494.38383
3.05000 3456.93612
3.15000 3378.22067
3.25000 3322.40810
3.35000 3265.71548
3.45000 3166.39892
3.55000 3093.83198
3.65000 3080.44191
3.75000 2948.42580
3.85000 2884.29635
3.95000 2833.47011
4.05000 2730.18003
4.15000 2723.09121
4.25000 2632.67991
4.35000 2540.21764
4.45000 2519.62555
4.55000 2464.15241
4.65000 2371.43467
4.75000 2353.69893
4.85000 2239.79998
4.95000 2230.64495
5.05000 2144.43673
5.15000 2120.84037
5.25000 2068.78583
5.35000 2013.15983
5.45000 1996.27541
5.55000 1908.71487
5.65000 1865.74969
5.75000 1833.27661
5.85000 1788.77822
5.95000 1747.31721
6.05000 1695.30040
6.15000 1650.19997
6.25000 1606.02538
6.35000 1574.94733
6.45000 1545.12084
6.55000 1492.30183
6.65000 1465.96084
6.75000 1447.19512
6.85000 1386.98347
6.95000 1375.69282
7.05000 1338.54072
7.15000 1326.54324
7.25000 1278.69935
7.35000 1257.23487
7.45000 1204.82844
7.55000 1195.88500
7.65000 1179.38727
7.75000 1119.62871
7.85000 1114.48073
7.95000 1099.30097
8.05000 1073.03154
8.15000 1045.68982
8.25000 1035.59168
8.35000 1007.67248
8.45000 996.34620
8.55000 964.81450
8.65000 947.58532
8.75000 928.94434
8.85000 909.13804
8.95000 890.09923
9.05000 860.35745
9.15000 859.02348
9.25000 827.13811
9.35000 815.09062
9.45000 801.92260
9.55000 774.87858
9.65000 768.84535
9.75000 746.55954
9.85000 735.46424
9.95000 720.38891
10.05000 692.74114
10.15000 700.25668
10.25000 678.03044
10.35000 681.08198
10.45000 646.38990
10.55000 635.90849
10.65000 621.82036
10.75000 604.27770
10.85000 609.77091
10.95000 577.85900
11.05000 576.91232
11.15000 556.35689
11.25000 545.62311
11.35000 529.36806
11.45000 528.25555
11.55000 517.77389
11.65000 505.84030
11.75000 487.14513
11.85000 488.54772
11.95000 476.39042
12.05000 471.58516
12.15000 463.37683
12.25000 453.51970
12.35000 434.92998
12.45000 434.58277
12.55000 420.30280
12.65000 422.01882
12.75000 397.32689
12.85000 392.28262
12.95000 394.15636
13.05000 384.30332
13.15000 371.30970
13.25000 363.39129
13.35000 367.06800
13.45000 344.92042
13.55000 358.79707
13.65000 344.72450
13.75000 332.16458
13.85000 334.69354
13.95000 332.63684
14.05000 329.14771
14.15000 309.74877
14.25000 311.31016
14.35000 296.55273
14.45000 299.07059
14.55000 282.64384
14.65000 283.75537
14.75000 277.14996
14.85000 271.99722
14.95000 267.42419
15.05000 264.16582
15.15000 258.95797
15.25000 265.98646
15.35000 252.82154
15.45000 238.80484
15.55000 242.22530
15.65000 241.65173
15.75000 233.94130
15.85000 225.65057
15.95000 226.71242
16.05000 216.54384
16.15000 218.56909
16.25000 217.72218
16.35000 211.08084
16.45000 201.37317
16.55000 203.37864
16.65000 201.19037
16.75000 196.10177
16.85000 183.42259
16.95000 193.65251
17.05000 183.10637
17.15000 181.16549
17.25000 176.92496
17.35000 181.98996
17.45000 174.45979
17.55000 172.98189
17.65000 161.11410
17.75000 159.70461
17.85000 163.45743
17.95000 156.46290
18.05000 158.41589
18.15000 158.35551
18.25000 151.48002
18.35000 147.61158
18.45000 148.54261
18.55000 140.13486
18.65000 149.49555
18.75000 138.04166
18.85000 134.54788
18.95000 128.90364
19.05000 133.05712
19.15000 132.87598
19.25000 128.97429
19.35000 126.00339
19.45000 131.71112
19.55000 117.90300
19.65000 125.96875
19.75000 121.21635
19.85000 118.46769
19.95000 119.29685
