0.2 2.21191 16.8716 -1.12096 70.13455 72.02026 67.60611
0.6 -0.71294 40.75007 0.8924 67.03461 67.22301 65.57112
1.0 -0.12434 62.1458 0.3032 64.67263 64.48068 61.76904
1.4 -0.50549 82.84236 0.41318 61.18078 60.70992 58.75839
1.8 -0.04597 99.13694 1.02993 58.27816 57.56369 55.70487
2.2 0.38882 112.59559 0.94566 55.63141 54.93561 53.11989
2.6 0.08077 124.51837 0.09778 52.80956 51.88705 50.50121
3.0 0.27778 134.27811 0.54403 50.98077 49.19685 48.56485
3.4 0.47374 144.39789 0.23443 48.50083 46.05633 45.81557
3.8 0.49274 152.71905 0.19624 46.78227 42.84091 43.32977
4.2 0.30487 159.83845 0.98435 44.48341 40.40137 41.2015
4.6 0.19731 166.54348 0.38185 43.24729 38.61517 39.32055
5.0 -0.30762 172.51123 0.64227 41.12792 36.52932 37.56382
5.4 0.62959 177.11449 0.7633 40.14518 34.41018 35.67656
5.8 0.21991 181.20448 0.22321 38.51042 32.52168 33.85933
6.2 0.00393 184.7062 -0.33313 37.55541 30.74638 32.72856
6.6 -0.25058 188.3193 -0.68752 36.12477 29.65935 31.23546
7.0 -0.31593 191.41216 -1.15218 34.33744 28.63414 29.86027
7.4 0.16828 194.42188 -1.49561 33.05549 27.34056 28.45757
7.8 0.46211 196.89283 -1.29984 31.96416 25.94721 27.21882
8.2 0.71118 198.853 -1.19117 31.12196 24.71945 25.91683
8.6 1.05421 199.88979 -1.22557 30.12795 23.44731 24.80691
9.0 0.44475 201.41351 -1.18395 28.75712 23.27134 23.76333
9.4 0.40406 203.10184 -0.86751 28.1994 22.2959 22.74069
9.8 0.65533 204.48211 -0.77907 26.92901 21.01676 21.58712
10.2 0.19405 205.18264 -0.61243 25.84866 20.37764 21.00259
10.6 0.37757 206.58212 -0.38547 24.90719 19.24728 20.32216
11.0 0.50488 207.85947 -0.45752 23.90494 18.69586 19.33048
11.4 0.29307 208.63848 -0.11812 23.11197 18.03608 18.46536
11.8 0.07609 208.70891 -0.12149 22.24212 17.35606 17.80408
12.2 0.15663 209.36574 -0.17597 21.42524 16.73123 17.1333
12.6 0.11653 210.08155 0.24246 20.72788 16.06934 16.42564
13.0 -0.01182 210.12077 0.6902 19.83143 14.97132 15.68546
13.4 -0.73115 209.51917 0.64877 19.67444 14.15936 15.05208
13.8 -0.68476 209.5078 1.07402 18.88673 13.8572 14.51328
14.2 -1.30304 210.39491 0.79012 18.25955 14.23046 14.28711
14.6 -0.57292 210.97595 0.52628 17.09872 13.57166 13.25642
15.0 0.08316 211.2803 0.12094 16.18492 11.91352 12.66995
15.4 0.27555 210.16055 0.0907 15.97422 11.3289 12.30815
15.8 0.17591 209.97694 -0.38111 15.93419 11.66772 12.09839
16.2 0.2643 210.6174 -0.57295 14.99982 12.11885 11.43119
16.6 0.92321 211.13758 -0.85524 14.69094 11.91171 10.85747
17.0 0.75234 211.41516 -0.46455 14.01378 10.85695 10.62137
17.4 1.22405 210.94399 -0.81976 13.53407 9.91677 10.19338
17.8 -0.06145 209.86695 -0.43773 13.51917 9.91248 9.6565
18.2 -0.69985 209.13835 -0.07255 13.65867 9.55794 9.76337
18.6 -1.6365 209.11195 0.16707 12.71832 9.3772 9.68018
19.0 -0.77522 209.66016 0.68739 12.40062 9.34695 9.25068
19.4 0.23052 210.4209 1.08174 11.44595 8.49712 8.28445
19.8 2.17674 210.32738 1.43287 10.88621 8.66503 8.01861
