0.05000 -752.54572 66.66122 -472.74169 817.20591 908.32546 1052.68529
0.15000 -1670.15070 29.40183 -801.85976 1031.30061 892.28635 2697.93082
0.25000 -2724.03691 42.99767 -398.01738 1120.49805 905.47980 3573.73016
0.35000 -3443.56245 93.28994 -382.60084 1192.24524 908.62425 4569.78233
0.45000 -4123.21606 84.10123 -212.39956 1358.53905 943.69808 5304.22986
0.55000 -4664.83762 79.45980 -188.39253 1403.60667 985.30857 5960.97932
0.65000 -5095.21846 113.46166 -145.03712 1498.48509 1002.57781 6261.65192
0.75000 -5523.15444 81.93056 128.99699 1561.67630 1000.58730 6402.57234
0.85000 -5741.90145 82.15369 -212.86201 1686.32546 1025.11545 6680.12863
0.95000 -6049.12430 52.75945 197.82206 1683.38391 1073.76527 6704.63264
1.05000 -6335.22637 77.34314 156.67573 1665.32704 1097.04115 6633.70013
1.15000 -6427.60556 92.97109 183.78731 1671.38731 1135.41650 6562.33272
1.25000 -6495.59073 94.17265 113.31509 1695.04683 1151.86032 6558.11747
1.35000 -6683.57781 84.40753 114.29127 1650.45406 1197.10287 6416.17344
1.45000 -6742.96489 81.63857 75.49791 1563.38856 1222.65032 6225.11705
1.55000 -6808.94815 65.14545 -101.25291 1527.39323 1247.35672 6144.13696
1.65000 -6887.13677 95.15884 -153.89728 1464.15910 1267.53316 5998.66450
1.75000 -6935.57654 72.02272 50.17243 1424.55275 1261.02093 5842.79592
1.85000 -7010.95866 81.10780 31.42665 1318.67252 1274.74780 5657.58275
1.95000 -7012.97839 121.58936 41.07101 1273.53631 1279.84419 5502.90477
2.05000 -7082.91722 84.75805 35.67552 1177.53817 1279.20939 5310.30555
2.15000 -7061.72182 111.51094 -50.48019 1171.20637 1268.14690 5277.97168
2.25000 -7078.62668 74.58705 22.13936 1107.69675 1281.44970 5157.96042
2.35000 -7098.82195 89.54743 28.06736 1045.79789 1267.51708 4997.62439
2.45000 -7083.44758 64.55640 -59.05211 1022.69172 1253.03259 4913.23548
2.55000 -7144.77762 46.97824 48.70341 918.43419 1246.01601 4667.70145
2.65000 -7124.24657 50.74292 73.77157 908.46156 1227.57401 4614.33812
2.75000 -7118.65288 53.30887 155.36713 816.01385 1212.87889 4472.57017
2.85000 -7091.59222 62.90613 86.07575 767.02949 1185.28605 4376.42187
2.95000 -7077.17575 61.05723 -11.94935 735.32959 1164.81758 4255.25908
3.05000 -7025.00549 61.84895 13.83735 707.04261 1127.82547 4155.21566
3.15000 -7000.06872 43.36076 23.47803 688.59020 1112.76933 4059.44686
3.25000 -7001.81097 65.26973 35.95262 645.49127 1078.39049 3960.85034
3.35000 -6991.91157 60.08222 -60.86594 616.09194 1053.86320 3873.42924
3.45000 -6970.01167 56.35651 40.95136 638.78503 1015.99303 3807.83257
3.55000 -6952.80746 51.24074 24.13766 597.82666 986.02836 3693.49106
3.65000 -6971.35951 54.18856 82.45705 597.04041 960.89413 3542.26890
3.75000 -6942.86214 40.80694 49.55160 601.19442 919.90983 3506.81451
3.85000 -6931.66084 60.40450 78.66128 573.86937 887.81056 3380.28030
3.95000 -6906.38363 32.86529 60.24212 589.46636 852.32924 3346.60832
4.05000 -6893.53438 61.28300 34.45650 585.16318 817.01611 3233.19819
4.15000 -6853.77992 58.24563 -30.34078 584.63509 785.56583 3180.71131
4.25000 -6818.06026 74.98365 7.61001 563.60622 746.82909 3048.52042
4.35000 -6779.57209 46.75068 13.20836 562.65157 722.94709 3004.69248
4.45000 -6759.35601 63.29224 2.54751 559.90372 692.62858 2882.27663
4.55000 -6738.44036 60.85537 52.88041 573.75413 660.22508 2821.72954
4.65000 -6686.72409 65.85528 37.77459 597.93999 622.55007 2779.07805
4.75000 -6665.68277 71.11488 -17.51813 563.61938 604.86746 2697.09896
4.85000 -6611.25470 65.87916 -29.81625 572.60409 572.67115 2640.85898
4.95000 -6577.81081 65.57058 12.91199 569.84870 549.27354 2584.43560
5.05000 -6553.79299 80.51259 -11.62389 577.56995 531.24206 2480.07902
5.15000 -6533.06180 76.85505 8.55034 573.46529 500.79841 2444.21773
5.25000 -6485.03681 73.47897 -9.56064 561.40033 472.16173 2368.25543
5.35000 -6436.98446 75.36641 37.62550 551.98010 452.05109 2349.44505
5.45000 -6400.90685 72.09792 26.62168 545.88374 424.28840 2277.18469
5.55000 -6360.87837 66.39427 28.37695 539.83499 407.28271 2223.35754
5.65000 -6322.32431 73.15197 15.15066 528.23282 385.21556 2153.71664
5.75000 -6278.12225 74.40681 -7.62952 512.29425 364.86751 2118.93182
5.85000 -6249.02178 71.60421 3.78600 503.47446 346.07782 2034.76273
5.95000 -6174.66367 70.68380 23.08774 475.16877 325.70575 2008.49112
6.05000 -6134.10526 65.22802 50.07152 465.36011 312.47324 1950.60746
6.15000 -6079.46667 63.61051 -0.54694 439.61806 296.63662 1920.20755
6.25000 -6037.02304 62.23920 -26.14881 417.82091 283.61110 1858.01508
6.35000 -5994.24478 61.30012 -1.50852 399.34624 271.87484 1820.98990
6.45000 -5944.14421 61.91013 -24.99187 378.03618 259.12116 1778.07532
6.55000 -5897.05613 62.94466 -1.71496 357.07488 247.12187 1744.33278
6.65000 -5848.49488 50.68854 37.90959 347.97506 239.27386 1689.10832
6.75000 -5809.12754 58.13147 -14.61619 323.48357 232.72400 1649.73162
6.85000 -5781.78927 48.71576 -19.78922 329.25121 226.35624 1614.78544
6.95000 -5742.76568 55.75869 8.34465 319.72291 218.99454 1595.15342
7.05000 -5709.10379 53.86209 -64.37491 301.74575 209.97096 1540.44227
7.15000 -5667.67324 48.68639 -27.05043 292.66067 204.59128 1516.85522
7.25000 -5626.77218 43.83541 -45.52975 286.11984 193.10024 1485.44490
7.35000 -5586.79903 46.39569 -37.65118 273.43304 188.10897 1438.40725
7.45000 -5539.40425 47.05195 -50.01188 270.85597 176.01796 1432.42873
7.55000 -5495.72352 49.97313 -50.76023 256.82395 180.01809 1385.96773
7.65000 -5452.36816 46.72134 -50.23344 254.79806 168.25259 1392.51674
7.75000 -5418.89132 46.54251 -45.75199 244.51440 166.99268 1335.96935
7.85000 -5385.61664 42.30572 -44.05987 233.51523 167.23442 1296.48951
7.95000 -5350.20762 42.36072 -40.98430 228.37775 158.07844 1253.16648
8.05000 -5304.33630 43.11241 -43.05946 233.98072 158.29940 1255.29564
8.15000 -5260.49815 40.62844 -49.57525 231.84588 149.39088 1235.63223
8.25000 -5225.84683 41.09861 -35.01735 214.06173 154.40718 1200.84165
8.35000 -5187.21403 39.89951 -26.22836 217.43157 141.40008 1181.15142
8.45000 -5138.06609 37.33641 -27.17585 201.83892 142.87889 1162.45387
8.55000 -5101.85757 41.93962 -47.12807 195.39841 136.84634 1118.89275
8.65000 -5062.44457 35.43653 -16.53344 196.81277 135.80742 1103.61007
8.75000 -5028.09991 38.50186 -23.12356 203.06829 129.98722 1063.37276
8.85000 -4988.43269 32.97887 -17.79623 191.81920 133.83792 1066.24320
8.95000 -4959.91116 34.62081 -39.30852 182.38436 128.72564 1032.73613
9.05000 -4918.60056 33.69040 -40.90938 177.76890 120.01013 1009.54354
9.15000 -4879.90106 29.64559 -8.30331 171.21245 122.44636 987.47485
9.25000 -4835.34024 31.71938 -21.89104 168.93507 120.54832 972.32471
9.35000 -4799.46801 31.77960 -41.48027 160.71842 119.36987 949.21817
9.45000 -4760.86307 30.81879 -32.37604 161.79966 114.80153 927.81919
9.55000 -4714.24447 32.55086 -30.42147 164.91084 109.80191 940.19037
9.65000 -4684.80925 32.79608 -38.43737 153.74404 113.24458 890.12966
9.75000 -4645.60970 30.52311 -3.58998 148.69104 110.78681 876.11238
9.85000 -4611.31028 27.78663 0.83260 144.36147 106.53182 853.34469
9.95000 -4577.84939 31.56760 -30.10527 142.83905 108.87402 842.23718
10.05000 -4541.32753 30.67959 -11.56563 144.83524 105.73448 832.29736
10.15000 -4505.59706 30.88165 1.18077 137.37487 102.29973 814.22438
10.25000 -4469.84165 26.99066 -4.30008 135.32950 101.18796 784.61290
10.35000 -4433.29148 28.22420 -21.31123 145.06080 100.64252 784.84951
10.45000 -4399.13528 28.58524 -20.44278 138.65429 99.71559 772.42139
10.55000 -4378.28659 30.09536 19.20114 132.88271 96.96167 740.07914
10.65000 -4338.59690 28.53660 -23.90270 132.92455 92.71838 722.14220
10.75000 -4306.33868 26.64069 1.71651 130.63405 91.53292 712.22035
10.85000 -4269.98120 25.60937 -8.91097 128.54773 95.43383 702.94108
10.95000 -4242.38445 28.12785 -17.38292 128.15516 92.29148 686.05040
11.05000 -4213.60023 26.91859 12.83444 125.53519 91.45329 666.65212
11.15000 -4184.26490 25.47894 -0.16761 123.54266 91.89141 656.43010
11.25000 -4151.82734 23.73285 -23.24270 125.56021 88.42463 653.66867
11.35000 -4122.25711 25.84736 -0.88018 120.40784 90.67206 633.03858
11.45000 -4094.66054 23.99101 -5.84403 123.32321 93.06215 624.64424
11.55000 -4062.22878 23.15316 -4.26155 121.14127 85.01925 628.09691
11.65000 -4034.64232 22.72076 -21.16560 118.41135 90.91815 604.17748
11.75000 -4001.87679 24.75731 -29.28066 113.30049 84.53362 592.22533
11.85000 -3974.85894 24.57706 -4.63332 114.84681 78.47080 571.84268
11.95000 -3942.01272 22.24410 -6.39623 107.98624 88.78833 575.31006
12.05000 -3911.39980 22.86278 -13.02702 109.43434 85.98054 547.25432
12.15000 -3886.84192 22.83601 -30.51612 105.31241 78.80306 541.55798
12.25000 -3857.02141 21.26338 2.08003 107.04173 82.28471 538.42002
12.35000 -3828.60015 21.83582 -18.82645 109.26935 76.75817 522.22034
12.45000 -3795.72772 21.44721 3.47352 106.05737 76.02816 519.65620
12.55000 -3771.48176 20.23510 -36.08430 99.71992 73.42391 508.95765
12.65000 -3747.91699 16.76419 -21.66338 98.73453 73.31727 492.42188
12.75000 -3715.61789 19.14957 -19.20038 96.30939 72.67465 491.22029
12.85000 -3687.18407 18.82616 2.90629 97.71563 70.38883 471.80236
12.95000 -3660.79988 18.65315 -28.44727 94.35493 66.79269 473.87691
13.05000 -3631.57212 20.86511 -14.20110 94.76427 69.32472 462.10947
13.15000 -3603.88358 18.59589 -22.54040 95.23432 73.83554 450.57089
13.25000 -3577.60321 17.38928 -9.31935 89.07959 64.26588 440.78800
13.35000 -3550.55428 20.10143 -12.57993 93.06090 68.88076 435.76987
13.45000 -3525.03037 18.46368 -21.56820 90.68041 63.19401 439.66416
13.55000 -3504.04543 20.38778 -33.89685 84.52556 66.59296 411.00307
13.65000 -3478.61114 17.93291 -25.22367 88.58620 63.94684 408.75243
13.75000 -3459.21519 14.98111 -1.75002 80.65089 65.98205 400.97847
13.85000 -3428.27751 18.22387 -13.97720 77.88908 58.26498 400.50222
13.95000 -3405.94328 15.84426 -27.47448 79.57858 70.31388 388.74289
14.05000 -3380.72521 14.51798 -14.18086 83.69251 71.19687 392.50457
14.15000 -3354.62793 18.70669 -42.69212 77.99597 63.14278 378.79016
14.25000 -3330.72665 14.65416 -3.54999 84.62236 53.60796 381.18786
14.35000 -3310.18020 14.02151 0.20430 73.83438 75.91819 366.31448
14.45000 -3289.60587 14.10409 -2.67593 66.85382 55.82158 356.72886
14.55000 -3263.45210 17.85766 -9.11899 73.51441 59.91056 360.06829
14.65000 -3243.28668 17.14078 -4.12185 70.86597 60.86128 350.64707
14.75000 -3222.31491 15.68505 -18.29718 74.66421 56.51534 339.38252
14.85000 -3202.62887 14.93703 -3.88761 66.83024 53.84241 333.86399
14.95000 -3182.62532 16.46312 -8.54891 73.67817 59.22318 324.97242
15.05000 -3160.88129 13.71344 -5.52948 75.11832 61.58835 325.17549
15.15000 -3141.96690 16.57351 -8.45146 72.45071 61.84474 323.57217
15.25000 -3122.90831 15.89810 -7.66825 69.89127 59.66049 319.13517
15.35000 -3104.13875 15.38592 -9.50348 64.56591 52.40998 302.39660
15.45000 -3084.30661 10.76608 -0.84763 70.53666 51.69287 298.76627
15.55000 -3060.88131 14.51353 9.75980 65.87235 56.71538 300.04972
15.65000 -3040.32239 13.01730 -6.62569 61.32794 53.79749 293.61767
15.75000 -3027.24271 10.57059 3.57165 63.56327 58.91549 277.90855
15.85000 -3002.29580 14.59552 14.53516 63.79343 62.19575 285.39439
15.95000 -2987.78781 14.81839 1.42681 66.84781 58.26863 273.64838
16.05000 -2967.94094 12.55521 -10.24233 68.03725 55.38778 275.19340
16.15000 -2950.90769 14.00394 1.12317 61.90982 49.52818 266.17894
16.25000 -2930.72779 10.56399 -10.63971 57.16645 48.83337 260.98675
16.35000 -2913.44726 12.77895 -17.51405 45.97749 49.75329 257.03995
16.45000 -2895.59847 10.38190 -8.73783 54.89936 57.94647 249.06352
16.55000 -2877.37322 11.45317 -6.77466 59.47200 59.03302 252.03658
16.65000 -2859.87540 12.29764 -5.60123 56.53278 52.17547 238.41078
16.75000 -2839.97634 10.65333 -9.13925 59.14043 55.18326 239.95333
16.85000 -2820.62439 8.74696 -14.84788 67.50176 54.95752 243.43244
16.95000 -2801.50163 13.56847 -6.32122 53.09043 48.32342 232.07675
17.05000 -2786.67910 11.03853 -12.61149 47.44297 46.16014 223.66910
17.15000 -2766.06080 12.68176 -11.23277 64.36308 61.80027 222.99165
17.25000 -2754.28657 11.86055 -11.00186 74.40186 53.88849 220.77067
17.35000 -2734.47422 9.95149 -14.63300 55.82330 52.68110 212.82158
17.45000 -2719.52700 10.08992 -12.90882 56.35413 47.61554 213.37615
17.55000 -2701.90651 10.02132 -6.05027 51.56664 44.69161 204.42651
17.65000 -2684.64629 12.48822 -5.90181 47.17666 43.36128 200.84822
17.75000 -2667.29867 10.53873 -8.51044 53.04013 49.10932 209.64344
17.85000 -2648.05591 8.98294 -22.40741 44.25871 50.98355 194.15562
17.95000 -2633.01793 11.89746 2.11132 53.49743 50.25602 194.08358
18.05000 -2618.58387 13.32431 -5.32356 45.96073 55.47897 182.88117
18.15000 -2600.53668 11.46637 -6.70533 49.94849 36.76039 192.91220
18.25000 -2584.14119 9.75062 -6.39054 58.61200 57.13064 187.60289
18.35000 -2567.70085 11.98179 -4.56958 45.26030 50.74397 182.18891
18.45000 -2557.28351 7.82892 -11.37390 47.99202 32.25141 175.91732
18.55000 -2535.85873 10.55363 -3.67348 48.86252 58.81320 177.54633
18.65000 -2520.86961 7.05750 -11.72818 46.80371 38.23706 178.28746
18.75000 -2505.58074 6.90302 3.96297 36.88765 40.85069 170.91900
18.85000 -2491.45096 7.98180 -7.81715 50.53606 51.81727 173.15830
18.95000 -2476.21289 7.46363 -7.41926 37.72979 38.73061 167.80152
19.05000 -2461.61090 10.95588 -4.48045 46.42750 34.49746 165.23876
19.15000 -2446.78546 8.69187 0.04356 52.02501 40.82676 162.12115
19.25000 -2430.26746 11.12002 5.46320 49.63258 51.12287 163.89511
19.35000 -2418.44408 9.45307 -1.10144 57.61624 47.05408 158.77411
19.45000 -2406.79247 8.45148 -21.46847 50.42068 40.38427 157.81885
19.55000 -2390.67902 8.40860 0.84397 36.67836 53.34716 154.99692
19.65000 -2374.74118 6.07710 0.93803 45.84281 43.52434 158.25868
19.75000 -2364.07351 4.77859 -14.26665 46.74017 41.82342 139.97355
19.85000 -2349.47389 11.05725 -16.97448 49.45042 52.82677 146.81065
19.95000 -2334.37557 5.70265 -14.39199 47.93248 44.21926 149.64055
