0.125 0.000 -0.000 0.005
0.375 -0.010 -0.009 0.107
0.625 -0.013 -0.024 0.551
0.875 -0.017 -0.019 1.376
1.125 0.000 0.023 2.343
1.375 -0.009 -0.003 3.268
1.625 0.024 0.020 4.083
1.875 0.020 0.026 4.931
2.125 -0.003 0.025 5.495
2.375 0.033 -0.009 5.991
2.625 0.019 0.077 6.446
2.875 -0.005 0.047 6.944
3.125 0.018 0.039 7.410
3.375 -0.003 0.039 8.027
3.625 0.027 0.079 8.602
3.875 0.001 0.038 9.149
4.125 0.003 0.091 9.871
4.375 -0.019 0.082 10.593
4.625 -0.046 0.065 11.194
4.875 -0.057 0.073 12.079
5.125 -0.075 -0.023 13.220
5.375 -0.133 -0.039 14.645
5.625 -0.159 -0.196 16.623
5.875 -0.193 -0.152 18.528
6.125 -0.190 -0.173 20.741
6.375 -0.174 -0.175 22.532
6.625 -0.198 -0.288 23.288
6.875 -0.185 -0.294 23.688
7.125 -0.198 -0.317 23.757
7.375 -0.182 -0.350 22.758
7.625 -0.126 -0.339 21.586
7.875 -0.115 -0.383 20.277
8.125 -0.043 -0.348 19.725
8.375 0.005 -0.335 19.726
8.625 -0.002 -0.350 19.481
8.875 0.042 -0.346 20.237
9.125 0.118 -0.286 21.178
9.375 0.154 -0.296 21.103
9.625 0.152 -0.252 21.388
9.875 0.193 -0.251 21.556
10.125 0.162 -0.191 21.310
10.375 0.126 -0.131 20.517
10.625 0.119 -0.069 20.287
10.875 0.093 -0.071 19.216
11.125 0.062 -0.011 18.883
11.375 0.031 0.018 17.556
11.625 -0.007 0.010 16.685
11.875 -0.067 0.023 16.349
12.125 -0.053 0.002 15.896
12.375 -0.092 0.001 15.726
12.625 -0.113 0.009 14.466
12.875 -0.109 -0.032 13.630
13.125 -0.105 -0.053 12.979
13.375 -0.092 -0.070 12.233
13.625 -0.068 -0.072 11.804
13.875 -0.070 -0.081 11.400
14.125 -0.040 -0.074 10.800
14.375 -0.001 -0.079 10.472
14.625 -0.025 -0.067 10.371
14.875 0.019 -0.055 10.428
