0.2 -0.8009 22.39104 0.04439 128.77043 123.78423 120.25138
0.6 0.11787 49.29296 -0.52656 114.47348 99.8895 96.85305
1.0 0.67035 66.73884 -0.92729 100.8866 84.94405 81.33324
1.4 -0.06973 80.32498 -0.33109 88.92223 79.0375 73.58439
1.8 0.61029 96.09892 -0.46709 78.37477 74.56071 69.3951
2.2 -0.39266 114.09263 0.02224 69.06017 71.00504 65.14668
2.6 -1.63307 133.91294 0.22109 60.88349 63.8745 58.9935
3.0 -1.30891 150.33893 -0.09674 56.32176 54.65512 53.37978
3.4 -1.13231 160.19279 -0.70937 52.21959 46.89014 48.74622
3.8 -1.11424 166.78559 -0.8613 49.14797 41.87022 44.85158
4.2 -0.79178 171.10625 -0.74991 47.07185 39.12426 42.43779
4.6 0.01978 175.45344 -0.57713 45.19238 37.59743 40.41793
5.0 0.16166 179.86156 -0.13243 43.17377 36.19142 38.28657
5.4 0.14562 184.03803 0.13964 41.72016 34.32001 36.29525
5.8 0.48742 187.4076 0.79742 40.28277 33.52386 35.00963
6.2 0.1073 189.96539 0.48763 38.96761 31.57331 33.43946
6.6 -0.32329 192.7786 0.14057 37.44605 30.09222 32.15676
7.0 -0.53923 195.24555 0.36459 36.24965 29.26187 30.66794
7.4 -0.95337 197.7793 0.37226 34.82759 27.99134 28.95843
7.8 -0.22713 200.41948 1.03381 33.46048 27.2545 28.02081
8.2 -0.22726 202.8807 1.25766 32.45742 26.30503 26.61811
8.6 0.47822 204.53893 1.07754 31.56799 25.38768 25.67972
9.0 0.22053 206.10408 1.24888 31.10761 24.2535 24.74796
9.4 0.41073 207.37264 1.20172 30.16487 22.97467 24.0442
9.8 0.60347 208.12658 0.91941 29.1212 21.74601 23.6225
10.2 0.47987 208.31424 0.95424 28.63878 20.44057 22.80218
10.6 0.48094 208.42006 0.48884 27.71846 19.8116 21.73275
11.0 0.01779 208.35302 0.38965 26.26381 19.551 21.22611
11.4 0.114 208.82157 0.55457 25.96374 19.2072 20.1633
11.8 -0.48302 209.51603 0.52845 25.29409 19.32623 19.22216
12.2 -0.14794 210.18802 -0.00568 24.94938 18.91952 18.70002
12.6 0.27958 211.13303 -0.45165 23.15162 18.24952 17.48441
13.0 0.33314 211.58639 -0.30926 22.8704 17.92734 17.04091
13.4 0.18846 212.16422 -1.01775 21.97226 17.34534 16.59722
13.8 0.49382 212.26856 -1.22875 21.66636 16.83419 15.98901
14.2 0.63341 212.68545 -1.58923 20.92003 16.49388 15.35173
14.6 0.09396 212.35946 -1.76202 21.11099 15.72185 14.70365
15.0 0.1563 212.29678 -1.81705 20.95375 15.5965 14.51164
15.4 -0.53181 212.42525 -1.9704 20.86504 14.89312 13.87358
15.8 -0.7657 212.83482 -1.10305 20.76151 14.29423 13.13707
16.2 -0.57655 212.84267 -1.06405 20.26193 13.21322 12.85133
16.6 -0.45385 212.47852 -0.91441 19.26723 12.63121 12.52347
17.0 -0.8412 211.26402 -0.20436 18.46333 12.2512 11.91665
17.4 -0.33751 210.51031 0.2141 17.91148 11.89082 11.93859
17.8 -0.36523 209.33245 0.10428 17.06833 12.12358 11.74617
18.2 -0.42937 209.22385 0.19175 16.00116 12.19251 11.2936
18.6 -0.48493 209.26539 -0.2081 15.74206 12.20443 10.78574
19.0 -0.67812 209.07371 -0.33448 15.20734 12.5016 10.46652
19.4 -0.02768 209.62592 -0.63171 14.13349 11.44963 10.49457
19.8 0.58254 209.98709 -0.36151 14.06263 10.96736 9.9184
