0.05000 -24161.32925 -1747.10759 -83.43419 14065.35592 15188.36725 23430.76407
0.15000 -34545.60198 -770.67010 1204.64484 14759.96271 11935.10494 29705.44297
0.25000 -36283.54793 293.54469 1296.56624 13588.48418 8137.71258 29326.15657
0.35000 -34767.09413 -105.72666 1206.04556 11227.12348 6496.13940 28053.95444
0.45000 -31941.07683 176.54097 1853.24038 10151.31820 4997.79020 26031.93521
0.55000 -29443.63470 15.54307 1159.64562 9008.19207 3998.82992 24241.80109
0.65000 -26527.17952 -18.67262 219.97689 8184.50240 3787.50385 22599.42841
0.75000 -24925.18892 70.36623 -128.22968 7346.63478 3377.95189 20725.89701
0.85000 -23499.03432 61.58913 -366.14739 6662.99617 3018.71049 19143.14278
0.95000 -21874.44754 27.38153 82.30450 6141.56988 3119.17768 17621.92466
1.05000 -20648.43869 7.60460 -571.96296 5642.00893 3126.68712 16272.16419
1.15000 -19507.27787 18.61817 106.34604 5401.82144 2893.93900 15375.63881
1.25000 -18680.45204 -35.28443 -56.46028 5113.30681 2771.09469 14358.25515
1.35000 -18046.39533 10.78877 55.69256 4690.67649 2760.49232 13337.56729
1.45000 -17209.50092 4.50159 343.31774 4559.47721 2681.55578 12796.02179
1.55000 -16471.47386 14.11765 -166.10614 4188.05185 2398.42542 12044.86453
1.65000 -15816.67439 -30.95239 -61.31127 3935.65304 2378.09259 11357.80308
1.75000 -15381.03568 46.25299 -655.62317 3709.90404 2364.81391 10722.39935
1.85000 -14788.57690 63.41699 -185.35118 3536.42220 2317.69507 10160.22781
1.95000 -14355.36848 -9.80894 434.85333 3312.95963 2207.32834 9559.53149
2.05000 -13930.58068 -29.07673 -178.08975 3129.83521 2123.48052 9112.58999
2.15000 -13480.91779 -27.48888 74.64228 2875.35883 1929.80188 8778.57026
2.25000 -13166.30499 69.13572 37.62620 2720.02294 1874.40626 8208.26401
2.35000 -12633.87158 13.05251 -240.41052 2579.80405 1824.46976 8096.39404
2.45000 -12321.92985 -22.20963 -55.22946 2578.63656 1793.99869 7713.51356
2.55000 -12086.39824 40.10380 -95.54534 2351.28053 1750.01778 7284.13283
2.65000 -11667.94131 80.40957 15.99096 2438.94258 1854.19414 7139.64591
2.75000 -11447.95168 58.47749 -20.38725 2237.64791 1787.49779 6774.17416
2.85000 -11178.12209 -15.96621 -30.61545 2246.80599 1750.02371 6603.60791
2.95000 -10951.97988 -33.41968 -324.95120 2119.57497 1780.82765 6282.08941
3.05000 -10700.64768 1.26603 -29.56150 2006.90820 1539.65555 6031.59912
3.15000 -10485.85787 -3.82631 -36.67630 1881.99119 1599.56809 5791.48496
3.25000 -10191.28284 -17.63499 -135.02960 1783.13703 1486.20492 5765.34690
3.35000 -10006.75986 80.47482 -90.58407 1763.73746 1536.80013 5471.88460
3.45000 -9730.98569 3.18432 -244.01288 1613.07460 1360.27852 5405.57889
3.55000 -9620.12948 38.69687 84.58739 1476.75923 1336.39263 5116.83774
3.65000 -9398.20615 -34.99811 -223.72267 1513.21383 1458.50476 4996.08201
3.75000 -9236.65032 4.29067 -211.99481 1767.24304 1293.67868 4899.69619
3.85000 -9027.67669 -24.45734 -4.86405 1414.18682 1349.97335 4787.91792
3.95000 -8918.85341 -5.66989 -4.13341 1633.14416 1301.84156 4663.74427
4.05000 -8703.43221 16.10492 164.71837 1266.89213 1176.65181 4565.93147
4.15000 -8600.88147 -4.17944 -3.41363 1235.27416 1181.51827 4350.45417
4.25000 -8416.67834 7.72401 -95.92815 1181.41012 1136.05779 4314.54165
4.35000 -8326.97264 -0.32891 -117.39988 1199.66830 1220.46664 4171.47593
4.45000 -8157.70006 -28.65825 -104.75788 1041.97351 1088.18760 4062.93844
4.55000 -8014.16457 84.79326 -253.22404 1173.55580 1136.99154 3912.92812
4.65000 -7878.24712 7.23227 -263.02709 1053.84280 1110.70602 3919.38863
4.75000 -7797.66886 -39.50354 11.24889 897.81894 1189.16854 3772.75453
4.85000 -7717.87470 -10.12352 -93.89936 848.01329 995.14325 3585.02998
4.95000 -7586.72642 -20.61321 -186.06736 1219.27688 1092.21631 3502.76918
5.05000 -7517.63098 0.15639 38.12237 878.75070 998.82349 3430.24074
5.15000 -7462.92138 27.29972 61.20341 821.05654 931.45230 3453.38127
5.25000 -7360.55790 -13.00472 19.62661 834.62752 931.17004 3254.13833
5.35000 -7233.85845 33.81088 -56.75177 701.94040 839.47893 3160.45113
5.45000 -7134.12406 23.88842 39.14194 670.78344 830.27793 3009.39931
5.55000 -7066.96201 -1.29132 103.44151 572.87574 851.37292 2831.23434
5.65000 -6965.64805 37.91482 -150.12171 608.48354 807.99092 2816.86043
5.75000 -6876.45423 -24.01753 34.30784 627.65484 971.25253 2690.25265
5.85000 -6818.47488 16.45645 -25.90733 589.93327 949.39232 2627.82678
5.95000 -6698.43819 2.58632 -140.02047 672.05587 837.07461 2624.62623
6.05000 -6667.03697 21.55810 103.54952 514.63368 712.74876 2490.53224
6.15000 -6594.49329 14.67353 -86.72540 572.96069 880.20945 2365.46741
6.25000 -6538.91641 -12.19098 34.70824 483.94411 737.22524 2292.37964
6.35000 -6436.89703 17.71702 -72.41411 469.89174 656.18445 2295.52866
6.45000 -6376.68785 22.34611 -82.73138 491.18877 715.49955 2208.80308
6.55000 -6306.54518 10.19573 -31.35477 482.91621 665.92198 2102.04361
6.65000 -6260.03151 -5.52537 -14.80718 495.25215 912.86001 2184.20160
6.75000 -6219.47100 -21.70966 21.71314 436.88067 672.65418 2009.31681
6.85000 -6153.22171 -21.11907 44.96822 488.55332 658.79749 1885.52600
6.95000 -6118.41467 1.36881 -26.42837 492.79824 612.31961 1799.02422
7.05000 -6086.87726 -11.92348 -81.68705 477.10691 630.17936 1772.98125
7.15000 -6038.60255 -11.76605 14.75755 524.66076 586.77104 1679.42949
7.25000 -5985.82058 12.56526 -30.47294 486.67403 548.62584 1645.08271
7.35000 -5941.88101 -5.73160 -47.40338 558.07125 605.90311 1565.43081
7.45000 -5927.74721 7.80508 -67.39176 484.71879 542.53749 1538.18929
7.55000 -5864.58360 -16.02962 -3.39628 479.99501 526.92081 1449.88680
7.65000 -5824.35500 -10.47799 33.28135 510.87582 543.73815 1399.83009
7.75000 -5792.21526 -6.25961 15.15870 597.24928 505.08582 1377.19600
7.85000 -5760.04347 -20.97021 56.31623 516.22600 479.65780 1333.42651
7.95000 -5725.31568 -18.08977 41.93968 535.28548 484.06401 1275.89657
8.05000 -5638.05769 6.93681 0.29627 532.14008 437.06324 1227.69011
8.15000 -5614.41044 -7.01751 -5.35561 521.50088 443.54340 1182.18641
8.25000 -5562.06066 -13.28777 32.43300 493.02873 396.74494 1174.65091
8.35000 -5487.54329 -14.35634 10.90242 474.92303 355.42554 1157.61643
8.45000 -5419.06737 -24.55499 31.65069 508.94797 409.59997 1123.15540
8.55000 -5360.58859 19.11734 80.96249 467.19292 389.06512 1093.32152
8.65000 -5306.85669 -10.91041 -33.78012 446.76313 401.50337 1033.62611
8.75000 -5240.00689 10.33517 -36.65438 450.73415 358.51768 1066.74647
8.85000 -5209.04728 9.39108 0.76332 430.81381 309.62490 1010.88430
8.95000 -5159.31953 -8.84462 8.20553 431.90518 322.30991 1009.18983
9.05000 -5101.24431 11.97858 27.53565 418.41978 282.63700 988.18095
9.15000 -5030.31324 7.85810 -14.87529 400.25774 300.17810 945.96455
9.25000 -4996.92249 11.98783 26.94703 419.31988 295.59083 880.97769
9.35000 -4937.07587 5.11619 6.12894 355.98477 274.67509 907.53924
9.45000 -4887.02936 12.28239 -26.55909 376.54220 248.13026 886.12001
9.55000 -4840.64558 7.74924 -24.50433 373.84417 255.75670 826.12731
9.65000 -4770.89734 9.57146 -57.15158 338.05861 277.17527 809.86469
9.75000 -4722.87678 3.87443 -56.72555 488.66404 320.77058 852.25145
9.85000 -4703.31845 7.88106 -4.86525 302.96616 278.41046 804.40824
9.95000 -4680.06102 -26.56659 5.73254 543.88028 831.92825 824.11614
10.05000 -4628.82371 26.78073 -16.66638 294.58035 260.31290 757.73192
10.15000 -4571.86599 4.38500 -6.52191 262.41243 215.42969 786.55388
10.25000 -4532.17729 12.85383 -14.20814 268.96727 234.52745 714.88297
10.35000 -4510.79658 10.14226 -22.60044 283.64941 307.08353 778.81527
10.45000 -4465.58835 3.11372 1.62849 266.17756 216.50785 712.98015
10.55000 -4414.28246 18.66804 -39.52017 250.15333 353.33653 742.11262
10.65000 -4405.05162 14.28633 -4.90644 231.34340 207.41323 671.50634
10.75000 -4346.30743 15.42454 -19.29629 271.27999 219.64952 686.57420
10.85000 -4316.05644 2.16158 -42.67896 303.74173 215.48475 673.67234
10.95000 -4282.56986 13.28515 -27.65804 276.50095 228.17155 649.14226
11.05000 -4250.69785 8.46089 -42.81877 275.03256 196.56016 657.22191
11.15000 -4192.23213 12.80265 -44.31730 218.45365 173.27163 652.13747
11.25000 -4162.86467 12.46785 -4.63740 206.69243 193.48669 617.53608
11.35000 -4118.92817 0.46191 -24.36605 233.38345 252.95379 604.49546
11.45000 -4095.31487 10.32986 -38.82406 195.78483 227.94578 612.26716
11.55000 -4067.92600 7.07254 -1.42654 207.14857 158.28832 590.06847
11.65000 -4020.80237 11.69669 -37.22633 187.82284 189.90543 571.77622
11.75000 -3989.29657 2.11642 -73.32480 185.70103 130.53931 533.82085
11.85000 -3965.96941 19.93080 -30.50239 236.14256 175.86660 548.90259
11.95000 -3940.09468 9.41473 -23.13693 256.08696 159.04550 569.26199
12.05000 -3888.39844 13.11750 -67.91677 477.63827 157.62793 522.88637
12.15000 -3865.37764 1.70209 -39.38930 150.83963 160.46785 527.81654
12.25000 -3839.03110 6.16328 -28.62721 204.74285 135.60513 501.55378
12.35000 -3810.62489 8.74170 -0.87340 144.48360 112.01637 515.14363
12.45000 -3780.23681 11.26156 -9.68676 181.32418 213.38566 488.77038
12.55000 -3763.37413 -3.37784 16.21214 261.46279 159.19863 526.37320
12.65000 -3727.72614 20.54282 -1.81985 134.47037 245.18082 483.82359
12.75000 -3689.53481 -10.95444 -2.32894 234.74222 195.21354 452.44647
12.85000 -3675.01803 5.91899 8.01565 204.47191 140.66122 487.36733
12.95000 -3629.94644 -2.15352 3.35177 138.53026 149.98251 449.87525
13.05000 -3619.33735 5.75368 -24.50727 144.17587 109.57568 447.67506
13.15000 -3580.49736 9.15283 2.53389 131.42676 132.47047 437.50792
13.25000 -3551.20821 11.41907 8.52321 137.40651 205.30428 450.88714
13.35000 -3533.02424 -2.47707 18.40678 260.80945 333.63180 436.63077
13.45000 -3496.45524 13.26691 42.17798 147.43808 100.68928 428.43090
13.55000 -3470.88589 13.39588 -5.99582 128.39581 97.71660 395.37768
13.65000 -3450.67102 10.90950 7.47013 149.77128 100.38301 396.58982
13.75000 -3423.01746 4.35305 5.62087 117.36025 122.49019 407.20127
13.85000 -3395.00990 -2.97430 25.64463 148.20616 195.09099 466.01656
13.95000 -3377.41892 -0.35183 -5.40236 107.64729 138.89455 375.90275
14.05000 -3358.09852 -1.94038 15.91900 123.59231 122.57170 370.19464
14.15000 -3336.01604 2.91588 4.74908 131.43098 107.80706 398.69317
14.25000 -3306.57675 3.62388 5.54010 97.03080 97.98828 367.53081
14.35000 -3278.57054 -3.80428 1.39367 103.92834 121.33405 373.03752
14.45000 -3267.45121 3.16989 -26.46295 218.56070 140.21890 406.29721
14.55000 -3229.05934 8.21065 -5.86541 109.65792 80.16488 350.00978
14.65000 -3210.75600 12.02737 -17.09428 115.69531 69.94800 374.17299
14.75000 -3190.85884 9.04239 -0.97422 106.44620 102.55954 318.58616
14.85000 -3152.56578 0.46136 10.33185 153.01886 90.15420 340.18655
14.95000 -3141.99507 7.52192 -23.03665 107.56676 86.72655 320.45252
15.05000 -3119.92621 8.01051 -9.43781 97.10961 80.61892 338.96689
15.15000 -3098.49973 3.35146 -21.28162 244.62827 91.89821 378.98627
15.25000 -3087.37245 22.25269 -23.73841 134.99531 156.33129 323.58437
15.35000 -3049.72696 6.50388 21.91380 157.73283 69.98697 341.35558
15.45000 -3053.51867 11.27070 -34.19154 145.98962 77.83995 334.72896
15.55000 -3024.28793 2.77651 -18.88984 234.52026 116.67002 558.14443
15.65000 -3003.60358 -12.22158 -34.69302 92.35872 191.20602 309.32666
15.75000 -2983.03242 1.88180 5.72233 148.50887 124.01176 310.04621
15.85000 -2954.67861 1.74596 -20.94216 126.11592 82.78600 314.91029
15.95000 -2939.36742 1.85876 -7.96650 78.22754 75.52868 305.48204
16.05000 -2914.68767 6.11758 -15.32535 100.02902 60.98368 294.68070
16.15000 -2914.06023 -3.24773 -33.90465 171.38338 104.57960 292.15636
16.25000 -2900.67732 6.02394 -32.55934 185.29346 88.00791 309.14037
16.35000 -2869.12010 13.57893 5.00426 88.52768 95.24583 299.32473
16.45000 -2838.64658 8.50066 -25.01544 158.72809 82.36296 277.69153
16.55000 -2824.40222 10.08949 -3.31167 91.37371 63.21648 276.80231
16.65000 -2816.07980 9.61140 -10.77509 81.64136 66.32932 275.22668
16.75000 -2804.32593 4.22121 -12.98641 105.07092 107.22922 275.33235
16.85000 -2776.24994 6.99922 -4.46485 81.41786 61.22343 264.99410
16.95000 -2748.11405 -0.36796 -35.55274 85.93641 135.02238 267.31249
17.05000 -2745.23072 11.52750 0.66431 302.04887 110.95003 291.39663
17.15000 -2721.00809 7.53184 24.17108 79.53229 75.08457 268.22446
17.25000 -2714.18024 5.99279 -8.15377 92.78061 80.23875 246.49086
17.35000 -2699.04964 4.42682 7.06513 68.91465 64.14864 252.40011
17.45000 -2681.99942 3.38342 -11.71820 77.71814 55.37333 263.51131
17.55000 -2666.91820 10.11618 1.93958 79.29970 57.89418 237.12437
17.65000 -2658.42499 6.22507 -6.30933 193.87475 53.79836 244.91996
17.75000 -2628.55167 5.11044 -18.51271 106.37826 74.24060 247.11435
17.85000 -2615.97288 13.04219 14.38301 97.61446 81.02696 235.61780
17.95000 -2571.29190 -3.29924 -22.98288 483.38440 167.72889 376.49194
18.05000 -2586.72682 10.61530 -0.84081 100.53594 92.85077 254.51148
18.15000 -2579.48363 4.11102 -36.29106 75.35062 80.65169 242.86036
18.25000 -2557.65171 0.88797 -4.28407 67.95428 102.69710 242.05728
18.35000 -2546.13676 15.62245 -13.54402 77.02442 121.37656 230.42139
18.45000 -2531.36740 6.19632 -15.27034 72.27908 63.42868 219.63238
18.55000 -2515.95853 8.67863 -2.26790 51.59128 52.42641 236.11007
18.65000 -2505.24758 2.13867 3.10889 114.75946 79.52849 211.35939
18.75000 -2491.63940 5.53171 1.39004 66.69155 49.03235 225.54213
18.85000 -2475.42000 12.45802 6.45969 93.53271 85.75608 228.61715
18.95000 -2456.55956 2.03672 -6.09703 146.42800 181.35782 225.54111
19.05000 -2443.32403 14.56186 -7.59688 79.59575 60.42921 224.11676
19.15000 -2437.12580 6.83754 3.03653 54.90420 46.36492 207.76879
19.25000 -2430.45359 1.42218 -28.93555 82.41657 106.02924 251.83028
19.35000 -2414.53592 4.34137 2.76992 60.25125 57.95875 196.21952
19.45000 -2394.60086 5.19729 23.20505 56.19561 36.80239 209.69634
19.55000 -2388.70322 0.10650 -5.46870 59.74870 90.62486 183.15775
19.65000 -2377.04079 7.79682 -1.43364 58.52276 55.85432 201.00990
19.75000 -2357.80021 4.57917 -12.86191 47.58558 61.52705 176.42934
19.85000 -2344.92425 2.47749 -13.57957 66.90749 60.97271 181.84417
19.95000 -2329.51884 9.06639 -16.27002 51.88647 62.47399 203.81958
