0.125 -0.001 -0.000 0.002
0.375 0.005 -0.004 0.056
0.625 0.014 -0.026 0.292
0.875 0.037 -0.050 0.841
1.125 0.079 -0.051 1.585
1.375 0.092 -0.065 2.469
1.625 0.065 -0.086 3.205
1.875 0.020 -0.094 3.964
2.125 0.019 -0.077 4.517
2.375 0.000 -0.060 5.067
2.625 -0.001 -0.051 5.480
2.875 0.049 0.004 5.872
3.125 0.068 0.058 6.109
3.375 0.044 -0.015 6.623
3.625 0.091 0.050 7.157
3.875 0.068 -0.029 7.826
4.125 0.095 -0.031 8.378
4.375 0.110 0.012 9.312
4.625 0.080 -0.014 10.323
4.875 0.118 -0.084 11.729
5.125 0.151 0.002 13.352
5.375 0.113 -0.127 15.072
5.625 0.175 -0.160 17.318
5.875 0.234 -0.125 19.347
6.125 0.186 -0.109 21.285
6.375 0.220 -0.082 22.603
6.625 0.265 -0.071 23.720
6.875 0.295 -0.039 24.556
7.125 0.285 -0.015 25.067
7.375 0.255 -0.004 24.932
7.625 0.330 0.034 25.324
7.875 0.350 0.055 25.539
8.125 0.341 0.058 25.576
8.375 0.340 0.022 25.776
8.625 0.338 0.053 25.398
8.875 0.298 -0.065 25.701
9.125 0.222 0.021 25.312
9.375 0.241 -0.026 24.509
9.625 0.235 -0.059 24.261
9.875 0.259 -0.012 24.228
10.125 0.236 -0.051 23.258
10.375 0.251 -0.084 23.095
10.625 0.288 -0.086 22.600
10.875 0.326 -0.086 21.750
11.125 0.319 -0.091 21.335
11.375 0.366 -0.094 21.051
11.625 0.321 -0.076 19.907
11.875 0.382 -0.026 19.775
12.125 0.311 -0.003 19.010
12.375 0.322 0.021 18.579
12.625 0.347 0.035 18.635
12.875 0.334 0.026 17.799
13.125 0.353 0.050 17.736
13.375 0.345 0.087 17.668
13.625 0.332 0.101 17.408
13.875 0.246 0.108 17.043
14.125 0.230 0.113 16.928
14.375 0.211 0.102 16.522
14.625 0.252 0.104 15.928
14.875 0.151 0.107 15.712
