0.05000 -2829.48003 789.24189 -753.69319 3440.87277 2662.16077 4772.40000
0.15000 -5066.92265 47.24639 700.30037 3856.59368 3261.26195 6328.74708
0.25000 -7007.05502 43.84305 658.03558 3579.55109 2978.76903 8110.37268
0.35000 -7957.32617 42.20776 349.00214 3351.47019 2330.81831 8963.44441
0.45000 -8644.56736 84.37056 -42.67140 3413.55068 2250.10052 9221.85653
0.55000 -8832.72082 48.02273 250.65216 2968.07100 1650.81626 8856.39317
0.65000 -8825.01985 15.54365 2.18307 3016.30321 1591.88801 8807.59840
0.75000 -8689.34436 25.96911 346.38782 2643.99659 1574.85520 8694.69416
0.85000 -8658.44285 -31.65636 222.02348 2523.42390 1650.72759 8369.76262
0.95000 -8481.64094 5.08306 359.07466 2649.90777 1411.59864 8228.94294
1.05000 -8357.39246 31.62969 243.55991 2312.92277 1370.29156 7934.93584
1.15000 -8283.18522 9.78370 160.97765 2102.49109 1288.01121 7629.65992
1.25000 -8141.63753 29.31137 82.13937 2026.33023 1318.35213 7402.85259
1.35000 -8130.03640 -8.30063 33.05753 1899.33387 1295.71069 7050.53123
1.45000 -8102.16384 20.35071 -167.76200 1851.07524 1324.37832 6809.33717
1.55000 -8121.20123 49.02163 19.80565 1755.66571 1412.26041 6640.70163
1.65000 -8087.58482 14.79586 67.20081 1607.31262 1212.37391 6342.01739
1.75000 -7969.71622 21.02325 -25.13988 1641.27534 1216.13113 6246.31896
1.85000 -7958.20047 14.28450 105.72528 1518.68930 1164.66118 5921.20577
1.95000 -7908.51901 17.05780 -49.80050 1382.93547 1101.00291 5745.64819
2.05000 -7858.62250 10.65002 -36.96765 1360.60405 1098.67616 5600.81206
2.15000 -7824.45285 3.33285 26.77804 1289.56804 1071.25996 5395.53185
2.25000 -7774.02787 15.15675 19.75125 1214.83741 996.25257 5247.58030
2.35000 -7760.94846 34.02610 43.32918 1144.41665 937.44086 5097.95805
2.45000 -7746.81834 23.66304 -78.21347 1125.23168 974.07523 4880.25191
2.55000 -7719.49022 19.58211 85.03771 1041.52268 908.55247 4727.86846
2.65000 -7675.76385 21.56749 51.37720 1030.41190 889.65005 4620.96898
2.75000 -7663.91006 20.26134 -20.19207 985.25989 875.21043 4510.16083
2.85000 -7624.60564 12.07957 11.20614 931.80876 822.07550 4370.97952
2.95000 -7592.74865 20.77690 -17.65053 873.44420 772.61313 4271.66187
3.05000 -7550.45605 -9.33238 35.93107 872.35608 841.53302 4090.77189
3.15000 -7486.88170 11.53061 -2.63142 802.70177 783.83713 3999.35565
3.25000 -7442.02960 23.11406 19.65487 903.56859 765.05076 3840.77692
3.35000 -7411.41365 3.64416 -52.17664 763.61369 749.25061 3783.17339
3.45000 -7375.27200 11.72664 -62.12816 774.03424 641.51657 3683.19898
3.55000 -7317.44469 9.37852 -21.27663 724.59117 675.44244 3560.46213
3.65000 -7276.76392 16.25693 -29.14957 849.28973 646.56379 3503.26440
3.75000 -7240.23471 10.67932 -55.36220 738.15371 668.94085 3409.43251
3.85000 -7189.03220 27.88631 13.71357 693.93935 643.33714 3274.36137
3.95000 -7124.35156 23.39765 -15.71570 672.79998 585.19311 3226.62431
4.05000 -7082.49017 13.34467 -20.36923 622.21836 596.80863 3161.53683
4.15000 -7029.75416 10.55147 -12.34327 707.58336 726.89971 3061.29943
4.25000 -6994.35197 13.70837 -17.66364 576.79167 508.39144 2967.24773
4.35000 -6951.97081 21.37122 8.65504 583.85163 523.59781 2910.25720
4.45000 -6908.38507 28.36961 32.97953 578.16097 465.48355 2846.57489
4.55000 -6861.38360 17.56975 -9.30220 513.59084 458.03636 2746.70728
4.65000 -6801.18247 18.99564 -37.36911 544.81590 481.42229 2706.11944
4.75000 -6762.75365 15.67606 -75.98986 521.25302 496.16661 2622.69908
4.85000 -6716.32440 13.66825 66.32026 513.98183 433.37853 2596.77974
4.95000 -6682.75309 16.83452 6.24012 550.13297 449.71261 2511.37653
5.05000 -6649.25820 22.04601 17.94676 470.88447 415.54305 2458.86735
5.15000 -6609.27619 9.76371 -31.22355 488.85068 470.50511 2386.14873
5.25000 -6580.87541 22.20679 -7.98784 440.01952 440.54975 2348.83913
5.35000 -6555.98196 19.09221 13.40960 496.26711 389.50515 2300.94275
5.45000 -6514.28303 28.53878 -1.60082 458.49991 366.79912 2233.98566
5.55000 -6469.74396 23.10016 6.84291 414.93388 370.95935 2191.61716
5.65000 -6445.11323 12.61213 25.36067 472.94497 425.11708 2156.25567
5.75000 -6401.26124 20.81396 -2.23382 428.20572 374.49729 2104.85665
5.85000 -6354.25385 20.46032 -29.80553 440.32384 364.78246 2061.72720
5.95000 -6314.69066 17.74930 11.89255 459.80906 329.96219 2016.13141
6.05000 -6268.57053 17.17856 9.94609 389.34831 323.21656 1957.79995
6.15000 -6222.14836 15.76011 -67.43572 459.67560 367.09842 1909.83777
6.25000 -6185.17860 18.58290 -23.59656 394.87282 312.39770 1886.33986
6.35000 -6138.97979 17.15979 -1.62129 451.90701 337.57160 1826.52548
6.45000 -6093.81757 19.07066 9.25145 430.81109 325.75127 1785.59912
6.55000 -6046.12317 12.26791 -22.98646 390.84289 308.42382 1749.03198
6.65000 -5993.75653 12.45146 -31.38812 388.50442 353.00504 1710.26675
6.75000 -5948.06227 18.17586 -9.23804 377.44431 345.91317 1677.12042
6.85000 -5899.42730 17.21978 37.92715 387.52202 298.86964 1650.13298
6.95000 -5840.89493 13.16431 -16.60837 403.31732 280.94783 1609.96992
7.05000 -5793.39019 13.66401 -73.61468 390.65801 324.98758 1582.80767
7.15000 -5744.13183 16.09853 -32.90186 596.82979 497.19697 1562.47462
7.25000 -5695.03735 20.88083 -32.54784 349.17056 301.70642 1497.75492
7.35000 -5641.66944 9.49637 -53.15387 317.68791 309.33661 1447.58220
7.45000 -5600.05310 21.73429 -27.71603 331.06621 224.06318 1411.49843
7.55000 -5556.15256 17.52152 13.31518 301.00467 251.15229 1384.38124
7.65000 -5511.70361 12.17857 -56.40824 313.25115 243.07461 1365.65291
7.75000 -5456.36680 16.32342 -13.03045 381.81047 251.66491 1350.37319
7.85000 -5422.57246 12.37969 -49.12734 284.06315 205.14229 1289.64257
7.95000 -5384.95450 20.09813 -38.39284 313.23022 238.88723 1263.66351
8.05000 -5340.75486 18.32500 -35.09963 318.79379 236.33904 1263.05772
8.15000 -5299.80972 18.22888 -7.41900 268.76851 231.42922 1238.05345
8.25000 -5269.43108 12.63490 -35.34210 291.50511 271.64198 1198.71907
8.35000 -5226.96788 17.60116 -25.71726 300.62206 248.88865 1159.50701
8.45000 -5201.08416 17.30795 -8.71176 245.34589 239.18929 1129.81533
8.55000 -5153.98367 7.78632 -13.38213 392.99781 408.34729 1126.40843
8.65000 -5116.80199 14.85216 2.33520 311.65972 199.50349 1101.70112
8.75000 -5076.09432 11.29237 -18.35872 285.37820 220.55650 1093.38628
8.85000 -5043.17957 10.80976 -55.06766 293.01307 217.56214 1066.33901
8.95000 -4989.41983 17.11261 -4.34097 229.77571 175.10498 1061.04442
9.05000 -4957.03051 7.88292 -15.31401 287.36743 280.93258 1038.24192
9.15000 -4919.64700 12.13215 4.52365 259.72821 173.73062 994.74381
9.25000 -4870.16973 11.73299 -53.28022 261.82127 231.47530 998.43647
9.35000 -4842.81271 15.76599 14.43670 198.65032 157.78239 953.58131
9.45000 -4801.83895 13.04010 4.16504 216.36979 175.93950 952.27910
9.55000 -4759.97898 10.75374 2.89992 210.16889 174.14392 924.41974
9.65000 -4720.22479 6.68488 -32.64391 481.23344 224.13950 915.08246
9.75000 -4685.71651 16.08059 -18.75115 177.78033 157.51631 896.76199
9.85000 -4647.02716 14.54232 0.86544 178.63961 130.70184 858.85846
9.95000 -4604.52592 7.15321 -9.34210 204.79169 209.88139 849.51039
10.05000 -4579.91070 11.30017 8.17135 250.27723 187.74975 851.45151
10.15000 -4541.52539 13.76287 -1.36341 180.04329 190.46123 808.84273
10.25000 -4502.78937 9.51879 -24.28059 278.32994 184.49799 825.34503
10.35000 -4474.06992 11.09620 -27.94472 177.64011 172.09116 786.00926
10.45000 -4433.26069 13.39159 4.55124 186.84400 150.54472 774.29119
10.55000 -4404.15944 4.96586 2.57838 279.89214 201.51382 763.19773
10.65000 -4361.99825 7.81886 -11.70780 219.63954 299.85952 746.36775
10.75000 -4339.06905 5.55172 -5.81299 194.16215 174.69976 729.42071
10.85000 -4299.00418 13.10744 -1.05626 191.50629 158.02641 717.19456
10.95000 -4266.55716 11.55267 -8.43356 168.46676 154.98167 722.61829
11.05000 -4236.22420 7.12603 -11.23856 191.57238 165.32297 697.36189
11.15000 -4210.18475 9.99411 9.09821 172.60466 138.62874 676.26670
11.25000 -4182.27093 6.54638 22.38184 170.71986 167.43735 666.45117
11.35000 -4140.83827 13.52413 1.11391 381.26760 238.85595 704.84993
11.45000 -4119.93322 4.62765 9.16609 203.81176 168.32312 695.40318
11.55000 -4091.95373 11.25097 13.61559 164.16190 157.54257 626.84879
11.65000 -4060.19943 3.20522 10.00727 183.05734 177.45521 643.99696
11.75000 -4031.14268 5.78047 20.21116 152.73054 138.43730 608.05944
11.85000 -3998.21383 3.25542 11.72576 218.44784 158.79361 621.84550
11.95000 -3979.08652 10.43355 6.89651 165.80710 123.17614 574.31550
12.05000 -3947.06169 9.36123 33.68903 219.76278 121.59629 568.66211
12.15000 -3919.66127 4.07259 -9.53795 145.56331 131.56190 554.53276
12.25000 -3886.48770 4.02981 27.91786 158.31952 247.27371 552.92120
12.35000 -3863.32669 7.92795 27.10222 128.64542 109.99721 541.79934
12.45000 -3827.93344 8.53797 19.93400 250.30285 121.43045 562.02857
12.55000 -3813.70272 6.84892 0.84688 141.02066 114.37813 504.50364
12.65000 -3777.28287 9.27331 12.60795 159.08886 171.14120 510.36447
12.75000 -3753.55210 5.57344 0.37322 149.11369 107.44812 496.42959
12.85000 -3730.44502 3.36185 3.97482 152.52663 106.45536 486.15817
12.95000 -3697.78155 4.02018 13.80234 205.33749 131.25047 496.48275
13.05000 -3674.12121 7.65175 8.35914 129.09728 114.05048 458.99643
13.15000 -3647.89938 7.66669 16.25365 154.74797 128.06918 456.27080
13.25000 -3622.42831 5.41603 20.60192 144.31680 143.48453 471.21646
13.35000 -3597.59151 5.12560 -0.98928 114.81212 79.90300 437.21936
13.45000 -3572.13218 4.41096 -4.15478 254.36525 176.42119 436.94733
13.55000 -3540.13204 0.26258 10.93770 365.59077 487.96035 512.52437
13.65000 -3528.67760 3.51116 -0.83961 384.64376 200.96656 712.48267
13.75000 -3499.94804 6.18638 -16.24174 96.60348 85.01452 410.12950
13.85000 -3478.93525 5.61174 -5.12512 187.55758 148.82100 414.48437
13.95000 -3443.40745 14.15209 -14.17694 219.29708 355.62182 412.48494
14.05000 -3426.42494 5.01430 -21.54126 109.74795 82.75096 390.28767
14.15000 -3400.45102 4.76280 -17.07063 81.40519 76.15758 391.24617
14.25000 -3376.81617 3.25282 -13.07828 89.91893 73.02209 379.03142
14.35000 -3352.97947 3.98085 -8.35356 95.68418 104.74397 367.06240
14.45000 -3324.38393 3.68882 -14.82490 173.04613 111.22049 384.45659
14.55000 -3304.03800 4.37957 -20.50384 109.27674 95.06157 353.52961
14.65000 -3284.70635 2.53145 -19.57182 154.03086 130.14750 350.96997
14.75000 -3259.44255 6.78623 -34.52821 70.20374 73.54760 329.37532
14.85000 -3235.81587 3.97699 -36.05762 115.78128 94.38727 337.39214
14.95000 -3212.68209 5.20838 -31.81762 87.57294 73.76372 333.60725
15.05000 -3193.05148 0.23547 -32.61542 77.59554 136.48741 327.53973
15.15000 -3162.32097 4.39110 -44.37676 135.10917 111.95555 322.68961
15.25000 -3145.49268 6.22147 -32.96233 88.29563 68.79349 318.95166
15.35000 -3124.44677 4.38965 -50.69977 121.70170 98.69865 294.07024
15.45000 -3108.11095 6.70075 -48.92307 112.36411 85.15874 331.98391
15.55000 -3082.35744 8.34074 -37.64903 82.43874 79.93445 301.73507
15.65000 -3067.28141 6.93213 -36.42559 94.47516 64.97260 293.32321
15.75000 -3040.80118 6.71365 -51.76292 111.54168 55.27495 284.44641
15.85000 -3014.95523 2.94280 -49.18555 223.62708 146.10652 296.17188
15.95000 -3003.66325 0.81826 -50.85776 70.81947 58.50223 273.96985
16.05000 -2984.93257 5.22912 -35.59976 88.05313 79.49741 262.76909
16.15000 -2962.35625 4.05402 -44.60424 106.10910 60.64939 252.95719
16.25000 -2943.19408 4.56041 -38.67954 96.89799 94.84490 254.06345
16.35000 -2922.50566 4.95869 -33.77334 58.68752 62.28837 244.15560
16.45000 -2903.65332 5.23773 -48.56066 66.71889 90.00753 242.05303
16.55000 -2887.68265 4.10589 -42.66795 117.93263 123.42154 248.23740
16.65000 -2865.74786 5.16212 -46.33872 68.48635 55.17262 244.85314
16.75000 -2847.87113 2.59895 -36.30396 67.64093 56.23065 239.23569
16.85000 -2829.75146 -0.40216 -37.20822 106.97359 107.46925 249.61836
16.95000 -2807.49027 6.44963 -35.24598 61.98962 58.21405 226.61969
17.05000 -2794.40484 2.40570 -32.99097 135.24568 106.66742 240.69331
17.15000 -2773.76737 6.34619 -26.26367 60.72077 42.94366 223.14347
17.25000 -2757.95660 3.43325 -33.32538 71.03113 232.25423 228.75411
17.35000 -2736.89205 2.73558 -46.63645 98.94714 87.32502 224.86045
17.45000 -2722.08353 1.44359 -39.07770 61.41674 146.37608 254.27199
17.55000 -2702.62233 5.41488 -41.33587 71.64939 144.21753 224.14408
17.65000 -2686.84100 5.39049 -47.82259 87.57936 64.55198 217.29033
17.75000 -2669.99191 1.92818 -37.02498 79.82645 51.89871 215.42985
17.85000 -2650.17002 5.93705 -46.75077 127.06119 66.86385 196.70959
17.95000 -2635.32273 7.10227 -47.18591 53.03953 51.49675 201.93728
18.05000 -2618.86096 2.51688 -49.39984 60.23037 83.62633 204.46915
18.15000 -2604.91042 4.72412 -23.89277 62.30251 66.71179 263.99805
18.25000 -2589.86022 2.91682 -32.05060 49.13818 75.98568 195.24143
18.35000 -2567.48227 6.26695 -41.55028 65.09885 63.49310 203.83568
18.45000 -2554.94896 5.09209 -37.80014 53.51490 50.81254 189.10988
18.55000 -2540.36752 3.50399 -37.67677 60.77011 40.32320 178.11266
18.65000 -2525.91371 7.18085 -40.19376 73.04114 56.27464 177.53059
18.75000 -2515.57281 4.00077 -32.07942 100.63148 52.90349 178.88157
18.85000 -2495.67421 -0.34716 -24.19600 48.59762 78.46173 184.23519
18.95000 -2481.99221 1.83178 -33.70797 79.85518 63.09153 166.50869
19.05000 -2467.55716 4.43107 -34.26067 88.99490 75.33744 175.31932
19.15000 -2455.34943 2.66544 -35.29824 77.43961 35.61870 189.98050
19.25000 -2422.26195 6.68553 -37.22855 370.60912 58.90893 241.98748
19.35000 -2419.33329 4.69456 -28.26524 60.23066 33.20401 163.73543
19.45000 -2407.67682 2.56581 -34.08994 43.92604 38.65597 155.98605
19.55000 -2399.18096 2.51327 -24.10555 86.21251 67.84062 168.97542
19.65000 -2388.75613 5.71901 -27.95621 165.05931 81.86612 167.26963
19.75000 -2369.13813 2.87031 -36.85942 43.36088 45.42638 157.03616
19.85000 -2354.63478 2.21139 -18.28476 46.19211 34.94899 140.65134
19.95000 -2344.03406 3.62148 -23.17608 46.69120 39.87186 151.08077
