0.12500 0.02409
0.37500 0.07077
0.62500 0.13406
0.87500 0.20148
1.12500 0.26303
1.37500 0.29891
1.62500 0.32920
1.87500 0.36083
2.12500 0.38922
2.37500 0.40843
2.62500 0.45324
2.87500 0.48198
3.12500 0.51612
3.37500 0.52837
3.62500 0.54211
3.87500 0.52742
4.12500 0.52075
4.37500 0.48601
4.62500 0.41178
4.87500 0.31953
5.12500 0.23990
5.37500 0.16035
5.62500 0.14643
5.87500 0.11429
6.12500 0.14213
6.37500 0.16573
6.62500 0.17573
6.87500 0.20408
7.12500 0.20408
7.37500 0.20083
7.62500 0.18662
7.87500 0.15621
8.12500 0.14076
8.37500 0.11401
8.62500 0.10765
8.87500 0.09079
9.12500 0.07688
9.37500 0.06533
9.62500 0.06658
9.87500 0.05787
10.12500 0.06401
10.37500 0.05436
10.62500 0.02954
10.87500 0.01285
11.12500 0.04133
11.37500 0.05205
11.62500 0.03748
11.87500 0.04252
12.12500 0.03138
12.37500 0.04462
12.62500 0.00995
12.87500 0.00795
13.12500 0.01339
13.37500 0.02816
13.62500 0.02765
13.87500 0.02165
14.12500 0.06275
14.37500 0.08458
14.62500 0.10068
14.87500 0.11655
