0.2 -1.1797 18.30119 0.43394 79.5462 79.47025 69.28597
0.6 -0.34859 40.91024 -0.46299 79.85806 77.10731 67.27013
1.0 -1.27284 61.51558 -0.67052 76.99524 73.63223 65.17081
1.4 -0.17592 78.32872 -0.99331 75.50687 69.95058 62.90967
1.8 0.31886 90.86641 -0.69928 73.70725 67.20752 59.86506
2.2 0.16589 104.41132 -0.27365 70.49194 64.12668 56.70865
2.6 0.26716 116.06902 -0.20181 68.14141 60.81871 53.71863
3.0 0.74869 126.30589 -0.23062 64.18257 57.25197 51.0376
3.4 0.96063 135.44482 0.10984 61.29784 53.8271 48.62871
3.8 1.25732 142.46758 0.91209 57.93919 51.26555 46.99265
4.2 0.46873 151.10934 0.46853 55.2687 48.55558 44.00307
4.6 1.07269 159.31543 0.59734 51.70979 45.00884 42.0966
5.0 1.52646 166.6902 0.54454 48.34989 41.86473 39.7533
5.4 0.80039 172.88779 0.38723 45.23044 39.07773 37.1338
5.8 0.51956 178.96863 0.22565 42.28524 36.63127 35.05777
6.2 0.11659 184.36654 0.21912 40.07723 34.55677 33.0884
6.6 0.12021 188.56361 0.00844 37.75165 32.38457 31.3271
7.0 -0.31457 192.4742 0.07881 35.65065 30.35996 30.01916
7.4 -0.01675 196.01813 0.1763 34.09449 28.57882 28.84432
7.8 -0.63494 198.3753 0.1198 32.78703 27.12175 27.3687
8.2 0.1288 199.95518 -0.44685 31.98477 25.90878 26.44181
8.6 -0.47748 201.99059 0.19823 30.16933 24.27111 25.1247
9.0 -0.24608 203.3234 0.54514 29.2194 23.39195 24.08147
9.4 -0.38487 204.2052 0.67135 28.15996 21.93255 23.14182
9.8 0.24015 205.34505 0.02243 27.69043 21.09075 21.99209
10.2 -0.09812 206.01068 0.00558 26.70091 20.40983 20.95615
10.6 0.29112 206.74048 -0.29492 25.34095 19.88988 20.13909
11.0 0.30161 207.72141 -0.65033 24.89198 19.72461 19.6973
11.4 0.44602 208.23083 -0.55106 23.89693 18.96735 18.53597
11.8 0.60044 208.99534 -0.48066 23.12706 17.90472 18.13364
12.2 0.37696 210.0706 -0.29747 22.6008 16.94926 17.18837
12.6 0.65399 210.72058 -0.05182 22.1797 15.95253 16.97199
13.0 0.02498 210.66781 -0.25915 21.46822 15.26124 16.39164
13.4 0.26109 210.36397 -0.61266 20.84997 14.64765 15.77926
13.8 -0.0494 210.50112 -0.86994 20.13563 14.37336 15.45486
14.2 0.19873 210.22999 -0.41186 19.10969 14.22104 14.77886
14.6 0.40226 210.50736 -0.34341 18.53742 13.91241 14.30308
15.0 0.65162 210.89786 -0.30936 17.96646 13.82832 13.49412
15.4 0.54264 210.78025 -0.33946 17.30135 13.31522 13.21041
15.8 0.70281 210.91473 -0.06629 16.86312 12.42015 12.82486
16.2 0.32102 211.1391 -0.0989 16.07009 12.10207 12.34951
16.6 -0.0119 210.50951 -0.03328 15.55648 12.17654 12.03195
17.0 -0.08749 211.35314 -0.40717 14.86041 11.29882 11.60108
17.4 0.38783 211.00194 0.02294 14.71733 11.5078 11.23758
17.8 0.41034 211.00518 -0.67206 14.31601 10.66269 11.05696
18.2 0.02353 210.13517 -0.80358 14.02609 10.04577 10.90297
18.6 -0.03922 209.97927 -0.79569 13.83557 9.94947 10.47211
19.0 0.05509 209.72392 -0.77318 13.32395 9.62106 10.49523
19.4 0.0645 210.13434 0.00442 12.86931 9.52386 9.66048
19.8 -0.15655 210.17767 0.00164 12.95084 8.83501 9.70074
