0.125 0.001 0.001 0.003
0.375 0.010 0.000 0.067
0.625 -0.001 -0.013 0.406
0.875 0.009 -0.025 1.203
1.125 0.010 -0.056 2.268
1.375 0.048 -0.051 3.239
1.625 0.066 -0.088 4.079
1.875 0.073 -0.096 4.841
2.125 0.047 -0.096 5.484
2.375 0.008 -0.146 5.944
2.625 0.084 -0.083 6.204
2.875 0.067 -0.107 6.511
3.125 0.029 -0.094 6.848
3.375 0.036 -0.201 6.982
3.625 0.057 -0.154 7.230
3.875 0.051 -0.177 7.382
4.125 0.000 -0.198 7.537
4.375 0.081 -0.177 7.685
4.625 0.098 -0.147 7.789
4.875 0.054 -0.180 8.115
5.125 0.026 -0.213 8.403
5.375 0.045 -0.194 8.814
5.625 0.012 -0.191 9.910
5.875 0.021 -0.262 11.702
6.125 0.056 -0.311 13.916
6.375 0.013 -0.366 16.247
6.625 0.010 -0.455 19.040
6.875 0.003 -0.444 20.760
7.125 0.001 -0.536 22.841
7.375 -0.002 -0.518 23.283
7.625 0.013 -0.526 23.119
7.875 -0.027 -0.502 21.868
8.125 0.005 -0.491 20.652
8.375 -0.014 -0.451 19.968
8.625 -0.036 -0.482 19.692
8.875 0.062 -0.450 19.425
9.125 -0.034 -0.489 20.426
9.375 -0.053 -0.480 20.832
9.625 -0.022 -0.516 21.517
9.875 -0.056 -0.546 21.773
10.125 -0.003 -0.566 22.091
10.375 -0.024 -0.495 21.540
10.625 -0.049 -0.464 20.332
10.875 -0.057 -0.428 20.008
11.125 -0.046 -0.413 18.957
11.375 -0.039 -0.372 17.807
11.625 -0.057 -0.342 17.282
11.875 -0.062 -0.312 16.510
12.125 -0.064 -0.261 15.769
12.375 -0.094 -0.270 15.463
12.625 -0.127 -0.241 14.165
12.875 -0.126 -0.219 13.470
13.125 -0.126 -0.226 12.804
13.375 -0.170 -0.229 12.399
13.625 -0.196 -0.235 12.274
13.875 -0.200 -0.269 11.685
14.125 -0.221 -0.289 11.637
14.375 -0.199 -0.329 10.996
14.625 -0.165 -0.337 10.465
14.875 -0.164 -0.336 10.123
