0.12500 0.01652
0.37500 0.03920
0.62500 0.06731
0.87500 0.11556
1.12500 0.15892
1.37500 0.21127
1.62500 0.26771
1.87500 0.32337
2.12500 0.34769
2.37500 0.37797
2.62500 0.42214
2.87500 0.42570
3.12500 0.45547
3.37500 0.49715
3.62500 0.50513
3.87500 0.52771
4.12500 0.54285
4.37500 0.54528
4.62500 0.57051
4.87500 0.58595
5.12500 0.59050
5.37500 0.60413
5.62500 0.60228
5.87500 0.61279
6.12500 0.60965
6.37500 0.62060
6.62500 0.57951
6.87500 0.57822
7.12500 0.54343
7.37500 0.53546
7.62500 0.47788
7.87500 0.46321
8.12500 0.44018
8.37500 0.40903
8.62500 0.38336
8.87500 0.37496
9.12500 0.38862
9.37500 0.34046
9.62500 0.36598
9.87500 0.37820
10.12500 0.35256
10.37500 0.33528
10.62500 0.29015
10.87500 0.26948
11.12500 0.22798
11.37500 0.15602
11.62500 0.13626
11.87500 0.11170
12.12500 0.09895
12.37500 0.09213
12.62500 0.09024
12.87500 0.09799
13.12500 0.05836
13.37500 0.09888
13.62500 0.06258
13.87500 0.09836
14.12500 0.06012
14.37500 0.09441
14.62500 0.03630
14.87500 0.05266
15.12500 0.02435
15.37500 0.02965
15.62500 0.05743
15.87500 0.03663
16.12500 0.07807
16.37500 0.09829
16.62500 0.07605
16.87500 0.08673
17.12500 0.07881
17.37500 0.09737
17.62500 0.16060
17.87500 0.08363
18.12500 0.09684
18.37500 0.11252
18.62500 0.12434
18.87500 0.08057
19.12500 0.09383
19.37500 0.08371
19.62500 0.08287
19.87500 0.08348
