0.05000 -2573.09175 -336.31812 2614.40135 2892.19710 3183.48861 4556.84928
0.15000 -5483.39769 -48.32590 1372.86793 3734.92262 3338.65933 8023.91876
0.25000 -7672.99248 130.17259 1328.47674 3886.38258 3595.34865 10087.38376
0.35000 -9158.59720 52.11858 313.59309 4064.86820 3969.69495 11492.62178
0.45000 -10030.94293 -68.57266 170.43059 4194.17264 4134.56246 12166.19861
0.55000 -10413.21035 98.41317 -120.76080 4236.17668 4303.20480 12292.76418
0.65000 -10652.22542 106.52550 -179.52252 4139.28809 4423.85195 11973.93047
0.75000 -10849.28437 -21.84394 -247.59074 4033.91876 4583.68699 11607.15185
0.85000 -10803.65341 -27.97800 -48.64173 3782.57625 4566.36580 11333.20306
0.95000 -10847.15200 -90.35637 -54.25477 3536.14774 4578.06852 10785.15610
1.05000 -10739.20507 -35.28498 -393.77789 3361.96866 4602.95077 10368.09434
1.15000 -10615.43283 -62.05192 -196.59477 3085.42356 4560.09752 9987.54920
1.25000 -10610.80728 -109.68008 -176.31149 2791.79132 4509.96684 9475.75780
1.35000 -10440.11452 -45.44361 -293.16753 2623.38038 4483.80149 9051.23398
1.45000 -10305.40974 -56.82079 -152.52551 2493.48022 4443.89091 8641.86790
1.55000 -10180.62358 -31.76336 -35.53002 2334.81780 4346.56028 8310.04844
1.65000 -10034.53125 -115.86610 -30.11924 2179.94980 4270.32476 8000.88432
1.75000 -9862.57650 -41.76354 -219.78057 2038.21914 4211.34466 7754.44321
1.85000 -9742.87103 -138.24835 -125.99439 1863.92760 4138.96152 7440.59984
1.95000 -9600.26138 -113.49883 52.60549 1737.46895 4076.34985 7080.23518
2.05000 -9429.26382 -111.20386 47.36202 1657.78273 3980.34377 6978.22778
2.15000 -9279.89931 -84.41528 14.62460 1536.54727 3937.00150 6757.39336
2.25000 -9150.15754 -149.37450 43.44098 1454.78704 3835.32883 6488.80410
2.35000 -9006.49865 -114.57800 10.89674 1339.21579 3719.73164 6372.27654
2.45000 -8866.54783 -29.88230 -53.98353 1307.50452 3636.79252 6128.46560
2.55000 -8810.13559 -104.95609 -34.73130 1206.78974 3585.05560 5933.82212
2.65000 -8709.73933 -75.98881 27.21883 1131.08684 3489.65197 5731.96118
2.75000 -8519.52168 -51.26742 23.01412 1087.46803 3369.17466 5633.63244
2.85000 -8378.53127 -44.64611 -12.08819 986.78828 3294.81213 5452.01806
2.95000 -8308.05140 -54.53416 61.06625 1037.12104 3221.56858 5337.33512
3.05000 -8246.60022 -21.12555 107.46206 889.20593 3105.56788 5158.30908
3.15000 -8180.85555 -70.85556 -48.53317 905.18796 3035.01949 4973.44446
3.25000 -8083.99019 -5.72331 -8.67842 892.81706 2932.11416 4898.29670
3.35000 -8025.43614 -66.04083 3.14206 884.04660 2853.56026 4696.93611
3.45000 -7947.96526 -61.23001 129.77996 822.41120 2747.10903 4534.38492
3.55000 -7892.76345 4.22926 -14.37815 858.50547 2670.44920 4445.32137
3.65000 -7836.88941 -16.45261 39.99844 826.25946 2518.34117 4238.84892
3.75000 -7745.79393 -2.92639 63.91432 855.35216 2436.57814 4112.94060
3.85000 -7677.78178 32.10488 83.65334 880.93397 2352.63161 3955.40343
3.95000 -7571.25239 28.93561 59.30470 901.38949 2218.18870 3866.31912
4.05000 -7496.32946 45.33491 173.12283 869.10004 2128.16157 3691.84951
4.15000 -7404.72418 48.30456 132.57174 848.86435 2053.35670 3603.43611
4.25000 -7299.02838 16.46649 66.20838 851.04527 1960.54720 3482.19335
4.35000 -7235.95695 58.97559 95.40985 822.93259 1903.73001 3407.73589
4.45000 -7175.71795 -11.92106 99.70167 823.85727 1865.69650 3225.02379
4.55000 -7111.62628 8.25246 -17.16714 779.07483 1764.14928 3205.71218
4.65000 -7068.50340 -11.76877 30.76597 795.77830 1697.97656 3078.72802
4.75000 -7058.89772 -52.32307 29.97883 799.08880 1665.02616 2991.58030
4.85000 -7074.02748 -92.56045 57.26734 801.41699 1623.72039 2941.42991
4.95000 -7079.61726 -75.70637 55.79150 864.46605 1535.64084 2885.70577
5.05000 -7103.03483 -135.33397 -7.77579 871.36688 1477.19861 2782.56494
5.15000 -7139.88700 -68.96742 43.73071 915.96175 1401.50241 2705.77400
5.25000 -7180.82921 -108.73973 44.67614 1014.99144 1351.22184 2632.43213
5.35000 -7181.07431 -62.72507 46.07298 1134.32828 1301.52996 2535.43598
5.45000 -7194.27866 -63.03444 8.74676 1120.24903 1242.25556 2410.18102
5.55000 -7179.39771 -50.15878 59.71474 1168.89183 1150.97508 2323.53888
5.65000 -7149.19909 -52.01268 79.90426 1199.21332 1101.86157 2212.95853
5.75000 -7086.00550 -15.94656 25.69537 1224.38380 1056.55691 2141.35643
5.85000 -7012.38791 -8.69429 -14.65585 1197.29538 933.26887 2045.35156
5.95000 -6901.35961 7.07375 27.61391 1208.34344 880.81896 1908.92508
6.05000 -6780.71095 34.89540 37.75090 1208.84943 808.93780 1840.30608
6.15000 -6632.32568 25.77293 25.40239 1083.28609 744.17962 1710.14840
6.25000 -6519.78901 37.93891 9.67073 1032.33165 683.56796 1649.11322
6.35000 -6411.67440 35.42160 22.20678 1014.03167 652.36385 1564.58074
6.45000 -6286.03525 57.48914 43.05292 891.18902 640.76175 1500.93167
6.55000 -6186.53831 62.99914 50.17606 827.00825 562.64094 1431.21430
6.65000 -6119.38936 61.73997 34.00527 794.76511 523.97255 1395.14330
6.75000 -6043.23629 49.52803 21.20878 739.82081 545.15936 1374.39062
6.85000 -5972.50286 54.79955 43.30233 721.41228 570.58421 1309.15778
6.95000 -5905.36881 68.04468 33.32092 656.10944 456.08021 1279.30352
7.05000 -5876.19381 44.35124 37.83982 655.32473 467.80970 1256.72059
7.15000 -5797.00545 53.89295 16.78580 594.02771 428.57275 1179.04967
7.25000 -5751.82689 52.99107 53.04554 565.35043 413.62526 1170.35238
7.35000 -5689.15838 50.65854 58.46038 530.59729 468.11395 1123.63069
7.45000 -5632.18345 49.51785 74.41481 578.57963 467.54596 1102.71919
7.55000 -5586.30867 48.35211 50.97321 459.04163 360.31182 1054.69702
7.65000 -5539.66769 35.97302 17.41512 443.21811 332.63292 1016.71019
7.75000 -5477.06944 35.36314 50.17573 435.84050 433.25759 992.60003
7.85000 -5422.52284 43.22687 30.51970 404.80801 393.83818 984.28501
7.95000 -5382.60167 34.07186 19.61347 385.19684 321.44887 944.38306
8.05000 -5330.42435 6.58866 18.68109 415.64914 427.79905 941.59130
8.15000 -5279.74865 18.08135 31.66460 376.86211 283.71275 940.30066
8.25000 -5214.83296 19.01629 5.65089 352.81994 334.27364 867.37713
8.35000 -5165.07478 11.15754 7.44596 324.73570 322.17105 836.84737
8.45000 -5124.52803 3.85884 4.33175 429.28225 265.72325 812.08740
8.55000 -5055.31349 3.72617 -2.62641 314.20089 325.53410 788.60190
8.65000 -4993.98849 12.05503 -11.13079 334.86525 257.92612 770.61131
8.75000 -4951.85908 3.65696 -27.13154 320.41035 228.39714 760.23209
8.85000 -4897.31008 3.48071 8.86650 322.12716 230.93109 729.67269
8.95000 -4850.73006 12.08504 -15.50299 367.47676 289.64883 720.22030
9.05000 -4810.92581 0.82907 -20.07089 315.72938 250.17247 682.12769
9.15000 -4756.87981 1.69670 -18.16283 293.38816 212.57011 668.12081
9.25000 -4698.45289 -3.93998 -1.99346 273.46216 218.08180 645.59283
9.35000 -4633.29839 6.81535 -41.08498 302.01196 275.81685 637.90379
9.45000 -4599.92313 6.96263 -39.81648 265.33555 199.32730 624.15355
9.55000 -4564.27385 3.99406 -37.49231 288.14455 234.30566 609.89839
9.65000 -4514.54096 4.36323 -23.15928 300.23657 232.99586 602.86863
9.75000 -4465.02749 3.00137 -34.34977 243.61877 175.54732 573.50944
9.85000 -4410.39985 9.16356 -42.21714 234.28589 143.37848 554.91315
9.95000 -4367.49585 15.96147 -33.90772 250.83954 180.82073 536.84775
10.05000 -4330.71713 10.52572 -32.65531 231.47201 165.59393 525.56413
10.15000 -4281.97429 9.66055 -49.09399 247.29725 159.10686 508.56921
10.25000 -4234.60474 13.64435 -38.83459 237.67783 153.49997 497.81318
10.35000 -4193.70065 8.26190 -16.09950 232.13825 246.73927 501.39483
10.45000 -4152.36547 3.72700 -39.15000 247.22224 388.00329 553.00979
10.55000 -4113.51614 14.85321 -41.11246 227.96509 128.60042 475.16093
10.65000 -4072.83815 17.34586 -22.07811 226.55816 131.05261 469.60714
10.75000 -4036.48485 15.10122 -38.38200 268.16518 118.94811 487.80008
10.85000 -3994.99762 17.35361 -50.46358 215.63598 370.17784 468.87801
10.95000 -3952.29865 8.15702 -30.33654 219.85009 132.32156 446.38080
11.05000 -3932.34276 3.00004 -29.13965 220.78576 312.29994 446.92072
11.15000 -3893.94533 8.06794 -40.16830 198.51686 108.62072 484.94723
11.25000 -3860.19455 11.35703 -32.98506 189.61131 126.99041 421.91363
11.35000 -3819.81921 7.14553 -47.67274 184.04604 211.75918 438.88781
11.45000 -3799.12244 9.48054 -19.57996 183.16040 109.72184 409.83539
11.55000 -3770.41361 8.36909 -42.04094 199.11037 126.84301 409.44558
11.65000 -3734.36776 11.63489 -45.42739 171.85341 165.47395 403.46460
11.75000 -3708.05199 15.96530 -36.98392 161.21649 139.23587 398.97403
11.85000 -3687.36415 11.05169 -37.54430 147.26952 116.22878 382.97529
11.95000 -3649.56333 8.63522 -39.30029 140.50628 117.22116 380.41218
12.05000 -3625.29042 9.94951 -46.64721 163.38606 126.98462 388.70197
12.15000 -3601.35470 18.87341 -33.96413 155.30160 172.72403 376.73363
12.25000 -3578.98142 12.07278 -51.88606 146.38375 145.94862 382.08170
12.35000 -3538.06763 10.26688 -48.52640 251.26354 213.75325 371.02088
12.45000 -3521.48277 9.97020 -57.81934 118.04296 83.05617 351.65104
12.55000 -3497.66993 9.00788 -40.09262 165.67565 185.33096 434.96512
12.65000 -3473.55049 7.06535 -45.12071 148.18650 115.47555 339.08179
12.75000 -3451.17682 13.57533 -49.83622 112.28206 138.24564 342.43483
12.85000 -3429.28307 4.49173 -41.39497 113.60875 120.20197 325.94311
12.95000 -3407.35737 13.35513 -53.64323 173.96013 221.91557 341.27380
13.05000 -3385.39755 4.72492 -31.46537 138.30933 113.22568 322.93548
13.15000 -3364.18933 7.83542 -34.89712 111.60653 89.66169 289.64500
13.25000 -3344.53347 4.51427 -7.77553 182.76652 246.65782 403.35909
13.35000 -3318.09428 8.15882 -41.60391 127.48343 100.18137 284.46102
13.45000 -3292.54782 5.74735 -27.75129 85.37461 71.60321 285.39984
13.55000 -3270.12167 7.93487 -31.97070 78.57992 59.32053 259.46954
13.65000 -3245.68208 5.03904 -27.54097 101.98956 101.06543 272.93254
13.75000 -3225.42847 10.32096 -36.22491 106.79241 112.67161 270.41927
13.85000 -3190.79599 5.45591 -31.85532 112.87116 88.68206 251.43008
13.95000 -3174.24164 6.73971 -29.92468 74.16383 67.63843 260.38483
14.05000 -3157.32237 3.71773 -33.69072 165.72488 79.62549 274.03117
14.15000 -3125.73524 7.09915 -22.92629 149.77582 151.96805 234.11154
14.25000 -3108.31773 7.03486 -28.47012 134.63008 108.24041 253.43192
14.35000 -3082.72602 8.40164 -19.88754 99.15745 143.48493 291.15679
14.45000 -3059.50835 1.25806 -21.02465 151.62198 147.16495 245.27758
14.55000 -3044.78719 4.08906 -18.35173 186.07757 66.64938 213.41314
14.65000 -3025.72162 1.86051 -25.28450 79.39352 125.71610 224.40056
14.75000 -2997.65458 3.48768 -20.33262 68.22940 79.18451 213.83600
14.85000 -2976.15345 2.74191 -32.39035 62.34086 81.96829 194.63260
14.95000 -2958.96890 5.66047 -35.46647 76.55894 87.89498 200.08884
15.05000 -2937.08163 -0.56420 -21.03961 101.14451 60.97893 192.29985
15.15000 -2918.72585 3.36006 -24.95548 57.20145 55.55476 185.55149
15.25000 -2898.34565 2.90714 -9.41608 80.27960 50.53345 244.76451
15.35000 -2878.34732 2.91015 -25.35667 59.89909 81.06073 182.03833
15.45000 -2856.58857 1.26446 -33.23007 54.84439 43.40306 175.35512
15.55000 -2834.40947 -1.70411 -16.74864 63.42844 75.62075 181.99298
15.65000 -2816.08669 0.54092 -20.92751 71.46307 76.58766 164.94591
15.75000 -2795.83115 -0.10693 -16.66955 57.98473 52.09254 160.40733
15.85000 -2774.02183 1.89863 -19.19878 60.34112 58.32115 157.53073
15.95000 -2758.02550 9.72964 -27.14388 88.70178 169.73376 194.84043
16.05000 -2742.68299 -0.19395 -15.02625 53.30239 65.71537 148.06053
16.15000 -2723.05146 2.57830 -10.80532 92.97098 122.34476 176.45134
16.25000 -2709.31106 10.87993 -4.95828 87.98732 104.02865 155.33865
16.35000 -2685.43525 1.57960 2.53664 52.33415 61.25619 144.73043
16.45000 -2672.42790 -1.16712 -10.71663 43.32524 47.59400 132.80273
16.55000 -2649.91197 -1.34256 -2.62689 145.13354 92.12575 146.47310
16.65000 -2639.84922 -1.64060 -9.56512 62.40092 124.94133 143.58849
16.75000 -2623.82995 -0.40660 -14.93879 64.73529 58.91953 147.92702
16.85000 -2602.30919 4.89564 -8.03994 48.05336 55.48499 134.43419
16.95000 -2588.76574 -1.20956 -12.52174 56.93119 62.81106 131.47916
17.05000 -2570.45698 -0.20480 -9.56508 48.49209 44.66575 119.89724
17.15000 -2549.03669 0.45651 -6.52340 110.18998 69.91901 120.12857
17.25000 -2536.84240 1.60465 -11.71504 82.16836 59.07713 126.21356
17.35000 -2522.37917 0.86753 -18.46106 57.73247 37.70267 115.25607
17.45000 -2505.55673 -0.24126 -24.08645 55.93331 60.59163 243.99314
17.55000 -2487.80507 3.82507 -18.96486 63.81004 55.49025 132.38192
17.65000 -2471.78076 -1.87390 -14.74903 78.97365 53.75565 120.07220
17.75000 -2454.57809 -7.67098 -22.42461 143.09049 70.89523 150.55546
17.85000 -2448.80298 10.38649 -7.47819 124.28884 158.41978 133.33480
17.95000 -2432.95462 -0.10352 -3.50100 37.77055 52.94509 112.56151
18.05000 -2422.70839 0.64801 -5.94911 35.59166 33.80303 108.70459
18.15000 -2402.85575 2.15262 -20.66526 65.60430 37.96940 103.60861
18.25000 -2386.35757 4.61571 -26.87700 29.65965 39.42082 103.14523
18.35000 -2373.31754 3.60585 -18.04148 37.93516 40.09250 106.96619
18.45000 -2361.84280 4.06712 -20.47194 43.45580 26.62439 94.69820
18.55000 -2346.86062 3.29752 -15.62938 47.42119 46.46476 117.30069
18.65000 -2329.82217 3.89495 -24.50953 159.73526 31.74470 157.96947
18.75000 -2315.33092 3.94227 -23.57894 34.37644 32.35553 95.11039
18.85000 -2303.69864 1.44009 -19.25835 33.98406 33.35817 91.54453
18.95000 -2291.36207 -1.37892 -20.94938 39.31366 56.57694 102.63364
19.05000 -2276.02535 4.27760 -29.66902 36.04335 28.25081 86.40340
19.15000 -2264.43370 0.87147 -27.33019 29.71343 38.33100 96.08553
19.25000 -2250.61893 0.94359 -25.43874 44.57591 41.70322 86.20661
19.35000 -2238.72535 7.36209 -25.34779 33.63714 30.75266 83.95614
19.45000 -2224.36936 -2.10585 -12.45308 36.48269 33.16047 91.14497
19.55000 -2203.22710 0.39996 39.76752 163.49799 87.27451 730.84030
19.65000 -2198.95979 1.73710 -22.88751 39.85056 39.98027 88.69593
19.75000 -2185.36218 -1.00743 -28.36115 59.17922 54.99794 104.76607
19.85000 -2141.06801 -17.65233 -43.15916 327.16783 204.49002 190.00262
19.95000 -2163.59258 -0.87104 -24.83541 35.98540 30.39580 80.69280
