0.2 -0.02228 11.34311 1.17418 124.19197 123.48144 97.82294
0.6 -0.69501 29.07339 1.05422 123.765 116.95895 93.79537
1.0 -0.08701 42.85255 0.05318 123.70901 110.09987 89.22171
1.4 -0.23224 56.25808 0.66917 124.53172 102.06338 83.72133
1.8 -0.43505 62.45989 -0.32091 125.04679 96.87777 78.88094
2.2 0.51895 68.01313 0.38974 124.47777 91.37601 75.35498
2.6 -1.07424 70.98204 -0.53871 122.83482 86.14556 71.64228
3.0 1.09569 76.77932 -0.25971 119.70924 82.3505 67.48268
3.4 -1.11107 79.22467 0.58267 116.72294 79.98552 64.71545
3.8 -1.1037 80.33949 -0.59299 113.46789 76.58008 61.52768
4.2 -1.47862 83.51146 -0.94692 108.78571 73.35478 59.31052
4.6 0.06439 85.50262 -1.88833 105.52707 72.24184 56.65861
5.0 0.82802 87.89664 -0.33375 99.79319 69.41642 53.61031
5.4 -0.51522 90.15546 -1.58324 97.40955 67.04886 51.99252
5.8 -0.03476 95.7119 -1.37041 92.9046 66.81362 49.27347
6.2 3.27353 100.01374 -0.94539 89.32494 66.32703 47.59026
6.6 -0.45964 104.86401 -0.51858 82.21434 67.75648 45.37902
7.0 1.44821 113.72628 -0.23557 75.83917 68.31471 43.16147
7.4 2.58967 123.85471 -1.74053 70.29791 68.17892 41.16805
7.8 0.34491 133.64718 -0.4212 63.91941 67.23709 38.77504
8.2 -0.26319 144.09551 0.16317 56.93998 66.23315 35.39351
8.6 0.36948 154.22909 -1.42702 50.95119 63.53007 32.55216
9.0 1.4212 162.41659 -1.32657 45.96735 59.63585 30.61975
9.4 0.92147 171.04343 -1.27147 40.33855 52.19238 28.69721
9.8 2.03651 175.29882 -0.27019 36.4833 46.41111 26.53436
10.2 0.47561 181.03701 1.38883 32.8264 39.45658 24.58257
10.6 -0.14443 186.33399 1.39238 31.02976 34.58767 23.58728
11.0 0.68823 189.33169 1.18763 27.91861 31.76779 22.34919
11.4 -1.2046 194.18677 1.78356 27.44803 25.33904 20.60449
11.8 -0.15963 196.46869 1.63471 26.30508 21.00081 20.519
12.2 -0.41368 197.12334 1.41601 25.58372 19.08897 19.65221
12.6 1.062 197.09759 0.57476 24.81347 18.48285 18.87866
13.0 0.11794 197.01553 1.1763 23.92016 18.13174 18.14449
13.4 0.65693 197.20574 0.96121 23.50801 18.51594 17.57351
13.8 0.8718 197.17597 1.10646 23.25518 18.06395 16.27593
14.2 0.36146 197.60705 1.62897 21.32625 18.31277 16.55365
14.6 0.02891 198.30113 -0.12204 20.47621 18.08401 16.55374
15.0 0.74119 200.53605 0.76576 21.05096 17.70269 15.46761
15.4 1.37878 201.31586 0.46281 19.40226 17.33891 15.90376
15.8 0.70435 202.74305 1.29456 19.81292 15.95012 16.0091
16.2 0.15399 202.81949 2.17163 19.18719 15.15278 14.70416
16.6 -0.24039 203.07107 1.58985 19.23891 13.27222 15.05939
17.0 -0.62863 203.24031 2.12756 17.24252 13.12207 14.14919
17.4 1.38847 203.40069 2.3476 17.68108 12.66693 14.10006
17.8 0.37553 201.77834 3.32276 17.21283 12.5038 13.11696
18.2 0.40019 202.92028 2.89526 17.52267 12.8866 13.32391
18.6 0.82961 202.65007 3.25594 17.31199 12.96681 13.33929
19.0 0.11988 202.90362 2.58306 16.18321 12.09936 12.86693
19.4 1.16641 202.046 1.13315 17.06606 12.09742 12.65275
19.8 1.89972 202.9771 0.14931 16.56474 12.769 12.95339
