0.05000 -1376.59862 -17.53698 -551.68881 1248.54119 932.61278 1765.31223
0.15000 -2645.36121 104.97217 -149.87869 1604.93564 1145.85868 2867.80958
0.25000 -4128.67807 52.45121 -207.90288 1948.57921 1362.81492 4345.35496
0.35000 -5278.36266 124.31780 -212.68227 2198.95399 1589.78472 5542.98523
0.45000 -6244.30631 164.77247 -15.62128 2406.10870 1861.53091 6601.41789
0.55000 -6986.93666 176.99475 -240.00493 2570.99560 2036.48114 7548.25995
0.65000 -7537.78249 137.50084 -138.35251 2760.24115 2220.66066 8222.56231
0.75000 -7976.84324 161.43414 77.07367 2807.56538 2323.34384 8629.09450
0.85000 -8264.75980 189.85167 40.22444 2892.06625 2444.20808 9075.51459
0.95000 -8467.40641 168.91990 -9.28413 2875.64252 2524.15027 9220.80105
1.05000 -8642.97584 168.73498 178.64130 2856.22608 2569.23163 9313.32562
1.15000 -8813.21622 162.63986 -193.62418 2759.38131 2596.90983 9223.09872
1.25000 -9000.50688 158.21772 121.50338 2721.56704 2626.35708 9117.99320
1.35000 -9182.02611 144.65743 -127.39305 2664.89296 2635.30933 8919.90164
1.45000 -9256.01945 167.16403 -55.39191 2597.96039 2615.84306 8764.32970
1.55000 -9327.08310 143.77760 37.93902 2508.38607 2555.29947 8531.16848
1.65000 -9399.71847 118.93986 -181.28271 2353.76010 2509.72935 8255.34369
1.75000 -9376.74169 180.03408 93.51679 2288.66895 2465.61208 8052.71878
1.85000 -9363.46177 67.86034 47.00958 2175.65984 2416.18560 7803.33221
1.95000 -9334.32315 126.80667 78.93330 2080.08068 2365.40796 7567.13243
2.05000 -9283.83191 124.53470 14.62989 1997.62401 2304.28528 7324.03094
2.15000 -9260.22542 116.34798 -82.68035 1914.32150 2240.08670 7053.31940
2.25000 -9238.96687 127.94589 -59.45211 1794.98850 2200.89508 6764.01614
2.35000 -9129.69725 95.09775 -90.73498 1757.13851 2112.02684 6581.39847
2.45000 -9072.18191 60.62152 87.14215 1659.03388 2073.59452 6322.62189
2.55000 -8981.96204 96.97796 -67.16090 1568.78127 2025.23156 6098.10842
2.65000 -8890.31075 50.95238 -11.12312 1523.73481 1971.43170 5895.16047
2.75000 -8834.21847 85.17269 -53.31805 1414.57720 1936.42256 5664.94737
2.85000 -8735.40766 65.93146 -8.32505 1395.49229 1877.96238 5454.42716
2.95000 -8654.29575 29.14410 -13.23671 1343.38517 1824.19492 5283.70659
3.05000 -8593.80644 38.52057 16.21475 1251.47720 1795.47098 5029.53448
3.15000 -8473.87721 93.03889 -117.95671 1217.25395 1757.04307 4899.05538
3.25000 -8340.34245 52.73705 -79.93928 1200.64777 1694.08492 4821.38530
3.35000 -8286.63028 65.92256 -43.81339 1105.83907 1681.42259 4630.36557
3.45000 -8201.05816 43.19036 88.49185 1096.01294 1635.31063 4501.90873
3.55000 -8152.64583 14.90933 63.76929 1018.70408 1601.47828 4317.60729
3.65000 -8040.46595 36.66394 0.26664 1008.61281 1566.94702 4271.03897
3.75000 -7956.86078 70.15110 -7.99313 1004.66540 1524.26343 4120.43201
3.85000 -7882.15235 77.30406 1.16253 937.71414 1485.00785 4027.75917
3.95000 -7787.52645 42.36722 -0.49390 942.89076 1441.31990 3981.78327
4.05000 -7734.79277 37.10062 77.66522 913.73685 1404.19482 3799.95543
4.15000 -7667.29920 71.99666 69.88339 857.63124 1357.61107 3693.68329
4.25000 -7583.41294 77.21524 85.16046 859.96351 1318.24400 3603.83062
4.35000 -7531.21316 60.52496 66.24210 840.08308 1290.02062 3500.23670
4.45000 -7445.37831 50.99682 42.77967 837.32755 1233.24733 3458.16275
4.55000 -7390.41910 31.28354 35.86846 837.12576 1211.80340 3337.02090
4.65000 -7325.81832 48.22701 22.34071 838.14960 1170.06186 3245.20972
4.75000 -7284.97740 18.11461 157.60207 801.94846 1129.60792 3120.41248
4.85000 -7206.51334 34.06759 30.00288 831.19317 1092.97142 3068.64350
4.95000 -7126.07032 37.18698 47.88829 805.71388 1050.11757 2982.17533
5.05000 -7072.22211 68.68421 -7.59059 775.72386 1012.10463 2891.02242
5.15000 -6999.11725 57.61599 -41.88471 776.73841 977.90150 2802.34249
5.25000 -6928.39788 41.91108 20.93867 771.75307 938.52467 2729.70885
5.35000 -6852.45752 70.37890 29.71934 780.42333 893.54058 2693.15644
5.45000 -6784.78095 56.98861 37.21625 760.73041 868.49179 2588.46953
5.55000 -6701.61748 71.94979 15.19766 756.01669 824.64944 2512.16719
5.65000 -6629.39850 63.38037 -11.67635 744.23814 780.36969 2438.27495
5.75000 -6546.84047 86.94655 57.35808 760.64473 748.57714 2404.94836
5.85000 -6458.14203 75.37484 27.20581 736.16698 716.77109 2277.60946
5.95000 -6374.92605 83.91395 5.42547 749.22870 678.97345 2206.21512
6.05000 -6279.97094 78.04314 -57.99579 727.32969 649.03561 2159.20225
6.15000 -6169.01509 112.20399 0.33008 713.35679 604.39598 2081.57996
6.25000 -6085.11935 99.74743 13.05892 696.89922 575.43275 2034.85979
6.35000 -5994.58382 82.58497 8.97224 681.36265 552.11379 1955.69481
6.45000 -5888.20221 103.85022 15.30338 660.36164 522.38322 1894.02186
6.55000 -5802.81953 103.22509 22.56436 639.82808 501.29920 1848.00444
6.65000 -5720.54342 90.70739 16.19207 616.20281 477.33747 1814.29291
6.75000 -5643.45708 98.95179 21.27431 585.72105 453.85322 1762.67024
6.85000 -5565.62172 96.75002 -6.31166 565.34014 432.83452 1709.65925
6.95000 -5479.71776 92.72021 9.91563 538.00788 419.72724 1638.43293
7.05000 -5432.87951 81.64940 10.79377 525.72388 397.38654 1586.91475
7.15000 -5367.20518 93.80635 -12.06863 505.68911 373.28170 1539.71430
7.25000 -5298.78515 75.24100 -0.81451 483.77381 366.91672 1491.97971
7.35000 -5233.89409 80.91059 -11.74524 457.43097 347.05602 1489.02606
7.45000 -5175.81658 77.38873 -0.99441 435.97772 331.46106 1435.73832
7.55000 -5143.09696 78.73558 -12.85565 431.98307 317.32897 1400.05969
7.65000 -5096.38702 67.72225 -31.25561 412.39571 304.34001 1346.94800
7.75000 -5054.92010 66.70861 -29.90728 406.02693 293.08753 1319.34857
7.85000 -4995.98763 62.97412 37.21228 388.83935 291.90171 1283.04674
7.95000 -4960.74727 62.40273 -24.17389 375.26860 274.62887 1223.11462
8.05000 -4928.09042 50.24935 -45.70633 365.66583 264.10875 1208.35292
8.15000 -4882.57438 64.54632 -21.73964 354.32381 250.83325 1187.57578
8.25000 -4854.39619 55.47540 -7.59480 335.57586 251.21911 1152.99811
8.35000 -4823.70766 52.88976 28.68775 327.42581 238.07132 1128.25934
8.45000 -4792.36660 52.91750 -28.86962 321.35035 227.56794 1104.31103
8.55000 -4771.39117 54.64039 -27.33585 306.48559 222.66899 1088.41758
8.65000 -4725.91093 52.14573 3.27368 292.48407 213.22147 1056.36419
8.75000 -4687.01251 51.82819 -3.20214 286.37265 207.88581 1047.08341
8.85000 -4667.19105 40.99112 4.74461 267.95684 197.71046 1009.38179
8.95000 -4630.76056 54.36633 2.55366 257.95076 194.12414 1002.45066
9.05000 -4611.48655 45.94179 16.18463 253.51728 189.50816 974.12204
9.15000 -4574.30149 37.10684 -14.29050 245.92779 181.46042 972.33971
9.25000 -4549.34060 42.02449 0.46653 241.12730 174.07969 949.28773
9.35000 -4506.06322 39.08261 -17.08378 234.06155 168.84786 944.14769
9.45000 -4483.07736 34.61446 2.05576 222.65764 168.04825 913.63590
9.55000 -4456.60770 34.22500 8.56873 211.40130 161.98029 890.04173
9.65000 -4433.07188 34.48296 3.54004 211.38474 158.45192 878.33043
9.75000 -4401.00657 32.34917 15.65276 206.28689 156.41354 856.70861
9.85000 -4367.32757 30.88368 5.42929 201.68067 149.73079 850.41129
9.95000 -4346.73180 32.89937 13.14145 197.29361 145.16341 824.12365
10.05000 -4317.80515 28.09800 -10.19508 191.65782 143.13372 817.72092
10.15000 -4291.31931 29.77160 -12.80166 186.17451 138.78125 808.75268
10.25000 -4253.74917 26.61387 -9.25042 176.89018 132.35103 779.09071
10.35000 -4228.00070 25.75340 -25.31309 167.33294 128.91675 771.40619
10.45000 -4202.27787 28.80591 18.97925 167.85798 123.44862 760.72604
10.55000 -4169.70932 25.11407 -10.99335 159.92455 121.93026 738.02771
10.65000 -4136.25726 23.15093 -9.10979 153.28257 117.39514 718.48473
10.75000 -4105.53626 29.90906 12.85400 150.58452 112.04051 725.05786
10.85000 -4080.15289 26.52108 7.40934 144.28422 113.51450 695.34677
10.95000 -4046.69908 26.34288 2.88134 142.81796 109.94182 693.65448
11.05000 -4022.06959 22.93333 0.31729 137.40036 105.08936 673.96705
11.15000 -3989.17409 21.16624 -6.54296 135.81206 101.47006 669.49562
11.25000 -3963.06572 20.10970 6.84971 142.96427 98.06686 653.58473
11.35000 -3934.34626 22.97756 -4.87425 129.43708 98.31931 641.21474
11.45000 -3903.59412 25.48575 5.84706 128.64970 95.55604 632.41959
11.55000 -3878.96742 22.98463 -7.24359 121.40489 91.76339 608.85638
11.65000 -3849.80862 21.38556 -28.33645 123.39803 90.15728 614.05440
11.75000 -3825.35811 21.12772 38.06868 122.65391 88.38072 601.29868
11.85000 -3799.75287 21.14413 9.87972 122.05782 86.09604 594.10870
11.95000 -3771.33572 20.09317 -8.98527 120.26671 85.69838 583.94616
12.05000 -3736.61033 24.13484 3.15476 123.26469 83.51366 570.86300
12.15000 -3717.45322 17.93851 22.78180 114.82857 79.12579 558.77579
12.25000 -3694.54672 20.68694 6.11468 114.24711 77.92116 542.23649
12.35000 -3665.93511 21.00975 -2.26552 119.23377 74.95984 543.60147
12.45000 -3641.04588 19.61316 14.00245 116.20198 74.06261 540.99029
12.55000 -3620.77246 17.08847 24.98158 116.40882 73.53906 513.94956
12.65000 -3597.51295 20.16524 -4.15051 124.97531 68.51971 514.55957
12.75000 -3570.32359 21.61033 18.90859 116.13058 68.02113 498.99293
12.85000 -3546.22991 19.24343 6.29719 117.12508 64.88549 502.63023
12.95000 -3526.37246 18.65915 1.13747 116.67173 62.80929 486.29954
13.05000 -3506.40894 20.24143 6.37549 116.38625 61.64819 473.31473
13.15000 -3485.09218 20.26322 -11.17357 113.17006 60.37751 473.34282
13.25000 -3458.30792 20.62187 9.05216 115.00143 59.43252 467.87845
13.35000 -3442.17805 22.91524 -4.15895 110.20456 56.11285 450.93190
13.45000 -3419.35029 20.41776 12.39585 111.92031 56.01304 451.55028
13.55000 -3399.93622 20.11438 10.01545 108.90303 54.72650 442.39991
13.65000 -3376.25372 21.77558 8.45002 110.43541 52.65047 436.65650
13.75000 -3355.87723 20.60305 15.27001 109.52949 50.21438 423.12581
13.85000 -3329.71560 20.01270 -6.17637 108.03280 48.05881 420.12879
13.95000 -3311.12405 20.36291 16.44943 104.99013 48.01958 419.91732
14.05000 -3284.59641 17.34458 0.46034 105.45411 47.35868 417.96042
14.15000 -3267.73489 17.34876 22.80430 101.29966 45.43707 399.10624
14.25000 -3246.51831 18.73818 10.96906 99.30245 43.80408 398.49081
14.35000 -3226.84966 16.74567 10.76735 96.15968 43.02466 387.16213
14.45000 -3204.58741 16.20494 7.02047 94.40269 41.45540 381.88290
14.55000 -3182.52865 16.17715 -7.72510 90.88704 39.62450 383.47769
14.65000 -3164.39431 16.06705 6.93900 91.41247 39.61967 380.34543
14.75000 -3142.45136 15.18132 5.10916 86.13190 37.44731 363.12177
14.85000 -3122.00084 15.15631 -15.58279 81.90851 37.26194 357.03195
14.95000 -3104.82856 14.11862 -1.05780 79.21515 37.07328 349.89927
15.05000 -3084.40416 12.08237 12.75169 77.68461 36.41782 353.59024
15.15000 -3063.00365 15.08539 3.89558 72.70936 34.97892 336.34331
15.25000 -3044.45581 13.41640 -5.97306 71.34207 33.01742 334.81249
15.35000 -3024.00480 13.67138 -3.83683 70.01396 34.24120 340.84736
15.45000 -3006.56199 13.56416 8.25710 67.08754 33.90529 333.99704
15.55000 -2982.67834 12.08036 -10.83266 66.80117 33.44837 332.19257
15.65000 -2968.16017 13.63726 -4.12013 62.96542 32.48681 330.25772
15.75000 -2953.53968 12.26660 6.55891 59.11936 31.58986 312.87740
15.85000 -2934.94905 12.94708 -2.51025 57.47021 30.19468 309.83212
15.95000 -2917.37792 12.54315 -6.70518 53.75974 30.33105 310.09247
16.05000 -2902.54388 12.17104 -5.63400 53.15790 30.80724 289.45379
16.15000 -2884.56813 13.00802 -8.89753 51.70709 31.86381 294.39666
16.25000 -2865.92990 13.08708 -1.53749 52.47483 29.01544 296.43499
16.35000 -2847.38227 12.62448 -8.36663 49.64010 29.15266 289.94757
16.45000 -2831.07485 10.76810 -6.56387 50.77443 29.56263 282.01428
16.55000 -2812.82000 11.31098 1.93329 46.62050 29.17830 273.82386
16.65000 -2797.66642 10.89017 15.09659 45.15211 28.95455 279.89857
16.75000 -2780.66642 11.14596 -5.09991 46.63073 29.84548 275.95459
16.85000 -2767.18721 11.22068 -4.48173 61.24143 31.02095 273.26054
16.95000 -2752.48939 10.77639 -8.24399 43.08547 29.37206 264.80018
17.05000 -2739.70102 11.85661 -11.19961 42.22488 30.41251 252.13666
17.15000 -2723.05355 11.04207 -4.83094 39.19261 29.92090 257.15207
17.25000 -2707.17443 11.01841 -3.60297 40.09626 28.79264 248.40300
17.35000 -2692.19581 11.10523 -8.45314 39.61561 27.44625 251.27091
17.45000 -2677.12321 12.29169 4.65106 39.82607 27.21385 248.44984
17.55000 -2661.69461 10.96168 -3.79714 40.81306 27.71902 246.54608
17.65000 -2647.61961 9.35238 -3.59608 38.75778 28.58041 237.20185
17.75000 -2631.72657 11.74072 -5.15200 38.74323 26.58791 233.56974
17.85000 -2618.80622 10.79510 -3.46286 39.42556 26.70203 230.79808
17.95000 -2603.77478 11.75472 -7.17107 39.15395 25.78542 228.34183
18.05000 -2590.96869 9.90567 -0.93218 38.71357 25.84213 219.75077
18.15000 -2576.04849 9.22428 6.75162 35.72517 26.08326 215.11444
18.25000 -2560.40527 11.38257 -2.17862 37.27801 26.19688 216.43411
18.35000 -2549.47313 10.29580 10.95023 33.90708 25.11611 209.17907
18.45000 -2534.85677 10.26783 4.85982 34.05961 25.52983 203.64837
18.55000 -2520.44676 11.30366 7.98646 35.60545 25.60503 206.04496
18.65000 -2507.90426 8.74219 -11.86754 32.19123 24.81821 193.33978
18.75000 -2493.80087 10.90196 -6.07228 30.36105 24.26233 186.92802
18.85000 -2478.85940 8.66306 -3.42109 31.32071 24.09376 197.66986
18.95000 -2465.46970 9.54379 6.35961 29.46992 24.48433 184.83900
19.05000 -2452.50953 8.01690 -12.28068 29.38054 23.14108 173.72718
19.15000 -2435.13550 10.44829 -0.87340 30.24478 23.82175 186.01598
19.25000 -2424.02384 9.40461 -5.22425 28.49771 23.63358 176.76166
19.35000 -2410.58714 9.68384 4.64064 27.79082 23.42582 174.17697
19.45000 -2396.63219 8.24885 10.76827 27.83431 22.81798 177.15669
19.55000 -2384.00192 8.68016 1.66301 26.83131 22.43371 164.43353
19.65000 -2370.30863 9.64513 4.15783 27.16087 22.63989 161.68577
19.75000 -2356.16601 9.92603 -2.23082 26.18672 22.01403 158.05537
19.85000 -2341.84815 12.45407 10.61212 26.15164 23.67329 156.09871
19.95000 -2329.68627 13.19912 1.38356 25.31267 23.33930 150.72751
