0.12500 0.01534
0.37500 0.03269
0.62500 0.09337
0.87500 0.15892
1.12500 0.23006
1.37500 0.27772
1.62500 0.31800
1.87500 0.36938
2.12500 0.41311
2.37500 0.44954
2.62500 0.50164
2.87500 0.50768
3.12500 0.52436
3.37500 0.54152
3.62500 0.54808
3.87500 0.54418
4.12500 0.53080
4.37500 0.52645
4.62500 0.51817
4.87500 0.46450
5.12500 0.45896
5.37500 0.44280
5.62500 0.41278
5.87500 0.41141
6.12500 0.39254
6.37500 0.35663
6.62500 0.33055
6.87500 0.32301
7.12500 0.28024
7.37500 0.25137
7.62500 0.20973
7.87500 0.18405
8.12500 0.15794
8.37500 0.13153
8.62500 0.11536
8.87500 0.09786
9.12500 0.08406
9.37500 0.09950
9.62500 0.09156
9.87500 0.08495
10.12500 0.10269
10.37500 0.09281
10.62500 0.08153
10.87500 0.09471
11.12500 0.04778
11.37500 0.05598
11.62500 0.07455
11.87500 0.06462
12.12500 0.08038
12.37500 0.06713
12.62500 0.10743
12.87500 0.08693
13.12500 0.10602
13.37500 0.15422
13.62500 0.15064
13.87500 0.13927
14.12500 0.17442
14.37500 0.16229
14.62500 0.17354
14.87500 0.23425
15.12500 0.20869
15.37500 0.22392
15.62500 0.19898
15.87500 0.18760
16.12500 0.17845
16.37500 0.14436
16.62500 0.12871
16.87500 0.14114
17.12500 0.12835
17.37500 0.04099
17.62500 0.09590
17.87500 0.05890
18.12500 0.06894
18.37500 0.07340
18.62500 0.13821
18.87500 0.04192
19.12500 0.03442
19.37500 0.09925
19.62500 0.07979
19.87500 0.02876
