0.120000 -1.156870
0.380000 -0.909460
0.620000 -0.626120
0.880000 -0.657250
1.120000 -0.625470
1.380000 -0.616780
1.620000 -0.618230
1.880000 -0.659470
2.120000 -0.667590
2.380000 -0.625720
2.620000 -0.646250
2.880000 -0.623870
3.120000 -0.623760
3.380000 -0.634170
3.620000 -0.594980
3.880000 -0.604400
4.120000 -0.571870
4.380000 -0.611900
4.620000 -0.595620
4.880000 -0.585740
5.120000 -0.547450
5.380000 -0.525530
5.620000 -0.484190
5.880000 -0.441050
6.120000 -0.354550
6.380000 -0.307820
6.620000 -0.260370
6.880000 -0.235390
7.120000 -0.214700
7.380000 -0.242780
7.620000 -0.253540
7.880000 -0.342200
8.120000 -0.323460
8.380000 -0.312460
8.620000 -0.273020
8.880000 -0.392110
9.120000 -0.384310
9.380000 -0.527520
9.620000 -0.421510
9.880000 -0.701330
10.120000 -0.569900
10.380000 -0.366640
10.620000 -0.574950
10.880000 -0.459000
11.120000 -0.452760
11.380000 -0.695790
11.620000 -0.665880
11.880000 -0.901350
12.120000 -1.019590
12.380000 -0.978580
12.620000 -0.928230
12.880000 -1.190740
13.120000 -1.437830
13.380000 -1.198990
13.620000 -1.233740
13.880000 -1.644310
14.120000 -1.477690
14.380000 -1.586030
14.620000 -1.617200
14.880000 -1.661990
