0.120000 2.174220
0.380000 3.081180
0.620000 3.008280
0.880000 2.922450
1.120000 2.826940
1.380000 2.867160
1.620000 2.922580
1.880000 2.865940
2.120000 2.828360
2.380000 2.842550
2.620000 2.716030
2.880000 2.769280
3.120000 2.753100
3.380000 2.709940
3.620000 2.619170
3.880000 2.628020
4.120000 2.578990
4.380000 2.611970
4.620000 2.495240
4.880000 2.391790
5.120000 2.120460
5.380000 2.175090
5.620000 2.193210
5.880000 2.021390
6.120000 2.034520
6.380000 1.858330
6.620000 2.478560
6.880000 -3.102800
7.120000 2.178900
7.380000 1.472120
7.620000 -1.444230
7.880000 1.879240
8.120000 -2.554410
8.380000 -3.063090
8.620000 2.797740
8.880000 2.341670
9.120000 2.127570
9.380000 2.428990
9.620000 1.326740
9.880000 1.724010
10.120000 0.947260
10.380000 0.673310
10.620000 0.558050
10.880000 0.130600
11.120000 0.125400
11.380000 0.558580
11.620000 -0.116950
11.880000 0.085500
12.120000 -0.607220
12.380000 -0.203140
12.620000 -0.150500
12.880000 -1.339360
13.120000 -0.743670
13.380000 -0.294410
13.620000 -1.191190
13.880000 -0.913830
14.120000 -1.539890
14.380000 -1.317550
14.620000 -0.325370
14.880000 -0.447520
15.120000 -2.238260
15.380000 -1.228960
15.620000 0.464490
15.880000 -1.165830
16.120000 -1.640290
16.380000 0.194480
16.620000 0.871050
16.880000 -1.785520
17.120000 -1.688860
17.380000 -0.920790
17.620000 -0.632830
17.880000 -2.037770
18.120000 -0.262450
18.380000 1.048600
18.620000 -1.243640
18.880000 -2.467260
19.120000 -0.607390
19.380000 -0.342900
19.620000 -1.648790
19.880000 -3.028740
