0.120000 -2.807150
0.380000 0.399400
0.620000 -0.616760
0.880000 2.204620
1.120000 -0.156370
1.380000 1.062250
1.620000 -2.987710
1.880000 -2.378730
2.120000 -0.988840
2.380000 2.374400
2.620000 -2.885990
2.880000 0.610600
3.120000 -1.583050
3.380000 2.721980
3.620000 -1.495470
3.880000 -0.006770
4.120000 1.728980
4.380000 -1.954790
4.620000 0.327420
4.880000 0.019410
5.120000 -2.611000
5.380000 -1.018960
5.620000 -0.048580
5.880000 -1.821330
6.120000 -2.403450
6.380000 -0.639330
6.620000 -0.888640
6.880000 -0.395800
7.120000 2.263340
7.380000 -1.121130
7.620000 -1.632020
7.880000 2.811190
8.120000 -0.316250
8.380000 -0.513060
8.620000 0.839600
8.880000 0.238860
9.120000 0.553690
9.380000 -1.284210
9.620000 -0.016500
9.880000 2.237010
10.120000 1.266200
10.380000 0.990820
10.620000 3.123210
10.880000 -0.699160
11.120000 -0.231660
11.380000 -1.924170
11.620000 -0.382090
11.880000 3.068240
12.120000 -2.920250
12.380000 -1.166840
12.620000 -2.506770
12.880000 -0.598180
13.120000 1.518880
13.380000 -2.829750
13.620000 2.938270
13.880000 -3.108270
14.120000 -0.373310
14.380000 -1.669020
14.620000 -2.435270
14.880000 -2.858420
