0.120000 -1.822140
0.380000 -0.294960
0.620000 -0.514400
0.880000 -0.376080
1.120000 -0.270050
1.380000 -0.230600
1.620000 -0.142920
1.880000 -0.056550
2.120000 -0.016130
2.380000 0.053030
2.620000 0.064850
2.880000 -0.014050
3.120000 -0.091050
3.380000 -0.177150
3.620000 -0.187560
3.880000 -0.145570
4.120000 -0.083710
4.380000 -0.009260
4.620000 0.120220
4.880000 0.130500
5.120000 0.047310
5.380000 -0.088850
5.620000 -0.290660
5.880000 -0.538750
6.120000 -0.675090
6.380000 -0.699370
6.620000 -0.878330
6.880000 -0.778040
7.120000 -0.696710
7.380000 -0.688910
7.620000 -0.593510
7.880000 -0.499200
8.120000 -0.120690
8.380000 -0.193110
8.620000 -0.241470
8.880000 -0.386070
9.120000 -0.420690
9.380000 -0.645050
9.620000 -0.646820
9.880000 -0.885880
10.120000 -1.204580
10.380000 -1.230680
10.620000 -1.486620
10.880000 -1.590300
11.120000 -1.715950
11.380000 -1.894310
11.620000 -1.984800
11.880000 -2.091290
12.120000 -2.270950
12.380000 -2.324970
12.620000 -2.566230
12.880000 -2.738160
13.120000 -2.959490
13.380000 -3.003050
13.620000 -3.140430
13.880000 2.763840
14.120000 2.430330
14.380000 2.524710
14.620000 2.762130
14.880000 3.061930
