0.125 -0.001 -0.000 0.001
0.375 -0.001 0.001 0.057
0.625 -0.006 -0.005 0.306
0.875 -0.003 -0.013 0.787
1.125 0.009 -0.037 1.483
1.375 0.043 -0.002 2.270
1.625 0.047 -0.034 3.192
1.875 0.025 -0.025 3.977
2.125 0.050 -0.038 4.737
2.375 0.024 -0.029 5.439
2.625 0.081 -0.061 6.225
2.875 0.087 -0.092 7.047
3.125 0.124 -0.019 7.709
3.375 0.137 -0.036 8.559
3.625 0.143 -0.047 9.380
3.875 0.093 -0.081 10.211
4.125 0.166 -0.066 11.020
4.375 0.155 -0.080 12.345
4.625 0.192 -0.091 13.529
4.875 0.198 -0.082 14.827
5.125 0.203 -0.112 16.347
5.375 0.261 -0.128 17.880
5.625 0.238 -0.151 19.945
5.875 0.325 -0.120 21.472
6.125 0.378 -0.125 23.529
6.375 0.360 -0.183 25.467
6.625 0.470 -0.178 26.772
6.875 0.359 -0.217 27.794
7.125 0.492 -0.209 27.670
7.375 0.387 -0.204 27.728
7.625 0.430 -0.197 27.057
7.875 0.381 -0.189 26.281
8.125 0.344 -0.216 25.510
8.375 0.372 -0.153 25.346
8.625 0.391 -0.141 24.936
8.875 0.349 -0.157 24.933
9.125 0.390 -0.165 24.863
9.375 0.358 -0.141 24.532
9.625 0.331 -0.178 23.113
9.875 0.303 -0.143 22.727
10.125 0.271 -0.160 22.083
10.375 0.313 -0.136 21.232
10.625 0.343 -0.112 20.857
10.875 0.294 -0.129 19.480
11.125 0.309 -0.128 19.131
11.375 0.270 -0.153 18.852
11.625 0.269 -0.145 18.069
11.875 0.290 -0.144 17.723
12.125 0.248 -0.151 17.757
12.375 0.253 -0.109 17.160
12.625 0.286 -0.146 17.600
12.875 0.240 -0.103 16.683
13.125 0.236 -0.096 17.082
13.375 0.249 -0.096 17.015
13.625 0.230 -0.134 16.877
13.875 0.232 -0.129 17.370
14.125 0.211 -0.119 16.730
14.375 0.214 -0.124 17.469
14.625 0.209 -0.132 17.856
14.875 0.203 -0.128 17.387
