0.125 -0.001 0.000 0.003
0.375 0.002 -0.001 0.043
0.625 -0.003 0.000 0.273
0.875 0.002 0.010 0.705
1.125 -0.032 0.001 1.404
1.375 -0.029 0.023 2.306
1.625 -0.008 -0.007 2.972
1.875 -0.018 0.020 3.735
2.125 -0.023 0.000 4.297
2.375 -0.023 -0.056 4.806
2.625 -0.069 0.010 5.276
2.875 -0.075 -0.075 5.769
3.125 -0.053 -0.050 6.128
3.375 -0.073 -0.068 6.587
3.625 -0.137 -0.036 6.686
3.875 -0.140 -0.088 7.148
4.125 -0.086 -0.076 7.488
4.375 -0.112 -0.051 7.950
4.625 -0.072 -0.060 8.256
4.875 -0.158 -0.074 8.691
5.125 -0.127 -0.062 8.909
5.375 -0.168 -0.070 9.226
5.625 -0.160 -0.094 9.628
5.875 -0.150 -0.109 9.882
6.125 -0.067 -0.082 10.234
6.375 -0.064 -0.071 10.801
6.625 -0.053 -0.075 11.820
6.875 -0.093 -0.056 12.082
7.125 -0.069 -0.120 13.610
7.375 -0.065 -0.089 15.003
7.625 -0.055 -0.089 16.405
7.875 -0.026 -0.091 18.495
8.125 0.055 -0.170 19.813
8.375 -0.004 -0.165 21.563
8.625 -0.060 -0.119 22.205
8.875 -0.087 -0.143 24.217
9.125 -0.064 -0.125 24.263
9.375 -0.121 -0.140 24.206
9.625 -0.114 -0.148 24.039
9.875 -0.082 -0.059 23.707
10.125 -0.147 -0.076 22.713
10.375 -0.122 -0.121 21.932
10.625 -0.045 -0.084 21.295
10.875 -0.078 -0.059 21.184
11.125 -0.104 -0.076 21.100
11.375 -0.104 -0.073 21.664
11.625 -0.025 -0.036 21.841
11.875 -0.056 -0.056 21.984
12.125 -0.126 -0.009 22.025
12.375 -0.094 -0.030 22.845
12.625 -0.137 0.005 23.475
12.875 -0.070 -0.051 23.197
13.125 -0.102 -0.041 23.392
13.375 -0.080 -0.022 22.544
13.625 -0.114 0.052 22.502
13.875 -0.081 0.007 21.110
14.125 -0.043 0.061 21.364
14.375 -0.047 -0.015 20.355
14.625 -0.071 0.051 19.478
14.875 -0.061 0.084 18.713
