0.120000 -2.930690
0.380000 -3.105330
0.620000 -3.111110
0.880000 -3.082580
1.120000 -3.113950
1.380000 -3.107130
1.620000 -3.120020
1.880000 -3.111670
2.120000 -3.104450
2.380000 -3.109000
2.620000 -3.115590
2.880000 -3.131480
3.120000 -3.100930
3.380000 -3.119930
3.620000 -3.122210
3.880000 -3.115390
4.120000 -3.108970
4.380000 -3.098060
4.620000 -3.094620
4.880000 -3.104130
5.120000 -3.106100
5.380000 -3.110560
5.620000 -3.134550
5.880000 -3.109520
6.120000 -3.096210
6.380000 -3.112050
6.620000 3.137840
6.880000 3.127270
7.120000 3.115060
7.380000 3.113530
7.620000 3.081220
7.880000 3.076210
8.120000 3.005530
8.380000 2.934940
8.620000 2.990730
8.880000 2.960740
9.120000 2.847540
9.380000 2.867950
9.620000 2.951660
9.880000 2.781730
10.120000 2.873270
10.380000 2.722430
10.620000 2.521120
10.880000 2.779660
11.120000 0.753630
11.380000 1.191220
11.620000 1.158690
11.880000 1.442740
12.120000 0.770950
12.380000 1.057640
12.620000 0.913000
12.880000 0.924660
13.120000 0.849360
13.380000 0.872420
13.620000 0.952560
13.880000 0.859200
14.120000 1.035140
14.380000 0.815260
14.620000 0.746690
14.880000 0.592030
