0.12500 0.01659
0.37500 0.01140
0.62500 0.01471
0.87500 0.00749
1.12500 0.01985
1.37500 0.00273
1.62500 0.00766
1.87500 0.01296
2.12500 0.01236
2.37500 0.02759
2.62500 0.00511
2.87500 0.03189
3.12500 0.01867
3.37500 0.03084
3.62500 0.02149
3.87500 0.02082
4.12500 0.03047
4.37500 0.02019
4.62500 0.01447
4.87500 0.03477
5.12500 0.02043
5.37500 0.03118
5.62500 0.02907
5.87500 0.02859
6.12500 0.02993
6.37500 0.03777
6.62500 0.04285
6.87500 0.02572
7.12500 0.02928
7.37500 0.02200
7.62500 0.02431
7.87500 0.00835
8.12500 0.01437
8.37500 0.03238
8.62500 0.02528
8.87500 0.02190
9.12500 0.03148
9.37500 0.03581
9.62500 0.02724
9.87500 0.01899
10.12500 0.01395
10.37500 0.02840
10.62500 0.02689
10.87500 0.02275
11.12500 0.04165
11.37500 0.02821
11.62500 0.04426
11.87500 0.03807
12.12500 0.02401
12.37500 0.03282
12.62500 0.03238
12.87500 0.01883
13.12500 0.02983
13.37500 0.00976
13.62500 0.00698
13.87500 0.01375
14.12500 0.04800
14.37500 0.03147
14.62500 0.02590
14.87500 0.01732
