0.120000 -2.641160
0.380000 -1.813820
0.620000 2.570590
0.880000 -1.723650
1.120000 -2.344420
1.380000 -1.824030
1.620000 -1.541160
1.880000 -1.607300
2.120000 -1.622580
2.380000 -1.672010
2.620000 -1.562910
2.880000 -1.693340
3.120000 -1.691080
3.380000 -2.136660
3.620000 -2.192320
3.880000 -2.997540
4.120000 3.133440
4.380000 -2.567870
4.620000 1.128310
4.880000 -2.877670
5.120000 -2.565910
5.380000 2.861580
5.620000 3.013070
5.880000 2.920580
6.120000 -3.133380
6.380000 2.265710
6.620000 1.747200
6.880000 2.005750
7.120000 2.669330
7.380000 0.675680
7.620000 -3.103170
7.880000 3.062570
8.120000 -3.087710
8.380000 -2.609630
8.620000 2.726830
8.880000 -3.064310
9.120000 -1.575500
9.380000 2.947060
9.620000 2.062710
9.880000 2.447070
10.120000 3.085890
10.380000 -1.210320
10.620000 -1.461550
10.880000 -0.639860
11.120000 -1.231020
11.380000 -1.883580
11.620000 -2.838090
11.880000 -2.462570
12.120000 0.728870
12.380000 2.226570
12.620000 2.291420
12.880000 1.985750
13.120000 2.694410
13.380000 2.941590
13.620000 2.961920
13.880000 2.868890
14.120000 2.381200
14.380000 -2.855230
14.620000 1.476820
14.880000 0.991070
15.120000 0.631480
15.380000 0.725840
15.620000 0.312650
15.880000 1.285860
16.120000 0.598060
16.380000 0.190240
16.620000 0.335600
16.880000 0.459180
17.120000 0.324920
17.380000 0.412750
17.620000 -0.257170
17.880000 0.525970
18.120000 -1.733460
18.380000 1.230520
18.620000 -0.292490
18.880000 1.221270
19.120000 2.162230
19.380000 0.517290
19.620000 -0.043030
19.880000 2.738300
