0.125 0.001 -0.000 0.004
0.375 0.008 0.006 0.105
0.625 0.026 0.004 0.595
0.875 0.023 0.015 1.431
1.125 0.033 0.013 2.479
1.375 0.032 0.053 3.562
1.625 0.044 0.062 4.438
1.875 0.065 0.030 5.260
2.125 0.001 0.020 6.138
2.375 0.083 0.046 6.758
2.625 0.089 0.031 7.585
2.875 0.008 -0.003 7.988
3.125 0.040 0.073 8.446
3.375 0.018 0.035 8.750
3.625 0.040 0.015 9.107
3.875 -0.022 0.005 9.204
4.125 -0.007 -0.059 9.626
4.375 -0.017 -0.008 9.907
4.625 0.022 -0.054 10.167
4.875 0.019 -0.048 11.011
5.125 0.022 -0.071 12.083
5.375 0.031 -0.092 13.506
5.625 0.036 -0.097 15.026
5.875 0.104 -0.146 16.626
6.125 0.074 -0.154 18.451
6.375 0.145 -0.165 19.549
6.625 0.162 -0.168 20.235
6.875 0.192 -0.180 20.553
7.125 0.271 -0.180 20.486
7.375 0.259 -0.144 19.990
7.625 0.253 -0.170 20.254
7.875 0.254 -0.183 20.205
8.125 0.320 -0.166 19.827
8.375 0.279 -0.180 20.145
8.625 0.313 -0.132 20.160
8.875 0.300 -0.143 21.082
9.125 0.359 -0.176 21.644
9.375 0.370 -0.198 22.648
9.625 0.393 -0.158 23.078
9.875 0.393 -0.176 23.077
10.125 0.400 -0.162 23.149
10.375 0.445 -0.178 22.563
10.625 0.369 -0.185 21.361
10.875 0.398 -0.146 20.458
11.125 0.351 -0.141 19.403
11.375 0.329 -0.096 18.433
11.625 0.357 -0.048 17.193
11.875 0.358 -0.082 16.650
12.125 0.280 -0.039 16.212
12.375 0.294 -0.016 16.357
12.625 0.296 -0.005 16.050
12.875 0.289 0.049 16.366
13.125 0.268 0.046 16.232
13.375 0.230 0.073 15.906
13.625 0.216 0.059 14.596
13.875 0.175 0.082 14.220
14.125 0.113 0.074 13.089
14.375 0.111 0.067 12.256
14.625 0.085 0.050 11.120
14.875 0.076 0.037 10.267
