0.12500 0.03326
0.37500 0.10524
0.62500 0.17860
0.87500 0.24191
1.12500 0.29979
1.37500 0.33449
1.62500 0.34658
1.87500 0.36287
2.12500 0.36287
2.37500 0.34694
2.62500 0.32992
2.87500 0.32196
3.12500 0.29748
3.37500 0.27407
3.62500 0.26345
3.87500 0.24670
4.12500 0.22381
4.37500 0.20115
4.62500 0.18059
4.87500 0.14837
5.12500 0.13169
5.37500 0.11983
5.62500 0.09103
5.87500 0.08121
6.12500 0.07802
6.37500 0.05995
6.62500 0.06072
6.87500 0.05556
7.12500 0.06592
7.37500 0.07246
7.62500 0.06548
7.87500 0.05689
8.12500 0.05937
8.37500 0.05193
8.62500 0.05865
8.87500 0.03888
9.12500 0.04368
9.37500 0.04669
9.62500 0.03075
9.87500 0.02128
10.12500 0.02807
10.37500 0.02654
10.62500 0.02650
10.87500 0.04143
11.12500 0.04011
11.37500 0.04581
11.62500 0.04988
11.87500 0.03435
12.12500 0.02258
12.37500 0.02336
12.62500 0.01524
12.87500 0.01553
13.12500 0.01556
13.37500 0.01131
13.62500 0.02211
13.87500 0.03215
14.12500 0.04599
14.37500 0.05403
14.62500 0.07164
14.87500 0.07148
