0.2 0.23644 21.17017 -1.57952 66.51253 66.80526 64.94129
0.6 -0.458 45.04257 -0.1652 62.71304 63.8307 60.93266
1.0 -1.63001 69.41081 0.29175 59.56338 59.57784 57.59437
1.4 -0.09287 91.41808 0.43062 56.28768 55.51857 53.79709
1.8 -0.78801 107.68399 0.09947 52.85353 52.18991 50.74815
2.2 -0.22914 120.72898 0.06093 50.78082 49.39545 48.03065
2.6 -0.18002 131.04684 -0.07989 47.86151 45.81732 46.00809
3.0 -0.33826 141.37002 -0.09872 45.89874 43.45965 42.93727
3.4 -0.13811 150.7364 -0.51696 43.51261 40.39151 40.43142
3.8 0.2568 158.99839 -0.46813 41.78311 37.61134 38.18546
4.2 0.82625 165.55883 -0.02623 39.41642 35.04577 36.18543
4.6 1.04972 171.71947 -0.09928 38.07268 32.80113 34.19053
5.0 1.08832 176.24625 0.04057 36.31345 31.49301 32.11683
5.4 1.48971 180.86513 -0.28695 34.91448 29.64131 30.36112
5.8 0.94742 184.59305 -0.63337 33.50002 27.87287 28.84453
6.2 0.80804 187.66772 -0.91402 32.23686 26.30022 27.43768
6.6 0.26152 190.54798 -0.67436 30.76586 25.05998 25.79517
7.0 0.23519 193.06986 0.19927 29.5286 23.78693 24.3031
7.4 0.3271 195.61524 0.62263 27.72781 22.41254 22.98185
7.8 0.55546 198.02571 1.27805 26.32677 21.26917 21.87348
8.2 0.76173 199.47064 1.62437 25.14435 20.04574 20.74211
8.6 0.40485 199.97811 1.68306 24.41485 18.86234 19.73267
9.0 0.53912 200.71583 1.94034 23.46581 17.84963 18.55183
9.4 -0.38958 202.23371 1.45892 22.48453 17.38849 17.76032
9.8 -0.48152 203.21449 0.74611 20.8483 16.04763 16.87739
10.2 -1.16104 203.25785 0.32644 20.44319 14.77141 16.12766
10.6 -0.96884 203.61078 -0.14425 19.21611 14.49917 15.26411
11.0 0.5888 205.63136 -0.48948 18.21003 14.60749 14.67417
11.4 2.00663 206.71361 -0.53972 17.41569 13.89754 13.86834
11.8 2.41199 206.30491 -0.11595 17.02012 13.01358 13.14613
12.2 1.80388 205.43319 -0.04075 16.32882 12.62403 12.46094
12.6 -0.42384 204.74448 0.50032 16.58619 12.50549 12.35609
13.0 -2.2459 205.01779 0.21952 15.73391 12.20464 12.1532
13.4 -1.75838 206.90281 -0.04227 14.27375 11.00746 11.36036
13.8 -0.1549 207.34037 -1.16364 13.55422 10.10933 10.68624
14.2 1.07717 207.21677 -1.689 12.75112 10.01379 9.91469
14.6 1.41396 207.68233 -2.0428 12.3981 9.91129 9.46541
15.0 2.01817 207.92034 -1.72201 12.35667 9.48658 9.23334
15.4 0.90212 207.55344 -1.53394 12.01921 8.76607 9.0515
15.8 -1.15998 206.74208 -1.58674 11.83937 8.68643 8.76719
16.2 -2.22643 206.55812 -2.05585 11.03774 8.36315 8.14364
16.6 -2.65139 206.65172 -2.07262 9.90084 7.37222 8.00111
17.0 -0.94793 206.87432 -1.61854 10.59163 7.06316 7.4253
17.4 -0.7819 206.32118 -1.30371 9.80467 6.80681 7.66566
17.8 0.18343 206.22919 -0.91703 9.52264 6.38515 7.1184
18.2 -0.90285 206.33754 -0.03861 8.88864 5.99468 6.84415
18.6 -0.2493 206.06636 0.39065 8.68436 6.06667 6.83316
19.0 1.66422 206.1528 0.84571 8.19115 6.33843 6.55639
19.4 3.36507 206.17448 0.88688 8.42943 6.82037 6.41507
19.8 4.40717 205.98935 0.96759 8.5529 7.08074 6.62569
