0.450000 1.000690
1.350000 1.087370
2.250000 1.558540
3.150000 1.211500
4.050000 1.427480
4.950000 1.478520
5.850000 2.362530
6.750000 2.010420
7.650000 1.679390
8.550000 1.499140
9.450000 0.181820
10.350000 0.522970
11.250000 -0.408870
12.150000 -0.638440
13.050000 -1.013040
13.950000 -1.986330
14.850000 2.525190
15.750000 2.811350
16.650000 1.890130
17.550000 0.000710
