0.1875 -2.34937 20.9978 0.86308 131.78267 130.8921 130.25708
0.5625 -0.392 46.62282 -0.71912 111.42746 109.93699 104.14713
0.9375 -0.3909 74.31788 -0.84141 98.94617 97.5304 88.96531
1.3125 -0.98469 99.06911 0.22376 88.50669 89.25073 78.84027
1.6875 0.31205 120.21264 1.13691 80.20333 79.23933 70.55892
2.0625 0.93037 132.68103 -1.11692 73.86693 70.51131 63.78805
2.4375 -1.23115 144.64178 -0.80627 67.74871 64.16441 57.96804
2.8125 -0.50221 154.13536 -0.4971 62.56928 58.64361 53.70166
3.1875 -0.19745 162.02688 -0.21952 59.04367 53.05304 49.83102
3.5625 -0.21769 167.7127 -0.45468 56.16264 48.8445 46.53996
3.9375 -0.27099 173.65033 -0.04261 53.05993 45.82114 44.06071
4.3125 -1.12281 177.76481 1.05426 49.77394 43.02092 41.92641
4.6875 -0.09603 180.79549 0.4349 47.68647 40.50511 39.29422
5.0625 -0.38427 185.16574 0.43459 46.1769 38.62289 38.17372
5.4375 0.96721 187.71676 0.95178 44.09081 36.7594 35.95626
5.8125 0.30741 190.69316 0.31031 42.89048 35.9449 35.26869
6.1875 1.36959 193.46316 0.95837 42.02671 34.98984 33.41567
6.5625 1.58646 197.31103 0.93729 40.73337 32.81586 32.40106
6.9375 1.98091 199.42507 1.64152 39.31163 30.84655 31.27186
7.3125 3.48322 200.85792 0.73917 38.49908 29.57191 30.00988
7.6875 2.63837 200.96298 1.03895 37.70428 29.20996 29.32795
8.0625 1.73061 201.47087 0.59197 36.03332 27.78942 27.75713
8.4375 0.55481 202.98857 -0.44292 35.80627 27.45369 26.79859
8.8125 0.70141 204.34458 -0.98529 34.43919 26.65258 25.69086
9.1875 -1.06687 205.30125 -2.22004 34.00255 24.88598 25.61772
9.5625 -0.25459 204.78599 -1.21253 33.51126 24.16132 24.652
9.9375 -1.9594 204.61911 -1.8126 32.48973 23.34546 23.58756
10.3125 -2.40255 205.51244 -1.41047 31.25692 22.64764 23.1865
10.6875 -2.52978 205.09312 -1.2066 29.63488 21.8501 22.02331
11.0625 -1.98307 205.58611 -1.56328 29.49367 21.14903 21.99906
11.4375 -0.99997 205.72418 -0.63167 28.54745 21.15317 21.39946
11.8125 -1.23143 205.76572 -0.86067 26.90656 20.3526 20.59404
12.1875 -0.60127 206.57433 0.01555 26.87651 19.82011 20.57539
12.5625 -9e-05 206.67355 0.49929 25.67917 19.25725 19.26108
12.9375 -0.34737 205.65237 0.96873 25.43776 18.75337 18.94151
13.3125 2.56027 205.81345 -0.12271 24.56536 18.46197 18.15669
13.6875 0.03456 204.5591 1.18973 23.57905 18.2435 17.77121
14.0625 1.1559 204.87333 0.93558 24.21448 17.87342 16.75185
14.4375 0.88587 204.34224 0.24312 22.64247 17.90935 16.24085
14.8125 0.10401 205.42165 -0.79438 22.19289 17.87807 15.98491
15.1875 -0.59621 206.76625 0.16812 20.66935 16.93403 15.47667
15.5625 0.99842 207.77719 0.31562 20.37788 15.56192 15.51648
15.9375 0.20181 207.58212 0.13889 19.48348 16.25414 15.13527
16.3125 -0.50824 206.52178 0.30907 19.34937 14.9666 14.89741
16.6875 0.87064 207.50996 -0.4175 18.30377 13.84054 14.28201
17.0625 0.69814 206.88522 0.08583 18.74373 13.24173 13.74537
17.4375 0.89735 206.72129 0.40136 17.1605 13.71616 13.84649
17.8125 -1.04188 207.60808 0.99297 17.36734 12.20194 12.9131
18.1875 1.29975 206.41611 0.90966 17.58906 12.29125 12.20972
18.5625 -1.53933 205.83129 0.0159 16.62786 13.15416 12.60876
18.9375 -0.62152 208.46514 1.07868 15.6826 12.58055 12.37263
19.3125 1.94041 207.68572 1.52424 15.25532 11.43979 11.7945
19.6875 -0.63574 206.61303 1.36888 13.76189 11.49984 11.42327
20.0625 -0.48491 206.86963 1.8811 14.03946 10.94778 11.37941
20.4375 1.16464 206.03986 -1.10052 14.41736 10.93025 12.18904
20.8125 -1.53406 207.28978 0.00765 13.99601 10.20386 11.39402
21.1875 -2.09907 205.18382 -0.41751 14.61211 9.30819 11.13801
21.5625 -3.47127 206.43843 -1.75935 13.20474 10.41595 9.85417
21.9375 -1.9416 205.96992 0.24397 13.4645 8.86733 9.65792
22.3125 -1.98387 206.88235 -1.69824 12.80606 10.12234 8.59472
22.6875 -0.24142 206.47565 -1.75709 10.69523 9.24529 9.32724
23.0625 -1.62772 203.91124 0.19585 11.73975 10.83269 7.68623
23.4375 0.91704 204.76053 -3.12383 12.1846 8.57099 8.87777
23.8125 1.84862 205.64542 -0.15054 10.2576 9.33459 7.66401
24.1875 1.34454 206.70665 -2.94964 14.52331 9.96407 8.40115
24.5625 0.40757 202.81994 -3.85316 10.38896 9.29226 8.11942
24.9375 -1.64105 203.64464 -0.97978 12.42983 8.7917 8.12679
25.3125 1.79045 203.17782 -2.78689 10.35335 8.64331 9.37175
25.6875 1.26148 205.1748 -3.0601 12.63253 7.0135 7.78192
26.0625 1.7777 203.73956 -0.18681 11.88595 7.49342 8.07816
26.4375 3.94339 201.54327 2.02039 11.20823 8.91348 6.01112
26.8125 -1.41931 203.17974 -1.33791 12.13983 8.623 5.74186
27.1875 -4.25401 203.0468 -1.34249 11.05304 7.54053 10.24137
27.5625 -2.97006 206.12462 0.3013 9.6594 8.09012 7.92259
27.9375 0.48039 203.01499 0.35809 7.30451 6.81452 8.11642
28.3125 -0.28922 203.26683 -0.43793 6.50337 5.39572 6.47876
28.6875 1.28288 204.19121 -2.12412 10.75854 5.5127 8.18422
29.0625 -4.27673 200.84057 -1.43734 9.65303 4.73829 4.09261
29.4375 -4.53488 209.22377 0.92398 8.2391 7.35667 6.5261
29.8125 -0.09793 199.21935 -0.13731 13.1857 1.64321 7.5084
