0.12500 0.01318
0.37500 0.03483
0.62500 0.07028
0.87500 0.10762
1.12500 0.13699
1.37500 0.16155
1.62500 0.20137
1.87500 0.22177
2.12500 0.23974
2.37500 0.23734
2.62500 0.23975
2.87500 0.23213
3.12500 0.22856
3.37500 0.23370
3.62500 0.21178
3.87500 0.21515
4.12500 0.18251
4.37500 0.15910
4.62500 0.14466
4.87500 0.12174
5.12500 0.09342
5.37500 0.08722
5.62500 0.05730
5.87500 0.04321
6.12500 0.03216
6.37500 0.03173
6.62500 0.03203
6.87500 0.02495
7.12500 0.02843
7.37500 0.03289
7.62500 0.02475
7.87500 0.03762
8.12500 0.03919
8.37500 0.05054
8.62500 0.03961
8.87500 0.03134
9.12500 0.03148
9.37500 0.03298
9.62500 0.05173
9.87500 0.03734
10.12500 0.04295
10.37500 0.02450
10.62500 0.03982
10.87500 0.04260
11.12500 0.04334
11.37500 0.04344
11.62500 0.03578
11.87500 0.02787
12.12500 0.03177
12.37500 0.02459
12.62500 0.02055
12.87500 0.03374
13.12500 0.01589
13.37500 0.02524
13.62500 0.06539
13.87500 0.08264
14.12500 0.07603
14.37500 0.07122
14.62500 0.05585
14.87500 0.03342
15.12500 0.06661
15.37500 0.05790
15.62500 0.00991
15.87500 0.03366
16.12500 0.03735
16.37500 0.01017
16.62500 0.03041
16.87500 0.00310
17.12500 0.02482
17.37500 0.03331
17.62500 0.02928
17.87500 0.02820
18.12500 0.04256
18.37500 0.04634
18.62500 0.03791
18.87500 0.06684
19.12500 0.03298
19.37500 0.05159
19.62500 0.05357
19.87500 0.12172
