0.26 1.70618 170.62429 0.04789
0.51 1.56801 141.66199 0.04411
0.77 1.39289 122.49946 0.04133
1.02 1.38515 117.65648 0.03917
1.28 1.42735 115.87012 0.03565
1.54 1.4671 115.59403 0.03338
1.79 1.38156 107.38116 0.03215
2.05 1.43233 103.38852 0.02911
2.31 1.42625 100.63738 0.02755
2.56 1.40535 93.87656 0.02563
2.82 1.4596 94.50763 0.02433
3.08 1.41966 89.27844 0.02304
3.33 1.45887 87.37522 0.0214
3.59 1.41648 78.68641 0.01956
3.84 1.55632 82.31376 0.01848
4.1 1.52716 77.95567 0.01712
4.36 1.54751 74.33729 0.01584
4.61 1.55526 72.0355 0.01483
4.87 1.52935 69.62149 0.01419
5.12 1.58105 67.62222 0.01311
5.38 1.62676 67.18459 0.01226
5.64 1.66675 65.27295 0.01151
5.89 1.62339 61.58364 0.01081
6.15 1.67895 60.5082 0.01008
6.41 1.69549 59.51032 0.00974
6.66 1.69243 56.94258 0.00905
6.92 1.72818 55.78327 0.00854
7.17 1.81153 56.67945 0.00805
7.43 1.76658 52.52576 0.0075
7.69 1.85126 51.35272 0.0069
7.94 1.88387 51.62775 0.00653
8.2 1.85632 48.81852 0.00611
8.46 1.94978 48.81971 0.00569
8.71 1.98906 46.01959 0.00527
8.97 2.04839 46.82469 0.00502
9.22 2.08882 45.64729 0.00472
9.48 2.09213 43.75973 0.00443
9.74 2.16483 42.94649 0.00411
9.99 2.25318 43.13739 0.00385
