0.12500 0.02201
0.37500 0.04946
0.62500 0.11974
0.87500 0.19863
1.12500 0.26594
1.37500 0.33652
1.62500 0.37417
1.87500 0.42294
2.12500 0.46130
2.37500 0.49937
2.62500 0.52231
2.87500 0.55778
3.12500 0.57175
3.37500 0.59758
3.62500 0.59881
3.87500 0.61551
4.12500 0.61424
4.37500 0.61058
4.62500 0.60529
4.87500 0.58405
5.12500 0.55053
5.37500 0.50942
5.62500 0.45562
5.87500 0.41528
6.12500 0.35861
6.37500 0.32313
6.62500 0.30377
6.87500 0.27879
7.12500 0.28800
7.37500 0.30297
7.62500 0.29756
7.87500 0.31554
8.12500 0.30237
8.37500 0.30991
8.62500 0.27804
8.87500 0.24370
9.12500 0.21542
9.37500 0.15828
9.62500 0.12514
9.87500 0.11024
10.12500 0.08673
10.37500 0.06806
10.62500 0.05981
10.87500 0.05746
11.12500 0.05174
11.37500 0.06652
11.62500 0.07676
11.87500 0.07306
12.12500 0.07718
12.37500 0.09346
12.62500 0.08596
12.87500 0.09764
13.12500 0.06401
13.37500 0.05324
13.62500 0.05252
13.87500 0.05447
14.12500 0.07289
14.37500 0.06983
14.62500 0.07014
14.87500 0.07876
