0.05000 -2932.45357 -1275.79924 -80.90835 3641.85473 3500.62701 4201.77812
0.15000 -5796.47213 426.16429 -229.29489 5021.90296 4719.87834 7194.01776
0.25000 -7789.81456 192.92561 -807.46335 4322.84203 4162.37688 9332.13191
0.35000 -8866.86579 35.12507 -492.79776 3928.56750 3548.55761 10384.68854
0.45000 -9751.95475 205.67627 -279.66004 3845.72785 2951.26452 10706.38573
0.55000 -10085.88809 -35.82438 135.79097 3426.76129 2568.32813 10903.29873
0.65000 -10029.41939 39.17105 97.38684 3154.06471 2287.10122 10491.13660
0.75000 -9993.17953 87.31954 557.42560 3039.89775 1931.81209 10138.05856
0.85000 -10146.32175 -38.19760 389.61119 3033.18657 1985.68172 9787.91629
0.95000 -10200.14469 26.21853 -60.56062 2786.70520 1953.36261 9373.33459
1.05000 -10105.99039 142.37364 136.05622 2633.88743 1810.99398 9034.07886
1.15000 -9990.23538 31.22952 81.56048 2454.97570 1740.33973 8724.04594
1.25000 -9907.63756 78.90985 175.90272 2440.67349 1690.49666 8387.35535
1.35000 -9840.73618 102.30724 114.20394 2176.88904 1581.17947 7968.16684
1.45000 -9681.43640 87.13764 160.29325 2140.15907 1651.69151 7483.93114
1.55000 -9521.80666 32.18155 310.77676 1963.08619 1522.00931 7320.76136
1.65000 -9454.38136 91.20456 -31.84855 1877.13023 1588.15822 6864.98298
1.75000 -9376.00321 67.96777 -113.62029 1774.83376 1501.71201 6651.93342
1.85000 -9229.85262 65.41503 140.98980 1675.28083 1483.35181 6516.26021
1.95000 -9119.13920 40.60050 -55.86337 1459.56192 1327.31862 6124.99947
2.05000 -8982.25351 33.38034 63.34490 1454.07863 1332.58524 6011.22623
2.15000 -8944.74078 44.90871 46.47398 1434.14881 1303.06061 5661.01644
2.25000 -8852.00069 11.02195 133.98421 1289.30558 1187.08775 5425.45347
2.35000 -8764.15929 44.18255 58.33059 1262.27391 1334.81561 5251.65496
2.45000 -8708.51641 20.85390 108.89020 1250.55203 1261.14709 4990.58832
2.55000 -8646.04889 -24.94908 -14.92711 1222.55122 1130.74987 4956.69780
2.65000 -8571.73325 31.67531 -32.63227 1171.77847 1086.53292 4692.25102
2.75000 -8463.26402 37.44503 -21.15094 1107.24872 1010.73592 4555.38228
2.85000 -8372.37172 42.85965 -77.28546 1039.57195 981.61712 4449.40963
2.95000 -8328.34814 50.37538 36.90939 977.51564 910.06466 4231.46036
3.05000 -8228.76997 3.07706 -31.88922 965.46168 896.01193 4132.94528
3.15000 -8144.91398 24.20300 30.59168 1009.23176 885.90538 4017.24401
3.25000 -8046.62435 32.71492 55.28075 979.69010 923.54842 3910.38855
3.35000 -7960.39908 29.98303 18.45084 812.40592 784.88022 3786.76933
3.45000 -7905.22125 -0.83095 -164.53210 806.36545 803.85723 3663.23242
3.55000 -7829.13437 1.50655 -57.05834 902.13506 785.17774 3566.68904
3.65000 -7720.67383 6.12218 -18.75918 810.74503 830.76433 3424.42282
3.75000 -7699.82342 10.99794 59.70972 952.08671 834.16586 3361.04718
3.85000 -7634.11377 25.65452 -90.26943 744.18187 698.66700 3233.85960
3.95000 -7573.65801 29.53198 -86.50114 850.48829 801.77035 3163.04475
4.05000 -7506.02125 28.60088 -30.08936 764.82192 587.62744 3044.61703
4.15000 -7444.27076 15.10041 -128.35076 706.06097 624.57683 3020.93005
4.25000 -7383.19224 11.49876 -28.25364 661.35506 667.88368 2862.10310
4.35000 -7355.68474 19.92647 -110.05249 689.01739 552.24668 2808.36569
4.45000 -7260.75606 29.07341 0.31496 727.08247 584.21194 2780.22357
4.55000 -7240.52123 26.77540 23.40570 716.32419 660.29335 2666.76808
4.65000 -7175.76830 17.04220 -86.18372 701.25973 651.90241 2624.72553
4.75000 -7125.83061 28.99576 -18.94750 646.82528 493.07246 2540.44969
4.85000 -7092.48837 30.09889 -35.07729 641.27803 510.33314 2445.67630
4.95000 -7033.97002 31.28758 4.51193 555.92358 477.31258 2402.06996
5.05000 -6961.95817 33.06872 -11.07396 678.97914 490.91414 2379.80825
5.15000 -6893.68368 27.12206 74.89930 571.21454 420.52572 2291.12012
5.25000 -6836.35261 23.82287 -12.55063 559.04629 428.68740 2269.27859
5.35000 -6789.72096 15.82795 -44.13795 514.67620 383.73379 2185.03866
5.45000 -6721.01247 19.92025 -78.82063 520.50163 357.02289 2104.34387
5.55000 -6686.51066 21.24810 5.35487 723.85829 448.04739 2124.94837
5.65000 -6610.34205 16.11687 48.32300 500.97871 348.36956 1979.57359
5.75000 -6545.69189 27.17352 42.03978 509.05146 395.63688 2045.71147
5.85000 -6477.81526 12.35656 -31.23798 460.30433 378.39562 1992.09821
5.95000 -6436.38223 32.15083 33.01689 770.46916 505.13705 1896.22226
6.05000 -6346.03734 24.07682 0.88458 366.19228 365.27268 1825.65485
6.15000 -6307.23252 11.35754 -69.82834 528.58522 413.39931 1795.41913
6.25000 -6278.91566 22.15325 -14.87361 495.31551 482.36679 1735.16104
6.35000 -6209.87104 16.47795 -62.56890 378.22984 286.57622 1686.38537
6.45000 -6146.63418 11.25019 -32.56010 390.05080 322.78621 1653.24889
6.55000 -6106.81316 19.12874 29.05434 565.62380 378.90815 1626.17598
6.65000 -6074.68652 17.75580 2.54800 449.61388 332.94737 1577.43416
6.75000 -6016.06907 8.03969 -14.08930 470.88112 352.70943 1547.84658
6.85000 -5966.60067 16.73967 -36.88613 511.79058 331.64097 1574.94582
6.95000 -5915.34436 22.82217 -84.12879 464.07898 427.46647 1522.58925
7.05000 -5887.28109 26.57694 -52.62795 344.56708 364.93554 1416.34165
7.15000 -5837.20182 14.62638 -16.27099 440.41479 391.47116 1405.57042
7.25000 -5785.72389 12.98447 -58.82129 360.33933 249.97738 1371.08571
7.35000 -5738.91778 15.09556 55.45918 380.04210 281.64726 1350.95435
7.45000 -5667.99934 1.67901 -16.17463 458.66875 376.23190 1390.14102
7.55000 -5648.53976 16.68230 -31.34538 393.62930 322.83194 1247.03073
7.65000 -5602.43872 18.55177 -85.65688 333.62018 256.56408 1254.58990
7.75000 -5538.24060 4.93614 -43.80468 340.94156 407.53179 1248.64387
7.85000 -5484.92972 14.35515 -72.12447 348.30905 259.64932 1278.46404
7.95000 -5449.26925 19.65891 -27.08487 292.76415 220.55665 1154.07576
8.05000 -5407.81484 24.39600 -81.59281 419.51731 560.39336 1110.73783
8.15000 -5352.93487 2.25337 -16.93142 475.24312 302.09799 1112.48980
8.25000 -5305.65157 24.31997 -61.79465 360.87961 366.92020 1104.83244
8.35000 -5246.32024 10.35129 -69.78963 259.17967 216.61494 1072.51701
8.45000 -5195.34170 10.95762 -82.40016 258.21254 225.76194 991.90965
8.55000 -5148.67864 -5.99093 -108.01167 353.01999 434.48208 1070.48127
8.65000 -5092.83354 12.79969 -86.58323 596.22681 381.07413 1059.90426
8.75000 -5071.07022 2.46627 -43.27218 286.60079 249.41221 977.99496
8.85000 -5032.00083 13.82773 -9.36039 284.03931 218.69302 953.10835
8.95000 -4974.26000 10.76520 -89.54460 404.64087 220.77862 992.07982
9.05000 -4934.74936 13.95382 -15.47973 267.88432 264.70121 919.62256
9.15000 -4893.60189 -0.53645 -63.52817 288.22409 265.51832 957.29641
9.25000 -4844.22563 19.86062 -9.66572 314.81395 248.09535 872.39225
9.35000 -4803.51977 10.63341 15.02522 234.71309 172.41978 855.75591
9.45000 -4757.82231 9.21454 -0.83365 255.29046 228.55093 841.61856
9.55000 -4713.75253 9.98965 28.72564 243.86123 185.01363 882.06784
9.65000 -4681.00908 10.43615 7.86980 210.43090 186.11894 801.23624
9.75000 -4666.91003 1.48611 -0.66387 461.04819 537.24166 911.02531
9.85000 -4605.37000 7.26675 36.77297 236.68841 181.04784 771.97620
9.95000 -4557.78541 10.80943 8.81526 221.85554 176.78934 771.07325
10.05000 -4509.26048 5.40705 70.06575 191.48624 135.12852 720.33502
10.15000 -4456.68181 11.23898 44.95828 600.85308 407.49614 733.12062
10.25000 -4462.22816 -2.27940 63.70403 467.01363 391.92875 803.11140
10.35000 -4384.84352 0.77401 84.97554 543.39887 360.88301 675.80781
10.45000 -4352.71401 -3.54281 34.28779 184.41437 352.36612 690.90683
10.55000 -4316.86490 18.96338 52.44094 190.84337 172.88927 667.69004
10.65000 -4287.02244 5.61845 32.90319 207.08277 194.02833 652.74859
10.75000 -4244.80805 18.77316 78.81714 325.89621 514.40283 743.29099
10.85000 -4213.08617 10.86129 86.44126 337.25017 209.57105 609.70613
10.95000 -4197.07801 4.25076 51.83028 204.26650 200.31220 622.81850
11.05000 -4172.68983 -1.51549 83.11230 212.77904 170.77200 598.65145
11.15000 -4132.77404 6.70347 41.55177 181.83307 141.75282 593.95162
11.25000 -4114.09663 7.89573 41.52856 124.64978 168.31080 579.87461
11.35000 -4084.10468 4.19793 31.52279 261.65545 143.09742 628.00906
11.45000 -4044.29260 11.99557 60.35763 162.94554 174.96561 569.57284
11.55000 -4034.20574 -5.84357 21.91111 227.93861 245.87070 567.70002
11.65000 -3978.91492 6.36062 50.66114 202.55193 137.23784 541.77290
11.75000 -3951.25852 -0.45619 6.61433 162.78700 157.86018 546.54993
11.85000 -3929.96827 11.90473 8.28723 251.37342 163.45580 528.03397
11.95000 -3885.87824 9.47944 12.90857 152.43161 137.33647 525.51194
12.05000 -3862.31445 6.30244 11.63421 194.91393 136.46536 500.67897
12.15000 -3837.65266 9.86163 25.44660 155.82992 157.59207 491.30223
12.25000 -3811.11338 -0.09726 -24.08175 140.32079 130.31452 480.71048
12.35000 -3767.42107 0.61078 -3.50095 232.57881 125.12806 500.72377
12.45000 -3746.34165 10.60785 -20.88831 201.30887 224.66384 467.27339
12.55000 -3723.52270 10.37301 -29.31245 162.78539 169.30592 462.87891
12.65000 -3688.72155 -2.44187 0.59730 175.84096 114.02642 448.52850
12.75000 -3649.15997 11.70220 3.70274 199.88563 190.48325 446.38558
12.85000 -3634.22017 8.60288 -8.95349 138.66040 156.82078 482.76972
12.95000 -3617.56505 -6.69906 -20.55637 383.26399 186.44061 434.17252
13.05000 -3564.25790 1.15389 -3.53043 196.80814 206.31309 449.55407
13.15000 -3537.89602 29.24763 -19.87399 286.75095 760.28187 446.17722
13.25000 -3544.39236 3.85284 -14.20134 513.33468 173.37976 409.37553
13.35000 -3497.43615 12.83187 -16.52524 113.78616 111.53698 438.66275
13.45000 -3467.34525 3.68879 3.07883 127.02436 155.62160 397.59880
13.55000 -3446.69324 2.61693 -7.76234 156.98542 148.43815 375.07806
13.65000 -3432.69304 17.50054 -27.23881 265.37826 166.61888 416.56086
13.75000 -3401.91945 5.65842 -15.73031 102.52298 124.65561 361.43786
13.85000 -3396.42152 7.57808 -6.61521 155.06826 113.67579 363.59468
13.95000 -3369.44545 2.56028 -23.18235 100.27915 121.79056 352.26385
14.05000 -3344.28244 -1.31302 -28.12297 104.93670 130.40118 402.89827
14.15000 -3327.65907 15.36449 -0.90856 126.34171 151.75053 309.25685
14.25000 -3304.96671 14.29216 -20.84626 113.94869 103.15668 323.00812
14.35000 -3297.27096 13.78483 -19.72827 166.28320 128.64174 321.45428
14.45000 -3245.97349 17.84493 -25.76443 136.89692 115.79582 319.08912
14.55000 -3233.91247 7.94474 -23.82323 78.56336 84.56059 292.40571
14.65000 -3210.27418 4.78544 -30.62685 112.34777 120.06789 325.37193
14.75000 -3191.54349 14.98419 -28.45783 190.44023 113.72388 275.22944
14.85000 -3175.56674 -7.15572 -3.22913 122.62918 395.35576 411.60445
14.95000 -3145.04262 15.05694 4.75110 113.03915 102.71198 282.63723
15.05000 -3133.16128 55.92887 -36.82560 88.29458 929.57956 304.41860
15.15000 -3097.49038 7.75953 -26.33230 122.62547 83.76266 277.25890
15.25000 -3078.18792 7.04096 -20.39561 141.70280 133.79767 271.95733
15.35000 -3057.49811 12.12284 -44.16416 79.39165 57.66295 268.87925
15.45000 -3032.00882 10.71147 -42.04541 64.03967 82.08327 260.58984
15.55000 -3011.25348 -3.10821 -38.81900 104.29198 251.34091 276.25861
15.65000 -2995.59141 6.30038 -24.71432 83.37525 84.06680 239.01227
15.75000 -2980.10830 12.38747 -27.10335 120.88458 118.12738 270.24899
15.85000 -2956.42660 7.51857 -31.88050 150.91677 144.10545 323.35974
15.95000 -2938.77613 11.98894 -53.44859 72.49214 78.36387 248.41754
16.05000 -2921.59497 8.42754 -52.10789 74.42877 64.26247 247.46472
16.15000 -2901.50767 8.16539 -52.54326 60.52071 89.40598 234.51658
16.25000 -2878.43342 8.30187 -45.48793 90.43612 104.49141 222.43302
16.35000 -2858.48235 3.34541 2.10583 102.98980 99.54728 229.46067
16.45000 -2841.23825 4.48075 -31.86254 121.37850 73.01769 255.57167
16.55000 -2820.34536 9.96363 -23.62433 108.83019 156.21073 233.87534
16.65000 -2802.48297 11.79966 -10.17838 75.88551 69.56498 233.85340
16.75000 -2777.99280 13.51544 13.24638 71.18785 69.33468 234.58490
16.85000 -2756.19256 12.98879 -18.04209 92.90057 109.20870 265.27902
16.95000 -2747.67465 9.37234 -5.09679 58.54577 50.69485 214.11861
17.05000 -2725.40043 3.02231 -17.76715 47.46389 65.01474 210.73364
17.15000 -2709.37795 6.39543 -12.39014 60.54905 74.33748 214.49938
17.25000 -2690.42555 8.93701 -11.48679 89.54707 46.13193 205.52019
17.35000 -2675.07284 7.96746 1.62255 67.70135 66.86545 219.19165
17.45000 -2651.91253 21.73562 -9.76343 97.88458 147.95796 201.55510
17.55000 -2638.72796 4.93266 -19.37012 75.64075 69.81558 204.37711
17.65000 -2618.06658 2.76448 -13.45844 74.55405 66.82254 203.17626
17.75000 -2607.95375 2.43862 0.81301 87.52372 92.40298 201.05723
17.85000 -2582.82672 9.30290 15.25542 64.45980 58.20496 185.52270
17.95000 -2574.55406 17.35317 -9.95874 129.40841 44.58276 202.18457
18.05000 -2549.80553 9.96797 23.32081 57.69405 57.18069 178.14343
18.15000 -2541.64213 4.01912 -10.41710 57.86378 111.95543 209.89084
18.25000 -2527.54329 7.66852 -12.62590 64.21939 60.26047 189.88340
18.35000 -2506.79847 15.03704 -21.49555 49.16424 80.02051 211.74451
18.45000 -2490.58743 7.93002 -14.33864 51.74920 47.91307 174.69507
18.55000 -2485.32892 7.01115 -23.07144 50.20389 51.78612 175.24797
18.65000 -2461.16916 9.09794 -20.04445 124.36537 147.92239 161.56762
18.75000 -2456.55757 6.78731 -20.41577 41.21553 50.22333 168.40657
18.85000 -2434.12359 -1.99457 -20.77974 114.30291 83.01486 180.02543
18.95000 -2418.32903 10.13120 -4.57887 57.95601 55.05842 173.99741
19.05000 -2421.02663 11.93663 -28.38489 116.51042 99.67887 185.37059
19.15000 -2396.67074 -1.52446 -1.01104 49.87955 75.68590 175.33593
19.25000 -2380.03440 2.49833 -22.91644 71.50103 88.61446 164.87840
19.35000 -2374.12444 1.62858 -25.02373 46.08100 46.15304 167.84655
19.45000 -2344.23509 -0.66900 -18.50426 105.09751 82.08699 184.59137
19.55000 -2332.70719 9.47953 -33.72839 136.30703 44.44519 209.29917
19.65000 -2318.16532 5.19842 -56.04364 75.29457 44.09909 170.37491
19.75000 -2306.06853 2.69444 -9.13612 78.83318 77.56596 164.54022
19.85000 -2300.72526 4.36846 -16.29759 43.94505 37.50834 158.19453
19.95000 -2292.66465 8.54694 -20.41818 37.12150 34.16068 153.66154
