0.12500 0.01018
0.37500 0.01287
0.62500 0.01594
0.87500 0.03822
1.12500 0.02000
1.37500 0.01022
1.62500 0.03060
1.87500 0.01781
2.12500 0.02289
2.37500 0.05208
2.62500 0.05592
2.87500 0.04356
3.12500 0.02590
3.37500 0.01731
3.62500 0.01857
3.87500 0.03629
4.12500 0.03725
4.37500 0.02917
4.62500 0.01981
4.87500 0.02192
5.12500 0.02586
5.37500 0.02132
5.62500 0.03033
5.87500 0.03774
6.12500 0.02688
6.37500 0.02322
6.62500 0.02224
6.87500 0.05050
7.12500 0.02134
7.37500 0.02432
7.62500 0.04988
7.87500 0.05969
8.12500 0.04458
8.37500 0.05653
8.62500 0.03848
8.87500 0.01768
9.12500 0.02545
9.37500 0.00845
9.62500 0.03823
9.87500 0.02147
10.12500 0.03261
10.37500 0.02098
10.62500 0.02138
10.87500 0.03818
11.12500 0.02818
11.37500 0.04545
11.62500 0.01557
11.87500 0.04501
12.12500 0.05358
12.37500 0.01703
12.62500 0.01142
12.87500 0.06951
13.12500 0.04915
13.37500 0.03598
13.62500 0.03124
13.87500 0.03798
14.12500 0.03379
14.37500 0.02578
14.62500 0.01095
14.87500 0.01961
15.12500 0.02648
15.37500 0.06809
15.62500 0.04814
15.87500 0.00610
16.12500 0.04458
16.37500 0.05096
16.62500 0.08517
16.87500 0.07091
17.12500 0.01907
17.37500 0.03203
17.62500 0.00576
17.87500 0.03103
18.12500 0.08692
18.37500 0.02490
18.62500 0.03531
18.87500 0.00121
19.12500 0.02653
19.37500 0.04007
19.62500 0.05244
19.87500 0.06469
