0.12500 0.00615
0.37500 0.00450
0.62500 0.02686
0.87500 0.03888
1.12500 0.08759
1.37500 0.11297
1.62500 0.13440
1.87500 0.16600
2.12500 0.19120
2.37500 0.20226
2.62500 0.20272
2.87500 0.20022
3.12500 0.21032
3.37500 0.20944
3.62500 0.20824
3.87500 0.20029
4.12500 0.19550
4.37500 0.16898
4.62500 0.16765
4.87500 0.13842
5.12500 0.11260
5.37500 0.09486
5.62500 0.06879
5.87500 0.06109
6.12500 0.04199
6.37500 0.04637
6.62500 0.05872
6.87500 0.03432
7.12500 0.05107
7.37500 0.04357
7.62500 0.04860
7.87500 0.03912
8.12500 0.05564
8.37500 0.07015
8.62500 0.06114
8.87500 0.06280
9.12500 0.08101
9.37500 0.07054
9.62500 0.08121
9.87500 0.09121
10.12500 0.07610
10.37500 0.07321
10.62500 0.07135
10.87500 0.06893
11.12500 0.07288
11.37500 0.05898
11.62500 0.07047
11.87500 0.05847
12.12500 0.05533
12.37500 0.05102
12.62500 0.04638
12.87500 0.04478
13.12500 0.03574
13.37500 0.03708
13.62500 0.02055
13.87500 0.05063
14.12500 0.03885
14.37500 0.05971
14.62500 0.07553
14.87500 0.06432
