0.120000 -2.519210
0.380000 0.952970
0.620000 0.701340
0.880000 0.810350
1.120000 0.451550
1.380000 0.632280
1.620000 0.581420
1.880000 0.738800
2.120000 0.793660
2.380000 0.856040
2.620000 0.820830
2.880000 0.704480
3.120000 0.768740
3.380000 0.684800
3.620000 0.567450
3.880000 0.610340
4.120000 0.446070
4.380000 0.389750
4.620000 0.278150
4.880000 -0.008840
5.120000 -0.347110
5.380000 -0.178480
5.620000 -0.280550
5.880000 -0.480350
6.120000 -0.602320
6.380000 -0.570380
6.620000 -0.470340
6.880000 -1.143500
7.120000 -1.028510
7.380000 -0.726360
7.620000 -1.069830
7.880000 -2.228150
8.120000 -2.203860
8.380000 -1.654520
8.620000 -1.866500
8.880000 -2.876460
9.120000 -1.493220
9.380000 -1.425640
9.620000 -1.463180
9.880000 -1.069450
10.120000 -2.191580
10.380000 -1.770590
10.620000 -1.347010
10.880000 2.976590
11.120000 1.630930
11.380000 1.971310
11.620000 -0.093550
11.880000 0.274780
12.120000 0.520920
12.380000 -0.439660
12.620000 -0.820660
12.880000 -0.057780
13.120000 -0.729780
13.380000 -0.014210
13.620000 -1.223970
13.880000 1.999120
14.120000 -2.476930
14.380000 -1.418880
14.620000 -2.912260
14.880000 -2.253770
