0.120000 -1.810300
0.380000 1.157130
0.620000 -1.297110
0.880000 1.123070
1.120000 0.778530
1.380000 0.204620
1.620000 -0.216750
1.880000 -0.752710
2.120000 -0.982310
2.380000 -1.429140
2.620000 -1.608770
2.880000 -1.311770
3.120000 -1.259060
3.380000 -1.319140
3.620000 -1.436150
3.880000 -1.981100
4.120000 -2.153110
4.380000 -2.678210
4.620000 -2.457660
4.880000 -2.773620
5.120000 -1.820140
5.380000 -0.701440
5.620000 -1.343120
5.880000 -2.289250
6.120000 -2.390830
6.380000 -2.979110
6.620000 2.527920
6.880000 2.881410
7.120000 2.453420
7.380000 0.451730
7.620000 0.079720
7.880000 -1.193060
8.120000 -0.721270
8.380000 -1.456080
8.620000 -1.186340
8.880000 -1.568060
9.120000 -1.219840
9.380000 -1.503400
9.620000 -1.290830
9.880000 -1.635550
10.120000 -2.213200
10.380000 -2.331770
10.620000 -2.334940
10.880000 -2.379430
11.120000 -3.003840
11.380000 -2.939940
11.620000 -2.834910
11.880000 1.468690
12.120000 1.967020
12.380000 1.535630
12.620000 0.540170
12.880000 0.804020
13.120000 0.470620
13.380000 0.512200
13.620000 -0.260880
13.880000 -0.724030
14.120000 -1.024380
14.380000 -2.604330
14.620000 2.947880
14.880000 -1.297400
