0.120000 -2.719890
0.380000 -2.343290
0.620000 -2.485930
0.880000 -2.279010
1.120000 -2.353220
1.380000 -2.303420
1.620000 -2.280420
1.880000 -2.289410
2.120000 -2.271570
2.380000 -2.239270
2.620000 -2.240530
2.880000 -2.252790
3.120000 -2.257880
3.380000 -2.256150
3.620000 -2.234270
3.880000 -2.258830
4.120000 -2.231000
4.380000 -2.237150
4.620000 -2.232450
4.880000 -2.187550
5.120000 -2.154270
5.380000 -2.120150
5.620000 -2.013770
5.880000 -1.976900
6.120000 -1.863550
6.380000 -1.778990
6.620000 -1.751610
6.880000 -1.790550
7.120000 -1.778840
7.380000 -1.938990
7.620000 -2.040760
7.880000 -2.398480
8.120000 -2.687000
8.380000 -2.741260
8.620000 -2.990260
8.880000 -2.977190
9.120000 -2.862040
9.380000 -2.920270
9.620000 -3.022920
9.880000 -3.058530
10.120000 -3.036780
10.380000 -3.090480
10.620000 2.994360
10.880000 2.946680
11.120000 2.780280
11.380000 2.569190
11.620000 2.397890
11.880000 2.179940
12.120000 2.367480
12.380000 3.002710
12.620000 -2.539770
12.880000 -2.033410
13.120000 -2.234060
13.380000 -1.949030
13.620000 -2.564800
13.880000 -2.720270
14.120000 -2.719660
14.380000 -3.069230
14.620000 3.120600
14.880000 2.735680
