0.12500 0.01453
0.37500 0.09651
0.62500 0.16877
0.87500 0.23376
1.12500 0.26488
1.37500 0.29089
1.62500 0.31018
1.87500 0.33064
2.12500 0.32566
2.37500 0.33273
2.62500 0.30804
2.87500 0.28248
3.12500 0.25216
3.37500 0.22304
3.62500 0.20763
3.87500 0.17190
4.12500 0.14326
4.37500 0.11239
4.62500 0.10923
4.87500 0.08421
5.12500 0.06571
5.37500 0.05048
5.62500 0.03432
5.87500 0.04498
6.12500 0.03976
6.37500 0.04889
6.62500 0.04961
6.87500 0.05228
7.12500 0.05071
7.37500 0.05541
7.62500 0.06019
7.87500 0.06395
8.12500 0.05726
8.37500 0.04633
8.62500 0.03758
8.87500 0.03595
9.12500 0.02654
9.37500 0.01172
9.62500 0.02653
9.87500 0.01383
10.12500 0.00583
10.37500 0.02397
10.62500 0.01715
10.87500 0.04374
11.12500 0.02339
11.37500 0.03014
11.62500 0.04044
11.87500 0.04012
12.12500 0.04624
12.37500 0.02659
12.62500 0.02713
12.87500 0.01899
13.12500 0.03589
13.37500 0.03363
13.62500 0.04477
13.87500 0.04252
14.12500 0.03384
14.37500 0.05204
14.62500 0.05746
14.87500 0.06261
