0.120000 -0.781270
0.380000 0.461550
0.620000 0.503640
0.880000 0.615200
1.120000 0.627860
1.380000 0.674520
1.620000 0.617390
1.880000 0.541860
2.120000 0.528490
2.380000 0.533970
2.620000 0.492830
2.880000 0.469570
3.120000 0.403150
3.380000 0.367600
3.620000 0.317690
3.880000 0.274170
4.120000 0.175000
4.380000 0.054010
4.620000 -0.042930
4.880000 0.026900
5.120000 0.152820
5.380000 0.272550
5.620000 0.010520
5.880000 0.013870
6.120000 -0.041520
6.380000 -0.168430
6.620000 -0.284430
6.880000 -0.546760
7.120000 -0.663970
7.380000 -0.558240
7.620000 -0.562640
7.880000 -0.507960
8.120000 -0.717880
8.380000 -0.784380
8.620000 -1.044570
8.880000 -1.313880
9.120000 -1.615890
9.380000 -1.884890
9.620000 -1.959760
9.880000 -2.162290
10.120000 -2.380930
10.380000 -2.531730
10.620000 -2.622790
10.880000 -2.971690
11.120000 -2.928390
11.380000 3.033000
11.620000 2.866390
11.880000 2.791150
12.120000 2.832020
12.380000 2.482370
12.620000 2.514610
12.880000 1.927110
13.120000 1.451060
13.380000 0.953050
13.620000 0.385680
13.880000 -0.301980
14.120000 -0.435680
14.380000 -1.091710
14.620000 -1.569170
14.880000 -1.815800
