0.125 -0.000 -0.000 0.001
0.375 -0.002 -0.001 0.056
0.625 0.002 0.004 0.314
0.875 -0.003 -0.021 0.833
1.125 0.007 -0.046 1.784
1.375 0.025 -0.029 2.953
1.625 0.034 -0.072 4.520
1.875 0.039 -0.088 6.166
2.125 -0.000 -0.095 7.842
2.375 0.020 -0.131 9.656
2.625 0.005 -0.146 11.400
2.875 -0.001 -0.135 12.927
3.125 0.066 -0.200 14.541
3.375 0.027 -0.196 16.148
3.625 0.030 -0.175 17.403
3.875 0.032 -0.130 18.515
4.125 0.023 -0.164 19.444
4.375 0.033 -0.132 20.486
4.625 0.036 -0.217 20.833
4.875 -0.025 -0.184 21.350
5.125 0.055 -0.169 22.742
5.375 0.074 -0.152 24.283
5.625 0.057 -0.190 26.147
5.875 0.053 -0.138 26.252
6.125 0.099 -0.161 24.762
6.375 0.039 -0.148 23.321
6.625 0.085 -0.136 22.579
6.875 0.088 -0.107 23.568
7.125 0.033 -0.138 25.722
7.375 0.107 -0.197 27.445
7.625 0.086 -0.157 27.821
7.875 0.098 -0.134 26.588
8.125 0.057 -0.142 24.669
8.375 0.046 -0.154 22.234
8.625 0.041 -0.076 20.438
8.875 0.026 -0.067 18.642
9.125 0.074 -0.100 17.366
9.375 0.077 -0.080 17.436
9.625 0.068 -0.088 17.626
9.875 0.066 -0.078 18.287
10.125 0.046 -0.107 19.142
10.375 0.080 -0.078 20.930
10.625 0.066 -0.074 20.877
10.875 0.096 -0.106 20.228
11.125 0.060 -0.075 18.239
11.375 0.046 -0.089 16.667
11.625 0.060 -0.092 15.978
11.875 0.067 -0.055 16.054
12.125 0.042 -0.051 15.751
12.375 0.043 -0.056 15.500
12.625 0.055 -0.040 14.489
12.875 0.025 -0.055 12.797
13.125 0.039 -0.031 11.569
13.375 0.027 -0.030 10.000
13.625 0.028 -0.028 9.044
13.875 0.015 -0.038 8.332
14.125 0.021 -0.039 7.688
14.375 0.008 -0.030 7.476
14.625 0.018 -0.038 7.486
14.875 0.009 -0.037 6.803
