0.120000 -2.599650
0.380000 2.924910
0.620000 3.074600
0.880000 -3.139840
1.120000 3.089090
1.380000 3.066140
1.620000 3.101070
1.880000 3.052780
2.120000 3.051830
2.380000 3.085050
2.620000 3.062360
2.880000 3.080210
3.120000 3.068450
3.380000 3.074600
3.620000 3.058470
3.880000 3.051930
4.120000 3.041660
4.380000 3.040070
4.620000 3.028690
4.880000 3.031280
5.120000 3.046590
5.380000 3.046170
5.620000 3.019780
5.880000 2.984070
6.120000 2.955000
6.380000 2.935560
6.620000 2.959150
6.880000 2.891540
7.120000 2.830580
7.380000 2.779670
7.620000 2.763850
7.880000 2.497070
8.120000 2.276990
8.380000 2.169790
8.620000 2.010180
8.880000 1.927380
9.120000 1.895830
9.380000 1.663390
9.620000 1.685190
9.880000 1.690510
10.120000 1.577940
10.380000 1.698690
10.620000 1.685130
10.880000 1.753790
11.120000 2.041850
11.380000 1.747360
11.620000 2.203490
11.880000 2.477970
12.120000 2.567020
12.380000 2.783740
12.620000 2.523230
12.880000 2.845180
13.120000 2.817850
13.380000 2.819050
13.620000 2.569570
13.880000 2.173320
14.120000 2.527870
14.380000 2.238710
14.620000 1.709060
14.880000 2.179420
