0.05000 5.31651 -407.42246 5030.61082 1583.78262 694.72613 43.76221
0.15000 -381.57861 457.29073 5088.76713 1209.34426 1135.21437 344.21932
0.25000 -988.96775 -72.18158 5015.28665 1427.66088 1598.63503 535.37225
0.35000 -746.58157 33.43195 5019.66404 1422.31275 1373.74579 336.60909
0.45000 -1130.06557 81.72075 4858.29772 1396.15664 1352.91237 541.50108
0.55000 -962.31380 -10.14195 4814.16448 1412.48173 1538.86934 492.30681
0.65000 -1559.35008 258.24971 4640.37001 1432.69896 1460.90242 659.06812
0.75000 -1510.74262 165.28523 4647.63265 1490.72343 1503.98334 692.61661
0.85000 -1766.70371 105.03436 4440.97548 1536.59420 1537.64448 721.10240
0.95000 -1901.72951 56.94074 4312.91385 1703.77242 1643.30018 791.78024
1.05000 -2100.12277 20.28540 4231.31253 1508.81192 1623.23384 804.29181
1.15000 -2317.30225 -40.52262 4047.40792 1458.24689 1773.78651 897.75558
1.25000 -2349.66110 -111.15492 3950.54889 1795.56712 1963.09883 1369.11513
1.35000 -2604.65293 -101.07314 3664.19100 1839.81176 1971.62167 1128.02764
1.45000 -2839.31488 90.17261 3471.90290 1730.09759 2066.59429 1195.53006
1.55000 -2906.29839 -55.25080 3096.85593 2137.60440 2444.13121 1370.11553
1.65000 -3125.10772 34.62380 2687.11649 2041.48155 2373.38487 1559.03094
1.75000 -3326.75744 35.21181 2123.02268 1956.15719 2246.64205 1871.07423
1.85000 -3505.39760 56.29104 1688.34384 1977.00662 2252.13154 2280.98601
1.95000 -3661.43104 -37.66532 1328.81080 1851.14966 1994.29073 2533.96014
2.05000 -3766.15664 125.52461 1077.62150 1797.36910 1919.65599 2549.33321
2.15000 -3758.97563 -59.20569 884.33989 1689.74370 1761.96802 2714.04885
2.25000 -3734.72383 -22.28448 875.27124 1636.01872 1552.97282 2874.03478
2.35000 -3805.21053 -36.07293 717.26596 1588.53446 1703.94149 2880.95597
2.45000 -3850.61198 -14.70103 644.36842 1445.34815 1417.46684 2809.14191
2.55000 -3874.19891 -1.89454 640.74057 1317.32530 1207.78785 2680.93268
2.65000 -3779.92515 -11.26172 599.60636 1377.38956 1122.89437 2745.29048
2.75000 -3807.85808 2.41507 587.88185 1371.06622 1074.07272 2700.24396
2.85000 -3734.57477 -24.77576 459.76310 1287.80619 1004.46136 2728.00323
2.95000 -3741.56476 -36.44724 373.97826 1238.19324 985.14996 2700.59378
3.05000 -3687.72325 -32.79849 404.79878 1319.28460 898.48424 2683.29479
3.15000 -3684.03261 1.32846 382.98811 1301.48806 890.68550 2632.08048
3.25000 -3656.41031 -4.21574 321.73104 1312.81831 894.35754 2619.12003
3.35000 -3620.89356 -3.36148 192.35693 1251.84439 797.23669 2659.09824
3.45000 -3620.08663 -17.42726 314.79162 1210.35694 722.96929 2563.13546
3.55000 -3526.13765 -41.11919 281.34260 1161.42852 717.70335 2633.27731
3.65000 -3518.57468 1.26618 224.34823 1143.62869 666.39343 2583.49477
3.75000 -3484.55521 26.49762 185.83967 1370.65041 706.22525 2581.71362
3.85000 -3439.77050 -10.09387 271.73205 1172.19609 636.49377 2548.51032
3.95000 -3441.66575 -14.85593 292.15308 1069.67078 614.55094 2496.43307
4.05000 -3451.42545 16.23493 166.70247 1096.49066 589.43034 2460.67661
4.15000 -3363.49017 -5.29046 139.30581 1116.22088 580.47778 2518.68039
4.25000 -3386.80985 3.39841 51.10195 1026.16180 541.05620 2484.25362
4.35000 -3333.70886 -4.04911 132.62874 1043.57195 530.52812 2454.39819
4.45000 -3289.61629 8.93877 106.37066 1015.71289 516.49297 2478.76513
4.55000 -3280.01827 7.25944 126.00885 1054.66536 478.22868 2429.91759
4.65000 -3289.32569 -0.87583 36.30870 995.42980 496.72663 2405.79155
4.75000 -3270.49351 -12.87882 162.20810 1004.56189 464.14167 2331.78775
4.85000 -3224.00388 -0.48105 30.86591 995.74578 588.02524 2471.29251
4.95000 -3191.03179 -8.22807 59.45410 978.93561 486.19573 2383.09793
5.05000 -3184.99081 -6.87552 28.76048 998.75703 557.37143 2424.54695
5.15000 -3149.34357 -10.25691 192.71659 1009.51279 490.32025 2303.37203
5.25000 -3107.71353 2.14527 90.22808 990.00021 442.88950 2370.41670
5.35000 -3085.58045 -5.84125 -33.20911 956.59492 431.33760 2336.23766
5.45000 -3102.96402 13.24767 90.04459 948.99008 409.99840 2265.03380
5.55000 -3074.90299 10.31593 69.75511 950.30263 398.82668 2252.16032
5.65000 -3085.83584 8.70032 -27.61115 911.70427 401.93674 2223.97432
5.75000 -3031.66462 6.25222 44.91321 930.30285 388.04975 2244.59659
5.85000 -3010.52729 -2.84588 97.36873 902.25408 367.51064 2213.19336
5.95000 -2998.97968 14.01558 8.02386 927.93045 356.54726 2228.20101
6.05000 -2997.53760 -0.57530 19.96365 895.69245 389.22971 2174.92798
6.15000 -2952.03549 6.50519 96.59547 907.10388 336.30993 2177.57951
6.25000 -2923.12443 -3.19098 -55.57538 919.68550 336.70098 2193.86167
6.35000 -2927.42005 -4.12556 53.93313 880.73133 317.64020 2127.82959
6.45000 -2923.32924 -4.01449 -28.25930 883.01406 323.20832 2135.83023
6.55000 -2889.52759 2.64738 6.47977 866.70784 312.43205 2128.36743
6.65000 -2864.75202 1.79428 -12.42585 892.88013 311.05152 2119.53524
6.75000 -2836.19118 4.31663 7.51372 867.29321 292.24619 2123.69864
6.85000 -2849.92020 2.37251 18.25891 833.79952 289.40138 2068.75517
6.95000 -2806.16341 -9.88694 12.40002 860.60441 286.78744 2073.97962
7.05000 -2806.07558 1.43280 -46.71532 851.38738 267.25432 2078.11804
7.15000 -2788.27200 3.15282 51.42586 840.22790 269.55145 2036.68478
7.25000 -2786.24146 -1.70521 -51.48185 810.63195 280.42463 2032.02519
7.35000 -2735.46488 -2.32604 44.60196 828.43979 269.76575 2022.73320
7.45000 -2740.65734 -2.07136 0.15941 1020.23742 429.07371 2012.33204
7.55000 -2733.01171 2.11259 -40.99018 802.63858 255.75188 1992.32282
7.65000 -2703.67780 9.00049 23.98931 806.54202 247.89624 1980.25091
7.75000 -2697.55309 4.53834 55.66003 786.50120 245.57992 1960.39809
7.85000 -2709.97803 -1.06974 -33.32393 764.43041 261.53362 1930.42978
7.95000 -2679.54320 -4.62257 -90.86354 778.79707 233.16544 1934.49667
8.05000 -2646.23899 5.15261 -26.71895 765.36976 218.24530 1935.72413
8.15000 -2634.00287 -8.61750 -55.01457 783.43705 241.38031 1922.91293
8.25000 -2604.77285 -4.20401 -93.74596 780.42411 225.23906 1931.01712
8.35000 -2594.60956 1.80117 -82.61176 780.42697 244.31725 1901.77951
8.45000 -2573.34192 -8.87031 -90.52115 768.24660 290.61944 1907.69733
8.55000 -2587.83859 8.88189 -98.33756 760.23882 213.62685 1864.66875
8.65000 -2526.27745 -6.65327 -87.53962 775.47220 214.04059 1908.36621
8.75000 -2548.30854 -0.27484 2.43993 745.59249 214.89051 1839.60968
8.85000 -2545.26455 3.74977 -83.75915 734.92970 199.94505 1839.18996
8.95000 -2511.80997 4.94559 -53.20170 754.11696 203.82664 1833.98911
9.05000 -2496.60965 2.23553 -40.49476 756.89642 242.20974 1839.88042
9.15000 -2471.87618 -3.61329 -51.04251 736.60221 235.25446 1829.02952
9.25000 -2457.43073 1.91667 -43.14697 740.21210 224.29239 1813.51827
9.35000 -2440.01956 0.16496 -38.48766 744.21291 245.77327 1810.70250
9.45000 -2432.01268 3.12035 -89.94178 734.86860 200.04256 1802.44918
9.55000 -2412.08628 0.95285 -58.67968 720.48361 195.50452 1795.45648
9.65000 -2402.12700 1.21698 -80.84629 704.78136 199.86024 1783.86700
9.75000 -2401.22848 2.45280 -63.74558 699.50751 179.56889 1763.05533
9.85000 -2376.79535 2.65830 -79.13715 715.25057 191.27944 1759.04116
9.95000 -2358.72972 1.05263 -127.18394 717.37724 176.30210 1756.20262
10.05000 -2359.12992 -5.29460 -38.58571 679.38409 177.07755 1730.14278
10.15000 -2345.18209 -2.82866 -85.97953 711.71543 235.98464 1729.85963
10.25000 -2326.81795 3.51497 -68.13279 691.52807 178.97077 1730.71711
10.35000 -2327.52148 2.82697 -51.04168 684.41785 160.74890 1709.74155
10.45000 -2308.12442 1.02895 -51.88669 674.02462 165.86037 1696.05530
10.55000 -2287.61967 3.93517 -31.61648 679.00988 179.42185 1685.47901
10.65000 -2274.57656 -3.33786 -61.14045 673.62995 215.01415 1691.27888
10.75000 -2247.62109 -2.90663 -87.27926 668.53656 161.04433 1697.06182
10.85000 -2257.51739 3.41914 -48.07494 658.24729 201.28752 1670.12914
10.95000 -2235.32627 0.32590 -75.73357 661.40762 206.59164 1664.61896
11.05000 -2226.09885 3.62595 -91.18208 660.59024 144.86675 1649.43480
11.15000 -2213.64645 -2.65055 -109.70022 652.99328 152.44597 1651.43543
11.25000 -2209.35092 0.01786 -59.95537 653.32217 165.02049 1620.07970
11.35000 -2218.02856 -3.01921 -103.60210 626.04886 132.12753 1594.35924
11.45000 -2187.73689 -0.95028 -54.13130 637.79150 144.87699 1606.03847
11.55000 -2176.38515 3.77601 -62.66735 651.26068 137.37160 1600.41610
11.65000 -2130.36756 0.25343 -57.51968 653.86322 165.03702 1623.41830
11.75000 -2177.53555 2.59060 -24.26346 625.37181 152.46095 1557.93725
11.85000 -2129.85995 -3.66137 -132.30859 624.37993 124.87072 1594.12399
11.95000 -2127.60808 0.56055 -14.29801 616.58728 124.85470 1559.56674
12.05000 -2118.17516 6.04640 -37.95859 623.12393 178.86619 1558.69568
12.15000 -2105.94075 -0.72650 -35.21561 622.15207 128.30065 1542.75037
12.25000 -2082.49868 -0.17879 -110.21708 615.36626 135.89917 1562.89622
12.35000 -2077.03135 -0.84385 -90.26046 598.92897 126.48821 1545.86987
12.45000 -2069.38819 -3.63053 -51.98688 609.98077 132.93165 1534.13466
12.55000 -2063.24428 5.13080 -30.61191 597.02926 143.49375 1517.51603
12.65000 -2042.03615 -2.85809 -36.36000 593.25063 113.71723 1518.35847
12.75000 -2044.61413 -1.86966 -25.42380 598.51535 117.89827 1491.95908
12.85000 -2029.99699 1.89674 -50.72234 590.36613 118.09411 1491.09096
12.95000 -2019.04069 2.70016 -53.50897 590.34174 119.37535 1482.85733
13.05000 -2003.66419 0.37709 -68.76611 579.78160 109.05306 1486.87772
13.15000 -2005.46953 0.30286 -72.99192 584.48266 115.14184 1466.91991
13.25000 -2011.91831 -0.33629 -102.45851 569.97738 106.85873 1443.01423
13.35000 -1958.45655 2.16488 -34.17603 577.20514 129.40841 1478.95062
13.45000 -1980.22388 -2.90785 -103.16762 561.41801 149.06775 1434.54668
13.55000 -1971.85701 1.13574 -104.64394 568.03368 137.06361 1432.16607
13.65000 -1943.83312 -0.15701 -64.32364 565.35440 96.75048 1436.26389
13.75000 -1935.62878 0.78164 -68.51528 558.73378 138.95531 1429.27476
13.85000 -1937.43259 1.62768 -128.07464 554.87571 105.72473 1417.82613
13.95000 -1906.35283 -1.29170 -62.12108 558.61958 108.29614 1423.90600
14.05000 -1907.05595 0.16054 -19.48058 560.99709 117.55332 1407.03629
14.15000 -1887.33695 0.66375 -74.78316 547.05369 159.33549 1418.81508
14.25000 -1906.39859 -1.68731 -72.86873 546.86918 94.32783 1372.17206
14.35000 -1859.42510 1.58128 -35.57111 554.80322 94.71306 1405.65978
14.45000 -1873.93674 -2.13669 -76.00775 540.32719 108.39938 1373.92294
14.55000 -1882.06823 -0.98549 -99.41338 532.11787 106.15529 1353.96197
14.65000 -1853.88785 0.20888 -75.42635 538.62370 92.21297 1365.86327
14.75000 -1845.03856 -0.15277 -22.40784 549.77160 119.56345 1352.04163
14.85000 -1852.17018 1.79541 -79.26954 522.36972 116.14545 1337.45442
14.95000 -1822.41011 0.04656 -61.34700 536.75124 88.30154 1349.32521
15.05000 -1825.68253 -3.37306 -63.14834 517.22855 119.16330 1331.73192
15.15000 -1810.56417 1.29735 -106.77398 523.06584 110.25811 1333.39455
15.25000 -1802.97687 0.96681 -41.80541 534.80789 85.78421 1320.95085
15.35000 -1792.33343 1.24472 -61.14301 522.12229 98.14854 1314.16951
15.45000 -1798.65929 1.35549 -69.12035 506.48706 113.36786 1296.23417
15.55000 -1784.33646 -0.88364 -89.85683 502.34253 82.03358 1296.45253
15.65000 -1752.30028 3.58083 -69.64883 529.71287 157.78139 1315.07437
15.75000 -1771.33460 1.04316 -65.21364 508.10920 95.32694 1283.47103
15.85000 -1744.64071 -1.97831 -48.74428 508.54566 83.15907 1294.60946
15.95000 -1736.28979 -0.09253 -11.55224 506.15045 86.34264 1280.23494
16.05000 -1743.08662 0.79488 -46.13613 497.58015 93.82783 1265.47540
16.15000 -1724.06018 -0.30070 -23.27390 508.00878 135.65812 1270.54309
16.25000 -1716.77038 0.34207 -59.99577 499.01581 91.85953 1263.86304
16.35000 -1716.75721 -0.15997 -77.87434 500.46544 94.32074 1254.09521
16.45000 -1701.17043 -1.66592 5.84353 490.43559 94.22912 1253.33982
16.55000 -1698.26609 -1.49925 -93.18266 489.05618 86.27575 1239.18878
16.65000 -1677.05079 -0.55521 -1.52653 499.13823 79.36617 1243.48301
16.75000 -1677.84012 -0.50924 -40.46850 492.48935 85.27112 1239.46532
16.85000 -1672.95493 2.86802 -54.68961 490.61416 136.49342 1232.99997
16.95000 -1666.93548 -0.65242 -71.53631 480.03218 108.00235 1223.25434
17.05000 -1652.64392 -0.30234 -79.46844 480.53148 108.21454 1220.73041
17.15000 -1656.43157 0.56250 -106.14628 473.55435 114.95279 1204.44181
17.25000 -1661.99490 1.65409 -87.08790 466.15734 75.87044 1180.48920
17.35000 -1625.77425 0.26151 -59.84783 479.16278 67.25155 1201.96699
17.45000 -1631.46694 2.89718 -40.14886 460.46985 85.09564 1186.12276
17.55000 -1624.95929 -0.85484 -33.40922 463.76185 70.46038 1176.93691
17.65000 -1614.90721 -1.09752 -65.56806 457.44831 78.43605 1180.32158
17.75000 -1593.63916 1.93450 -70.80104 468.64601 92.72451 1192.06545
17.85000 -1600.08391 -1.80210 -75.05761 462.40924 78.06956 1167.41305
17.95000 -1582.83651 0.53170 -32.69081 466.18850 84.95001 1174.87168
18.05000 -1596.78663 -0.11461 -83.69733 455.04904 79.19628 1146.35208
18.15000 -1574.88707 -1.26946 -44.98698 454.69011 77.63148 1161.70218
18.25000 -1580.11537 0.59412 -37.66890 444.51259 68.05250 1135.73142
18.35000 -1565.48378 -0.46571 -70.45647 452.79412 80.13744 1143.84440
18.45000 -1540.56244 0.98355 -64.70452 483.64758 117.68128 1157.36725
18.55000 -1539.16710 1.80608 -83.40491 451.13923 81.63983 1144.59102
18.65000 -1539.08679 0.08676 -10.15770 441.28932 58.58583 1130.30876
18.75000 -1532.95676 -1.14255 -57.73801 443.01282 87.77891 1125.11455
18.85000 -1521.96879 1.11973 -37.80097 436.98486 68.82313 1129.57143
18.95000 -1510.91486 0.55129 -52.84586 448.93862 66.26986 1128.81593
19.05000 -1511.60116 -0.16710 -27.07006 435.85618 65.58721 1110.64711
19.15000 -1516.99921 -0.01513 -44.86491 428.00087 55.64265 1091.80594
19.25000 -1505.35327 -0.99752 -45.44469 462.36134 106.80973 1094.29655
19.35000 -1497.49775 -0.48098 -59.25624 421.49958 64.68069 1092.97117
19.45000 -1486.19695 1.14465 -67.24634 425.72982 60.81193 1093.53631
19.55000 -1484.48712 1.22783 -47.79449 419.42600 52.43194 1079.34510
19.65000 -1468.56760 -0.14540 -61.18184 433.41574 66.54204 1085.56199
19.75000 -1465.61674 -1.41235 -42.30309 417.41969 61.66116 1079.35890
19.85000 -1451.28005 -0.72811 -38.45127 425.52354 62.78962 1077.87052
19.95000 -1440.35201 0.48033 -54.20270 431.28743 64.04173 1081.60510
