0.05000 -233.89434 -883.86121 317403.86198 3066.49124 1752.03686 75632.37194
0.15000 1212.90144 388.87717 714.43085 2094.69995 1404.60923 126678.77681
0.25000 -850.00251 -290.82947 -316280.78591 2361.83154 1781.08864 1496718.95868
0.35000 -586.61041 220.62021 -408342.24987 2517.10642 1816.60378 1849114.43525
0.45000 -275.73102 -50.29844 -322334.98136 2665.67456 1817.06545 1182628.79396
0.55000 -576.54902 -100.67485 -77280.53700 2568.81090 1964.55540 850113.63821
0.65000 -934.97350 -168.51005 -2105.78404 2438.89513 1937.15888 986817.98509
0.75000 -662.39691 -101.65244 -175722.65344 2481.29917 1839.70496 1251441.47175
0.85000 -1037.68917 -77.34107 22879.55031 2283.61697 1816.08157 760259.98084
0.95000 -1163.68321 156.05442 125931.66372 2289.28200 2099.46343 1304277.02199
1.05000 -1331.97938 70.43080 19542.21998 2198.57509 1893.93978 1181790.80417
1.15000 -1613.21951 93.15089 107448.60127 2101.28718 2035.64880 2485259.69312
1.25000 -1735.62886 -31.17618 77132.69138 2030.93125 2006.15949 1602449.48346
1.35000 -1960.21673 -47.89960 -96612.65412 1909.07475 2080.37493 1945012.82263
1.45000 -2214.95425 10.04617 -24245.71567 1633.32480 2157.91223 1250836.54825
1.55000 -2588.21057 -1.42914 87989.89178 1353.69910 2254.32872 1514995.69038
1.65000 -2883.63902 91.57839 44782.72935 1554.81570 2279.98668 1840382.27207
1.75000 -3205.76530 -16.95069 48443.56464 842.12697 2032.41810 1289422.99580
1.85000 -3427.57742 -65.05721 44859.70699 738.93119 1666.36292 1569529.88077
1.95000 -3581.92702 32.90920 16014.82221 800.74898 1625.40431 1807134.75040
2.05000 -3717.40993 -32.83801 -67531.62487 1157.53341 1504.14663 1819575.44916
2.15000 -3786.00452 17.49279 -84843.42740 615.73497 1353.37748 2130201.97329
2.25000 -3845.21395 27.48338 -23159.67837 480.55497 1297.84853 1827471.23376
2.35000 -3913.07983 22.97377 25109.12997 763.22011 1246.84686 1735763.58968
2.45000 -3981.57814 31.05454 -27379.86352 1009.15533 1425.11587 1589433.18434
2.55000 -3996.80702 -7.03445 -41311.27338 437.98878 1109.63790 1571430.94546
2.65000 -4017.63311 9.61120 -65913.09490 393.32937 1046.33800 2071604.90135
2.75000 -4034.18063 38.88993 -50980.49743 395.20655 1076.91664 1659024.01239
2.85000 -4059.96802 -5.02498 55225.50748 445.98760 1035.13621 2110772.53055
2.95000 -4060.52466 -26.52118 -69839.92652 366.83334 900.97889 2194393.47661
3.05000 -4059.21988 -13.48968 24662.58988 386.53372 901.68187 2077627.76590
3.15000 -4071.86694 -32.13851 -15703.30675 414.21047 1002.52003 1971506.39871
3.25000 -4067.09346 -2.25718 -78108.69867 534.47650 833.10158 2560123.97060
3.35000 -4061.98136 36.46974 84449.34891 514.91880 836.54273 2430715.28877
3.45000 -4037.52317 -17.44960 53235.50446 730.59849 794.58308 2197606.97451
3.55000 -4074.49982 8.40230 -10945.27457 1424.23813 1590.42392 2232622.91339
3.65000 -4025.03721 -26.62010 -5248.16134 377.11931 718.68780 2082828.07893
3.75000 -3992.70846 16.28521 69833.92668 434.11422 683.34025 2219060.47301
3.85000 -4002.60875 7.04008 61795.13077 883.77059 709.87944 2480604.51978
3.95000 -3963.21702 -2.52459 19209.46032 334.31504 629.77870 2464582.45763
4.05000 -3957.35166 13.08033 41122.31833 366.28686 626.97024 2538765.63027
4.15000 -3943.77214 -1.44224 -23031.60235 1181.38723 1529.82245 2077262.83876
4.25000 -3816.83647 113.73043 -8878.55928 4621.75732 5890.94600 2356106.95485
4.35000 -3919.67353 -28.14101 51391.37755 292.30297 556.18554 2184452.47595
4.45000 -3902.41426 7.45791 109846.98776 525.14336 602.27514 2044002.30353
4.55000 -3894.00853 -5.26955 27783.59488 425.40955 790.25887 2097606.12655
4.65000 -3871.55644 4.10484 129883.15733 274.63541 519.12105 2294927.81935
4.75000 -3851.98191 13.32704 36170.26772 292.87221 496.48985 2689923.91520
4.85000 -3832.61499 13.02698 84237.70997 838.30544 1299.88381 2508490.77639
4.95000 -3814.51715 10.16696 -19048.06518 291.97985 499.02326 2245277.80777
5.05000 -3793.32912 5.72037 -5608.91104 344.85151 552.63671 2437172.33979
5.15000 -3769.11146 -2.54118 -31203.53420 253.05547 447.41972 2258482.57943
5.25000 -3767.19228 -17.55410 93911.87711 1805.36144 697.55056 2428017.43573
5.35000 -3738.51091 -9.01410 37806.90612 401.64353 487.10141 2117773.93632
5.45000 -3717.67722 -1.38978 6287.34347 242.21679 444.02901 2281762.68919
5.55000 -3715.75435 8.85693 30392.54976 337.27907 458.79708 2211579.88215
5.65000 -3710.99724 -1.71077 -57514.03355 1164.69511 582.11112 2322141.67113
5.75000 -3680.50173 -6.48163 -50864.60667 455.81995 424.07844 2216784.59121
5.85000 -3662.58566 15.42349 -99656.35944 271.31171 377.42661 2126325.94277
5.95000 -3634.56717 0.29628 42244.39471 252.64845 386.70176 2409240.63090
6.05000 -3629.68602 -7.68984 -29624.78327 239.25345 359.48066 2081395.04865
6.15000 -3604.31291 -0.75503 -26677.60647 2599.79506 2988.77334 2539170.02100
6.25000 -3587.35499 -1.49829 78957.85275 241.57042 351.34292 2473349.73090
6.35000 -3564.01240 2.58702 -9365.36865 237.23786 332.22496 2586640.09289
6.45000 -3561.38375 7.05025 108457.35427 325.71369 688.33263 2202223.23233
6.55000 -3540.05049 15.85950 -67321.55300 275.42331 366.62272 2383956.08930
6.65000 -3524.52501 -4.92771 -6754.89617 242.45451 323.92332 2280849.08333
6.75000 -3503.09947 0.19020 24969.78406 442.49810 359.73077 2101664.25864
6.85000 -3488.32167 -9.53587 -47930.21927 214.47786 323.66038 2098417.75413
6.95000 -3461.59651 -4.28029 -36763.02542 207.63508 296.70478 2357410.86558
7.05000 -3446.61305 -7.53517 -65170.74692 281.50139 330.08668 2390229.89062
7.15000 -3431.86204 2.74352 92142.34098 252.15954 315.61911 2326005.70641
7.25000 -3422.84414 1.60393 -1333.78495 846.23836 465.85808 2352841.61685
7.35000 -3397.86619 -3.18158 -59507.12922 252.16079 300.81556 2492535.59148
7.45000 -3387.33568 -4.05567 18372.32447 240.45350 309.13766 1908430.30726
7.55000 -3372.63728 2.64702 58529.73964 251.79663 285.45430 2297949.61980
7.65000 -3348.62274 2.44438 -61597.99845 221.48237 286.13659 2531314.76348
7.75000 -3334.16943 5.95786 65605.48083 330.82094 383.11188 2183372.03615
7.85000 -3318.43632 1.18472 71001.88531 301.50805 283.12666 2234922.77272
7.95000 -3300.61595 -3.47639 41329.37162 322.90770 283.23943 2274200.71489
8.05000 -3289.75159 -5.31664 -31514.37182 391.80289 420.56317 2417677.55524
8.15000 -3265.02013 -7.28785 -63969.30520 223.59066 548.29499 2408414.63649
8.25000 -3251.23865 -9.34284 -7895.35606 275.05388 249.22503 2195458.90848
8.35000 -3235.55882 3.36873 -10591.42930 203.72312 240.05028 2106423.66751
8.45000 -3223.28710 -1.93694 7717.23692 207.56612 245.10568 2382086.98116
8.55000 -3206.79060 5.62836 43202.63075 830.83103 785.52733 2150595.47330
8.65000 -3184.44049 -4.38222 -40790.03278 273.29819 344.14567 2391122.60511
8.75000 -3166.47698 2.79812 -75569.92107 201.22829 223.72063 2268517.41111
8.85000 -3164.67944 0.04532 -21954.56603 183.29748 231.50420 2383531.24013
8.95000 -3146.38222 11.06434 45017.14655 440.13083 347.51833 2285976.22744
9.05000 -3122.42540 -3.76845 45113.88717 254.27662 463.19853 2200119.83580
9.15000 -3105.46767 0.99348 -34330.10934 198.56086 218.43321 2204397.17487
9.25000 -3093.14746 1.43791 41057.91852 181.34547 198.17249 2305401.67311
9.35000 -3072.69242 -2.59939 -56782.31559 1274.60423 435.89111 2304964.71603
9.45000 -3055.59042 0.31935 1227.89710 187.79162 187.89871 2279133.39901
9.55000 -3042.85220 4.38237 54813.10228 196.21720 206.03983 2217474.57591
9.65000 -3020.76271 0.44503 75015.13945 178.86218 206.47404 2394051.65091
9.75000 -3012.31985 7.67313 63990.09756 309.86675 267.54378 2243337.07789
9.85000 -2994.05747 4.82561 -51449.51845 209.17988 202.96139 2191070.15902
9.95000 -2988.73116 -0.49598 34199.19620 170.73021 200.77225 2398488.82156
10.05000 -2969.69214 1.62468 -18551.75116 183.00672 251.80444 2197255.58489
10.15000 -2947.25722 0.76441 -52997.14733 182.87399 174.32681 2404980.60296
10.25000 -2935.18941 1.47321 37146.52581 183.40504 197.95210 2077860.77634
10.35000 -2919.86074 -2.67733 -16111.74404 199.92749 186.05261 2208574.12648
10.45000 -2907.24356 -7.43088 -49532.37161 177.58918 170.05871 2396557.18352
10.55000 -2891.66983 2.41859 -76355.88310 167.05590 164.50981 2211115.67920
10.65000 -2874.53221 -1.84403 -49209.72099 176.14138 163.24229 2113982.48120
10.75000 -2861.66247 3.06527 21330.40648 151.93883 161.60373 2089561.75065
10.85000 -2849.16698 6.26324 27903.45936 143.02277 150.33806 2348319.06014
10.95000 -2833.36034 -1.51364 16815.79164 157.28276 161.40449 2251655.04113
11.05000 -2819.26867 -3.24265 372.29678 141.55929 179.17643 2095255.33918
11.15000 -2796.78173 -1.82965 -52473.74940 159.60106 185.89453 2018372.07208
11.25000 -2786.21232 -2.69265 14594.23233 168.65101 160.80793 2358315.97120
11.35000 -2773.25625 -2.61491 -52173.33267 149.15831 150.09619 2262712.15431
11.45000 -2756.27062 0.76737 26119.84491 157.78962 181.54283 2215708.55808
11.55000 -2747.10936 3.49768 -10272.31034 173.32958 149.45451 2186059.28237
11.65000 -2725.32125 -0.04223 81069.92851 159.67809 147.55622 2217662.20896
11.75000 -2717.06963 -0.88961 -17243.38410 169.79215 371.23739 2119212.53199
11.85000 -2701.09504 1.43919 -4652.35766 157.37522 177.04909 2093517.77373
11.95000 -2688.69140 1.42093 51517.12482 128.38529 150.14431 2027849.91048
12.05000 -2675.03633 -0.94721 -14732.42011 127.82551 127.38226 2191280.06037
12.15000 -2663.27250 -2.62646 -40626.50744 182.25787 162.52193 2301087.08617
12.25000 -2641.98683 -0.13459 85006.57345 148.48970 132.11537 2263985.26953
12.35000 -2634.67863 -0.34683 -50895.35853 155.84645 130.52366 2207003.35022
12.45000 -2622.23497 0.81659 -39826.91634 978.59779 771.40848 2117814.49771
12.55000 -2611.52812 0.00814 -55290.59003 127.31327 131.57335 2070179.70786
12.65000 -2596.92558 3.04141 50879.24381 141.23100 155.95347 1963067.94887
12.75000 -2577.90271 0.61671 -72912.71445 186.31298 132.86252 2415544.75511
12.85000 -2570.02356 -1.87087 -40008.31037 169.47601 131.12318 2027421.97788
12.95000 -2556.22530 -0.11458 -47197.06821 173.12258 163.64365 2338738.48219
13.05000 -2545.42693 -2.92712 -6422.51868 155.22534 152.16122 2285151.07505
13.15000 -2530.93398 -3.80048 -63820.11041 165.61239 126.34589 2147143.70558
13.25000 -2525.84738 4.13200 21891.84611 388.11667 152.18987 1930855.23825
13.35000 -2509.13429 -6.01131 -46418.14402 117.51408 147.97898 2165738.05396
13.45000 -2489.63471 1.49245 4839.29348 129.06667 112.05270 1997080.30093
13.55000 -2481.17420 -0.07825 37877.39768 1187.24622 3480.02243 2144488.17837
13.65000 -2467.42729 0.45516 -42662.38868 147.57201 462.59551 1824841.54989
13.75000 -2461.39000 3.40219 -99960.80683 126.63388 113.02573 2038062.87552
13.85000 -2445.61488 2.73263 32134.99662 143.01710 122.26188 2076861.97078
13.95000 -2430.62563 -0.19921 48909.24778 115.05914 112.40944 1801807.11216
14.05000 -2419.78383 -0.42340 -54330.65230 464.56552 161.35537 2250495.83781
14.15000 -2408.72613 0.68660 50421.69638 167.24148 137.87855 2089327.93999
14.25000 -2397.45663 1.45740 -28340.63161 126.39395 119.72382 1923638.08686
14.35000 -2383.60270 -3.16736 30199.28279 207.01089 126.43478 2087968.73069
14.45000 -2373.42562 -0.62581 57615.33163 123.54293 107.23608 2081853.93781
14.55000 -2365.82943 -0.67260 54563.78631 110.78592 124.77084 2004696.07613
14.65000 -2349.83654 1.78074 -2895.45881 107.83864 107.17600 1861035.70640
14.75000 -2339.53867 0.94136 -7876.16408 170.67137 179.39389 2037208.58081
14.85000 -2326.43306 2.01747 -115025.07973 151.08997 102.10298 2094403.32585
14.95000 -2319.16558 4.19085 -71750.31732 110.73727 120.38326 2052428.00583
15.05000 -2306.64480 1.59747 -12640.83744 105.33959 138.85244 2070600.21901
15.15000 -2296.39717 -0.16558 -20462.91828 105.58030 106.57680 1983658.64753
15.25000 -2286.16836 1.66164 8671.70626 98.81290 98.84077 1988949.40494
15.35000 -2272.86507 -3.57848 -21927.10345 119.25288 113.63352 1926179.41751
15.45000 -2265.26627 -0.69856 -25478.57170 140.93220 117.03962 1990113.77688
15.55000 -2256.44837 -1.81720 31820.42829 139.22334 108.39484 1933939.47194
15.65000 -2245.33618 1.75325 65520.72676 101.35000 93.54278 2034854.87541
15.75000 -2230.60195 -3.31333 10868.30325 94.73997 88.40318 1993830.17627
15.85000 -2218.11419 -1.30986 -104729.33970 141.46578 167.38745 2001137.88697
15.95000 -2210.04207 -0.57010 45153.69721 119.04662 88.83091 2048275.55220
16.05000 -2202.42680 0.52782 -10417.62549 132.42500 154.98876 1912114.62991
16.15000 -2195.04880 -0.33774 24597.38691 108.41343 99.02830 2033062.29115
16.25000 -2181.06151 -0.79257 -28566.69710 109.69401 85.74201 1940037.29603
16.35000 -2168.61431 -3.60499 -31357.88941 99.70854 217.54542 2127471.64781
16.45000 -2161.00295 0.36898 88195.62255 96.75210 106.83163 1970688.20730
16.55000 -2150.39949 1.51741 -11897.94862 101.65722 81.60277 1784761.04816
16.65000 -2142.68435 -0.21461 22845.14578 364.51559 423.78622 2056047.27294
16.75000 -2130.28343 -3.45956 20024.75043 104.88611 82.58179 1931489.18833
16.85000 -2122.73460 1.09050 -7086.59147 105.00322 80.94006 1796561.92968
16.95000 -2115.60335 0.03996 -40841.42091 87.28393 74.29475 1746627.73316
17.05000 -2104.89664 1.18897 30456.09996 99.64416 94.32750 1994300.30533
17.15000 -2091.08151 0.57787 22526.90474 94.33617 82.70525 1891988.23031
17.25000 -2083.73527 -1.64186 23419.88643 92.82124 82.25332 1879490.44728
17.35000 -2075.68520 0.35736 5161.00569 92.45810 76.93291 1893766.48388
17.45000 -2065.08022 -0.20756 -5672.19067 104.29608 90.60383 1831176.40302
17.55000 -2055.60541 -0.21439 -23159.67132 88.70283 91.69844 2060495.14051
17.65000 -2034.61749 -0.10526 -10476.56825 594.51678 127.37555 1919179.80466
17.75000 -2039.06084 0.22770 -10946.23976 101.22680 87.51520 1964973.85526
17.85000 -2029.53076 1.17844 -35680.75598 87.96767 88.16283 1981323.38903
17.95000 -2020.48369 -1.37178 1879.76759 102.10213 75.76341 1898622.12762
18.05000 -2011.25300 1.04105 -56244.29961 103.68000 141.70200 1914638.88821
18.15000 -2002.48012 -0.02975 20132.00522 89.54899 72.53606 1925625.60801
18.25000 -1996.09006 0.51890 -9443.80984 92.55811 84.34389 1862855.20236
18.35000 -1986.92340 1.19894 -39939.65136 92.21196 76.79922 1940207.42074
18.45000 -1974.35124 1.22125 32511.15677 143.42395 119.17752 1805896.41868
18.55000 -1968.70664 6.37636 -51627.03576 151.91153 250.67187 1951149.36882
18.65000 -1959.15012 -1.12057 -34104.06331 174.81876 742.18865 1812719.16701
18.75000 -1949.85370 2.40553 -26316.46859 108.23795 82.80202 1868035.83030
18.85000 -1941.57716 1.11559 -4434.36535 102.35439 68.34518 1782460.96511
18.95000 -1929.43216 -0.85218 -15065.44480 84.48233 70.06442 1892005.31871
19.05000 -1924.47688 0.06116 897.75994 95.45317 91.55502 2078296.77982
19.15000 -1914.04534 1.31181 36134.66619 119.03619 104.51896 1860328.99126
19.25000 -1907.74875 0.71658 -30816.27148 83.77868 63.67452 1765160.65595
19.35000 -1899.60160 -0.09653 2299.69643 88.12173 79.90227 1975610.36204
19.45000 -1893.18974 1.67673 -20690.88687 83.49866 70.38902 1753760.69042
19.55000 -1884.27475 0.24669 -11481.49789 79.85943 68.69860 1696799.21227
19.65000 -1872.82900 0.61296 -14160.02152 73.58374 57.01845 1799306.97742
19.75000 -1866.46693 0.12941 -57152.05819 81.98370 62.74885 1768102.74284
19.85000 -1858.26402 -2.86890 -10206.50919 76.43904 63.43717 1827576.75409
19.95000 -1849.91148 -1.21610 -3093.91586 73.08069 67.96434 1792918.55223
