0.12500 0.14879
0.37500 0.10125
0.62500 0.05972
0.87500 0.03502
1.12500 0.03594
1.37500 0.03770
1.62500 0.05717
1.87500 0.06382
2.12500 0.08512
2.37500 0.10152
2.62500 0.10491
2.87500 0.10780
3.12500 0.11570
3.37500 0.10403
3.62500 0.07413
3.87500 0.06911
4.12500 0.05513
4.37500 0.06359
4.62500 0.06650
4.87500 0.06174
5.12500 0.06305
5.37500 0.05116
5.62500 0.05822
5.87500 0.05030
6.12500 0.04312
6.37500 0.03949
6.62500 0.05748
6.87500 0.05451
7.12500 0.05449
7.37500 0.06721
7.62500 0.06077
7.87500 0.06423
8.12500 0.05542
8.37500 0.04308
8.62500 0.04948
8.87500 0.04098
9.12500 0.02886
9.37500 0.02836
9.62500 0.03129
9.87500 0.01973
10.12500 0.01902
10.37500 0.00489
10.62500 0.00903
10.87500 0.02474
11.12500 0.02549
11.37500 0.03444
11.62500 0.04537
11.87500 0.04292
12.12500 0.05360
12.37500 0.03701
12.62500 0.04040
12.87500 0.02279
13.12500 0.03169
13.37500 0.03203
13.62500 0.03462
13.87500 0.05048
14.12500 0.07170
14.37500 0.09271
14.62500 0.09618
14.87500 0.12762
