0.05000 1977.27673
0.15000 3214.13455
0.25000 4514.32025
0.35000 5465.43861
0.45000 6231.97514
0.55000 6644.85765
0.65000 6957.53366
0.75000 7022.94070
0.85000 7107.39704
0.95000 6918.42825
1.05000 6989.06331
1.15000 6602.12955
1.25000 6525.90078
1.35000 6243.02586
1.45000 6139.44822
1.55000 5903.47473
1.65000 5672.19780
1.75000 5496.16909
1.85000 5352.19903
1.95000 5198.73813
2.05000 4968.37278
2.15000 4877.70986
2.25000 4779.78745
2.35000 4614.07732
2.45000 4471.57178
2.55000 4348.94616
2.65000 4210.68679
2.75000 4173.30964
2.85000 4023.80146
2.95000 3870.07722
3.05000 3782.31026
3.15000 3674.73749
3.25000 3580.73455
3.35000 3528.47127
3.45000 3386.65027
3.55000 3271.17783
3.65000 3249.74158
3.75000 3101.41989
3.85000 3058.81575
3.95000 2958.36165
4.05000 2881.98587
4.15000 2804.63771
4.25000 2714.58530
4.35000 2648.17875
4.45000 2575.25045
4.55000 2514.33968
4.65000 2415.69271
4.75000 2368.62646
4.85000 2263.58759
4.95000 2248.17998
5.05000 2212.08581
5.15000 2144.36808
5.25000 2091.92836
5.35000 2020.08546
5.45000 1924.79885
5.55000 1892.37245
5.65000 1836.96994
5.75000 1815.91220
5.85000 1735.13145
5.95000 1669.39363
6.05000 1634.28088
6.15000 1590.61832
6.25000 1533.48039
6.35000 1502.81873
6.45000 1469.97803
6.55000 1437.13898
6.65000 1373.89292
6.75000 1356.65140
6.85000 1322.38289
6.95000 1259.09252
7.05000 1248.47844
7.15000 1211.64183
7.25000 1171.77579
7.35000 1148.78250
7.45000 1115.16364
7.55000 1088.23296
7.65000 1072.30244
7.75000 1037.37236
7.85000 1007.04004
7.95000 974.97795
8.05000 963.07248
8.15000 935.26285
8.25000 901.53497
8.35000 900.09529
8.45000 871.99230
8.55000 842.01562
8.65000 829.17970
8.75000 816.69891
8.85000 807.17042
8.95000 772.96498
9.05000 749.10558
9.15000 744.33781
9.25000 724.20238
9.35000 708.25064
9.45000 682.36543
9.55000 679.39050
9.65000 650.58599
9.75000 661.64651
9.85000 631.58128
9.95000 618.79549
10.05000 607.86851
10.15000 585.11093
10.25000 572.85506
10.35000 557.70140
10.45000 544.47981
10.55000 545.36871
10.65000 534.59177
10.75000 518.78758
10.85000 504.62180
10.95000 482.19827
11.05000 487.05829
11.15000 472.23565
11.25000 454.80490
11.35000 450.96836
11.45000 439.52468
11.55000 434.09624
11.65000 429.29884
11.75000 417.35839
11.85000 419.75832
11.95000 405.18512
12.05000 393.74382
12.15000 391.40963
12.25000 389.02313
12.35000 374.63516
12.45000 369.89900
12.55000 359.87477
12.65000 352.69027
12.75000 347.09308
12.85000 344.16127
12.95000 335.88235
13.05000 329.59969
13.15000 325.98990
13.25000 317.74968
13.35000 304.33916
13.45000 305.29714
13.55000 304.79996
13.65000 301.61535
13.75000 284.42460
13.85000 281.51386
13.95000 280.33780
14.05000 271.55154
14.15000 260.24290
14.25000 263.71801
14.35000 248.30007
14.45000 252.10994
14.55000 242.72113
14.65000 233.79674
14.75000 222.38494
14.85000 222.89145
14.95000 215.12828
15.05000 212.13230
15.15000 216.83883
15.25000 205.41173
15.35000 206.12832
15.45000 202.20272
15.55000 196.69757
15.65000 192.90805
15.75000 188.44965
15.85000 186.42406
15.95000 173.30674
16.05000 184.72150
16.15000 176.39555
16.25000 164.24548
16.35000 172.44522
16.45000 163.79798
16.55000 157.32973
16.65000 160.06953
16.75000 151.87233
16.85000 147.45589
16.95000 155.52962
17.05000 145.97118
17.15000 147.23761
17.25000 140.87127
17.35000 135.93296
17.45000 136.39151
17.55000 136.89117
17.65000 129.72475
17.75000 130.55036
17.85000 124.94266
17.95000 126.44074
18.05000 121.12804
18.15000 120.08977
18.25000 118.44684
18.35000 117.47649
18.45000 109.13280
18.55000 112.19006
18.65000 110.35418
18.75000 104.97287
18.85000 108.83361
18.95000 101.45754
19.05000 100.70016
19.15000 102.00396
19.25000 105.29637
19.35000 98.33334
19.45000 101.76339
19.55000 103.50736
19.65000 93.84495
19.75000 97.40379
19.85000 95.98210
19.95000 89.71032
