0.120000 -1.399660
0.380000 -0.051150
0.620000 0.114140
0.880000 0.144330
1.120000 0.170390
1.380000 0.131720
1.620000 0.070770
1.880000 0.110380
2.120000 -0.045960
2.380000 -0.088220
2.620000 -0.191700
2.880000 -0.198320
3.120000 -0.216880
3.380000 -0.137420
3.620000 -0.204170
3.880000 -0.141590
4.120000 -0.290120
4.380000 -0.300320
4.620000 -0.169780
4.880000 -0.282710
5.120000 -0.227690
5.380000 -0.208160
5.620000 -0.322410
5.880000 -0.604800
6.120000 -0.708460
6.380000 -0.760480
6.620000 -0.863830
6.880000 -0.798550
7.120000 -1.068530
7.380000 -1.198520
7.620000 -1.339720
7.880000 -1.337640
8.120000 -1.690740
8.380000 -1.596430
8.620000 -1.781590
8.880000 -1.561300
9.120000 -1.649720
9.380000 -2.202470
9.620000 -2.194230
9.880000 -2.016530
10.120000 -1.811110
10.380000 -2.085320
10.620000 -2.347010
10.880000 -3.001600
11.120000 -1.526490
11.380000 -2.510370
11.620000 -2.268780
11.880000 2.851930
12.120000 2.210780
12.380000 2.835100
12.620000 -2.869370
12.880000 2.755420
13.120000 2.887810
13.380000 -1.643010
13.620000 -2.613630
13.880000 -2.515660
14.120000 -1.407850
14.380000 2.993570
14.620000 -3.093700
14.880000 -2.602570
