0.05000 -238281.29003 2361.53031 33103.82598 89747.24844 142227.35447 3140937.80473
0.15000 -144176.87068 244.65287 -38772.93632 40558.61557 30678.74514 2022007.63035
0.25000 -87346.94755 93.44610 -22783.04484 12893.73050 11580.07031 1571244.31638
0.35000 -65214.41993 149.05359 3320.11411 7655.18290 6651.48548 1432145.30226
0.45000 -52505.48656 27.94727 -74.51793 5010.46039 4802.17891 1245735.03259
0.55000 -44195.58129 46.63518 5689.22538 3917.25933 3553.46248 1065800.64806
0.65000 -38263.95633 34.12547 9600.11560 2805.97236 2616.42972 937380.28369
0.75000 -33782.08633 18.70752 -3356.44201 2732.56023 2410.29772 832236.85963
0.85000 -30326.42370 46.66740 6471.25790 2232.13663 2086.08440 821295.24686
0.95000 -27497.18278 8.33658 22.38878 1965.70538 2108.66449 665111.84256
1.05000 -25199.06540 28.91112 7919.85122 1762.42602 1773.50775 653449.23930
1.15000 -23294.60233 30.15451 3570.88718 1445.17628 1586.35307 564865.72190
1.25000 -21649.28708 18.59201 -3698.12769 1331.88692 1437.48888 525367.96117
1.35000 -20189.69821 4.01740 6783.53733 1237.41861 1595.20463 475223.84007
1.45000 -18957.97526 8.16723 -8374.12033 1166.97491 1309.34889 455673.38821
1.55000 -17880.61233 7.21546 -5643.95523 1611.01023 1791.70690 401085.49940
1.65000 -16919.18129 29.85149 -6448.71138 1063.55091 1214.23826 407817.69271
1.75000 -16045.80654 42.41540 698.14305 1166.60030 1477.66591 375086.10734
1.85000 -15259.13312 -8.05936 -4780.84001 956.41699 1362.92498 351228.56748
1.95000 -14553.50190 10.29972 4392.92067 917.44033 1141.92025 350268.53868
2.05000 -13889.23259 -2.51473 1024.97382 912.89371 1075.63397 326236.05224
2.15000 -13317.01339 4.71321 -186.46881 991.21226 1071.16789 288743.91678
2.25000 -12771.15216 4.27038 1303.15847 841.53039 1071.06397 289219.20151
2.35000 -12291.75227 14.81226 2718.36685 834.30281 970.25009 281497.99720
2.45000 -11846.13629 -10.20644 -786.10101 1059.55407 1011.65949 263461.09743
2.55000 -11442.15200 15.63613 -4090.24263 737.17856 958.66104 249659.31538
2.65000 -11063.01578 2.42943 4107.34008 686.04231 937.22388 245470.55587
2.75000 -10716.71286 -17.14573 -1852.33806 1381.11190 1420.66422 231445.56254
2.85000 -10406.09925 25.19208 5842.01553 766.60250 861.33384 234189.16526
2.95000 -10123.70696 20.69521 -142.82796 807.15968 852.48529 219287.77656
3.05000 -9803.12234 5.76788 -1055.20636 740.56647 806.67661 186748.88909
3.15000 -9540.94167 29.76381 -2744.13509 718.58368 809.74738 192456.63959
3.25000 -9323.13955 10.33819 -565.74444 832.36639 832.59665 203165.04987
3.35000 -9107.53786 18.27704 394.22580 678.80697 837.17124 174134.99568
3.45000 -8877.14217 15.32618 -580.40709 815.90147 887.22915 170944.15612
3.55000 -8667.54680 12.87549 1658.78040 621.03674 675.18440 157114.42104
3.65000 -8500.27119 6.65622 3743.43597 735.37380 778.20970 143739.20307
3.75000 -8349.63571 8.39406 -166.42403 662.89204 954.91755 136517.59160
3.85000 -8198.16771 11.94636 3379.21758 710.53718 649.74564 140993.10808
3.95000 -8070.07477 4.17142 64.43983 1164.28483 874.60480 123558.59677
4.05000 -7931.16135 13.49128 -1170.21205 739.95240 753.49099 121699.34000
4.15000 -7836.18206 -2.61270 -685.59576 563.80023 768.78876 122310.67183
4.25000 -7729.17989 -9.00627 823.37836 662.41619 706.99309 111059.73618
4.35000 -7633.44922 -0.41627 1488.78193 1053.04648 715.79241 115948.33204
4.45000 -7545.02887 0.14405 -120.94073 757.35409 580.54039 103917.11332
4.55000 -7475.31911 2.09269 -1240.57924 436.40058 481.28075 105662.78513
4.65000 -7403.96941 -2.00541 -1694.08202 648.61958 557.68225 116517.81240
4.75000 -7329.59391 5.70591 -2067.22661 431.49066 503.72675 91047.66931
4.85000 -7272.20846 9.00525 920.03917 467.25702 519.32388 88116.00279
4.95000 -7213.02808 0.69620 -2128.78139 587.16691 480.48670 94660.32882
5.05000 -7159.22602 4.73542 624.79319 431.83337 488.18220 85614.15855
5.15000 -7103.68085 4.02687 1600.02479 742.14341 482.00580 90503.52742
5.25000 -7038.86964 7.42415 238.05399 519.64418 510.52271 80172.24930
5.35000 -6983.44359 7.63032 -981.85321 692.89991 506.20550 77249.64277
5.45000 -6929.24186 11.45038 983.70677 620.67428 488.02705 73936.94577
5.55000 -6873.34163 7.48697 335.09921 370.53337 364.97246 67788.31803
5.65000 -6821.01810 4.34376 -95.25362 429.69769 440.90464 73584.93553
5.75000 -6769.48068 8.60692 -469.20399 456.48282 452.85877 69512.06548
5.85000 -6723.56379 6.23115 694.57495 413.46805 405.85321 61034.89206
5.95000 -6674.63959 5.56932 395.40961 372.63998 296.07924 58971.55341
6.05000 -6619.03457 6.73586 146.61276 415.20157 299.67276 60364.81008
6.15000 -6577.67690 3.81606 -17.19988 468.19375 279.19408 61114.71409
6.25000 -6518.46519 7.91485 885.68618 377.73579 396.89050 76600.19471
6.35000 -6469.76863 9.83302 835.90933 315.15650 433.54692 60916.52022
6.45000 -6416.80021 12.93868 164.03490 552.71422 474.51943 56270.16091
6.55000 -6356.34928 1.20131 -334.10005 543.87098 427.78829 48312.01885
6.65000 -6307.84257 3.58062 52.82785 587.98033 430.99462 46395.78320
6.75000 -6255.05004 11.00496 328.21956 687.74872 653.97706 57764.09600
6.85000 -6211.26135 2.43715 377.41892 450.95144 587.17914 50432.19372
6.95000 -6164.48439 0.21977 91.63341 462.07572 383.10904 40630.27873
7.05000 -6109.24807 8.96479 325.77013 384.30983 327.46887 46920.24644
7.15000 -6071.13321 -0.67670 84.14468 583.58418 365.19788 58017.87250
7.25000 -6018.07215 6.49106 -89.41178 274.71908 229.66646 44284.53942
7.35000 -5973.72101 5.22887 109.94078 366.39535 345.65130 43556.19995
7.45000 -5919.62325 9.80467 637.12375 239.40390 418.56121 37836.48151
7.55000 -5866.78372 9.37175 514.68076 256.02086 308.43013 50950.26898
7.65000 -5820.25647 9.67612 546.19475 263.13404 292.16141 32693.20055
7.75000 -5775.26293 4.87028 -61.63836 254.07739 246.82047 36960.88876
7.85000 -5724.57045 9.54491 663.36266 203.03777 209.42183 32963.59450
7.95000 -5677.12944 7.94824 345.38205 420.87315 284.88838 31183.58072
8.05000 -5628.15117 7.11882 793.05440 332.93364 262.41014 46008.08880
8.15000 -5584.00415 10.08763 -412.15331 217.50165 255.68240 30343.05622
8.25000 -5538.54797 4.44329 -171.05081 282.55025 228.23516 28512.89171
8.35000 -5488.54866 3.96577 -376.46772 202.37589 159.55539 33323.80855
8.45000 -5444.48830 8.65664 891.39421 155.99267 146.57704 27370.92306
8.55000 -5395.86325 7.89603 284.98802 179.55367 162.06725 29811.21280
8.65000 -5349.09173 7.10691 -22.88783 265.63486 212.14896 28100.87334
8.75000 -5298.45458 2.01782 86.26033 447.59143 276.53288 29145.89798
8.85000 -5257.04463 8.29602 176.44797 200.68501 177.91400 25233.44063
8.95000 -5209.44013 7.71848 8.38044 226.26114 190.86002 23956.25828
9.05000 -5167.30031 5.66205 248.21475 297.05663 298.63685 25605.33972
9.15000 -5116.09324 2.80935 348.13860 167.66638 199.30729 23581.12658
9.25000 -5071.98786 5.19949 560.84357 235.15866 567.44652 32228.87397
9.35000 -5026.85504 6.78197 162.60228 148.58025 209.07824 23147.06786
9.45000 -4980.00635 6.89560 -34.66190 177.76564 146.14288 21596.97217
9.55000 -4935.60763 5.97901 192.58564 169.86160 141.86646 21266.78092
9.65000 -4889.77532 7.57915 -395.47372 175.57855 156.22580 33508.72562
9.75000 -4846.99732 6.66475 -298.13224 206.60768 185.46428 19397.50097
9.85000 -4803.79559 4.06774 -212.42448 186.30817 241.17971 20220.14922
9.95000 -4760.86231 5.04496 289.90305 138.25985 124.62184 19004.47398
10.05000 -4722.96000 7.64634 85.23599 158.44476 178.90350 20202.41969
10.15000 -4682.13258 5.08183 916.77420 410.95061 570.72684 57953.54260
10.25000 -4646.67692 5.12201 -289.84534 206.25141 186.33905 17285.41825
10.35000 -4599.23319 6.27559 -153.61530 336.49668 183.54645 16616.03721
10.45000 -4561.01712 5.92907 -156.16795 128.53941 119.71041 16377.78951
10.55000 -4520.27569 5.60432 596.85963 126.12815 129.08461 18648.82125
10.65000 -4482.47693 6.38367 -55.07794 274.79681 471.59342 18864.47227
10.75000 -4449.56939 5.07156 240.37232 166.81140 147.18993 21545.86512
10.85000 -4410.69757 0.68561 -157.74938 114.24237 176.09656 16217.18934
10.95000 -4375.08318 6.20964 3.22840 110.15228 110.94876 15879.70154
11.05000 -4337.34103 7.36699 -351.79280 145.38358 124.87123 15946.22062
11.15000 -4303.48207 4.05586 -26.35890 161.51250 125.21167 15919.30621
11.25000 -4271.73753 0.94913 -266.58660 291.54377 319.90386 15982.72173
11.35000 -4238.46200 4.46534 -165.64953 134.31269 107.30956 15475.04990
11.45000 -4207.11195 1.65604 339.64948 128.86468 219.34493 31022.46875
11.55000 -4170.87777 1.97817 -69.39621 116.84722 160.67576 13837.48860
11.65000 -4138.98455 2.27907 -242.38996 136.08965 136.56382 13022.93608
11.75000 -4103.89851 2.32654 113.48518 129.06375 162.22265 13926.44228
11.85000 -4074.92783 4.46989 -434.29461 114.66858 96.40122 13445.09307
11.95000 -4051.57739 10.09443 101.59431 347.99558 262.33168 13639.55720
12.05000 -4017.00847 4.87915 -44.26845 121.31482 103.70697 10388.02991
12.15000 -3981.14744 3.70551 -67.59116 518.80881 147.92198 14533.88215
12.25000 -3959.95286 2.75088 181.52606 180.11886 182.04569 11619.76543
12.35000 -3925.65562 4.02784 319.53399 118.95344 86.16574 12109.90223
12.45000 -3897.99429 4.35219 150.13337 116.11852 102.66628 10638.03100
12.55000 -3869.81315 3.46078 -163.19306 108.51569 96.97921 12142.81274
12.65000 -3839.53848 2.46403 -116.70836 122.83876 119.46806 10798.72257
12.75000 -3812.60572 2.45270 -261.15582 134.99346 118.59263 11248.14543
12.85000 -3783.33774 5.66621 10.98319 123.18585 126.22150 10013.59111
12.95000 -3754.63340 2.64615 -299.13459 96.58415 74.48043 15454.22331
13.05000 -3726.68396 4.62089 33.06557 104.19949 107.85133 10246.41424
13.15000 -3697.21883 5.89583 -71.89418 89.82028 80.44793 8123.69470
13.25000 -3673.84468 3.48271 54.56064 89.52076 87.85047 8349.32371
13.35000 -3645.57817 4.32513 43.26459 106.51042 89.13598 8656.72926
13.45000 -3618.90447 4.84030 60.86033 86.57932 108.30133 9047.97248
13.55000 -3589.37940 1.51399 24.69701 281.31112 199.70738 7427.17991
13.65000 -3569.12990 3.13812 -151.26532 87.79562 99.95668 7732.36000
13.75000 -3544.89876 2.90750 -183.85563 298.10550 244.42210 7462.10588
13.85000 -3519.93920 2.30026 -274.45017 89.11323 89.36381 7834.84940
13.95000 -3496.38503 3.53036 -5.61192 290.62428 94.50870 8709.07865
14.05000 -3465.32437 3.50401 -75.13893 103.95191 65.97010 7935.94985
14.15000 -3437.79390 3.75337 -269.65028 125.62994 123.34557 6764.86029
14.25000 -3412.96688 4.52394 179.44704 160.79569 80.04773 7183.04830
14.35000 -3391.59671 5.79525 -160.05180 726.80391 227.08342 7028.38901
14.45000 -3365.31471 3.95547 -120.24141 78.56150 78.85437 8513.00046
14.55000 -3341.39557 3.60097 -9.77252 76.29491 89.35371 5727.82876
14.65000 -3317.62051 2.26876 9.13453 82.91493 93.84685 8481.55047
14.75000 -3295.75490 3.33482 -40.39478 51.87646 55.31194 6469.71502
14.85000 -3271.72360 4.59745 -49.77406 113.64612 143.73229 6286.17274
14.95000 -3247.62077 1.89860 187.08893 66.97059 116.82960 5850.48186
15.05000 -3226.29903 3.62008 63.70165 55.27241 58.50031 5133.81167
15.15000 -3206.26301 5.75059 -21.95277 88.24978 71.25939 5284.24982
15.25000 -3180.64804 1.16426 91.21069 98.20351 81.05800 5283.23592
15.35000 -3160.68457 3.10029 -49.01664 65.43503 55.56526 5504.18995
15.45000 -3143.40756 3.16948 248.24406 74.14829 85.57436 8480.84880
15.55000 -3120.40652 3.77087 -136.20712 69.72085 54.29992 5221.57606
15.65000 -3096.65099 3.31129 6.27305 76.20827 47.36172 5931.81248
15.75000 -3075.01529 2.59180 -56.62328 74.34243 57.96109 5571.26774
15.85000 -3052.05718 2.95626 10.44893 109.87298 95.73666 5080.09074
15.95000 -3035.08911 3.31423 4.04566 63.58054 68.13547 4931.57228
16.05000 -3014.27554 2.56056 157.92868 56.41534 48.76535 4367.25450
16.15000 -2995.09121 2.88162 56.73196 79.01900 63.41323 5631.01961
16.25000 -2975.13528 2.60041 14.81238 63.58720 52.75342 3841.50751
16.35000 -2955.69651 3.83869 27.37359 79.59185 55.71281 4873.63443
16.45000 -2934.84494 0.03015 -64.73612 62.51401 112.92998 4361.48334
16.55000 -2916.87841 5.26529 -117.77747 64.86250 69.74266 4049.24510
16.65000 -2900.56376 0.35635 -37.53563 115.49303 124.66750 4348.88054
16.75000 -2877.10762 1.42040 -8.93502 106.66162 73.01454 3613.19423
16.85000 -2861.75835 2.27747 32.73807 89.78716 65.15919 4523.30524
16.95000 -2846.87990 -2.35144 1.86199 140.75867 182.99352 3763.89968
17.05000 -2824.20023 2.71173 40.28026 144.42432 56.97034 4109.17662
17.15000 -2807.64057 8.90204 94.58827 108.12051 354.23315 3844.18762
17.25000 -2792.14173 2.40227 184.89646 73.89980 51.22868 3357.90262
17.35000 -2772.25546 3.65718 -10.64979 38.04384 40.26584 3975.31487
17.45000 -2754.06389 0.87681 94.23098 67.49564 59.94689 3250.70921
17.55000 -2735.60280 2.25056 188.07820 46.34311 49.03777 3665.34043
17.65000 -2716.52439 1.68360 83.47688 42.08327 62.61656 3699.20590
17.75000 -2698.67352 1.77851 -4.79835 107.30628 45.37836 3642.08797
17.85000 -2685.65441 5.37698 -17.23867 52.86606 102.06624 3171.66392
17.95000 -2668.45624 0.55627 102.99088 55.03810 61.35542 3061.70262
18.05000 -2649.48498 1.99504 126.90287 40.37121 52.36126 2858.36081
18.15000 -2634.49652 -2.86797 158.77325 64.16143 259.76961 3102.32908
18.25000 -2615.53361 3.70402 62.20721 86.24737 48.32365 3135.19335
18.35000 -2598.03790 0.28010 9.72952 113.14128 73.70425 3156.43282
18.45000 -2582.85250 1.23035 165.11258 47.70251 41.91717 3683.61567
18.55000 -2567.22698 2.46524 25.29164 51.83481 45.17750 3108.84788
18.65000 -2551.06600 -0.31053 75.72882 42.71938 49.56964 3378.58660
18.75000 -2534.93302 0.85141 63.32903 73.36524 62.66324 2939.31308
18.85000 -2520.47866 1.81225 -17.16702 849.74711 398.35850 2759.47450
18.95000 -2509.50294 6.04629 164.88891 89.82538 93.78517 2382.85378
19.05000 -2492.69648 4.03927 -152.60162 33.84221 41.49601 2985.38667
19.15000 -2478.89804 3.93229 -63.82670 79.68153 79.84982 3027.02057
19.25000 -2462.02139 1.30686 155.38648 47.73277 39.75185 2840.30237
19.35000 -2446.55145 2.55480 -25.60595 39.72835 55.08139 2548.48876
19.45000 -2431.46356 1.57075 49.33060 34.43503 33.55940 3958.37794
19.55000 -2417.79910 -0.01325 3.57194 29.00124 31.66306 2332.80716
19.65000 -2402.10650 0.88356 129.95680 74.01756 52.69319 2566.92281
19.75000 -2392.31711 -0.74501 126.78412 79.98703 60.72153 2006.53486
19.85000 -2379.12407 -0.48886 119.92881 37.38496 49.96823 2413.17128
19.95000 -2364.50954 3.34516 83.29799 33.90286 35.13586 2478.04992
