0.05000 3960.56137
0.15000 5544.83124
0.25000 6104.44770
0.35000 6278.42943
0.45000 6760.75128
0.55000 6522.00816
0.65000 6936.16927
0.75000 6784.88407
0.85000 6740.99623
0.95000 6360.57117
1.05000 6479.19855
1.15000 6386.82440
1.25000 6245.89196
1.35000 5943.01631
1.45000 5778.59467
1.55000 5681.72519
1.65000 5429.28356
1.75000 5188.23122
1.85000 5141.84384
1.95000 4775.04268
2.05000 4639.52076
2.15000 4680.37905
2.25000 4510.91276
2.35000 4176.03060
2.45000 4276.53592
2.55000 4111.90474
2.65000 4010.42396
2.75000 3846.95991
2.85000 3811.49104
2.95000 3676.29172
3.05000 3613.77881
3.15000 3501.90741
3.25000 3417.79504
3.35000 3301.19856
3.45000 3216.72459
3.55000 3070.91727
3.65000 3007.18753
3.75000 2922.79468
3.85000 2891.44677
3.95000 2802.18864
4.05000 2792.13007
4.15000 2680.72539
4.25000 2621.73357
4.35000 2588.23138
4.45000 2436.03245
4.55000 2427.60535
4.65000 2370.38069
4.75000 2292.56603
4.85000 2263.86670
4.95000 2232.41345
5.05000 2198.09709
5.15000 2114.26359
5.25000 2048.54653
5.35000 2015.99354
5.45000 1969.83574
5.55000 1912.79868
5.65000 1920.93035
5.75000 1874.62120
5.85000 1757.65718
5.95000 1744.11257
6.05000 1679.13576
6.15000 1716.35934
6.25000 1639.13248
6.35000 1572.93818
6.45000 1590.22600
6.55000 1521.35867
6.65000 1478.53790
6.75000 1531.17812
6.85000 1434.18770
6.95000 1409.85438
7.05000 1378.03376
7.15000 1289.83249
7.25000 1296.83569
7.35000 1277.16666
7.45000 1219.57483
7.55000 1194.77367
7.65000 1178.39657
7.75000 1149.18374
7.85000 1142.35134
7.95000 1100.99206
8.05000 1088.36684
8.15000 1048.79556
8.25000 1030.58196
8.35000 1022.18712
8.45000 1002.75353
8.55000 967.37240
8.65000 957.16348
8.75000 933.94679
8.85000 901.32641
8.95000 850.11387
9.05000 850.51226
9.15000 849.43691
9.25000 829.75968
9.35000 807.84317
9.45000 827.16319
9.55000 777.20844
9.65000 766.49785
9.75000 754.32489
9.85000 739.39803
9.95000 735.14823
10.05000 723.24016
10.15000 694.10669
10.25000 685.12548
10.35000 656.11003
10.45000 680.55876
10.55000 613.51687
10.65000 630.20054
10.75000 611.33016
10.85000 613.75030
10.95000 580.72141
11.05000 570.84745
11.15000 556.57695
11.25000 556.55625
11.35000 542.07763
11.45000 519.29302
11.55000 550.24455
11.65000 519.52731
11.75000 495.27650
11.85000 496.00200
11.95000 471.01544
12.05000 485.78613
12.15000 473.74234
12.25000 453.53908
12.35000 440.41040
12.45000 439.33115
12.55000 455.32168
12.65000 423.26427
12.75000 421.49068
12.85000 397.55890
12.95000 396.77203
13.05000 399.17345
13.15000 378.75863
13.25000 394.86772
13.35000 387.29286
13.45000 373.21097
13.55000 356.87427
13.65000 356.40449
13.75000 339.82068
13.85000 343.84275
13.95000 327.61288
14.05000 330.26027
14.15000 311.59729
14.25000 311.94705
14.35000 320.42996
14.45000 295.46086
14.55000 284.43645
14.65000 286.13474
14.75000 284.60382
14.85000 268.56624
14.95000 303.89574
15.05000 273.31331
15.15000 307.21434
15.25000 268.30632
15.35000 269.11213
15.45000 257.23043
15.55000 253.73210
15.65000 259.32690
15.75000 248.47298
15.85000 235.33472
15.95000 243.30939
16.05000 244.65537
16.15000 227.35254
16.25000 220.24250
16.35000 226.69788
16.45000 224.52333
16.55000 203.35398
16.65000 213.44760
16.75000 207.08024
16.85000 203.35337
16.95000 197.23317
17.05000 183.59215
17.15000 173.16131
17.25000 196.90566
17.35000 181.55345
17.45000 169.08380
17.55000 174.55096
17.65000 200.37655
17.75000 172.58090
17.85000 168.02990
17.95000 169.68330
18.05000 172.25434
18.15000 153.59702
18.25000 147.01534
18.35000 168.63649
18.45000 156.25613
18.55000 159.74133
18.65000 153.09483
18.75000 148.20692
18.85000 148.15737
18.95000 124.19985
19.05000 145.03416
19.15000 142.08109
19.25000 134.91945
19.35000 139.76609
19.45000 137.85708
19.55000 137.53732
19.65000 131.82966
19.75000 129.69080
19.85000 117.82900
19.95000 129.19389
