0.12500 0.01227
0.37500 0.03331
0.62500 0.05893
0.87500 0.08444
1.12500 0.10329
1.37500 0.13745
1.62500 0.17785
1.87500 0.21853
2.12500 0.24919
2.37500 0.28097
2.62500 0.29588
2.87500 0.28188
3.12500 0.25323
3.37500 0.22041
3.62500 0.19304
3.87500 0.18610
4.12500 0.16009
4.37500 0.13375
4.62500 0.10757
4.87500 0.08120
5.12500 0.07144
5.37500 0.06352
5.62500 0.04310
5.87500 0.03082
6.12500 0.02825
6.37500 0.03239
6.62500 0.02119
6.87500 0.02764
7.12500 0.02811
7.37500 0.03827
7.62500 0.03314
7.87500 0.03199
8.12500 0.02606
8.37500 0.02954
8.62500 0.02400
8.87500 0.02291
9.12500 0.02490
9.37500 0.02419
9.62500 0.02842
9.87500 0.03374
10.12500 0.02903
10.37500 0.00776
10.62500 0.01366
10.87500 0.01444
11.12500 0.01959
11.37500 0.01642
11.62500 0.02782
11.87500 0.02670
12.12500 0.03868
12.37500 0.02552
12.62500 0.03923
12.87500 0.02897
13.12500 0.01238
13.37500 0.03106
13.62500 0.03192
13.87500 0.03522
14.12500 0.02692
14.37500 0.01357
14.62500 0.02083
14.87500 0.03470
