0.12500 0.01313
0.37500 0.05611
0.62500 0.11634
0.87500 0.16223
1.12500 0.22048
1.37500 0.26081
1.62500 0.28560
1.87500 0.31849
2.12500 0.34777
2.37500 0.37469
2.62500 0.41553
2.87500 0.42237
3.12500 0.46357
3.37500 0.47935
3.62500 0.47975
3.87500 0.47978
4.12500 0.47159
4.37500 0.45047
4.62500 0.39225
4.87500 0.36919
5.12500 0.33250
5.37500 0.32305
5.62500 0.27119
5.87500 0.26552
6.12500 0.22290
6.37500 0.20177
6.62500 0.18484
6.87500 0.15313
7.12500 0.14453
7.37500 0.09165
7.62500 0.10193
7.87500 0.10704
8.12500 0.10737
8.37500 0.04934
8.62500 0.07936
8.87500 0.05928
9.12500 0.05898
9.37500 0.06052
9.62500 0.04901
9.87500 0.06282
10.12500 0.06195
10.37500 0.05301
10.62500 0.04299
10.87500 0.01549
11.12500 0.03748
11.37500 0.01269
11.62500 0.01263
11.87500 0.00905
12.12500 0.04675
12.37500 0.05571
12.62500 0.04774
12.87500 0.06396
13.12500 0.12621
13.37500 0.10393
13.62500 0.13779
13.87500 0.10583
14.12500 0.18423
14.37500 0.18128
14.62500 0.15367
14.87500 0.11512
15.12500 0.19713
15.37500 0.14789
15.62500 0.12123
15.87500 0.13118
16.12500 0.16415
16.37500 0.10863
16.62500 0.13762
16.87500 0.09586
17.12500 0.11192
17.37500 0.15190
17.62500 0.10051
17.87500 0.11114
18.12500 0.08094
18.37500 0.12038
18.62500 0.06916
18.87500 0.10803
19.12500 0.02605
19.37500 0.13913
19.62500 0.08464
19.87500 0.10539
