0.12500 0.00903
0.37500 0.00463
0.62500 0.01245
0.87500 0.03260
1.12500 0.01258
1.37500 0.03051
1.62500 0.04692
1.87500 0.02838
2.12500 0.03431
2.37500 0.02628
2.62500 0.03900
2.87500 0.03077
3.12500 0.03035
3.37500 0.03612
3.62500 0.02091
3.87500 0.01749
4.12500 0.00706
4.37500 0.01138
4.62500 0.00466
4.87500 0.00601
5.12500 0.01294
5.37500 0.02054
5.62500 0.01485
5.87500 0.01690
6.12500 0.00828
6.37500 0.01247
6.62500 0.01037
6.87500 0.01075
7.12500 0.01743
7.37500 0.02238
7.62500 0.01138
7.87500 0.02123
8.12500 0.01118
8.37500 0.01119
8.62500 0.01424
8.87500 0.00894
9.12500 0.01465
9.37500 0.00996
9.62500 0.01840
9.87500 0.01150
10.12500 0.00180
10.37500 0.02154
10.62500 0.03507
10.87500 0.02722
11.12500 0.02858
11.37500 0.01796
11.62500 0.03075
11.87500 0.01892
12.12500 0.01576
12.37500 0.03292
12.62500 0.01590
12.87500 0.01291
13.12500 0.00622
13.37500 0.00656
13.62500 0.00908
13.87500 0.01566
14.12500 0.01048
14.37500 0.01934
14.62500 0.01503
14.87500 0.01584
