0.12500 0.00783
0.37500 0.06133
0.62500 0.10225
0.87500 0.18193
1.12500 0.25092
1.37500 0.32478
1.62500 0.36935
1.87500 0.44598
2.12500 0.51233
2.37500 0.54160
2.62500 0.57251
2.87500 0.59369
3.12500 0.60833
3.37500 0.60426
3.62500 0.58483
3.87500 0.56664
4.12500 0.54923
4.37500 0.52102
4.62500 0.49071
4.87500 0.45713
5.12500 0.43748
5.37500 0.41589
5.62500 0.39463
5.87500 0.36105
6.12500 0.32753
6.37500 0.28320
6.62500 0.22925
6.87500 0.17170
7.12500 0.12250
7.37500 0.10158
7.62500 0.08391
7.87500 0.07758
8.12500 0.07170
8.37500 0.07063
8.62500 0.03759
8.87500 0.04232
9.12500 0.01705
9.37500 0.02612
9.62500 0.04831
9.87500 0.06183
10.12500 0.06912
10.37500 0.10519
10.62500 0.09378
10.87500 0.12557
11.12500 0.12460
11.37500 0.12392
11.62500 0.11553
11.87500 0.08636
12.12500 0.08714
12.37500 0.07459
12.62500 0.07155
12.87500 0.10545
13.12500 0.12907
13.37500 0.14445
13.62500 0.16152
13.87500 0.14056
14.12500 0.12490
14.37500 0.13770
14.62500 0.15084
14.87500 0.16240
