0.05000 0.00000 0.00000 0.00000 0.00000 0.00000 0.00000
0.15000 -1166.49856 -909.99119 -126030.89358 2253.54963 2249.40647 240509.47928
0.25000 -861.74703 -93.30803 62634.30846 2263.54021 2635.72253 922777.27921
0.35000 -506.42890 484.12287 437620.31915 2410.57581 2730.19547 3264757.65319
0.45000 -953.62550 227.38835 21680.17162 2509.72134 2874.17167 791659.13754
0.55000 -933.88855 -211.21891 -82370.53720 2281.54900 2609.99146 989939.63033
0.65000 -1435.21185 -217.73372 19164.15169 2047.60742 2776.11497 1014796.75189
0.75000 -1902.50908 -101.84428 122529.95914 1676.95577 2467.37688 1113438.12220
0.85000 -2413.64275 -128.72704 31382.45121 1222.25133 2390.50062 1226750.14434
0.95000 -2836.90064 184.63687 -54693.35679 903.63481 2329.02452 1271911.40122
1.05000 -3189.13776 67.35176 -14130.22602 937.02390 2107.25447 1594589.57843
1.15000 -3466.95001 -20.62247 5099.89321 707.28089 1963.00065 796321.06379
1.25000 -3597.40649 117.13827 44637.84915 685.95985 1813.53190 1217513.24926
1.35000 -3750.60760 27.40591 55.42960 633.67807 1648.35333 1205462.37671
1.45000 -3847.43741 43.08103 36999.20908 559.22968 1566.69636 1392651.68878
1.55000 -3889.69443 56.30379 75706.87599 481.40371 1453.47490 1178003.35011
1.65000 -3965.10721 -30.68535 -92225.43446 497.62351 1380.07359 1851187.74399
1.75000 -4003.40478 28.36207 179005.48382 481.69833 1285.90832 2143852.01806
1.85000 -4042.58978 -4.18267 116865.59873 582.78349 1304.48173 1457175.53783
1.95000 -4079.52982 10.36658 -78817.56187 575.49917 1204.36489 1669988.04215
2.05000 -4099.01978 -38.65861 -14952.34274 435.90504 1120.21263 1705099.63400
2.15000 -4109.23214 58.07351 -28119.23424 496.82136 1078.28374 1911561.98565
2.25000 -4166.86363 -2.91275 46534.27649 375.31054 1006.99864 1689802.83414
2.35000 -4143.10657 -31.43766 46520.55864 421.40873 979.62829 1572666.79553
2.45000 -4119.60258 4.40254 39411.89128 398.30455 959.41364 1997527.26862
2.55000 -4105.02481 22.37438 46959.08797 330.93901 886.93522 1763071.09412
2.65000 -4098.12590 7.33388 -28102.48980 369.12565 869.17678 2219154.73058
2.75000 -4087.61590 -2.36081 64148.01323 415.66963 861.94190 2141570.93602
2.85000 -4075.03700 -2.92054 30814.93997 313.22020 822.09898 2257919.70395
2.95000 -4061.35903 -23.61320 13650.97361 386.14964 795.78169 1911555.47433
3.05000 -4058.19816 -15.49016 -15909.83732 324.40804 768.88557 2285693.82552
3.15000 -4042.00299 -22.28504 31666.63789 386.04070 733.51617 1762277.93264
3.25000 -4029.42658 -7.57532 56056.20683 386.54104 695.67896 1836876.36323
3.35000 -4011.29254 -32.67425 -22290.92133 318.52356 673.30280 2191362.95404
3.45000 -3995.52243 7.88111 71866.34401 291.06816 655.72048 2250960.47053
3.55000 -3989.90459 30.98658 37022.88572 280.82532 620.18234 2014238.44094
3.65000 -3971.82790 -10.77684 89290.93059 308.64020 628.75289 2371550.27843
3.75000 -3953.63960 -3.93886 -6498.15809 340.75778 624.55314 2527447.81877
3.85000 -3943.13241 -7.53888 -15566.30833 288.71099 583.09298 1981869.71074
3.95000 -3923.08667 13.53447 18859.51395 287.32535 574.15796 2008150.09346
4.05000 -3916.82231 -0.12258 119273.68945 284.11514 587.59856 1801338.03590
4.15000 -3895.20772 -2.07738 37264.41643 314.92341 534.68429 2168742.72636
4.25000 -3878.00021 -0.49546 -8020.84597 270.96004 531.39869 2372366.45204
4.35000 -3865.73286 -5.86481 23348.80472 261.11986 518.89575 1940404.37094
4.45000 -3843.77790 13.63398 -22895.59944 270.65047 503.07566 2075126.73739
4.55000 -3832.28013 8.00237 18813.29512 253.01141 477.12771 1676182.20345
4.65000 -3813.27385 -4.33861 69371.71376 226.54115 483.30036 2123160.35177
4.75000 -3791.40961 -3.78323 50184.98311 289.78591 474.76442 2376730.44786
4.85000 -3778.88938 -0.73438 4859.07803 247.38954 447.51392 2063796.92131
4.95000 -3773.35169 -1.93151 8521.35974 285.42639 465.32841 2298006.06803
5.05000 -3742.14207 -7.60641 -32179.24692 237.61232 447.65625 2255016.69657
5.15000 -3721.58828 4.18840 -15260.68287 247.15035 424.13705 2542503.36565
5.25000 -3720.05007 -2.64593 -41952.83446 195.14004 385.44542 2129982.97210
5.35000 -3691.03280 -21.66354 -86936.86535 226.89478 408.74667 2107736.39245
5.45000 -3679.61994 -6.93648 7852.29919 270.22249 390.69311 2381896.35190
5.55000 -3670.85559 1.37835 35815.92174 220.44991 390.73565 2118159.79061
5.65000 -3646.98226 -14.36631 -41010.56668 222.58952 390.20259 2427275.02752
5.75000 -3638.90747 3.46351 -39870.34977 246.51187 374.94925 2087355.10049
5.85000 -3611.05066 7.33746 -21450.18498 265.79206 365.42573 2113561.93566
5.95000 -3598.43066 0.35228 10448.25042 201.95861 345.48831 2464540.22991
6.05000 -3583.66374 -4.33507 18881.47513 174.16698 366.56660 2450445.84619
6.15000 -3572.03130 3.10654 50830.12165 234.35240 342.66837 2132113.96322
6.25000 -3544.15270 -9.16358 34167.61532 151.32051 331.94721 2444866.78932
6.35000 -3529.64526 5.17687 36420.96066 188.37247 345.37162 1978925.03852
6.45000 -3510.33328 0.95310 33112.81757 223.98548 313.14074 2331610.66266
6.55000 -3487.53639 -3.46000 -4428.01536 196.66478 355.06060 2261568.25403
6.65000 -3483.72305 12.20703 64045.43946 149.82422 318.85434 2367997.33045
6.75000 -3460.72966 4.82659 -47387.66630 225.42658 302.10922 2083588.77961
6.85000 -3441.07903 -5.92989 47074.46785 215.17199 314.74054 2491534.06257
6.95000 -3427.64823 5.58779 -68335.04092 209.65925 303.08586 2461817.53324
7.05000 -3412.39213 2.82566 11085.67556 180.15042 289.01263 2029630.68285
7.15000 -3384.85992 -7.81475 -1648.02898 199.82285 287.22101 2483394.07204
7.25000 -3374.93956 -0.72440 39257.64574 176.74110 282.96502 2333596.65077
7.35000 -3357.94071 2.82098 -16521.60850 158.30280 269.76149 2718991.49911
7.45000 -3337.60635 2.09122 -5968.68108 161.77778 270.54951 2180332.22848
7.55000 -3324.88819 6.40781 104265.88453 180.75850 277.22100 2178665.72108
7.65000 -3304.80208 -8.29049 32618.99459 161.24950 268.90573 2132840.97980
7.75000 -3287.02758 7.14517 2261.29745 170.41239 251.25877 2591476.79587
7.85000 -3273.55999 8.21296 10647.06066 156.18469 271.61027 2228365.07057
7.95000 -3251.56240 3.09049 -73536.80560 170.00886 248.91698 2359159.77949
8.05000 -3238.39539 -5.85156 42506.66804 132.14177 242.70116 2010047.51621
8.15000 -3220.48868 7.63661 36363.37920 164.10921 245.76315 2548818.29928
8.25000 -3201.37318 4.50866 19451.48892 123.40478 227.13385 2257350.03656
8.35000 -3184.37250 1.09989 -83438.07592 137.60854 233.32179 2058633.06867
8.45000 -3166.73665 1.66278 64440.42641 139.79543 227.25357 2187364.94620
8.55000 -3151.09527 -3.15978 -10929.02856 115.93570 219.01254 2242496.17937
8.65000 -3137.19339 10.16530 18429.05188 117.78644 213.09320 2310669.47776
8.75000 -3117.04426 -0.37553 3782.79872 154.76804 212.86858 2232037.08303
8.85000 -3102.77437 -1.11743 3907.22712 136.93720 215.46916 2552224.88360
8.95000 -3085.89084 -2.11058 38988.47276 155.98772 224.11506 2134438.80612
9.05000 -3070.87351 7.77181 -20475.16953 164.05740 212.21520 2205749.92363
9.15000 -3057.39874 1.00472 -135661.28837 128.37453 199.63233 2298867.75273
9.25000 -3037.84003 -5.36710 -33697.19307 144.30001 203.45368 2127206.08538
9.35000 -3023.98893 -3.63041 -11801.95128 145.33613 204.51053 2372355.28852
9.45000 -3015.10123 -3.45802 -67744.23320 105.56717 189.00823 2171918.79258
9.55000 -2999.56721 0.10362 60503.66876 123.37176 192.54292 2294900.39457
9.65000 -2979.43025 4.25359 -18716.75840 154.41844 198.83773 2051597.92257
9.75000 -2964.69066 -1.05877 -30124.79401 148.17742 207.28204 2044802.66184
9.85000 -2952.64033 -0.07625 -60746.44968 123.31600 178.28234 2386611.56365
9.95000 -2933.16592 3.75175 31564.07558 108.69359 202.39236 2446302.75515
10.05000 -2914.98768 -5.72036 -48271.19625 140.99175 185.68416 2389183.06098
10.15000 -2900.10654 1.77040 76253.33820 121.75198 193.41340 2319773.67375
10.25000 -2884.57735 -4.52875 64615.02106 141.18561 205.67496 2249884.95377
10.35000 -2873.74674 3.05753 5317.17327 111.38952 179.51583 2203550.54020
10.45000 -2856.57556 -2.34148 81162.81264 107.68757 171.44043 2354182.97369
10.55000 -2844.55718 2.75144 24327.25877 138.80607 167.70147 2004208.23701
10.65000 -2827.11868 -0.26570 49508.29840 109.57870 168.11388 2343819.38803
10.75000 -2814.20087 -0.98828 72862.35781 131.60899 167.32541 2282270.54701
10.85000 -2797.15318 -4.39090 -66783.93239 114.17442 167.32682 2314988.36095
10.95000 -2783.52825 5.31680 -6902.45426 119.41095 174.22439 2033035.46162
11.05000 -2769.85374 1.52153 32914.60617 122.35997 163.99906 1956746.07225
11.15000 -2746.87417 -0.80420 -48932.06969 162.23475 174.42643 2238064.94051
11.25000 -2741.99721 -0.46323 35960.53498 99.74386 152.31090 2028747.46483
11.35000 -2723.38122 -0.34738 -22033.17687 129.60392 149.52272 1991557.87902
11.45000 -2709.90217 0.31544 -38208.47926 146.23710 158.20529 2046205.04415
11.55000 -2700.38195 2.74930 -27522.25497 101.32566 142.39052 2271040.53030
11.65000 -2681.04068 3.88264 3629.53132 121.71697 154.49401 2447634.14045
11.75000 -2670.29539 -0.87445 23359.06534 131.18863 145.34355 2276531.69628
11.85000 -2659.98675 2.65640 -12766.45387 102.92697 153.21795 2170968.60561
11.95000 -2645.71735 -1.67357 -3239.08826 147.69959 139.17971 1973655.10910
12.05000 -2633.08846 1.92562 94375.50000 150.48699 148.53679 2140691.88460
12.15000 -2615.96173 -1.91222 -10631.21129 121.93987 131.11628 2167641.67920
12.25000 -2605.47809 -1.74423 -3811.33143 91.89559 130.21644 2185322.01542
12.35000 -2592.82460 -1.82614 9868.94719 106.35593 138.02553 1997329.84950
12.45000 -2579.01881 3.03566 -63689.46613 101.96562 136.53253 2127687.81996
12.55000 -2564.28208 -1.62793 -92470.39508 92.90581 132.99619 2030294.89940
12.65000 -2558.09317 -5.10918 6820.71900 109.65634 177.35278 2123796.72692
12.75000 -2545.01598 0.55341 77956.89188 81.21856 132.07967 1998723.36619
12.85000 -2527.71033 -0.46398 67289.79769 111.15914 131.58052 2009956.84586
12.95000 -2515.44081 -2.93317 11350.03227 131.32527 144.25054 1898032.18360
13.05000 -2508.39233 -1.76772 -16229.06673 86.31139 126.21176 2116045.07826
13.15000 -2494.85334 0.78434 39298.87360 96.68010 132.97855 1990927.22426
13.25000 -2480.06908 -0.13432 20385.28985 109.22775 122.72234 2152344.49709
13.35000 -2469.50443 -1.30960 46149.23505 101.16863 157.16117 2169558.88029
13.45000 -2457.09185 -3.73788 7691.02548 81.59590 117.77353 2010514.99602
13.55000 -2441.71006 1.43596 51286.81712 131.15194 137.66220 2088432.92237
13.65000 -2435.78832 3.80029 -23500.29706 95.79235 128.90119 2095304.68051
13.75000 -2422.96280 5.18053 19692.64691 86.88756 119.44346 2001620.43663
13.85000 -2411.02155 -0.11041 -54835.40764 73.09461 110.31737 1930238.07924
13.95000 -2397.72754 2.46166 37429.67370 82.10876 120.97610 2068671.10095
14.05000 -2387.95007 -3.15373 16463.51909 73.20879 119.07830 1925684.40788
14.15000 -2378.33686 -2.07505 -44692.24386 73.47636 119.38771 1952361.60123
14.25000 -2365.06055 1.91781 -68304.47239 74.12044 108.87382 2187503.01502
14.35000 -2354.30263 -1.03033 -47247.23359 131.02591 109.12075 1966588.43890
14.45000 -2342.45234 1.82065 58692.92123 74.74577 101.19675 2055510.78311
14.55000 -2332.24827 3.09290 -25373.45742 80.94290 105.77809 1817163.74302
14.65000 -2319.71482 -1.22326 46034.25234 85.25246 98.87923 2020152.94254
14.75000 -2309.27757 2.34621 -20363.63841 95.58986 122.91240 1976408.76809
14.85000 -2298.47188 -2.33041 -72919.32649 76.62687 107.93766 2037579.06538
14.95000 -2288.96796 0.94273 29136.78893 77.31501 109.33642 1954928.28348
15.05000 -2278.96632 1.90057 5935.99897 69.52281 103.32383 1802940.91875
15.15000 -2266.50121 -0.12461 -142041.07505 87.63115 108.95279 2059912.36107
15.25000 -2257.78125 -0.76230 -36083.85984 89.73320 94.97842 2029521.41792
15.35000 -2249.85953 -0.33120 -19389.21265 140.39106 120.53082 1920915.54676
15.45000 -2232.58397 -0.47239 -60667.15012 97.97883 110.45985 2043406.46857
15.55000 -2224.82893 -0.57036 -6336.29791 84.31805 102.77032 2026702.99678
15.65000 -2217.38256 0.07020 -5772.04558 75.67810 103.34101 1938547.56871
15.75000 -2204.14303 0.31823 -6042.76147 94.54904 91.23963 2005884.58853
15.85000 -2196.03644 -0.47131 39581.45146 76.28315 102.02973 2063062.44655
15.95000 -2186.20906 -1.74852 -9759.28553 76.16645 87.03252 1950363.00460
16.05000 -2177.37497 -0.26329 -6786.75331 67.20971 106.63621 1896861.17445
16.15000 -2166.42470 -0.18354 47428.64756 79.36831 103.54121 1812461.31889
16.25000 -2155.73226 0.19552 -48027.13381 78.04672 86.33051 1864701.78654
16.35000 -2143.64897 -1.72548 34531.89895 81.48566 86.90052 1937510.22327
16.45000 -2135.76542 0.46527 -26050.91248 62.19882 91.23126 2008216.10594
16.55000 -2127.67055 -2.48618 76469.71104 69.24935 114.16855 1778006.27616
16.65000 -2117.98612 -0.27928 10150.99046 72.38461 84.91806 1897758.30678
16.75000 -2105.70234 -1.64027 -74132.03051 88.28069 97.64566 2024141.23379
16.85000 -2094.67784 -0.78081 121.59195 76.71594 91.85837 1775622.56215
16.95000 -2086.95199 -1.09786 8959.37987 86.51599 81.79506 1854935.28997
17.05000 -2079.86423 3.82700 29258.84195 71.87627 91.00647 1717091.83667
17.15000 -2073.23790 1.08583 -9689.40451 66.25733 84.20733 1888242.89031
17.25000 -2059.53227 -0.03647 -21331.88320 70.73180 86.63095 1863584.57827
17.35000 -2050.85731 -1.69206 -23582.50252 67.21283 81.52276 1934350.76947
17.45000 -2041.53146 1.35917 46825.46593 90.71814 97.39176 1935105.60477
17.55000 -2033.84495 -0.74422 20508.88024 65.61578 93.12434 1936446.53568
17.65000 -2024.31510 -1.65331 566.40418 59.11760 131.87675 1872974.41813
17.75000 -2015.53717 0.23711 5214.42225 74.37895 76.60509 1611526.49898
17.85000 -2004.55980 0.85502 -24229.37144 67.53790 80.08654 1809233.92820
17.95000 -1996.80106 -1.28113 6038.96703 80.17223 81.79719 1923790.45311
18.05000 -1988.38972 0.50762 -17464.81470 73.82428 81.36562 1993694.22895
18.15000 -1981.62382 -0.53842 -2400.96123 64.66264 100.54904 1927902.21628
18.25000 -1971.01738 -0.76934 39201.95695 130.41616 80.06809 1823964.61602
18.35000 -1961.77563 0.48022 13591.23519 54.53158 72.44057 1748953.42333
18.45000 -1952.15655 -1.49653 -34916.85937 84.95369 72.86098 1773283.47365
18.55000 -1945.63638 -2.49161 3289.08707 54.93067 78.06262 1853118.32018
18.65000 -1935.31167 1.40373 47401.32981 68.37868 73.63333 1937814.67704
18.75000 -1929.81263 -0.01509 -45351.69071 59.69832 72.07637 1888865.76816
18.85000 -1922.69752 -1.96469 -16240.76183 64.90136 78.82558 1898014.96708
18.95000 -1910.50598 -0.30187 68447.69551 58.22262 67.65796 1858650.25341
19.05000 -1904.39999 -1.26999 -44023.74463 61.09921 69.33163 1562883.05075
19.15000 -1896.06277 1.04938 41701.96036 60.30683 70.48408 1761741.40943
19.25000 -1885.93601 1.90555 17514.86977 75.97174 103.33524 1781797.19579
19.35000 -1878.18770 -0.52082 11968.92748 82.80125 96.19466 1828398.13790
19.45000 -1869.98840 -0.25803 16056.79751 70.67481 70.00865 1827166.82569
19.55000 -1861.76726 1.00953 61532.67137 70.64482 73.01534 1698660.35341
19.65000 -1855.63055 0.40294 -34287.22542 65.90051 70.20440 1716237.85942
19.75000 -1847.41809 -1.58441 35725.37004 62.43719 63.77349 1921540.66205
19.85000 -1838.96886 -0.71503 28990.23261 52.46219 72.81951 1883700.32348
19.95000 -1830.92684 -3.38869 -21038.93443 81.62468 166.54698 1676555.82517
