0.05000 -1438.77202 -24.62778 26233.30211 679.25982 252.70184 385980.10949
0.15000 -2994.88361 -3.42489 8138.21424 833.36457 294.04852 424398.34671
0.25000 -4273.35852 -22.09193 41330.97303 1025.78897 454.93903 458306.60290
0.35000 -5455.19936 15.18036 -4134.01500 1165.60594 575.82976 302063.79803
0.45000 -6361.28346 0.42607 1990.41416 1278.05842 630.78027 330664.06518
0.55000 -7007.43924 36.58135 -10708.56357 1284.14931 686.35901 351056.97157
0.65000 -7434.75442 20.73255 -7705.16902 1366.97033 714.84027 273068.81055
0.75000 -7774.94329 42.56329 2485.68382 1383.56486 733.88074 317605.25435
0.85000 -8069.47113 39.37090 4418.73430 1335.07078 757.03478 286875.55472
0.95000 -8253.70194 60.60508 -2206.10768 1296.99977 770.37672 273843.52373
1.05000 -8373.62196 73.11868 -1457.14504 1267.77072 799.19413 256490.18779
1.15000 -8438.28284 43.79770 -5787.45089 1243.89707 829.41296 302198.88994
1.25000 -8501.10596 20.20294 -5238.06309 1215.20120 851.72104 234900.65630
1.35000 -8475.53423 16.09662 -2534.07828 1154.13801 877.01721 255906.39628
1.45000 -8501.05002 24.74885 1781.20921 1108.57908 896.69057 282425.12979
1.55000 -8456.87717 41.57499 -2847.53710 1065.71937 924.53241 240738.16503
1.65000 -8377.33759 35.05332 -4013.74916 1002.35658 930.96544 232136.58881
1.75000 -8397.20136 25.88480 2179.77771 929.05495 941.17249 213739.55266
1.85000 -8327.08009 18.73148 -1252.20815 874.80620 956.53644 209512.86737
1.95000 -8272.86613 -20.49532 -1109.90133 864.39112 953.04916 202244.41083
2.05000 -8203.55055 7.06657 -2924.24577 798.87358 963.75156 194589.29031
2.15000 -8166.14481 -8.44383 -5086.81803 746.09057 967.98585 169441.57023
2.25000 -8108.04450 7.52318 -2178.00489 692.64406 969.46649 186536.91150
2.35000 -8053.39438 5.20233 1858.35654 647.13244 972.24145 164320.92080
2.45000 -8009.45290 24.86656 -1297.27870 604.65294 947.26076 163814.25206
2.55000 -7937.68261 -0.11670 -1267.43526 563.52281 946.35130 173385.95761
2.65000 -7865.26558 16.64270 -877.13300 521.95173 933.44854 138839.59240
2.75000 -7792.08821 47.64264 -4552.33675 480.32056 905.62454 138629.87202
2.85000 -7727.83072 27.74058 -1922.20865 444.09535 898.27605 138398.62758
2.95000 -7669.84286 45.81238 -505.18917 406.71627 873.31600 129020.83020
3.05000 -7630.25160 39.16624 -10.28726 369.26422 855.81782 136319.46776
3.15000 -7594.14988 30.65798 -760.09276 342.68984 831.77901 139507.30239
3.25000 -7557.72258 32.75153 -2071.46099 324.77852 806.08423 136945.69252
3.35000 -7519.69241 36.92554 732.24001 326.59529 779.58042 136901.66202
3.45000 -7479.65428 32.66812 -1344.10061 323.22259 744.09220 130205.75665
3.55000 -7423.37339 26.22220 -2433.77549 329.03819 723.01241 121142.23802
3.65000 -7394.13624 38.97217 -86.48622 335.00225 686.96517 114503.08258
3.75000 -7351.07002 31.27001 2475.42550 345.72621 657.73339 110610.40908
3.85000 -7310.43223 22.58264 1120.53848 358.29171 629.67390 107435.03308
3.95000 -7272.69836 17.31446 698.00795 364.54061 599.48959 98258.83189
4.05000 -7231.86975 17.09177 69.76161 372.84725 567.38641 99589.57030
4.15000 -7186.73865 34.31481 -952.59172 386.98116 539.68620 96874.07225
4.25000 -7131.47933 12.61587 248.85540 395.08402 510.92115 91209.33985
4.35000 -7075.04611 13.57896 -104.17277 402.72231 480.25930 93132.04425
4.45000 -7031.14257 15.98523 -234.65383 401.52619 460.66429 89838.58373
4.55000 -6971.85768 21.76919 1103.96961 402.38656 433.90655 85782.45804
4.65000 -6925.85168 9.60397 -6.88651 394.41680 407.45590 83373.64303
4.75000 -6882.10805 14.82224 1397.19703 386.08689 382.60341 91949.15860
4.85000 -6828.41377 19.32451 121.69946 383.39121 360.30929 73166.48282
4.95000 -6779.69099 17.85919 -968.43136 375.74215 337.17133 79052.90197
5.05000 -6726.75048 12.27361 -55.15486 358.64183 319.32240 79117.47557
5.15000 -6664.33868 17.90255 1113.94669 347.97680 301.32104 74773.41819
5.25000 -6610.47091 15.73691 996.83098 332.45716 282.37229 64951.21242
5.35000 -6563.75272 17.21558 -1211.64556 318.25188 268.46747 75324.94259
5.45000 -6516.56124 12.71444 -135.04796 304.80608 254.27846 61421.18349
5.55000 -6473.31820 11.87272 -2119.64916 285.55704 243.79201 76498.26657
5.65000 -6422.11098 16.02358 -367.57847 272.95154 232.83517 64192.56318
5.75000 -6374.97442 12.74239 -244.70346 268.58117 217.38599 62483.16320
5.85000 -6320.50932 15.46691 149.93588 257.14903 207.17439 63388.29039
5.95000 -6280.23380 14.37259 -363.14272 250.48382 200.27190 55464.91970
6.05000 -6225.80960 15.08247 757.44966 234.21327 190.52341 57214.06603
6.15000 -6177.32500 15.62953 876.58773 226.16554 182.50348 51297.33370
6.25000 -6130.78803 17.12620 89.47478 215.51214 176.99788 51117.47660
6.35000 -6090.57009 20.48717 188.72572 208.14512 169.65041 50428.32268
6.45000 -6055.59306 18.24466 -77.87143 198.82234 162.90583 50662.62883
6.55000 -6015.89543 19.95204 -426.53509 189.97964 157.26324 70065.46394
6.65000 -5975.20729 22.11072 -64.88893 181.13852 152.19705 45873.63621
6.75000 -5936.06123 20.33108 144.53253 168.93415 148.81499 41319.92722
6.85000 -5894.62929 21.32107 -240.47763 160.48524 144.08113 40966.82336
6.95000 -5862.57515 23.30017 -1221.07635 157.02416 140.13438 44746.72358
7.05000 -5817.47776 18.51827 -170.63463 150.60821 134.75843 39897.23579
7.15000 -5774.00106 22.15197 -816.91166 146.20307 130.15298 38309.52541
7.25000 -5730.34984 19.33862 -1223.18750 138.24198 126.80082 39680.06878
7.35000 -5688.80093 23.04596 -390.55559 132.66442 125.55448 33632.26211
7.45000 -5648.51797 18.43824 100.16136 124.64399 122.50038 34938.95248
7.55000 -5609.55203 17.91627 -791.13702 116.90545 118.80530 37736.17132
7.65000 -5568.07575 15.13733 -108.68414 114.63736 115.40584 31618.90655
7.75000 -5521.63152 12.97053 420.48270 111.49126 112.74367 37301.10052
7.85000 -5476.14509 15.35061 -263.77816 106.63192 109.17861 35401.85252
7.95000 -5433.22634 15.02517 -556.76427 103.57382 105.91952 31466.17862
8.05000 -5391.36825 13.03413 -337.42348 100.68046 103.25692 29034.49328
8.15000 -5347.35206 11.88777 -397.46709 97.23422 102.07252 30432.73833
8.25000 -5301.65677 10.27448 721.46863 94.17175 98.10672 30000.13114
8.35000 -5257.78705 10.02254 407.94349 88.39576 95.85381 26943.89883
8.45000 -5217.96781 12.72048 -244.72365 87.90487 93.44561 26207.06606
8.55000 -5174.25823 13.09768 587.04228 87.67386 90.86530 61954.48948
8.65000 -5133.46584 10.92303 -759.97675 85.42476 89.63449 25548.42480
8.75000 -5091.18298 6.32221 619.73528 83.22972 88.43263 25931.75147
8.85000 -5054.75868 9.10858 296.45926 87.96183 85.58525 22106.32878
8.95000 -5011.01247 8.80002 -4.94251 85.81563 84.53956 25885.14587
9.05000 -4970.07323 10.79600 441.45198 84.70630 83.11184 22674.61489
9.15000 -4932.71818 9.49380 10.36271 83.25016 81.36729 22953.14492
9.25000 -4895.66227 10.92922 -101.40471 85.82225 78.46968 21154.51490
9.35000 -4859.50308 10.04784 188.77128 88.53600 75.71840 22000.74841
9.45000 -4824.33002 12.03511 485.85233 90.34393 75.98051 24246.72667
9.55000 -4790.03195 9.88741 -105.67882 86.30244 74.74218 22007.64848
9.65000 -4752.53330 10.41696 -415.43086 86.56823 72.34487 25525.25483
9.75000 -4714.36808 10.54816 -193.92073 85.59722 71.21621 21564.61710
9.85000 -4679.46271 10.38502 15.80163 84.84775 69.72108 17278.21502
9.95000 -4643.98549 8.57957 -114.61516 83.23584 66.09963 17535.67269
10.05000 -4609.01277 10.20579 177.44253 83.37573 65.65046 20001.10051
10.15000 -4573.99554 8.60734 369.25519 82.63507 61.73203 15446.48412
10.25000 -4537.11428 10.56758 34.69461 83.17049 60.41911 18096.03777
10.35000 -4502.84141 8.05711 291.94149 81.93241 59.89974 16939.82727
10.45000 -4465.40920 8.82055 -312.55883 80.54883 58.55041 17820.50216
10.55000 -4433.08549 8.63102 189.92027 81.40699 57.96316 35957.94922
10.65000 -4393.73660 7.95181 -200.24246 80.89245 56.56996 14521.54737
10.75000 -4361.01587 7.67364 -18.06694 81.34652 56.82969 16603.46416
10.85000 -4324.88659 5.98873 33.34296 78.71792 55.66250 12365.70481
10.95000 -4288.28351 9.33648 -222.32384 81.68428 55.61935 16973.35349
11.05000 -4256.80536 6.72808 -119.99329 82.92963 54.70618 15786.31624
11.15000 -4223.33449 7.34276 78.94241 80.31348 52.86076 13254.73246
11.25000 -4192.78556 7.15133 -428.88082 80.57566 53.08862 13913.56634
11.35000 -4155.90615 7.22340 -382.52654 76.45840 51.16224 14466.85871
11.45000 -4127.02722 8.14727 72.77122 74.11771 50.67207 13382.86480
11.55000 -4094.99052 8.05782 -278.35683 70.00250 49.87191 10319.74471
11.65000 -4063.76784 8.98156 -127.70028 67.43159 48.73721 12522.47997
11.75000 -4034.06289 8.54144 -314.15552 66.19528 49.56198 13239.09057
11.85000 -4004.33069 9.42557 -173.58626 64.58893 47.29215 11002.19468
11.95000 -3973.88669 9.30002 -8.73500 63.97583 45.38659 9060.69452
12.05000 -3941.18706 7.58512 -54.90168 64.33182 44.98590 10487.89026
12.15000 -3916.47268 8.35364 -323.30912 60.58255 44.43260 9475.41104
12.25000 -3886.66132 8.63474 265.83419 59.80271 42.74494 9752.73988
12.35000 -3858.73031 7.25801 -345.31200 59.38751 43.63179 9186.84535
12.45000 -3826.27394 7.60540 -187.81483 60.14916 42.53189 9033.37858
12.55000 -3801.04515 7.61809 -109.87279 59.23214 41.62356 7816.58299
12.65000 -3771.75288 8.06145 -49.52452 60.19745 41.39611 11231.08750
12.75000 -3745.01194 6.82325 -289.13028 57.24531 40.08770 8155.76517
12.85000 -3716.34183 6.48902 -146.42130 58.03579 39.67589 8913.19541
12.95000 -3687.92409 6.07846 690.82198 58.56141 37.39454 38180.12956
13.05000 -3660.44553 6.08386 82.74613 57.65250 36.37466 8653.70090
13.15000 -3629.97358 7.50224 -535.34090 55.69327 36.67319 9595.97648
13.25000 -3601.07069 5.30436 -157.72298 55.33067 35.79302 7882.98266
13.35000 -3573.91286 6.22368 -234.33032 54.12398 34.95495 9152.62210
13.45000 -3546.36270 5.38222 37.96531 51.82399 35.51727 9387.62623
13.55000 -3521.51452 4.88684 -133.14060 52.28878 35.82153 8238.13051
13.65000 -3495.33462 4.79804 336.44133 50.33005 34.80914 8456.16144
13.75000 -3470.61783 4.22130 -170.90378 50.37155 33.95302 6848.99654
13.85000 -3443.11246 5.55707 -15.86528 49.08931 34.61135 6358.05314
13.95000 -3421.27334 4.68507 -35.68101 46.73540 34.88569 7796.78272
14.05000 -3398.08011 5.06207 117.45138 46.99979 34.40346 6135.39303
14.15000 -3375.48708 4.15426 200.93805 45.49892 34.27269 8027.24419
14.25000 -3349.60607 5.28109 98.69617 44.29293 33.69108 7453.00642
14.35000 -3327.03181 5.31959 127.54941 41.51845 32.36734 8513.02610
14.45000 -3305.52709 6.09604 -91.52389 39.86920 33.83378 5938.60428
14.55000 -3283.22557 4.21126 22.82745 42.87160 32.58200 5176.27966
14.65000 -3259.55786 3.77039 -165.42800 40.28206 32.60427 5136.41888
14.75000 -3239.92875 4.26346 -197.97780 38.81970 31.96248 5931.62720
14.85000 -3219.40288 3.60949 -63.03981 37.63977 30.86178 4960.41795
14.95000 -3196.84654 4.19510 -38.30896 37.12961 30.84205 4321.18963
15.05000 -3175.24415 4.74339 109.51587 35.49908 30.98681 5791.40853
15.15000 -3154.49176 3.75714 5.03773 34.26131 29.03777 4277.39661
15.25000 -3133.43384 6.40974 3.92843 33.18208 28.59630 4800.31418
15.35000 -3111.80928 5.26151 35.45185 32.18475 28.51353 4353.93705
15.45000 -3090.95966 3.90660 148.15427 31.14527 29.61298 4975.36336
15.55000 -3069.44988 4.72718 -7.33329 31.12500 27.72855 4762.30105
15.65000 -3048.92807 3.59130 66.43415 32.28766 27.29876 4641.32249
15.75000 -3029.49866 3.93705 -148.78421 32.00391 27.26976 5325.29238
15.85000 -3005.54756 5.77729 76.92839 31.99425 28.35063 4111.00438
15.95000 -2987.34310 3.20426 175.75736 29.92580 27.05060 3897.49538
16.05000 -2967.27346 3.92832 16.93259 31.69389 26.87772 3146.36168
16.15000 -2947.53073 3.19008 76.86179 31.44383 26.65315 3367.12155
16.25000 -2928.27945 4.58364 -5.46903 31.84249 26.99967 3516.13026
16.35000 -2908.63166 2.95738 100.67967 30.34622 25.73580 3718.57302
16.45000 -2887.45684 3.44997 -61.35938 29.11220 26.62384 4309.90831
16.55000 -2867.73426 3.43352 -123.24849 29.34960 26.69340 3344.81442
16.65000 -2847.87808 3.38393 -143.20970 29.09658 26.53874 3404.08799
16.75000 -2829.11319 3.04129 23.27884 27.86099 26.79040 3740.20777
16.85000 -2814.27090 3.01937 -12.22727 28.44674 26.61417 2998.88784
16.95000 -2795.44055 1.75026 -14.05124 29.63880 26.73569 2707.60472
17.05000 -2776.75127 3.96819 33.63891 29.80633 25.58023 2910.36479
17.15000 -2757.45320 2.26704 46.83796 29.26798 25.78129 2427.38678
17.25000 -2740.98858 3.17113 140.92246 28.21551 24.43829 3139.86621
17.35000 -2726.09034 4.12395 27.70779 28.32904 24.78878 3243.65070
17.45000 -2705.57120 3.77388 -107.49926 27.63133 24.49784 2585.50361
17.55000 -2691.16999 3.33814 70.45594 25.65344 25.33903 2895.17312
17.65000 -2674.52054 4.64050 -137.49577 26.21520 25.89307 2692.94375
17.75000 -2658.24034 2.75380 -52.66130 25.53009 23.87415 2499.25730
17.85000 -2642.47953 2.64492 127.02418 26.13225 25.05244 2794.56097
17.95000 -2625.14829 4.48124 -158.02985 25.24315 24.82061 3745.73533
18.05000 -2609.04516 4.28830 -9.32123 27.25370 24.74116 3026.46650
18.15000 -2592.60411 2.58413 -64.06118 25.24782 22.90739 2484.21980
18.25000 -2578.27195 2.90600 19.29158 24.21283 23.83219 2442.97196
18.35000 -2561.39984 1.21084 -5.67486 23.89837 23.82439 2685.24110
18.45000 -2546.32251 2.91974 -125.73142 25.27862 23.79786 2357.81648
18.55000 -2531.70394 2.57060 -95.02161 26.29601 25.32713 2738.55298
18.65000 -2515.28642 2.71279 -43.04527 25.42735 24.43345 2239.88061
18.75000 -2502.53648 3.69212 -59.12773 25.33714 25.35005 2206.13043
18.85000 -2488.74742 2.94305 -341.79509 24.95429 23.85214 2184.58419
18.95000 -2471.36347 1.27678 -122.27776 25.43945 21.82945 2561.88872
19.05000 -2458.19128 2.86612 -17.30429 23.56939 21.78455 1814.81284
19.15000 -2443.25742 2.00672 3.68979 23.55537 22.11308 1884.13471
19.25000 -2428.17796 2.48447 -70.37654 23.64679 21.48675 1937.35560
19.35000 -2416.27870 2.59958 -93.32195 23.03352 20.26359 2697.88131
19.45000 -2400.78103 2.22733 138.32567 23.80621 21.55498 7493.56592
19.55000 -2388.18700 2.51420 -70.10615 21.51874 22.40005 1763.88311
19.65000 -2374.29137 0.05154 -6.49651 21.87818 20.36920 1782.65675
19.75000 -2362.15497 1.52569 -119.28451 21.90516 21.26740 2121.75947
19.85000 -2347.54838 2.46283 91.74933 21.71879 21.34135 2117.91121
19.95000 -2335.62698 1.77337 -121.48928 21.86266 20.69068 2055.16044
