0.15 0.38632 9.10648 1.04534 61.15918 61.89633 59.67351
0.45 0.66039 21.97239 -0.31262 61.64801 61.27633 59.99534
0.75 1.31285 35.78733 -0.87645 60.08763 60.39293 58.40512
1.05 -0.44046 49.60023 -0.71119 59.51733 58.38437 58.59087
1.35 0.09317 64.88468 -0.43595 58.10368 57.89818 56.63541
1.65 -0.87172 76.50699 -0.55176 57.35121 56.05695 55.632
1.95 -1.20667 89.49059 -0.72416 55.76192 55.34373 54.10448
2.25 -0.65456 100.54312 0.1422 54.24859 53.96911 53.51025
2.55 -1.22926 111.91232 -0.35308 53.39871 52.14967 51.72876
2.85 -0.1644 120.46814 -0.15196 51.96027 51.38049 50.98572
3.15 -0.24809 130.56674 0.64402 50.50453 49.78952 49.38087
3.45 0.4851 138.40659 0.11644 49.63536 48.09561 47.76307
3.75 0.48651 146.5833 -0.12964 48.16132 46.94641 46.42688
4.05 1.43274 153.93997 0.37199 47.27001 45.05281 45.13077
4.35 1.6538 160.24997 0.04767 46.20797 44.04022 43.53176
4.65 1.70209 166.20356 0.67389 45.16975 41.69096 42.11562
4.95 1.10667 171.98931 0.48603 44.24277 40.44526 40.39322
5.25 1.05982 177.31698 0.93432 42.93096 38.10931 39.25195
5.55 0.99043 181.53908 1.43858 42.09718 37.1355 38.12352
5.85 1.10663 185.96588 1.08161 40.6049 35.73569 36.83757
6.15 1.29869 189.98623 1.01061 39.76951 34.20265 35.92339
6.45 1.31119 193.25966 0.6369 38.57923 33.05776 34.7605
6.75 0.78455 196.96671 0.75814 37.79281 32.09145 33.4551
7.05 2.29098 200.15566 0.69112 36.89012 31.05794 32.8448
7.35 1.5112 201.87935 0.09453 35.6459 30.37653 31.5394
7.65 1.84601 204.24394 0.18118 35.28599 29.09637 30.67108
7.95 1.37297 206.84163 0.20803 34.13683 28.26301 30.25996
8.25 1.61067 208.23639 -0.29688 33.33871 27.23554 28.63809
8.55 1.42696 210.35633 -0.23097 32.5522 26.52584 27.78223
8.85 1.62024 211.37995 -0.1339 31.82065 25.59675 26.94214
9.15 1.88217 212.93993 -0.24896 30.79314 25.2057 26.26222
9.45 0.98918 214.49638 -0.61358 30.42321 24.19917 25.15682
9.75 1.3542 215.96074 -0.72952 29.48822 23.7229 24.28817
10.05 1.68842 216.69242 -0.73793 28.69355 22.64355 24.36276
10.35 2.00268 217.71487 -0.48833 28.30131 22.14643 23.26627
10.65 2.04551 218.63129 -0.55343 27.47071 21.39845 22.33262
10.95 1.06313 219.02187 -0.57187 27.26647 20.87732 21.71618
11.25 0.98247 219.74715 -0.48194 26.59613 20.1803 21.12578
11.55 1.49271 220.69149 -0.8051 26.02928 20.0712 20.64198
11.85 0.98479 220.89531 -0.23206 25.70353 19.67598 19.92383
12.15 1.82875 221.63848 -0.57187 24.70766 18.87414 19.45624
12.45 1.58679 221.95088 -0.28354 23.97083 17.88233 19.06814
12.75 1.53694 221.82092 -0.69321 23.3584 17.43255 18.29915
13.05 1.22047 221.72917 -0.88631 22.92824 17.12773 18.12089
13.35 1.0662 221.94355 -0.52503 22.63255 16.75156 17.24997
13.65 0.6638 222.42173 0.04401 21.62683 16.48888 16.61422
13.95 1.05248 221.75828 -0.38107 21.95598 16.58281 16.60046
14.25 0.88248 222.48582 -0.02377 21.03519 15.61749 16.16537
14.55 0.95552 222.39178 0.34969 20.85548 15.85331 15.70036
14.85 0.76846 223.23062 0.22676 20.61658 14.77964 15.02984
15.15 1.19053 222.55041 0.09606 19.82506 14.70876 15.02988
15.45 1.18853 222.62676 0.01021 19.3575 13.58569 14.07091
15.75 1.40035 221.54568 0.08085 19.19259 13.40698 13.76229
16.05 1.03661 220.89571 -0.38294 18.87901 12.94594 13.3547
16.35 -0.13281 219.70707 -0.32762 19.01919 13.20411 13.31126
16.65 -0.31791 219.56499 -0.36936 18.11209 13.56883 12.8473
16.95 -0.24897 220.39845 -0.65778 18.15915 12.75673 12.6516
17.25 -0.1922 220.06356 -0.81922 17.7021 13.19114 11.96022
17.55 0.0834 220.11385 -0.41145 17.16913 12.0008 12.12439
17.85 0.57628 219.39161 -0.37242 16.29718 11.37707 11.48457
18.15 0.73251 218.43528 -0.71093 16.56843 11.36171 11.60604
18.45 0.72107 217.77713 -0.6194 16.10082 10.69987 11.26815
18.75 0.94333 217.42524 -0.06996 15.23497 11.46051 11.35635
19.05 0.93151 217.06543 -1.04795 15.46691 11.65459 10.79846
19.35 1.43133 218.49194 -1.0214 14.6271 11.60678 10.24727
19.65 1.7562 218.74068 -0.80392 13.8276 11.14111 9.88722
19.95 2.21422 218.53798 -0.90516 13.85388 10.48282 9.51907
20.25 1.93215 217.93291 -1.3406 13.99218 9.90975 9.5788
20.55 1.80506 216.53508 -1.27772 13.51571 9.25971 9.55465
20.85 1.44848 215.32598 -0.96486 14.33317 8.41414 9.15799
21.15 0.89191 214.77342 -1.14597 12.94013 8.72602 9.03876
21.45 -0.07214 214.08645 -1.42484 13.47739 8.88593 9.15333
21.75 -2.46125 213.9474 -1.16487 13.61037 9.3361 9.1512
22.05 -2.8792 213.40693 -0.48312 13.17749 9.08655 8.92327
22.35 -2.84806 214.13065 -0.3065 12.78743 8.84469 8.97119
22.65 -1.82167 214.9063 -0.20544 11.63445 8.26646 8.49701
22.95 -0.36915 213.56364 -0.10873 12.06262 8.05891 7.88361
23.25 1.00926 214.42041 -0.04114 10.9711 7.24124 7.48945
23.55 2.00639 213.16913 0.17428 10.91655 7.38756 7.73201
23.85 2.09969 212.54461 0.12053 10.60577 7.17758 7.39812
24.15 2.40475 211.27964 -0.16144 10.22776 7.13929 7.57254
24.45 2.02376 210.88411 -0.45178 10.18907 7.37905 7.49223
24.75 1.6153 209.63366 -0.36695 10.74973 7.52889 6.82248
25.05 0.72774 209.63103 -0.18259 10.29958 7.22718 7.09858
25.35 -0.29322 208.89404 -0.76337 10.10985 7.11315 6.56147
25.65 -2.75555 208.14177 -0.95347 10.0769 7.20892 6.73145
25.95 -3.78536 208.70126 -0.87274 9.11671 6.09219 7.18328
26.25 -3.96947 208.57595 -0.40926 9.15077 5.69397 6.34101
26.55 -4.15708 208.12565 -0.82388 8.00952 5.10354 6.50988
26.85 -3.29497 207.51358 -0.50821 9.47787 5.23874 6.04972
27.15 -1.94635 207.02577 0.04493 9.5542 4.56123 6.21732
27.45 -0.52478 206.54627 0.3287 8.70674 4.94169 5.74799
27.75 -0.91008 205.1942 -0.0579 8.43016 5.65378 5.92794
28.05 2.27544 204.83055 0.13292 8.52019 6.50142 6.03144
28.35 3.48869 205.46674 0.02461 7.89148 6.47107 5.58269
28.65 3.80657 205.2025 -0.06059 7.36206 6.54027 5.66388
28.95 4.31071 205.41736 0.00203 8.48145 6.59495 5.12547
29.25 4.34353 205.69046 -0.12658 7.66603 6.46199 5.33793
29.55 4.3669 204.78642 -0.6199 8.64547 6.69272 5.20398
29.85 3.95248 204.36207 -0.38473 7.83776 6.50146 5.45957
