0.05000 1672.53254
0.15000 4381.22906
0.25000 6298.64586
0.35000 7797.13788
0.45000 9350.29358
0.55000 10021.00781
0.65000 10757.01149
0.75000 10836.67222
0.85000 10961.51799
0.95000 10729.06987
1.05000 10596.64457
1.15000 10116.20175
1.25000 9854.19002
1.35000 9455.29591
1.45000 9144.54436
1.55000 8652.85590
1.65000 8211.10607
1.75000 7818.67249
1.85000 7518.78174
1.95000 7083.81175
2.05000 6824.56013
2.15000 6556.77576
2.25000 6245.84103
2.35000 6062.26207
2.45000 5808.46392
2.55000 5631.02553
2.65000 5392.83483
2.75000 5186.75841
2.85000 4970.35122
2.95000 4811.21063
3.05000 4674.30226
3.15000 4533.56267
3.25000 4372.49512
3.35000 4224.47214
3.45000 4171.90883
3.55000 3959.55940
3.65000 3904.77536
3.75000 3779.38557
3.85000 3640.82448
3.95000 3619.66761
4.05000 3453.75116
4.15000 3312.00930
4.25000 3297.11948
4.35000 3228.40398
4.45000 3070.49090
4.55000 2999.68176
4.65000 2846.97494
4.75000 2780.55998
4.85000 2727.19416
4.95000 2736.45825
5.05000 2597.64495
5.15000 2620.78002
5.25000 2555.13022
5.35000 2510.19415
5.45000 2357.01737
5.55000 2382.23546
5.65000 2225.64152
5.75000 2239.18066
5.85000 2164.81366
5.95000 2125.50660
6.05000 2038.87492
6.15000 2066.87537
6.25000 1981.82969
6.35000 1924.25527
6.45000 1868.61308
6.55000 1845.42801
6.65000 1717.62191
6.75000 1715.31049
6.85000 1742.04502
6.95000 1654.00190
7.05000 1552.97628
7.15000 1557.89566
7.25000 1489.81822
7.35000 1420.51636
7.45000 1428.97609
7.55000 1352.29663
7.65000 1350.97789
7.75000 1269.20982
7.85000 1240.99196
7.95000 1144.80619
8.05000 1134.02258
8.15000 1098.40118
8.25000 1063.65967
8.35000 1065.58628
8.45000 1025.04889
8.55000 983.44992
8.65000 967.46400
8.75000 961.82555
8.85000 931.93019
8.95000 869.01979
9.05000 875.51837
9.15000 835.95105
9.25000 832.10742
9.35000 786.80694
9.45000 763.38454
9.55000 769.44799
9.65000 722.26930
9.75000 703.46670
9.85000 691.60149
9.95000 662.17797
10.05000 645.43508
10.15000 610.73813
10.25000 617.70078
10.35000 593.27945
10.45000 587.40089
10.55000 571.93412
10.65000 547.67207
10.75000 531.57324
10.85000 524.59997
10.95000 512.47998
11.05000 488.32113
11.15000 505.54173
11.25000 495.68824
11.35000 457.32435
11.45000 439.50333
11.55000 461.81366
11.65000 433.99611
11.75000 423.84486
11.85000 411.43782
11.95000 406.86555
12.05000 395.10979
12.15000 414.70240
12.25000 385.81899
12.35000 372.82923
12.45000 394.22244
12.55000 368.62549
12.65000 369.31823
12.75000 375.22942
12.85000 370.35542
12.95000 336.23972
13.05000 335.49945
13.15000 342.53178
13.25000 344.33226
13.35000 330.15969
13.45000 317.66795
13.55000 316.71899
13.65000 317.88602
13.75000 295.98646
13.85000 301.66634
13.95000 290.62323
14.05000 310.16372
14.15000 304.46156
14.25000 288.67802
14.35000 302.48473
14.45000 288.38909
14.55000 271.15579
14.65000 304.31412
14.75000 274.23463
14.85000 271.55429
14.95000 270.62602
15.05000 272.97750
15.15000 285.23149
15.25000 272.63199
15.35000 253.45063
15.45000 279.70168
15.55000 256.44003
15.65000 279.91384
15.75000 279.81744
15.85000 265.70880
15.95000 242.69913
16.05000 258.52292
16.15000 260.16860
16.25000 258.38401
16.35000 241.63063
16.45000 238.60226
16.55000 253.38479
16.65000 228.35585
16.75000 244.70481
16.85000 237.63753
16.95000 250.25872
17.05000 221.22182
17.15000 223.86768
17.25000 209.75626
17.35000 191.97701
17.45000 215.51621
17.55000 202.93536
17.65000 185.37338
17.75000 188.36388
17.85000 177.86208
17.95000 186.96208
18.05000 170.68618
18.15000 191.43410
18.25000 180.96422
18.35000 192.87844
18.45000 151.40270
18.55000 167.08305
18.65000 152.77108
18.75000 149.81148
18.85000 156.64470
18.95000 159.79795
19.05000 148.67136
19.15000 143.31741
19.25000 129.64381
19.35000 127.24194
19.45000 148.75853
19.55000 143.84124
19.65000 171.54643
19.75000 164.61291
19.85000 159.22410
19.95000 142.92027
