0.05000 963.46227 1089.25560 4089.00790 640.51786 303.89551 71.12683
0.15000 122.26103 527.44351 4230.12384 1023.63299 901.64555 216.16134
0.25000 -382.90674 -373.06883 4262.13681 970.89178 974.96789 203.39455
0.35000 -648.30825 -119.58233 4212.50431 1049.18423 1170.42552 316.43516
0.45000 -963.59630 1.64359 4126.66985 1183.75755 1065.02088 350.47856
0.55000 -1091.52928 144.88165 4114.39803 1128.74888 1125.51345 390.08412
0.65000 -1281.89371 97.51558 3957.17481 1140.57017 1242.37686 487.69643
0.75000 -1695.49428 156.75348 3798.76181 1208.61304 1128.31266 561.39625
0.85000 -1858.33988 2.66875 3629.90484 1242.04364 1253.59488 640.12855
0.95000 -2007.24783 -120.16298 3530.14182 1207.26912 1255.49544 671.78063
1.05000 -2079.91180 19.33858 3340.38460 1287.34296 1381.93468 724.82846
1.15000 -2415.46052 49.42428 3080.93054 1275.63876 1366.96370 879.80781
1.25000 -2512.92841 -20.54107 2821.65487 1342.69371 1445.76627 1039.52230
1.35000 -2741.47560 85.44821 2407.35069 1279.18371 1517.02792 1235.93193
1.45000 -2926.97059 61.30187 2188.78553 1274.48161 1411.41960 1443.80897
1.55000 -3014.26809 34.36797 1868.72873 1263.90256 1373.90469 1680.64385
1.65000 -3126.40684 -45.91804 1542.57024 1297.28585 1309.69693 1887.39760
1.75000 -3211.83697 -59.25133 1381.98351 1224.09229 1241.07320 2037.40086
1.85000 -3339.25907 -20.02457 1115.95865 1212.53824 1139.32966 2126.22434
1.95000 -3384.16170 18.23067 1129.48247 1154.40203 1030.12573 2179.95390
2.05000 -3441.38272 -2.49546 992.75733 1151.91401 978.23358 2222.14459
2.15000 -3368.19329 36.68157 805.12364 1169.23820 945.94373 2383.43546
2.25000 -3409.21757 -22.97964 786.44836 1141.82171 870.36382 2379.76926
2.35000 -3456.37481 24.57043 824.44231 1085.22993 780.64441 2328.57449
2.45000 -3498.10862 -20.87000 686.11100 1023.97737 756.42468 2307.33488
2.55000 -3443.29802 6.15467 506.43218 1097.87587 726.58933 2392.82398
2.65000 -3454.77834 11.85790 482.18987 1068.65800 702.30589 2380.68041
2.75000 -3355.91842 -22.69412 594.22380 1141.58112 628.84662 2429.97749
2.85000 -3398.26241 2.43890 438.41103 1079.47249 611.27499 2416.71952
2.95000 -3416.16518 4.84120 284.33651 1035.83519 598.23373 2426.15191
3.05000 -3401.95122 -10.69807 338.97321 1050.11405 569.11435 2391.48038
3.15000 -3311.01609 -19.99266 347.57789 1062.97092 538.95313 2468.28844
3.25000 -3341.15314 1.70487 225.91483 1034.99734 530.66948 2433.04229
3.35000 -3346.32378 5.02378 411.36199 1032.34901 497.64133 2333.48108
3.45000 -3328.37161 -23.73957 368.71013 997.47912 477.41662 2361.69125
3.55000 -3270.53383 10.65726 259.17712 992.93587 446.85914 2425.09661
3.65000 -3263.65917 -9.20713 191.14095 1022.01336 443.52600 2391.70014
3.75000 -3249.64194 -16.38836 249.63016 950.30151 426.09408 2370.59338
3.85000 -3227.85227 3.83992 197.32616 952.18638 410.27617 2370.43252
3.95000 -3207.98742 7.25735 291.96327 980.97618 392.50782 2318.80545
4.05000 -3221.14108 -6.53311 279.76256 936.87365 371.70026 2277.85723
4.15000 -3153.54001 1.69012 128.60694 957.62814 385.16616 2357.35858
4.25000 -3216.90835 22.80615 174.06993 914.55386 357.36732 2256.71318
4.35000 -3145.05226 -6.12821 149.67018 944.33828 359.07102 2307.93560
4.45000 -3128.13493 9.81110 184.48746 920.26482 342.25099 2285.34664
4.55000 -3121.09545 -4.37190 157.11079 912.44286 336.56740 2269.48099
4.65000 -3107.44393 -1.59107 143.84202 930.21007 328.52180 2247.60001
4.75000 -3104.09282 3.18251 69.91107 918.26220 315.22572 2238.74253
4.85000 -3100.74810 -14.05295 250.57537 899.14765 303.54473 2171.04573
4.95000 -3089.31531 -3.34402 112.33142 867.73165 304.88580 2182.69109
5.05000 -3051.89612 -13.85797 154.53847 871.62453 292.02814 2191.40027
5.15000 -3000.93754 -1.49798 47.21548 906.38820 290.79301 2215.05533
5.25000 -3008.18588 3.62874 132.10834 884.56334 275.94399 2157.77487
5.35000 -2955.68117 4.90309 153.77732 897.25644 274.47422 2181.07661
5.45000 -2937.53314 -2.54531 37.56900 869.01712 268.15553 2199.90879
5.55000 -2935.87176 -5.51104 100.31291 866.69666 262.14482 2150.73718
5.65000 -2922.77357 6.06380 150.25599 867.28468 251.80499 2123.81591
5.75000 -2932.09562 -0.16023 124.97132 842.29093 245.39461 2091.35223
5.85000 -2875.43428 -3.25963 38.38577 870.77894 241.33827 2151.82175
5.95000 -2871.74619 0.45887 118.96120 858.69236 237.63209 2116.48118
6.05000 -2875.86530 -2.39580 53.07055 833.64459 227.29748 2103.43951
6.15000 -2859.81518 2.01052 44.70611 846.91589 225.99678 2084.18243
6.25000 -2836.76723 -1.21772 59.77460 836.27400 219.25887 2078.52778
6.35000 -2841.51429 0.61403 40.97579 822.62843 219.97051 2057.74696
6.45000 -2852.14437 3.24697 24.35903 794.20866 212.41248 2027.31103
6.55000 -2805.29388 3.57519 -17.22764 815.89984 206.98362 2041.33445
6.65000 -2794.22792 1.89825 68.57806 804.39478 204.74315 2026.49192
6.75000 -2786.45083 4.93720 19.45242 799.29949 200.84968 2009.19092
6.85000 -2748.93363 -5.37379 53.01204 805.15142 194.75103 2019.35564
6.95000 -2733.35351 3.82900 10.67906 796.32964 190.48115 2015.14865
7.05000 -2729.90367 -1.09983 -48.52338 790.08775 191.21010 1996.89476
7.15000 -2706.03985 1.82462 25.51801 799.26908 182.17278 1987.02324
7.25000 -2704.84693 -1.78199 16.19678 771.00102 180.59909 1966.56582
7.35000 -2665.95064 -3.70356 -13.46656 781.27010 182.67574 1983.87623
7.45000 -2659.68364 0.87518 -62.30761 785.23366 177.00169 1970.73202
7.55000 -2666.00016 -1.95956 -37.75740 762.76546 172.63975 1943.41181
7.65000 -2663.49536 -2.43683 -91.66617 761.24862 172.50118 1915.58021
7.75000 -2624.34475 1.04770 4.16182 766.62020 166.82914 1920.91433
7.85000 -2624.82319 -2.04782 -6.34111 769.64998 163.03601 1890.59860
7.95000 -2582.81979 -4.15523 3.26895 756.01164 161.28753 1922.84334
8.05000 -2580.26749 -1.37283 -46.41998 741.21115 160.56999 1910.04271
8.15000 -2589.42173 6.35964 14.74669 719.62065 158.12937 1865.16441
8.25000 -2576.69181 2.69788 -8.17291 730.90109 152.31611 1854.39903
8.35000 -2551.95782 -1.14337 -24.10255 728.11771 152.92304 1857.48909
8.45000 -2532.58810 3.15286 6.85997 730.81694 148.89785 1855.54044
8.55000 -2528.05973 3.34643 10.75977 722.02696 145.37724 1829.10166
8.65000 -2501.66771 1.14128 -20.49614 729.19452 144.74237 1835.35444
8.75000 -2495.53973 -1.41417 -56.71364 720.35006 141.44077 1822.38709
8.85000 -2473.90648 5.29607 -98.77085 716.31655 142.16656 1822.36694
8.95000 -2475.93039 -1.83644 -17.29314 709.31566 138.51509 1787.10903
9.05000 -2461.97513 -1.77909 19.37832 705.53838 138.44293 1773.70357
9.15000 -2402.03818 -1.55984 30.32195 722.58129 133.94609 1817.52821
9.25000 -2420.97631 5.47031 -76.28641 713.19137 130.50866 1777.08319
9.35000 -2413.33461 -2.81949 -108.87021 687.96810 131.23588 1773.57053
9.45000 -2412.30167 -3.71936 -12.05713 699.07115 128.27612 1734.44089
9.55000 -2410.58432 4.27817 -58.11774 680.87556 129.45936 1713.75250
9.65000 -2378.90801 -1.38181 -16.42246 680.52069 123.50449 1727.94951
9.75000 -2337.17248 2.47149 -87.17514 712.29355 126.28441 1755.70620
9.85000 -2338.95878 -2.27058 -61.25086 685.54655 124.83400 1731.07030
9.95000 -2319.89933 3.14983 -95.52302 686.64388 119.61051 1735.45904
10.05000 -2316.28000 1.14663 50.02213 665.25965 119.09155 1698.57783
10.15000 -2318.26582 9.02217 -72.58755 657.81379 117.40502 1688.53077
10.25000 -2295.22937 -3.54964 -48.46468 659.02359 116.63061 1691.09550
10.35000 -2274.61570 -0.92998 -58.11176 671.14314 111.36080 1692.94815
10.45000 -2265.95320 -0.45111 -50.86736 667.85003 112.41576 1674.71331
10.55000 -2237.20122 -1.19297 -64.68278 668.91586 113.50370 1684.99778
10.65000 -2242.25691 1.53513 -34.61024 653.80649 111.35987 1659.89040
10.75000 -2245.33311 -0.95830 -41.92565 647.21042 106.78049 1633.41014
10.85000 -2198.59132 0.77799 -58.29838 653.20402 105.54368 1666.40245
10.95000 -2226.64257 -1.91525 -54.52954 629.82425 106.20158 1613.81138
11.05000 -2220.91261 0.22414 -66.89190 616.64487 106.63714 1602.42634
11.15000 -2174.63654 1.75303 18.28501 638.50221 101.07481 1621.64496
11.25000 -2175.81377 0.07506 -86.54583 622.89070 101.66715 1615.67346
11.35000 -2172.91110 2.07488 -35.38129 611.11167 99.43256 1596.97200
11.45000 -2158.15767 0.79719 -95.64150 625.60261 99.28247 1590.35636
11.55000 -2143.02048 -3.41372 -87.69093 621.89893 96.71039 1591.07559
11.65000 -2130.46700 -1.56680 -78.78959 627.65931 97.12284 1575.05211
11.75000 -2135.40334 2.56715 -57.32504 606.06881 94.68793 1552.59250
11.85000 -2125.71889 -2.68256 -63.14832 593.27072 93.86544 1547.30912
11.95000 -2095.86245 -2.06396 -16.82236 605.08457 92.25044 1554.99689
12.05000 -2093.58986 -1.21546 -68.69604 599.94585 92.71378 1542.23091
12.15000 -2082.74510 1.06533 -31.48457 600.88763 88.26252 1529.74315
12.25000 -2083.49407 0.94304 -10.67302 585.80014 89.57416 1509.47159
12.35000 -2063.40855 -1.27994 -73.81622 582.54411 89.25628 1524.07082
12.45000 -2037.01910 1.22468 -52.47393 606.45521 88.93473 1524.62000
12.55000 -2050.60360 0.84127 -81.09566 570.09013 84.25806 1501.01631
12.65000 -2022.88024 -0.94020 -38.97147 587.02204 86.29313 1503.91548
12.75000 -2019.05603 -1.74253 -6.01879 582.08682 83.54988 1484.23189
12.85000 -2006.86544 0.20491 -46.19404 579.26356 84.28322 1483.54186
12.95000 -2003.39415 0.09591 -76.70187 570.38363 84.10186 1475.13666
13.05000 -1992.25491 1.22257 -70.29337 572.38246 80.62695 1467.42068
13.15000 -1982.67273 -1.46199 -79.06835 559.58641 81.19257 1463.49397
13.25000 -1974.80246 -1.55553 -35.86302 568.29750 77.12549 1446.57398
13.35000 -1984.27850 3.19684 -53.37631 543.41191 77.51475 1419.98483
13.45000 -1952.39618 -0.28286 -69.62974 565.73982 77.65380 1439.16855
13.55000 -1941.92367 3.83477 -89.44260 562.13670 76.61399 1430.62804
13.65000 -1931.47681 -2.59204 -75.94845 540.89022 74.37654 1431.96806
13.75000 -1932.83783 0.03197 -70.41814 548.22502 74.72291 1409.69136
13.85000 -1928.49294 1.89919 -67.30734 531.82420 75.43694 1397.58486
13.95000 -1905.68140 -1.82449 -54.50252 539.14590 72.36989 1409.34683
14.05000 -1906.35328 1.89767 -70.60200 552.83369 71.30394 1383.46350
14.15000 -1875.99406 -0.36724 -63.65255 546.18167 72.77992 1404.85035
14.25000 -1900.34989 -0.95954 -34.74470 528.78342 70.33688 1354.89598
14.35000 -1854.85627 -1.31352 -41.83514 541.58532 71.10753 1396.75597
14.45000 -1862.44389 -1.99146 -71.24817 537.77825 68.70758 1364.96259
14.55000 -1826.76717 1.93869 -20.77769 541.74759 69.18925 1387.70824
14.65000 -1841.74126 0.43300 -77.62816 530.52482 69.42032 1358.46011
14.75000 -1837.83362 0.90415 -48.42905 523.94817 67.63230 1340.67330
14.85000 -1824.42568 2.06373 -95.07861 523.79844 66.57860 1346.89705
14.95000 -1813.60469 -0.64465 -40.54521 530.09837 66.57572 1339.14980
15.05000 -1793.50205 1.78088 -34.92156 530.54030 64.66752 1346.44760
15.15000 -1805.71665 -1.44091 -5.33531 506.22786 63.87540 1314.17230
15.25000 -1785.95856 0.20406 -62.22548 514.24422 65.13084 1324.01611
15.35000 -1781.72285 -0.40015 -50.97909 509.82712 63.62883 1315.79864
15.45000 -1774.94599 -1.83662 -58.11233 505.85497 62.35836 1305.30080
15.55000 -1796.30816 2.53322 -75.14081 488.02553 61.81955 1266.70111
15.65000 -1755.01762 -0.07962 -36.32729 509.92728 61.53709 1296.80336
15.75000 -1763.55487 1.72249 -44.70015 489.91739 60.52732 1275.18666
15.85000 -1745.58555 -0.19639 -48.99305 498.78594 60.87927 1274.90304
15.95000 -1739.37334 -0.50192 -77.07258 489.06269 60.88596 1272.80701
16.05000 -1732.34907 0.89273 -60.94892 481.41536 59.77072 1267.06789
16.15000 -1716.21462 0.89868 -24.42605 501.19968 57.14040 1260.84280
16.25000 -1706.90550 -0.07899 -59.58428 497.48240 58.15353 1257.84774
16.35000 -1703.02841 -0.39074 -56.78179 491.71042 57.60846 1246.80444
16.45000 -1680.69170 1.35335 -47.53218 491.75410 58.10170 1261.49280
16.55000 -1689.32345 -0.10272 -108.93042 469.70874 57.67134 1243.81619
16.65000 -1671.80989 0.80980 -74.96637 484.42922 58.21789 1243.41487
16.75000 -1657.80571 -0.12463 -63.78055 489.23189 56.03111 1245.27158
16.85000 -1660.01319 1.90221 -47.69455 483.20169 54.74426 1227.59650
16.95000 -1670.90804 -0.68177 -28.12113 455.23869 55.30782 1200.89000
17.05000 -1671.40434 0.24126 -10.30493 458.52768 54.41693 1183.15631
17.15000 -1642.24949 -1.19210 -96.78009 467.34492 56.39975 1207.58821
17.25000 -1620.23651 1.33877 -65.18790 472.18937 53.11702 1220.17116
17.35000 -1623.33169 0.53313 -47.02019 476.12128 53.41626 1195.69692
17.45000 -1618.07073 -0.19615 -87.21069 461.32027 51.75341 1192.82811
17.55000 -1616.05799 -0.20162 -83.83366 458.74896 52.78380 1183.73359
17.65000 -1595.42937 0.01599 -56.03763 464.14403 52.26523 1189.90083
17.75000 -1598.94883 0.18706 -48.51645 456.10544 50.34261 1170.33393
17.85000 -1597.18034 -1.04599 -65.04933 445.93505 52.33214 1161.00957
17.95000 -1578.28455 -0.37771 -91.01188 448.35916 49.55579 1173.86935
18.05000 -1576.32018 -0.67787 -59.64373 448.59478 49.40784 1158.70612
18.15000 -1579.14862 0.82937 -60.59187 437.43223 50.11367 1142.25312
18.25000 -1562.90491 -0.96464 -66.36448 440.59659 47.88551 1146.56807
18.35000 -1558.86585 0.64464 -20.47515 436.15524 49.21136 1134.23621
18.45000 -1548.31164 0.41143 -28.10615 436.54545 47.94654 1135.98645
18.55000 -1539.09161 -0.63225 -67.90961 442.16106 48.46156 1132.84060
18.65000 -1541.60263 0.63401 -34.39230 426.94841 47.81823 1118.60817
18.75000 -1534.40651 -1.02156 -70.86496 436.74841 47.91219 1112.05667
18.85000 -1528.95219 1.17857 -32.32139 431.27222 46.49271 1102.63633
18.95000 -1514.79314 0.28849 -47.70816 438.37709 45.05558 1108.77506
19.05000 -1505.13712 0.79969 -55.52345 432.52548 43.46560 1108.08950
19.15000 -1505.67420 0.06071 -54.61344 425.94304 45.00209 1096.45748
19.25000 -1483.21823 0.54424 -35.00352 425.86414 44.40247 1108.81589
19.35000 -1475.25703 -0.82920 -46.09338 440.15292 44.69399 1102.57753
19.45000 -1473.61519 0.32926 -2.87985 424.83918 44.75717 1092.74752
19.55000 -1477.52349 1.15108 -38.80099 415.11960 44.43529 1081.26273
19.65000 -1436.70711 -0.23230 -33.30456 438.42720 44.74820 1109.67214
19.75000 -1443.53518 -0.60235 -8.14490 429.31792 43.71006 1090.42216
19.85000 -1442.41599 1.15677 -23.30461 413.90100 41.88590 1085.29425
19.95000 -1444.60695 1.15562 -50.33491 409.49111 42.70063 1071.93354
