0.12500 0.00720
0.37500 0.03261
0.62500 0.08349
0.87500 0.13261
1.12500 0.19047
1.37500 0.24347
1.62500 0.27753
1.87500 0.31303
2.12500 0.33721
2.37500 0.35821
2.62500 0.36735
2.87500 0.39539
3.12500 0.41679
3.37500 0.44842
3.62500 0.48750
3.87500 0.51357
4.12500 0.53510
4.37500 0.57793
4.62500 0.60220
4.87500 0.61150
5.12500 0.62252
5.37500 0.61171
5.62500 0.62180
5.87500 0.59869
6.12500 0.59020
6.37500 0.56916
6.62500 0.53537
6.87500 0.50649
7.12500 0.46863
7.37500 0.42098
7.62500 0.39073
7.87500 0.36627
8.12500 0.35554
8.37500 0.36180
8.62500 0.35438
8.87500 0.37030
9.12500 0.36638
9.37500 0.36359
9.62500 0.37957
9.87500 0.35470
10.12500 0.35598
10.37500 0.32758
10.62500 0.31996
10.87500 0.29006
11.12500 0.26419
11.37500 0.24904
11.62500 0.20913
11.87500 0.19506
12.12500 0.16521
12.37500 0.13443
12.62500 0.11752
12.87500 0.11359
13.12500 0.10394
13.37500 0.09643
13.62500 0.09031
13.87500 0.07164
14.12500 0.06009
14.37500 0.06943
14.62500 0.06647
14.87500 0.10605
15.12500 0.12474
15.37500 0.11492
15.62500 0.15661
15.87500 0.16152
16.12500 0.18254
16.37500 0.17866
16.62500 0.17642
16.87500 0.17657
17.12500 0.12177
17.37500 0.14445
17.62500 0.09209
17.87500 0.08112
18.12500 0.07934
18.37500 0.10947
18.62500 0.13613
18.87500 0.13011
19.12500 0.17616
19.37500 0.19493
19.62500 0.22179
19.87500 0.20862
