0.125 -0.001 0.001 0.003
0.375 0.005 -0.002 0.074
0.625 0.002 -0.001 0.385
0.875 0.016 -0.005 0.975
1.125 0.037 0.006 1.834
1.375 0.040 0.000 3.004
1.625 0.065 0.007 4.181
1.875 0.063 -0.033 5.359
2.125 0.057 -0.018 6.619
2.375 0.122 -0.032 8.135
2.625 0.085 -0.042 9.793
2.875 0.127 -0.109 11.453
3.125 0.141 -0.077 13.410
3.375 0.083 -0.113 15.117
3.625 0.061 -0.112 17.142
3.875 0.076 -0.138 18.537
4.125 0.128 -0.086 19.681
4.375 0.118 -0.121 20.899
4.625 0.073 -0.152 21.881
4.875 0.107 -0.147 22.985
5.125 0.092 -0.142 23.795
5.375 0.140 -0.204 24.707
5.625 0.128 -0.162 24.782
5.875 0.124 -0.200 25.061
6.125 0.150 -0.205 25.157
6.375 0.175 -0.202 25.385
6.625 0.210 -0.169 24.842
6.875 0.151 -0.151 24.369
7.125 0.175 -0.146 23.817
7.375 0.223 -0.137 24.144
7.625 0.180 -0.067 23.824
7.875 0.194 -0.103 23.799
8.125 0.176 -0.041 23.623
8.375 0.196 0.007 22.784
8.625 0.095 0.020 22.321
8.875 0.071 0.009 21.349
9.125 0.066 -0.015 20.858
9.375 0.011 -0.014 20.375
9.625 0.007 -0.027 20.468
9.875 0.002 -0.043 20.009
10.125 -0.018 -0.062 19.804
10.375 -0.045 -0.057 18.992
10.625 -0.020 -0.039 18.773
10.875 -0.029 -0.034 17.865
11.125 -0.046 -0.071 17.298
11.375 -0.036 -0.058 16.872
11.625 -0.011 -0.067 15.587
11.875 -0.022 -0.060 14.415
12.125 -0.003 -0.060 13.831
12.375 -0.005 -0.088 12.601
12.625 -0.007 -0.054 11.835
12.875 -0.000 -0.045 11.269
13.125 0.002 -0.056 11.378
13.375 -0.013 -0.046 11.649
13.625 -0.015 -0.028 11.291
13.875 -0.018 -0.046 10.551
14.125 -0.037 -0.035 9.563
14.375 -0.048 -0.045 8.778
14.625 -0.046 -0.051 8.334
14.875 -0.043 -0.081 7.952
