0.05000 1555.39164
0.15000 1888.22216
0.25000 2969.16781
0.35000 3981.01196
0.45000 4377.69077
0.55000 4736.61356
0.65000 4946.62196
0.75000 5230.80004
0.85000 5442.84717
0.95000 5363.64794
1.05000 5333.49207
1.15000 5353.21908
1.25000 5276.12225
1.35000 5272.48356
1.45000 5087.39915
1.55000 4984.85434
1.65000 4876.45358
1.75000 4713.90528
1.85000 4596.96937
1.95000 4548.30467
2.05000 4436.25350
2.15000 4274.87854
2.25000 4209.03539
2.35000 4050.05967
2.45000 3938.77865
2.55000 3910.35287
2.65000 3797.09221
2.75000 3656.41596
2.85000 3574.74936
2.95000 3489.09987
3.05000 3422.27949
3.15000 3359.88674
3.25000 3226.06725
3.35000 3224.06971
3.45000 3125.03359
3.55000 3061.17328
3.65000 2969.42628
3.75000 2931.51446
3.85000 2818.72197
3.95000 2778.08967
4.05000 2721.74011
4.15000 2631.59581
4.25000 2577.85605
4.35000 2529.49398
4.45000 2450.63678
4.55000 2412.86446
4.65000 2335.54862
4.75000 2295.92060
4.85000 2250.69956
4.95000 2144.86522
5.05000 2133.02700
5.15000 2096.77887
5.25000 2027.67641
5.35000 1982.66201
5.45000 1911.59442
5.55000 1884.55046
5.65000 1857.00090
5.75000 1804.08909
5.85000 1726.44999
5.95000 1690.63251
6.05000 1683.26835
6.15000 1637.17238
6.25000 1615.14646
6.35000 1561.82680
6.45000 1523.67916
6.55000 1500.66435
6.65000 1492.62641
6.75000 1409.74093
6.85000 1407.62407
6.95000 1373.96580
7.05000 1327.00021
7.15000 1298.09948
7.25000 1280.29462
7.35000 1254.80123
7.45000 1234.26618
7.55000 1201.32765
7.65000 1148.55666
7.75000 1149.10124
7.85000 1121.13776
7.95000 1088.67988
8.05000 1075.47536
8.15000 1037.25986
8.25000 1021.64832
8.35000 1008.93485
8.45000 972.78105
8.55000 949.89781
8.65000 938.47617
8.75000 920.85135
8.85000 883.86971
8.95000 860.05723
9.05000 862.79980
9.15000 834.56844
9.25000 835.34512
9.35000 801.23183
9.45000 773.51049
9.55000 762.99383
9.65000 756.90923
9.75000 715.70179
9.85000 725.11843
9.95000 706.10265
10.05000 691.21038
10.15000 664.68732
10.25000 658.17420
10.35000 633.37218
10.45000 633.84154
10.55000 612.08557
10.65000 612.43795
10.75000 596.24297
10.85000 581.92543
10.95000 574.57924
11.05000 555.12323
11.15000 549.56516
11.25000 534.66457
11.35000 530.73143
11.45000 523.59733
11.55000 512.49974
11.65000 499.54778
11.75000 491.43523
11.85000 485.32550
11.95000 477.63770
12.05000 462.85049
12.15000 459.95461
12.25000 452.46090
12.35000 443.88620
12.45000 430.19405
12.55000 429.40507
12.65000 419.84373
12.75000 408.38379
12.85000 411.16610
12.95000 401.27029
13.05000 393.36470
13.15000 369.72775
13.25000 368.08700
13.35000 367.45319
13.45000 353.01465
13.55000 350.86424
13.65000 344.18422
13.75000 342.03223
13.85000 341.69110
13.95000 325.01238
14.05000 326.70479
14.15000 317.66256
14.25000 319.16550
14.35000 308.25310
14.45000 308.91178
14.55000 301.41017
14.65000 290.92262
14.75000 283.90645
14.85000 284.62696
14.95000 276.11364
15.05000 271.91757
15.15000 268.06724
15.25000 257.31302
15.35000 251.57216
15.45000 248.92749
15.55000 250.38035
15.65000 244.16736
15.75000 235.01988
15.85000 223.40288
15.95000 235.06851
16.05000 224.88371
16.15000 222.40393
16.25000 220.64969
16.35000 209.25342
16.45000 208.59701
16.55000 202.65657
16.65000 207.73381
16.75000 199.43856
16.85000 199.27308
16.95000 186.95726
17.05000 186.74628
17.15000 184.28126
17.25000 187.49885
17.35000 182.25810
17.45000 172.71855
17.55000 171.25479
17.65000 172.51329
17.75000 168.43645
17.85000 159.07978
17.95000 160.86358
18.05000 162.12067
18.15000 156.16501
18.25000 154.02372
18.35000 147.48599
18.45000 154.64416
18.55000 146.10119
18.65000 146.48766
18.75000 146.36219
18.85000 144.79281
18.95000 136.38304
19.05000 136.76361
19.15000 134.79127
19.25000 137.17444
19.35000 128.08414
19.45000 126.10365
19.55000 122.79530
19.65000 125.20669
19.75000 120.78032
19.85000 118.39502
19.95000 117.20676
