0.05000 -19430.56142 393.09025 14270.23349 27104.28092 16205.73474 26481.49272
0.15000 -28942.33200 65.52979 6548.70605 15437.89495 12672.41804 29622.66527
0.25000 -29668.02495 -22.23083 2276.08338 12327.96624 10226.10342 29292.13932
0.35000 -28747.81007 -136.91676 -216.89783 10178.68792 7921.15462 26800.49185
0.45000 -26626.47109 115.45449 -328.28516 8532.80462 7212.74790 24140.03986
0.55000 -24738.27520 32.86850 -852.76798 8283.54729 7138.44663 21765.79076
0.65000 -22842.78750 102.16725 -572.10651 6817.01486 6187.64601 19568.88663
0.75000 -21329.52455 206.78220 -647.34675 6293.14959 5915.30303 17797.34496
0.85000 -20175.23719 116.51550 -745.97059 5449.09223 5377.46818 16259.57038
0.95000 -19172.43651 45.38278 -569.60123 6144.64092 5151.44148 14992.86533
1.05000 -18314.65636 204.98710 -282.14471 4605.39811 4626.51940 13546.39375
1.15000 -17440.16585 61.28060 -646.35120 4101.76869 4219.46218 12602.33045
1.25000 -16542.26144 65.93954 -347.73117 3820.33863 4142.81681 11759.89741
1.35000 -15890.92670 115.32396 -196.05832 3763.91814 3747.04059 10961.65656
1.45000 -15194.50274 74.86575 -395.29189 3047.92035 3390.46098 10205.04344
1.55000 -14550.50710 3.08565 -122.03128 2991.34164 3355.28623 9702.79075
1.65000 -13911.59107 41.44199 -109.05347 2725.17200 3027.69284 9072.62019
1.75000 -13393.20940 57.76547 -340.12410 3244.64298 3038.59604 8547.29084
1.85000 -12825.48569 10.76932 -292.44276 2429.46965 2820.52096 8128.82774
1.95000 -12334.40071 65.44000 -68.02375 2142.88346 2741.66791 7776.47363
2.05000 -11834.79559 80.82046 -70.71770 2104.74543 2376.16824 7366.92670
2.15000 -11445.57154 60.40445 -200.39269 1843.62678 2260.12642 6909.57409
2.25000 -11117.97184 68.90250 -155.97983 1741.87776 2249.25061 6575.09801
2.35000 -10800.28717 45.58659 -122.27781 1576.08464 2654.00526 6271.36740
2.45000 -10424.29417 11.75335 -175.44775 1560.44512 2197.65140 6233.21019
2.55000 -10155.85370 11.76044 -147.38140 1773.32954 2492.15415 5698.24218
2.65000 -9878.27368 56.24023 28.84525 1416.95424 1893.15601 5497.10356
2.75000 -9679.74484 29.00102 78.19687 1469.48863 1806.31741 5247.06348
2.85000 -9396.47577 -1.54619 -131.77354 1158.79589 1777.26014 4967.95146
2.95000 -9223.15256 -56.34141 -79.96514 1369.78817 1776.91725 4654.97801
3.05000 -9000.71658 -25.03035 48.64777 1149.15418 1712.38167 4516.44693
3.15000 -8856.05552 -46.70348 112.94249 1015.49701 1531.05043 4186.47463
3.25000 -8687.12160 -20.72493 174.16125 1115.96474 2935.38671 4118.72069
3.35000 -8518.11597 -38.55439 87.23744 875.11659 1366.81032 3898.86975
3.45000 -8387.60222 -19.20945 -16.78769 901.15384 1335.65483 3715.76739
3.55000 -8239.89734 -34.91936 65.94373 837.79002 1243.73184 3648.83481
3.65000 -8145.02943 -34.78447 156.18494 941.25215 1214.46978 3502.61985
3.75000 -8021.58701 -27.82093 162.99372 1215.55269 1218.57847 3432.67005
3.85000 -7926.67385 6.16633 134.90719 774.95857 1057.69539 3181.37546
3.95000 -7824.61539 -3.90560 163.27052 905.18967 1322.21075 3236.94105
4.05000 -7731.01622 -4.83752 143.75624 803.40165 1153.94047 3070.39717
4.15000 -7652.15051 -4.00685 116.86382 722.12551 950.07639 3210.45816
4.25000 -7567.30279 5.36818 102.57204 761.92488 909.76155 2873.66502
4.35000 -7524.62838 -7.83144 101.89777 990.77058 856.61957 3090.41812
4.45000 -7411.14350 29.41458 109.50163 2788.91057 2811.15042 2897.43241
4.55000 -7402.64248 -8.34403 47.69542 842.21695 974.65096 3259.61881
4.65000 -7324.05688 6.41527 4.02210 699.74142 748.87745 2564.46705
4.75000 -7282.81811 6.08453 101.60927 740.17335 767.25117 2472.05930
4.85000 -7231.54167 10.49907 30.43681 1244.17247 798.30768 2639.75828
4.95000 -7160.73740 11.12469 47.48739 983.44737 760.61678 2388.24912
5.05000 -7093.20584 -3.34180 36.16558 644.31320 857.39212 2288.64354
5.15000 -7045.28282 8.94003 -4.69338 683.84968 592.88667 2248.16268
5.25000 -7000.14874 11.20823 14.70363 760.14777 559.24706 2203.70923
5.35000 -6956.95435 23.66841 98.69118 735.12416 573.49675 2183.42186
5.45000 -6888.06162 12.30589 43.08289 777.07003 581.38694 2071.39431
5.55000 -6804.96105 12.15696 15.01364 557.59509 451.90508 1975.90230
5.65000 -6727.68982 19.02888 11.48592 569.97260 570.84206 1952.67315
5.75000 -6675.54517 15.49298 84.29530 943.40662 847.67086 1896.93067
5.85000 -6598.73407 4.35712 56.63063 786.85854 1133.07544 1872.89527
5.95000 -6554.88436 13.79707 2.94399 874.23023 483.27163 1777.97026
6.05000 -6491.87674 7.33066 64.00651 508.07381 467.48362 1945.23774
6.15000 -6429.09878 9.13058 58.61779 486.35315 390.61179 1704.93421
6.25000 -6379.12014 10.36681 18.10728 471.01724 450.56005 1641.33333
6.35000 -6332.09572 10.66450 34.56653 649.24352 410.60699 1693.15148
6.45000 -6260.10531 1.13126 22.06182 692.08819 430.95191 1613.11290
6.55000 -6228.21238 -0.22150 32.59708 621.83081 735.44219 1569.99986
6.65000 -6172.36405 9.81757 25.93309 448.10060 381.38417 1517.45871
6.75000 -6110.41647 13.87273 42.24586 776.38891 852.60604 1653.82079
6.85000 -6060.67085 4.76389 -5.76394 474.35410 441.40041 1475.80338
6.95000 -5998.29494 4.67875 25.99135 614.64882 443.42428 1471.15474
7.05000 -5957.34936 1.19306 39.02583 350.05782 350.63873 1353.58506
7.15000 -5894.50998 1.28063 10.95847 399.69083 290.15940 1305.00927
7.25000 -5836.04723 3.22456 5.22116 461.46387 726.82312 1435.26488
7.35000 -5782.71913 2.79735 62.51123 424.08134 276.23098 1241.09128
7.45000 -5712.88103 4.69440 27.14531 309.48606 350.63061 1221.64280
7.55000 -5655.18543 13.18297 5.80596 367.11861 381.97373 1189.72552
7.65000 -5598.68961 4.73196 28.31530 524.61954 403.80990 1189.71045
7.75000 -5550.70458 7.70406 36.21486 279.13329 244.13819 1111.86181
7.85000 -5496.15547 8.25970 18.53069 286.82657 270.34692 1111.60165
7.95000 -5441.17655 -0.62231 14.51746 357.51156 408.49543 1315.83601
8.05000 -5384.66544 -1.63897 13.94485 571.41192 553.52701 1252.88514
8.15000 -5307.78310 -3.71982 -0.06857 557.20596 692.52299 1094.60167
8.25000 -5268.41859 6.62839 14.72103 365.62125 278.78035 1002.26810
8.35000 -5213.29230 0.86620 22.48468 358.29231 428.15530 983.62734
8.45000 -5159.84305 17.45887 12.79817 321.47962 327.11179 954.30397
8.55000 -5110.67534 9.22788 33.02568 278.60719 217.35564 933.25271
8.65000 -5063.43729 7.02177 36.68328 296.33327 216.46092 918.40903
8.75000 -5015.90031 3.67172 58.41101 256.95868 188.80446 892.68001
8.85000 -4962.98810 6.69405 36.21748 681.42689 291.05984 1024.47227
8.95000 -4922.27866 4.84932 28.38211 292.88408 404.20664 874.87191
9.05000 -4871.62649 3.29006 51.98704 288.15924 267.00265 847.93398
9.15000 -4831.12621 3.52844 23.89488 341.34435 331.63157 854.15204
9.25000 -4793.14979 4.03771 69.92182 362.42250 280.05087 819.55299
9.35000 -4756.60632 4.06357 40.21358 246.80757 159.02026 789.02208
9.45000 -4716.32344 1.37457 50.85508 265.76460 175.24761 787.33884
9.55000 -4683.16230 0.23307 41.43428 339.44110 281.35821 848.77060
9.65000 -4631.82650 -3.80568 61.73164 842.69602 373.25501 986.87268
9.75000 -4602.54115 6.53540 32.68065 388.89334 309.02864 781.74123
9.85000 -4567.81468 12.71373 33.39815 499.19776 633.88173 795.14795
9.95000 -4547.04103 11.42798 54.53229 329.18457 300.16852 706.80534
10.05000 -4507.80263 2.34467 33.15537 239.49429 177.20693 753.22027
10.15000 -4482.27337 3.43526 13.45452 230.00651 236.32798 727.96572
10.25000 -4437.07079 7.47997 53.29924 195.77350 136.38222 675.58479
10.35000 -4414.49932 7.36516 48.18674 173.15616 149.24928 659.68282
10.45000 -4378.37300 3.36098 51.37576 169.37573 135.96142 635.01990
10.55000 -4338.77657 1.11962 44.05008 274.13376 227.50361 631.02177
10.65000 -4301.44838 1.82507 44.07703 210.65316 176.58909 655.89271
10.75000 -4275.92285 1.37806 48.40862 185.67030 110.84792 593.57360
10.85000 -4243.15804 5.64854 50.96737 174.94296 200.63875 592.31172
10.95000 -4215.92379 1.56753 38.90913 166.08410 153.01140 588.49918
11.05000 -4180.81494 7.37123 66.68745 169.42898 132.43781 563.42060
11.15000 -4153.28224 4.70081 35.76559 165.31257 391.06191 569.67154
11.25000 -4116.21105 -6.25544 21.74494 239.35871 411.87820 548.50768
11.35000 -4079.19900 1.47839 44.71146 187.97279 159.74119 527.77213
11.45000 -4056.89773 7.13837 37.89186 128.52288 114.67682 499.70579
11.55000 -4028.22355 0.44137 35.84798 191.80453 391.78973 510.29979
11.65000 -3995.85648 2.99679 45.68924 129.80542 97.00303 494.57951
11.75000 -3962.82871 6.65951 31.38192 121.55928 118.54051 466.67596
11.85000 -3940.02268 4.01588 37.40735 185.11783 165.34389 461.83309
11.95000 -3906.32629 5.30600 64.33531 165.43538 172.49967 441.16373
12.05000 -3877.06975 4.16652 41.46317 109.05144 93.76449 452.43914
12.15000 -3845.15496 7.90107 52.17178 330.92323 687.31116 495.04629
12.25000 -3806.34753 10.23365 39.90616 138.81904 352.62544 434.83354
12.35000 -3782.60266 2.03599 44.77477 218.45047 278.38146 470.83328
12.45000 -3750.30018 3.36764 30.45713 105.16521 90.69610 390.66340
12.55000 -3723.44389 1.49713 25.37180 142.53636 96.59360 393.10144
12.65000 -3692.24079 -4.73326 43.02487 105.60638 126.63825 377.38952
12.75000 -3657.57110 5.44641 28.89869 125.27998 100.15840 403.96880
12.85000 -3628.64086 -0.50720 21.63681 94.53364 227.09235 401.63539
12.95000 -3605.82433 4.84186 35.23212 105.66902 87.80853 358.55729
13.05000 -3574.76701 3.11682 35.03148 92.86242 73.67395 346.94637
13.15000 -3549.90907 -3.75089 40.06134 173.37761 145.72443 402.43602
13.25000 -3520.41810 4.83465 15.29027 105.15388 71.52905 336.75747
13.35000 -3494.75058 1.99621 11.97032 107.78985 80.50411 327.64016
13.45000 -3471.81697 2.62547 27.42127 87.97964 75.80527 325.53989
13.55000 -3441.19383 0.70795 24.99692 153.21224 128.06669 363.06324
13.65000 -3416.46869 2.94612 16.14458 79.92350 80.93060 304.67378
13.75000 -3389.68757 3.10546 12.42360 106.44808 107.41092 315.12024
13.85000 -3371.14536 3.52890 11.93207 86.65323 91.18679 289.13401
13.95000 -3344.64467 2.66590 17.87497 68.93429 81.43364 303.82946
14.05000 -3316.51222 1.44891 25.77943 135.86282 118.20364 301.34952
14.15000 -3295.43872 0.07624 27.67064 105.50761 104.18931 293.46629
14.25000 -3271.24410 0.80787 18.62795 86.81640 93.44055 276.70792
14.35000 -3246.08886 0.74445 19.85968 72.39046 78.60791 277.97147
14.45000 -3223.16156 -1.00240 3.46429 84.84576 90.83344 264.54666
14.55000 -3194.63007 0.45502 29.29523 109.93260 74.88198 260.61539
14.65000 -3171.57151 1.70363 15.89386 127.36156 172.91053 266.32763
14.75000 -3155.86348 1.39207 30.58789 86.06481 74.64546 242.78074
14.85000 -3127.70904 -1.54861 25.75862 91.04144 106.98662 241.66343
14.95000 -3110.18306 -0.85322 34.89343 156.66767 90.81049 250.88079
15.05000 -3081.58192 -0.49120 31.65927 71.55149 75.50444 232.95152
15.15000 -3059.94476 3.92850 23.76104 60.91070 76.59788 236.46476
15.25000 -3032.83992 2.81536 21.37118 78.26158 73.21600 232.00287
15.35000 -3015.28794 -0.63328 30.55327 90.97494 106.70836 214.28657
15.45000 -2992.19018 -1.65511 37.82685 56.76415 53.76906 216.91123
15.55000 -2971.25923 -1.56011 28.17145 55.04548 45.83114 210.04165
15.65000 -2953.84090 1.10213 25.55026 230.13744 98.75135 364.27836
15.75000 -2927.23684 3.50185 9.67573 65.88311 87.79904 746.42233
15.85000 -2908.17650 0.27961 22.06313 58.89349 54.97846 208.08529
15.95000 -2883.88734 1.36921 13.78621 67.94611 74.80437 201.25132
16.05000 -2867.93604 -0.71120 26.49053 119.86586 92.70975 243.46089
16.15000 -2845.42671 1.28900 22.43998 99.33685 56.61743 213.36569
16.25000 -2824.13853 -0.11825 30.33275 90.78049 51.58633 206.06466
16.35000 -2810.10200 1.46535 21.46525 64.41842 56.07840 197.98176
16.45000 -2790.71054 0.82271 25.55937 54.93893 73.13374 193.83167
16.55000 -2778.73577 -5.45622 15.77042 61.20464 72.66897 186.91966
16.65000 -2758.32577 2.94502 12.01010 236.91735 288.85636 519.77987
16.75000 -2730.59335 -7.54119 22.16209 293.27747 194.86353 182.88522
16.85000 -2723.58999 0.38961 23.43869 49.36984 60.55054 175.20180
16.95000 -2708.05423 0.62664 20.17963 53.82242 46.87196 173.29977
17.05000 -2682.85524 3.14365 9.14302 77.84080 58.20997 177.87774
17.15000 -2675.87665 -0.78596 15.53939 80.35448 47.70844 168.53868
17.25000 -2653.68689 -2.20559 19.64553 80.44275 52.58820 169.16099
17.35000 -2637.77061 0.01137 10.04591 52.78006 44.89240 171.76803
17.45000 -2622.55257 0.42706 24.38942 47.47999 42.79895 164.78032
17.55000 -2604.35531 2.14963 19.54462 51.01401 44.18015 166.08612
17.65000 -2587.00237 -1.79304 17.32890 53.54328 47.61368 166.73480
17.75000 -2572.16720 -0.50609 8.69120 65.43191 68.44973 158.04985
17.85000 -2556.58534 3.26253 16.92326 74.29120 51.66267 168.19268
17.95000 -2538.08911 9.40740 9.08809 151.25814 275.37268 171.73929
18.05000 -2527.89472 0.06334 16.47661 59.77828 48.54230 155.45860
18.15000 -2514.44874 -4.31162 8.90438 153.72288 79.70834 167.77417
18.25000 -2497.63448 -1.49576 28.41734 47.50974 35.11140 141.90270
18.35000 -2481.74206 -1.24906 30.34527 51.36340 46.39776 141.24363
18.45000 -2469.70505 -0.44727 9.51657 45.16762 41.12757 147.44804
18.55000 -2453.05428 -1.00877 17.74101 45.12075 42.17553 134.86658
18.65000 -2435.67199 -1.57374 24.17685 48.16796 64.79685 143.36636
18.75000 -2428.55770 1.96247 21.32116 46.47304 48.97170 138.96692
18.85000 -2410.81467 1.37767 17.71290 64.08229 49.37995 137.29590
18.95000 -2481.70626 -33.42860 25.74037 1617.04852 545.26668 276.55316
19.05000 -2390.97638 -5.81953 7.43996 122.73765 47.95921 206.46937
19.15000 -2368.20332 -1.02408 30.65788 55.41561 45.86155 135.36238
19.25000 -2350.02144 -1.88912 11.25168 45.56927 41.73734 126.79981
19.35000 -2334.60584 3.51073 22.10037 72.76647 55.18176 120.34355
19.45000 -2324.82398 -3.33531 14.46787 41.85701 53.37334 121.20983
19.55000 -2307.64284 0.68010 20.30975 44.87982 35.61163 123.68070
19.65000 -2302.85350 -2.00386 10.78652 49.02648 33.81321 115.27245
19.75000 -2282.59666 3.59077 25.37971 89.19928 64.25225 127.78657
19.85000 -2271.17266 2.80065 29.62380 38.01686 50.70896 119.94927
19.95000 -2259.57733 0.35774 21.19976 60.12481 38.41638 111.50274
