0.120000 -0.203920
0.380000 -2.885880
0.620000 3.058860
0.880000 2.908800
1.120000 2.938400
1.380000 2.955890
1.620000 2.918380
1.880000 2.899390
2.120000 2.906240
2.380000 2.910330
2.620000 2.872250
2.880000 2.886300
3.120000 2.873990
3.380000 2.878250
3.620000 2.875720
3.880000 2.903840
4.120000 2.907260
4.380000 2.905880
4.620000 2.920590
4.880000 2.930510
5.120000 2.934170
5.380000 2.978070
5.620000 2.981930
5.880000 3.001840
6.120000 3.039690
6.380000 3.056170
6.620000 3.043570
6.880000 3.086620
7.120000 3.006820
7.380000 3.035960
7.620000 3.018390
7.880000 2.954480
8.120000 2.969930
8.380000 2.964450
8.620000 2.992520
8.880000 2.953180
9.120000 2.878460
9.380000 2.804750
9.620000 2.748880
9.880000 2.699730
10.120000 2.564610
10.380000 2.559110
10.620000 2.449460
10.880000 2.390870
11.120000 2.219420
11.380000 1.910410
11.620000 1.912350
11.880000 1.765140
12.120000 1.903670
12.380000 1.273250
12.620000 1.463340
12.880000 1.423220
13.120000 1.652150
13.380000 1.342020
13.620000 1.792760
13.880000 2.746290
14.120000 2.529120
14.380000 2.544600
14.620000 3.088390
14.880000 2.332000
