0.125 -0.000 -0.000 0.001
0.375 0.000 -0.001 0.019
0.625 -0.003 -0.006 0.123
0.875 0.006 0.007 0.376
1.125 0.023 0.003 0.839
1.375 -0.009 -0.026 1.519
1.625 0.020 -0.022 2.334
1.875 0.029 -0.005 3.332
2.125 0.021 -0.063 4.480
2.375 0.014 -0.027 5.672
2.625 0.024 -0.041 6.941
2.875 0.009 -0.059 7.967
3.125 -0.004 -0.046 9.065
3.375 0.019 -0.016 10.183
3.625 0.019 -0.057 11.125
3.875 0.034 -0.054 12.643
4.125 -0.022 -0.051 13.974
4.375 -0.019 -0.061 15.553
4.625 -0.001 -0.032 17.593
4.875 0.043 -0.058 19.824
5.125 0.045 -0.038 21.791
5.375 0.037 -0.061 23.396
5.625 0.084 -0.055 23.908
5.875 0.057 0.006 23.975
6.125 0.047 -0.027 23.666
6.375 -0.012 0.049 24.003
6.625 0.064 0.033 24.462
6.875 0.072 0.015 24.548
7.125 0.030 -0.041 26.006
7.375 0.002 0.047 27.131
7.625 0.053 0.058 27.719
7.875 -0.005 -0.035 28.833
8.125 0.004 0.048 28.338
8.375 -0.016 0.037 28.382
8.625 -0.002 0.044 27.777
8.875 -0.064 0.033 26.470
9.125 -0.001 0.066 25.599
9.375 -0.015 0.041 24.368
9.625 -0.018 0.027 23.956
9.875 -0.024 -0.011 23.099
10.125 -0.008 0.050 23.551
10.375 -0.049 0.027 23.411
10.625 -0.074 0.043 23.237
10.875 -0.036 -0.017 22.798
11.125 -0.024 0.018 22.731
11.375 -0.035 0.012 23.236
11.625 0.019 0.048 23.170
11.875 -0.041 0.009 22.622
12.125 -0.004 -0.014 22.163
12.375 -0.006 0.028 22.212
12.625 -0.037 -0.023 22.007
12.875 0.010 -0.021 21.487
13.125 0.005 0.006 21.303
13.375 -0.033 0.015 20.517
13.625 0.013 0.014 20.526
13.875 0.001 -0.006 20.070
14.125 -0.010 -0.014 19.030
14.375 0.019 -0.022 18.518
14.625 -0.007 -0.031 17.963
14.875 0.002 0.021 17.204
