0.120000 -2.606470
0.380000 -2.240050
0.620000 -1.827270
0.880000 -1.901740
1.120000 -1.887120
1.380000 -1.870510
1.620000 -1.838670
1.880000 -1.831730
2.120000 -1.847220
2.380000 -1.774280
2.620000 -1.766330
2.880000 -1.745180
3.120000 -1.734200
3.380000 -1.705160
3.620000 -1.732570
3.880000 -1.657520
4.120000 -1.621410
4.380000 -1.740510
4.620000 -1.667260
4.880000 -1.725040
5.120000 -1.829260
5.380000 -1.933650
5.620000 -1.869430
5.880000 -2.000800
6.120000 -1.864630
6.380000 -2.544830
6.620000 -2.487020
6.880000 3.095550
7.120000 -2.815740
7.380000 -2.589350
7.620000 -2.764590
7.880000 -3.042430
8.120000 -2.994900
8.380000 3.018370
8.620000 -3.106120
8.880000 2.864350
9.120000 2.749560
9.380000 2.903430
9.620000 2.479630
9.880000 2.523300
10.120000 2.039610
10.380000 2.217940
10.620000 2.213060
10.880000 1.335470
11.120000 1.292970
11.380000 -1.235270
11.620000 -0.732630
11.880000 0.823240
12.120000 1.176220
12.380000 -0.060920
12.620000 0.920780
12.880000 1.092640
13.120000 1.473710
13.380000 1.081500
13.620000 0.437490
13.880000 -0.074140
14.120000 0.400860
14.380000 2.053630
14.620000 2.505610
14.880000 1.660360
