0.05000 -1002.43388 -16.31931 744.41236 1168.20988 893.48285 1760.89926
0.15000 -2650.99958 -32.95883 980.06820 1084.46534 798.21044 2849.94151
0.25000 -3521.64424 103.53275 565.76382 1197.45036 657.40253 3738.32727
0.35000 -3844.72445 78.48311 795.82201 1101.38540 537.21449 4501.35596
0.45000 -4167.51342 91.91153 499.76308 1176.83747 506.82154 5270.86698
0.55000 -4538.44669 72.09134 200.45865 1250.55653 477.28325 5747.88819
0.65000 -4905.13105 78.10812 261.75869 1272.90190 420.95085 5968.84900
0.75000 -5134.95639 84.21156 352.76148 1278.39036 382.29385 6130.74534
0.85000 -5233.57517 86.54739 18.85368 1277.32391 352.15482 6258.43552
0.95000 -5462.68283 82.47368 -75.61080 1234.64292 352.80792 6188.77723
1.05000 -5658.35095 86.45080 -78.01883 1279.90137 335.62866 6273.67754
1.15000 -5852.93873 94.73699 28.47035 1246.52003 314.95133 6268.17061
1.25000 -6018.47292 79.38887 -86.49023 1208.16267 302.37405 6159.56820
1.35000 -6186.14624 86.50974 -140.12366 1181.90776 307.59672 6023.26463
1.45000 -6334.75314 92.58304 -219.24897 1129.94655 294.59453 5935.71345
1.55000 -6492.40383 86.61412 -97.23884 1134.82854 290.41856 5823.51641
1.65000 -6637.86147 84.23066 -118.24749 1109.53644 283.31157 5700.99555
1.75000 -6756.09261 95.55453 -16.12337 1032.56342 278.34792 5572.03098
1.85000 -6880.70570 96.85756 -34.46786 990.11319 273.85250 5386.65277
1.95000 -6923.36228 90.16893 -69.83089 1025.89240 259.86285 5347.89805
2.05000 -6973.69233 90.28522 -44.91549 953.53023 244.82287 5179.20393
2.15000 -7025.35131 89.71912 -87.54297 892.44816 232.50087 5005.50630
2.25000 -7086.60196 89.01734 -105.68427 860.82540 227.04478 4875.86732
2.35000 -7139.00981 86.03961 16.32298 790.23095 224.62946 4742.25693
2.45000 -7142.92297 87.73542 -12.68299 819.36600 221.98371 4664.27227
2.55000 -7184.88424 88.60811 -73.55406 784.29310 216.78263 4559.84657
2.65000 -7214.32445 82.32134 -69.06033 742.08667 215.14789 4407.54068
2.75000 -7237.81175 85.63218 -63.29278 720.25832 210.99669 4255.65511
2.85000 -7237.38271 85.68956 -90.69072 718.74144 209.09194 4215.47848
2.95000 -7273.09830 83.14271 -63.31801 643.09496 203.51245 4007.40282
3.05000 -7256.00894 79.66428 -120.94042 656.48093 199.09708 3947.32826
3.15000 -7256.30267 78.83387 -8.87269 613.52126 194.62807 3841.54640
3.25000 -7240.42798 78.83835 -20.67813 587.53527 192.40418 3736.18687
3.35000 -7217.11523 74.67452 -38.44802 594.05366 189.22450 3641.16591
3.45000 -7205.18181 73.95135 -26.75252 559.08746 181.77595 3558.49059
3.55000 -7198.63648 70.18084 -49.31760 519.40379 180.17217 3442.70520
3.65000 -7176.00673 75.71676 -43.81775 496.17010 179.98850 3358.29267
3.75000 -7158.63767 68.82866 24.87651 506.23777 170.13179 3274.73958
3.85000 -7124.49229 70.65793 -14.13060 490.54208 165.57654 3210.99248
3.95000 -7089.51989 65.04845 -49.85491 476.65654 157.07435 3124.68852
4.05000 -7049.41427 66.36104 20.41182 450.96584 153.39458 3030.85776
4.15000 -6999.35506 64.03919 -4.35644 440.98313 150.63794 2956.98777
4.25000 -6943.55361 65.23283 -14.54932 426.63113 147.03889 2908.18299
4.35000 -6907.09186 62.88852 -42.48615 426.65998 144.14828 2797.42947
4.45000 -6872.21209 64.94202 -6.94466 413.70960 136.58930 2744.62872
4.55000 -6829.86389 62.46515 -53.27557 391.69030 138.63669 2662.43919
4.65000 -6778.11946 58.83185 -19.28343 374.80482 132.44763 2599.92440
4.75000 -6740.59630 59.24699 -7.30397 366.46671 133.60806 2534.74983
4.85000 -6696.65064 59.24692 -1.60157 355.62938 126.16307 2477.49399
4.95000 -6658.51887 56.12545 -19.68321 349.72354 124.98299 2426.77520
5.05000 -6611.35720 56.09494 2.57575 325.42832 123.19389 2366.56327
5.15000 -6589.25083 53.89041 -44.11595 323.36788 123.62056 2265.24192
5.25000 -6535.43018 50.82126 38.07192 311.54981 121.54457 2262.21966
5.35000 -6499.84638 54.86583 13.87319 301.78185 124.58952 2182.05510
5.45000 -6461.41011 52.38006 44.60730 308.57666 123.81271 2138.07053
5.55000 -6421.65747 49.18299 20.86497 281.60019 117.65697 2099.97486
5.65000 -6379.68157 49.30888 46.16328 279.96659 113.78085 2035.10974
5.75000 -6346.49838 47.07780 51.17240 271.57452 112.92334 1974.30272
5.85000 -6293.79504 46.90570 30.16226 280.90058 109.22549 1946.88793
5.95000 -6250.61606 46.77003 -17.37650 270.12857 107.50697 1892.41930
6.05000 -6208.89936 44.99388 52.47849 256.48406 105.48917 1836.18832
6.15000 -6164.65023 44.76556 47.82753 259.62652 106.06733 1809.84214
6.25000 -6105.90056 43.89489 4.70570 277.37500 104.94343 1794.32686
6.35000 -6071.82375 42.21614 24.85829 252.96250 108.12927 1728.87544
6.45000 -6040.01021 40.91361 27.92497 233.27006 106.97614 1671.41377
6.55000 -5993.45483 40.27425 26.56074 234.02064 106.56911 1641.77801
6.65000 -5941.91682 41.41603 49.14328 230.75502 103.27910 1618.67168
6.75000 -5888.38550 40.57625 1.03741 215.10890 101.79080 1559.48151
6.85000 -5828.05558 35.87882 53.93476 207.71019 100.25840 1551.74158
6.95000 -5777.27894 38.42752 12.84244 201.44879 98.81887 1518.29633
7.05000 -5727.36419 39.60187 43.49415 195.19612 97.54999 1467.68792
7.15000 -5676.04878 36.78814 29.33067 184.77393 96.74718 1445.25547
7.25000 -5632.41574 37.09953 34.47613 185.57357 94.61704 1398.56354
7.35000 -5593.37897 37.34680 11.53416 181.64221 95.74211 1376.74094
7.45000 -5550.50312 36.04519 28.94444 184.76998 93.83666 1353.96586
7.55000 -5505.89086 31.39842 24.57702 188.26048 94.81231 1329.54811
7.65000 -5468.19129 36.60773 23.99059 178.51647 96.85476 1300.41509
7.75000 -5435.30248 29.00439 42.37004 154.36781 91.54884 1237.04891
7.85000 -5389.21045 32.04286 49.86465 163.32309 91.25276 1222.42692
7.95000 -5345.39377 33.31414 13.05055 170.11985 90.47487 1207.66034
8.05000 -5311.72107 32.64309 25.33831 158.01046 90.08563 1162.28632
8.15000 -5274.88313 31.06212 28.04405 154.83159 90.17468 1151.52861
8.25000 -5240.64806 31.30331 17.86189 160.13927 88.50845 1129.43150
8.35000 -5200.32902 32.10859 55.04347 148.77289 86.35068 1102.69968
8.45000 -5165.53391 29.32115 32.52295 144.90191 84.89981 1066.48265
8.55000 -5127.73042 30.50967 24.65108 161.06041 84.30849 1057.71857
8.65000 -5091.38530 29.78927 17.25818 156.96314 82.71450 1032.03463
8.75000 -5050.27665 27.62077 45.83030 142.91146 81.21146 1010.87330
8.85000 -5009.88908 27.65628 42.24598 133.86253 78.97223 983.38103
8.95000 -4964.43292 28.16919 24.13285 131.46549 77.48841 972.13862
9.05000 -4936.50364 26.97315 43.36463 127.91380 79.72299 930.74114
9.15000 -4892.65975 27.50296 33.18455 133.66928 78.39548 931.72486
9.25000 -4845.60134 26.77184 23.53066 126.62969 75.60098 907.46215
9.35000 -4804.80262 24.59465 25.89357 125.39976 72.64212 887.86395
9.45000 -4760.53044 24.59857 14.82067 118.71017 73.97926 857.20074
9.55000 -4719.69197 24.54739 26.65771 118.92097 75.03072 850.27107
9.65000 -4683.93871 25.46665 14.01067 120.59627 68.78799 817.27693
9.75000 -4641.44200 25.46325 27.23310 113.73786 70.88772 811.34524
9.85000 -4610.21615 23.87891 1.06921 112.86972 68.41719 790.52424
9.95000 -4577.85692 24.20338 1.55780 111.11669 69.10615 776.18551
10.05000 -4543.04021 23.73568 14.23681 120.15490 67.15208 770.73654
10.15000 -4513.54567 23.57032 19.52278 109.81577 68.94580 737.75145
10.25000 -4484.29349 22.90327 14.56451 109.83478 65.53885 720.86263
10.35000 -4448.30867 22.46896 14.64661 114.27763 64.99519 713.47136
10.45000 -4419.07892 21.55002 1.23118 105.20334 62.99393 694.70027
10.55000 -4386.17640 20.99127 -4.89014 101.45730 63.64675 674.97613
10.65000 -4354.75252 21.67818 1.73920 103.11335 62.02267 668.77151
10.75000 -4318.45086 18.91175 24.51733 97.41934 61.28560 645.79811
10.85000 -4285.28897 21.79564 2.70894 107.56906 62.74782 638.83622
10.95000 -4256.43258 21.12201 29.94144 108.90645 62.59501 621.58062
11.05000 -4220.06298 20.30550 -27.08660 104.77512 62.05910 618.85388
11.15000 -4184.67366 18.46287 -3.24155 94.75816 61.41785 603.11627
11.25000 -4147.86901 19.64976 18.05318 92.14497 58.18880 598.09835
11.35000 -4119.48299 18.25381 14.67611 90.17950 57.64634 566.76820
11.45000 -4076.61160 17.10336 7.24122 89.81485 58.70288 570.09403
11.55000 -4044.76868 18.20823 10.09669 87.73289 58.67137 557.06173
11.65000 -4005.50188 17.04517 30.65997 86.24199 56.65709 554.92190
11.75000 -3973.37713 15.95658 40.53815 81.17316 55.04224 529.38592
11.85000 -3936.28110 16.80102 15.35508 80.52929 54.14927 528.40717
11.95000 -3902.70548 18.87515 8.26934 75.61252 52.43137 509.68405
12.05000 -3868.36006 15.45645 4.24515 72.83407 52.98029 495.12767
12.15000 -3836.04988 17.02242 12.21940 71.06475 50.73806 483.19970
12.25000 -3800.83170 15.90871 22.92942 70.16494 51.71675 479.37383
12.35000 -3771.28782 16.13206 4.83393 68.36914 52.10768 460.66723
12.45000 -3743.73303 13.91497 -4.66485 67.40420 53.39846 451.08806
12.55000 -3719.11536 15.55305 15.76339 71.91316 54.00959 438.54058
12.65000 -3694.58958 14.86755 2.70299 69.90772 50.87924 440.36898
12.75000 -3667.35828 15.28619 6.90201 70.72750 54.86134 434.24618
12.85000 -3650.33884 12.87228 0.73468 64.81995 52.36477 409.34184
12.95000 -3624.96312 15.05590 11.64699 68.27805 50.09581 412.70237
13.05000 -3602.73428 14.35085 24.88828 65.82792 48.04508 404.56442
13.15000 -3577.91880 13.48108 15.26311 65.17448 49.88449 396.18971
13.25000 -3559.27140 15.47144 19.39173 63.15572 49.51794 380.50605
13.35000 -3537.52141 14.35140 22.64414 63.26833 49.01637 381.60955
13.45000 -3519.00025 13.67830 9.97159 61.39537 49.57669 366.49861
13.55000 -3495.20857 15.56555 13.19757 63.24431 49.90287 369.42555
13.65000 -3475.18160 14.04830 5.17372 63.14222 48.29448 357.44457
13.75000 -3453.24007 12.37841 10.91068 63.26436 47.14826 352.76566
13.85000 -3432.83956 11.00591 2.02337 61.11047 47.50148 339.66365
13.95000 -3406.48087 14.08756 18.09072 62.47927 46.42369 340.19792
14.05000 -3386.51338 12.99863 -1.35345 62.90309 45.41261 335.26343
14.15000 -3357.44178 12.38574 4.99487 58.69909 43.84403 330.10133
14.25000 -3339.16151 12.76487 26.07478 58.24691 44.09164 320.69597
14.35000 -3312.71254 11.87863 5.88931 58.85725 44.91490 322.30557
14.45000 -3290.65661 12.79209 -7.12161 59.26506 44.39670 308.88250
14.55000 -3268.04786 10.78073 -2.66023 56.05652 42.15022 294.71580
14.65000 -3242.12990 12.86470 -3.18100 59.65280 44.68482 304.44995
14.75000 -3220.64668 11.81586 0.23325 59.38891 43.17635 295.22933
14.85000 -3197.26808 9.44921 -4.19883 57.74487 41.78286 291.57957
14.95000 -3178.11626 10.52794 -14.86890 52.74957 40.51489 281.25321
15.05000 -3154.77762 11.34544 -19.62136 53.85430 39.73858 271.77465
15.15000 -3131.08444 11.64547 -6.08678 57.88881 41.14122 271.48633
15.25000 -3108.13100 9.90071 -11.33916 51.54676 43.02389 270.32847
15.35000 -3083.11943 10.00656 -3.48123 53.54594 39.54723 256.87613
15.45000 -3059.38011 8.90445 -8.14306 52.59647 43.16712 259.85698
15.55000 -3038.51082 10.87137 11.28818 50.71131 37.94008 251.08323
15.65000 -3015.58234 11.00387 -0.77958 50.26245 38.51732 251.30814
15.75000 -2990.78428 10.28762 0.73747 44.12914 34.91942 243.06209
15.85000 -2968.62334 8.66452 7.73641 42.91556 35.91999 233.77657
15.95000 -2947.77022 12.19273 11.44693 45.52071 40.65469 237.87319
16.05000 -2925.87217 7.38230 3.15058 42.74737 36.25126 230.55586
16.15000 -2904.87469 11.04143 -1.16693 43.93088 33.37078 218.11327
16.25000 -2883.41834 9.80997 10.17510 42.40244 36.75769 217.73147
16.35000 -2861.97955 9.29429 10.35495 43.48972 38.74781 210.31970
16.45000 -2843.29719 9.98811 11.90945 41.50519 35.46876 210.71621
16.55000 -2821.41854 10.44948 22.19966 43.75026 39.03166 219.11745
16.65000 -2804.31327 9.44211 20.95094 40.76707 38.46410 209.02292
16.75000 -2787.55378 9.08970 35.36278 46.50959 38.41995 199.34513
16.85000 -2768.99421 4.77809 31.80056 41.41310 40.42633 198.01996
16.95000 -2752.19331 8.42915 29.98690 41.73725 31.96765 194.95454
17.05000 -2736.46815 6.10904 20.67284 44.49205 36.27970 185.86415
17.15000 -2719.81423 10.90963 21.58359 41.11162 37.11089 178.68893
17.25000 -2703.81862 8.61644 30.89363 40.51702 33.69034 186.06653
17.35000 -2689.47626 7.89279 36.37490 39.76442 39.60575 182.39936
17.45000 -2670.43368 8.34434 31.67304 42.11846 36.50035 172.42773
17.55000 -2654.41930 7.91385 36.65622 39.17024 35.07820 177.45749
17.65000 -2641.26271 7.50418 32.24081 38.31564 32.44059 176.09092
17.75000 -2625.13330 6.88925 43.51665 37.34415 34.16368 173.33739
17.85000 -2607.12782 8.57239 52.77679 37.39430 33.00409 168.98072
17.95000 -2593.99417 7.27119 45.75051 37.14470 32.75690 161.56802
18.05000 -2576.47911 8.74872 48.52874 37.26485 32.90605 159.80024
18.15000 -2561.25317 10.10685 42.89584 36.84655 36.55357 166.75687
18.25000 -2545.71529 8.04036 41.93462 37.15259 32.84471 157.21185
18.35000 -2530.08538 7.45564 49.00152 35.08240 32.37478 151.27956
18.45000 -2513.51298 8.41602 53.37460 33.62502 29.15653 158.25096
18.55000 -2499.37625 7.60748 34.38531 36.10609 31.41964 151.44196
18.65000 -2484.30788 5.98722 24.84609 37.05097 31.71604 146.73397
18.75000 -2467.97605 9.12025 36.01302 31.72143 31.45850 140.41705
18.85000 -2454.48126 4.94511 30.47398 37.09593 31.88685 146.99409
18.95000 -2437.57725 7.40124 34.40397 38.03441 34.75696 145.68213
19.05000 -2425.54946 9.06987 30.49246 34.60351 32.92411 139.43627
19.15000 -2413.05374 5.28154 27.10331 35.24011 28.09613 143.30284
19.25000 -2396.57588 6.66387 34.00887 30.68745 30.41230 140.03131
19.35000 -2381.26233 4.65854 18.93044 33.17718 33.66560 136.97540
19.45000 -2370.64171 6.45553 13.16269 33.94825 31.75674 132.55213
19.55000 -2356.86522 7.34199 26.97610 33.08200 31.56952 129.95618
19.65000 -2342.97236 6.34915 22.25943 31.34338 30.91120 128.36873
19.75000 -2329.97922 5.68735 17.66393 35.89177 27.96565 128.06215
19.85000 -2316.30397 6.38230 16.55868 29.10458 31.95817 128.97395
19.95000 -2305.28550 5.82057 20.87643 37.51037 32.68497 122.20068
