0.1875 0.2164 15.72091 -1.53352 89.86056 89.90596 79.46617
0.5625 -0.82314 37.68322 -0.09933 88.78582 85.43081 76.69762
0.9375 -0.84069 58.894 0.14971 86.14115 81.01503 72.51747
1.3125 0.27182 73.57198 -0.0952 80.90054 75.51073 69.77945
1.6875 0.46309 87.09332 0.05791 76.66817 71.36636 66.36759
2.0625 1.02827 98.79413 0.84872 73.13462 68.2195 63.76366
2.4375 0.53491 110.47058 -0.20456 69.69466 65.11386 60.26093
2.8125 0.14201 120.35862 -0.354 66.43347 61.93715 57.39516
3.1875 -0.44855 131.98069 -0.10749 63.16949 57.28478 53.95851
3.5625 0.13774 139.98356 -0.31929 59.44871 53.93293 51.24411
3.9375 -0.28748 147.69506 0.10833 55.59675 50.62786 48.94727
4.3125 -0.61819 154.05078 -0.36775 52.30247 47.6962 47.05533
4.6875 0.18629 161.21327 -0.2225 50.88477 45.35651 44.64803
5.0625 -0.13524 167.97745 0.05162 48.34186 43.04257 42.44696
5.4375 0.52718 173.79119 0.0297 46.31215 40.5404 40.49708
5.8125 0.55581 178.47914 0.01785 44.37305 39.53265 38.79283
6.1875 -0.24774 182.3909 0.43128 43.34021 36.88151 37.41373
6.5625 0.27247 186.42998 0.44353 41.4965 34.91818 35.39429
6.9375 0.83353 189.60696 0.68515 39.74281 33.43764 33.97421
7.3125 0.76106 192.38965 0.6766 38.98669 32.01926 32.64568
7.6875 0.49129 194.23045 1.13351 37.69437 30.95565 31.08507
8.0625 0.51598 196.67433 0.86578 36.27422 29.92951 29.89589
8.4375 0.1635 199.10518 0.28125 35.22076 28.91958 28.96977
8.8125 0.4372 200.83301 0.60372 34.10876 28.3283 27.81737
9.1875 0.70805 203.14164 0.66035 32.61101 27.08353 26.59808
9.5625 0.41444 205.44301 -0.04597 31.47962 25.79382 25.82131
9.9375 0.77505 206.30807 0.26867 30.37355 24.83725 24.79426
10.3125 0.86312 207.6221 -0.17289 29.2351 23.57708 23.66745
10.6875 0.90125 208.80862 -0.16937 28.43133 23.10175 22.68016
11.0625 0.82013 210.37629 -0.30936 28.11966 22.19404 21.87486
11.4375 0.34037 211.7445 -0.90035 26.59256 21.34339 21.49707
11.8125 0.77842 212.29954 -0.8696 26.21253 20.51152 20.63259
12.1875 0.03224 212.73389 -0.88568 25.67841 20.18652 19.8175
12.5625 0.6292 213.34766 -0.36993 25.25122 18.48687 19.1751
12.9375 0.30721 213.42938 -0.96731 24.24904 17.97651 18.68131
13.3125 0.07693 213.57552 -0.71424 23.48097 17.21639 18.12287
13.6875 0.11029 213.09382 -0.48847 23.33761 16.46164 17.79623
14.0625 -0.05018 213.2528 -0.71618 23.0349 16.23849 16.92774
14.4375 -0.18346 213.37687 -0.74126 21.72716 15.75046 16.48915
14.8125 -0.52519 213.397 -0.74847 21.15 15.51607 16.1854
15.1875 -0.18251 213.5227 -1.15693 20.26304 15.1039 15.50951
15.5625 0.01137 213.24348 -0.43391 19.94887 14.94717 15.14094
15.9375 0.41663 213.77922 -0.32158 19.36516 14.50138 14.61369
16.3125 0.10751 213.86151 -0.63294 18.65733 14.3342 14.11744
16.6875 0.34683 213.49107 -0.93385 18.53247 14.12823 13.60165
17.0625 -0.04348 214.01529 -0.66663 17.82423 13.76995 13.43995
17.4375 0.33519 213.55548 -0.53675 17.1728 13.27083 12.72867
17.8125 0.51811 213.5935 -0.25977 17.05397 12.62752 12.58091
18.1875 -0.44557 213.16073 -0.34485 16.27652 12.82477 12.35573
18.5625 -0.20991 213.64022 -0.34046 16.03091 12.27803 11.84762
18.9375 -0.17755 213.49644 -1.15218 15.92492 12.23637 11.67142
19.3125 -0.12924 213.50596 -1.18693 15.77926 11.5745 11.09921
19.6875 -0.62568 213.23451 -1.57603 15.03903 11.06523 10.81231
20.0625 0.2762 212.9042 -1.16311 15.01577 10.86847 10.58635
20.4375 -0.34833 213.03021 -0.8475 14.66712 10.44053 10.16773
20.8125 -0.23793 212.80085 -0.11688 14.3975 10.02018 10.13319
21.1875 -0.20808 212.11784 0.19881 13.7361 10.43842 9.92895
21.5625 -0.42607 212.57146 0.44978 13.37702 9.22451 9.28192
21.9375 -0.41435 211.18823 0.94279 13.83306 9.24389 9.43757
22.3125 -0.64258 211.16911 0.72882 13.26367 9.30508 9.159
22.6875 -0.23146 210.40932 0.95085 13.14768 9.28125 8.72318
23.0625 -1.24083 210.06984 0.72732 12.41353 9.18996 8.83175
23.4375 -1.26462 209.70196 0.79663 12.56737 9.86683 8.56515
23.8125 -1.67819 210.00699 0.06053 12.28066 8.71724 7.82627
24.1875 -0.80448 210.22569 -0.02235 11.4524 8.67403 7.71637
24.5625 -1.89365 209.28498 -0.0358 11.3101 7.5858 7.64566
24.9375 -1.47958 209.59008 0.05491 11.17018 7.8454 7.52161
25.3125 -1.56489 209.14185 0.43701 10.44317 7.30591 7.21757
25.6875 -1.43036 207.97135 0.38476 10.69772 7.50897 7.15548
26.0625 -0.62278 208.01645 0.19188 10.52671 6.85016 6.79272
26.4375 -1.3393 207.44627 0.40649 10.0355 6.56379 6.74631
26.8125 -1.18016 208.01725 1.3189 10.35783 6.84764 6.62798
27.1875 -0.43246 207.0366 0.79433 10.19749 6.79758 6.70964
27.5625 -0.07014 206.77989 1.04471 10.2872 6.69025 6.87836
27.9375 -0.68178 207.1838 0.63649 9.15025 6.85633 6.30838
28.3125 0.02312 206.14434 1.29349 9.64917 6.26673 6.32924
28.6875 0.04056 205.77674 1.24989 8.44039 5.98966 6.20364
29.0625 1.34703 205.729 1.01147 8.90151 6.69675 6.22011
29.4375 -0.11299 205.44367 1.38112 8.31624 6.77832 5.89427
29.8125 1.09731 204.89578 0.86199 8.22788 6.37452 5.80972
