0.05000 8123.42547
0.15000 9787.85662
0.25000 11269.14254
0.35000 11647.13480
0.45000 12546.03878
0.55000 12961.89022
0.65000 12980.93841
0.75000 12590.80170
0.85000 12260.60325
0.95000 11874.05011
1.05000 11533.92470
1.15000 10912.54103
1.25000 10528.58733
1.35000 9912.60642
1.45000 9473.07365
1.55000 9097.34405
1.65000 8784.35867
1.75000 8338.42672
1.85000 8064.52307
1.95000 7672.80310
2.05000 7267.14025
2.15000 6949.14401
2.25000 6783.41709
2.35000 6348.38605
2.45000 6176.94601
2.55000 6002.60296
2.65000 5689.67811
2.75000 5583.76860
2.85000 5226.53200
2.95000 5175.94930
3.05000 4993.96309
3.15000 4734.28508
3.25000 4620.80134
3.35000 4479.38214
3.45000 4292.96509
3.55000 4038.47246
3.65000 4015.70813
3.75000 3887.24877
3.85000 3787.74915
3.95000 3494.16964
4.05000 3546.42151
4.15000 3383.47663
4.25000 3254.55418
4.35000 3178.88841
4.45000 3193.25038
4.55000 3007.92298
4.65000 2968.53579
4.75000 2845.92833
4.85000 2833.02912
4.95000 2746.11824
5.05000 2580.68706
5.15000 2570.74617
5.25000 2516.11144
5.35000 2391.21105
5.45000 2304.66656
5.55000 2339.02023
5.65000 2226.46481
5.75000 2169.06770
5.85000 2139.04637
5.95000 2042.16599
6.05000 1963.01728
6.15000 1996.78672
6.25000 1878.07673
6.35000 1901.16734
6.45000 1771.16083
6.55000 1787.47399
6.65000 1672.01334
6.75000 1718.31084
6.85000 1666.35365
6.95000 1539.05120
7.05000 1626.84263
7.15000 1540.93687
7.25000 1453.43600
7.35000 1429.59768
7.45000 1388.08605
7.55000 1343.32150
7.65000 1350.29225
7.75000 1327.39703
7.85000 1248.21745
7.95000 1275.95399
8.05000 1194.66137
8.15000 1121.87095
8.25000 1103.72750
8.35000 1095.75442
8.45000 1046.87892
8.55000 1020.33131
8.65000 1005.73459
8.75000 972.22880
8.85000 921.42772
8.95000 878.57699
9.05000 867.78490
9.15000 860.84238
9.25000 867.89744
9.35000 842.15538
9.45000 769.07441
9.55000 801.99132
9.65000 731.69309
9.75000 727.95853
9.85000 736.09866
9.95000 682.40715
10.05000 702.79409
10.15000 651.94869
10.25000 643.73179
10.35000 609.75123
10.45000 631.47411
10.55000 586.31045
10.65000 561.57373
10.75000 587.89971
10.85000 564.61246
10.95000 541.92325
11.05000 520.25370
11.15000 502.09191
11.25000 450.69443
11.35000 473.39024
11.45000 462.03071
11.55000 445.97085
11.65000 441.66842
11.75000 446.47447
11.85000 424.80745
11.95000 422.49560
12.05000 407.34898
12.15000 409.34109
12.25000 392.32834
12.35000 381.54247
12.45000 400.77225
12.55000 360.87146
12.65000 359.03616
12.75000 376.80377
12.85000 335.14444
12.95000 339.92343
13.05000 351.25896
13.15000 350.62560
13.25000 338.82906
13.35000 314.43796
13.45000 309.51651
13.55000 320.84295
13.65000 312.83447
13.75000 293.27474
13.85000 289.41651
13.95000 270.21596
14.05000 289.03881
14.15000 277.24194
14.25000 273.59071
14.35000 262.59561
14.45000 274.16853
14.55000 247.65549
14.65000 228.40874
14.75000 246.24947
14.85000 263.46828
14.95000 222.00692
15.05000 229.21307
15.15000 235.51327
15.25000 227.40843
15.35000 200.89852
15.45000 212.13384
15.55000 203.11032
15.65000 198.48725
15.75000 190.50503
15.85000 199.53898
15.95000 220.45904
16.05000 194.59175
16.15000 193.96728
16.25000 181.56631
16.35000 189.04708
16.45000 180.13794
16.55000 169.81129
16.65000 176.03831
16.75000 180.07835
16.85000 179.63172
16.95000 161.14305
17.05000 151.52313
17.15000 155.49783
17.25000 175.95169
17.35000 154.14098
17.45000 165.15542
17.55000 158.67622
17.65000 187.04869
17.75000 145.65444
17.85000 143.75494
17.95000 151.82051
18.05000 154.22327
18.15000 141.36742
18.25000 151.98867
18.35000 147.33679
18.45000 137.37211
18.55000 142.57122
18.65000 135.06659
18.75000 159.62494
18.85000 159.02573
18.95000 148.45753
19.05000 151.94003
19.15000 127.87372
19.25000 156.90101
19.35000 158.53845
19.45000 149.51215
19.55000 143.41979
19.65000 132.47068
19.75000 141.93833
19.85000 141.73576
19.95000 142.17142
