0.05000 52150.49848 -14935.50344 54479.41447 238966.33980 250827.00448 126373.30104
0.15000 -87501.56861 1352.64999 20606.54727 193754.41794 261781.58250 249325.92584
0.25000 -129976.88551 -1004.35784 1469.17944 103397.83445 95540.92323 136719.54418
0.35000 -88685.82775 -23.32484 -3439.43548 47658.53939 37653.08850 78806.95837
0.45000 -68748.28743 -79.24978 -2624.24421 30616.61660 21316.62982 55813.82918
0.55000 -53786.71632 -6.35878 -3101.07992 20461.25197 13857.28460 43747.57735
0.65000 -45468.83360 -39.54448 -1658.65965 15738.33300 9778.44197 35379.37734
0.75000 -38849.35640 44.51037 -473.17868 13058.35573 7718.53333 30069.46811
0.85000 -34073.98490 89.48824 -1250.32900 10798.83610 5771.18763 25934.40815
0.95000 -30494.22524 -27.41553 -321.15744 9036.36488 4371.31352 22442.29996
1.05000 -27460.64832 -26.21024 -688.25814 8026.32575 4785.56322 20106.07642
1.15000 -24793.61762 -20.44034 -442.61379 7349.03244 3508.51649 18085.04211
1.25000 -22800.92356 45.31977 -490.63018 6178.54745 2994.39729 16116.98779
1.35000 -21221.72633 -65.52922 70.36442 5570.61550 3096.79763 14631.66617
1.45000 -19578.64396 -46.10592 -429.96737 6547.37626 2403.79004 14556.68295
1.55000 -18438.05715 20.33244 -248.08709 4237.49322 1792.30128 12302.91568
1.65000 -17356.98130 60.94013 -559.66698 4055.51310 1569.58254 11265.40616
1.75000 -16437.11024 10.08563 -49.91840 3673.38650 1380.19298 10483.98198
1.85000 -15680.96999 9.36633 -291.76885 3434.24339 1916.33001 9967.67748
1.95000 -15119.44401 -5.24313 121.66622 3338.47219 1297.04421 8947.68924
2.05000 -14450.03555 -6.92133 86.91114 2754.52487 1381.36194 8326.94453
2.15000 -13789.46551 5.70833 -182.35501 2502.17088 1196.84755 8030.10444
2.25000 -13286.72967 -26.59223 -189.20698 2712.43989 2099.06857 7409.90225
2.35000 -12963.61414 22.23670 206.20000 2061.46693 1243.13869 6897.76659
2.45000 -12460.25574 -5.70070 -36.36405 2024.88658 1341.37185 6577.26045
2.55000 -12240.02458 17.81642 70.55332 1822.30471 1200.07472 6035.67553
2.65000 -11836.00882 -20.13891 15.26377 1616.13196 807.54177 5842.94336
2.75000 -11532.54775 9.05414 -137.35022 1649.14917 1299.99955 5645.28902
2.85000 -11260.44562 -9.29141 -125.14045 3425.70323 1526.40024 5390.12527
2.95000 -11009.02437 18.06036 -96.65920 1466.79779 1381.44130 5590.90099
3.05000 -10801.50069 10.26078 -25.14396 1626.61101 1472.61003 4781.46744
3.15000 -10683.63288 -10.72990 23.50802 1601.61601 1167.09093 4655.35181
3.25000 -10444.59045 15.47656 -6.63638 1627.61900 1378.21271 4347.82913
3.35000 -10234.47456 -7.72114 162.81671 1005.84681 600.96086 4115.91393
3.45000 -10089.67659 8.16460 100.91236 1325.97957 1332.69733 4068.53071
3.55000 -9902.78646 -3.46062 151.66964 962.23642 749.95241 3890.70120
3.65000 -9722.95932 7.94408 141.77790 977.39517 699.38816 3607.64942
3.75000 -9556.07471 0.03588 86.63363 1127.04694 896.46860 3624.49803
3.85000 -9407.21068 -10.54079 5.16882 864.88619 780.47647 3340.87860
3.95000 -9308.50823 -14.67449 64.28155 933.63741 1276.66168 3329.15540
4.05000 -9178.45649 -7.02265 69.48424 788.41261 512.01630 3084.09169
4.15000 -9008.33745 22.82213 -11.84320 1015.02900 838.80860 3031.00018
4.25000 -8933.22169 -3.52682 -119.71395 858.20924 550.42424 2997.07180
4.35000 -8815.47383 40.74168 75.05234 845.12536 932.26500 3577.72370
4.45000 -8682.95889 -20.04998 -19.84682 804.26342 972.21057 2800.32409
4.55000 -8544.28237 -9.15261 -96.25674 884.26420 575.53867 2627.64409
4.65000 -8428.03181 19.69650 -74.16328 637.97672 894.11399 2519.56767
4.75000 -8281.77695 20.51054 -68.11980 839.52458 684.56774 2505.89073
4.85000 -8188.35813 5.20116 -84.81535 566.68706 404.51259 2366.98536
4.95000 -8070.87660 15.49508 -62.64402 840.98963 429.61926 2292.48766
5.05000 -7974.68071 6.21740 -67.86366 510.89281 422.28004 2227.05497
5.15000 -7842.11345 46.13871 -73.86361 1127.24651 1278.02644 2830.16105
5.25000 -7758.89226 7.33257 -56.51307 654.74623 483.71832 2062.94217
5.35000 -7643.66946 9.19485 13.12067 489.98046 410.28467 2053.80092
5.45000 -7551.92742 1.11849 -34.73772 701.31724 475.70984 2022.40983
5.55000 -7450.35160 22.46735 40.22423 533.63477 373.38655 1878.79431
5.65000 -7308.87734 18.81766 -79.22454 582.04945 511.55733 1957.70474
5.75000 -7241.98022 22.37044 -39.41549 452.91160 289.85896 1772.41400
5.85000 -7160.63284 38.64150 26.02867 487.33063 470.18057 1737.76666
5.95000 -7027.73468 26.47560 84.50001 637.69782 505.00735 1757.41418
6.05000 -6967.23343 27.45281 44.41419 425.91223 900.01396 1640.67001
6.15000 -6886.51553 3.46267 15.84504 1047.97996 642.75281 1706.11015
6.25000 -6783.97459 16.09373 -51.04621 703.28189 611.22592 1793.03089
6.35000 -6706.29277 4.08777 33.82918 514.94923 397.23421 1516.39038
6.45000 -6627.94400 5.60104 -40.57066 585.22982 436.32728 1638.09478
6.55000 -6523.30223 10.22703 50.27571 402.25976 467.71200 1419.06892
6.65000 -6471.21527 17.63175 72.57097 388.77740 270.13551 1353.96786
6.75000 -6373.20376 9.22848 -8.52256 341.08930 324.89667 1357.86912
6.85000 -6282.19326 4.53121 -11.23257 459.49319 479.12003 1694.33252
6.95000 -6232.42671 14.18294 9.98060 859.07357 265.65320 1446.57333
7.05000 -6141.88742 1.23811 46.39140 373.28764 268.25713 1255.72791
7.15000 -6072.12749 -0.66911 54.84571 749.29358 1044.16682 1286.93510
7.25000 -6003.36007 2.67687 156.10425 439.71085 244.82779 1213.92102
7.35000 -5935.14051 1.27083 72.82060 380.95334 279.82561 1202.06237
7.45000 -5864.55250 -10.49564 84.33124 313.32611 259.34683 1166.88268
7.55000 -5792.67425 -2.18397 17.21090 311.47873 246.01015 1168.01819
7.65000 -5728.44513 -10.86300 129.41525 397.23702 356.99092 1082.90519
7.75000 -5650.13648 -2.01641 78.76421 460.61180 285.43084 1076.31783
7.85000 -5616.12292 3.99715 74.51077 1042.37095 870.30511 1625.66083
7.95000 -5561.89695 5.63811 53.36513 571.69035 274.09725 1074.86810
8.05000 -5502.17155 7.37477 29.80093 370.18981 317.50401 1014.93719
8.15000 -5427.27107 -1.51773 97.63797 338.94847 205.98345 1011.08329
8.25000 -5386.47748 6.05666 114.89145 295.73416 213.83141 926.28305
8.35000 -5325.90243 -7.82013 65.86177 336.95805 324.17340 930.20377
8.45000 -5273.00517 -5.53773 80.18183 262.05364 207.27724 944.95202
8.55000 -5234.01494 9.58395 78.57309 405.51316 425.98778 1130.45503
8.65000 -5182.83789 -11.83605 69.86514 304.64776 303.53656 897.00528
8.75000 -5123.63445 -9.08728 86.68625 293.69218 327.29865 862.04892
8.85000 -5068.49756 -11.10107 99.98981 234.81991 207.17324 858.08548
8.95000 -5031.53842 -10.09314 96.73347 267.15265 206.81941 829.58090
9.05000 -5007.80148 0.91520 66.91847 224.84388 262.16545 814.14724
9.15000 -4948.82091 0.78097 60.77631 228.79268 182.81594 759.13643
9.25000 -4908.81379 -8.68937 97.32505 239.33407 194.26144 796.94476
9.35000 -4871.74746 -4.48706 87.38434 272.66214 230.21039 774.97967
9.45000 -4823.80179 -0.18411 145.40109 183.13253 175.83192 749.66519
9.55000 -4788.40178 9.08417 71.88033 361.41634 274.01237 739.52842
9.65000 -4739.02038 -14.13473 133.42221 360.44565 513.97053 730.15102
9.75000 -4687.12852 3.18495 139.55051 218.89339 279.95611 732.21498
9.85000 -4658.16125 -7.37696 182.49907 344.39749 280.24652 844.82582
9.95000 -4614.16763 1.79825 103.94380 246.53882 184.63866 682.45505
10.05000 -4574.66606 -23.25983 108.17773 343.99830 667.96165 664.46382
10.15000 -4522.93830 3.55762 131.45495 214.25479 148.17387 651.32764
10.25000 -4470.39318 -1.70362 113.43477 177.06944 193.95788 639.89577
10.35000 -4442.91770 5.99518 126.81145 169.41794 226.14881 855.26162
10.45000 -4411.42880 4.32902 87.21388 157.60893 142.12570 608.76645
10.55000 -4362.81222 4.26911 95.75540 1744.73318 354.83296 1719.95566
10.65000 -4343.65679 27.87992 156.38174 278.18636 726.31186 634.39062
10.75000 -4300.71858 6.46772 104.72681 177.69793 150.60486 586.78539
10.85000 -4262.90443 3.41188 130.14469 159.86612 184.18886 535.19399
10.95000 -4225.29978 5.49069 99.46775 162.87606 145.00046 560.11796
11.05000 -4194.82581 -3.83533 100.94468 196.18249 212.61642 556.81234
11.15000 -4154.23397 5.43799 137.89356 226.80890 145.77163 554.28362
11.25000 -4113.58821 -3.85106 121.59861 232.47518 151.41485 554.66777
11.35000 -4085.78779 6.57004 139.63231 160.18136 124.58439 563.08228
11.45000 -4057.26495 -11.18017 115.89000 200.95955 190.60385 498.80970
11.55000 -4029.32770 6.48642 135.74971 136.69309 132.06048 458.60312
11.65000 -3982.00942 5.19548 109.23081 141.19246 108.28674 485.61569
11.75000 -3951.96090 4.21454 125.95196 173.92157 232.76593 457.49712
11.85000 -3921.35682 -10.86837 107.58210 193.06593 256.36337 488.40857
11.95000 -3882.63706 3.91286 102.27836 135.43341 122.23359 468.44897
12.05000 -3845.15130 -2.43328 103.59766 194.39963 136.86986 444.15093
12.15000 -3821.50589 0.77537 139.65440 142.73131 116.24226 428.98738
12.25000 -3872.68939 -47.18179 293.35750 1755.24926 1284.01003 3910.75825
12.35000 -3754.45125 -3.77857 95.81935 115.53709 93.38151 411.99469
12.45000 -3720.14487 -5.10118 110.50865 176.68873 134.73373 411.35509
12.55000 -3698.11998 -6.59937 77.40297 217.94630 168.67129 502.44719
12.65000 -3665.13737 11.81857 94.39369 181.84862 245.90454 385.22645
12.75000 -3624.05468 7.39877 135.22601 134.99612 114.85167 385.57499
12.85000 -3600.66420 -2.81172 131.14149 142.38886 147.04661 392.97230
12.95000 -3577.29195 -9.52031 120.35023 113.00773 97.72197 352.13784
13.05000 -3541.05746 -6.06028 74.18110 112.46888 107.46929 356.97359
13.15000 -3518.20100 6.26612 87.81643 130.65390 185.26796 416.75844
13.25000 -3486.07031 -7.24931 97.62602 97.00859 108.44793 348.17961
13.35000 -3473.89503 -5.80762 68.47964 180.61711 154.26937 379.77933
13.45000 -3424.49158 -10.77436 127.81737 103.16551 128.35032 341.18757
13.55000 -3424.78134 2.29161 87.67087 328.67613 167.40120 395.60681
13.65000 -3409.13365 -21.67128 81.61062 732.83651 263.86000 447.18927
13.75000 -3350.40895 6.31965 54.54332 145.14357 410.79394 360.71540
13.85000 -3323.59173 -19.72063 55.76848 127.76696 113.60932 346.44933
13.95000 -3304.79155 -7.85452 73.33678 92.92067 102.95477 314.58366
14.05000 -3276.85957 -3.33282 37.89987 106.79092 102.33123 335.04996
14.15000 -3243.59295 1.33695 81.73907 96.11357 121.27660 317.13260
14.25000 -3230.95849 -16.31513 59.50285 140.12629 116.92205 333.91468
14.35000 -3210.78824 -13.73545 63.43680 90.25888 90.01792 286.26016
14.45000 -3194.13530 -11.80357 44.85974 161.72353 108.09738 308.96010
14.55000 -3152.24608 -11.36623 15.65624 145.38871 140.63633 327.71399
14.65000 -3134.40003 -3.96931 49.39036 94.01398 87.09336 280.58101
14.75000 -3117.86374 5.20561 59.41291 139.14302 126.64576 299.49022
14.85000 -3099.63064 -29.33934 56.65658 170.19489 217.25738 260.36735
14.95000 -3070.55182 -6.62268 50.60719 88.62090 92.26298 276.72242
15.05000 -3047.46674 3.44420 54.62503 116.26493 93.84535 312.85784
15.15000 -3035.30124 6.78621 31.17022 86.33651 108.02332 268.19800
15.25000 -3017.72517 -20.91500 50.25947 99.95963 192.65594 280.69472
15.35000 -2979.68455 -9.53326 16.00909 117.35625 88.86618 348.49098
15.45000 -2959.12642 -9.28555 52.00479 92.05711 105.88005 273.21287
15.55000 -2951.68930 13.50072 27.73945 80.97006 137.24203 239.97811
15.65000 -2927.64414 48.01487 39.05903 107.07749 464.34021 282.75951
15.75000 -2900.78721 -27.00286 55.82739 216.41167 390.29147 587.58825
15.85000 -2885.52002 -1.71669 78.27068 101.41841 97.37396 250.90199
15.95000 -2873.72554 4.95799 14.74161 86.90913 80.75365 267.42217
16.05000 -2839.85430 -6.25606 67.87523 94.93818 94.10406 255.14790
16.15000 -2830.99253 10.64834 27.94139 86.90392 88.64375 255.16509
16.25000 -2801.09634 4.08732 45.43435 85.60681 93.61309 264.34599
16.35000 -2803.52660 13.28337 27.96286 85.12631 86.71497 228.76326
16.45000 -2767.30766 -13.70140 75.65916 87.74647 123.71293 258.45711
16.55000 -2734.18003 16.48523 63.30576 156.99273 147.00018 274.72127
16.65000 -2745.19804 12.78624 27.23865 84.87912 110.44326 214.80462
16.75000 -2722.63306 -3.81905 62.95566 76.02254 105.82722 219.11444
16.85000 -2698.00247 8.73849 31.91947 82.12780 76.75415 243.99011
16.95000 -2660.16641 -48.37301 42.17151 240.75281 451.35672 326.94354
17.05000 -2665.02612 11.07769 55.24813 81.98128 79.08225 248.89363
17.15000 -2645.44790 8.30960 61.07791 82.18116 113.68529 211.87176
17.25000 -2625.32735 -6.43946 42.74484 87.76164 85.37714 225.78707
17.35000 -2599.57237 -1.23758 83.16353 107.65047 81.58029 215.77038
17.45000 -2602.69293 4.06644 47.30379 82.82720 108.77433 225.09186
17.55000 -2583.15691 -10.48009 52.91170 119.06434 117.20175 237.84010
17.65000 -2567.99689 -2.48495 64.29465 76.24429 80.68528 210.06107
17.75000 -2545.82863 13.33939 31.93882 84.07184 92.59746 187.35060
17.85000 -2543.08318 1.42289 37.51517 71.08188 68.53388 177.74051
17.95000 -2527.07283 -15.46761 61.29117 88.12307 86.52568 181.18289
18.05000 -2502.81872 4.26351 80.13848 95.94427 93.07129 213.98180
18.15000 -2484.42152 18.22758 62.10877 79.55554 81.78154 186.11169
18.25000 -2457.58898 2.09108 42.97968 92.60158 65.87797 195.88361
18.35000 -2445.72923 -0.94177 85.77571 83.29075 73.11636 171.85219
18.45000 -2425.11094 3.13649 16.68290 72.22478 73.76898 193.31298
18.55000 -2419.65321 10.62678 69.36954 85.38995 71.13906 173.34521
18.65000 -2401.90690 -5.06390 94.45585 86.72260 87.49227 159.33189
18.75000 -2293.27750 -1.18735 166.43013 795.10777 68.36315 726.91302
18.85000 -2376.52449 13.12909 43.19940 63.74522 74.40448 166.10530
18.95000 -2374.73024 -2.37312 68.09302 64.72084 73.86977 165.85069
19.05000 -2366.30864 -3.93605 11.53289 68.70320 65.07091 137.29097
19.15000 -2342.54622 -5.96681 55.10422 68.89903 72.04711 149.23656
19.25000 -2331.41779 -3.81957 55.20836 64.84227 70.70346 140.55905
19.35000 -2304.60899 8.60612 79.66039 61.19475 68.97238 151.67156
19.45000 -2307.88136 15.74950 43.82851 67.84035 61.28888 171.15536
19.55000 -2289.07869 9.12516 89.81595 67.92830 67.60600 145.61467
19.65000 -2257.94803 5.72144 35.54458 59.20702 57.54028 172.32695
19.75000 -2264.10734 0.15242 54.45006 62.48733 65.32513 117.51359
19.85000 -2251.89716 12.41746 62.34014 106.34699 94.07402 160.67289
19.95000 -2242.25794 10.26234 32.29471 59.61688 75.85464 145.19292
