0.120000 -0.351970
0.380000 0.402210
0.620000 1.966750
0.880000 2.161290
1.120000 2.864490
1.380000 2.333400
1.620000 1.707890
1.880000 1.824100
2.120000 1.524270
2.380000 1.459610
2.620000 1.468840
2.880000 1.195360
3.120000 0.953370
3.380000 1.095340
3.620000 1.007910
3.880000 0.825670
4.120000 0.777510
4.380000 0.658550
4.620000 0.290180
4.880000 0.122340
5.120000 0.127200
5.380000 0.271950
5.620000 0.415920
5.880000 0.375330
6.120000 0.120920
6.380000 0.267840
6.620000 0.477860
6.880000 -0.046980
7.120000 -0.186380
7.380000 -0.049330
7.620000 -0.103310
7.880000 -0.237750
8.120000 -0.770850
8.380000 0.457220
8.620000 -0.080500
8.880000 1.626930
9.120000 0.769620
9.380000 -1.314440
9.620000 1.795970
9.880000 1.689550
10.120000 -0.055750
10.380000 -0.876070
10.620000 -0.551840
10.880000 -1.117950
11.120000 -0.965410
11.380000 -1.531680
11.620000 -1.820090
11.880000 -1.699750
12.120000 -1.939570
12.380000 2.706490
12.620000 2.766940
12.880000 2.633090
13.120000 2.757570
13.380000 2.921510
13.620000 2.877710
13.880000 -2.923250
14.120000 2.510960
14.380000 2.685530
14.620000 2.082810
14.880000 2.362130
