0.1875 -1.01083 18.13222 0.74315 105.94668 104.14293 92.94346
0.5625 -1.37858 38.10548 0.27884 104.54678 96.07698 85.61193
0.9375 0.47854 58.44979 0.5258 100.59014 88.23094 79.97739
1.3125 0.49954 70.78516 -0.36908 95.78156 83.07491 75.30163
1.6875 0.72353 79.57721 0.23687 91.83732 77.35906 71.80668
2.0625 -0.2459 87.66904 0.2052 86.33411 73.55559 68.70783
2.4375 -1.32879 96.63479 -0.38843 82.06936 71.50537 65.78979
2.8125 0.1318 103.91498 -0.09908 77.47456 69.55583 63.5695
3.1875 0.74983 114.84382 -0.40317 73.35858 66.45187 60.77851
3.5625 1.32604 126.45799 0.05108 69.17408 64.38407 57.86516
3.9375 1.46722 137.85302 0.66908 64.35194 60.52038 53.78006
4.3125 0.38366 148.90179 0.25703 60.62703 56.04577 50.47051
4.6875 0.34524 157.42977 0.82065 56.60283 51.41066 47.21723
5.0625 0.69798 164.46562 0.40909 52.36847 47.80468 44.34671
5.4375 0.08774 169.85543 1.06224 49.25767 44.26649 42.28834
5.8125 0.12954 175.75968 0.59649 47.50457 41.50571 39.99146
6.1875 -0.13922 180.83159 0.40852 45.27752 38.62081 38.52888
6.5625 -0.13962 185.16783 -0.24651 43.72634 36.58045 36.28133
6.9375 0.11012 189.16795 -0.21427 42.25223 34.40037 34.67434
7.3125 0.64631 191.7084 -0.06106 40.8106 33.32293 32.94277
7.6875 0.37129 193.78604 -0.08001 39.07868 32.06815 31.85099
8.0625 0.6507 196.33122 -0.51997 38.25026 31.0506 30.47311
8.4375 0.56122 198.40566 0.05288 36.82717 29.74791 29.19749
8.8125 0.2936 200.15727 -0.09487 35.44894 28.99737 28.83615
9.1875 0.37745 201.62067 0.33886 34.20448 28.09954 27.07945
9.5625 0.28923 203.72201 0.0173 33.00154 27.33137 26.07103
9.9375 -0.1595 206.11047 0.08003 31.92616 26.48553 25.35888
10.3125 -0.4445 207.41796 0.16025 30.85754 25.08487 24.37366
10.6875 -0.23613 208.49374 0.38326 29.93931 24.0628 23.37188
11.0625 -0.01211 209.25899 0.27155 28.84616 23.18488 22.61504
11.4375 0.56398 209.98166 0.08319 27.78394 22.4287 21.90383
11.8125 0.21965 210.98801 0.10326 26.63397 21.57847 21.29881
12.1875 0.3533 211.69807 -0.3265 26.31857 20.70884 20.49895
12.5625 0.23741 212.75664 -0.6918 25.6946 20.23944 19.57344
12.9375 0.47504 213.36452 -0.91333 25.20257 19.13477 18.98408
13.3125 0.9664 213.21275 -1.41177 24.27566 18.5741 18.46665
13.6875 0.64714 213.7197 -0.97097 24.06839 17.71765 18.17247
14.0625 0.11611 213.81726 -1.47212 23.41884 16.76433 17.62563
14.4375 0.01681 213.80911 -1.08002 22.94613 16.21689 17.31884
14.8125 0.49586 213.41825 -1.12941 22.40671 15.56478 16.79246
15.1875 0.31872 212.9964 -0.85379 21.7876 15.46345 16.58015
15.5625 0.30302 212.19853 -1.18298 21.34113 15.19198 15.737
15.9375 -0.10336 212.404 -0.97886 20.52446 15.71087 15.05759
16.3125 0.57719 212.22025 -0.92994 20.05589 15.13957 14.65411
16.6875 -0.08825 212.30158 -0.75177 19.63634 14.77683 13.98655
17.0625 -0.15275 212.77002 -1.2076 19.13739 14.24651 13.7599
17.4375 0.86356 212.80193 -0.21889 18.15254 14.20542 13.5141
17.8125 0.77098 212.50328 -0.27249 17.73707 14.20659 13.18824
18.1875 0.54213 213.18418 -0.50507 17.31146 13.36342 12.68389
18.5625 0.20327 212.96933 0.25725 17.29079 13.02304 12.59503
18.9375 0.9773 212.90659 0.63573 16.96642 12.90477 12.22731
19.3125 0.53818 213.10135 -0.16951 16.08708 12.33963 11.47126
19.6875 1.08487 212.90701 0.19274 16.11094 12.14051 11.3003
20.0625 0.51735 212.73032 -0.20114 16.28928 11.85682 11.52616
20.4375 0.16781 212.28479 -0.41527 15.60984 11.28771 10.64027
20.8125 0.38574 212.05161 -0.32801 15.5151 10.67943 10.58732
21.1875 0.18109 211.70228 -0.1442 15.15339 10.45905 10.48053
21.5625 0.41204 211.02128 -0.43957 15.21924 10.10996 10.11245
21.9375 -0.12565 211.15613 -0.04932 14.92049 10.64194 10.05715
22.3125 0.45335 210.88906 0.3959 14.21276 10.12216 10.30451
22.6875 0.49661 211.31663 0.71524 14.34477 9.30229 9.6491
23.0625 0.70998 211.22479 -0.31384 13.16108 8.92283 9.29189
23.4375 0.71619 210.43266 -0.12533 13.04372 8.91889 9.24868
23.8125 0.78069 210.7371 -0.15405 13.0338 8.84844 8.69032
24.1875 0.9263 209.85728 0.07248 12.31747 9.19885 8.85709
24.5625 0.51428 209.41604 0.08963 12.31253 8.8159 8.08265
24.9375 -0.42925 209.35997 -0.35955 11.72179 8.50978 8.0605
25.3125 0.51415 208.55772 -0.72012 11.06067 8.68883 7.77102
25.6875 1.0328 209.09511 -0.26267 10.20902 8.16339 7.78533
26.0625 -0.07579 209.12829 -0.61487 10.76694 6.96369 7.58554
26.4375 0.38842 207.73584 -0.89871 10.66991 7.47519 7.6968
26.8125 0.0887 208.46544 -0.41938 10.58095 6.82397 7.11188
27.1875 -0.19457 207.93748 -1.02744 10.29313 7.09952 7.20082
27.5625 -0.33261 208.05276 -0.70717 9.05371 6.97328 6.42529
27.9375 -0.59283 208.02348 -0.70158 10.10299 6.62405 6.89068
28.3125 0.35237 208.03329 -1.22594 9.72646 5.65845 6.66501
28.6875 0.72935 207.12 -0.70957 9.81893 6.3383 6.07045
29.0625 1.10906 206.30738 -1.19551 9.21995 5.86556 6.06785
29.4375 0.93265 205.39571 -1.02564 9.19737 5.81948 5.63795
29.8125 0.66814 205.4771 -0.67928 8.55564 6.02581 5.96377
