0.1875 -3.23183 16.46421 -0.77274 73.74107 71.23309 68.97654
0.5625 1.27786 41.99389 0.40474 68.28089 68.07594 65.89831
0.9375 1.03668 65.0494 -0.55268 64.62608 64.64478 62.5303
1.3125 1.02767 84.31937 -0.92689 61.41526 62.38767 59.86043
1.6875 0.98517 102.55535 -1.3879 58.26353 56.85757 56.25998
2.0625 0.25026 114.63057 -1.23842 56.26013 54.44137 53.48161
2.4375 1.60095 125.54849 0.98252 54.34853 51.84852 50.98151
2.8125 1.2512 134.50997 -0.13799 52.25949 49.18993 49.09393
3.1875 0.56533 143.07746 0.20471 50.17137 46.98901 47.04987
3.5625 0.0131 150.79756 -0.88491 48.02017 44.84173 44.13244
3.9375 0.38791 158.52419 -0.1557 45.64347 41.91183 42.9266
4.3125 0.20151 164.62704 0.83004 44.13266 40.26891 40.86431
4.6875 0.41329 169.63484 0.91464 43.27636 36.74056 38.52579
5.0625 0.3918 174.219 0.77816 41.36339 34.44567 37.16586
5.4375 -0.90838 177.03459 0.95123 39.89059 33.58856 35.75916
5.8125 -1.33164 182.51178 0.90387 38.32044 32.19062 33.88509
6.1875 -0.84758 186.43886 0.48415 36.68248 30.25049 32.79595
6.5625 1.17642 189.69766 0.91797 35.47869 29.39602 30.95669
6.9375 1.58551 192.97198 1.52981 33.66789 28.19196 29.67958
7.3125 0.84829 194.71593 2.34876 32.90432 27.64347 27.63897
7.6875 0.15246 196.74446 1.86092 31.58929 26.69637 26.90809
8.0625 -1.00365 200.25646 1.15661 31.10106 25.06712 25.7573
8.4375 -2.05733 201.96427 -0.65079 30.10202 22.91524 25.22391
8.8125 -1.49397 202.66628 -0.91809 29.60032 21.19895 24.29529
9.1875 -2.41234 202.7175 -1.34019 28.30828 20.50752 23.60158
9.5625 -2.93775 201.03681 -1.11093 26.59059 20.27726 22.3586
9.9375 -3.64938 201.92042 -1.31334 24.85299 19.98113 21.07737
10.3125 -2.67643 203.53073 -0.7103 23.79128 19.63216 20.3263
10.6875 -1.32871 205.13252 -0.27575 23.44389 17.88494 19.20996
11.0625 1.24644 206.68139 1.26073 23.01943 17.30799 18.65539
11.4375 2.53558 207.16064 1.226 21.92711 16.29409 17.39046
11.8125 2.92392 207.69038 1.60383 22.03267 16.24119 17.28189
12.1875 2.27477 208.91936 2.03419 20.3292 15.39348 16.09146
12.5625 1.99856 209.0882 1.11251 19.84449 15.28279 16.14577
12.9375 -0.32559 209.94554 0.67073 18.29552 14.84759 15.1928
13.3125 0.07212 209.71923 -0.42298 17.74121 14.57484 14.64643
13.6875 1.25466 210.61733 -1.43706 17.00907 14.28093 14.81311
14.0625 1.73173 210.34857 -1.53779 16.91252 14.20258 14.04887
14.4375 3.50271 211.23698 -2.49276 17.30621 14.39731 13.6223
14.8125 5.27748 211.79165 -3.01952 17.76164 14.5889 13.30206
15.1875 6.57438 211.40293 -3.47839 17.99884 14.44699 12.90989
15.5625 6.2933 212.10421 -3.8888 17.91849 14.73811 12.01115
15.9375 6.1558 213.19131 -3.49428 17.05824 13.83735 11.9169
16.3125 3.45005 213.227 -3.38109 15.71857 13.74925 11.47392
16.6875 3.3201 214.2422 -3.40612 14.32109 12.83841 10.36173
17.0625 1.16073 214.51635 -3.39658 13.36054 11.09948 10.66606
17.4375 -0.469 215.51383 -3.25711 11.80398 9.90849 9.92924
17.8125 -1.61311 214.90637 -2.26965 11.38182 9.71202 9.22142
18.1875 -1.26024 214.7281 -2.14246 10.12049 9.17059 9.49466
18.5625 -1.61793 214.40981 -2.27165 9.89457 7.94278 8.80075
18.9375 -1.56332 214.13329 -2.39159 9.95505 7.87165 8.82411
19.3125 -1.25201 213.66735 -2.67956 10.35176 8.0086 8.49076
19.6875 -1.77135 213.22476 -1.286 9.78417 7.53032 8.3867
20.0625 -2.57992 213.27926 -2.277 9.68908 7.36637 7.70457
20.4375 -0.78544 212.39048 -1.1293 9.40311 6.99462 7.43818
20.8125 -2.49502 212.5733 -1.43776 10.23279 6.73426 7.09174
21.1875 -1.58373 212.19557 -1.02448 9.87709 6.59346 7.32897
21.5625 -1.85591 212.07884 -1.33546 9.89826 5.68944 6.97934
21.9375 -1.4244 211.46894 -0.7207 9.34814 5.6348 6.75096
22.3125 -2.28867 210.72875 -0.82338 10.78041 5.41063 7.17322
22.6875 -1.90014 211.07925 -0.92552 9.35894 4.82597 6.15827
23.0625 -3.18398 210.72265 -1.11847 10.19852 4.37196 6.7999
23.4375 -2.435 210.29259 -0.56336 10.01726 4.48739 6.48238
23.8125 -2.06216 209.71539 -0.40761 9.67228 4.56019 6.03558
24.1875 -3.12473 209.42893 -0.7192 8.86735 4.38632 6.51186
24.5625 -2.81116 209.00006 0.06482 7.82677 4.3707 6.47625
24.9375 -1.86948 209.23549 -0.18887 8.94351 3.98237 5.52925
25.3125 -2.54339 208.0765 0.1561 8.5294 4.0114 6.41048
25.6875 -2.48251 207.69944 -1.22544 7.58842 4.12515 5.43209
26.0625 -3.27376 207.80422 0.37668 8.07898 4.29615 6.1381
26.4375 -2.84853 207.81695 -0.4003 7.96844 4.49839 5.02539
26.8125 -2.27054 207.3431 -0.89512 7.56194 4.08744 4.90513
27.1875 -2.77535 206.71676 -0.19859 6.53801 4.36281 5.62539
27.5625 -3.14245 204.27068 -1.03079 7.05958 4.76067 5.98187
27.9375 -3.23759 205.8818 0.73597 7.74811 4.15159 4.77913
28.3125 -0.988 205.52251 -0.14096 6.58884 3.74584 4.8228
28.6875 -4.47287 204.10043 0.10511 6.07848 4.1684 4.73368
29.0625 -2.64069 203.21016 -0.20791 5.47531 3.55111 5.32969
29.4375 -1.79861 203.83607 0.26922 5.37759 3.76726 4.72988
29.8125 -1.93709 203.88121 0.16465 5.92387 4.00975 4.30694
