0.120000 2.144460
0.380000 1.355040
0.620000 2.214080
0.880000 -1.560300
1.120000 1.680670
1.380000 1.857860
1.620000 3.048080
1.880000 1.832780
2.120000 2.537020
2.380000 1.113450
2.620000 2.943870
2.880000 1.818460
3.120000 0.797870
3.380000 1.512970
3.620000 1.840810
3.880000 1.268160
4.120000 1.393680
4.380000 0.792300
4.620000 0.897740
4.880000 -0.556650
5.120000 -0.116070
5.380000 -0.907950
5.620000 -0.705420
5.880000 -1.519180
6.120000 3.033480
6.380000 -0.635700
6.620000 2.207280
6.880000 -2.631270
7.120000 2.498760
7.380000 2.548950
7.620000 2.169740
7.880000 0.809110
8.120000 0.950660
8.380000 1.568570
8.620000 0.371480
8.880000 1.332810
9.120000 0.742110
9.380000 0.132050
9.620000 -0.415030
9.880000 0.973590
10.120000 1.643610
10.380000 0.678360
10.620000 1.228910
10.880000 1.584010
11.120000 0.327640
11.380000 0.579610
11.620000 -0.068780
11.880000 -0.750560
12.120000 0.011430
12.380000 0.178290
12.620000 0.234220
12.880000 -2.291160
13.120000 -0.284000
13.380000 -2.929690
13.620000 -2.970080
13.880000 -2.368780
14.120000 1.223560
14.380000 -0.112600
14.620000 1.239510
14.880000 0.716190
15.120000 0.395140
15.380000 -0.220840
15.620000 0.897260
15.880000 -0.131210
16.120000 0.131550
16.380000 -1.588030
16.620000 1.040790
16.880000 -0.382710
17.120000 -0.795060
17.380000 -0.176950
17.620000 -1.394540
17.880000 -2.406330
18.120000 -2.364610
18.380000 0.224510
18.620000 1.704030
18.880000 2.681310
19.120000 -2.947780
19.380000 2.568240
19.620000 -2.414760
19.880000 -1.314110
