0.125 0.000 -0.001 0.003
0.375 0.000 0.003 0.041
0.625 0.007 -0.001 0.202
0.875 -0.005 -0.012 0.571
1.125 0.003 0.004 1.151
1.375 -0.011 0.014 1.993
1.625 -0.010 -0.026 3.075
1.875 0.018 0.010 4.195
2.125 -0.011 0.007 5.549
2.375 0.017 -0.010 7.064
2.625 0.010 0.012 8.591
2.875 0.029 0.019 9.984
3.125 0.012 0.046 11.533
3.375 -0.028 0.012 13.339
3.625 0.033 -0.010 15.078
3.875 0.029 0.028 16.906
4.125 0.093 -0.006 18.373
4.375 0.057 0.013 20.184
4.625 0.114 0.063 21.120
4.875 0.113 0.053 22.641
5.125 0.147 0.067 23.670
5.375 0.173 0.098 24.075
5.625 0.152 0.096 24.554
5.875 0.182 0.103 24.701
6.125 0.134 0.135 25.133
6.375 0.107 0.130 25.008
6.625 0.093 0.207 25.226
6.875 0.114 0.141 25.009
7.125 0.096 0.158 25.233
7.375 0.032 0.148 25.468
7.625 0.043 0.185 26.231
7.875 -0.007 0.109 25.402
8.125 -0.005 0.189 25.438
8.375 -0.023 0.191 25.492
8.625 -0.043 0.122 24.951
8.875 -0.025 0.132 24.662
9.125 -0.075 0.117 23.903
9.375 -0.023 0.027 22.556
9.625 -0.065 0.073 22.189
9.875 -0.022 0.049 21.768
10.125 -0.020 0.027 21.440
10.375 -0.023 0.055 21.330
10.625 -0.044 0.014 20.583
10.875 -0.005 0.048 20.705
11.125 -0.001 -0.001 20.400
11.375 0.006 0.054 20.216
11.625 -0.009 0.060 19.630
11.875 -0.025 0.089 19.348
12.125 -0.026 0.078 18.674
12.375 -0.021 0.032 18.226
12.625 -0.020 0.060 17.294
12.875 -0.050 0.016 16.480
13.125 -0.029 0.082 15.584
13.375 -0.011 0.049 14.952
13.625 -0.038 0.040 15.094
13.875 -0.035 0.062 14.778
14.125 -0.060 0.035 14.211
14.375 -0.032 0.057 13.780
14.625 -0.026 0.009 12.706
14.875 -0.031 0.048 11.471
