0.05000 -10399.77133 -491.03245 -2085.01764 16261.35132 13755.30184 21728.95488
0.15000 -22889.72521 194.57211 -1685.80280 14673.65046 14862.45099 26147.23517
0.25000 -25726.16350 -207.40972 -817.43273 14343.03779 9740.29847 27818.23612
0.35000 -26903.95861 56.78279 -213.13453 11420.22715 10651.22785 27948.54484
0.45000 -26875.06244 -215.94165 605.72393 12517.35204 8887.86591 25952.60620
0.55000 -25252.48069 -25.06380 583.09524 8519.68007 8186.50455 23487.06597
0.65000 -23715.94993 -125.18764 -864.73891 7228.86582 6368.98052 20575.10644
0.75000 -22390.80432 118.41874 118.29132 6471.33701 5455.49511 17983.48755
0.85000 -20871.29349 -69.07701 -279.09970 5615.89620 5925.06579 16857.36277
0.95000 -19692.27234 113.68546 482.43159 5948.11034 4902.98670 15127.70974
1.05000 -18737.61570 -89.44959 -54.06093 4469.43792 4474.58833 13668.36246
1.15000 -17569.75752 47.20682 -267.24707 4116.74162 3948.50981 12645.16619
1.25000 -16671.53279 29.18958 -188.30038 3992.80719 6004.27009 11741.64595
1.35000 -15907.23834 -45.85073 -252.62217 5053.36817 3665.93953 11504.91294
1.45000 -15279.03874 -53.10564 25.88820 3822.22488 3906.21207 10222.15735
1.55000 -14590.30712 71.46795 463.79819 3237.05773 3241.18944 9792.62467
1.65000 -13994.68802 87.32250 -194.58090 2811.90849 3102.09736 9226.62186
1.75000 -13496.82334 6.68397 373.50521 2332.22130 3098.72626 8426.54157
1.85000 -12936.34991 197.95748 215.37309 2599.51478 3038.12717 8040.77535
1.95000 -12559.70390 66.08538 421.76687 2232.29956 2663.03871 7498.01132
2.05000 -12161.81769 30.42262 -82.07778 2269.55684 2811.16905 7061.60589
2.15000 -11732.97048 -16.17433 12.70893 1763.28432 2409.18065 6765.03134
2.25000 -11309.07729 -56.65675 -36.51256 2345.24574 2391.99603 6855.96603
2.35000 -11006.83695 28.21330 46.49794 1547.16723 2240.45144 6080.60646
2.45000 -10683.97666 79.63797 80.35560 1459.12324 2235.61341 5733.72673
2.55000 -10457.23416 -42.53890 201.37053 1627.89784 2052.79436 5473.78225
2.65000 -10141.88821 -4.85993 -8.21542 1219.72423 1942.67565 5274.25702
2.75000 -9994.77367 -8.46169 114.65656 3818.68102 2504.27486 5379.12218
2.85000 -9730.28985 19.98412 65.23775 1309.31515 2332.78448 6124.88148
2.95000 -9572.89010 -110.22134 -54.96323 1181.58734 1845.81128 4566.50096
3.05000 -9383.44239 -125.02643 34.97040 1103.66969 3865.71071 4599.15458
3.15000 -9271.05577 -31.65069 83.63039 1422.14323 1906.23156 4240.83278
3.25000 -9124.30333 -118.30661 173.38163 1097.88649 2172.81123 4037.45536
3.35000 -8941.57746 7.57353 157.29592 1015.05026 1564.76931 3891.59948
3.45000 -8838.19781 -30.39357 93.15696 972.60454 1499.18363 3717.09029
3.55000 -8656.69601 -8.28935 50.14189 996.96166 1473.74194 3625.43649
3.65000 -8610.51798 -53.28733 116.06938 1276.54955 1483.87182 3592.58538
3.75000 -8484.36835 -7.02894 143.32936 1033.87943 1335.93022 3445.38938
3.85000 -8362.84868 -49.48749 120.32034 3746.38047 1489.36396 3476.85041
3.95000 -8283.76444 -36.65758 3.13525 985.40757 1258.69137 3192.50522
4.05000 -8192.41692 -18.57477 -28.94653 831.87272 1121.68101 3075.93452
4.15000 -8154.40766 -7.52163 150.27725 1190.04277 1536.74480 3079.02644
4.25000 -8038.46909 -6.64073 -34.88268 878.80591 1146.57941 2897.39472
4.35000 -8007.47738 -121.33732 164.99435 1093.26502 6809.33616 4918.48632
4.45000 -7930.90561 -27.70153 -19.50259 1084.40964 1153.90167 2701.23265
4.55000 -7807.88222 13.78132 -19.59595 1929.33064 1207.17783 2597.54569
4.65000 -7717.61093 3.37175 -1.86261 1071.02076 945.51672 2474.58084
4.75000 -7620.27250 9.37416 4.96116 888.83305 872.91532 2403.36470
4.85000 -7640.26120 14.90350 183.15868 2512.05387 1382.19772 4183.04548
4.95000 -7487.20744 12.17671 80.70049 925.15944 782.06626 2285.04299
5.05000 -7392.25666 51.22370 54.62825 774.61476 678.64569 2138.93016
5.15000 -7310.40850 19.16449 66.35573 995.23028 844.42124 2087.62170
5.25000 -7220.86347 36.45904 61.16685 813.80825 623.06613 2017.03489
5.35000 -7129.82127 17.66276 62.67566 754.85405 634.75436 1967.24328
5.45000 -7058.45036 38.73976 -15.23040 766.41275 614.21009 1898.72907
5.55000 -6989.43334 -3.16690 -23.28428 871.54823 829.47172 1819.19892
5.65000 -6914.12922 53.95460 5.89838 769.76310 808.80485 1867.37077
5.75000 -6821.62726 45.76273 -26.18493 709.44439 622.85551 1748.00528
5.85000 -6747.03387 3.66551 -21.56868 718.02888 532.36577 1680.83952
5.95000 -6685.63003 11.39069 38.32661 618.56175 440.23148 1622.63136
6.05000 -6590.54666 7.04486 7.62217 597.42373 489.37042 1570.79121
6.15000 -6499.02911 54.51826 0.43869 745.46369 1005.49300 1530.59688
6.25000 -6428.73664 9.86423 68.33366 642.11279 431.37138 1498.48646
6.35000 -6325.78309 0.42048 13.80764 575.98954 537.50955 1558.82489
6.45000 -6283.47373 1.83090 83.42350 526.62467 891.02771 1638.82905
6.55000 -6197.91532 22.81903 25.96481 534.02704 561.95229 1423.67373
6.65000 -6105.05077 11.37902 -66.62997 649.58583 540.75945 1619.55602
6.75000 -6039.32620 -4.30347 -69.78097 552.99486 909.74026 1702.22171
6.85000 -5985.76766 12.89198 -37.45346 453.20435 340.15979 1282.09026
6.95000 -5930.34485 7.93314 -23.54078 588.77660 615.99227 1277.05674
7.05000 -5873.31531 11.00104 -25.73054 469.69048 350.54924 1175.39172
7.15000 -5804.64518 7.95034 -35.86737 472.56836 975.85677 1553.29940
7.25000 -5749.13561 17.08593 -63.62371 387.57617 268.94235 1141.05275
7.35000 -5691.80464 17.93268 -58.97966 418.92375 262.37647 1127.58721
7.45000 -5634.99784 11.78578 -70.73173 365.22664 339.49709 1094.92921
7.55000 -5596.89480 15.21419 -29.50136 376.51442 356.15439 990.18104
7.65000 -5524.52466 1.17423 -31.82914 372.38198 251.46228 1046.20800
7.75000 -5442.77020 -0.54393 -43.06352 372.75916 265.87931 1060.12068
7.85000 -5405.79422 13.87354 -57.57241 661.04238 441.46875 1140.31868
7.95000 -5333.99472 13.02215 -22.03231 356.08192 488.80573 1044.35307
8.05000 -5310.82886 0.95172 -26.03623 305.39984 242.46785 948.26827
8.15000 -5237.26772 1.23316 -29.93712 335.03723 351.86940 906.91325
8.25000 -5195.40577 -3.37922 -91.51075 1587.41120 1097.33470 971.80685
8.35000 -5129.80322 2.09781 -70.79880 397.77219 738.06166 903.74332
8.45000 -5057.10519 9.60858 -54.33754 789.89706 415.98317 906.30651
8.55000 -5036.04643 -3.53240 -43.91158 318.89512 187.47916 823.61643
8.65000 -5002.53427 1.95716 -79.54377 1205.42652 1354.28472 1311.82555
8.75000 -4964.34585 2.20490 -82.74966 287.68850 214.44829 835.80813
8.85000 -4904.57555 -4.22988 -110.46065 300.91633 283.16612 778.97828
8.95000 -4858.43851 8.42144 -79.16641 288.77529 196.85741 751.19649
9.05000 -4834.71271 -9.64104 -100.85484 415.88584 569.80976 795.19443
9.15000 -4800.47505 0.66017 -93.28000 941.63682 1698.96229 1079.42377
9.25000 -4752.45533 4.37725 -95.78730 1166.27115 1515.03610 1292.70446
9.35000 -4703.94450 8.71985 -59.34613 206.87116 161.10224 679.99794
9.45000 -4656.14309 7.94157 -25.46088 277.39080 188.12074 686.77283
9.55000 -4625.44349 13.86394 -80.58559 269.62943 191.62172 648.15513
9.65000 -4579.50239 3.38015 -99.38431 216.46158 245.84017 640.45501
9.75000 -4544.83823 7.51199 -94.51869 222.39701 203.09306 623.36098
9.85000 -4501.67593 3.08943 -76.08929 206.84476 165.37132 609.09155
9.95000 -4465.03121 2.59087 -69.47222 870.16771 644.96634 591.09956
10.05000 -4398.73868 6.46898 -74.22105 618.42517 426.16871 668.50181
10.15000 -4388.18508 11.23621 -93.29509 235.69844 160.11703 578.65255
10.25000 -4345.61015 -2.96849 -86.72400 168.59504 193.96834 574.64015
10.35000 -4296.39094 2.34523 -66.65340 182.78254 169.19125 559.49444
10.45000 -4244.90988 -1.03854 -74.58038 362.49093 361.91100 566.35364
10.55000 -4229.80217 6.58347 -70.39530 249.67093 193.19333 526.12792
10.65000 -4197.47103 -1.06978 -85.27651 133.34086 224.91665 506.51847
10.75000 -4152.77313 -0.22024 -30.60688 167.75642 141.96278 470.21541
10.85000 -4116.01111 2.92211 -53.90107 126.67699 167.84267 461.02699
10.95000 -4083.09728 10.09476 -59.73041 136.15488 137.68820 464.93380
11.05000 -4043.77917 5.88536 -56.31848 135.90901 158.46230 481.16409
11.15000 -4011.40577 1.95050 -54.86827 186.45816 144.12105 457.11495
11.25000 -3977.40296 14.76877 -52.25258 164.87865 174.28868 444.16856
11.35000 -3957.06080 6.20028 -69.19636 321.44411 158.97491 457.13579
11.45000 -3917.04662 11.77433 -86.63949 164.33559 169.41438 484.71182
11.55000 -3875.81959 8.00454 -55.97381 203.82106 157.72720 410.78635
11.65000 -3860.69535 0.05212 -47.43253 190.22916 309.54814 428.04667
11.75000 -3815.90493 9.69946 -56.24701 185.51771 190.86615 378.25935
11.85000 -3791.95689 -3.43534 -70.91665 120.50818 101.41744 390.53936
11.95000 -3756.92382 6.35370 -49.60983 165.35842 185.59127 386.11689
12.05000 -3719.16433 -0.84817 -35.95748 274.45835 233.64987 380.74840
12.15000 -3723.06278 0.12663 -55.20883 277.25367 166.48722 404.00324
12.25000 -3675.35120 -0.65933 -59.30486 121.66046 119.74567 364.12581
12.35000 -3649.17185 2.61149 -69.27985 112.08282 140.92416 342.87267
12.45000 -3621.46379 -2.36605 -58.11225 126.40063 163.66212 348.93312
12.55000 -3609.77015 -1.51668 -84.54628 99.29508 98.45409 319.66266
12.65000 -3574.48993 -0.80365 -74.80221 125.23325 117.71787 333.86562
12.75000 -3560.99941 5.49468 -59.08167 87.65342 96.31576 310.85345
12.85000 -3522.10253 2.04085 -59.47172 143.21111 103.14323 325.94314
12.95000 -3495.09491 -3.61883 -40.99708 131.00723 94.23457 306.00774
13.05000 -3429.79467 -1.82274 -0.54612 702.93678 154.63249 1688.02234
13.15000 -3430.79344 11.39902 -70.09730 121.22938 181.36907 301.90280
13.25000 -3421.35706 3.71106 -80.43426 119.83265 98.89698 287.12345
13.35000 -3382.78738 -2.41671 -64.03950 86.43660 79.56756 284.97751
13.45000 -3356.78356 -1.98523 -106.84091 108.96076 92.87315 289.86167
13.55000 -3329.41660 0.25128 -99.85092 102.92507 69.51244 272.12943
13.65000 -3308.21414 1.98881 -97.38704 111.85915 86.04495 264.17342
13.75000 -3269.74149 -13.94450 -76.76768 214.97762 118.57158 274.82851
13.85000 -3249.18844 -4.59097 -93.75887 82.36573 90.77122 244.50454
13.95000 -3232.62888 10.25107 -73.98166 98.64207 229.81221 268.94442
14.05000 -3204.84381 1.23279 -55.65457 115.99331 106.01061 266.35209
14.15000 -3181.56562 -6.43938 -105.11539 78.22333 81.16997 228.08598
14.25000 -3161.32108 3.59342 -78.66893 91.56451 74.09190 234.44381
14.35000 -3140.22989 8.57361 -83.30106 282.00304 172.26263 247.09252
14.45000 -3112.68609 1.45449 -97.75301 64.14703 90.16042 209.23792
14.55000 -3078.51857 2.34362 -89.34360 68.92411 52.13228 213.82835
14.65000 -3062.14189 -4.81422 -68.11671 78.50361 52.71726 208.46511
14.75000 -3032.20482 0.49100 -65.30622 79.05397 61.77553 233.00182
14.85000 -3005.19347 15.18621 -85.92506 127.59845 121.11827 266.78762
14.95000 -2999.68356 2.61566 -79.10614 100.92180 97.99133 216.83861
15.05000 -2975.70046 6.49775 -76.95673 64.23675 72.93496 183.76092
15.15000 -2958.76686 5.80595 -77.86806 79.29739 55.24797 198.75011
15.25000 -2940.65603 3.75349 -64.19624 68.73127 56.00421 195.30439
15.35000 -2899.10076 -10.12134 -85.16736 197.82114 179.58895 235.97013
15.45000 -2895.87148 0.17273 -60.44122 63.62140 86.11823 195.55323
15.55000 -2872.97008 5.65401 -81.11852 56.42852 73.39389 219.65220
15.65000 -2850.39911 1.45808 -55.09371 63.90621 59.71583 189.57853
15.75000 -2838.64147 -0.02358 -49.62955 54.91884 76.53591 186.91088
15.85000 -2814.74283 -2.23114 -49.19881 67.42365 91.58582 199.24993
15.95000 -2800.05896 1.41239 -42.47471 101.79468 88.79261 166.73889
16.05000 -2784.88503 -8.16568 -44.78948 106.24059 114.38059 209.23074
16.15000 -2766.01794 -2.73809 -84.32917 66.89481 46.52568 173.02073
16.25000 -2735.70847 -3.58362 -38.01643 73.55433 57.62122 177.44319
16.35000 -2729.68032 -7.66798 -62.31193 63.25295 124.30955 164.39355
16.45000 -2706.44350 -2.71331 -58.60686 62.25055 72.31872 174.06133
16.55000 -2698.23456 5.07537 -67.42534 76.87308 89.92185 162.36335
16.65000 -2675.85289 0.91151 -81.92285 67.33478 50.97482 144.37563
16.75000 -2655.80212 0.29540 -52.02902 82.74378 74.52019 175.99949
16.85000 -2643.16045 -1.08490 -59.69741 64.23376 54.19167 150.81534
16.95000 -2630.64744 7.54032 -66.09476 61.61528 66.14016 147.21995
17.05000 -2600.65036 2.39702 -45.62875 144.13824 49.25339 147.91519
17.15000 -2607.43229 9.50486 -47.72353 133.96250 108.93722 187.13442
17.25000 -2578.34901 -4.99194 -57.64124 71.46226 75.89820 164.50369
17.35000 -2568.22209 -13.00778 -61.75071 123.39380 175.68482 165.03215
17.45000 -2553.48718 21.17231 -67.70390 110.69006 268.83602 259.22802
17.55000 -2530.80756 7.31557 -61.72045 58.53999 99.39857 139.11529
17.65000 -2514.77290 26.98524 -109.05163 75.74190 232.88687 379.29141
17.75000 -2511.21100 -3.68321 -86.99064 48.87055 104.45426 140.38668
17.85000 -2489.86984 -8.26944 -48.29843 71.50691 75.55979 161.30542
17.95000 -2469.66460 -10.83910 -58.56749 52.62574 46.07431 151.25756
18.05000 -2453.45093 0.77156 -43.47264 55.91256 51.94395 123.42358
18.15000 -2447.40243 -0.28726 -83.72169 54.41949 42.35691 136.00415
18.25000 -2430.14635 6.91105 -55.97363 39.20706 44.06270 133.10924
18.35000 -2415.14008 -7.80543 -42.84080 43.76507 112.03971 139.77789
18.45000 -2398.17098 5.39960 -64.49171 69.78911 46.22074 129.74346
18.55000 -2374.99016 3.08080 -57.96667 33.69022 41.53223 119.49005
18.65000 -2367.84203 7.11173 -64.56905 46.61594 83.47729 129.84519
18.75000 -2358.44252 0.43869 -83.05915 61.49926 39.09610 136.67539
18.85000 -2342.13468 -2.70545 -77.12607 34.32039 29.35335 132.34468
18.95000 -2316.66929 6.41728 -82.60717 52.98979 57.25732 120.96670
19.05000 -2304.75863 -0.43572 -72.55209 39.14178 34.42509 102.75836
19.15000 -2290.41089 -6.64662 -79.49853 41.16027 30.80141 97.21261
19.25000 -2278.26419 6.71142 -89.53475 36.66408 32.34835 104.06786
19.35000 -2269.20485 -21.12611 -52.72173 46.74340 72.42738 111.74294
19.45000 -2240.03174 7.58424 -67.10508 107.06270 144.18485 178.52980
19.55000 -2254.89548 7.28794 -77.92556 125.79686 92.66094 122.29422
19.65000 -2239.61309 -5.77917 -71.49541 49.79763 58.05543 126.07863
19.75000 -2215.88533 -15.65659 -62.22847 62.43767 67.09366 129.59041
19.85000 -2209.23963 0.83526 -71.88093 47.69534 35.38738 84.86323
19.95000 -2186.28044 -9.28776 -47.66234 38.61803 39.75318 91.39265
