0.05000 873.53340
0.15000 1800.35093
0.25000 3006.37718
0.35000 3554.32495
0.45000 3924.00234
0.55000 4268.97464
0.65000 4436.06541
0.75000 4513.06013
0.85000 4850.43660
0.95000 4910.29267
1.05000 4993.15137
1.15000 4896.76728
1.25000 4934.28404
1.35000 4988.94477
1.45000 4875.82351
1.55000 4695.28628
1.65000 4674.82342
1.75000 4548.40596
1.85000 4574.13166
1.95000 4471.11077
2.05000 4369.77073
2.15000 4275.70624
2.25000 4186.85990
2.35000 4049.28642
2.45000 3969.97887
2.55000 3922.14725
2.65000 3836.20866
2.75000 3735.69170
2.85000 3617.22775
2.95000 3596.40776
3.05000 3461.53582
3.15000 3297.76733
3.25000 3239.34310
3.35000 3160.50717
3.45000 3071.03518
3.55000 3024.89309
3.65000 2961.52420
3.75000 2855.87789
3.85000 2809.23359
3.95000 2769.59164
4.05000 2681.50089
4.15000 2635.80685
4.25000 2572.64119
4.35000 2497.74083
4.45000 2442.64620
4.55000 2382.24140
4.65000 2320.83814
4.75000 2282.45669
4.85000 2214.12486
4.95000 2194.18039
5.05000 2120.74528
5.15000 2060.91387
5.25000 2023.18602
5.35000 1995.21975
5.45000 1947.75822
5.55000 1878.75422
5.65000 1857.45520
5.75000 1820.75170
5.85000 1754.15720
5.95000 1723.52697
6.05000 1700.66361
6.15000 1654.39309
6.25000 1604.87410
6.35000 1576.32049
6.45000 1528.74769
6.55000 1505.40253
6.65000 1468.52374
6.75000 1435.37063
6.85000 1406.68503
6.95000 1355.94320
7.05000 1352.13562
7.15000 1313.58469
7.25000 1267.91565
7.35000 1265.98998
7.45000 1216.43780
7.55000 1187.97418
7.65000 1157.16917
7.75000 1135.33716
7.85000 1124.18020
7.95000 1078.57083
8.05000 1045.95214
8.15000 1046.78779
8.25000 1008.97539
8.35000 986.88513
8.45000 976.11448
8.55000 928.38178
8.65000 935.08122
8.75000 903.71353
8.85000 869.32735
8.95000 874.77585
9.05000 840.97318
9.15000 817.54069
9.25000 813.24401
9.35000 786.16083
9.45000 773.15842
9.55000 761.36170
9.65000 740.82971
9.75000 718.85405
9.85000 696.33345
9.95000 689.04758
10.05000 684.33476
10.15000 662.85306
10.25000 658.13132
10.35000 648.47364
10.45000 630.02810
10.55000 622.30502
10.65000 617.30479
10.75000 582.27954
10.85000 588.13971
10.95000 563.78978
11.05000 559.29530
11.15000 535.60708
11.25000 529.03738
11.35000 522.84605
11.45000 514.40938
11.55000 505.19158
11.65000 495.58576
11.75000 489.43003
11.85000 474.63271
11.95000 474.54385
12.05000 459.20389
12.15000 455.59106
12.25000 454.66234
12.35000 442.44080
12.45000 435.79583
12.55000 426.03192
12.65000 419.58337
12.75000 412.77046
12.85000 409.29649
12.95000 397.24074
13.05000 391.38665
13.15000 374.06030
13.25000 374.29685
13.35000 366.48162
13.45000 356.06085
13.55000 355.62826
13.65000 349.00531
13.75000 340.68211
13.85000 339.98749
13.95000 322.23408
14.05000 314.68001
14.15000 311.08453
14.25000 302.70849
14.35000 297.44738
14.45000 286.54282
14.55000 285.61604
14.65000 271.89266
14.75000 271.90407
14.85000 267.33994
14.95000 257.56990
15.05000 249.02759
15.15000 251.95078
15.25000 232.13860
15.35000 232.06208
15.45000 233.83844
15.55000 222.20368
15.65000 223.49283
15.75000 217.41609
15.85000 206.82137
15.95000 205.77238
16.05000 204.92901
16.15000 201.38658
16.25000 198.60138
16.35000 188.31639
16.45000 194.54245
16.55000 189.75521
16.65000 185.75155
16.75000 183.51103
16.85000 171.54003
16.95000 173.30404
17.05000 175.60327
17.15000 161.45531
17.25000 168.47328
17.35000 164.98198
17.45000 158.54942
17.55000 150.92570
17.65000 153.27262
17.75000 141.73747
17.85000 147.17885
17.95000 139.45426
18.05000 138.38239
18.15000 137.06004
18.25000 136.76890
18.35000 134.01836
18.45000 127.58087
18.55000 130.16917
18.65000 119.23502
18.75000 122.68524
18.85000 123.51552
18.95000 115.45196
19.05000 117.75601
19.15000 117.31036
19.25000 115.56330
19.35000 116.53435
19.45000 107.61266
19.55000 109.51621
19.65000 110.37900
19.75000 109.67809
19.85000 104.73985
19.95000 109.37933
