0.12500 0.01245
0.37500 0.05553
0.62500 0.11459
0.87500 0.17050
1.12500 0.21752
1.37500 0.25993
1.62500 0.29692
1.87500 0.32274
2.12500 0.35015
2.37500 0.37407
2.62500 0.40548
2.87500 0.42907
3.12500 0.45112
3.37500 0.46237
3.62500 0.49570
3.87500 0.52035
4.12500 0.53327
4.37500 0.52603
4.62500 0.54497
4.87500 0.53866
5.12500 0.53646
5.37500 0.49401
5.62500 0.46461
5.87500 0.42795
6.12500 0.37224
6.37500 0.32644
6.62500 0.27860
6.87500 0.27277
7.12500 0.27728
7.37500 0.28737
7.62500 0.29210
7.87500 0.29741
8.12500 0.26938
8.37500 0.25492
8.62500 0.24440
8.87500 0.21044
9.12500 0.19334
9.37500 0.16927
9.62500 0.12865
9.87500 0.11332
10.12500 0.09657
10.37500 0.07673
10.62500 0.05489
10.87500 0.06040
11.12500 0.06859
11.37500 0.07130
11.62500 0.05646
11.87500 0.05178
12.12500 0.05502
12.37500 0.05063
12.62500 0.07583
12.87500 0.05570
13.12500 0.08549
13.37500 0.08716
13.62500 0.08787
13.87500 0.12499
14.12500 0.10018
14.37500 0.10860
14.62500 0.09328
14.87500 0.09534
