0.05000 -1290.00184 183.92380 -129756.38120 755.46647 884.53241 366211.26276
0.15000 -4017.15516 10.84588 36127.57268 3127.28191 2444.29118 419896.57358
0.25000 -5471.53464 -68.78180 -774.94855 3007.31293 2365.01237 383960.05507
0.35000 -6535.25944 -12.39785 20493.44444 2403.39739 1903.13080 539414.50381
0.45000 -7453.06619 -80.80014 38249.71332 2234.09850 2608.95209 327140.11291
0.55000 -7872.71719 -35.63113 -6058.07828 3103.50228 1863.14498 361688.08972
0.65000 -8154.89726 -60.91590 8815.64574 1823.65494 2239.84648 441020.06334
0.75000 -8324.81686 -71.36820 1476.49277 1955.86059 1329.69073 390845.35644
0.85000 -8511.08153 -52.00829 -14051.44125 1992.63585 1571.32415 298807.88951
0.95000 -8658.32809 -32.11152 5397.24788 2256.61178 1425.76760 304341.68472
1.05000 -8792.67321 67.15527 -4721.73016 2607.11055 1679.86575 279339.13105
1.15000 -8791.70197 -41.40230 5686.75093 2204.92578 1572.06096 282059.20178
1.25000 -8946.47036 -12.35674 -4225.93281 1777.14342 1390.26240 252065.79032
1.35000 -8844.36451 32.14655 13420.90288 2160.51926 1404.02360 280949.17105
1.45000 -8750.78053 34.07258 -4001.32791 1652.56997 1285.59141 253025.91415
1.55000 -8721.06170 29.35212 -4775.79238 1505.75170 1037.73204 238652.16242
1.65000 -8674.33472 12.77520 -6021.66825 1619.45688 1366.03692 261429.80915
1.75000 -8615.96595 -28.55098 -8562.56700 1375.79337 1282.26884 212551.24398
1.85000 -8662.41671 -34.77258 -824.36907 1538.55792 1313.30008 213586.76602
1.95000 -8674.54035 14.56181 2244.79978 1373.31336 1271.31268 208034.10810
2.05000 -8585.65515 4.24988 833.98099 949.83366 723.29518 213593.72982
2.15000 -8529.21820 -14.86755 -1944.97223 1038.07553 989.58085 209412.64980
2.25000 -8489.17364 51.72651 -4151.07605 1070.88441 1192.29718 191325.68770
2.35000 -8367.88527 3.48974 1912.54415 1490.31560 1376.51569 176368.22671
2.45000 -8414.30596 1.36578 -7135.76913 972.98614 1309.94976 183334.65116
2.55000 -8291.95078 -16.45539 -1491.42664 872.15145 843.67679 166331.20320
2.65000 -8253.74360 10.24742 -3612.86586 781.15898 632.54716 161784.62093
2.75000 -8182.77513 15.17331 543.09060 927.22852 754.76864 156621.70336
2.85000 -8102.15724 21.09181 -1153.30919 1287.41236 1099.92673 133407.43673
2.95000 -8061.00696 20.43660 -3022.14844 947.92472 785.73890 158183.28516
3.05000 -8013.40471 10.23520 2382.57669 1008.03750 785.17807 144541.18961
3.15000 -7962.82058 -9.08690 478.10362 705.86642 1324.23333 135714.41996
3.25000 -7900.34160 -4.78141 130.11546 694.80071 655.58261 119892.23066
3.35000 -7823.39231 0.29753 157.44857 707.39745 616.89322 114718.09926
3.45000 -7767.25487 1.79477 -127.55218 595.35449 534.49546 107074.59315
3.55000 -7677.98017 20.35936 -6105.66646 1305.10974 830.81425 110664.95657
3.65000 -7634.51364 30.54544 1709.63366 866.35673 863.41686 111093.88847
3.75000 -7571.54335 1.71227 207.66624 606.74682 519.15787 104493.96241
3.85000 -7482.21094 27.50638 1115.42097 1290.46021 1037.02622 103877.08937
3.95000 -7455.35557 -0.34302 1392.87137 722.92132 566.81242 98854.89357
4.05000 -7437.12423 -6.77455 1832.08806 635.87017 679.17422 141798.51351
4.15000 -7344.90890 3.09981 -318.22095 601.52534 542.89136 87582.47386
4.25000 -7321.30223 17.21611 1030.54260 632.57769 629.72700 88792.28874
4.35000 -7284.41385 -1.46698 1722.20847 708.12454 958.99886 81529.16116
4.45000 -7258.71335 8.11047 2075.54132 1019.97811 579.04649 81913.92304
4.55000 -7190.84977 13.73633 2199.06418 569.71025 455.28137 76016.97207
4.65000 -7118.64436 24.89288 -605.84590 577.96408 504.62742 85908.67364
4.75000 -7080.08744 7.15541 -1491.77817 635.65529 491.73029 83572.29350
4.85000 -7005.37166 -15.90836 2201.67946 606.36172 1125.14793 93100.93582
4.95000 -6957.18267 -3.20812 316.36265 457.93934 596.02246 71115.36670
5.05000 -6915.16432 18.08534 627.30289 457.74382 537.34750 65535.94855
5.15000 -6867.51917 2.98071 -1627.49703 460.93007 533.07680 72733.02003
5.25000 -6803.37865 18.09946 -400.82008 415.19678 532.14367 59314.41513
5.35000 -6725.15352 10.61660 691.80185 433.90734 550.50842 56000.91821
5.45000 -6665.30923 -3.07411 -669.60585 466.84916 630.14810 51552.88756
5.55000 -6598.61263 21.27807 -244.97401 575.50337 432.45498 70263.82495
5.65000 -6525.87177 9.25891 1052.43044 398.74855 375.85424 51110.72882
5.75000 -6444.04571 24.49270 2078.95636 706.34028 965.03956 55246.02677
5.85000 -6372.47724 2.34624 -800.12797 475.20464 495.86892 54102.11221
5.95000 -6334.48655 16.09574 97.10189 434.30853 386.06673 57971.05482
6.05000 -6279.63963 18.68023 -1317.85718 313.98602 329.84674 49709.46693
6.15000 -6243.02386 6.35400 160.87165 759.94931 923.91535 44046.25685
6.25000 -6149.86162 7.30755 1417.64099 366.70270 389.14948 41935.22244
6.35000 -6137.00007 42.23092 -44.28459 835.05858 1375.60493 44937.69112
6.45000 -6079.45115 17.57511 -1124.85809 387.24382 385.93345 44975.57431
6.55000 -6049.44281 17.53932 -804.93020 409.08930 405.89869 36871.68917
6.65000 -5983.39311 14.79512 -924.42535 312.76883 309.20707 36702.76637
6.75000 -5939.45094 12.00156 2150.72891 359.13045 464.08241 53714.03520
6.85000 -5895.01431 8.91488 903.22300 307.04510 306.88044 29906.83792
6.95000 -5858.83152 18.57198 1434.10095 427.47068 368.91646 35346.47250
7.05000 -5845.24046 8.59968 140.72122 358.00098 303.98735 29152.23394
7.15000 -5794.29223 11.68893 170.22730 345.02872 325.92287 35492.77658
7.25000 -5789.67475 24.23334 -573.39225 516.23096 680.17089 27643.00872
7.35000 -5755.87556 19.12935 565.78475 330.85277 339.78806 30627.35521
7.45000 -5710.24763 13.23502 738.86510 301.30221 320.74292 23470.84225
7.55000 -5658.19550 3.25883 16.81349 534.10130 515.39668 22870.65302
7.65000 -5626.03474 23.15048 1486.25240 383.41601 362.20788 35684.90469
7.75000 -5584.97380 2.55036 667.64338 741.47143 535.11648 26432.83420
7.85000 -5548.52250 6.05305 840.78103 280.00121 310.44576 29535.46755
7.95000 -5508.25683 11.90828 524.09773 299.01559 259.97553 23357.58721
8.05000 -5458.13161 15.33580 -603.12697 307.93227 294.07420 21694.81480
8.15000 -5421.11341 19.28508 706.00552 336.72933 306.05954 23917.40624
8.25000 -5356.58116 9.61682 410.50102 241.47262 263.02964 33429.83535
8.35000 -5322.31456 11.11953 578.53051 248.48549 221.76720 23832.47418
8.45000 -5253.42726 2.44252 295.79289 411.73091 263.86836 24520.00696
8.55000 -5211.80307 15.67004 198.25510 301.04616 264.93685 23598.60109
8.65000 -5167.48565 5.40060 -675.29701 245.64743 302.54039 24271.01057
8.75000 -5115.45498 8.47046 -208.28564 248.59805 275.37138 19579.11656
8.85000 -5073.87567 22.72713 -536.13280 240.90141 283.59932 26144.32990
8.95000 -5040.32630 9.25535 653.11265 190.79145 196.82958 19247.30415
9.05000 -4979.80044 10.54471 -486.39644 290.70044 247.28481 17375.73110
9.15000 -4926.44647 12.88201 505.53410 380.80843 227.97240 18828.99738
9.25000 -4880.08985 10.26635 421.77103 209.88483 237.11202 17705.64411
9.35000 -4829.80035 15.23206 -60.16588 268.94722 282.66822 16960.08031
9.45000 -4797.67749 4.33969 618.36674 217.44553 261.08619 20504.07870
9.55000 -4753.45503 -6.53489 246.06804 188.69230 336.61400 13949.02763
9.65000 -4715.60556 3.22820 -685.20649 296.90637 236.36331 19338.33963
9.75000 -4659.37306 12.30467 108.07860 413.40119 244.15907 13812.94516
9.85000 -4633.18603 -2.48505 126.78888 195.98930 247.35007 12515.86905
9.95000 -4585.99638 8.64579 22.54489 179.72858 179.43062 11816.92162
10.05000 -4534.78281 14.37709 416.11267 222.03280 190.82456 20301.14400
10.15000 -4503.19454 0.04812 1056.94873 209.37764 248.74796 12412.80816
10.25000 -4461.26982 6.79672 -322.90413 194.76665 205.66035 17131.87704
10.35000 -4420.42746 7.33307 -346.70763 269.00602 247.82404 12721.94630
10.45000 -4384.61335 9.69343 -178.82601 331.47964 306.82511 9945.10955
10.55000 -4338.64911 10.16415 -46.34368 159.45984 198.09194 12136.96867
10.65000 -4318.60701 -5.12711 -533.66619 237.54404 367.34939 13589.76587
10.75000 -4283.14646 16.59268 -229.52791 188.71947 228.64389 10579.96311
10.85000 -4247.46269 17.08800 310.87345 245.88307 244.28529 10541.36158
10.95000 -4215.93568 10.35678 -119.81352 204.14059 330.17290 10780.37697
11.05000 -4199.87901 5.85369 -690.88856 214.02642 258.94350 15643.65609
11.15000 -4169.51229 2.59955 289.95077 182.59418 176.89908 9887.47187
11.25000 -4148.47117 1.46233 91.68168 232.07031 272.38863 8862.84120
11.35000 -4122.11888 7.23156 -34.69461 267.82907 180.74105 8037.22089
11.45000 -4078.39676 6.91904 146.80235 203.26564 134.21216 8129.79765
11.55000 -4051.34058 -0.06411 -362.82276 191.85617 168.80511 9008.12040
11.65000 -3998.88704 -0.13756 501.14086 595.66624 268.38419 11031.72880
11.75000 -3991.93322 6.26038 184.05401 161.38662 188.75407 7570.65391
11.85000 -3969.07301 8.85189 -316.52537 176.76729 140.31722 7044.64312
11.95000 -3942.31879 7.49086 -103.54841 168.90140 153.51022 7877.75475
12.05000 -3907.23464 8.66401 -466.82133 146.56929 141.06629 8401.08353
12.15000 -3882.00470 10.63668 -10.29125 185.41759 156.75143 6451.04592
12.25000 -3859.56335 9.53717 210.83324 154.33155 167.39185 7669.34374
12.35000 -3832.31904 7.60393 210.36942 133.96623 124.90471 8946.74010
12.45000 -3796.34594 15.46401 26.02747 170.40124 179.91164 6789.40507
12.55000 -3770.40405 -3.22496 -27.38811 155.96022 285.37475 6525.23226
12.65000 -3756.27558 11.40237 -53.09047 258.92468 223.50793 7360.60083
12.75000 -3715.75806 8.91730 -230.18065 167.74050 148.05726 6199.10661
12.85000 -3691.45128 -1.09320 8.75205 119.75899 162.42671 7326.40730
12.95000 -3660.69603 6.48371 -275.00499 170.84704 368.52673 5002.86782
13.05000 -3637.26183 9.86542 225.68542 190.86056 128.71892 5152.69242
13.15000 -3610.72288 2.04281 -176.79675 111.06048 113.67258 5049.82560
13.25000 -3577.77154 9.67789 -46.10735 105.04679 98.20854 5155.21378
13.35000 -3546.62904 5.64246 250.75463 96.72079 91.85183 5914.16779
13.45000 -3527.26831 10.23442 -301.48154 103.25669 157.15880 7679.58973
13.55000 -3500.64145 9.74360 -82.07411 96.32392 117.56977 7145.23782
13.65000 -3470.16839 9.46151 261.95326 154.69041 201.65210 5782.83203
13.75000 -3436.87448 11.78188 -142.53083 240.22828 236.45178 8538.25525
13.85000 -3426.14155 -7.03303 75.38541 222.78696 158.53380 6520.37292
13.95000 -3393.63657 5.28233 -33.94016 128.06766 111.28474 5354.53580
14.05000 -3371.39890 -8.15764 124.90941 276.34274 212.16497 5415.57868
14.15000 -3334.22432 4.87427 -52.14634 101.12423 87.66209 3987.94084
14.25000 -3316.65380 11.85309 507.12734 97.91566 114.31980 6159.38627
14.35000 -3289.15527 12.16658 96.35435 148.61958 129.78053 4818.26956
14.45000 -3270.48957 7.77486 -118.88792 175.60498 134.89115 4295.13929
14.55000 -3254.37542 0.08124 -17.22505 101.80206 82.70957 3579.64706
14.65000 -3225.33656 0.15303 -461.20748 105.94076 131.42576 4223.51509
14.75000 -3203.12145 5.98212 -328.49339 96.41188 120.52621 5221.61608
14.85000 -3187.18061 -0.43032 281.01816 113.39550 123.97195 4653.88733
14.95000 -3172.25061 -4.68731 -281.93593 133.17245 136.34064 6084.72766
15.05000 -3147.03308 5.04540 -182.14644 106.60381 99.49348 4491.92101
15.15000 -3135.11737 6.20460 238.70478 126.01511 81.21011 3760.79641
15.25000 -3116.58434 5.06595 -54.21941 81.95657 116.74864 4858.06192
15.35000 -3092.24998 14.24416 -26.08758 96.20015 229.74799 3279.94044
15.45000 -3075.25998 5.25914 143.65467 73.61537 68.44254 3649.81094
15.55000 -3049.93441 3.53808 345.04236 114.13553 76.97390 5656.44129
15.65000 -3035.67760 2.88106 134.17059 75.68314 95.61939 2463.30917
15.75000 -3016.68923 6.60597 -0.59160 76.76636 75.34469 2904.74153
15.85000 -3001.61650 6.37889 -43.60942 97.99890 102.92626 3271.67331
15.95000 -2967.22611 -3.27088 -25.06370 201.86468 129.88386 4392.54926
16.05000 -2956.68364 8.88564 -55.58531 114.48164 93.70870 3381.58096
16.15000 -2950.66026 12.51804 315.53574 178.82735 171.12071 2700.81841
16.25000 -2906.23562 2.45227 26.16379 228.95547 138.66783 2997.19959
16.35000 -2900.83989 4.60659 94.77455 81.90994 90.17727 3269.88038
16.45000 -2883.79735 5.50251 32.89594 103.82651 87.49240 2825.71418
16.55000 -2853.14196 8.79884 200.90694 152.33119 84.49454 2332.69911
16.65000 -2855.62620 -1.27456 82.34752 74.64406 85.11389 3545.70720
16.75000 -2834.03368 6.02865 55.91272 82.11302 72.42899 2527.44744
16.85000 -2797.39217 10.27156 -28.74686 143.65334 110.97258 3408.24198
16.95000 -2765.63225 11.92657 -19.85574 190.75481 121.88570 2791.61397
17.05000 -2770.74223 5.80376 -211.58961 129.85684 67.15240 2276.85504
17.15000 -2757.00836 -1.86512 10.17676 146.51448 80.35367 2139.88738
17.25000 -2738.58857 -4.28610 -151.74441 56.00032 175.14742 1710.97199
17.35000 -2719.67061 8.78606 -39.05821 62.39651 72.62361 2625.56970
17.45000 -2701.36534 3.52192 -98.94373 132.68241 130.05122 1567.36957
17.55000 -2691.83740 4.61066 -26.23002 101.87114 78.91125 1725.44420
17.65000 -2674.37934 6.57917 7.34613 69.49972 73.46716 1906.70770
17.75000 -2649.90695 7.55109 199.03127 101.37533 126.81703 1749.45014
17.85000 -2642.30876 14.42327 58.23566 92.66485 112.35089 1448.59898
17.95000 -2621.22502 1.03635 -91.95394 83.35918 58.23017 1868.15023
18.05000 -2586.31129 -2.75451 176.08896 281.81268 118.20815 3302.62151
18.15000 -2585.53353 2.06559 -240.88313 39.76142 44.39890 2044.40444
18.25000 -2565.00343 4.89885 -56.63083 54.82842 43.27039 1583.46708
18.35000 -2546.94132 5.66057 -270.58420 341.81750 140.23435 2513.25992
18.45000 -2534.88313 4.98006 -206.91309 63.97404 57.69938 1958.81406
18.55000 -2515.28622 3.44228 16.84279 52.28016 65.58560 1922.27628
18.65000 -2504.38583 -2.60793 63.30085 82.54946 132.81856 1015.98104
18.75000 -2485.39887 4.69347 -6.46881 62.60252 50.75173 1494.08575
18.85000 -2464.27148 4.42933 -205.97261 83.17879 138.82374 1466.23495
18.95000 -2452.87555 4.85078 -108.91184 59.29293 53.49774 873.34292
19.05000 -2444.01156 0.55165 30.56697 44.37858 43.71458 988.89078
19.15000 -2431.04760 5.54122 113.56585 48.05210 52.28986 1708.35585
19.25000 -2398.68222 1.69044 -124.45749 84.65912 51.34330 1629.83491
19.35000 -2389.57415 1.20958 75.73624 131.12268 46.75469 1342.40206
19.45000 -2382.35669 7.90266 -103.39437 47.65631 52.74377 1121.34222
19.55000 -2379.83769 5.46261 -19.18716 69.98851 59.72843 1238.71113
19.65000 -2353.06883 4.92025 52.36273 48.09616 67.40569 674.01809
19.75000 -2340.50509 9.30159 -154.83937 55.87251 69.27143 1549.74097
19.85000 -2327.04696 2.49133 -37.59052 46.85899 67.04235 1677.67508
19.95000 -2318.01830 -0.36485 -124.50533 57.21576 40.55193 795.46621
