0.12500 0.00821
0.37500 0.01815
0.62500 0.04773
0.87500 0.05967
1.12500 0.09138
1.37500 0.12269
1.62500 0.17842
1.87500 0.21220
2.12500 0.25338
2.37500 0.29145
2.62500 0.29682
2.87500 0.31580
3.12500 0.31068
3.37500 0.30799
3.62500 0.29812
3.87500 0.29746
4.12500 0.28582
4.37500 0.27257
4.62500 0.25614
4.87500 0.23066
5.12500 0.21116
5.37500 0.19826
5.62500 0.16961
5.87500 0.15295
6.12500 0.12739
6.37500 0.09592
6.62500 0.08096
6.87500 0.05882
7.12500 0.03719
7.37500 0.02589
7.62500 0.03925
7.87500 0.03557
8.12500 0.05034
8.37500 0.05055
8.62500 0.05916
8.87500 0.07042
9.12500 0.07537
9.37500 0.05571
9.62500 0.07058
9.87500 0.06743
10.12500 0.07541
10.37500 0.07457
10.62500 0.08371
10.87500 0.07774
11.12500 0.05807
11.37500 0.04424
11.62500 0.03359
11.87500 0.01523
12.12500 0.01875
12.37500 0.01734
12.62500 0.04418
12.87500 0.05459
13.12500 0.06817
13.37500 0.08194
13.62500 0.07768
13.87500 0.07025
14.12500 0.08844
14.37500 0.07101
14.62500 0.07604
14.87500 0.06946
