0.120000 2.459440
0.380000 -2.883630
0.620000 1.149310
0.880000 -0.102240
1.120000 -0.024170
1.380000 -0.055660
1.620000 0.175170
1.880000 0.069430
2.120000 -0.275790
2.380000 -0.575560
2.620000 -0.614970
2.880000 -0.611610
3.120000 -0.701370
3.380000 -0.589930
3.620000 -0.679430
3.880000 -0.919500
4.120000 -0.639070
4.380000 -1.207910
4.620000 -1.629550
4.880000 -1.772090
5.120000 2.317100
5.380000 -2.727280
5.620000 1.929550
5.880000 -0.638210
6.120000 -0.576250
6.380000 -0.757730
6.620000 -1.003790
6.880000 -1.354260
7.120000 -1.854980
7.380000 -1.667620
7.620000 -1.581490
7.880000 -1.821220
8.120000 -2.233200
8.380000 3.034810
8.620000 3.075360
8.880000 2.271960
9.120000 2.308300
9.380000 2.740180
9.620000 1.937780
9.880000 2.835820
10.120000 2.145130
10.380000 0.036640
10.620000 1.779770
10.880000 0.879930
11.120000 0.441950
11.380000 -0.284050
11.620000 0.306940
11.880000 0.166170
12.120000 -0.507290
12.380000 -0.810140
12.620000 -0.163140
12.880000 -0.751450
13.120000 -1.017480
13.380000 -3.099560
13.620000 -1.147570
13.880000 -1.823520
14.120000 0.134120
14.380000 -2.890280
14.620000 2.676260
14.880000 2.159650
15.120000 1.703400
15.380000 -2.710000
15.620000 -3.027090
15.880000 0.717740
16.120000 2.062720
16.380000 0.623770
16.620000 -0.773150
16.880000 0.375340
17.120000 -0.388140
17.380000 -0.129970
17.620000 0.128460
17.880000 -1.314950
18.120000 0.938120
18.380000 0.083390
18.620000 0.188280
18.880000 -1.217040
19.120000 -2.111040
19.380000 -0.254930
19.620000 -2.173740
19.880000 -2.508760
