0.120000 0.608850
0.380000 0.779860
0.620000 0.991160
0.880000 0.962000
1.120000 0.985060
1.380000 1.038200
1.620000 1.065930
1.880000 1.035510
2.120000 1.017930
2.380000 0.987120
2.620000 1.001690
2.880000 0.998230
3.120000 1.018180
3.380000 0.971640
3.620000 1.001290
3.880000 0.960570
4.120000 0.934900
4.380000 0.899400
4.620000 0.876970
4.880000 0.824850
5.120000 0.714270
5.380000 0.671060
5.620000 0.560160
5.880000 0.506680
6.120000 0.469790
6.380000 0.381550
6.620000 0.206300
6.880000 0.144720
7.120000 0.000530
7.380000 0.085950
7.620000 -0.100820
7.880000 -0.071250
8.120000 0.088880
8.380000 -0.111330
8.620000 0.043190
8.880000 0.583660
9.120000 -1.180630
9.380000 -0.203350
9.620000 0.129100
9.880000 0.201720
10.120000 1.390570
10.380000 1.772820
10.620000 1.308790
10.880000 1.213520
11.120000 1.067720
11.380000 1.099360
11.620000 0.960740
11.880000 1.068030
12.120000 1.457670
12.380000 1.785440
12.620000 2.010840
12.880000 2.382140
13.120000 2.300020
13.380000 2.272830
13.620000 2.440090
13.880000 2.807850
14.120000 2.781470
14.380000 -2.152490
14.620000 -2.623030
14.880000 -1.690140
