0.15 -2.3259 14.82603 -0.44742 66.17486 69.11016 69.70895
0.45 0.74122 27.74201 1.14979 67.1425 67.59592 67.58761
0.75 0.4739 45.13401 -1.38212 65.13819 65.16257 66.37519
1.05 -0.28119 61.86264 -0.31773 63.5376 64.17216 63.57247
1.35 0.58649 75.91688 -0.61427 61.69463 62.73552 61.15194
1.65 1.66192 89.39341 -1.55409 60.33897 60.50982 58.53613
1.95 1.91547 100.06377 -1.19061 58.81559 57.96507 57.3874
2.25 1.91708 111.03904 -0.27728 57.76861 56.89212 56.1861
2.55 2.75338 119.565 -0.75361 55.53949 55.04161 54.15091
2.85 3.0156 126.53753 -0.28774 55.46806 53.85862 52.20352
3.15 3.07295 135.06585 0.05738 53.54147 51.71068 50.42471
3.45 3.42126 141.69881 0.23336 52.35074 49.55162 48.58436
3.75 1.92761 148.48609 0.34046 50.7275 47.39162 47.16179
4.05 2.06225 154.63657 -0.83966 49.60582 45.93358 45.47529
4.35 1.33991 158.81688 -0.08646 48.08472 44.45859 43.7475
4.65 0.67096 164.67094 -0.16453 46.52602 41.83809 42.52478
4.95 0.65592 168.72533 -0.19267 45.11236 40.39817 41.2086
5.25 0.57381 174.15318 0.30639 44.04981 38.96707 39.42091
5.55 1.32379 177.68433 -0.27576 42.44393 36.5773 38.30194
5.85 1.05659 180.14587 0.2213 41.66374 35.39493 37.67394
6.15 1.11837 182.88606 -0.18354 40.8075 33.62954 35.92592
6.45 1.18696 185.03133 0.09732 39.79593 32.83297 34.79376
6.75 0.8242 187.78233 0.02093 38.40851 32.46664 33.6258
7.05 0.35805 190.63195 0.0401 37.29488 31.49245 32.42604
7.35 -0.26282 192.70371 0.75796 36.19606 29.58315 31.30321
7.65 -0.35063 193.65752 0.62872 35.17684 28.19798 30.50973
7.95 -0.45353 194.41832 0.90996 35.17643 27.22416 29.31278
8.25 -1.08125 196.04305 1.12086 33.83948 26.36804 28.67972
8.55 -1.46993 198.25908 0.92056 32.68511 26.06709 28.02984
8.85 -1.03658 200.25015 1.11786 31.69129 25.57883 26.63283
9.15 -0.93177 202.07241 1.06371 30.34349 25.0102 25.80588
9.45 -0.00784 203.76087 1.02806 29.9841 23.64284 24.98555
9.75 0.83573 204.68627 0.59764 28.85379 22.99322 24.08599
10.05 0.57625 205.11668 0.72984 28.40944 22.45869 23.37095
10.35 0.50898 205.65697 0.07051 27.47439 22.00311 22.9491
10.65 -0.10471 205.88901 -0.26086 27.29082 21.51044 22.27207
10.95 -1.09157 205.91181 -0.2509 26.84143 20.09543 21.72469
11.25 -2.07893 206.07913 -0.58265 26.4546 19.08564 21.11105
11.55 -3.62901 205.69406 -0.60955 25.7267 18.28084 20.60246
11.85 -4.30485 205.92564 -0.91278 24.86082 17.30607 20.06808
12.15 -4.25438 205.67173 -0.60234 24.58303 17.28556 19.54753
12.45 -3.9065 205.64883 -0.64589 23.33231 17.14859 18.43394
12.75 -3.6967 206.0975 -0.00707 22.65034 16.51512 17.68886
13.05 -2.99834 205.96331 0.18354 21.35437 16.10275 17.39217
13.35 -2.28967 206.1643 0.50124 20.75273 15.37386 16.89578
13.65 -2.0529 206.09858 1.00493 20.22966 14.91309 16.05237
13.95 -2.26823 205.77356 1.21206 19.31482 14.98074 15.80941
14.25 -1.91414 206.88596 0.62909 19.0166 14.47342 15.37099
14.55 -2.01162 206.94826 0.76988 18.86961 14.02123 15.18165
14.85 -0.84406 207.82145 0.5152 18.75869 14.36722 14.75847
15.15 0.6285 208.71016 0.13521 18.42768 13.94975 14.44159
15.45 2.06919 208.27235 -0.79022 18.32853 14.02528 14.54534
15.75 3.04162 208.36153 -0.57553 18.70784 13.60893 13.86232
16.05 4.10113 207.82395 -0.76254 18.46572 13.52258 13.73021
16.35 4.61706 206.9627 -0.72566 18.2525 13.70901 13.46866
16.65 4.0075 206.3415 -0.93704 17.60019 14.02135 13.27318
16.95 3.35332 206.17578 -0.74387 17.15424 14.34512 13.16605
17.25 2.6136 206.63656 -0.6614 16.6487 14.3826 12.33051
17.55 1.07748 207.14769 -0.22153 15.76005 14.13383 11.87912
17.85 0.96253 207.5335 0.16436 14.68755 13.64359 11.76049
18.15 0.61503 208.20721 0.76368 14.42816 12.67514 11.14003
18.45 0.05725 209.25738 0.81093 13.0813 11.17775 10.65648
18.75 0.46091 208.85147 0.91403 13.55651 11.62716 10.23525
19.05 0.48275 209.41084 1.33309 14.23719 11.28038 10.20445
19.35 0.30212 209.80469 1.09366 13.43174 9.68662 9.64809
19.65 -0.50281 209.87074 0.64155 13.62291 8.63796 9.4572
19.95 -0.96858 209.43481 1.10933 14.05588 8.13798 9.38084
20.25 -2.583 210.06488 0.46958 12.99793 7.50443 9.2691
20.55 -3.342 210.11158 0.33435 12.20331 6.81122 8.74096
20.85 -4.25224 209.6389 0.2727 11.55208 7.09171 8.84961
21.15 -5.19673 209.28224 0.65257 11.09467 6.70458 9.09876
21.45 -6.50926 208.6764 -0.04128 10.86504 6.52934 8.37462
21.75 -6.76198 208.14309 -0.33639 10.29967 6.63388 8.82077
22.05 -7.39299 207.11659 -0.3381 9.94756 6.51804 8.27734
22.35 -7.08797 206.93248 -0.0382 9.29993 6.58034 8.21288
22.65 -7.18293 206.09513 -0.35966 9.44142 6.47226 8.16196
22.95 -6.85276 205.39911 -0.10244 8.57349 6.56192 8.11224
23.25 -7.82239 203.95115 -0.48558 9.06633 6.49616 7.37423
23.55 -6.89995 203.2104 -0.64491 8.62033 6.67368 7.25831
23.85 -6.98353 202.96714 -1.05863 7.73226 6.65 7.52253
24.15 -6.51139 202.59694 -1.17999 7.98643 6.56692 7.1329
24.45 -5.75909 202.25191 -1.35067 7.60336 6.48479 7.12073
24.75 -4.9025 201.45303 -1.35084 7.8107 6.30929 6.53951
25.05 -5.08679 201.19158 -0.78133 7.59585 6.67268 6.69785
25.35 -3.56611 200.5109 -0.6811 7.7154 6.69855 6.74712
25.65 -3.4562 199.7701 -1.02491 7.64373 6.14745 6.50951
25.95 -3.92597 199.31704 -1.26812 8.03215 6.07991 6.27188
26.25 -3.09585 200.13382 -0.9547 7.93231 6.08067 6.16312
26.55 -1.77817 199.22356 -1.21817 7.74821 5.70596 6.56253
26.85 -1.29637 199.28292 -1.29924 8.3533 6.13121 6.34308
27.15 -0.37343 199.21974 -1.40052 8.47861 5.5251 6.25793
27.45 -0.27693 198.81093 -0.59726 8.87059 5.6487 6.14154
27.75 1.46503 199.1046 -0.66241 9.26244 5.42252 5.64842
28.05 1.10194 199.45125 -1.1164 9.14919 4.96127 5.52293
28.35 1.79579 199.04433 -1.04357 8.55987 5.20595 5.81543
28.65 1.75165 198.70262 -0.90973 8.40178 4.80488 5.54976
28.95 1.95269 199.17888 -1.27307 8.34675 4.78745 5.19036
29.25 2.02389 199.20036 -0.51913 8.37653 4.10175 5.81654
29.55 2.59451 199.06243 -1.06443 8.37567 4.92219 5.68006
29.85 2.58928 198.72821 -1.3286 7.68343 4.59035 5.61555
