0.05000 -1936.20652 12.72490 -106436.96805 1253.84536 1866.35019 299443.12895
0.15000 -3885.48124 43.37602 28392.48744 1725.06079 1787.43121 353024.91530
0.25000 -5277.65867 89.23911 3622.51990 1327.98025 1392.22434 406710.30229
0.35000 -6006.98645 40.90612 -18557.70509 1405.21500 1230.68352 396123.42234
0.45000 -6802.07121 28.60657 -13508.87232 1576.36258 1101.66259 413675.43490
0.55000 -7198.50970 46.50481 2712.82133 1585.44756 990.64186 437968.03401
0.65000 -7637.02143 21.24436 -4808.06325 1560.88890 863.43032 342244.44852
0.75000 -7800.15679 49.79635 -15828.84414 1569.75822 799.75552 312924.12994
0.85000 -7982.61723 49.27846 497.80807 1476.71675 729.81147 307546.78054
0.95000 -8162.59375 43.94346 -6588.80458 1452.11075 730.46822 312048.44467
1.05000 -8312.78687 22.49446 4494.92117 1361.04016 653.07641 307779.92976
1.15000 -8363.36104 59.55167 -958.76422 1323.82776 637.65630 255682.63330
1.25000 -8379.08434 44.23858 -3375.90016 1275.97805 588.82488 239723.52554
1.35000 -8336.22752 45.47052 1089.81278 1226.97723 563.99362 246734.52551
1.45000 -8341.34041 42.88644 -1903.02091 1153.55553 571.75537 222704.25891
1.55000 -8383.54950 39.94368 -3368.44104 1098.91387 538.91543 231514.91782
1.65000 -8366.63854 43.11759 -793.21451 1010.03482 552.66758 222572.43842
1.75000 -8337.73639 42.33385 -4080.98792 960.38899 520.78896 223152.96085
1.85000 -8276.03709 42.25858 -523.19911 893.07172 500.91857 190340.77217
1.95000 -8240.58432 47.46245 -1374.85669 863.32196 486.07296 198567.39223
2.05000 -8220.80639 52.91272 564.16797 787.31707 486.60466 182244.99947
2.15000 -8218.38013 33.05056 -2998.42158 754.46511 499.53904 181639.03380
2.25000 -8139.22572 42.87796 -865.02404 706.96636 449.80080 164882.72686
2.35000 -8084.49913 44.91286 230.29357 664.22336 449.96849 163342.74068
2.45000 -8045.70482 34.96803 1739.47696 605.30440 440.25097 157352.60197
2.55000 -8003.87053 41.90430 2898.89176 568.34298 462.53255 165251.75714
2.65000 -7954.60742 41.07468 -894.59297 539.81634 440.14489 157564.21654
2.75000 -7896.96706 45.55216 -1496.73841 525.08666 418.34019 149287.97489
2.85000 -7854.83040 46.39800 780.97991 512.51181 396.56741 151605.75233
2.95000 -7827.61626 38.63231 1725.16857 502.59474 431.18420 124620.15934
3.05000 -7779.68969 40.96598 -1147.65847 463.64558 412.46324 133113.53386
3.15000 -7743.63073 43.61527 2415.51303 424.54928 399.29589 124250.59216
3.25000 -7701.90336 33.82153 -1530.83312 421.26697 393.93607 126305.93440
3.35000 -7663.44626 38.40550 -1219.26003 394.50861 375.38560 118439.38309
3.45000 -7621.76117 36.33250 -1621.29772 409.88326 396.58365 111492.27058
3.55000 -7586.93195 33.95985 1965.73130 373.78752 357.97066 115861.93756
3.65000 -7532.96564 33.34346 -841.46295 367.27863 339.63944 111118.83158
3.75000 -7477.56120 31.45106 -1779.75577 337.72190 336.54895 100445.90066
3.85000 -7442.59054 27.24654 -1308.34676 337.41579 344.63559 97143.97568
3.95000 -7398.32740 32.84530 27.28587 323.48399 327.66270 110862.60994
4.05000 -7356.93437 31.04799 480.01277 329.66031 327.68258 86951.09324
4.15000 -7303.07956 31.85931 178.85854 312.76416 311.47429 94477.51424
4.25000 -7240.57665 25.52441 1519.91615 310.82282 312.66368 84018.95301
4.35000 -7195.53952 30.35466 711.41532 308.61252 293.14618 79229.13297
4.45000 -7140.00509 30.24267 -986.21195 318.91906 308.72076 82245.90002
4.55000 -7089.32704 25.82406 -756.47060 313.70995 299.67210 77181.62762
4.65000 -7049.12027 26.78567 -1618.07695 315.46496 304.95166 73500.38583
4.75000 -6978.55013 31.51133 -1842.22045 305.96610 284.96623 71972.52977
4.85000 -6922.44203 25.51531 -1578.93630 296.83237 299.25666 74275.85108
4.95000 -6856.06709 27.11417 -601.39406 308.26237 274.93232 64385.69289
5.05000 -6801.77272 30.68197 240.13813 285.50455 269.29084 64821.46246
5.15000 -6733.08287 29.95408 -2807.57278 270.62108 254.97365 63288.17589
5.25000 -6665.42200 22.76918 -1392.71214 280.12314 263.94449 56217.47072
5.35000 -6626.06773 19.89171 -380.73748 268.14206 255.02713 55493.87081
5.45000 -6560.41568 24.29643 -1346.63360 257.33096 243.11340 60675.90307
5.55000 -6509.72482 27.39605 -251.16618 277.13215 232.80193 53534.39319
5.65000 -6466.56567 23.28458 192.31379 252.14343 243.45238 55440.27024
5.75000 -6430.84390 25.80988 67.82024 265.30521 259.36538 50603.65457
5.85000 -6395.95830 22.32045 20.27838 283.34475 288.59267 50410.93886
5.95000 -6365.90545 22.09176 -382.52682 239.29726 235.54394 57298.20759
6.05000 -6338.81776 20.89820 -758.02185 251.07362 227.27887 50675.68984
6.15000 -6317.30575 21.22096 -696.05208 243.42067 263.57980 45936.61332
6.25000 -6278.11231 19.88529 1141.67289 229.18751 220.87194 84882.87958
6.35000 -6248.50717 21.90161 -391.15559 221.37695 233.82293 43681.04267
6.45000 -6197.81178 23.22533 394.35793 238.01792 218.35488 39501.72006
6.55000 -6162.70201 17.72947 -125.87033 224.50359 228.46600 40685.66029
6.65000 -6120.02730 20.63651 -623.37499 233.83847 212.17917 40078.11506
6.75000 -6069.51650 17.43658 -636.28307 205.80632 225.40778 65805.44835
6.85000 -6020.59990 19.81076 277.24894 248.91340 203.83404 61494.17817
6.95000 -5974.41983 23.99652 40.52338 199.83520 189.10305 36263.25751
7.05000 -5917.24356 15.48190 680.31545 199.27687 219.00774 38489.02051
7.15000 -5857.42141 18.15606 590.96630 204.22784 228.31921 34904.41630
7.25000 -5804.93627 17.07165 -389.77744 207.50594 212.86505 33480.24417
7.35000 -5734.28776 13.91910 -271.25462 196.87149 214.91938 30289.56503
7.45000 -5682.77399 18.04692 -737.61076 224.36759 195.88981 30144.83184
7.55000 -5630.68432 16.06843 142.35380 205.75513 179.36887 33589.63874
7.65000 -5572.16885 20.41095 500.52172 182.55676 174.26174 31716.12041
7.75000 -5509.19523 15.24521 -466.80440 181.82541 201.38188 47368.45852
7.85000 -5454.27291 17.42883 -713.68286 193.53897 187.81365 28955.45553
7.95000 -5390.29914 12.69448 -163.89973 181.33023 169.75889 26099.58462
8.05000 -5333.78354 17.76910 -187.28041 191.36673 164.75892 27668.04653
8.15000 -5282.50909 15.83364 -477.28000 138.04502 149.97482 28247.19008
8.25000 -5227.51983 18.38963 -78.90499 197.16804 166.46712 33176.64972
8.35000 -5186.36972 15.41012 25.90628 186.42558 173.21944 23218.27254
8.45000 -5145.48531 12.97497 295.98375 156.59902 177.63546 21811.58180
8.55000 -5107.57837 13.71534 528.16220 187.41527 154.18026 19100.65228
8.65000 -5078.98245 16.21259 -234.39438 190.71263 173.14718 18267.73262
8.75000 -5046.88954 13.82219 -245.34738 179.21566 148.85193 21076.74929
8.85000 -5019.36262 11.33458 -262.83355 162.23972 153.71046 19776.97489
8.95000 -4993.03894 11.75794 163.56636 186.41471 180.88521 19954.73450
9.05000 -4970.20433 16.91634 -156.04318 181.37117 187.83774 19060.93689
9.15000 -4942.37096 15.46432 -0.20803 163.67480 138.17259 27108.38895
9.25000 -4911.08914 11.66713 -271.25620 183.35438 163.70875 16880.89886
9.35000 -4886.57592 14.07474 356.26304 142.67472 147.52556 27650.80988
9.45000 -4850.06616 11.00946 -128.11795 153.53872 149.68654 15618.08563
9.55000 -4814.80480 11.48412 -177.29726 152.61335 164.00365 15193.05897
9.65000 -4777.14840 14.71564 -39.77193 147.45814 141.12866 15512.35602
9.75000 -4735.68968 9.45266 -244.48184 178.28368 160.44035 14432.12964
9.85000 -4704.15036 12.36204 -55.97029 177.02390 153.91366 15422.67095
9.95000 -4669.56455 10.79646 224.38587 146.84363 145.69975 16959.52211
10.05000 -4632.26283 9.02942 -30.36833 193.52604 170.40047 12858.21837
10.15000 -4603.16182 7.55435 -72.91551 166.26488 146.52250 14581.32651
10.25000 -4563.87201 9.11354 40.67577 149.11851 154.59339 12681.65878
10.35000 -4527.05528 9.89273 0.58804 135.39616 145.55616 17309.35411
10.45000 -4485.19084 16.65078 496.74951 164.39158 143.95808 31197.27967
10.55000 -4454.05890 14.75801 9.94485 153.39113 156.86724 12321.41125
10.65000 -4414.66565 10.53225 -115.34147 139.37383 119.43343 12042.44817
10.75000 -4376.69167 9.25403 88.62741 120.33893 147.80142 11899.76082
10.85000 -4342.29727 11.24643 -404.31058 106.01671 108.24241 10451.13907
10.95000 -4308.71088 7.39308 133.52523 137.77638 124.22075 11560.08925
11.05000 -4265.68238 10.22899 -395.69678 119.13845 118.55337 11701.47198
11.15000 -4236.18693 10.21520 227.69973 152.68432 138.09106 10962.94706
11.25000 -4199.15805 13.14675 279.60503 121.08342 128.53685 10510.82711
11.35000 -4154.87138 9.63332 -61.20576 160.42813 115.23324 12235.90449
11.45000 -4123.93375 9.76234 -19.45700 155.36868 131.63907 10539.13809
11.55000 -4089.56513 10.77048 149.69664 110.17038 92.47006 9627.99746
11.65000 -4057.15139 10.41714 -25.74414 158.10039 124.40639 9633.84275
11.75000 -4022.08180 7.25070 -52.46445 148.04561 126.07805 8750.46255
11.85000 -3982.83157 6.88820 167.95926 107.57936 118.40506 9178.04652
11.95000 -3952.84497 9.77144 210.45749 159.96880 91.20660 6905.97803
12.05000 -3908.94485 10.24677 -88.50094 130.45744 126.37391 10350.03586
12.15000 -3880.53229 10.56825 -36.50401 104.92415 100.93755 8323.46784
12.25000 -3843.55104 6.83451 17.70320 123.82202 132.10795 7497.76996
12.35000 -3817.18544 6.69620 35.19777 109.28078 123.22656 7607.68501
12.45000 -3784.47916 10.74299 306.71727 116.41822 97.45316 7562.25744
12.55000 -3756.44184 6.05909 176.60937 130.13312 100.34902 6666.25089
12.65000 -3719.17198 2.67621 290.40530 121.72478 116.34054 6148.27783
12.75000 -3691.71511 8.32176 122.58679 87.51347 92.10431 7570.52115
12.85000 -3658.42274 7.36217 117.45909 132.96006 102.80170 5797.15044
12.95000 -3632.01490 4.25941 241.13685 120.13592 132.82935 6364.23075
13.05000 -3605.05252 7.96112 258.89945 110.27384 133.98981 6738.52020
13.15000 -3577.69626 9.35445 -13.15688 119.09243 109.39842 6681.69033
13.25000 -3548.20157 6.98746 105.90974 79.81995 126.43318 4274.22558
13.35000 -3525.75527 5.50411 98.06530 97.51968 120.98802 4538.14582
13.45000 -3499.87138 4.49362 58.39172 144.85839 161.51063 5241.24234
13.55000 -3474.35954 6.74083 161.43432 84.20597 78.17893 4918.91475
13.65000 -3453.82591 2.60228 404.15894 118.08734 111.81994 6279.60821
13.75000 -3429.56977 8.18482 110.66999 93.10702 83.47005 4176.64663
13.85000 -3405.33735 3.87154 183.56830 85.33643 112.91853 4345.30940
13.95000 -3393.67483 9.53860 189.97443 143.26008 131.19150 4574.64746
14.05000 -3368.72075 6.63704 136.79654 104.32554 94.08837 4307.77478
14.15000 -3342.70676 5.07514 131.34930 91.10848 86.67061 3829.45787
14.25000 -3321.04831 10.06458 -95.55805 116.18712 123.92074 3959.27578
14.35000 -3297.45102 6.67729 97.36908 99.31363 85.26891 4689.72840
14.45000 -3276.40172 8.03947 -21.79787 70.39829 88.12728 3921.46302
14.55000 -3253.73703 5.65510 99.96882 67.03386 76.62737 3853.46626
14.65000 -3230.51805 5.91952 -49.90627 60.57565 66.42931 4484.64016
14.75000 -3208.93415 4.44412 1.93821 74.46547 77.68403 4876.40071
14.85000 -3182.50967 7.19336 148.56598 89.51368 108.61495 3783.31394
14.95000 -3164.75591 7.25703 11.80307 65.08891 74.45228 3190.69539
15.05000 -3142.77123 5.10093 77.70236 76.80923 68.06212 3604.34073
15.15000 -3122.12633 8.82588 35.68493 102.61044 111.55601 3707.03748
15.25000 -3097.52282 5.45494 223.42945 127.43866 190.25415 3860.32927
15.35000 -3076.09322 5.92735 -46.22898 164.55971 92.74043 3984.51103
15.45000 -3058.43619 3.19930 67.03316 73.14763 83.53374 3109.11993
15.55000 -3037.20815 6.23081 77.36465 80.27775 69.86051 3260.09108
15.65000 -3019.30559 7.23271 23.76877 127.81234 60.15162 2909.06285
15.75000 -2988.86086 3.30932 91.53854 71.49624 94.73191 2857.51313
15.85000 -2974.16843 10.87909 11.12043 81.66894 111.01868 5341.68926
15.95000 -2952.31968 5.65618 28.45315 71.76551 71.93557 2354.63096
16.05000 -2933.48285 5.60363 -65.05125 64.20122 65.14700 3303.66279
16.15000 -2914.18453 2.70067 45.43312 72.19375 72.78171 2443.31903
16.25000 -2895.46619 4.40694 151.07081 88.35965 69.16955 2557.37397
16.35000 -2878.44827 10.37042 -59.97440 68.88339 163.68026 2463.35338
16.45000 -2850.90155 5.90970 15.94977 57.91574 47.54690 2842.12250
16.55000 -2822.48424 6.33333 99.42551 241.55044 86.67864 2481.66970
16.65000 -2816.65543 2.86264 -17.60700 47.18888 51.38516 2350.95258
16.75000 -2794.65570 4.39993 -99.71104 96.99632 81.84941 1907.11646
16.85000 -2781.49424 3.21754 5.38800 64.70260 63.31298 2328.61373
16.95000 -2761.44388 6.70647 92.62763 78.47908 108.50076 2571.95033
17.05000 -2745.13275 3.08521 -118.94686 57.53639 46.44780 2701.55229
17.15000 -2723.65094 2.60211 109.82133 65.28181 48.47507 2520.65067
17.25000 -2708.22111 1.93570 -126.15688 56.41832 56.58563 1839.59013
17.35000 -2690.64790 2.91541 -41.80902 78.11615 64.75772 2120.84574
17.45000 -2678.64295 7.40334 90.80729 64.27696 81.44470 2110.30822
17.55000 -2660.44493 7.35029 28.31180 53.02246 88.95950 2515.98480
17.65000 -2643.09414 3.06224 -32.24791 99.83229 79.99602 2797.86234
17.75000 -2625.96658 9.57831 -59.25772 109.19593 99.26877 1665.74753
17.85000 -2614.17780 2.19829 37.45343 112.80118 52.69382 2140.93631
17.95000 -2593.38065 5.77371 62.41409 43.56728 47.62654 2123.26723
18.05000 -2576.87796 -0.26656 96.65733 144.39059 145.29757 2348.62652
18.15000 -2560.22038 0.81333 105.98947 106.66168 57.39072 2631.82687
18.25000 -2550.32822 4.15051 92.65880 45.91008 42.30343 1977.64648
18.35000 -2532.73112 5.93856 -91.38902 58.94422 56.85029 2353.20233
18.45000 -2519.69924 3.48879 1.38750 65.78354 57.22226 1829.96642
18.55000 -2505.57706 3.15290 78.16159 61.09058 58.69940 1771.96746
18.65000 -2490.67676 4.62278 -76.50713 45.15118 48.40944 2011.19914
18.75000 -2479.43592 1.29661 45.32857 50.01375 44.99644 1305.46561
18.85000 -2464.29401 2.69209 57.66841 45.37219 52.87849 1638.12733
18.95000 -2446.25022 -2.74447 -65.21385 52.54544 134.77667 1924.05116
19.05000 -2435.85808 2.86559 125.17654 47.41401 97.72623 2559.11413
19.15000 -2423.53573 4.30015 -54.67475 45.49456 44.79472 1655.10489
19.25000 -2410.21292 3.26370 53.61576 48.96791 39.00655 1815.98097
19.35000 -2401.09110 0.68905 -103.29438 162.35327 113.46409 2014.13035
19.45000 -2375.68503 3.24634 18.41757 105.96889 47.84996 1480.18026
19.55000 -2365.38973 2.62736 54.94016 52.92182 74.86573 2446.68991
19.65000 -2352.01982 5.36415 -30.34370 87.84921 68.06499 1480.96165
19.75000 -2340.77604 1.15297 29.19079 37.07702 34.89104 1434.08607
19.85000 -2327.03165 2.41742 30.12726 38.33325 49.27312 1095.83251
19.95000 -2314.37316 -1.20334 -101.30498 54.21977 152.04172 1317.98158
