0.2 0.82027 14.70658 0.68699 117.30117 115.85698 93.18796
0.6 -0.76754 34.2908 0.30269 117.45582 110.49973 90.03847
1.0 0.14896 50.83892 -0.89735 117.72349 103.082 86.47305
1.4 -0.27443 64.70734 -0.40387 117.33522 96.1263 82.62117
1.8 1.00966 74.3365 -0.80219 114.69419 92.00667 78.38271
2.2 0.43677 81.61381 -0.25171 112.98401 88.74094 74.85172
2.6 0.55423 86.91182 0.67821 110.78646 84.95371 71.06584
3.0 -0.90722 92.88814 -0.54013 106.94207 81.36857 68.05693
3.4 -0.62106 96.07386 -0.19674 103.05683 77.57798 64.19127
3.8 -0.50305 100.13321 0.42211 98.11047 74.47628 60.75602
4.2 -0.4987 104.6683 0.35656 92.72342 72.58915 58.31696
4.6 -1.17673 109.46288 0.40594 87.6129 70.66807 55.73731
5.0 -2.52869 114.55789 0.8809 83.38511 69.87091 52.98512
5.4 -1.69972 122.0804 1.49612 78.12863 69.46476 50.5037
5.8 -3.48269 131.37707 1.39081 72.8542 68.4807 48.2695
6.2 -2.92918 143.33023 1.5994 68.43753 67.2216 45.4143
6.6 -3.64961 153.61866 1.81482 63.24562 64.25143 42.22668
7.0 -3.66712 163.2072 1.24192 57.80429 59.2157 40.04753
7.4 -3.11101 170.20259 0.16611 52.28816 54.21573 37.76381
7.8 -2.19474 176.62161 -0.59531 47.23942 48.72697 35.31876
8.2 -1.79894 182.06529 -0.68668 43.63622 44.30393 33.37916
8.6 -1.51266 186.12354 -0.99559 40.78576 39.99563 31.84904
9.0 -0.30655 189.34733 -1.26353 38.37495 37.78782 29.59871
9.4 0.02608 191.52861 -1.28021 36.75027 35.83538 27.73999
9.8 0.16643 194.87421 -0.92193 34.9709 33.26417 26.52757
10.2 0.64795 198.62782 -0.16798 34.28903 29.08048 24.94704
10.6 -0.02445 200.90689 0.14463 34.04683 25.62302 23.75235
11.0 0.39186 202.21355 -0.03588 32.87202 24.06108 22.79393
11.4 -0.16401 202.31477 -0.1844 31.9387 23.42528 21.92817
11.8 -0.1011 202.87308 0.1265 31.16466 22.80437 21.55131
12.2 -0.25519 203.18242 0.34797 29.93729 22.23736 20.54874
12.6 -0.85624 203.68229 0.16356 28.29761 22.53879 19.84001
13.0 0.22584 204.48676 0.25183 27.19675 22.20309 19.20842
13.4 -0.32971 204.53305 0.55624 26.09644 21.71262 18.69676
13.8 -0.35836 204.62109 0.18428 24.94389 21.10657 17.87405
14.2 -0.56441 205.45669 0.14878 23.59602 20.19004 17.50253
14.6 0.10721 206.24429 0.24915 22.88046 18.97292 17.11328
15.0 -0.30105 206.90855 -0.02506 21.97381 17.28065 16.58449
15.4 -0.08118 207.14487 -0.04862 21.68128 17.33467 15.68259
15.8 0.71438 208.06779 0.21464 20.20989 16.2444 15.72871
16.2 0.0296 209.41866 -0.15616 19.31255 15.30007 14.93858
16.6 0.51699 209.28895 -0.73099 18.95598 15.82281 14.32501
17.0 0.27974 210.0061 -0.25151 18.8564 15.24363 14.13308
17.4 0.03666 210.71827 -0.72517 18.20286 15.04593 13.75538
17.8 0.07558 210.91862 -0.84811 17.68441 14.45995 13.50519
18.2 -0.23346 212.23508 -1.19953 17.59607 13.66455 13.17916
18.6 0.32047 212.59146 -0.98677 17.68625 12.62498 13.03733
19.0 -0.36519 212.46627 -0.96661 17.08169 11.70108 12.53758
19.4 0.33365 211.956 -1.14847 17.2429 10.70254 12.53214
19.8 0.03595 210.54357 -1.01991 16.90373 10.18761 12.46163
