0.12500 0.03001
0.37500 0.01141
0.62500 0.04907
0.87500 0.02908
1.12500 0.05761
1.37500 0.07320
1.62500 0.12372
1.87500 0.12619
2.12500 0.15383
2.37500 0.15155
2.62500 0.17149
2.87500 0.17141
3.12500 0.15537
3.37500 0.13932
3.62500 0.10233
3.87500 0.10627
4.12500 0.06163
4.37500 0.07211
4.62500 0.03129
4.87500 0.03948
5.12500 0.02355
5.37500 0.03361
5.62500 0.03090
5.87500 0.03536
6.12500 0.03356
6.37500 0.00348
6.62500 0.03251
6.87500 0.05169
7.12500 0.05190
7.37500 0.04912
7.62500 0.06245
7.87500 0.03961
8.12500 0.03425
8.37500 0.02781
8.62500 0.03586
8.87500 0.04093
9.12500 0.08286
9.37500 0.06328
9.62500 0.07707
9.87500 0.06811
10.12500 0.07078
10.37500 0.06264
10.62500 0.05421
10.87500 0.02286
11.12500 0.01543
11.37500 0.02390
11.62500 0.04000
11.87500 0.03277
12.12500 0.03783
12.37500 0.04329
12.62500 0.04650
12.87500 0.06813
13.12500 0.02605
13.37500 0.05140
13.62500 0.01842
13.87500 0.02134
14.12500 0.04279
14.37500 0.03039
14.62500 0.03137
14.87500 0.05144
15.12500 0.01251
15.37500 0.08510
15.62500 0.03164
15.87500 0.05216
16.12500 0.09982
16.37500 0.04006
16.62500 0.06119
16.87500 0.02175
17.12500 0.11993
17.37500 0.10042
17.62500 0.05740
17.87500 0.11087
18.12500 0.10611
18.37500 0.05550
18.62500 0.11186
18.87500 0.06919
19.12500 0.07371
19.37500 0.09740
19.62500 0.09252
19.87500 0.12005
