0.120000 -2.147220
0.380000 -2.322930
0.620000 2.068220
0.880000 1.801970
1.120000 1.717390
1.380000 1.941670
1.620000 2.151350
1.880000 2.124360
2.120000 2.075050
2.380000 2.157450
2.620000 2.089610
2.880000 1.938960
3.120000 1.798030
3.380000 1.813260
3.620000 1.858770
3.880000 1.583500
4.120000 1.738210
4.380000 1.729590
4.620000 2.047210
4.880000 1.805610
5.120000 1.871700
5.380000 1.598510
5.620000 1.712240
5.880000 1.961550
6.120000 1.867560
6.380000 2.104390
6.620000 1.786440
6.880000 1.541880
7.120000 1.454800
7.380000 0.594520
7.620000 1.633370
7.880000 0.286820
8.120000 1.134160
8.380000 1.057300
8.620000 1.520640
8.880000 1.122480
9.120000 1.569690
9.380000 0.887050
9.620000 1.211890
9.880000 0.639250
10.120000 0.208370
10.380000 0.720720
10.620000 1.201690
10.880000 -0.553680
11.120000 0.202670
11.380000 -1.066840
11.620000 -1.006530
11.880000 -0.654580
12.120000 -1.541360
12.380000 -1.540640
12.620000 -0.309420
12.880000 -2.592760
13.120000 -0.933690
13.380000 -0.881700
13.620000 -1.404290
13.880000 -0.865710
14.120000 -0.753710
14.380000 1.504420
14.620000 2.031950
14.880000 1.125790
