0.12500 0.00482
0.37500 0.02687
0.62500 0.04896
0.87500 0.07270
1.12500 0.10567
1.37500 0.13876
1.62500 0.17992
1.87500 0.21347
2.12500 0.25516
2.37500 0.28010
2.62500 0.27713
2.87500 0.25185
3.12500 0.25234
3.37500 0.23719
3.62500 0.23442
3.87500 0.23211
4.12500 0.22462
4.37500 0.19696
4.62500 0.16998
4.87500 0.12577
5.12500 0.11803
5.37500 0.09909
5.62500 0.08197
5.87500 0.06491
6.12500 0.05007
6.37500 0.05631
6.62500 0.03933
6.87500 0.03758
7.12500 0.02250
7.37500 0.02710
7.62500 0.02978
7.87500 0.01742
8.12500 0.02938
8.37500 0.00455
8.62500 0.01945
8.87500 0.02247
9.12500 0.01920
9.37500 0.03445
9.62500 0.03342
9.87500 0.05194
10.12500 0.04783
10.37500 0.05339
10.62500 0.04989
10.87500 0.05408
11.12500 0.06558
11.37500 0.05003
11.62500 0.02508
11.87500 0.02672
12.12500 0.03207
12.37500 0.01918
12.62500 0.02363
12.87500 0.00711
13.12500 0.00720
13.37500 0.00125
13.62500 0.02867
13.87500 0.00830
14.12500 0.02479
14.37500 0.02650
14.62500 0.01996
14.87500 0.01744
15.12500 0.02770
15.37500 0.00936
15.62500 0.01794
15.87500 0.01210
16.12500 0.02093
16.37500 0.04828
16.62500 0.02637
16.87500 0.02840
17.12500 0.04155
17.37500 0.03746
17.62500 0.05174
17.87500 0.03847
18.12500 0.04595
18.37500 0.00554
18.62500 0.04778
18.87500 0.04341
19.12500 0.01082
19.37500 0.03712
19.62500 0.00667
19.87500 0.01536
