0.05000 -1318.56912 1342.37542 3926.19944 1333.77394 918.86546 168.33789
0.15000 -818.97400 -961.68920 3787.28963 1290.63162 1685.44563 138.03210
0.25000 29.03133 -164.89416 4116.42226 1699.83955 1572.46566 988.78030
0.35000 -557.17251 258.12825 4034.97545 1506.78637 1663.05076 869.16844
0.45000 -1046.09647 65.45159 3899.04526 1391.29177 1677.32020 588.70585
0.55000 -1220.00242 -135.03194 3981.06590 1531.87188 1635.60444 714.19112
0.65000 -1547.06370 173.25353 3777.92805 1652.06290 1683.21733 800.89374
0.75000 -1654.22409 49.87689 3610.45568 1891.10799 1757.11881 854.58899
0.85000 -1642.62984 4.74416 3471.97469 1636.91482 1846.71010 979.06507
0.95000 -2042.33147 -106.93423 3264.52703 1668.91264 1826.49631 1300.07940
1.05000 -2131.79563 20.47148 3026.07631 1840.99678 1980.44710 1333.11855
1.15000 -2336.16366 112.47205 2776.10683 1622.39294 1920.09605 1417.49120
1.25000 -2367.88047 110.91446 2538.34629 1703.54843 2085.05137 1662.88848
1.35000 -2638.70597 20.69132 2159.95667 1634.53182 2012.71734 1762.36662
1.45000 -2851.35767 -7.98151 1686.08059 1864.77045 2125.19877 2094.39856
1.55000 -3069.24972 24.95043 1567.18089 2788.13295 2175.65342 3402.86250
1.65000 -3130.78071 -8.78931 1276.06071 1705.29722 1649.63713 2565.49231
1.75000 -3218.78152 34.10150 1210.76711 1463.62504 1585.10126 2584.04242
1.85000 -3342.76241 -7.86236 943.50629 1405.17016 1640.42077 2465.28066
1.95000 -3413.92999 -2.56758 899.13571 1546.37346 1441.01450 2520.29923
2.05000 -3464.85121 -51.03111 811.00918 1299.64327 1245.92755 2434.27306
2.15000 -3413.52488 35.37337 822.53795 1854.38078 1562.40364 2902.75964
2.25000 -3486.32384 23.75870 675.25909 1276.70636 1200.76768 2503.74499
2.35000 -3476.24302 8.15155 503.39889 1291.92942 1113.83909 2536.95210
2.45000 -3490.00652 29.72681 468.60708 1303.54856 1045.62459 2531.84224
2.55000 -3487.77632 -12.84503 378.92690 1184.81989 1083.33510 2546.23735
2.65000 -3468.63945 9.16343 510.34012 1215.97037 913.28907 2524.04378
2.75000 -3449.67121 -3.34208 456.97355 1182.60280 1020.10988 2536.43664
2.85000 -3479.34138 4.18988 307.99438 1323.69182 1051.56192 2617.21312
2.95000 -3519.64893 23.00058 366.18153 1704.96828 937.00474 2918.11971
3.05000 -3511.16966 4.77526 181.42188 1172.19364 799.70888 2511.77557
3.15000 -3465.68468 -21.77573 308.59224 1286.78038 748.61825 2514.49893
3.25000 -3417.58995 -23.77300 148.90973 1177.28918 839.42957 2563.69974
3.35000 -3394.55520 -20.05019 188.11159 1414.83415 915.59273 2724.58368
3.45000 -3354.69327 -39.69512 260.05832 1123.96858 665.80524 2524.40597
3.55000 -3344.31281 -8.50309 209.35937 1094.02257 615.55478 2500.98511
3.65000 -3379.55465 12.06993 172.75155 1065.33181 652.91856 2461.67307
3.75000 -3309.70171 -1.58797 326.23121 1093.17267 587.07283 2423.17045
3.85000 -3275.82683 3.48642 179.02413 1032.26255 557.12457 2451.71319
3.95000 -3244.23172 9.54589 381.62493 1032.04432 554.39199 2409.46112
4.05000 -3257.83521 0.35593 173.89601 1021.36931 543.00834 2394.73843
4.15000 -3204.13626 -11.59313 180.98536 1068.79343 644.64568 2453.64566
4.25000 -3188.94505 -9.53139 158.26004 992.14434 490.78213 2402.36020
4.35000 -3226.55826 2.65316 76.64840 947.35349 492.85068 2346.11573
4.45000 -3248.18037 8.59728 41.41368 956.00682 469.00398 2322.03521
4.55000 -3146.53544 -1.51027 74.29579 973.64664 484.94247 2418.08885
4.65000 -3136.05276 -4.84215 199.22507 1657.92880 979.64889 2833.00625
4.75000 -3133.32364 3.98121 84.31385 962.79009 453.43519 2339.98789
4.85000 -3108.19490 -0.21539 143.36766 945.36487 408.28438 2299.93678
4.95000 -3106.55888 -1.28556 129.39720 902.39238 407.21546 2262.57585
5.05000 -3071.40863 -15.84930 90.00846 936.63315 520.02275 2284.31694
5.15000 -3066.76971 -2.11902 106.60272 923.28035 376.04517 2237.71106
5.25000 -3033.29103 -6.05791 72.99813 921.80499 385.24222 2255.67801
5.35000 -3046.24231 -6.02306 92.44757 886.34697 364.86710 2206.65228
5.45000 -3023.93457 -3.82954 20.55385 1975.10755 1328.92861 2267.60157
5.55000 -2974.92028 -0.32113 76.77019 926.10861 346.98480 2213.45354
5.65000 -2960.63511 2.31160 103.43617 889.05790 395.58722 2200.10267
5.75000 -2930.51261 2.47648 135.87059 883.49724 356.12183 2208.24751
5.85000 -2940.77960 -5.31141 35.29777 909.00935 349.60584 2171.31892
5.95000 -2923.23507 -6.20500 120.53344 882.79787 321.41831 2153.97209
6.05000 -2887.81836 -5.28526 131.59424 873.53679 427.15164 2162.09735
6.15000 -2925.44736 -7.93527 3.32338 850.84944 329.37306 2100.22754
6.25000 -2877.62911 0.91662 26.95265 861.42031 311.94541 2119.56179
6.35000 -2863.88262 3.94641 67.24960 881.81533 375.17725 2110.54944
6.45000 -2827.93546 -8.34593 80.02860 866.03861 532.89056 2132.59699
6.55000 -2852.06204 -9.23087 103.56502 807.72953 289.35938 2044.96682
6.65000 -2802.40817 2.95605 49.97180 840.86006 397.76518 2089.84659
6.75000 -2805.66253 -2.88680 78.47062 877.39569 450.05518 2040.37932
6.85000 -2747.16471 -10.19580 -34.91730 853.53413 260.74120 2086.71920
6.95000 -2767.00168 6.63789 24.99583 814.63216 298.88905 2060.24180
7.05000 -2723.30137 4.55069 24.83451 831.95148 258.05118 2046.09555
7.15000 -2739.01413 -5.07164 48.07049 815.03528 291.43351 2022.47947
7.25000 -2749.28675 -3.33985 20.10497 823.89737 282.19068 1980.35095
7.35000 -2723.52542 -3.75897 -33.88265 815.31319 271.42913 1978.70351
7.45000 -2707.97663 -1.41545 10.87358 790.90602 255.99110 1962.06162
7.55000 -2680.09517 0.24544 56.29265 796.80251 277.80661 1953.02294
7.65000 -2637.61986 -3.93901 -48.89399 775.04937 254.00275 1998.71202
7.75000 -2650.93117 -6.47932 -23.94095 786.56424 219.82259 1943.80988
7.85000 -2621.55754 -4.65253 -16.03341 772.25033 254.25080 1954.94955
7.95000 -2627.17401 1.98233 -38.42701 761.43574 298.17556 1925.07057
8.05000 -2581.44021 -2.65034 26.59415 846.98423 310.17785 1933.93639
8.15000 -2597.14966 2.34693 -9.14477 838.55356 308.40314 1914.28385
8.25000 -2554.14033 6.49479 -10.30808 776.24706 221.41270 1935.46158
8.35000 -2577.65460 -1.16778 -40.87148 741.32859 419.50651 1873.98644
8.45000 -2568.11532 -0.16406 -109.66574 749.83235 200.64883 1863.26192
8.55000 -2553.58140 -2.74144 -57.80897 771.45703 234.82134 1861.13973
8.65000 -2525.49595 -2.82153 -38.47000 736.58585 215.44658 1856.36127
8.75000 -2523.49547 0.08849 32.16010 739.62998 246.71257 1852.69281
8.85000 -2523.74063 -1.67092 -11.05902 709.80285 195.76842 1806.29438
8.95000 -2469.61162 1.10823 -13.23108 732.04648 187.58440 1834.95493
9.05000 -2476.30888 -0.11339 -8.27061 735.08807 226.86628 1885.87053
9.15000 -2466.21958 0.16016 -68.01582 757.91825 221.09619 1837.30359
9.25000 -2431.76401 -0.55401 -0.09770 834.63903 329.79314 1899.42487
9.35000 -2402.61908 2.35509 10.11980 724.38911 186.58646 1803.40633
9.45000 -2418.09502 -1.16422 -26.21229 714.17219 204.19357 1768.35404
9.55000 -2416.06430 0.36019 -88.19306 694.92089 223.44077 1754.12692
9.65000 -2375.71128 5.87630 -45.63697 824.31027 194.03414 1855.18467
9.75000 -2363.45438 -2.51308 -40.19483 704.77766 195.73894 1759.94851
9.85000 -2346.16696 5.57235 -55.00414 678.63103 183.89739 1755.64854
9.95000 -2361.10874 -3.09509 -50.24383 696.51500 517.02382 1713.29459
10.05000 -2368.22498 0.71287 -81.13805 658.73535 156.86060 1691.60092
10.15000 -2334.03360 -1.59046 -61.50861 674.63835 278.00594 1696.16760
10.25000 -2296.19617 -2.73886 -33.52664 695.72255 191.74899 1722.14885
10.35000 -2273.02373 -1.00062 -85.01079 692.32862 163.72662 1719.92105
10.45000 -2276.69090 2.88341 -23.23417 664.42583 150.21521 1691.91995
10.55000 -2259.49507 2.68788 -55.43608 692.89905 222.06275 1685.82747
10.65000 -2264.99187 -3.96741 -59.19416 650.19584 156.20382 1663.96574
10.75000 -2271.77574 4.82517 -65.52319 644.75864 154.70780 1635.61074
10.85000 -2237.00397 1.94327 -33.40605 660.78199 167.37781 1645.00486
10.95000 -2223.13650 -1.66814 -78.99490 654.24711 140.86633 1636.03740
11.05000 -2222.63616 -3.92557 -65.91179 625.69576 136.83979 1622.85665
11.15000 -2181.96182 1.57840 -54.02403 643.18300 178.32379 1644.86773
11.25000 -2185.96663 3.48985 -32.87541 636.85344 129.27934 1606.92531
11.35000 -2168.60062 2.03822 -74.31557 639.91684 164.97562 1610.24385
11.45000 -2165.68278 0.03291 -94.00153 635.02882 161.60776 1598.09448
11.55000 -2152.25450 -7.03843 -98.60068 653.79472 152.12070 1584.82419
11.65000 -2138.77207 -4.08439 -78.11648 637.64149 136.91708 1578.09034
11.75000 -2153.42826 1.60272 11.08215 596.37933 134.74168 1542.61660
11.85000 -2117.72014 -4.54585 -76.35262 621.05805 162.89778 1565.28686
11.95000 -2078.47385 -2.01633 -63.60140 625.55347 119.61065 1587.48017
12.05000 -2108.61190 2.10186 -56.25659 617.10709 164.96768 1533.36925
12.15000 -2099.55648 0.41373 -39.59810 594.13912 128.94902 1524.54669
12.25000 -2062.72250 -1.68661 -103.52401 1246.12297 139.35198 1583.02016
12.35000 -2050.80627 0.70743 -53.10529 612.50782 157.77608 1541.08246
12.45000 -2059.27436 5.97763 -69.48607 603.79095 175.15511 1508.40295
12.55000 -2039.12675 -4.25859 5.87150 611.42323 169.43232 1565.75337
12.65000 -2026.74896 1.27613 -11.52570 590.75493 125.02060 1501.67802
12.75000 -2052.02915 1.76880 -62.43122 574.69589 119.15316 1467.84677
12.85000 -1987.86785 -1.14578 -42.40096 611.08785 108.09820 1506.01340
12.95000 -2000.21626 -5.79293 -75.48921 590.93332 320.15683 1499.19429
13.05000 -2000.02710 1.72610 -60.59595 577.55421 127.89948 1457.20262
13.15000 -2002.36315 -0.23027 -85.15424 556.21682 124.51245 1440.60195
13.25000 -1965.86791 -0.15657 -36.33011 587.11543 110.86487 1455.30278
13.35000 -1977.00825 -0.29831 -155.38174 564.75710 109.10037 1432.93185
13.45000 -1946.68446 0.32754 -50.28521 574.68192 207.31272 1444.84502
13.55000 -1948.67482 0.10584 -57.43606 554.64113 112.96174 1428.79688
13.65000 -1929.40550 -1.89939 -53.60814 560.55405 98.15022 1430.15331
13.75000 -1915.16384 0.83028 -69.22075 555.26969 104.97763 1428.85030
13.85000 -1902.82924 -0.76188 -25.14375 560.70702 112.86695 1423.23728
13.95000 -1881.58231 -1.92102 -37.42937 1714.71810 463.05738 2577.74628
14.05000 -1889.19306 1.71042 -114.69528 552.59237 124.06204 1409.78235
14.15000 -1860.69351 2.72338 -64.66247 570.99103 232.58266 1421.21765
14.25000 -1879.80352 -1.44825 -59.33617 535.37404 114.07201 1380.19740
14.35000 -1845.95775 1.27625 -64.05189 550.49284 103.55981 1400.39931
14.45000 -1846.14001 1.51669 -89.62576 562.44755 135.91932 1382.88146
14.55000 -1850.57939 0.28755 -78.98074 553.99643 118.13009 1366.41322
14.65000 -1853.21636 -0.63167 -64.78033 521.99775 103.20369 1342.37564
14.75000 -1834.70381 -3.25366 -26.19803 519.90699 100.46177 1343.14512
14.85000 -1802.57059 1.24344 -43.25420 533.50956 86.27420 1361.85460
14.95000 -1801.43109 -2.62226 -26.50202 532.00791 96.35443 1342.70654
15.05000 -1799.37287 0.36198 -50.95647 510.13940 97.45119 1337.26192
15.15000 -1797.30007 -0.43977 -22.72223 509.71938 89.65315 1319.69217
15.25000 -1800.38105 0.10874 -39.06697 504.01781 79.74190 1298.62424
15.35000 -1791.19225 -0.34424 -22.70973 504.33902 89.79212 1288.90641
15.45000 -1788.10599 4.46676 -55.10817 539.73475 128.92926 1291.15707
15.55000 -1768.10144 1.54402 -21.74744 493.85006 80.97227 1288.56247
15.65000 -1767.47729 0.23639 -37.88538 494.77683 128.59817 1273.72837
15.75000 -1744.12204 1.03944 -55.47585 509.12946 102.78212 1281.69946
15.85000 -1744.40165 -1.01416 -32.99364 504.62567 88.81834 1270.62490
15.95000 -1718.89472 0.83550 -76.65900 494.38899 143.73543 1282.44785
16.05000 -1732.22876 1.92651 -37.31200 502.93527 85.71774 1249.83229
16.15000 -1715.40774 1.82199 -68.08310 507.61113 113.58159 1255.20895
16.25000 -1703.61736 0.41645 -73.63211 478.82053 241.52413 1266.34297
16.35000 -1698.89926 1.58427 -8.67214 533.17367 84.01787 1247.03814
16.45000 -1676.69927 1.30910 -63.24527 493.52126 83.51058 1261.25495
16.55000 -1671.45232 -0.16555 -48.78936 486.25192 133.27527 1248.68710
16.65000 -1672.04472 0.56856 -83.26251 482.72485 85.69176 1233.51617
16.75000 -1672.60239 -2.02639 -53.37832 473.03554 83.34434 1224.26030
16.85000 -1665.21349 -1.05073 -58.44099 469.46884 75.48620 1212.06815
16.95000 -1656.19897 1.43733 -37.78548 469.25562 70.46238 1204.58126
17.05000 -1648.02928 0.98270 -17.91589 463.39534 75.70614 1203.64814
17.15000 -1641.44196 -1.59862 -33.78610 475.07185 72.87946 1196.00716
17.25000 -1617.64376 -1.74138 -58.14138 475.03461 91.36723 1205.06014
17.35000 -1607.68301 1.16766 -47.56890 496.04260 221.97759 1228.31225
17.45000 -1614.00717 0.91696 -44.94906 458.51531 102.16600 1184.54601
17.55000 -1610.33991 0.08533 -63.14657 459.66886 80.64921 1174.16660
17.65000 -1599.30175 0.73519 -67.87814 461.75704 75.93367 1176.65033
17.75000 -1612.38415 0.92564 -3.45141 456.60765 91.47351 1145.50785
17.85000 -1586.37127 -0.26691 -71.45231 466.20521 113.23030 1163.12720
17.95000 -1580.27626 -1.15691 -45.00289 453.06684 81.01644 1154.47895
18.05000 -1569.95341 0.29749 -45.43227 441.10511 65.27498 1159.10446
18.15000 -1565.35734 0.10961 -9.59826 449.16716 78.14467 1142.01308
18.25000 -1547.41321 1.34426 -56.76008 451.93197 67.26025 1156.76703
18.35000 -1533.83469 -0.59949 -32.86411 446.12385 103.16041 1155.50821
18.45000 -1535.66848 -0.19032 -34.19878 460.53480 108.67607 1137.05333
18.55000 -1519.72059 2.23985 -76.99198 456.30562 66.33893 1145.85209
18.65000 -1538.07322 -1.44250 -62.58816 430.88523 66.21174 1113.23823
18.75000 -1529.57271 2.03708 -41.15789 426.48018 91.40097 1112.66798
18.85000 -1517.16140 0.38256 -13.88604 436.01772 67.91140 1106.44554
18.95000 -1489.04219 0.11428 -33.69205 439.06772 65.51642 1134.07224
19.05000 -1494.74976 0.94155 -42.58323 433.59877 73.18701 1111.13894
19.15000 -1492.58123 1.48560 -42.65687 432.52586 63.96715 1100.29613
19.25000 -1498.30000 -0.48821 -31.55774 422.77662 66.60725 1084.52476
19.35000 -1472.29911 -0.11375 -37.51587 423.89163 64.45068 1101.41823
19.45000 -1481.44854 0.28713 -51.04131 415.15030 81.22658 1082.01364
19.55000 -1480.42315 -0.14293 -30.39957 414.38407 68.10970 1065.74949
19.65000 -1448.48669 1.40428 8.29689 426.91473 58.86673 1086.77315
19.75000 -1451.72095 0.01864 -23.38007 422.03383 58.59399 1076.49368
19.85000 -1456.28512 0.13750 -39.88450 429.07635 68.60753 1060.10918
19.95000 -1437.19172 1.03934 -33.04167 430.10167 61.68797 1065.26854
