0.12500 0.04475
0.37500 0.01070
0.62500 0.02262
0.87500 0.02075
1.12500 0.02100
1.37500 0.04116
1.62500 0.04125
1.87500 0.05465
2.12500 0.07567
2.37500 0.08453
2.62500 0.09020
2.87500 0.09458
3.12500 0.09684
3.37500 0.09068
3.62500 0.09117
3.87500 0.10478
4.12500 0.09863
4.37500 0.10325
4.62500 0.09399
4.87500 0.08965
5.12500 0.08864
5.37500 0.07811
5.62500 0.07192
5.87500 0.06669
6.12500 0.05548
6.37500 0.04165
6.62500 0.03127
6.87500 0.02070
7.12500 0.02274
7.37500 0.03334
7.62500 0.02669
7.87500 0.03112
8.12500 0.02907
8.37500 0.04046
8.62500 0.03788
8.87500 0.04618
9.12500 0.02327
9.37500 0.02032
9.62500 0.03404
9.87500 0.03267
10.12500 0.04787
10.37500 0.06685
10.62500 0.05193
10.87500 0.04350
11.12500 0.04520
11.37500 0.04382
11.62500 0.04626
11.87500 0.04531
12.12500 0.04491
12.37500 0.04585
12.62500 0.03089
12.87500 0.04812
13.12500 0.04580
13.37500 0.04593
13.62500 0.02601
13.87500 0.02762
14.12500 0.00928
14.37500 0.01825
14.62500 0.02898
14.87500 0.02481
