0.12500 0.02884
0.37500 0.00788
0.62500 0.01722
0.87500 0.00610
1.12500 0.01118
1.37500 0.00936
1.62500 0.00342
1.87500 0.00299
2.12500 0.01543
2.37500 0.01428
2.62500 0.01432
2.87500 0.00967
3.12500 0.01791
3.37500 0.01143
3.62500 0.00341
3.87500 0.01215
4.12500 0.00519
4.37500 0.00526
4.62500 0.00319
4.87500 0.00586
5.12500 0.00974
5.37500 0.01392
5.62500 0.00650
5.87500 0.01528
6.12500 0.02020
6.37500 0.00803
6.62500 0.00369
6.87500 0.00086
7.12500 0.01167
7.37500 0.00994
7.62500 0.00758
7.87500 0.01278
8.12500 0.00845
8.37500 0.00481
8.62500 0.01613
8.87500 0.00944
9.12500 0.01757
9.37500 0.01307
9.62500 0.01214
9.87500 0.00164
10.12500 0.01725
10.37500 0.01083
10.62500 0.02586
10.87500 0.00901
11.12500 0.01986
11.37500 0.01291
11.62500 0.00898
11.87500 0.01560
12.12500 0.01323
12.37500 0.04274
12.62500 0.01069
12.87500 0.01721
13.12500 0.00439
13.37500 0.02264
13.62500 0.01363
13.87500 0.01316
14.12500 0.00943
14.37500 0.01979
14.62500 0.02029
14.87500 0.00637
