0.12500 0.01493
0.37500 0.01373
0.62500 0.02658
0.87500 0.04605
1.12500 0.06998
1.37500 0.09809
1.62500 0.11135
1.87500 0.12606
2.12500 0.13841
2.37500 0.12673
2.62500 0.12274
2.87500 0.12217
3.12500 0.10660
3.37500 0.08351
3.62500 0.04884
3.87500 0.02999
4.12500 0.03425
4.37500 0.03391
4.62500 0.04402
4.87500 0.05118
5.12500 0.06240
5.37500 0.05525
5.62500 0.05400
5.87500 0.04255
6.12500 0.03996
6.37500 0.04461
6.62500 0.03610
6.87500 0.03503
7.12500 0.05206
7.37500 0.05767
7.62500 0.04188
7.87500 0.04443
8.12500 0.04351
8.37500 0.03617
8.62500 0.03920
8.87500 0.05351
9.12500 0.04660
9.37500 0.04896
9.62500 0.04340
9.87500 0.02973
10.12500 0.03793
10.37500 0.05029
10.62500 0.04786
10.87500 0.04298
11.12500 0.02992
11.37500 0.02619
11.62500 0.02088
11.87500 0.02400
12.12500 0.03128
12.37500 0.02622
12.62500 0.03535
12.87500 0.03763
13.12500 0.06568
13.37500 0.03797
13.62500 0.04419
13.87500 0.03294
14.12500 0.02255
14.37500 0.04082
14.62500 0.03723
14.87500 0.05852
