0.05000 21393.99537
0.15000 30085.91391
0.25000 26852.40035
0.35000 22995.98905
0.45000 20048.76208
0.55000 18287.14769
0.65000 16079.66327
0.75000 14335.99621
0.85000 13047.22783
0.95000 11957.34822
1.05000 10877.62014
1.15000 9992.00208
1.25000 9104.58803
1.35000 8831.57312
1.45000 8153.67128
1.55000 7666.78025
1.65000 7235.53044
1.75000 6717.66169
1.85000 6415.64032
1.95000 6154.28066
2.05000 5861.37954
2.15000 5629.33370
2.25000 5312.16456
2.35000 5151.38636
2.45000 4864.60639
2.55000 4635.53186
2.65000 4408.41035
2.75000 4092.52982
2.85000 3925.30384
2.95000 3775.22061
3.05000 3519.63694
3.15000 3443.89724
3.25000 3319.93585
3.35000 3215.71472
3.45000 3065.55672
3.55000 2953.81340
3.65000 2808.25086
3.75000 2696.84246
3.85000 2656.39450
3.95000 2527.10094
4.05000 2492.57234
4.15000 2399.48577
4.25000 2355.10835
4.35000 2248.22105
4.45000 2189.93116
4.55000 2090.89712
4.65000 2096.59717
4.75000 2052.75874
4.85000 1941.71000
4.95000 1934.11624
5.05000 1809.70118
5.15000 1815.80742
5.25000 1734.96618
5.35000 1686.86825
5.45000 1680.41374
5.55000 1616.54534
5.65000 1511.05171
5.75000 1514.14601
5.85000 1517.61865
5.95000 1446.14633
6.05000 1402.74044
6.15000 1414.05487
6.25000 1372.76309
6.35000 1285.03581
6.45000 1263.59000
6.55000 1192.81510
6.65000 1174.64062
6.75000 1150.07865
6.85000 1091.46752
6.95000 1089.14443
7.05000 1061.38787
7.15000 1010.59910
7.25000 993.57340
7.35000 976.78179
7.45000 916.82056
7.55000 908.06205
7.65000 880.72225
7.75000 833.58092
7.85000 810.48295
7.95000 796.40689
8.05000 793.23306
8.15000 751.23236
8.25000 755.34967
8.35000 691.37921
8.45000 682.14722
8.55000 669.79995
8.65000 695.34054
8.75000 666.58716
8.85000 653.37994
8.95000 615.14224
9.05000 618.74489
9.15000 594.72305
9.25000 607.81011
9.35000 607.03682
9.45000 555.00647
9.55000 556.71635
9.65000 559.20847
9.75000 535.20105
9.85000 523.41905
9.95000 535.48268
10.05000 516.76472
10.15000 492.94274
10.25000 485.68586
10.35000 478.87626
10.45000 478.56914
10.55000 446.56437
10.65000 449.86948
10.75000 445.01399
10.85000 422.16189
10.95000 436.92068
11.05000 439.40462
11.15000 399.60996
11.25000 390.85664
11.35000 381.85164
11.45000 352.37406
11.55000 367.77364
11.65000 351.70457
11.75000 351.50391
11.85000 342.21849
11.95000 337.70018
12.05000 320.52285
12.15000 327.77403
12.25000 314.59791
12.35000 325.89979
12.45000 300.38901
12.55000 287.37310
12.65000 312.84529
12.75000 291.49925
12.85000 276.33415
12.95000 279.11829
13.05000 273.49355
13.15000 301.04625
13.25000 255.96594
13.35000 253.36774
13.45000 245.63147
13.55000 266.96335
13.65000 264.48703
13.75000 239.52127
13.85000 239.87353
13.95000 243.26423
14.05000 233.72832
14.15000 235.41255
14.25000 233.80706
14.35000 217.54468
14.45000 213.16831
14.55000 191.65311
14.65000 203.23054
14.75000 205.22599
14.85000 205.29302
14.95000 203.39666
15.05000 212.22278
15.15000 193.83247
15.25000 176.14288
15.35000 233.52392
15.45000 185.06574
15.55000 165.97301
15.65000 196.21258
15.75000 180.04999
15.85000 182.65246
15.95000 159.79908
16.05000 187.65720
16.15000 167.66553
16.25000 194.56487
16.35000 173.23714
16.45000 160.37959
16.55000 163.50722
16.65000 171.09976
16.75000 158.49571
16.85000 137.84240
16.95000 157.67990
17.05000 147.66540
17.15000 166.72621
17.25000 156.55786
17.35000 150.16740
17.45000 127.54479
17.55000 148.99099
17.65000 159.02891
17.75000 143.82485
17.85000 141.81621
17.95000 131.58666
18.05000 122.79944
18.15000 136.19444
18.25000 138.25263
18.35000 149.61143
18.45000 171.32883
18.55000 113.37954
18.65000 123.89388
18.75000 120.01325
18.85000 114.35477
18.95000 114.48881
19.05000 141.24643
19.15000 99.21365
19.25000 82.07416
19.35000 109.10818
19.45000 111.58224
19.55000 96.97002
19.65000 93.04534
19.75000 103.25181
19.85000 91.60233
19.95000 77.07714
