0.12500 0.03078
0.37500 0.02882
0.62500 0.01417
0.87500 0.03513
1.12500 0.04795
1.37500 0.07400
1.62500 0.08754
1.87500 0.10342
2.12500 0.12390
2.37500 0.13819
2.62500 0.15764
2.87500 0.16182
3.12500 0.16297
3.37500 0.16910
3.62500 0.18670
3.87500 0.18539
4.12500 0.17829
4.37500 0.17532
4.62500 0.16395
4.87500 0.15010
5.12500 0.14158
5.37500 0.12654
5.62500 0.10741
5.87500 0.08384
6.12500 0.07195
6.37500 0.05238
6.62500 0.05245
6.87500 0.05807
7.12500 0.05325
7.37500 0.04447
7.62500 0.06997
7.87500 0.06265
8.12500 0.05475
8.37500 0.05617
8.62500 0.06628
8.87500 0.06152
9.12500 0.05905
9.37500 0.06817
9.62500 0.04148
9.87500 0.05874
10.12500 0.05373
10.37500 0.04691
10.62500 0.05088
10.87500 0.04171
11.12500 0.04401
11.37500 0.05524
11.62500 0.05158
11.87500 0.04315
12.12500 0.05545
12.37500 0.04082
12.62500 0.02413
12.87500 0.03928
13.12500 0.04846
13.37500 0.04122
13.62500 0.04399
13.87500 0.05900
14.12500 0.06933
14.37500 0.07263
14.62500 0.05459
14.87500 0.04109
15.12500 0.02386
15.37500 0.03017
15.62500 0.03275
15.87500 0.02669
16.12500 0.01818
16.37500 0.02033
16.62500 0.03208
16.87500 0.05921
17.12500 0.00781
17.37500 0.01124
17.62500 0.03426
17.87500 0.03996
18.12500 0.03932
18.37500 0.02526
18.62500 0.04085
18.87500 0.02135
19.12500 0.01659
19.37500 0.03305
19.62500 0.00957
19.87500 0.03571
