0.125 0.001 -0.002 0.009
0.375 -0.011 -0.000 0.134
0.625 -0.008 -0.003 0.447
0.875 -0.001 0.019 0.950
1.125 0.015 -0.029 1.493
1.375 -0.009 -0.001 2.088
1.625 -0.007 -0.023 2.721
1.875 0.006 -0.000 3.414
2.125 -0.007 0.033 4.216
2.375 0.031 0.044 5.152
2.625 -0.016 0.017 6.199
2.875 -0.036 0.013 7.634
3.125 -0.025 0.038 9.310
3.375 0.018 0.058 10.973
3.625 -0.080 0.061 12.616
3.875 -0.040 0.089 13.979
4.125 -0.031 0.111 15.242
4.375 -0.004 0.087 16.426
4.625 -0.039 0.115 17.243
4.875 0.014 0.059 18.347
5.125 -0.095 0.070 19.026
5.375 -0.001 0.140 19.588
5.625 0.003 0.152 20.566
5.875 0.008 0.137 21.025
6.125 -0.028 0.096 21.648
6.375 -0.014 0.148 22.483
6.625 -0.085 0.171 22.450
6.875 0.036 0.141 23.124
7.125 -0.010 0.176 23.391
7.375 -0.070 0.144 23.438
7.625 -0.084 0.157 23.415
7.875 -0.120 0.152 24.491
8.125 -0.085 0.106 24.309
8.375 -0.104 0.132 24.936
8.625 -0.056 0.139 25.751
8.875 -0.014 0.130 25.983
9.125 -0.038 0.090 26.258
9.375 -0.012 0.073 26.555
9.625 -0.021 0.072 26.650
9.875 -0.078 0.089 26.862
10.125 -0.080 0.110 26.109
10.375 0.019 0.070 25.788
10.625 -0.030 0.152 25.362
10.875 -0.028 0.074 24.469
11.125 0.013 0.103 24.335
11.375 -0.066 0.071 23.874
11.625 -0.092 0.042 23.214
11.875 -0.063 0.070 22.644
12.125 -0.015 0.067 22.308
12.375 -0.091 0.017 21.888
12.625 -0.065 0.147 21.263
12.875 -0.009 0.083 21.168
13.125 -0.089 0.058 21.600
13.375 -0.044 0.048 20.855
13.625 -0.086 0.038 20.270
13.875 -0.069 0.018 19.582
14.125 -0.072 0.019 18.682
14.375 -0.049 0.009 18.205
14.625 -0.021 -0.000 17.650
14.875 -0.014 0.024 17.215
15.125 -0.017 0.009 16.632
15.375 0.013 0.008 16.407
15.625 0.013 -0.009 15.793
15.875 0.046 0.010 15.708
16.125 0.037 0.059 15.196
16.375 0.021 0.030 14.886
16.625 0.027 0.033 14.321
16.875 0.014 0.011 13.574
17.125 0.042 0.020 13.420
17.375 0.020 0.038 12.893
17.625 0.011 -0.007 12.126
17.875 0.030 0.011 12.126
18.125 0.010 0.014 11.364
18.375 0.033 0.013 10.683
18.625 0.031 0.003 10.364
18.875 0.010 0.017 9.886
19.125 0.040 0.029 9.420
19.375 0.043 0.035 9.233
19.625 0.062 0.049 8.793
19.875 0.050 0.058 8.622
