0.12500 0.01213
0.37500 0.00654
0.62500 0.00292
0.87500 0.01760
1.12500 0.00926
1.37500 0.02636
1.62500 0.04495
1.87500 0.03733
2.12500 0.03246
2.37500 0.01313
2.62500 0.02483
2.87500 0.01425
3.12500 0.00620
3.37500 0.01301
3.62500 0.01683
3.87500 0.02215
4.12500 0.01613
4.37500 0.00160
4.62500 0.01986
4.87500 0.03438
5.12500 0.01875
5.37500 0.00652
5.62500 0.01234
5.87500 0.02703
6.12500 0.00708
6.37500 0.01168
6.62500 0.01944
6.87500 0.02547
7.12500 0.02318
7.37500 0.01659
7.62500 0.00950
7.87500 0.01628
8.12500 0.02208
8.37500 0.01280
8.62500 0.02598
8.87500 0.01435
9.12500 0.01622
9.37500 0.00627
9.62500 0.02416
9.87500 0.02245
10.12500 0.02073
10.37500 0.02510
10.62500 0.00855
10.87500 0.02347
11.12500 0.02186
11.37500 0.02340
11.62500 0.01235
11.87500 0.01751
12.12500 0.02788
12.37500 0.01771
12.62500 0.02580
12.87500 0.02636
13.12500 0.01308
13.37500 0.04266
13.62500 0.02421
13.87500 0.03547
14.12500 0.03955
14.37500 0.02994
14.62500 0.04843
14.87500 0.02327
