0.120000 -3.070450
0.380000 1.449050
0.620000 -2.291730
0.880000 1.204220
1.120000 -3.100780
1.380000 2.682230
1.620000 2.405570
1.880000 1.338990
2.120000 2.291700
2.380000 1.507330
2.620000 1.879700
2.880000 1.771350
3.120000 1.612710
3.380000 1.818450
3.620000 1.842060
3.880000 -2.277680
4.120000 -2.043040
4.380000 3.131120
4.620000 -3.131060
4.880000 2.559270
5.120000 1.971980
5.380000 1.891940
5.620000 1.197240
5.880000 1.201630
6.120000 1.345530
6.380000 1.738750
6.620000 1.703270
6.880000 1.747000
7.120000 1.521660
7.380000 1.313240
7.620000 0.859170
7.880000 1.536080
8.120000 -1.951290
8.380000 -1.472210
8.620000 1.524600
8.880000 -0.450010
9.120000 -1.354800
9.380000 -2.968800
9.620000 2.574930
9.880000 -0.484540
10.120000 -0.173440
10.380000 1.404710
10.620000 0.861190
10.880000 0.707170
11.120000 0.375220
11.380000 0.347850
11.620000 0.857880
11.880000 0.803590
12.120000 1.140580
12.380000 -2.419460
12.620000 1.902840
12.880000 -3.111750
13.120000 -1.649540
13.380000 -2.079340
13.620000 -2.997460
13.880000 -2.092220
14.120000 -2.416030
14.380000 -2.306860
14.620000 2.720440
14.880000 -2.551070
