0.05000 -801.59311 0.60814 -68.41394 1262.18489 1049.12088 1775.94492
0.15000 -2230.48440 137.88462 -225.18386 1084.50032 911.14720 2840.77934
0.25000 -3274.95704 94.91801 37.46596 1122.34203 841.35506 4108.02076
0.35000 -4065.82269 115.29265 88.19754 1224.49735 722.54489 4987.70347
0.45000 -4582.14966 154.59367 129.80132 1326.52477 716.81170 5595.35704
0.55000 -4967.03030 165.94534 86.51890 1423.71788 735.71926 5986.70212
0.65000 -5301.83076 149.06952 -44.04817 1459.10047 749.32699 6338.68758
0.75000 -5593.43292 155.35642 69.07487 1483.54606 747.36568 6563.90226
0.85000 -5886.06671 118.99156 92.51534 1461.72109 728.30668 6741.43535
0.95000 -6178.76521 152.11288 147.19760 1414.22128 744.35461 6649.90359
1.05000 -6335.77824 113.33346 12.53557 1448.55896 730.67228 6628.30527
1.15000 -6472.15369 127.45168 -157.14294 1412.19663 731.02204 6526.22877
1.25000 -6620.66867 101.71138 69.01515 1370.17426 737.90828 6400.99355
1.35000 -6706.62987 130.97965 -140.34091 1324.50786 724.86644 6273.68727
1.45000 -6724.51442 129.81587 114.76823 1290.93017 727.71178 6197.35801
1.55000 -6805.16322 145.99666 22.53430 1230.09909 743.02748 5924.59964
1.65000 -6901.38228 143.89005 -14.60177 1136.58066 742.04020 5699.82356
1.75000 -6944.57559 143.01471 57.62466 1094.00247 734.90554 5587.31159
1.85000 -6990.17510 138.77512 -1.37976 1018.27900 728.71710 5511.85303
1.95000 -7057.03045 147.83843 3.41632 982.40284 705.03134 5365.73597
2.05000 -7149.65662 135.98402 11.79824 895.66372 683.67848 5161.38038
2.15000 -7189.91868 117.33614 29.40668 864.95334 660.83739 5019.21192
2.25000 -7204.60605 116.99424 -116.67206 854.43584 641.50180 4915.49310
2.35000 -7278.08068 138.50309 52.97169 749.69961 622.74827 4728.71577
2.45000 -7323.33679 135.34923 34.08871 760.52819 590.66265 4617.73365
2.55000 -7366.56120 131.27123 -17.97956 761.58378 570.62496 4514.79267
2.65000 -7418.25994 132.54310 65.67239 722.22411 539.47532 4365.83314
2.75000 -7441.47239 136.00008 -44.36036 704.78827 510.01249 4236.64747
2.85000 -7448.65589 127.46161 -103.80796 727.27891 477.22424 4125.07116
2.95000 -7448.85839 127.83471 35.19560 707.94556 442.30731 4042.07544
3.05000 -7450.99431 130.84298 15.67572 690.23905 415.37314 3914.85188
3.15000 -7452.11771 133.11088 -31.19413 675.73978 384.86767 3766.17478
3.25000 -7427.70415 132.12554 -1.46993 669.05047 356.83763 3669.53461
3.35000 -7394.85303 136.54828 -13.84003 651.59044 329.94978 3606.90372
3.45000 -7360.04918 133.38270 -35.67574 631.93263 306.73713 3491.07103
3.55000 -7328.22737 134.02736 -5.32454 588.58419 290.02343 3355.36021
3.65000 -7274.69293 126.24398 68.64363 582.52881 268.49178 3285.35648
3.75000 -7242.92615 129.65220 29.45119 551.57090 252.84917 3175.71730
3.85000 -7184.49710 129.46654 56.71713 512.31931 235.53335 3101.58995
3.95000 -7146.46520 128.25037 93.70146 485.89705 222.24989 3002.48002
4.05000 -7102.15723 125.18854 45.73996 464.69102 207.64743 2943.96892
4.15000 -7072.52029 120.71170 26.83546 460.18897 197.01403 2845.35837
4.25000 -7025.07529 120.55814 18.75124 439.25355 185.93538 2787.40480
4.35000 -6989.45552 125.26487 95.64557 415.49594 180.57985 2672.17219
4.45000 -6933.75281 116.34686 93.09082 402.68703 170.14368 2641.49624
4.55000 -6885.62788 112.31204 70.87488 385.69475 160.29313 2583.82741
4.65000 -6841.02470 108.62000 53.46721 371.12993 155.25208 2484.94910
4.75000 -6786.58525 106.91327 45.38714 363.42109 146.81725 2426.46790
4.85000 -6738.48844 108.88316 98.58765 357.55999 143.19003 2373.59069
4.95000 -6685.53012 105.19351 66.85541 330.63293 133.89253 2313.15672
5.05000 -6633.52587 101.54480 59.90874 318.71771 131.28706 2234.46684
5.15000 -6578.72922 101.03191 53.35504 309.30567 126.54005 2211.68202
5.25000 -6528.23793 95.52075 128.92863 310.06167 121.97328 2154.85852
5.35000 -6485.10432 96.52396 68.17483 289.83769 116.03564 2079.66544
5.45000 -6425.11047 93.66441 39.66765 289.79179 112.98571 2039.95304
5.55000 -6385.06389 92.85713 67.46520 258.72009 110.17376 1982.93037
5.65000 -6337.37729 90.40654 29.10801 267.73744 107.19674 1942.45345
5.75000 -6300.09193 88.65315 44.97813 243.47610 105.42586 1895.30973
5.85000 -6250.20069 85.00300 68.25467 255.81127 103.42659 1866.52130
5.95000 -6211.57110 86.16922 0.04523 237.55107 100.16233 1817.31676
6.05000 -6166.41106 82.84650 26.45736 242.23442 99.87284 1771.48807
6.15000 -6125.57189 80.78831 -22.60832 233.25184 97.53257 1722.95517
6.25000 -6074.32616 80.45366 6.84432 220.26873 96.98570 1692.26467
6.35000 -6026.74696 76.17726 -38.42643 209.95108 95.82129 1650.87198
6.45000 -5976.81969 76.35710 -33.30921 224.45121 91.05118 1615.22087
6.55000 -5935.50450 73.96462 -40.39790 202.86734 91.76761 1571.69490
6.65000 -5897.99047 73.47679 -20.10680 199.06827 89.16309 1535.01011
6.75000 -5858.45236 70.96231 -72.25419 214.69964 86.50883 1495.26407
6.85000 -5815.64281 69.81458 -81.70519 201.49049 85.03128 1456.44543
6.95000 -5763.88684 69.31997 -37.30787 193.03604 82.01155 1441.02358
7.05000 -5717.04770 69.74760 -87.92635 191.63875 79.50508 1397.38141
7.15000 -5669.95622 66.55095 -58.32744 180.43606 78.65469 1364.45238
7.25000 -5627.12753 66.58573 -86.71034 193.52275 76.96017 1322.87151
7.35000 -5580.71815 66.15165 -65.95965 175.40138 75.93112 1310.83984
7.45000 -5534.59558 63.15954 -84.72828 178.56575 74.19207 1272.58092
7.55000 -5494.36295 63.51289 -75.36363 167.23224 74.18959 1246.18465
7.65000 -5448.90730 62.73189 -79.74825 165.80786 72.19221 1210.68501
7.75000 -5406.60497 61.29310 -75.37058 176.74077 70.63146 1183.94692
7.85000 -5358.70754 58.39617 -84.97272 158.85382 68.66298 1177.98874
7.95000 -5316.97318 58.80969 -87.83223 145.89293 67.56140 1138.25020
8.05000 -5271.35283 58.57190 -74.15868 164.16446 68.46211 1112.08308
8.15000 -5231.75139 56.81101 -89.54407 141.93844 68.99383 1070.85369
8.25000 -5194.09972 56.26739 -115.40955 139.60116 66.73138 1053.19030
8.35000 -5157.68586 55.09219 -73.14716 138.20341 66.92774 1028.30910
8.45000 -5114.87362 55.07691 -59.07466 137.70974 61.94983 1004.08572
8.55000 -5072.64983 52.40485 -78.77162 144.59141 62.73323 984.75528
8.65000 -5034.63238 52.73333 -87.46706 129.08224 62.25484 951.23932
8.75000 -4992.43927 50.67899 -82.65738 124.86685 60.17953 945.15146
8.85000 -4954.33564 50.56165 -82.81249 130.02792 58.57902 906.57258
8.95000 -4907.91453 50.22681 -55.43233 127.34760 56.22469 895.89670
9.05000 -4866.27048 47.75718 -50.21281 121.50975 54.22700 876.09745
9.15000 -4825.20360 46.90048 -44.76206 120.67135 56.42380 856.72465
9.25000 -4791.23929 47.49096 -72.42917 119.21149 53.82666 837.17147
9.35000 -4752.60243 44.23055 -53.17248 121.00862 52.97815 825.56974
9.45000 -4714.80114 45.52728 -34.96858 115.50748 51.40227 806.76990
9.55000 -4676.13575 45.57643 -22.76852 115.47855 50.17369 796.32496
9.65000 -4637.93275 44.45392 -9.92460 112.38369 48.67729 779.80175
9.75000 -4604.13628 43.54251 -46.07173 107.24739 48.48267 745.52480
9.85000 -4565.97580 41.81961 -35.25239 104.86751 48.82747 737.60288
9.95000 -4532.61675 42.63560 -20.35418 103.27205 49.18532 718.91090
10.05000 -4496.52217 42.31011 -43.69873 108.87032 48.69601 696.78903
10.15000 -4458.66542 40.17730 -16.92030 102.46129 48.78658 693.68268
10.25000 -4421.92615 39.70676 0.32328 95.17297 47.82214 675.36574
10.35000 -4389.49198 38.93108 0.96056 92.91528 47.78581 654.82256
10.45000 -4350.36377 38.10421 6.56763 91.21944 46.67141 645.54907
10.55000 -4319.28202 39.90991 -2.68923 85.34983 45.81107 618.33139
10.65000 -4283.19070 36.51799 3.06598 90.68996 45.05047 612.73906
10.75000 -4250.90396 35.76337 18.87429 86.40375 45.03911 597.12603
10.85000 -4215.01955 38.20007 9.66589 87.87231 44.21443 579.27893
10.95000 -4178.47902 35.00371 20.03161 88.80402 43.51507 570.57917
11.05000 -4144.35127 34.47212 32.71864 88.39239 41.91564 560.45641
11.15000 -4105.72218 34.62912 12.22216 95.53475 41.97109 561.98175
11.25000 -4072.39109 33.73006 22.14398 86.23317 41.04930 540.62220
11.35000 -4038.78724 34.46869 17.00112 82.74121 41.41466 523.83942
11.45000 -4004.91377 33.08445 26.57387 79.27592 40.73659 510.15719
11.55000 -3967.44001 32.53192 1.42204 80.87604 40.71707 505.58194
11.65000 -3937.30202 31.63366 4.14895 77.96891 39.45894 491.81427
11.75000 -3906.81701 31.08515 0.89405 72.76374 38.23211 482.21710
11.85000 -3878.39793 29.73882 1.05337 74.01181 36.04714 464.92874
11.95000 -3844.01957 29.95544 -3.21758 67.65222 36.70724 458.60412
12.05000 -3812.77520 29.23957 20.19569 64.66673 35.58636 448.85870
12.15000 -3787.12920 29.32476 3.45829 64.03843 36.48640 442.81276
12.25000 -3758.28564 28.09443 -4.96192 61.97670 35.90186 440.10058
12.35000 -3730.73327 27.54029 -0.18459 58.86891 33.95086 424.42253
12.45000 -3701.23859 27.74623 -6.80161 58.50136 34.67519 415.02605
12.55000 -3672.46484 26.70326 -5.16204 56.24033 34.44362 407.69353
12.65000 -3647.37566 28.78744 4.13276 55.27612 35.58683 390.62301
12.75000 -3620.46397 28.48580 13.42918 53.09543 35.67007 394.45465
12.85000 -3593.57179 25.35273 -16.91819 53.24990 34.73128 381.60775
12.95000 -3570.27290 26.23233 -16.90090 53.13164 34.63000 379.30977
13.05000 -3547.05341 25.86993 -6.32882 52.00733 32.57346 368.41389
13.15000 -3522.63099 24.20030 -4.72987 50.49319 34.37133 365.82884
13.25000 -3496.39273 25.13508 -18.02227 50.50611 33.07164 360.79105
13.35000 -3475.02716 24.30891 -16.10827 50.27396 33.04877 344.52333
13.45000 -3451.18741 24.04593 -5.21232 46.07712 32.67443 337.83864
13.55000 -3423.27781 23.05079 -9.79328 48.39716 32.07415 335.80131
13.65000 -3401.91897 26.02006 -2.89004 47.86537 33.11048 325.64900
13.75000 -3377.06719 23.84836 -15.03559 47.55688 32.36454 326.45235
13.85000 -3352.94091 22.38241 -4.75089 45.27057 31.16933 309.67213
13.95000 -3328.85867 23.04026 -16.70838 47.36631 31.38074 314.27106
14.05000 -3305.30738 22.37829 -17.08594 46.18731 31.29227 307.50908
14.15000 -3284.79277 22.32022 2.67290 44.37452 31.37547 303.24055
14.25000 -3260.48322 22.59469 -1.85380 41.61416 30.89111 299.86153
14.35000 -3239.21518 21.83313 -1.86880 43.17492 31.44368 294.84605
14.45000 -3214.96473 21.46494 -3.18222 41.45438 30.31194 293.08885
14.55000 -3192.84760 20.96520 -4.51749 39.02881 29.86979 277.06171
14.65000 -3171.89665 21.94450 5.19417 38.34855 29.12083 270.94256
14.75000 -3148.80613 20.93410 -4.14059 38.47432 29.53316 269.00374
14.85000 -3126.17757 19.28310 14.59458 37.57178 27.89573 267.89429
14.95000 -3106.36384 20.08407 9.75811 39.39230 29.17432 258.08179
15.05000 -3084.82783 19.45012 -2.46855 39.49933 27.83338 254.45159
15.15000 -3062.52504 18.68801 10.46055 37.70909 27.71703 249.24522
15.25000 -3041.28380 18.65185 3.86201 39.06153 26.79355 250.54844
15.35000 -3022.08175 20.97388 7.03876 39.29878 26.31242 237.36216
15.45000 -2999.11326 18.10426 7.92791 37.70288 27.23469 235.32686
15.55000 -2980.93790 17.00958 6.16222 37.35674 27.58947 229.17867
15.65000 -2961.15260 18.20964 6.75621 37.88737 27.62358 220.09448
15.75000 -2942.44434 18.81998 9.87590 34.19506 26.51715 215.11839
15.85000 -2922.67691 17.45157 4.81132 35.67226 25.01095 212.30109
15.95000 -2899.84673 18.49502 9.40877 35.22574 26.33952 208.27613
16.05000 -2879.13939 17.86602 12.88705 32.62076 26.31458 208.40903
16.15000 -2860.64034 15.64057 12.70312 34.16145 25.69014 203.64986
16.25000 -2839.92080 17.87142 18.90585 32.56397 25.46047 202.22147
16.35000 -2821.96750 14.54528 6.57911 30.14444 25.24565 187.91251
16.45000 -2799.17395 16.40905 14.66164 28.81813 24.96650 199.89360
16.55000 -2782.07858 15.47325 4.77982 31.27550 25.96910 186.98609
16.65000 -2763.07676 13.28325 7.35569 28.81065 24.88165 185.21525
16.75000 -2744.82840 14.67734 1.95208 31.27509 24.91219 183.19827
16.85000 -2726.97244 15.85397 3.38906 31.11409 26.42335 180.16747
16.95000 -2709.63144 15.33857 6.58205 29.21998 26.62036 184.46877
17.05000 -2691.39803 16.42301 -11.61280 28.24444 24.95994 178.46310
17.15000 -2675.80946 12.76282 -6.63975 28.35780 25.55637 169.63974
17.25000 -2659.98361 15.82352 -5.80327 29.82173 25.31775 163.24536
17.35000 -2641.57085 13.63833 -5.27492 28.71822 24.95435 164.77377
17.45000 -2625.46417 13.94689 4.50880 27.41134 23.77755 163.15101
17.55000 -2607.80185 15.19407 -3.85795 27.01395 23.38990 155.03327
17.65000 -2592.41998 14.90313 5.18018 25.63507 24.76622 147.77890
17.75000 -2577.41339 14.84571 -9.15443 27.21455 22.93742 148.54786
17.85000 -2562.08700 13.45631 -6.53427 24.74027 24.59812 151.55771
17.95000 -2544.26966 13.92645 -4.69259 26.06158 24.83731 150.50114
18.05000 -2532.93697 13.98101 1.49088 25.51847 25.53904 135.61175
18.15000 -2517.50111 12.58534 -2.11184 24.80836 23.81649 140.16019
18.25000 -2500.87227 13.15299 -1.23393 26.82729 23.94916 138.10273
18.35000 -2485.92399 11.45463 3.61926 24.49434 23.32300 144.24392
18.45000 -2473.80873 12.34499 -1.08298 27.44927 23.01166 139.76545
18.55000 -2459.22317 12.75123 6.86242 25.69481 23.83906 137.75961
18.65000 -2446.44160 12.33342 2.86679 24.23045 22.81891 129.95318
18.75000 -2429.92327 12.88067 8.47096 24.58212 22.52420 136.68211
18.85000 -2411.16443 11.21850 12.33917 23.80272 23.86129 132.04155
18.95000 -2402.10989 10.20603 19.41547 23.71492 22.14491 131.56890
19.05000 -2384.76167 11.99287 8.79600 24.04796 21.73480 130.66913
19.15000 -2371.68439 12.13710 12.64332 22.33792 22.40653 121.05596
19.25000 -2354.60906 12.45699 16.72088 24.95748 21.51004 129.81420
19.35000 -2342.03959 15.51021 24.79266 23.46456 21.58128 128.14217
19.45000 -2325.65514 21.09540 28.57029 21.44191 23.27933 119.93960
19.55000 -2314.40381 24.48584 27.25242 21.79986 21.06896 113.06302
19.65000 -2300.00799 23.99001 22.51068 21.49365 21.50734 118.16735
19.75000 -2289.84201 27.72810 24.79665 20.34082 20.53582 107.53557
19.85000 -2275.83192 27.55362 14.18063 19.76206 19.38950 113.45806
19.95000 -2263.90485 28.18095 18.80922 21.69201 21.74598 110.75062
