0.12500 0.05405
0.37500 0.05468
0.62500 0.11436
0.87500 0.11569
1.12500 0.14605
1.37500 0.18112
1.62500 0.20797
1.87500 0.20310
2.12500 0.22234
2.37500 0.23360
2.62500 0.23178
2.87500 0.19844
3.12500 0.17673
3.37500 0.16960
3.62500 0.12646
3.87500 0.10080
4.12500 0.05313
4.37500 0.02160
4.62500 0.00981
4.87500 0.01558
5.12500 0.02924
5.37500 0.03778
5.62500 0.03626
5.87500 0.02890
6.12500 0.04883
6.37500 0.06038
6.62500 0.05441
6.87500 0.04297
7.12500 0.04285
7.37500 0.04549
7.62500 0.02886
7.87500 0.01785
8.12500 0.02546
8.37500 0.02826
8.62500 0.03046
8.87500 0.03789
9.12500 0.04605
9.37500 0.04886
9.62500 0.03560
9.87500 0.01174
10.12500 0.01540
10.37500 0.00725
10.62500 0.04139
10.87500 0.03104
11.12500 0.05503
11.37500 0.04521
11.62500 0.04573
11.87500 0.06733
12.12500 0.07918
12.37500 0.04208
12.62500 0.01999
12.87500 0.04161
13.12500 0.06000
13.37500 0.02691
13.62500 0.03923
13.87500 0.03462
14.12500 0.04495
14.37500 0.00962
14.62500 0.01375
14.87500 0.05266
