0.05000 -12897.41920 1558.82654 5236.55706 13294.58590 11701.87173 14517.73607
0.15000 -24575.83089 -596.01765 2343.92553 11969.42985 9348.13660 24905.63353
0.25000 -26254.51283 -51.20609 2583.51605 10871.61215 8415.99281 24741.48241
0.35000 -26332.40065 185.25763 69.95561 9639.33200 6915.41013 24793.10674
0.45000 -25395.42072 -152.84467 408.91101 8573.01993 5928.61772 22470.59647
0.55000 -24274.70928 2.78339 -955.34654 8019.68700 5477.73924 21441.45411
0.65000 -22364.13262 66.26054 -659.27542 7387.28679 4841.39441 20372.97610
0.75000 -21026.31054 83.95950 -785.77270 6672.72517 4629.24399 18617.69146
0.85000 -19719.36952 7.34731 114.28441 5927.46815 4259.66093 17205.44388
0.95000 -18868.52663 187.78303 -71.04587 5490.73904 4065.96760 15867.79721
1.05000 -18025.98970 21.23457 -37.63668 5319.84307 3986.25834 14982.51882
1.15000 -17300.84295 41.79240 184.39898 5051.46097 3837.57165 13933.07814
1.25000 -16536.42360 -10.47508 118.16708 4554.51615 3515.34159 13151.39790
1.35000 -15808.44133 115.83876 -94.60870 4324.26672 3344.01527 12354.70538
1.45000 -15219.69088 125.04737 17.80495 4042.82447 3228.49267 11728.41574
1.55000 -14869.94779 48.22181 -141.33254 3779.38051 3126.61430 10832.13462
1.65000 -14249.22712 95.11790 -49.66921 3597.50626 3021.06292 10467.30739
1.75000 -13820.55294 56.02820 -391.44935 3401.24666 2893.15867 9830.07664
1.85000 -13494.60036 34.51491 -271.50420 3079.80155 2740.54840 9205.06692
1.95000 -13105.89884 74.26180 88.85580 3012.05749 2767.09780 8860.78253
2.05000 -12663.49593 73.97533 -23.39782 2724.66160 2526.53212 8512.12468
2.15000 -12167.87017 7.20064 -97.92619 2656.33964 2492.69619 8184.16368
2.25000 -11815.50296 -34.09283 -194.70784 2708.71746 2577.73217 8006.04470
2.35000 -11634.89891 -65.73705 -46.83514 2348.78898 2319.12212 7503.05938
2.45000 -11332.30463 77.19594 -228.14344 2237.62774 2206.97855 7263.40423
2.55000 -11000.22113 51.77299 -138.12904 2130.07324 2239.05309 7063.44438
2.65000 -10838.31351 -85.87567 193.46421 2068.26324 2169.42340 6628.38043
2.75000 -10533.58605 -11.47981 -127.87842 2064.39962 2044.85483 6404.26791
2.85000 -10290.57078 15.97940 -112.85565 1950.93576 2020.39327 6243.98012
2.95000 -10075.18411 110.41198 -83.75287 1885.12627 1996.82970 6081.01037
3.05000 -9882.72450 17.92531 -328.34267 2004.64397 1832.71775 5844.39988
3.15000 -9720.62241 -42.90885 -232.21695 1682.90830 1752.47501 5593.36213
3.25000 -9494.77564 88.35503 -181.07406 1702.22599 1738.19575 5488.60275
3.35000 -9316.84986 5.69038 -67.28841 1519.04866 1616.32102 5251.84585
3.45000 -9095.70967 -41.91048 -28.31913 1481.10796 1578.06793 5214.11203
3.55000 -8950.09166 -32.84956 -304.32772 1460.77465 1593.42283 4966.08120
3.65000 -8822.30393 -43.00791 -110.50337 1290.90486 1471.66486 4776.93286
3.75000 -8596.78918 31.94061 -100.99162 1340.37483 1498.05758 4801.41988
3.85000 -8451.77292 58.78708 75.63837 1199.65830 1358.20737 4603.44684
3.95000 -8299.57902 57.33622 33.16934 1302.44415 1481.28299 4438.72721
4.05000 -8152.59953 42.70217 -54.46756 1254.67783 1335.62939 4488.15091
4.15000 -8038.05500 -11.75834 102.29760 1076.98723 1238.71161 4266.30113
4.25000 -7931.14688 9.75200 -96.01109 1028.02843 1363.57831 4194.81006
4.35000 -7787.79899 77.57293 -47.47501 1091.61921 1191.07011 3998.95400
4.45000 -7694.66860 20.46009 96.53930 1053.62128 1174.71187 3869.90520
4.55000 -7559.48252 -1.92004 -91.21749 965.72897 1097.55810 3848.01829
4.65000 -7494.18355 -17.55332 -124.47704 1028.92374 1088.27704 3721.49080
4.75000 -7339.29136 -44.22063 59.53312 888.08091 1119.88791 3629.96573
4.85000 -7258.10259 -18.78689 -53.21888 839.30845 1007.89483 3453.26332
4.95000 -7146.66146 23.42105 -11.48176 833.22774 997.69692 3380.94483
5.05000 -7076.07942 17.04966 -45.73690 768.17974 990.11932 3269.91407
5.15000 -7003.14235 -8.83651 -21.40023 766.95913 926.03115 3077.61482
5.25000 -6907.37553 25.36165 32.54816 738.86282 901.42408 3073.87133
5.35000 -6813.18232 17.48143 -197.69584 670.39736 886.07575 2966.45876
5.45000 -6707.93939 -3.66079 -94.91119 712.26703 930.28646 2878.29655
5.55000 -6645.00181 -22.50000 19.01142 781.44689 847.85598 2807.30331
5.65000 -6535.19464 -45.40422 35.74261 633.55925 797.29253 2623.42143
5.75000 -6454.82522 -5.40782 13.02492 938.21432 852.91564 2598.91848
5.85000 -6372.41139 -42.12247 33.88796 620.55119 817.50926 2563.75132
5.95000 -6336.99263 10.12445 -94.30054 828.60909 818.40346 2410.35067
6.05000 -6277.80604 8.64648 34.18517 498.49806 812.89850 2261.30535
6.15000 -6182.90120 -21.76720 11.83861 530.01690 731.37571 2210.96926
6.25000 -6118.11436 10.72774 37.35387 480.71488 688.79708 2117.34494
6.35000 -6061.02905 -18.08919 31.78582 517.53890 707.15700 2128.43316
6.45000 -6007.01115 -19.78581 4.38759 457.26408 646.31858 2002.51918
6.55000 -5963.04561 -30.35504 76.28626 494.24825 663.48990 1909.35624
6.65000 -5899.99653 -0.95183 140.61793 403.56988 621.42017 1884.00632
6.75000 -5867.08016 3.68458 90.78050 403.80962 622.59772 1777.96382
6.85000 -5820.38681 -14.43807 114.92738 625.87557 705.89463 1884.55967
6.95000 -5732.87799 27.77973 112.87190 455.36776 614.48786 1686.23818
7.05000 -5702.96434 -12.62201 124.08134 466.83756 576.94878 1644.98083
7.15000 -5652.32259 13.90060 159.59767 447.04118 572.23900 1604.78804
7.25000 -5633.03644 1.93438 152.12394 506.27246 572.77393 1517.96830
7.35000 -5592.78393 52.90014 122.92943 463.52512 595.78939 1476.03481
7.45000 -5575.81570 36.77828 107.96588 465.57870 543.53856 1425.44808
7.55000 -5549.33562 31.68242 236.82874 444.76191 543.49046 1392.87859
7.65000 -5504.41865 41.85838 129.54675 445.15884 500.19616 1322.33799
7.75000 -5468.47855 27.58369 168.04265 545.25023 498.56380 1334.20891
7.85000 -5445.25976 49.41569 183.47133 579.75674 507.03796 1302.39986
7.95000 -5425.61447 21.89416 177.46085 514.80973 473.31449 1294.46834
8.05000 -5407.57502 30.68968 58.80956 538.66031 461.48331 1228.73834
8.15000 -5338.03148 21.65209 85.68318 540.76759 455.76868 1189.52545
8.25000 -5290.91730 20.93631 151.41416 488.43799 414.49330 1161.91428
8.35000 -5261.59429 35.86732 128.00120 486.41627 412.16102 1115.62052
8.45000 -5210.62749 24.75291 153.70533 520.71211 439.67748 1123.30092
8.55000 -5148.97552 23.86006 129.05022 459.89280 402.94781 1047.57185
8.65000 -5120.58437 29.41879 118.83638 471.72488 410.78302 1072.26567
8.75000 -5067.03324 21.01613 71.59463 429.22920 340.17566 1047.90765
8.85000 -5000.03358 20.48689 118.65249 452.49954 384.80753 978.02316
8.95000 -4972.36341 14.99771 68.75413 461.31375 369.61140 953.94468
9.05000 -4925.25254 12.31083 80.18868 410.34991 315.56288 928.02138
9.15000 -4862.41707 13.35062 90.26684 391.02737 286.44650 927.40156
9.25000 -4833.74332 27.76138 71.08244 413.23879 269.20640 897.95036
9.35000 -4798.46231 27.83351 83.44111 347.94247 266.57630 864.91183
9.45000 -4747.52270 26.36438 73.72449 329.97582 243.02335 872.01821
9.55000 -4689.63586 21.62163 77.18315 386.73081 314.26128 833.08485
9.65000 -4657.42659 9.93233 39.17427 346.44782 284.49683 850.05146
9.75000 -4615.71694 14.15770 83.80522 343.79215 342.98523 791.88581
9.85000 -4564.14783 15.52345 22.71866 347.99419 254.32718 787.16974
9.95000 -4535.56104 15.03272 76.94854 297.97698 212.23136 758.61678
10.05000 -4474.19987 13.50896 97.07778 343.11986 201.72968 749.34799
10.15000 -4443.43962 23.10979 69.85883 482.64939 215.25613 740.27089
10.25000 -4404.89794 9.68782 108.80180 331.82995 242.12371 732.53977
10.35000 -4356.86912 22.33844 86.85890 284.81598 271.76434 715.34790
10.45000 -4353.92602 16.30070 71.74394 322.78603 283.26735 690.31232
10.55000 -4284.43536 11.18845 93.53628 249.55317 194.70914 666.62521
10.65000 -4276.50569 18.01866 69.78092 263.46812 180.05050 662.74463
10.75000 -4230.91301 25.44569 77.61289 245.71287 246.35268 635.89567
10.85000 -4209.05771 8.87788 46.53518 269.48284 235.54704 642.01315
10.95000 -4158.11488 13.23964 53.86896 251.04763 187.95430 638.92612
11.05000 -4131.45053 7.55269 84.54617 213.51455 165.98427 621.28505
11.15000 -4105.79376 2.43739 58.33461 189.99475 155.80237 599.63126
11.25000 -4061.03268 14.69180 61.55831 242.97774 219.61729 610.45330
11.35000 -4023.80268 20.49340 26.31210 246.59962 222.30296 597.30340
11.45000 -4014.49887 0.32600 60.45941 200.23610 180.44695 593.53416
11.55000 -3984.39996 2.41786 85.29095 175.53217 216.49126 596.56354
11.65000 -3917.81440 15.08115 58.89697 290.06724 149.42008 554.50808
11.75000 -3910.42132 -4.44217 86.41860 242.35167 149.35327 539.49761
11.85000 -3879.56483 5.02501 65.34204 204.29699 167.89623 553.76358
11.95000 -3843.82251 8.64958 4.23763 176.29657 144.47447 494.76699
12.05000 -3810.97781 3.02697 49.94351 153.96692 137.94573 507.99786
12.15000 -3788.27791 13.09991 77.72951 177.84278 185.23972 558.81534
12.25000 -3750.77781 4.41362 35.30340 194.39927 257.62411 518.94900
12.35000 -3729.11318 5.12166 55.97837 194.64023 153.08587 478.26923
12.45000 -3695.56649 -7.10806 27.21765 183.51369 168.62818 536.69834
12.55000 -3674.67858 5.49855 43.59573 182.14820 130.50795 448.97915
12.65000 -3646.30485 3.83102 41.51096 208.11127 181.48427 457.20913
12.75000 -3615.40315 1.97393 83.52193 120.80286 103.04400 477.65096
12.85000 -3583.67230 8.26002 38.92460 123.84803 133.70145 437.10469
12.95000 -3560.89190 2.24740 44.14023 197.75216 133.38441 510.48145
13.05000 -3530.27215 7.31322 56.13354 122.12322 158.92177 440.74297
13.15000 -3512.52101 5.85490 39.83177 155.80510 151.02475 432.65145
13.25000 -3488.96884 11.82403 7.33503 231.87304 155.62512 419.05935
13.35000 -3462.40680 15.57822 47.47843 223.06529 144.33284 448.81043
13.45000 -3432.15351 -5.24865 30.95875 107.62115 129.86294 403.81170
13.55000 -3416.57046 9.51101 51.87458 118.82228 101.73734 428.07830
13.65000 -3390.49457 3.96308 22.46228 114.44556 97.24432 406.72596
13.75000 -3374.43683 4.32128 20.77794 187.13488 168.26496 392.17769
13.85000 -3342.45867 7.66705 18.80518 120.43775 123.47934 377.03737
13.95000 -3318.10288 7.20879 53.26299 163.16839 252.82923 417.97131
14.05000 -3303.14408 2.79540 50.61738 238.65079 119.59558 443.87097
14.15000 -3269.03678 1.80430 -0.21305 168.98202 231.62426 387.19485
14.25000 -3260.77777 7.96829 13.74932 172.16231 138.08603 366.91159
14.35000 -3227.83842 11.47322 47.76572 161.52719 103.83048 372.49625
14.45000 -3212.48106 8.64517 -12.28833 119.89336 97.62827 354.21292
14.55000 -3191.80929 7.15100 27.65588 154.40077 100.08291 335.29056
14.65000 -3176.58812 4.14728 25.69599 130.24005 121.10525 329.02783
14.75000 -3143.93453 12.64208 65.84455 176.85604 209.82662 350.85044
14.85000 -3124.86931 1.47435 56.95456 216.08660 104.86138 347.83481
14.95000 -3118.73179 11.41281 39.04748 92.58613 73.20563 313.84756
15.05000 -3075.00438 14.03746 8.38535 350.86196 206.33900 355.66632
15.15000 -3058.77876 9.72122 17.73077 169.28227 169.13486 334.78932
15.25000 -3052.23030 8.43583 12.30090 117.46119 88.93110 320.23230
15.35000 -3024.94042 1.10176 21.71209 119.13700 125.72791 303.65505
15.45000 -2998.38367 2.04222 29.78836 125.66725 338.73825 377.39233
15.55000 -2990.79987 6.16427 19.67903 117.39559 175.24779 427.09291
15.65000 -2973.13226 -14.32131 43.93490 194.31519 304.50037 363.34074
15.75000 -2947.99519 10.90689 18.67922 90.08055 69.43466 284.35820
15.85000 -2927.71600 11.09868 20.31443 112.09211 101.61967 304.04525
15.95000 -2916.47330 3.88111 24.09846 119.50261 109.45943 283.62037
16.05000 -2893.13206 8.66826 19.84325 85.64922 96.14442 276.57850
16.15000 -2867.64588 11.06655 20.74300 128.54456 66.62352 277.94547
16.25000 -2858.53992 5.23099 28.49309 135.47237 95.43400 261.83350
16.35000 -2837.92049 -2.07242 19.76411 356.38941 313.08925 390.69058
16.45000 -2817.21674 8.08789 13.62710 95.20873 70.33855 279.17118
16.55000 -2798.23204 7.95658 38.39777 127.68155 80.62319 273.25746
16.65000 -2783.79628 2.54390 30.34789 110.98391 133.35566 253.25199
16.75000 -2778.39212 13.25875 28.29232 156.50328 101.49978 270.72071
16.85000 -2767.15736 11.51139 14.33469 97.36248 167.21689 316.54814
16.95000 -2740.54083 14.09236 42.81843 123.66622 84.24083 248.19925
17.05000 -2725.87066 4.11968 64.32080 73.25632 84.25390 232.55706
17.15000 -2706.36228 9.67453 43.33428 75.50829 52.89705 246.56831
17.25000 -2691.35622 8.61161 22.33777 80.84927 80.28681 242.53387
17.35000 -2675.22687 1.40238 22.09110 181.47998 98.83182 320.81136
17.45000 -2660.16703 5.29359 32.37468 122.51308 71.68307 250.39502
17.55000 -2648.20275 7.64306 19.46990 113.96828 61.89224 224.30777
17.65000 -2631.28396 6.90247 38.90301 204.71703 110.93794 242.68351
17.75000 -2614.88661 6.11493 23.94981 88.05499 60.37772 227.47312
17.85000 -2606.90618 -0.29898 24.79567 136.77083 66.03657 274.56903
17.95000 -2585.39532 10.25437 53.42195 126.58615 119.77411 287.75041
18.05000 -2574.83320 1.92425 50.13840 76.18006 60.86003 213.80163
18.15000 -2551.76921 -4.39178 38.03524 82.00254 99.99101 219.78755
18.25000 -2544.34454 0.16496 45.88193 71.76774 58.48659 217.93593
18.35000 -2529.31355 2.31779 43.05974 73.68048 64.05124 214.99336
18.45000 -2508.86990 9.22556 19.47259 60.34233 72.37126 208.56802
18.55000 -2499.62756 6.02707 46.20236 82.15873 60.76428 186.78495
18.65000 -2490.37757 6.53936 21.75427 83.41187 94.11431 209.56387
18.75000 -2472.20228 10.97282 58.10946 51.28617 55.37830 187.98925
18.85000 -2451.63904 6.26845 48.18330 101.52765 54.38945 196.85602
18.95000 -2439.18040 6.51556 14.44855 72.25165 70.19819 193.60757
19.05000 -2438.97828 2.78013 66.19298 136.01665 72.87806 196.66487
19.15000 -2411.92374 11.92846 26.86968 55.76226 45.45409 178.82304
19.25000 -2396.49323 3.93917 40.78567 84.87652 64.14135 184.33909
19.35000 -2386.74714 5.10696 42.46153 49.76692 45.37386 165.48668
19.45000 -2372.38097 0.88759 44.97346 85.79743 71.05881 182.88576
19.55000 -2357.55239 6.35279 38.24116 72.41993 65.77732 194.06966
19.65000 -2331.31838 -1.26346 24.22232 86.97543 75.73702 179.20764
19.75000 -2314.89722 6.34217 34.74187 123.26196 67.56790 157.66867
19.85000 -2317.70868 4.94863 34.97722 47.64623 40.02404 166.30277
19.95000 -2299.45099 1.19182 26.99962 68.95989 47.71215 167.52931
