0.120000 2.152080
0.380000 0.067790
0.620000 2.827150
0.880000 -1.806350
1.120000 3.133960
1.380000 -1.460770
1.620000 -0.749040
1.880000 -1.947220
2.120000 -1.063410
2.380000 -0.916380
2.620000 -1.842570
2.880000 -1.370930
3.120000 -1.237280
3.380000 -2.219130
3.620000 -0.933750
3.880000 -0.813070
4.120000 -1.796930
4.380000 -1.956990
4.620000 -1.106630
4.880000 3.012750
5.120000 -0.192110
5.380000 -2.189780
5.620000 2.125680
5.880000 1.839680
6.120000 0.216800
6.380000 2.016250
6.620000 1.729520
6.880000 1.539160
7.120000 1.542890
7.380000 2.024390
7.620000 1.538370
7.880000 1.860590
8.120000 1.183840
8.380000 1.362260
8.620000 2.822980
8.880000 1.023720
9.120000 -0.153550
9.380000 -0.559440
9.620000 1.165770
9.880000 0.248540
10.120000 -0.080960
10.380000 0.970050
10.620000 -0.237560
10.880000 0.167320
11.120000 0.337770
11.380000 0.030150
11.620000 0.348340
11.880000 -1.319630
12.120000 -2.022220
12.380000 -0.837300
12.620000 -1.094840
12.880000 -0.468330
13.120000 0.926160
13.380000 -1.048130
13.620000 -1.224310
13.880000 -1.872300
14.120000 0.044620
14.380000 -1.544010
14.620000 0.637830
14.880000 -0.019190
