0.12500 0.01403
0.37500 0.06680
0.62500 0.13348
0.87500 0.16446
1.12500 0.22923
1.37500 0.26687
1.62500 0.28240
1.87500 0.31970
2.12500 0.36292
2.37500 0.36667
2.62500 0.39676
2.87500 0.42379
3.12500 0.44336
3.37500 0.43533
3.62500 0.43635
3.87500 0.41401
4.12500 0.42310
4.37500 0.36868
4.62500 0.35497
4.87500 0.30370
5.12500 0.25867
5.37500 0.25990
5.62500 0.22561
5.87500 0.22578
6.12500 0.18165
6.37500 0.20870
6.62500 0.18814
6.87500 0.17799
7.12500 0.18611
7.37500 0.14064
7.62500 0.16593
7.87500 0.12902
8.12500 0.12269
8.37500 0.13473
8.62500 0.11879
8.87500 0.08138
9.12500 0.09575
9.37500 0.08378
9.62500 0.07420
9.87500 0.06547
10.12500 0.03886
10.37500 0.05022
10.62500 0.06012
10.87500 0.07513
11.12500 0.05601
11.37500 0.07082
11.62500 0.07136
11.87500 0.07741
12.12500 0.06865
12.37500 0.08711
12.62500 0.09155
12.87500 0.14135
13.12500 0.10685
13.37500 0.14108
13.62500 0.11160
13.87500 0.14588
14.12500 0.08502
14.37500 0.06781
14.62500 0.08124
14.87500 0.06250
15.12500 0.03490
15.37500 0.03664
15.62500 0.02977
15.87500 0.02200
16.12500 0.03170
16.37500 0.03174
16.62500 0.02001
16.87500 0.02340
17.12500 0.09211
17.37500 0.05187
17.62500 0.02943
17.87500 0.00530
18.12500 0.06419
18.37500 0.06777
18.62500 0.02531
18.87500 0.07145
19.12500 0.10882
19.37500 0.09008
19.62500 0.08180
19.87500 0.09270
