0.12500 0.11455
0.37500 0.09096
0.62500 0.05552
0.87500 0.05169
1.12500 0.05430
1.37500 0.08006
1.62500 0.09601
1.87500 0.11838
2.12500 0.13839
2.37500 0.15359
2.62500 0.16001
2.87500 0.15033
3.12500 0.11412
3.37500 0.07792
3.62500 0.03773
3.87500 0.02693
4.12500 0.00426
4.37500 0.01306
4.62500 0.03238
4.87500 0.04118
5.12500 0.05824
5.37500 0.06301
5.62500 0.06259
5.87500 0.09095
6.12500 0.09297
6.37500 0.10665
6.62500 0.09317
6.87500 0.08649
7.12500 0.06904
7.37500 0.07767
7.62500 0.05588
7.87500 0.07820
8.12500 0.06853
8.37500 0.06882
8.62500 0.06264
8.87500 0.03928
9.12500 0.03947
9.37500 0.02673
9.62500 0.03127
9.87500 0.01969
10.12500 0.05425
10.37500 0.04212
10.62500 0.04310
10.87500 0.04032
11.12500 0.03693
11.37500 0.01419
11.62500 0.01863
11.87500 0.00147
12.12500 0.02505
12.37500 0.02279
12.62500 0.04264
12.87500 0.03857
13.12500 0.04124
13.37500 0.05989
13.62500 0.04629
13.87500 0.06368
14.12500 0.06983
14.37500 0.06051
14.62500 0.07605
14.87500 0.00743
