0.1875 1.85701 17.44147 0.11008 135.27704 132.68378 113.81105
0.5625 -2.06626 34.98616 -0.94002 132.3512 121.95272 106.57027
0.9375 -0.44814 58.2159 -0.31927 129.99981 110.14109 96.66355
1.3125 0.11346 67.24352 -0.88258 123.69169 101.12612 90.49194
1.6875 -3.00658 76.08617 0.32577 119.23543 93.91495 85.5812
2.0625 -0.76502 83.5909 -0.34196 114.9335 89.11654 79.95804
2.4375 -0.8285 86.13362 1.41645 109.91259 83.60931 76.85969
2.8125 0.6434 88.68285 0.42645 104.10309 80.94429 72.62644
3.1875 0.14251 94.14633 -0.1982 99.87508 76.64396 69.40856
3.5625 0.584 98.76293 0.5074 95.12998 74.83449 67.18108
3.9375 0.22878 103.13527 1.83042 89.82512 71.82949 64.10412
4.3125 0.70538 111.54769 1.46411 86.00592 69.86857 62.73529
4.6875 0.21925 119.4984 0.96961 81.40962 70.27389 60.4122
5.0625 -0.12129 128.77148 -0.14755 77.44433 68.12111 57.69778
5.4375 -0.65674 139.35169 2.3327 70.28259 66.59357 54.04605
5.8125 0.31579 149.6105 1.70755 65.01941 63.37286 48.4523
6.1875 0.52627 160.73664 0.75294 59.37188 58.23184 46.64744
6.5625 0.3071 169.12921 -1.10123 53.12111 54.30969 42.04228
6.9375 0.32027 178.14763 -1.12439 48.18802 48.4261 39.01475
7.3125 1.50937 182.86023 -3.17898 45.57595 42.79501 35.32588
7.6875 0.91943 187.37556 -2.20322 42.39813 38.70476 32.82072
8.0625 1.52241 189.22988 -1.88225 39.39313 36.40737 30.73007
8.4375 1.54618 193.49775 0.10437 37.43598 32.86692 29.80539
8.8125 0.40216 195.4601 0.69787 36.46137 30.51619 27.54449
9.1875 -0.69939 198.03707 1.08922 35.45392 28.31619 26.30648
9.5625 -0.3336 201.01871 2.14201 34.15429 27.69439 24.94589
9.9375 0.72231 202.02171 1.63309 32.52683 26.34196 24.30945
10.3125 0.39332 203.93708 1.02906 31.69138 24.51391 23.81995
10.6875 0.57253 204.82647 1.42022 31.39108 23.8752 22.8252
11.0625 0.87897 205.14419 0.35089 30.06073 23.5647 22.46122
11.4375 1.24875 205.83072 0.47849 29.60453 23.17924 22.16895
11.8125 1.80848 206.96792 0.4373 28.07116 21.92 21.37467
12.1875 0.72965 207.99075 -0.59391 27.6638 21.28975 20.66478
12.5625 0.50422 207.7334 -1.23827 27.35925 20.45286 20.13926
12.9375 -0.17053 207.52984 -0.43681 26.82822 20.40902 19.00623
13.3125 0.05526 207.95636 -1.24932 26.04688 18.7823 19.45743
13.6875 -0.06045 207.44614 -1.796 25.62197 18.6368 18.21757
14.0625 -1.18706 208.04616 -1.62573 25.17605 18.60242 18.35622
14.4375 -0.37703 209.14479 -1.21178 25.06161 18.51359 17.88887
14.8125 0.13634 208.84242 -1.5322 24.53215 18.78612 16.68974
15.1875 -0.32687 210.78069 -1.61058 23.12555 17.55932 16.68045
15.5625 0.37429 211.10174 -0.45661 22.99359 17.34087 16.08351
15.9375 -0.03397 211.72366 -0.13567 22.42012 17.11241 16.12348
16.3125 -0.86696 211.90543 0.03185 22.27065 16.37846 15.61211
16.6875 -0.8215 211.79835 0.20853 21.63457 14.50275 15.08614
17.0625 -0.211 210.52115 -0.06946 21.79335 14.46873 14.80109
17.4375 -0.85945 210.67986 0.43269 21.1973 13.49378 14.64101
17.8125 -0.97375 210.16371 0.58387 21.18099 12.42338 14.56067
18.1875 0.08116 209.20511 -0.34142 19.95117 12.62546 14.54544
18.5625 -0.0614 207.0068 -0.49039 20.61055 12.33678 14.29897
18.9375 1.27598 207.53616 -0.77533 19.15709 12.96093 14.36796
19.3125 -0.90782 206.21845 -0.83485 19.22862 12.9594 13.80354
19.6875 -0.72505 207.06098 0.09836 17.77985 13.04559 13.27116
20.0625 0.89625 205.83877 -0.54115 18.03882 13.10772 13.52769
20.4375 -0.06236 206.10648 -0.08483 17.14451 13.62175 12.69115
20.8125 0.78621 206.00876 -1.40196 16.52666 13.09734 12.55917
21.1875 0.35138 206.2962 -1.0024 15.77318 13.09641 11.57111
21.5625 -1.02926 206.54268 -0.81162 14.29887 12.8361 11.88176
21.9375 0.53793 206.97057 1.28929 15.49127 10.00049 10.72674
22.3125 -2.1699 206.5788 -0.39156 15.19936 11.34327 10.18381
22.6875 -1.37849 206.54608 -0.08906 15.4789 10.70501 10.53337
23.0625 0.19617 206.3309 0.01961 14.27202 10.00467 10.31717
23.4375 1.02591 207.19 0.22634 14.80403 9.28763 11.20762
23.8125 0.29905 207.37876 -0.24517 13.95451 11.46646 10.36616
24.1875 1.49775 207.88549 0.2155 13.05913 9.094 9.83114
24.5625 0.59008 206.62741 -1.67765 12.28152 9.93092 10.4142
24.9375 1.97509 205.6106 0.85607 12.63701 8.993 10.44568
25.3125 1.01477 205.33694 -0.10271 11.83483 10.09199 9.78801
25.6875 1.49073 204.95525 -0.45489 13.22441 9.2362 9.67818
26.0625 2.47093 205.5961 0.29089 13.91127 10.44575 9.58495
26.4375 1.39334 203.75152 0.24856 12.05304 10.37225 8.9393
26.8125 2.27793 206.36677 -0.57685 9.85737 8.93989 8.65106
27.1875 1.35024 201.9396 -2.89119 11.22379 9.9782 8.14313
27.5625 5.08087 204.43312 -1.10832 9.46366 8.35256 8.50393
27.9375 1.18413 202.74656 0.09048 10.17195 7.91979 8.26516
28.3125 2.78255 202.13266 -1.57489 10.29804 8.36511 8.3369
28.6875 0.48453 204.85103 -0.1094 9.33142 8.92934 6.41116
29.0625 -0.29251 203.28558 -0.59389 8.71122 8.19776 7.92894
29.4375 2.75264 203.79515 -0.49724 10.09047 8.12542 6.65984
29.8125 1.61527 203.45644 -1.27932 10.95747 8.74908 7.90288
