0.05000 0.00000 0.00000 0.00000 0.00000 0.00000 0.00000
0.15000 -35.93959 -803.65677 278147.73787 2848.65397 1356.00282 844438.95527
0.25000 -881.90321 342.42325 -38831.99495 2496.08281 1513.02920 249877.33064
0.35000 286.98606 -80.41653 -54075.29652 2596.10446 1341.42355 688661.97399
0.45000 -511.56116 33.86791 -209130.07872 2690.52394 1453.36023 1266676.46096
0.55000 -853.31152 404.54425 -40201.74219 2374.59603 1406.00261 1648762.61147
0.65000 -696.83674 138.00939 291007.19231 2590.80972 1416.65072 3248203.16847
0.75000 -628.14303 -40.50249 -97523.66599 2502.41432 1588.52513 1557669.87217
0.85000 -833.89948 -68.67011 26314.64318 2240.58663 1501.05118 1416856.95474
0.95000 -979.65065 -6.33350 -58151.50229 2294.67129 1585.34469 1004219.09619
1.05000 -1108.44153 -56.51168 49666.26899 2216.76629 1634.70069 1046893.85271
1.15000 -1488.30229 -47.02689 6570.67382 1961.73113 1645.25428 1218194.11549
1.25000 -1551.75352 -73.59920 64809.33530 1891.76840 1620.88132 1598717.56546
1.35000 -1892.28628 4.18101 16574.03284 1595.67700 1649.74438 1257779.27422
1.45000 -2040.47203 12.64069 57101.35512 1405.58577 1650.27690 1899184.81215
1.55000 -2348.20429 60.16487 7538.25453 1120.96166 1616.27698 1284133.85913
1.65000 -2665.01565 -19.45332 -91640.76654 890.84466 1506.52628 1772256.78090
1.75000 -2942.85246 -84.40380 4642.62692 716.52369 1454.43884 1241976.60134
1.85000 -3092.23964 -1.48969 1062.70227 574.86231 1389.30667 1535570.56627
1.95000 -3299.74934 -0.22048 -36034.60449 465.63097 1249.27664 1841147.38797
2.05000 -3391.19236 -8.51512 13179.56936 420.76453 1233.75227 1609514.76336
2.15000 -3507.40443 -34.29224 -126877.20690 368.52446 1119.27219 2172440.42571
2.25000 -3593.18033 56.76032 36108.24131 347.84017 1078.92251 1867585.85513
2.35000 -3669.35451 -28.97251 19088.28086 316.65344 1010.85017 1650238.23740
2.45000 -3732.81567 16.66797 91641.78289 315.96089 953.69056 2278017.72386
2.55000 -3767.18945 55.45066 39344.61909 284.70458 879.74334 2242279.50058
2.65000 -3803.45938 5.48523 -44884.94354 279.18413 868.12850 1871269.73095
2.75000 -3827.44293 21.13572 -31078.98127 263.04697 797.86764 1689956.55330
2.85000 -3864.57344 14.45915 -4241.07785 263.26846 769.25787 2567879.44084
2.95000 -3874.35699 -2.41819 -16307.46980 248.22331 715.17827 2046942.09488
3.05000 -3894.45560 -10.96002 -77998.25795 231.28371 697.83897 2235710.50406
3.15000 -3911.49505 -12.66986 54292.77580 226.18083 657.96568 2214884.58265
3.25000 -3913.63147 -5.85571 26004.60345 226.90256 642.79810 2493776.44224
3.35000 -3894.62167 0.44866 -47635.53596 209.97181 597.99210 2288836.02176
3.45000 -3901.12221 -18.80082 53418.85118 216.86636 575.98303 2107887.89112
3.55000 -3895.93621 24.90174 1258.73297 200.56515 563.73507 2074777.81572
3.65000 -3903.97200 -1.19324 41709.89053 205.93971 549.47647 1772874.20821
3.75000 -3885.88435 -23.66174 66139.93068 201.46881 523.02547 2055514.21957
3.85000 -3886.69464 -8.64284 -35386.57203 205.02063 507.91276 2384001.39310
3.95000 -3873.53275 -44.66606 -95871.07350 199.33167 473.57785 2295506.27366
4.05000 -3880.43326 -30.20473 -103029.22745 212.68771 471.88109 2118912.14718
4.15000 -3877.19976 -0.75885 16901.25773 216.77961 461.25109 1980973.94492
4.25000 -3852.52369 1.42295 -28220.39246 220.70719 436.97430 2376937.26318
4.35000 -3835.08824 -2.97147 -51245.16684 216.33869 424.08709 2279374.71268
4.45000 -3841.04336 -15.32379 -40819.03029 224.45234 407.46249 2360994.85055
4.55000 -3814.62281 34.71977 -58344.53886 217.77302 396.18568 2228711.75537
4.65000 -3811.51639 -1.57568 -9322.46126 214.56187 386.16287 2440007.34591
4.75000 -3803.31189 0.83393 -108881.72617 218.49410 373.74868 2271034.16778
4.85000 -3788.14803 5.34824 90722.99722 220.00777 362.86438 2184549.68174
4.95000 -3768.54185 -3.39738 -48949.36998 215.20196 352.58418 2159707.13335
5.05000 -3756.42196 -9.56045 67671.20128 216.88134 343.01169 2064104.56279
5.15000 -3739.08381 5.48667 26640.92918 212.71810 334.04514 2196233.03540
5.25000 -3710.13299 -1.33304 -30473.88144 200.21226 328.17858 2141394.02583
5.35000 -3692.27578 3.44305 61034.30963 207.07151 315.59089 2186134.15329
5.45000 -3681.44906 -12.77441 -84270.19771 198.39923 310.73171 2247486.89744
5.55000 -3658.09875 4.13375 2265.04559 194.90854 301.95305 2245735.12754
5.65000 -3636.07633 -0.27776 25946.20811 198.38693 293.45334 2130832.12183
5.75000 -3619.71431 3.44548 101580.07604 190.93854 289.81850 2416693.46351
5.85000 -3604.10875 4.36735 -33360.47016 190.28034 287.73905 2819090.16039
5.95000 -3595.13169 -1.68772 -1115.95483 188.46545 275.06301 2137849.38006
6.05000 -3570.53304 4.18873 60205.36378 186.72511 271.21806 2204105.92846
6.15000 -3567.03334 -4.25017 -21795.76506 185.53424 269.21010 2517084.19431
6.25000 -3544.77524 -0.81655 59856.81084 186.84759 254.82145 2521208.90289
6.35000 -3524.07368 -3.54775 88601.24647 181.66098 256.51976 2592897.11395
6.45000 -3513.35506 5.73403 -68270.39306 182.48142 249.77247 2377916.66667
6.55000 -3488.87666 5.64148 -29174.82669 180.01360 237.49734 2145958.27858
6.65000 -3476.02199 1.13535 2062.19900 178.80433 240.29269 2399126.42765
6.75000 -3463.65348 -2.28988 -2261.26041 174.38061 239.07678 2151579.69860
6.85000 -3444.43621 7.67656 -30981.21609 177.37165 232.85187 2165331.56228
6.95000 -3430.62433 -5.07629 16864.33196 179.57635 226.07923 2356479.28182
7.05000 -3408.54895 0.08898 1969.79084 172.98427 218.06605 2342346.38418
7.15000 -3400.74113 8.12020 10335.87982 176.98212 218.62776 2338293.96656
7.25000 -3379.40852 4.95613 -4456.27792 177.52736 211.87438 2467315.64789
7.35000 -3362.63550 1.27038 33000.97657 175.67802 209.71947 2268991.80622
7.45000 -3347.38895 -1.49310 38652.57311 173.48237 204.89671 2340167.19721
7.55000 -3329.72600 -3.97218 4804.38330 170.97167 200.10549 2167964.25600
7.65000 -3314.99406 0.25230 45873.40127 170.80859 199.45330 2080942.08842
7.75000 -3294.82256 8.86523 14750.41907 169.35201 190.36328 2372388.37657
7.85000 -3278.19568 -1.49100 24174.53453 164.48635 191.95550 2176173.20103
7.95000 -3262.07175 2.13954 33969.84652 162.41476 187.25573 2332618.72163
8.05000 -3244.41410 -1.31442 38712.89396 158.45322 180.36750 2398162.75689
8.15000 -3233.03759 2.48398 19018.88568 156.95618 180.23309 2359285.49082
8.25000 -3221.46241 -1.50580 -24579.13800 163.05288 178.00030 2169613.94839
8.35000 -3202.50903 -2.55505 48519.85233 158.27916 173.27042 2169812.67734
8.45000 -3188.24054 -2.07915 -65397.46182 160.08734 169.43461 2367013.64463
8.55000 -3166.01721 0.27013 -40315.23928 159.63729 170.74212 2228379.52690
8.65000 -3157.46985 2.03177 -51616.86603 155.37408 166.83872 2309091.74812
8.75000 -3135.70213 -0.28997 68489.12737 152.61186 163.94724 2538526.74550
8.85000 -3128.35219 -1.65709 47760.64651 152.52971 161.60668 2181232.32422
8.95000 -3111.16690 1.08511 51947.19147 155.65469 157.27045 2344036.62502
9.05000 -3089.19263 -1.45314 -11014.56024 152.19647 155.92096 2304310.26610
9.15000 -3077.59822 -1.73544 -53000.45077 150.00752 155.57095 2086919.97334
9.25000 -3064.59787 2.53715 34635.90586 151.19709 153.25529 2286638.15726
9.35000 -3048.04012 -1.19221 72951.77619 152.68704 151.12714 2101787.63234
9.45000 -3032.28844 2.26260 32308.54304 149.29768 145.61612 2415153.81076
9.55000 -3013.97309 2.17634 34975.35255 145.58205 142.81972 2535956.05605
9.65000 -3001.84154 -2.43224 -58967.58815 145.57698 145.20823 2234607.53438
9.75000 -2981.97853 0.55093 53255.99012 145.81855 142.50617 2313589.69919
9.85000 -2964.50821 -1.21704 94942.51978 143.48437 139.51110 1938216.35587
9.95000 -2947.14075 0.80019 -21712.91457 143.78624 135.73589 2281232.32324
10.05000 -2933.53073 0.25322 49857.75652 141.09604 137.03443 2260175.44757
10.15000 -2920.20721 -1.18003 -1853.87662 141.08774 132.48819 2238494.08979
10.25000 -2902.17037 2.20582 -44906.66090 142.07701 133.28970 2201473.66935
10.35000 -2889.48315 3.41511 -3509.85059 140.06203 130.09160 2356045.18616
10.45000 -2877.35851 2.74330 31476.37432 140.14572 128.43947 2017308.93175
10.55000 -2863.14219 0.00916 40093.77692 139.36916 123.86096 2109330.25575
10.65000 -2850.82391 -1.60356 -39291.95866 140.26826 125.37445 2289756.76845
10.75000 -2835.58696 2.54541 46751.63411 141.74002 122.54160 2210691.33811
10.85000 -2816.29012 -0.60335 -23263.22750 138.92180 118.74449 2504229.99081
10.95000 -2803.94887 -0.82007 -17012.80130 136.85438 120.30674 2266823.95350
11.05000 -2786.15578 -1.03397 -1044.33641 137.07109 116.31426 2098857.67484
11.15000 -2773.86383 -1.47254 140823.77833 136.32735 118.01766 2181880.89431
11.25000 -2755.55891 -1.27829 -23814.52044 132.77282 114.29221 2265506.97061
11.35000 -2743.14458 3.29895 9637.46996 132.64382 113.51282 2286304.74813
11.45000 -2731.52876 -4.45772 -21635.61527 132.08811 110.19655 2253909.41851
11.55000 -2716.44228 3.32791 5699.92831 129.47978 109.59978 2117830.11324
11.65000 -2704.32673 0.30017 98459.23789 129.54251 109.20654 2292287.95169
11.75000 -2689.08094 -2.64800 119667.48072 127.20029 108.19253 1872717.45947
11.85000 -2675.69901 -0.06111 7240.96722 128.98838 106.34825 2289371.85980
11.95000 -2665.17073 2.39014 -782.49346 126.58619 105.23757 2061504.36080
12.05000 -2650.42530 -0.96629 -28110.32295 125.27991 102.60124 2275585.29458
12.15000 -2635.93098 -0.36006 -8233.12094 127.94913 102.65097 2227641.78031
12.25000 -2622.14409 2.08049 -49597.02293 125.67707 101.65755 2058815.43145
12.35000 -2611.50615 -1.05069 52825.22358 124.19740 100.56043 2222997.00747
12.45000 -2602.18819 -2.40965 -978.51909 123.44925 96.11196 2251829.25973
12.55000 -2584.25590 0.61920 43408.41706 125.14981 96.86443 2267218.20293
12.65000 -2573.14249 0.87387 3784.57403 125.29534 98.26092 2139085.84226
12.75000 -2563.59999 -0.38040 62457.73902 124.12067 93.94149 2147614.87314
12.85000 -2548.89247 -0.00755 30782.13599 123.31049 94.08819 2304348.57062
12.95000 -2535.76690 -3.90292 3752.10325 121.54892 92.09010 2018868.90512
13.05000 -2520.48719 -3.75738 3664.19793 119.57483 92.95956 1899912.69079
13.15000 -2513.37081 -1.22832 57760.94064 120.14505 89.85439 2204365.10823
13.25000 -2497.18259 3.10735 -26189.77671 117.12365 86.59858 1979352.32866
13.35000 -2485.47905 -1.68758 32527.15792 115.32907 88.31643 2144883.89183
13.45000 -2476.08674 2.81902 -12854.29824 114.19120 85.36414 2189583.81340
13.55000 -2464.28438 1.97343 32.00341 113.82132 87.20562 2020103.69460
13.65000 -2452.29096 1.40610 39227.45300 112.53326 87.36779 2020386.09988
13.75000 -2438.54942 0.39729 6772.40257 113.51422 83.73625 2139583.64361
13.85000 -2429.59549 -3.20300 49147.31495 114.35383 85.27155 2128471.95788
13.95000 -2420.31839 -0.48631 -59805.42640 113.72184 82.66847 1957154.14312
14.05000 -2403.40351 -0.71413 67180.35356 111.80194 80.93373 1828964.11589
14.15000 -2394.41677 0.59913 -12434.78262 113.24347 81.41614 2030231.04736
14.25000 -2376.17050 1.08407 -53316.12346 108.47083 77.68643 1895807.01942
14.35000 -2368.00122 1.83251 -67287.43691 108.83648 80.63347 1947573.08618
14.45000 -2354.60760 1.28759 -27547.43298 107.34119 77.76479 1906740.74106
14.55000 -2346.63506 0.96456 60046.32975 109.27005 77.38536 1850260.30819
14.65000 -2336.51649 -0.37398 -15469.83449 107.15681 77.71698 2228112.61635
14.75000 -2323.24911 0.70830 43232.01740 105.67255 76.15659 2054968.92938
14.85000 -2314.37933 2.22321 45594.27290 105.74716 74.95951 1969970.92364
14.95000 -2296.68221 0.19138 9124.44852 104.28748 71.44386 1976707.74149
15.05000 -2292.65333 -0.34265 31066.83221 105.03471 72.97851 2207239.40813
15.15000 -2281.87710 -0.25978 55414.31811 104.10590 73.98433 2038932.50557
15.25000 -2267.55820 -1.45349 -39963.49393 105.17202 73.59754 2013155.94974
15.35000 -2257.81881 0.03153 -36228.77042 103.05920 68.95729 1958502.08780
15.45000 -2244.71961 0.24257 365.09076 101.82003 71.54869 2031096.09501
15.55000 -2236.99890 -1.34393 -62867.80594 101.34993 68.63811 1970367.87749
15.65000 -2226.96084 -1.79869 -34835.65579 100.57336 69.90310 2003426.31621
15.75000 -2216.53572 -2.16683 -3832.23581 98.17971 67.74831 1926292.44873
15.85000 -2204.47538 -2.09094 -27688.97940 98.50152 67.19635 2122410.37907
15.95000 -2196.67376 -0.20221 -15942.84361 99.31632 69.55185 2110136.82131
16.05000 -2184.97807 1.04539 -24877.97842 95.01631 65.63805 1857063.47325
16.15000 -2172.42027 1.69298 -70051.98878 96.36142 65.00773 1897755.68890
16.25000 -2162.12414 0.54755 -15527.69674 93.88052 64.99276 2084878.66297
16.35000 -2157.57725 0.07675 756.12949 94.90159 65.15275 1897286.54303
16.45000 -2146.26220 0.41620 -13495.15603 93.76623 63.99168 1824121.84612
16.55000 -2134.85343 -0.37367 52583.45696 94.26242 64.06705 1886498.31608
16.65000 -2128.21573 -1.13307 27315.08334 95.56408 63.42344 2126418.68255
16.75000 -2115.54430 -0.97744 37514.52447 93.23109 62.67228 1988784.21126
16.85000 -2105.10809 0.48161 -4808.81142 92.36184 61.60690 1762579.81916
16.95000 -2091.04027 -1.75937 -2862.89376 92.12183 60.95377 1937813.55181
17.05000 -2084.31319 0.54119 -2163.13909 89.70736 60.49403 2011642.08883
17.15000 -2078.90162 0.16439 13073.12943 88.56194 59.34827 1886942.97574
17.25000 -2067.98097 -2.36874 58493.88464 88.36751 59.58009 1897362.90720
17.35000 -2059.32741 0.52668 43288.62508 87.61433 57.75748 1758924.71887
17.45000 -2048.15911 -0.07885 5281.96488 87.52669 58.17780 1864016.81233
17.55000 -2042.64579 0.25740 -52195.63442 87.19436 56.39193 1885675.38159
17.65000 -2031.80758 0.20975 -51222.12579 86.68679 56.20342 2086812.38012
17.75000 -2021.26732 -0.46336 42199.28045 85.55243 56.88366 1764556.87277
17.85000 -2013.07997 -0.29658 17629.72316 85.71217 55.24069 1961307.26479
17.95000 -2003.19893 0.24324 -8557.47266 84.50916 56.23558 1848318.65795
18.05000 -1996.54134 0.49557 -77732.08625 85.14478 55.86292 1812903.61705
18.15000 -1988.04326 0.69617 -16110.61062 84.30647 55.70509 1839392.17152
18.25000 -1976.87629 0.31336 -70678.35408 84.13111 53.44404 2056056.40263
18.35000 -1971.25988 0.88291 -6782.99227 84.61808 53.70971 1960818.91100
18.45000 -1959.82317 -1.16305 27114.66186 81.99306 52.25083 1674034.37362
18.55000 -1954.41609 0.33012 9166.45035 83.61806 51.50334 1803969.72953
18.65000 -1942.33119 -0.28679 3584.88326 82.15926 50.46346 2116668.04674
18.75000 -1936.18041 0.91009 -55325.04536 79.99782 52.63026 1997157.09425
18.85000 -1927.13979 0.20424 11081.79536 78.78508 50.22149 1818158.62608
18.95000 -1918.81202 -1.07838 -37295.90971 79.94741 53.14679 1777513.08799
19.05000 -1912.33747 1.88900 -40817.73842 79.50543 50.18358 1890216.41979
19.15000 -1905.37376 -0.94049 -87793.27561 79.90050 49.92975 1797739.90233
19.25000 -1894.32206 0.58817 1006.31961 78.91610 47.27997 1736468.90914
19.35000 -1886.39861 1.04644 -34763.87816 77.56317 47.98659 1687190.46706
19.45000 -1877.69952 1.02791 -22709.08519 79.60949 47.60109 1953605.21609
19.55000 -1870.11590 -0.51076 1241.89269 78.03194 48.00942 1817022.45836
19.65000 -1863.27600 -1.63032 25428.86620 77.16319 48.88670 2063649.64779
19.75000 -1853.27578 0.35111 -11233.12569 77.67769 47.14379 1765256.54539
19.85000 -1846.95928 -0.59399 -63979.40275 77.38463 49.13762 1816469.39694
19.95000 -1841.15446 -1.10034 10629.54878 76.23080 45.74853 1656959.75537
