0.05000 6662.37490
0.15000 9304.44689
0.25000 12084.04784
0.35000 14034.98898
0.45000 14530.91646
0.55000 14490.13563
0.65000 14144.81082
0.75000 13271.30319
0.85000 12770.14574
0.95000 12146.26190
1.05000 11359.71003
1.15000 10635.74587
1.25000 10112.49062
1.35000 9599.62874
1.45000 8989.25538
1.55000 8525.37189
1.65000 8158.46063
1.75000 7809.00290
1.85000 7366.21592
1.95000 7065.07775
2.05000 6785.01138
2.15000 6379.85491
2.25000 6093.18517
2.35000 5851.44278
2.45000 5659.35937
2.55000 5397.12228
2.65000 5116.93523
2.75000 5003.79146
2.85000 4769.25731
2.95000 4599.75064
3.05000 4350.48815
3.15000 4267.39139
3.25000 4053.35013
3.35000 3945.70498
3.45000 3723.64620
3.55000 3640.87328
3.65000 3506.49865
3.75000 3397.29175
3.85000 3287.19525
3.95000 3139.66537
4.05000 3048.83810
4.15000 2963.29549
4.25000 2843.33749
4.35000 2773.18834
4.45000 2630.94584
4.55000 2535.06961
4.65000 2474.24646
4.75000 2357.93676
4.85000 2268.67666
4.95000 2150.65731
5.05000 2063.91472
5.15000 1949.35400
5.25000 1902.67997
5.35000 1816.62470
5.45000 1725.13022
5.55000 1711.45218
5.65000 1594.78416
5.75000 1560.61797
5.85000 1514.21707
5.95000 1476.16484
6.05000 1420.62499
6.15000 1384.47691
6.25000 1341.35050
6.35000 1308.29114
6.45000 1263.63425
6.55000 1213.97056
6.65000 1196.87693
6.75000 1187.66084
6.85000 1152.49179
6.95000 1101.88563
7.05000 1069.89517
7.15000 1058.90321
7.25000 1023.91011
7.35000 976.12706
7.45000 960.75142
7.55000 938.97714
7.65000 912.21009
7.75000 884.86461
7.85000 852.60938
7.95000 819.66142
8.05000 787.17824
8.15000 764.36042
8.25000 738.06761
8.35000 724.20194
8.45000 698.14473
8.55000 678.95448
8.65000 673.00849
8.75000 644.20463
8.85000 628.41221
8.95000 606.32160
9.05000 594.22870
9.15000 567.45756
9.25000 548.45774
9.35000 542.16371
9.45000 525.64092
9.55000 522.95441
9.65000 511.34513
9.75000 496.59708
9.85000 497.62401
9.95000 490.39615
10.05000 461.70915
10.15000 456.94909
10.25000 460.61113
10.35000 440.09839
10.45000 435.78369
10.55000 422.53363
10.65000 413.67227
10.75000 408.33138
10.85000 399.81272
10.95000 389.21554
11.05000 385.93650
11.15000 369.82508
11.25000 380.18307
11.35000 348.47302
11.45000 348.30208
11.55000 344.09811
11.65000 332.63747
11.75000 328.45610
11.85000 331.20120
11.95000 325.81663
12.05000 311.20092
12.15000 316.00842
12.25000 297.76906
12.35000 293.60293
12.45000 291.70075
12.55000 286.24673
12.65000 271.15330
12.75000 270.00340
12.85000 260.95078
12.95000 276.83019
13.05000 248.44274
13.15000 258.29542
13.25000 233.35397
13.35000 237.32819
13.45000 240.29508
13.55000 227.57792
13.65000 236.23938
13.75000 222.11682
13.85000 212.73201
13.95000 213.45864
14.05000 214.74214
14.15000 203.58904
14.25000 206.63513
14.35000 194.43255
14.45000 193.50631
14.55000 200.99469
14.65000 187.04291
14.75000 185.60705
14.85000 191.03823
14.95000 174.41441
15.05000 177.45846
15.15000 178.21386
15.25000 176.57112
15.35000 167.85622
15.45000 175.52832
15.55000 157.80031
15.65000 161.54880
15.75000 155.90879
15.85000 152.53808
15.95000 160.96053
16.05000 153.30117
16.15000 147.12975
16.25000 145.36834
16.35000 147.88310
16.45000 153.73667
16.55000 141.03003
16.65000 148.52330
16.75000 144.31814
16.85000 141.79701
16.95000 138.67349
17.05000 139.62231
17.15000 145.15039
17.25000 130.54602
17.35000 139.78995
17.45000 133.92928
17.55000 130.40133
17.65000 123.04258
17.75000 125.95212
17.85000 128.73943
17.95000 118.79762
18.05000 118.42968
18.15000 119.25051
18.25000 121.86494
18.35000 116.51241
18.45000 115.50796
18.55000 123.48689
18.65000 111.06797
18.75000 108.77201
18.85000 104.65931
18.95000 101.34056
19.05000 104.29861
19.15000 104.99762
19.25000 98.21403
19.35000 94.87950
19.45000 110.59732
19.55000 83.10549
19.65000 84.04588
19.75000 91.35486
19.85000 94.34201
19.95000 79.27364
