0.120000 0.843820
0.380000 -0.071420
0.620000 1.470100
0.880000 0.950670
1.120000 -2.729680
1.380000 -1.746760
1.620000 -0.449320
1.880000 -0.229500
2.120000 -1.021320
2.380000 -0.238440
2.620000 -2.087920
2.880000 2.679210
3.120000 1.004370
3.380000 0.540640
3.620000 1.463940
3.880000 1.343090
4.120000 -0.851410
4.380000 2.224480
4.620000 2.199940
4.880000 1.363760
5.120000 1.700890
5.380000 1.305770
5.620000 1.005600
5.880000 1.007010
6.120000 -0.385670
6.380000 2.574750
6.620000 -0.686250
6.880000 -0.073920
7.120000 2.827930
7.380000 3.137970
7.620000 1.538140
7.880000 -2.936790
8.120000 -2.403700
8.380000 2.849490
8.620000 2.909750
8.880000 -1.545590
9.120000 2.829200
9.380000 -2.947540
9.620000 2.633470
9.880000 -1.608550
10.120000 -2.012760
10.380000 2.836560
10.620000 -1.717340
10.880000 2.913990
11.120000 -2.965920
11.380000 -0.554790
11.620000 2.091140
11.880000 -2.337300
12.120000 -1.574310
12.380000 2.020760
12.620000 -0.469970
12.880000 -2.595070
13.120000 1.570800
13.380000 -2.725050
13.620000 1.840100
13.880000 0.101900
14.120000 0.672560
14.380000 2.615660
14.620000 2.508180
14.880000 0.868440
15.120000 1.069200
15.380000 0.746760
15.620000 -0.533970
15.880000 -1.176270
16.120000 -1.659570
16.380000 -1.257480
16.620000 -2.036040
16.880000 -1.338070
17.120000 2.590610
17.380000 -1.081840
17.620000 0.948600
17.880000 1.678110
18.120000 3.029350
18.380000 -0.546420
18.620000 2.059570
18.880000 -1.452740
19.120000 -3.049040
19.380000 -1.468940
19.620000 -1.185750
19.880000 -0.328920
