0.12500 0.03993
0.37500 0.02941
0.62500 0.04074
0.87500 0.05568
1.12500 0.10804
1.37500 0.11740
1.62500 0.13950
1.87500 0.17021
2.12500 0.15643
2.37500 0.16494
2.62500 0.15320
2.87500 0.12725
3.12500 0.07384
3.37500 0.05009
3.62500 0.04643
3.87500 0.04660
4.12500 0.04207
4.37500 0.07411
4.62500 0.05893
4.87500 0.05545
5.12500 0.05693
5.37500 0.07022
5.62500 0.03167
5.87500 0.03121
6.12500 0.02623
6.37500 0.04314
6.62500 0.05550
6.87500 0.02361
7.12500 0.02408
7.37500 0.03954
7.62500 0.03166
7.87500 0.02720
8.12500 0.02438
8.37500 0.01176
8.62500 0.00628
8.87500 0.02437
9.12500 0.02781
9.37500 0.04489
9.62500 0.03484
9.87500 0.02561
10.12500 0.03901
10.37500 0.02766
10.62500 0.04450
10.87500 0.02354
11.12500 0.01385
11.37500 0.02195
11.62500 0.00090
11.87500 0.00085
12.12500 0.04810
12.37500 0.04980
12.62500 0.05005
12.87500 0.04381
13.12500 0.03170
13.37500 0.05335
13.62500 0.06645
13.87500 0.08099
14.12500 0.05488
14.37500 0.09488
14.62500 0.02032
14.87500 0.09572
15.12500 0.05881
15.37500 0.07581
15.62500 0.05467
15.87500 0.05069
16.12500 0.09520
16.37500 0.06449
16.62500 0.13884
16.87500 0.11484
17.12500 0.10124
17.37500 0.11439
17.62500 0.03622
17.87500 0.13576
18.12500 0.05926
18.37500 0.14930
18.62500 0.09560
18.87500 0.13714
19.12500 0.07853
19.37500 0.04454
19.62500 0.02499
19.87500 0.21577
