0.120000 -1.474850
0.380000 -1.233200
0.620000 -1.281090
0.880000 -1.250200
1.120000 -1.238020
1.380000 -1.226600
1.620000 -1.234730
1.880000 -1.209670
2.120000 -1.225530
2.380000 -1.214490
2.620000 -1.200860
2.880000 -1.169860
3.120000 -1.182380
3.380000 -1.219970
3.620000 -1.221570
3.880000 -1.225400
4.120000 -1.253300
4.380000 -1.289970
4.620000 -1.300960
4.880000 -1.314720
5.120000 -1.284040
5.380000 -1.272800
5.620000 -1.237660
5.880000 -1.504140
6.120000 -1.745720
6.380000 -1.636940
6.620000 -1.535630
6.880000 -1.326030
7.120000 -1.084890
7.380000 -1.048760
7.620000 -0.924230
7.880000 -0.788390
8.120000 -0.818900
8.380000 -1.109380
8.620000 -1.387490
8.880000 -1.519830
9.120000 -1.698740
9.380000 -1.758440
9.620000 -1.718320
9.880000 -1.651030
10.120000 -1.738020
10.380000 -1.707260
10.620000 -1.721700
10.880000 -1.655510
11.120000 -1.581970
11.380000 -1.629870
11.620000 -1.507810
11.880000 -1.549050
12.120000 -1.868530
12.380000 -1.894500
12.620000 -2.210810
12.880000 -2.253680
13.120000 -2.590450
13.380000 -2.789730
13.620000 -3.024620
13.880000 2.735830
14.120000 2.458420
14.380000 2.371520
14.620000 2.336950
14.880000 2.313770
