0.12500 0.00924
0.37500 0.02027
0.62500 0.05484
0.87500 0.10355
1.12500 0.16409
1.37500 0.20562
1.62500 0.26374
1.87500 0.30870
2.12500 0.36335
2.37500 0.40543
2.62500 0.44043
2.87500 0.47892
3.12500 0.49786
3.37500 0.51738
3.62500 0.54171
3.87500 0.54654
4.12500 0.55153
4.37500 0.56154
4.62500 0.55847
4.87500 0.56903
5.12500 0.55561
5.37500 0.54159
5.62500 0.52615
5.87500 0.50337
6.12500 0.47309
6.37500 0.43461
6.62500 0.40304
6.87500 0.36313
7.12500 0.33145
7.37500 0.29073
7.62500 0.25392
7.87500 0.23079
8.12500 0.18415
8.37500 0.17680
8.62500 0.15451
8.87500 0.14563
9.12500 0.10360
9.37500 0.09448
9.62500 0.08959
9.87500 0.07753
10.12500 0.09783
10.37500 0.10873
10.62500 0.09925
10.87500 0.10399
11.12500 0.10153
11.37500 0.09286
11.62500 0.10303
11.87500 0.06429
12.12500 0.08064
12.37500 0.08702
12.62500 0.10769
12.87500 0.08887
13.12500 0.08602
13.37500 0.10495
13.62500 0.06560
13.87500 0.04911
14.12500 0.06634
14.37500 0.04809
14.62500 0.06754
14.87500 0.07784
