0.12500 0.02379
0.37500 0.05039
0.62500 0.10519
0.87500 0.18315
1.12500 0.24220
1.37500 0.27980
1.62500 0.31442
1.87500 0.33934
2.12500 0.36098
2.37500 0.37100
2.62500 0.38828
2.87500 0.42243
3.12500 0.44997
3.37500 0.47734
3.62500 0.49629
3.87500 0.52216
4.12500 0.53736
4.37500 0.53658
4.62500 0.53858
4.87500 0.53025
5.12500 0.51243
5.37500 0.47087
5.62500 0.43872
5.87500 0.41161
6.12500 0.38342
6.37500 0.37112
6.62500 0.35342
6.87500 0.35573
7.12500 0.32226
7.37500 0.29947
7.62500 0.29294
7.87500 0.25348
8.12500 0.22376
8.37500 0.19490
8.62500 0.15016
8.87500 0.12181
9.12500 0.09614
9.37500 0.07894
9.62500 0.06686
9.87500 0.04437
10.12500 0.03353
10.37500 0.03604
10.62500 0.03785
10.87500 0.04788
11.12500 0.04500
11.37500 0.03896
11.62500 0.01678
11.87500 0.00803
12.12500 0.00516
12.37500 0.01594
12.62500 0.01828
12.87500 0.03597
13.12500 0.01942
13.37500 0.05461
13.62500 0.02999
13.87500 0.02762
14.12500 0.05425
14.37500 0.04730
14.62500 0.02564
14.87500 0.06463
