0.12500 0.03264
0.37500 0.00383
0.62500 0.00040
0.87500 0.00960
1.12500 0.01867
1.37500 0.01328
1.62500 0.00687
1.87500 0.00863
2.12500 0.00182
2.37500 0.01753
2.62500 0.01866
2.87500 0.00854
3.12500 0.01107
3.37500 0.01264
3.62500 0.01715
3.87500 0.01252
4.12500 0.01690
4.37500 0.01799
4.62500 0.02038
4.87500 0.02279
5.12500 0.01664
5.37500 0.01432
5.62500 0.01507
5.87500 0.00956
6.12500 0.01777
6.37500 0.01410
6.62500 0.01325
6.87500 0.00484
7.12500 0.00297
7.37500 0.00423
7.62500 0.00878
7.87500 0.02890
8.12500 0.02777
8.37500 0.03034
8.62500 0.03341
8.87500 0.00437
9.12500 0.00884
9.37500 0.00550
9.62500 0.00883
9.87500 0.02126
10.12500 0.01686
10.37500 0.01536
10.62500 0.02678
10.87500 0.02959
11.12500 0.02353
11.37500 0.02052
11.62500 0.02429
11.87500 0.01652
12.12500 0.00234
12.37500 0.02307
12.62500 0.01943
12.87500 0.01191
13.12500 0.02440
13.37500 0.04042
13.62500 0.03210
13.87500 0.02980
14.12500 0.04885
14.37500 0.03888
14.62500 0.01486
14.87500 0.01591
