0.12500 0.03250
0.37500 0.00687
0.62500 0.02097
0.87500 0.04100
1.12500 0.06945
1.37500 0.11122
1.62500 0.13854
1.87500 0.17065
2.12500 0.19372
2.37500 0.20518
2.62500 0.20126
2.87500 0.21507
3.12500 0.22484
3.37500 0.21608
3.62500 0.19775
3.87500 0.17724
4.12500 0.17063
4.37500 0.13837
4.62500 0.12486
4.87500 0.11504
5.12500 0.08257
5.37500 0.05910
5.62500 0.04695
5.87500 0.03421
6.12500 0.01272
6.37500 0.01819
6.62500 0.03026
6.87500 0.02926
7.12500 0.03825
7.37500 0.03593
7.62500 0.06069
7.87500 0.05091
8.12500 0.06553
8.37500 0.07123
8.62500 0.06015
8.87500 0.06479
9.12500 0.05359
9.37500 0.05164
9.62500 0.03148
9.87500 0.03303
10.12500 0.04239
10.37500 0.04466
10.62500 0.02665
10.87500 0.02311
11.12500 0.03353
11.37500 0.03622
11.62500 0.01955
11.87500 0.02633
12.12500 0.04309
12.37500 0.04909
12.62500 0.01398
12.87500 0.03362
13.12500 0.03178
13.37500 0.01517
13.62500 0.02051
13.87500 0.06006
14.12500 0.04392
14.37500 0.03701
14.62500 0.03860
14.87500 0.01966
