0.12500 0.00905
0.37500 0.05363
0.62500 0.10525
0.87500 0.16957
1.12500 0.22420
1.37500 0.23046
1.62500 0.28186
1.87500 0.30675
2.12500 0.34101
2.37500 0.37265
2.62500 0.41274
2.87500 0.41446
3.12500 0.44147
3.37500 0.46358
3.62500 0.47948
3.87500 0.48452
4.12500 0.49229
4.37500 0.49875
4.62500 0.45228
4.87500 0.44094
5.12500 0.40781
5.37500 0.39611
5.62500 0.33168
5.87500 0.31123
6.12500 0.31686
6.37500 0.29541
6.62500 0.31143
6.87500 0.28656
7.12500 0.29017
7.37500 0.26775
7.62500 0.22768
7.87500 0.20806
8.12500 0.17057
8.37500 0.15560
8.62500 0.13607
8.87500 0.11702
9.12500 0.08823
9.37500 0.07947
9.62500 0.05556
9.87500 0.05227
10.12500 0.04638
10.37500 0.04230
10.62500 0.07071
10.87500 0.05425
11.12500 0.03475
11.37500 0.04980
11.62500 0.06128
11.87500 0.07247
12.12500 0.04127
12.37500 0.09481
12.62500 0.06460
12.87500 0.01151
13.12500 0.03963
13.37500 0.04925
13.62500 0.04202
13.87500 0.03103
14.12500 0.03234
14.37500 0.01391
14.62500 0.09934
14.87500 0.03099
15.12500 0.03784
15.37500 0.08712
15.62500 0.07682
15.87500 0.09299
16.12500 0.09652
16.37500 0.11843
16.62500 0.14152
16.87500 0.16460
17.12500 0.15722
17.37500 0.13240
17.62500 0.13984
17.87500 0.10969
18.12500 0.11630
18.37500 0.13706
18.62500 0.06595
18.87500 0.07534
19.12500 0.03037
19.37500 0.06207
19.62500 0.02438
19.87500 0.10427
