0.05000 -2450.41189 268.67161 188.19600 1606.48580 2068.69690 4097.94626
0.15000 -4039.95361 -86.26481 282.74619 2704.55617 1919.56974 3663.69551
0.25000 -3946.07570 29.96712 232.97499 2156.71992 1923.68943 4132.65578
0.35000 -4353.36010 97.46682 58.62961 1955.87632 1839.03343 4971.89183
0.45000 -4661.72160 33.41248 266.85976 1819.53312 1540.70497 5266.19041
0.55000 -5009.32838 21.00247 -0.18840 1706.01582 1362.56597 5578.34256
0.65000 -5053.22047 35.78980 125.13154 1821.03094 1147.78060 6001.11658
0.75000 -5168.28567 1.22319 128.90262 1651.43352 1141.54470 5950.25309
0.85000 -5350.53794 14.10386 468.12174 1661.99608 1036.02839 6055.39853
0.95000 -5631.85715 -16.89318 23.22285 1473.07763 1002.20363 6104.98650
1.05000 -5825.19288 3.18001 150.46563 1503.12025 799.70449 6152.46183
1.15000 -5927.91076 4.25030 207.89742 1543.86037 947.54584 6198.34916
1.25000 -6102.19098 17.08276 137.23215 1502.53843 788.75945 6100.33107
1.35000 -6239.03477 22.71021 148.22154 1450.73699 944.01900 5980.24030
1.45000 -6370.40090 7.23209 106.12617 1406.83563 942.28735 5926.54153
1.55000 -6457.68070 36.96045 243.16602 1337.52554 856.03525 5685.72526
1.65000 -6521.51961 25.80697 -77.70141 1315.07579 770.76608 5637.29835
1.75000 -6578.05241 22.03579 -5.00496 1263.19947 675.80214 5502.20468
1.85000 -6675.08703 11.80914 -72.60247 1215.46430 664.87334 5325.54394
1.95000 -6789.31955 18.04673 -0.27526 1162.13787 584.14897 5171.29986
2.05000 -6853.75086 13.52183 3.41113 1153.10818 673.97081 5071.06137
2.15000 -6884.37446 23.28717 34.47312 1096.67586 636.00558 4980.85077
2.25000 -6944.02221 19.85587 -28.94971 981.09038 551.90852 4776.44008
2.35000 -6956.23625 7.51218 -34.21863 973.84192 583.03685 4689.46342
2.45000 -6969.65808 13.68911 30.89593 987.55787 576.84026 4562.73036
2.55000 -6964.55400 14.24645 -7.13978 1058.35899 564.45942 4506.97581
2.65000 -7021.03112 12.52758 82.92659 992.60559 608.00129 4345.73244
2.75000 -7005.90684 22.13395 13.82763 952.84002 616.02320 4260.97425
2.85000 -7029.65918 7.16022 -54.56869 860.66050 604.85689 4110.98034
2.95000 -7020.52301 11.07812 -16.11676 832.90586 477.08623 3996.56010
3.05000 -6975.71872 18.31251 51.24287 834.06963 609.74812 3905.36173
3.15000 -6945.92317 13.85758 82.26352 746.68523 461.46185 3786.54603
3.25000 -6912.43550 12.42200 78.74115 802.73214 492.24694 3693.12343
3.35000 -6854.77637 12.90451 151.83894 696.80043 465.58170 3625.36667
3.45000 -6833.08895 13.20888 -46.50887 676.85208 419.21769 3521.99283
3.55000 -6779.32488 18.54390 55.20433 704.56685 444.80462 3445.58992
3.65000 -6750.53790 18.85487 14.41967 738.38456 400.84388 3363.90882
3.75000 -6696.53872 9.24714 -18.55609 600.81101 548.51996 3309.83670
3.85000 -6641.29071 7.10491 -33.49184 572.91379 373.49572 3253.46853
3.95000 -6598.97484 9.29689 -18.22408 604.07934 447.95921 3160.42383
4.05000 -6563.08742 8.56410 -57.44338 555.31607 479.44022 3055.75072
4.15000 -6548.02268 12.65093 -32.11362 512.16691 396.94364 2995.55775
4.25000 -6507.81256 14.73698 -114.89477 521.34476 365.50659 2978.04374
4.35000 -6485.16773 2.42728 -122.33544 512.65182 565.59703 2882.67253
4.45000 -6438.11639 8.47460 -110.69839 545.62919 419.32290 2859.82170
4.55000 -6426.11739 13.92022 -80.10343 470.72616 334.48198 2781.55346
4.65000 -6402.89150 16.49942 -147.09184 537.02970 502.20557 2705.51979
4.75000 -6425.90703 11.75806 -114.66104 557.25580 531.32428 2659.26450
4.85000 -6411.47339 3.94357 -143.35817 464.34943 353.13497 2588.33565
4.95000 -6413.38452 6.74027 -125.82036 469.10508 467.51769 2542.09224
5.05000 -6417.76408 9.12516 -122.06497 489.20094 474.53117 2498.76880
5.15000 -6418.11637 12.87477 -96.60741 477.34380 388.76905 2437.76436
5.25000 -6398.07276 11.70116 -75.31562 509.00976 394.33709 2415.35591
5.35000 -6408.28172 8.21690 -58.78709 458.30116 377.32445 2300.85561
5.45000 -6394.89271 12.25742 -71.09440 449.94712 290.40981 2278.92012
5.55000 -6386.05858 10.70230 -69.99893 579.19965 421.02072 2238.65450
5.65000 -6368.70645 13.28690 0.34869 466.88382 365.26650 2177.29476
5.75000 -6348.86552 7.48218 -29.47068 463.89509 332.97456 2119.75307
5.85000 -6306.12840 11.68021 34.46134 436.12817 305.98954 2065.02430
5.95000 -6289.33558 13.52237 8.38968 468.10123 333.70845 2044.15991
6.05000 -6232.18701 14.91452 66.58248 490.82592 321.03150 1985.21698
6.15000 -6182.31414 7.22275 73.45100 396.50130 350.31713 1929.86444
6.25000 -6140.83777 12.31324 62.78432 409.61986 296.29751 1884.34028
6.35000 -6100.72164 4.23409 91.84044 377.20880 313.98948 1822.04716
6.45000 -6052.56838 10.45898 136.40603 397.49290 222.90105 1785.89103
6.55000 -6000.67849 2.61713 148.18489 393.49466 280.25450 1764.69544
6.65000 -5947.28800 12.27054 124.65182 316.31670 314.78852 1709.20855
6.75000 -5888.41735 6.74250 116.11537 340.40433 256.09069 1684.28360
6.85000 -5853.73400 9.54696 130.06156 336.95669 311.86290 1646.83266
6.95000 -5796.69573 8.55139 87.48968 359.33276 256.30690 1628.09948
7.05000 -5759.52393 7.39098 74.43312 342.15286 238.08766 1563.77284
7.15000 -5719.32589 3.03002 104.21958 318.54052 268.69080 1549.34750
7.25000 -5668.60690 7.07888 112.62420 299.97632 235.48976 1509.71967
7.35000 -5615.74115 4.42300 105.47291 373.07042 289.47753 1498.46981
7.45000 -5587.57194 7.59693 118.98434 320.91251 261.87722 1431.63253
7.55000 -5541.50470 5.61463 60.41704 367.12672 250.58152 1409.57452
7.65000 -5508.79446 14.46027 98.64665 313.92770 349.14569 1401.38387
7.75000 -5477.01482 12.91686 78.95752 331.17590 341.71825 1386.05998
7.85000 -5439.99502 7.37398 51.29373 279.78308 219.79674 1329.56809
7.95000 -5409.60494 3.89715 62.48028 271.01339 288.71696 1299.05049
8.05000 -5378.50741 7.35515 20.12638 259.08009 257.81070 1282.89833
8.15000 -5339.26962 6.60012 45.92082 333.51709 275.34404 1265.20888
8.25000 -5302.01107 10.67298 48.99976 253.91479 223.69420 1222.09279
8.35000 -5263.73284 4.54765 4.99114 284.00072 254.63679 1209.93492
8.45000 -5224.95019 8.40462 -7.28165 261.00749 267.38444 1175.87269
8.55000 -5196.22573 2.63116 8.10363 313.71230 284.99733 1147.45492
8.65000 -5161.08370 7.33789 -29.84325 284.11862 257.93193 1163.51941
8.75000 -5131.68571 5.91793 4.63017 241.48263 198.43990 1092.15531
8.85000 -5083.02192 4.55204 19.12666 324.00110 195.74499 1092.56740
8.95000 -5046.81131 1.98785 5.05322 274.18627 283.02027 1046.81073
9.05000 -5003.61346 2.96591 4.51271 238.17872 199.62414 1022.49903
9.15000 -4969.07462 1.92522 13.62373 272.24317 210.34445 986.49176
9.25000 -4924.58753 8.05152 -28.51581 206.51288 173.81880 964.20799
9.35000 -4887.08273 2.53128 -35.05243 188.12185 158.06552 947.70236
9.45000 -4841.16682 1.42231 -40.63642 191.87754 160.82321 906.79746
9.55000 -4798.78796 9.12108 -35.54141 250.70695 203.27962 916.18474
9.65000 -4761.08260 7.79571 -49.78540 230.92122 172.97936 893.33959
9.75000 -4716.91810 -2.11870 -44.29161 284.36490 183.70998 874.55780
9.85000 -4681.12846 5.85951 -35.86406 239.93767 235.24340 844.23171
9.95000 -4638.17375 1.37662 -71.03754 250.59635 178.02899 888.54784
10.05000 -4601.88409 -2.07845 -56.81642 191.26013 304.83055 799.72765
10.15000 -4553.69042 5.90248 -48.85924 186.27639 166.72382 796.57812
10.25000 -4518.97138 5.58142 -81.13115 163.84347 156.39170 767.83540
10.35000 -4486.61516 4.49671 -54.35496 203.22185 183.98017 755.13263
10.45000 -4452.68663 2.83976 -39.67639 208.03147 143.41012 727.73127
10.55000 -4418.55693 4.13012 -83.37321 187.22096 220.19705 723.21202
10.65000 -4376.33405 5.09216 -65.11774 246.00160 178.88024 718.01056
10.75000 -4339.31671 3.55224 -86.90903 223.18953 181.58588 702.27515
10.85000 -4300.21696 2.79132 -65.33695 178.69158 184.29326 670.32336
10.95000 -4266.85108 1.37060 -76.23695 160.62138 212.95993 669.93609
11.05000 -4234.33878 3.33896 -50.18036 157.30565 134.89034 646.28501
11.15000 -4204.95856 2.86210 -57.76917 246.55431 283.98582 677.30107
11.25000 -4172.84959 8.22258 -72.27089 152.65702 193.84478 635.30241
11.35000 -4144.36396 4.41142 -48.12226 216.76116 162.63419 626.05947
11.45000 -4111.60566 4.72998 -61.16982 190.53527 174.11179 621.01186
11.55000 -4084.43764 8.64418 -57.01726 150.03651 274.90612 689.28848
11.65000 -4045.49511 1.06331 -58.94247 228.89191 217.93379 613.44590
11.75000 -4018.53968 4.29312 -63.49812 158.42686 154.61357 571.83955
11.85000 -3990.43411 4.07593 -48.40770 180.08022 101.88065 573.38891
11.95000 -3957.06208 -0.93689 -50.15782 256.66914 214.18032 567.80692
12.05000 -3936.06269 -1.56561 -61.16437 121.82868 202.83356 559.78434
12.15000 -3906.09851 3.49257 -33.12279 174.72868 151.74584 534.00113
12.25000 -3874.81833 -1.53384 -71.61113 178.57580 286.16695 524.90101
12.35000 -3849.39108 -1.94908 -56.08960 180.34842 127.81753 501.70478
12.45000 -3820.62523 0.97611 -46.90764 175.51441 221.32028 497.30174
12.55000 -3785.05739 6.44099 -51.08251 194.39378 118.63066 481.67641
12.65000 -3759.25191 5.41280 -36.57529 96.19567 138.30591 474.32673
12.75000 -3730.61953 -2.94622 -36.51348 124.57011 208.84387 513.13817
12.85000 -3701.79699 3.64922 -59.70342 105.77756 137.36663 477.82822
12.95000 -3676.69768 3.31831 -43.52564 127.33305 119.58455 431.70984
13.05000 -3642.65086 -0.07076 -39.30022 131.05175 128.43001 453.27274
13.15000 -3619.24009 3.04594 -42.59858 95.99776 124.59841 446.19245
13.25000 -3599.95251 0.09121 -23.62634 214.35966 131.46213 481.37178
13.35000 -3569.69861 2.58154 -35.55175 117.89186 142.76005 443.11682
13.45000 -3551.98479 1.60881 -45.42125 120.02914 118.89923 412.28699
13.55000 -3524.17083 5.72009 -45.86190 101.93859 120.54413 424.31968
13.65000 -3503.07708 1.16110 -38.89045 123.80100 102.81155 395.79282
13.75000 -3472.40934 5.99881 -51.66942 103.74287 94.65433 402.36052
13.85000 -3450.20665 1.23153 -47.92819 99.02307 80.40854 386.67333
13.95000 -3427.06367 -0.98307 -29.02318 94.16675 182.85969 395.88651
14.05000 -3405.91438 2.95331 -40.25246 98.99594 99.00321 368.42384
14.15000 -3381.78773 4.09813 -35.63454 116.47084 139.65157 436.50228
14.25000 -3348.74167 -1.02003 -33.47294 329.12438 180.97353 467.57640
14.35000 -3336.60818 5.18829 -23.26826 91.06634 77.99523 352.82155
14.45000 -3312.03529 2.30472 -18.21667 170.58045 112.58621 353.10391
14.55000 -3284.89993 6.70430 -25.17610 98.11095 203.30661 356.19349
14.65000 -3259.94485 5.01838 -25.76549 83.26980 81.83287 325.71514
14.75000 -3241.88911 0.42794 -30.31305 92.58580 117.05569 342.23390
14.85000 -3219.15738 2.67050 -30.45512 120.75883 83.42234 311.55552
14.95000 -3195.05706 3.75052 -19.41890 146.43748 99.91748 313.75567
15.05000 -3167.48043 1.57006 -23.55672 223.27082 88.52110 371.04166
15.15000 -3154.41059 1.42105 -18.42719 151.05863 70.59120 310.72844
15.25000 -3128.81561 -0.70038 -18.20044 148.99402 145.51579 326.80653
15.35000 -3105.45112 5.16628 -26.26455 96.86430 142.82511 322.29590
15.45000 -3079.64372 1.51744 -19.27986 149.59389 92.81833 300.66557
15.55000 -3070.20102 1.87090 -12.54985 131.26205 67.60348 279.06399
15.65000 -3043.22540 3.45866 -28.85388 103.24913 120.45239 287.41554
15.75000 -3025.62217 5.35545 -16.93849 74.97235 99.66385 274.01704
15.85000 -3008.22474 -15.87957 -2.89369 172.03832 519.01573 283.76043
15.95000 -2983.42181 1.76874 -20.82999 52.91729 52.43964 264.48220
16.05000 -2963.18742 2.37559 -24.87151 57.08188 57.89284 255.44706
16.15000 -2941.68827 2.01761 -22.04623 52.21623 51.18030 252.43498
16.25000 -2922.27143 -1.45839 -15.82634 70.00997 67.82949 258.34267
16.35000 -2903.02509 0.63398 -17.66770 88.12938 79.07282 262.48329
16.45000 -2884.06729 -1.23937 -12.68429 122.92277 162.61881 267.60369
16.55000 -2863.39640 4.62691 -19.64144 123.78066 60.50271 236.58489
16.65000 -2850.67863 -2.27408 -4.94241 156.11675 146.29923 232.25429
16.75000 -2826.90233 -2.18387 -18.83623 91.85260 75.76927 221.51812
16.85000 -2809.98598 4.55532 -17.34830 94.16205 150.55162 225.39857
16.95000 -2788.12148 1.29308 -21.12819 77.41843 197.37579 247.88465
17.05000 -2767.60942 -0.33753 -15.18496 126.29596 77.56740 217.06740
17.15000 -2750.97086 5.71192 -14.15913 52.13806 134.64914 225.92907
17.25000 -2734.21952 1.56409 -11.30116 51.75418 53.35233 213.14134
17.35000 -2719.63108 2.14687 -17.07177 110.65834 66.22333 199.75839
17.45000 -2703.44875 1.56157 -12.52944 51.63299 51.05397 194.19701
17.55000 -2685.06414 -4.45947 -20.96847 50.85734 161.94173 231.57429
17.65000 -2668.90394 1.82274 -12.90881 55.14491 77.76982 192.35635
17.75000 -2650.10005 -0.24018 -11.48603 55.33604 54.60487 190.38229
17.85000 -2635.11650 -0.50991 -9.85235 65.12555 39.64272 194.05271
17.95000 -2620.87897 1.96919 -18.47632 48.78268 70.21586 181.27536
18.05000 -2598.97622 5.13972 -18.18878 66.55747 72.81542 182.27435
18.15000 -2587.29273 0.31344 -16.45480 89.74660 54.33078 197.47441
18.25000 -2573.30954 -4.37553 -2.54944 80.09465 131.68514 190.34573
18.35000 -2554.57967 1.69633 -12.84489 171.85594 72.37586 247.07371
18.45000 -2535.83609 0.04619 0.89954 80.36146 54.97672 174.82323
18.55000 -2523.54831 3.08410 -8.14535 82.78451 109.93388 170.39320
18.65000 -2510.53001 2.45515 -4.07123 49.52789 39.49795 165.84528
18.75000 -2495.49188 3.27853 -9.25252 50.02483 52.35820 158.23856
18.85000 -2477.10262 0.17903 -12.89385 73.15606 91.54934 171.50423
18.95000 -2462.24433 -0.38608 -19.50495 58.98163 53.85831 165.05273
19.05000 -2451.30842 1.13140 -7.99124 74.87901 101.09437 157.55054
19.15000 -2433.04461 -2.43772 -16.60804 101.74420 110.17272 158.99787
19.25000 -2420.57219 1.94729 -17.40384 45.92949 43.28843 158.66490
19.35000 -2405.84987 2.88447 -6.00360 47.73064 57.90433 157.54103
19.45000 -2391.01432 0.69417 -11.46391 89.50652 73.95109 173.29670
19.55000 -2383.81104 2.32522 -14.46289 63.61956 118.15500 176.85252
19.65000 -2366.25894 3.73961 -11.00884 45.92697 38.43510 145.11548
19.75000 -2353.06605 4.47351 -18.37714 34.97844 43.30112 150.22203
19.85000 -2338.44817 -2.53611 -6.38653 61.35039 61.17118 141.14097
19.95000 -2325.52872 0.14967 -9.89927 40.58452 37.90647 134.93997
