0.12500 0.01093
0.37500 0.02729
0.62500 0.07417
0.87500 0.13441
1.12500 0.17992
1.37500 0.23910
1.62500 0.26985
1.87500 0.29619
2.12500 0.34058
2.37500 0.36944
2.62500 0.39641
2.87500 0.42559
3.12500 0.44651
3.37500 0.48245
3.62500 0.49396
3.87500 0.50732
4.12500 0.52114
4.37500 0.55656
4.62500 0.54833
4.87500 0.56251
5.12500 0.57524
5.37500 0.57686
5.62500 0.55971
5.87500 0.51493
6.12500 0.49328
6.37500 0.46352
6.62500 0.40284
6.87500 0.38864
7.12500 0.32169
7.37500 0.31610
7.62500 0.27994
7.87500 0.31080
8.12500 0.29272
8.37500 0.27332
8.62500 0.27532
8.87500 0.25913
9.12500 0.25492
9.37500 0.22455
9.62500 0.18712
9.87500 0.13261
10.12500 0.10772
10.37500 0.11650
10.62500 0.10384
10.87500 0.08619
11.12500 0.06692
11.37500 0.07586
11.62500 0.05365
11.87500 0.07291
12.12500 0.06936
12.37500 0.07804
12.62500 0.06239
12.87500 0.05077
13.12500 0.05178
13.37500 0.05481
13.62500 0.01472
13.87500 0.02793
14.12500 0.07577
14.37500 0.07352
14.62500 0.10281
14.87500 0.08034
15.12500 0.08216
15.37500 0.09309
15.62500 0.11016
15.87500 0.09177
16.12500 0.07164
16.37500 0.07764
16.62500 0.10891
16.87500 0.04821
17.12500 0.11969
17.37500 0.18914
17.62500 0.14807
17.87500 0.16794
18.12500 0.21332
18.37500 0.23691
18.62500 0.21110
18.87500 0.22456
19.12500 0.25476
19.37500 0.23676
19.62500 0.20866
19.87500 0.21832
