0.15 0.65051 12.01313 -0.90089 167.65571 165.26399 138.0547
0.45 0.37554 29.01797 -0.77469 166.39278 151.96182 126.63832
0.75 0.86201 44.02257 -0.39642 163.87796 136.65158 114.75794
1.05 1.74763 57.39339 -1.42451 162.64372 125.07844 106.18745
1.35 -1.15458 63.73714 -0.47288 159.2114 115.68373 100.54005
1.65 -1.63654 69.54379 0.44714 154.56649 109.25219 95.25739
1.95 1.76543 73.45061 0.61445 148.72076 104.91173 90.49987
2.25 0.12184 76.15733 0.82062 143.26842 99.43797 85.79102
2.55 0.76432 77.28485 0.61573 138.5105 95.75698 81.7791
2.85 0.5175 80.32636 0.81338 134.25042 91.90477 78.02324
3.15 -0.85878 79.78018 -1.1482 129.22355 89.06265 74.98873
3.45 -0.87469 82.56465 0.62692 124.94646 86.19607 71.34167
3.75 0.88671 83.87696 0.71005 120.75018 84.11792 68.75049
4.05 -0.29182 86.26793 0.89825 118.09979 80.85286 66.82475
4.35 -0.36987 88.31341 1.00524 113.61682 78.75073 64.33211
4.65 -0.91862 90.8281 -0.81587 110.64262 76.85239 61.36143
4.95 -2.35057 93.77622 0.11233 106.65049 75.62761 59.62396
5.25 -0.7293 95.17256 -0.25265 103.7028 74.12232 57.39999
5.55 1.22055 99.10813 -0.03781 99.94161 73.45041 55.95993
5.85 -0.3491 102.30401 -0.71022 95.24951 73.47338 54.90373
6.15 -0.90611 105.74799 -1.7403 92.43174 72.62068 52.67949
6.45 0.37949 109.96623 -0.39141 89.00269 72.50071 51.24367
6.75 0.92224 116.40514 -0.50993 85.42759 72.65644 49.28608
7.05 -0.09032 120.95331 0.71708 80.89846 73.44908 48.13066
7.35 -1.68353 130.00536 -0.22604 75.94229 73.86358 45.59016
7.65 -0.86981 137.91619 -1.146 71.84843 72.22182 43.65446
7.95 -1.38452 145.84143 0.34293 66.50589 70.58794 41.64528
8.25 -1.06249 152.28562 0.33413 63.57494 68.46394 38.981
8.55 -0.03255 160.66846 0.49719 58.317 65.63822 37.32043
8.85 -0.5926 167.70676 -0.39036 55.17094 61.63033 34.53943
9.15 -0.65431 173.99387 -0.12726 52.35727 56.88297 33.77712
9.45 0.21413 178.56084 0.26592 49.05191 52.41564 31.04051
9.75 -0.38264 181.91814 0.73751 46.22652 48.30698 29.81558
10.05 -0.06046 184.16986 0.37315 43.71083 43.65348 28.58395
10.35 -0.5478 186.09868 0.45574 41.16452 40.20477 27.36633
10.65 0.30407 187.95307 1.03503 39.15647 37.11216 26.18061
10.95 0.24287 189.95219 0.63863 37.42633 34.88836 25.22315
11.25 -0.0397 192.57291 0.17588 36.01094 32.01068 24.58659
11.55 0.68925 194.34575 0.43076 35.40895 29.90129 23.64073
11.85 0.74676 195.36698 -0.12343 34.83123 28.65515 23.00069
12.15 1.03652 197.25984 -0.6862 34.04027 27.46322 22.20364
12.45 1.24327 197.452 0.13599 33.55408 26.39553 22.08966
12.75 1.76054 197.8415 -0.57751 33.16532 25.8777 21.02943
13.05 1.40403 199.01219 -0.09502 32.2669 24.89523 20.77096
13.35 2.14895 198.77937 -0.3921 31.40254 24.35644 20.26518
13.65 1.93627 199.6952 -0.09093 31.05079 23.68436 19.99061
13.95 0.71549 199.30208 -0.47742 30.65242 23.1717 19.54692
14.25 0.49057 199.51805 -0.54761 29.79001 22.44958 19.43938
14.55 1.08419 199.88158 -0.19233 29.46507 22.1945 19.03903
14.85 -0.66234 199.55522 0.04202 29.01462 22.44894 18.22947
15.15 -0.58913 199.85275 -0.0164 28.0872 21.51262 17.9547
15.45 -0.61902 200.15469 0.39512 28.01729 21.81921 17.80605
15.75 -0.92641 200.8524 0.57242 27.26635 21.80423 17.35285
16.05 -1.51835 201.35573 0.21646 26.02686 20.73293 16.93527
16.35 -1.23233 201.99588 0.50672 26.67773 20.96371 17.27806
16.65 -0.99215 203.12782 0.49149 25.8554 20.62235 16.37496
16.95 -1.76988 204.72954 0.72582 25.31876 20.51413 16.52266
17.25 -1.2 204.25769 0.90283 24.90933 20.12511 16.38284
17.55 -0.95919 205.50522 0.4474 24.76546 19.34569 16.07055
17.85 -0.21069 205.60239 0.8193 24.67345 18.86316 15.4895
18.15 -0.47366 205.43467 0.37286 24.07978 18.10802 15.12609
18.45 -0.28619 205.56924 0.76169 25.02811 16.64343 15.0551
18.75 -0.14509 204.6397 0.53041 24.43985 16.3108 15.82893
19.05 -0.17341 204.68919 0.44945 24.3204 14.73671 15.06864
19.35 0.90875 203.48002 0.61141 24.41618 14.85984 14.7906
19.65 0.27687 203.19144 0.552 24.13897 13.83799 14.43054
19.95 0.80466 202.06496 -0.00095 22.94577 13.36382 14.73561
20.25 1.30509 201.46809 0.13742 23.64385 13.04139 14.37947
20.55 0.29845 200.0603 -0.41011 22.74689 13.28807 13.87967
20.85 1.41744 199.69251 0.07951 23.04013 13.52059 13.99087
21.15 1.11373 198.69506 -0.19343 22.5008 14.25414 13.76124
21.45 -0.23663 197.47732 -0.30473 22.32735 14.26707 13.2085
21.75 0.11448 197.62541 -0.85752 21.48045 14.63842 13.35291
22.05 0.41166 196.43006 -0.03111 21.75245 14.98249 13.06955
22.35 0.93432 196.26752 -0.45064 21.17291 15.60744 12.95462
22.65 0.59131 195.7747 -0.62852 20.33241 15.67033 12.38769
22.95 0.97206 195.29789 -0.66057 19.97714 16.2138 12.15826
23.25 1.71817 196.11855 0.20082 18.46838 16.5389 11.6529
23.55 0.18563 196.46613 -0.39417 18.86457 16.43494 11.11797
23.85 0.7704 196.28078 -0.01272 18.46352 17.22262 10.70241
24.15 0.36831 195.30184 -0.37631 17.34503 17.06934 10.90202
24.45 0.08945 197.64249 -0.54352 17.17949 16.58661 10.67292
24.75 1.24917 198.24807 -0.07999 16.8019 16.34889 9.89101
25.05 0.56403 198.65799 -0.98834 16.04634 15.5375 10.25005
25.35 1.99904 199.62939 -0.23572 16.68164 15.87421 9.34636
25.65 0.52033 200.43646 0.4587 16.35073 14.5192 9.33116
25.95 -0.19392 201.15482 0.26341 15.26476 13.52432 9.37511
26.25 -0.71389 201.56024 0.7466 15.53499 13.35551 8.82135
26.55 -1.47433 201.38623 -0.02076 15.13295 13.36825 8.07485
26.85 -0.66922 202.16962 0.75713 15.6159 11.78484 8.16272
27.15 0.03202 200.714 0.6372 15.31999 11.10511 8.08967
27.45 -1.36793 200.28992 0.33173 15.90279 10.47242 8.04423
27.75 -1.6115 200.4604 0.96895 16.50136 10.51488 7.65657
28.05 -1.05637 200.74172 0.12049 15.09721 9.54858 7.41858
28.35 -1.4629 199.64529 -0.77705 14.70955 9.71657 7.28521
28.65 -1.75087 200.03678 -0.18951 15.02064 9.51148 7.14151
28.95 -0.16541 198.55441 -0.0415 15.09132 9.352 6.91907
29.25 -1.23473 198.89003 0.20071 15.06649 10.05507 6.80471
29.55 -2.3191 200.06708 0.27783 14.47995 11.28727 7.66382
29.85 -3.9454 201.46062 -0.8665 14.18583 10.14826 6.84073
