0.2 -0.08351 20.20644 1.0104 66.98588 68.12863 66.47788
0.6 0.38775 43.19377 0.07041 64.42032 64.71507 63.61894
1.0 -0.55703 67.62959 0.85821 61.70928 61.47436 59.95336
1.4 0.01138 88.31025 0.87375 57.76638 57.13609 56.49061
1.8 -0.6119 104.05908 0.48511 55.20911 54.12192 53.25682
2.2 -1.09466 116.42466 0.31645 52.94485 51.28205 51.04158
2.6 -0.65796 128.90987 1.16313 50.78305 48.99747 48.31524
3.0 0.01202 138.8227 0.21448 48.50636 45.99872 46.08176
3.4 0.12164 147.41601 0.13861 46.67727 43.93998 43.54621
3.8 0.95936 155.38983 0.01002 44.70346 41.28148 41.37518
4.2 1.19865 162.82077 -0.33286 43.1476 39.53665 39.23915
4.6 0.46385 169.83998 -0.38218 41.0911 36.19673 37.36781
5.0 0.00597 173.15624 0.34944 39.34719 33.63361 35.20373
5.4 -1.37968 177.27965 -0.11839 37.67786 32.27697 33.83172
5.8 -1.48783 182.48472 0.49334 36.27043 30.51374 32.35454
6.2 -0.19537 187.2553 0.16281 34.69825 28.8382 30.79345
6.6 1.48302 191.2626 0.51226 32.93315 27.89492 29.12112
7.0 2.95246 193.47845 1.26516 31.49729 27.12256 27.40481
7.4 2.39196 195.48758 1.48708 30.48376 26.18268 26.27562
7.8 0.63595 198.93086 1.08269 29.55667 25.03265 25.20805
8.2 -0.48492 202.05827 -0.47277 28.74533 22.9517 24.42108
8.6 -0.95662 203.05131 -1.42417 27.7176 20.54938 23.35492
9.0 -1.53272 202.49774 -2.48698 26.909 19.37344 22.15241
9.4 -3.45361 201.82716 -2.57125 25.00081 19.23527 21.06723
9.8 -3.61978 202.13221 -2.0395 23.65775 18.83303 19.69636
10.2 -2.95677 203.8153 -1.68301 22.66486 17.60598 18.75588
10.6 -0.94122 204.98605 -0.73054 21.94279 16.27279 17.57358
11.0 1.47011 206.32607 -0.12651 21.07247 15.30349 17.04574
11.4 2.31166 206.97829 0.68642 20.67921 15.19341 16.04756
11.8 1.39956 208.07397 0.08704 19.40287 14.00622 15.31149
12.2 -0.1854 208.65403 0.4045 18.4401 13.70843 14.98017
12.6 -0.6615 209.32796 -0.27256 16.94401 13.15065 14.69452
13.0 -0.99834 209.12345 -1.05955 15.58538 12.57341 14.1597
13.4 -0.89294 208.42592 -1.0417 15.42016 12.87763 13.35215
13.8 0.84067 208.29475 -1.61657 15.21936 12.73654 13.12086
14.2 3.16034 208.17423 -1.56737 15.59304 13.1698 12.53879
14.6 4.50062 209.05061 -1.38866 16.20722 12.9582 12.02477
15.0 6.20046 209.60106 -1.74131 16.16272 12.80723 11.72786
15.4 6.2223 209.67459 -1.68178 16.12956 12.84191 11.08978
15.8 5.21451 210.53503 -1.51769 15.47155 12.71749 10.65659
16.2 3.25049 211.62369 -1.2075 14.17348 11.58966 10.32737
16.6 1.67596 212.4236 -1.19931 12.24051 10.52195 9.7291
17.0 0.41118 212.72821 -0.96655 10.59608 9.72711 9.15529
17.4 -0.63414 212.58647 -0.85354 10.11463 8.59401 9.00055
17.8 -0.48598 212.33662 -1.09808 9.49015 8.22647 8.73874
18.2 -1.04082 212.01938 -0.52595 8.89691 7.60509 8.35135
18.6 -0.81338 211.14257 -0.65142 8.87963 8.23524 8.20579
19.0 -1.02373 211.02214 0.04645 8.2529 7.14415 8.00174
19.4 -1.43315 210.73825 -0.30957 8.49082 7.0214 7.28729
19.8 -1.20107 210.30097 -0.33961 8.558 7.02746 7.19346
