0.05000 -1960.47053 -606.37527 -302455.07942 1667.20497 1223.88560 1751791.21831
0.15000 -4116.41201 1.22777 138593.67656 1830.30447 1573.10037 1139092.57116
0.25000 -6346.62545 43.03183 54080.78089 2003.84429 1856.00730 1195603.87691
0.35000 -8212.61676 99.12243 8583.99602 2036.53611 2137.62734 1189603.80603
0.45000 -9522.28972 71.50960 -6831.83601 2082.61829 2340.46068 1121005.67483
0.55000 -10585.77905 157.03985 -7855.97629 2145.33104 2532.29821 1085726.91937
0.65000 -11555.68170 144.62773 -6721.13966 2159.15827 2677.40991 1083135.00393
0.75000 -12187.57488 80.05463 13232.71195 2276.56156 2794.91478 1072171.22733
0.85000 -12527.60798 136.92902 1652.60948 2308.64418 2942.24066 1024759.85028
0.95000 -12819.81700 135.75232 3793.68326 2262.86292 2986.57474 954644.57243
1.05000 -12963.83462 153.42957 -17697.77089 2160.43663 3038.08426 956787.64275
1.15000 -13082.63080 155.36972 -18081.89480 2015.82421 3051.58177 874130.71298
1.25000 -13044.11029 192.19052 -5672.27233 1879.35195 3099.80687 831104.01450
1.35000 -12983.98986 203.05816 25183.30391 1707.84054 3086.08418 795489.57296
1.45000 -12899.63004 204.84925 -2061.85381 1577.13905 3051.60495 778035.80356
1.55000 -12733.81634 167.15310 1299.64306 1423.48422 3041.44559 709342.76731
1.65000 -12594.45044 168.45730 -3401.78367 1254.50025 3003.29247 698200.23721
1.75000 -12444.45709 194.04929 6046.74484 1092.24412 2911.78664 673085.92551
1.85000 -12246.70318 160.54380 -1334.72626 981.77760 2848.32688 632042.32543
1.95000 -12042.96361 75.10182 823.58793 868.61535 2801.27992 611079.31240
2.05000 -11831.29023 185.60404 336.63995 767.15352 2720.79385 569605.87999
2.15000 -11658.82447 197.83328 12994.32247 689.99449 2641.83091 569750.49593
2.25000 -11463.46212 123.35863 3558.32619 604.54504 2585.83752 505630.90136
2.35000 -11263.65672 169.25831 8631.92436 552.77834 2495.33571 511146.30507
2.45000 -11060.48711 116.38238 -2333.78852 498.94680 2449.42810 494654.82367
2.55000 -10862.73260 140.97892 4162.64798 452.73439 2373.68477 454391.62995
2.65000 -10683.56705 145.69838 7365.64790 414.76634 2325.89179 455491.73776
2.75000 -10485.28916 153.96809 4066.54350 387.90970 2247.65055 420661.12384
2.85000 -10303.35656 168.62635 8670.36425 370.77174 2198.44474 452935.46681
2.95000 -10116.84717 88.07286 -4651.11989 356.36104 2162.03323 400551.38514
3.05000 -9951.31164 137.25281 -12798.22086 340.20840 2091.00599 383227.20620
3.15000 -9790.46865 131.80070 221.61532 318.78218 2036.70694 377429.98752
3.25000 -9624.34826 79.84172 3241.20074 301.15106 1991.63429 352582.53564
3.35000 -9461.47794 87.18819 485.02340 293.90690 1958.92746 335369.01827
3.45000 -9305.00821 63.66882 -1523.91561 284.63590 1889.82434 326046.99050
3.55000 -9163.50698 56.30063 -3443.51942 277.34944 1869.08092 307741.31073
3.65000 -9028.03360 61.87453 2760.94998 269.02133 1808.23182 294623.64912
3.75000 -8903.46378 95.74465 187.04351 278.88251 1749.93353 291627.22310
3.85000 -8774.63417 79.59568 -4227.60704 292.86024 1696.99582 261390.27857
3.95000 -8658.42304 55.39546 -2650.55991 308.75998 1662.04932 252145.67630
4.05000 -8537.01131 71.83799 -1054.72615 328.91095 1616.99864 243905.78327
4.15000 -8428.41526 99.38585 -6456.47013 333.62595 1587.70945 236514.62933
4.25000 -8311.06841 69.96732 2488.36181 346.84791 1529.97883 234806.89060
4.35000 -8198.30793 60.75807 522.75684 366.46364 1488.04531 234070.15741
4.45000 -8104.67512 50.39255 -3284.81037 389.22280 1433.84135 220121.11466
4.55000 -8024.37300 67.93537 3790.07745 398.99698 1415.45838 214893.78031
4.65000 -7924.04090 91.17576 -3410.65953 433.54386 1360.16712 211237.32917
4.75000 -7838.91800 83.85207 -4678.31151 459.69323 1315.38543 204034.70530
4.85000 -7759.41627 40.19544 1545.50513 484.89501 1257.41378 196138.78218
4.95000 -7685.18861 78.23853 -215.18310 504.31395 1241.71321 194575.21936
5.05000 -7596.02154 69.66981 -342.67800 531.98367 1189.90899 182587.45033
5.15000 -7519.62173 61.10902 -4096.49497 558.45518 1149.16892 179696.99512
5.25000 -7447.93143 64.02695 -4281.87100 584.41608 1087.15651 169194.94161
5.35000 -7350.44927 78.60936 -5210.80688 606.51559 1059.80669 157018.57277
5.45000 -7258.37856 64.87675 -2446.10411 616.30109 1003.04382 154789.13075
5.55000 -7152.01405 50.85402 -6712.95574 639.64317 969.50957 161929.51474
5.65000 -7054.71133 40.93765 -1914.89794 641.55917 922.74406 149768.79901
5.75000 -6948.02547 28.87366 -1964.40832 653.52302 878.69349 138455.12035
5.85000 -6851.31325 50.64069 -3002.63339 674.15629 836.16451 154306.49997
5.95000 -6774.03227 41.67824 -125.81539 676.32503 800.61054 144473.02612
6.05000 -6634.38610 38.15706 -3472.84832 683.58187 753.34651 124830.52802
6.15000 -6545.52045 41.62329 -2832.19890 683.38592 719.02467 141837.56704
6.25000 -6444.79470 45.88412 -2409.88264 683.44958 690.65333 131897.91459
6.35000 -6341.36597 47.53800 -1345.55573 678.50630 651.17292 122572.58259
6.45000 -6204.51768 57.07925 -1857.04869 687.01284 611.85571 116067.47991
6.55000 -6129.81288 18.27664 -259.47047 671.07993 579.19551 116289.31565
6.65000 -6015.97016 23.53314 -1780.35153 660.74382 553.92359 111503.61262
6.75000 -5906.52996 44.12745 -5180.78509 654.42589 520.29887 107044.03694
6.85000 -5808.13547 42.66579 -66.57157 637.02474 480.13461 99848.52076
6.95000 -5742.81304 40.09971 -796.27198 616.10547 464.71688 100620.38524
7.05000 -5630.91197 51.18299 -97.40838 585.22682 439.66373 92426.19244
7.15000 -5541.48137 45.52664 -106.77096 556.22919 417.89728 87924.51340
7.25000 -5492.98400 47.65136 -3155.72727 537.10468 397.50266 85065.13640
7.35000 -5411.78303 42.26822 -549.91920 512.48721 380.07655 86843.59609
7.45000 -5334.90644 37.25566 -2313.29571 481.53957 357.96213 82267.42431
7.55000 -5286.66575 46.51948 -1233.03155 464.31823 341.67651 68476.57636
7.65000 -5217.65105 39.73928 3083.36871 444.34250 327.25179 67582.76238
7.75000 -5179.59005 48.01182 -258.70601 424.34147 314.31161 65124.57019
7.85000 -5121.43916 45.80268 -817.11967 404.20830 302.83020 61361.28860
7.95000 -5071.98680 42.61637 765.00166 386.30254 288.52828 59892.53420
8.05000 -5034.60981 46.55220 -1154.51935 369.59846 277.96002 60942.74487
8.15000 -4992.07674 49.32247 669.75299 355.48102 264.49957 60472.30716
8.25000 -4954.94812 38.15542 -248.71529 344.55238 254.28042 54871.61104
8.35000 -4914.08251 45.06897 -468.06433 331.20392 245.63564 51293.80206
8.45000 -4880.63441 47.21215 -1094.83729 314.39652 236.72548 47813.69869
8.55000 -4848.22886 44.38283 786.10748 301.23127 228.78060 44181.99333
8.65000 -4815.54996 38.55552 713.38541 286.94882 218.39233 53577.36613
8.75000 -4780.54509 36.47275 566.93208 275.61923 210.45039 38007.92132
8.85000 -4749.33273 33.65601 311.78048 261.58829 206.44895 38184.65717
8.95000 -4722.32510 33.92665 1071.58619 251.55242 198.32663 39563.04852
9.05000 -4686.13843 34.15166 -504.75547 236.31527 189.40885 39922.53914
9.15000 -4655.94590 35.32336 -323.24972 225.61111 183.86479 37730.35251
9.25000 -4625.50876 36.49482 -724.86097 216.60201 181.04364 35710.00069
9.35000 -4597.20487 34.72596 -249.72402 213.66927 172.29670 30554.83117
9.45000 -4567.47273 32.68026 204.52000 203.89626 169.76250 28309.47849
9.55000 -4532.32250 29.92172 -508.85075 197.27476 165.09882 28145.70233
9.65000 -4498.63220 32.54722 -135.36289 191.80672 157.36994 26502.16217
9.75000 -4466.27349 29.70111 -266.08812 192.82905 152.30968 29605.54429
9.85000 -4433.31188 27.00552 1292.26473 180.20448 150.86517 25970.38775
9.95000 -4399.42615 22.94164 197.71502 177.35101 141.81429 20647.57378
10.05000 -4361.58019 29.03904 84.60470 165.36318 137.54966 27753.08468
10.15000 -4333.59300 27.91005 -19.67184 159.32319 133.23256 22672.59912
10.25000 -4300.24955 26.61519 385.39685 152.94100 131.59008 23342.94901
10.35000 -4266.54882 23.18122 392.81285 147.18494 127.50616 24675.71396
10.45000 -4235.70321 24.02973 186.74731 141.83699 124.63366 23530.05137
10.55000 -4200.02267 26.63604 -854.76685 139.29036 123.71379 22261.94097
10.65000 -4167.21608 22.97770 100.24902 134.08080 117.71241 23732.29478
10.75000 -4137.14949 25.43862 -254.51179 131.97494 112.18023 21962.52950
10.85000 -4102.94094 24.34495 -127.48940 131.69282 109.19475 17175.18435
10.95000 -4070.94111 22.99660 13.37099 127.14945 105.93903 20470.36293
11.05000 -4041.89754 23.73103 122.08081 122.83640 103.76632 17952.61709
11.15000 -4009.07512 22.46486 520.17021 119.77282 101.64977 19026.34356
11.25000 -3982.52762 18.52506 271.36942 110.62562 98.48824 29887.26528
11.35000 -3949.38381 24.09077 203.48754 109.75756 94.29669 18524.29062
11.45000 -3917.87120 22.05250 142.89438 108.84897 93.55347 16504.13047
11.55000 -3892.40487 20.36524 308.98189 108.23219 93.33254 17218.08948
11.65000 -3860.78584 23.27135 180.44286 109.06098 90.16667 18607.68006
11.75000 -3832.22251 18.50754 354.72282 110.22266 89.01688 17416.18889
11.85000 -3805.01125 20.92523 -232.31047 107.87983 86.19700 15215.84224
11.95000 -3775.49314 22.95174 -506.98694 109.63243 83.66097 14342.74645
12.05000 -3752.25191 19.92238 -46.72502 107.24565 81.02558 14526.15905
12.15000 -3728.34660 17.99793 176.21375 106.46478 78.72877 14863.17372
12.25000 -3697.40590 21.10407 -267.49409 106.10779 74.39011 11413.84519
12.35000 -3675.60977 21.57991 348.77378 111.06951 74.47875 15175.52561
12.45000 -3646.85644 20.95117 -155.60923 109.50014 72.11507 13624.07578
12.55000 -3622.26837 19.37583 708.14388 106.73540 69.23743 21493.95361
12.65000 -3598.56119 18.02686 -24.98442 110.41534 69.03502 12561.22845
12.75000 -3572.38150 16.84041 30.72014 108.83397 66.93707 14076.80904
12.85000 -3550.26014 18.45302 321.29850 109.29745 65.73934 12023.08528
12.95000 -3528.31780 18.21131 125.56739 109.60112 64.13422 12169.59226
13.05000 -3507.78039 18.89154 269.44100 104.32396 63.21172 12060.75671
13.15000 -3484.25859 18.22101 46.24058 105.36729 58.96989 10659.42127
13.25000 -3457.79504 19.16625 -108.97230 103.18859 59.70923 11927.99913
13.35000 -3427.72047 19.08624 111.75179 101.42868 56.53414 10499.35977
13.45000 -3410.47274 19.30869 -133.07263 98.31425 56.26263 10969.25921
13.55000 -3390.02911 20.41835 -139.27027 96.72054 53.00881 9815.88365
13.65000 -3367.44768 18.77258 423.44929 98.01275 54.01685 8588.95689
13.75000 -3347.51761 18.85968 51.53551 96.38520 51.87407 8987.29874
13.85000 -3328.74183 17.67272 -209.60233 99.85584 50.12566 8971.77101
13.95000 -3307.71054 18.28248 201.41358 100.52380 49.50436 9167.49287
14.05000 -3281.45621 18.71335 497.12117 94.90995 46.96580 8498.61834
14.15000 -3259.59211 17.85628 153.69816 93.19050 46.51368 7070.75194
14.25000 -3237.68555 18.59635 316.38778 87.82523 45.73700 7923.99466
14.35000 -3218.33542 18.07806 72.32982 87.09556 45.02008 6795.66539
14.45000 -3197.22635 18.18160 184.56895 85.03206 43.07979 8412.69986
14.55000 -3180.14293 17.01188 59.65589 82.97968 43.66943 8410.74926
14.65000 -3156.47267 17.65451 -90.03369 83.62214 40.67741 8317.46882
14.75000 -3134.30577 15.24856 29.50438 80.55055 40.84964 7948.01213
14.85000 -3117.33472 17.45093 124.83893 78.00876 41.38240 6401.23045
14.95000 -3094.34482 17.17458 270.40255 76.66127 39.09527 8276.09999
15.05000 -3072.91034 16.98653 43.77976 73.70544 38.47194 6325.59746
15.15000 -3054.76522 16.51021 -10.61962 72.84579 37.98216 5410.42195
15.25000 -3032.90152 16.56385 56.36195 68.30281 37.38982 6075.38199
15.35000 -3017.54740 15.02434 308.31845 69.47181 37.37094 6816.90409
15.45000 -3000.35652 13.69410 421.27850 67.29924 36.21484 5902.46858
15.55000 -2979.77355 12.58971 226.97194 62.65801 36.15876 6399.57035
15.65000 -2964.39785 15.59524 147.85368 61.91750 36.89464 6641.81908
15.75000 -2948.96051 12.95633 -1.87252 60.34000 34.83400 6285.97772
15.85000 -2928.07899 12.18861 -18.74510 56.95440 32.84415 5797.16874
15.95000 -2910.29686 14.01434 367.58642 57.26210 32.61340 9681.49965
16.05000 -2893.39408 13.08012 136.73947 56.12491 31.43966 6970.70246
16.15000 -2878.00322 13.91657 -110.11710 54.37894 31.31418 5713.81221
16.25000 -2857.06404 13.42817 28.84096 51.47578 31.62104 7299.97368
16.35000 -2835.63297 13.08087 37.93927 48.52187 32.25062 6494.80171
16.45000 -2818.76917 13.93635 71.79676 47.20176 30.38668 6264.78476
16.55000 -2802.52734 12.58772 46.57837 46.76696 29.95216 5241.95754
16.65000 -2787.40251 14.22496 247.94694 44.83155 30.34182 5310.84426
16.75000 -2772.35464 12.49067 17.41677 43.04183 29.13354 4893.69657
16.85000 -2753.53853 13.17581 419.87275 40.93196 29.89751 5882.85223
16.95000 -2738.57784 11.81957 122.02798 40.20198 29.34978 5039.70700
17.05000 -2722.39168 14.05685 -115.88376 37.98733 28.69429 5011.89518
17.15000 -2708.76986 12.37951 150.69380 36.72803 30.24887 5491.00524
17.25000 -2693.81668 11.61296 -228.85934 35.57612 28.43492 5585.64907
17.35000 -2678.89401 11.86490 173.23572 34.91893 28.25769 5938.14348
17.45000 -2662.81828 13.52026 158.81667 34.16534 28.34561 6243.10597
17.55000 -2651.56326 12.91205 -136.63459 32.76414 26.80851 5174.62400
17.65000 -2635.44014 11.47836 197.35304 33.98964 26.08171 4953.50025
17.75000 -2622.80309 10.70712 268.71394 32.94090 26.17072 5550.34996
17.85000 -2610.81999 12.17619 135.71376 33.24921 26.11931 4474.30026
17.95000 -2595.74005 11.63561 201.11745 33.81274 25.38622 3911.86603
18.05000 -2581.94218 12.22380 -42.39785 32.28562 26.29082 6093.90598
18.15000 -2568.17466 11.23653 -262.64010 31.98392 25.85736 3969.38942
18.25000 -2555.23134 10.88681 -136.20157 30.36284 25.74466 3877.97114
18.35000 -2543.20202 11.85504 -111.82051 29.76931 25.00850 3958.04946
18.45000 -2527.88642 9.93303 -2.74457 30.70341 24.70198 3619.17520
18.55000 -2515.02814 11.35163 21.22095 28.74873 24.21125 4961.68252
18.65000 -2501.61123 9.60647 49.46248 28.66987 23.54059 4377.67617
18.75000 -2487.64993 11.45400 11.85953 28.95132 24.77911 3367.45442
18.85000 -2475.18027 10.93661 -22.75417 28.75427 23.56319 3649.87520
18.95000 -2460.95425 8.60397 -179.39232 29.48258 23.79857 4511.70285
19.05000 -2448.50299 9.85663 116.77709 26.74550 22.98117 3290.82347
19.15000 -2435.61257 10.15824 52.73619 26.84755 22.45646 3945.37945
19.25000 -2422.28189 10.02610 2.79016 26.23777 24.48387 4276.56558
19.35000 -2409.91360 8.42123 -24.83636 26.24665 22.86186 3534.66991
19.45000 -2396.47184 9.06698 11.44467 25.33021 22.73949 3704.16206
19.55000 -2384.81130 10.85895 70.20425 24.86511 22.28104 4038.61397
19.65000 -2370.36768 10.74110 -0.31460 26.99920 23.51125 2391.94584
19.75000 -2355.89501 10.96754 -144.22657 25.92548 23.01621 3175.48355
19.85000 -2341.87242 12.96398 -15.22524 25.51311 23.02817 2178.36380
19.95000 -2327.79338 16.37916 70.14711 25.36524 23.83860 3550.36081
