0.120000 -3.130890
0.380000 -0.601730
0.620000 -1.156370
0.880000 -1.382670
1.120000 -1.147080
1.380000 -1.071990
1.620000 -1.089230
1.880000 -1.057080
2.120000 -1.026270
2.380000 -1.037390
2.620000 -1.098660
2.880000 -1.103850
3.120000 -1.154870
3.380000 -1.186270
3.620000 -1.212980
3.880000 -1.256270
4.120000 -1.280250
4.380000 -1.245550
4.620000 -1.318240
4.880000 -1.249070
5.120000 -1.386810
5.380000 -1.693180
5.620000 -1.858740
5.880000 -2.056190
6.120000 -2.291980
6.380000 -2.337320
6.620000 -2.436630
6.880000 -2.487570
7.120000 -2.314360
7.380000 -2.553260
7.620000 -2.608070
7.880000 -2.787050
8.120000 -2.696110
8.380000 2.953560
8.620000 3.010750
8.880000 0.787000
9.120000 1.620910
9.380000 1.028130
9.620000 0.470510
9.880000 0.294700
10.120000 -0.433470
10.380000 -1.436500
10.620000 -1.343560
10.880000 -1.727330
11.120000 -1.692500
11.380000 -2.453850
11.620000 -1.381490
11.880000 -2.455850
12.120000 -2.464210
12.380000 -2.255740
12.620000 -2.639660
12.880000 -2.142830
13.120000 -1.921460
13.380000 -1.785460
13.620000 -2.374010
13.880000 -1.706710
14.120000 -1.896750
14.380000 -1.934430
14.620000 -2.123670
14.880000 2.540690
