0.05000 -2501.53489 -456.31206 -96932.85301 2341.09994 2277.59762 980662.85866
0.15000 -6074.76061 -1.68597 -47528.07427 3033.92810 2645.43269 1186610.21066
0.25000 -10021.71818 149.12368 6685.47966 3216.73764 3133.39326 1166537.32353
0.35000 -12959.15821 -14.29847 4112.90528 3211.87144 3440.75890 1218315.43390
0.45000 -15117.89419 38.02956 -18448.14652 3229.18035 3793.38308 1011995.93758
0.55000 -16686.93731 102.39525 15822.98326 3049.93917 4048.83962 983238.34202
0.65000 -17861.03403 37.24487 6418.54179 2877.47824 4171.15559 906853.57276
0.75000 -18450.13884 -49.25260 -8063.44258 2686.27623 4177.07294 835043.56545
0.85000 -18559.30154 65.56648 -11341.87813 2609.26115 4231.88957 748649.80184
0.95000 -18427.12382 48.16922 -12536.08578 2368.80965 4230.59626 687062.61920
1.05000 -18257.50316 107.17270 4827.26607 2185.36826 4219.15544 615704.80580
1.15000 -17927.74379 -12.45828 -7010.42203 2013.94450 4113.31816 584316.52126
1.25000 -17473.72205 5.96918 -1977.76329 1809.94762 4088.28075 556996.73595
1.35000 -17022.50383 32.17128 2881.60342 1632.88807 3988.53531 496476.27797
1.45000 -16538.25170 38.72689 -2138.19216 1459.27497 3918.18463 468469.91969
1.55000 -16104.95562 31.36536 5353.74801 1283.50315 3777.51382 443104.09357
1.65000 -15711.47946 93.10858 1914.16176 1131.75539 3704.67215 417115.67665
1.75000 -15268.13707 101.06037 -4586.17490 998.43635 3572.36785 392315.89453
1.85000 -14842.00028 57.88512 3138.23475 882.02406 3504.04478 342981.99806
1.95000 -14431.53539 66.72662 -4207.91376 809.57224 3377.11474 313795.03011
2.05000 -14052.52814 4.06139 3494.01337 715.29661 3301.09728 318967.66992
2.15000 -13660.95513 41.08286 1924.31302 638.54118 3194.00215 348715.02196
2.25000 -13306.78471 74.72557 -5114.85308 548.92567 3086.77711 312704.31719
2.35000 -12963.89767 68.30550 640.14581 490.87229 2998.45540 265934.30539
2.45000 -12633.60868 16.35180 -1147.81172 444.10493 2908.22052 253095.34999
2.55000 -12322.08304 58.61544 -1445.66462 423.87340 2809.39834 232241.73168
2.65000 -12000.64712 50.81283 -1023.92331 400.04904 2725.91197 230167.19549
2.75000 -11725.35337 85.81968 -372.34662 373.90924 2648.59339 202590.10501
2.85000 -11457.82989 30.87330 590.57875 369.07293 2568.91863 195771.37117
2.95000 -11178.90495 38.51522 1153.99815 355.67103 2473.84538 196059.75226
3.05000 -10953.92153 76.16252 2819.42042 357.40357 2407.35188 183933.22103
3.15000 -10732.03236 32.21788 -3000.43531 354.73974 2335.20932 162455.21202
3.25000 -10523.32816 52.75351 -3242.86934 363.78686 2260.36360 147236.23300
3.35000 -10329.01758 48.89338 81.49204 359.27993 2198.03353 181423.57828
3.45000 -10118.80552 13.55211 1044.70920 375.52528 2127.67865 150203.15089
3.55000 -9925.96282 23.00809 539.77101 378.75846 2060.50133 157751.70226
3.65000 -9741.83440 50.44514 -1012.94887 381.40472 1984.11023 149711.31703
3.75000 -9569.89232 36.69783 242.01141 394.55937 1922.32776 123912.99075
3.85000 -9414.38453 57.45949 -347.21984 396.77427 1883.49104 120459.32544
3.95000 -9271.52254 27.54170 -2242.52852 412.88494 1799.67006 117986.81281
4.05000 -9127.63863 34.36568 -678.91005 418.47664 1753.34391 114295.50597
4.15000 -8980.99644 73.70882 -2935.16893 432.32106 1686.60303 99939.92557
4.25000 -8838.45618 41.17813 -30.44140 447.25034 1626.89427 103487.01276
4.35000 -8704.72127 24.07026 -514.97085 457.10149 1572.36532 102097.58328
4.45000 -8580.47953 54.38361 186.76491 451.56929 1515.39170 91312.95057
4.55000 -8461.63477 63.83143 448.83725 467.26822 1481.00434 87813.79182
4.65000 -8353.08245 63.45011 256.24955 474.58282 1433.27257 94740.70228
4.75000 -8214.86590 97.93327 888.96781 489.21573 1360.14093 93478.35043
4.85000 -8107.76620 17.39640 -424.88835 493.68480 1325.96626 83125.97061
4.95000 -7976.82131 23.56956 -2079.52200 508.27009 1270.04337 74780.38251
5.05000 -7878.79323 71.43767 459.63989 508.68351 1226.42171 77612.87157
5.15000 -7772.66150 49.40524 -85.91464 503.74118 1187.41179 80228.88309
5.25000 -7658.43315 24.73441 190.20132 510.63047 1136.81922 61559.37719
5.35000 -7537.15864 50.53181 1402.94492 515.30359 1098.19222 77821.17212
5.45000 -7427.38098 78.85832 -1772.84128 520.22044 1051.99035 72741.57922
5.55000 -7306.66260 38.37393 768.02871 522.10399 1017.03599 65668.66236
5.65000 -7206.70239 62.30711 -866.09571 526.35435 964.91889 69144.57568
5.75000 -7089.59431 23.83647 775.07102 532.43836 932.95072 73046.58559
5.85000 -6977.69524 46.85150 1254.54378 538.23777 900.66104 66211.32117
5.95000 -6867.92614 47.83671 -1333.31172 529.87057 861.45862 62054.61964
6.05000 -6765.78073 83.26477 126.33810 519.97258 827.46335 67033.81085
6.15000 -6623.51631 64.39593 -210.41708 532.06853 795.71441 60058.31805
6.25000 -6489.22115 76.66097 -1411.57159 536.83307 757.36708 62403.20659
6.35000 -6395.01237 56.68034 276.21428 528.22836 730.25945 71316.57392
6.45000 -6260.86600 81.72243 1370.38206 534.85675 692.71817 67787.62645
6.55000 -6166.93092 72.65865 -2334.76767 514.81812 659.16525 69790.12293
6.65000 -6044.09708 80.94463 1996.94778 505.52885 629.61426 118792.40578
6.75000 -5938.92484 83.82765 1364.91242 493.18224 617.75130 60464.79577
6.85000 -5840.53768 67.77499 -1728.82242 479.48747 594.65889 63091.57134
6.95000 -5731.61463 64.10339 -36.61855 468.06742 561.56406 53456.57687
7.05000 -5641.73885 34.34089 2411.72562 450.52076 552.50796 96567.91993
7.15000 -5560.22564 41.54525 535.91013 432.56585 534.12233 54798.33723
7.25000 -5470.49294 32.85490 550.01572 421.12834 522.79135 46801.70843
7.35000 -5384.43004 29.56006 -1290.57333 402.63928 501.47135 57254.28320
7.45000 -5326.19499 58.97393 1150.42368 381.83390 489.32869 48638.30239
7.55000 -5258.04486 35.11711 1500.96713 372.03686 475.44761 51642.03906
7.65000 -5195.51126 31.45701 -841.44616 355.30101 464.30710 52517.35626
7.75000 -5131.02098 24.69186 178.82252 351.33819 458.76407 46267.81049
7.85000 -5081.31495 18.88568 -1066.44838 337.23658 443.49636 42867.17884
7.95000 -5028.38690 19.43985 553.78696 336.02943 432.82512 43559.81008
8.05000 -4965.06760 14.88178 739.02140 324.96744 430.06323 37236.02993
8.15000 -4933.64706 21.28556 1142.97337 324.36014 414.77427 34397.50216
8.25000 -4885.49270 10.79987 67.49852 309.49996 412.12533 35608.53393
8.35000 -4853.87326 7.14670 988.49866 313.34938 401.25671 39612.68156
8.45000 -4799.93456 -9.20783 806.21050 301.87615 398.43659 38791.82098
8.55000 -4764.54705 -17.95025 683.73818 290.02760 382.60176 28705.27603
8.65000 -4749.53141 -18.40662 151.52324 287.76748 378.72429 31261.92036
8.75000 -4714.32437 -26.03038 39.28581 283.18535 370.50711 29485.26360
8.85000 -4688.83463 -27.44592 -6.51797 291.76252 367.32822 25345.49678
8.95000 -4667.50046 -12.39787 573.13933 295.50382 361.34336 23886.61165
9.05000 -4644.58733 -30.88053 1336.34236 300.71636 344.90481 25501.18504
9.15000 -4626.49062 -18.00003 208.51216 309.95965 334.44471 22215.62337
9.25000 -4602.42717 -25.21436 718.20726 315.90137 326.42119 21903.31168
9.35000 -4585.41546 -14.83796 570.43145 329.07219 313.47688 23387.46836
9.45000 -4552.74235 -23.21189 118.87270 336.78880 310.03592 28310.74173
9.55000 -4521.16616 -16.67027 226.51434 347.23006 297.80228 21855.63129
9.65000 -4473.09521 -10.11657 704.13066 357.19429 281.65108 28239.72611
9.75000 -4447.10368 -19.47598 670.49490 350.02890 272.00679 20367.68555
9.85000 -4410.76830 -6.43418 457.08251 353.76801 264.81300 18263.49279
9.95000 -4365.80714 -10.73319 612.58239 345.57335 254.89677 20104.33135
10.05000 -4326.17405 -1.49711 -888.38107 349.26443 246.90776 27308.88522
10.15000 -4265.90782 -3.06075 -152.68580 340.03964 236.97642 20172.45725
10.25000 -4227.50172 -0.74558 -672.30778 334.09700 224.84552 17306.49888
10.35000 -4182.14208 8.05668 -431.38506 316.24202 211.49046 17519.27287
10.45000 -4146.98839 4.44672 572.84077 313.78789 205.88689 18843.48852
10.55000 -4092.74949 -0.59416 365.58939 297.83770 207.34624 18009.34870
10.65000 -4060.01876 3.87174 -764.99831 286.23425 194.20610 18165.20888
10.75000 -4024.40931 4.71793 182.91188 279.33416 187.96448 17093.71706
10.85000 -3980.61490 0.96175 163.96581 266.89163 179.49572 15605.50019
10.95000 -3951.79117 6.58175 129.82069 257.07749 175.02660 14132.04120
11.05000 -3920.12112 1.47525 369.94052 247.18456 161.83523 13852.75986
11.15000 -3879.68488 2.16837 396.06608 234.06554 161.16969 14858.64461
11.25000 -3856.15951 2.84920 -257.66680 227.87981 149.06111 14308.97867
11.35000 -3818.65356 0.25909 297.89521 214.96259 149.20593 12964.39572
11.45000 -3777.37136 7.72692 -208.08232 211.07533 144.98043 13642.17978
11.55000 -3762.28155 3.28858 -305.61697 209.10147 146.41301 14271.79269
11.65000 -3731.51098 6.31945 209.31547 196.75479 138.37798 14047.59869
11.75000 -3703.23595 5.82286 108.16853 186.83552 134.56822 14774.67119
11.85000 -3674.47940 10.66516 -124.77675 179.84602 134.65315 12374.50569
11.95000 -3651.62928 10.21763 307.12341 170.91903 126.28908 11825.83210
12.05000 -3625.22394 9.75579 -404.75686 165.53151 121.54296 14408.06445
12.15000 -3600.16822 8.08884 -293.53130 157.02694 121.43386 12890.22740
12.25000 -3578.23863 9.72633 170.13825 150.72269 119.33963 12399.21979
12.35000 -3555.82639 12.50546 -76.28832 152.22545 119.63334 10753.69927
12.45000 -3528.36488 8.21662 -143.07004 149.86710 116.57779 12040.26168
12.55000 -3506.88241 17.86621 260.52968 142.42707 114.96262 11676.35636
12.65000 -3489.15144 14.81885 -320.21755 135.70264 108.03081 9322.50448
12.75000 -3461.62445 13.42054 -91.30603 133.86824 113.29269 11349.51746
12.85000 -3437.74940 13.24062 -28.12437 127.78225 104.60252 10507.62242
12.95000 -3408.54439 13.87310 149.71127 124.62830 99.34912 9579.58581
13.05000 -3390.81533 17.36082 43.61278 127.23423 98.95947 10618.73149
13.15000 -3374.21525 16.93982 -296.06191 121.74132 100.64630 9255.81824
13.25000 -3349.56066 20.92707 -170.12559 117.10228 96.21633 9925.07193
13.35000 -3333.90574 18.37727 112.26594 118.81806 98.51066 8169.71662
13.45000 -3309.31898 19.56666 140.53996 114.70999 93.97588 10267.45212
13.55000 -3287.42949 15.58916 25.23894 108.50181 94.06707 8374.15769
13.65000 -3258.98452 12.35489 161.35720 107.81162 90.03109 8104.13728
13.75000 -3242.64650 13.53451 198.87389 104.27869 87.27935 8658.04963
13.85000 -3218.90081 13.43589 199.63234 105.70487 87.09156 8583.80007
13.95000 -3201.84866 11.70782 282.35104 107.43612 93.85584 8088.79302
14.05000 -3182.08082 19.16711 294.93875 103.20802 88.28563 7914.92978
14.15000 -3159.11959 16.81524 152.93296 95.21197 85.80301 8891.89789
14.25000 -3136.59088 13.25668 400.90183 103.90251 82.37445 8273.40057
14.35000 -3117.00189 14.89935 390.20481 103.38916 83.90060 9651.46849
14.45000 -3093.55397 13.68027 289.98328 92.89241 78.53146 8174.12831
14.55000 -3080.34913 13.25074 125.41132 89.82986 76.88562 8288.78889
14.65000 -3061.56747 14.15753 439.03919 93.83477 78.38823 6233.30467
14.75000 -3039.23525 9.94904 504.70715 87.07661 76.91377 9286.08619
14.85000 -3017.52048 14.13941 407.23655 88.31220 75.15711 7086.00735
14.95000 -2999.92220 8.00676 327.25103 83.22367 77.09060 7010.78195
15.05000 -2980.70641 15.59429 111.91241 87.11854 76.03531 5213.65932
15.15000 -2961.84461 12.55215 315.65286 80.65701 73.28923 7132.53460
15.25000 -2944.17629 14.39273 285.88412 78.38862 65.90247 6594.89449
15.35000 -2927.09541 11.76687 211.85677 93.02851 67.82581 6549.84852
15.45000 -2903.57104 12.28694 159.42012 77.46008 68.91302 7619.67853
15.55000 -2884.18471 16.37326 96.96634 79.77213 68.12944 6050.95288
15.65000 -2872.16932 10.95874 131.74791 83.74246 67.93600 6047.44351
15.75000 -2852.84751 12.15641 -241.42966 85.50366 77.42414 5584.68210
15.85000 -2835.89928 14.50618 69.50833 81.34285 64.40769 4684.75187
15.95000 -2818.79321 15.93793 110.15840 86.15509 64.53648 6632.67794
16.05000 -2795.94133 15.19361 307.79617 78.11010 64.08316 5471.76680
16.15000 -2778.27944 18.08062 171.86532 79.20894 63.31426 5551.70120
16.25000 -2759.72762 15.15658 55.39877 78.52816 54.51071 6750.23881
16.35000 -2742.11967 13.40152 -106.83427 73.13782 55.64170 4651.93211
16.45000 -2722.75226 16.79882 -54.06409 86.57915 58.78546 4738.72472
16.55000 -2708.44988 13.77589 -16.06535 68.57245 51.67698 4520.36753
16.65000 -2681.36924 15.94776 -65.39371 73.75304 62.24805 4422.79764
16.75000 -2668.28038 12.95615 34.06928 63.96513 58.40431 4083.73474
16.85000 -2652.13491 15.51478 51.00810 74.84842 57.59206 4505.32828
16.95000 -2638.77627 14.75303 109.55576 63.99506 51.96612 3647.04466
17.05000 -2625.08539 11.57902 252.88877 63.71164 59.41866 4100.93759
17.15000 -2607.13503 12.73067 21.28320 61.09962 47.09019 4860.75707
17.25000 -2591.18989 15.47585 85.79552 71.11250 64.01999 4276.47431
17.35000 -2573.63865 10.93281 71.90157 58.50701 48.95693 3256.98388
17.45000 -2557.79676 10.45558 -4.11721 66.19714 58.72416 3898.56123
17.55000 -2546.67015 15.15156 -113.09614 60.22591 55.37727 3721.56564
17.65000 -2531.01386 11.74467 -98.73436 65.27845 64.53927 3534.00021
17.75000 -2510.70928 11.19477 267.85149 57.44509 41.54930 4139.64222
17.85000 -2498.22197 10.81474 114.57220 54.79604 51.65717 3261.37246
17.95000 -2483.53162 9.65206 -19.33570 58.40946 51.10695 3577.01894
18.05000 -2469.39532 12.92161 1.20382 50.76009 43.96338 4339.50553
18.15000 -2454.59379 10.91812 -28.80569 71.26217 51.06258 3495.32002
18.25000 -2444.02223 6.47613 87.70274 73.15531 53.33568 3019.17324
18.35000 -2428.46349 6.43999 44.74995 50.96083 43.31814 3115.40140
18.45000 -2412.39387 7.23002 162.87778 49.41600 36.05944 3142.58749
18.55000 -2396.98593 9.29689 45.07149 49.83117 39.61440 2354.32731
18.65000 -2380.62128 9.46296 -108.27279 48.66287 37.86321 2689.60410
18.75000 -2367.81205 8.25607 180.82049 51.58908 37.76434 2928.80627
18.85000 -2356.87549 8.73461 0.17463 51.86893 42.69199 3180.73788
18.95000 -2342.67017 5.69877 51.33786 57.50078 37.00428 2903.74336
19.05000 -2331.55422 10.15978 101.38841 53.85976 45.50277 2266.66251
19.15000 -2318.13250 4.51136 68.11955 66.38021 56.96225 2291.70695
19.25000 -2305.88536 10.80589 359.86075 54.64970 55.22645 3250.50309
19.35000 -2290.46708 9.16659 67.31363 45.75755 33.78158 3380.31331
19.45000 -2269.41356 7.86803 146.05551 57.56875 43.92568 2656.83278
19.55000 -2260.55318 8.04250 383.50469 58.21491 51.32508 2793.35354
19.65000 -2247.24334 9.84209 356.94762 43.01139 37.37800 3591.71566
19.75000 -2234.92852 9.02157 112.86089 45.09101 30.96532 2517.65782
19.85000 -2226.82774 8.58749 -235.67051 48.20101 34.04067 4397.07998
19.95000 -2216.91286 8.14732 40.00614 53.77339 39.76351 2475.34440
