0.05000 -134693.76236 8474.78084 23658.29151 141555.96006 175196.50328 174208.74443
0.15000 -153482.82775 1003.58229 752.78197 76262.21400 71676.12961 134858.17981
0.25000 -96816.26665 -161.94065 -1191.66465 39049.81971 24076.13420 77416.66067
0.35000 -67111.44081 250.02904 556.94693 23660.85215 12735.91925 54218.94287
0.45000 -51385.94547 178.56001 -1695.46331 17238.10359 7268.57090 41733.05429
0.55000 -42562.31872 100.61765 -866.92776 12646.05886 5302.03184 33414.00329
0.65000 -35793.55803 22.49615 -1291.78949 10261.38129 3981.14281 28297.90561
0.75000 -31421.39961 178.87348 -511.08231 9031.40638 5364.38604 24598.94511
0.85000 -27893.54932 93.95854 -33.92567 7640.14231 2670.55326 21759.30275
0.95000 -25325.52545 73.47771 -32.99867 7481.44843 3235.92156 19468.03112
1.05000 -23090.78731 51.50785 28.91208 5857.36247 1951.39789 17377.62264
1.15000 -21370.90981 50.15044 47.43335 5340.91879 1991.73092 15606.58602
1.25000 -20018.24253 31.63845 134.55345 4728.74435 1748.11204 14255.34452
1.35000 -18810.18292 59.25545 -38.48657 4237.92846 2166.50497 12928.80025
1.45000 -17689.25695 126.07898 8.97682 3779.67194 2417.41449 12204.25545
1.55000 -16922.37024 28.29057 -139.69904 3337.01325 1460.55593 10869.82200
1.65000 -16052.21302 16.26524 -167.88800 3145.54120 1354.75674 10175.77642
1.75000 -15376.18920 21.92539 74.91053 2977.73907 1709.68878 9614.21586
1.85000 -14876.74412 36.81003 95.34854 3171.80890 2441.73720 8952.29735
1.95000 -14291.45478 56.21583 -70.78790 2455.14555 1225.94384 8262.27962
2.05000 -13806.80484 31.22997 -150.42288 2451.71079 1200.28772 7735.36951
2.15000 -13540.49811 53.76475 -10.47107 2098.22407 1371.03313 7227.82032
2.25000 -13138.07951 33.90752 -129.61818 2054.63722 985.26309 6929.90072
2.35000 -12752.99174 82.28909 15.33951 2053.30997 2128.51132 6650.73998
2.45000 -12460.74572 29.97198 -163.73336 1766.98534 1053.17737 6161.24458
2.55000 -12195.89549 10.56173 -55.91863 1787.77034 957.24253 5748.80042
2.65000 -11903.55334 32.88959 43.88592 1686.64087 1079.42365 5510.27700
2.75000 -11605.65760 46.53614 -124.50750 1714.34295 1210.77230 5198.01830
2.85000 -11364.91866 3.65616 -46.38470 1454.78209 870.17837 4977.66918
2.95000 -11165.36855 9.76841 152.22144 1296.50791 956.98119 4820.85350
3.05000 -10895.75812 -16.18092 28.83449 1390.00457 2487.96408 5142.02270
3.15000 -10670.41290 17.41021 -3.77517 1196.82969 731.28481 4319.38347
3.25000 -10492.29242 16.97097 -47.63977 1127.77748 1196.02794 4110.41144
3.35000 -10259.84678 10.58282 178.06164 1243.77924 1200.20917 4143.04822
3.45000 -10110.70888 2.20567 52.30446 869.10032 719.56151 3773.11684
3.55000 -9891.77153 17.02360 14.77416 1070.79024 979.77019 3669.38679
3.65000 -9746.50550 -38.14292 65.39902 1146.41488 2930.68399 3498.69236
3.75000 -9604.72606 47.79390 -14.18497 836.66900 1126.31557 3378.22955
3.85000 -9404.93101 -4.53547 50.87101 902.65726 656.34054 3278.08275
3.95000 -9318.21952 12.61468 2.65948 912.86610 776.69584 3156.61575
4.05000 -9151.46687 11.72292 -8.43166 984.08594 678.75077 3138.87560
4.15000 -9018.23731 18.90772 93.93620 910.51466 573.53344 2843.89050
4.25000 -8892.06867 12.75123 -5.21012 765.97134 625.82267 2790.56622
4.35000 -8784.11709 -77.64537 16.83317 2120.14294 3099.46121 2751.92521
4.45000 -8655.22349 70.12881 -123.73607 1912.53926 2784.09031 3276.68574
4.55000 -8464.45321 -29.83724 -59.92369 585.75670 1482.15437 2872.79012
4.65000 -8317.43819 10.17228 26.26436 936.79269 583.00989 2463.30288
4.75000 -8196.54381 9.13843 26.98509 1325.81238 673.43006 2612.31628
4.85000 -8083.79225 -0.52324 66.27927 614.43802 709.72961 2341.05505
4.95000 -7962.14543 0.37689 -28.73318 633.73580 691.10406 2595.35685
5.05000 -7876.08944 21.39750 -21.59144 658.57713 655.25187 2428.23072
5.15000 -7727.86852 20.17218 -17.26309 667.14469 433.09244 2178.72648
5.25000 -7629.22334 -4.44417 -48.58241 499.65189 648.33265 2085.74692
5.35000 -7528.68894 21.53008 -14.48317 645.66247 499.09290 2003.94728
5.45000 -7435.37743 13.81463 -27.19312 562.97294 507.48096 1943.80485
5.55000 -7319.32193 -12.10873 21.79163 498.27887 358.15533 1887.91228
5.65000 -7234.18906 12.17084 76.48173 414.95715 440.84760 1853.20057
5.75000 -7135.24080 5.31195 29.77511 466.16892 476.69334 1820.14743
5.85000 -7048.28312 7.95067 -29.59373 436.71681 373.37888 1754.56873
5.95000 -6972.56728 2.26808 -1.70601 417.79456 361.63606 1690.72571
6.05000 -6872.98186 11.39667 12.84113 411.42802 421.95444 1684.77154
6.15000 -6806.80266 8.61403 42.43567 487.02166 331.79015 1604.00622
6.25000 -6725.92585 8.99023 79.56067 498.07327 300.26405 1583.33667
6.35000 -6638.30165 6.76256 105.09068 604.10190 421.39120 1572.30514
6.45000 -6551.46554 16.27562 52.86285 816.80819 641.20528 1526.56601
6.55000 -6496.11453 9.14657 50.50427 604.65610 697.34619 1443.45171
6.65000 -6439.91574 2.23584 24.10909 490.04883 375.26205 1435.27340
6.75000 -6343.25778 1.88146 73.76574 375.41693 356.04649 1469.82116
6.85000 -6324.51613 8.43251 146.62327 1256.74737 571.61355 1456.51423
6.95000 -6230.77855 9.47864 111.42156 374.30916 327.10934 1313.60850
7.05000 -6150.63993 5.77205 45.90146 353.53334 259.52760 1334.49329
7.15000 -6102.02788 2.48755 118.90378 319.81549 266.99325 1258.91289
7.25000 -6032.51174 -5.48230 106.41723 396.85005 328.77459 1294.22399
7.35000 -5986.95462 -2.22828 120.62451 377.86264 315.34585 1272.22308
7.45000 -5921.60192 8.67796 108.43764 374.55402 358.35101 1204.52426
7.55000 -5887.95733 11.93618 137.07829 493.16753 412.47518 1186.75259
7.65000 -5824.17110 -0.00132 100.88981 285.89862 232.13773 1147.01690
7.75000 -5760.31084 -0.36942 163.40496 317.09830 261.97178 1126.11416
7.85000 -5701.92816 5.15367 141.89975 327.38560 295.04953 1122.09323
7.95000 -5641.11805 1.15535 130.81151 235.09758 220.98837 1075.21267
8.05000 -5604.07341 2.19807 141.33991 305.14304 310.18645 1029.52934
8.15000 -5559.98756 -6.38349 95.20831 394.71611 267.26081 1034.27860
8.25000 -5493.41694 13.63426 157.62373 412.31938 243.04326 996.47823
8.35000 -5416.55836 27.47209 112.82787 397.23702 753.39823 1104.94341
8.45000 -5270.61533 82.75219 105.15147 4454.94106 2496.65714 956.34011
8.55000 -5365.18774 3.27582 121.73185 530.94803 239.24824 930.96126
8.65000 -5275.11422 8.45881 99.12791 265.84808 239.10038 947.03499
8.75000 -5226.77907 15.13862 142.96896 362.11664 209.79083 901.63195
8.85000 -5157.49047 14.63098 102.00996 412.23439 281.54516 908.75131
8.95000 -5107.44398 15.63568 92.21219 520.21324 281.33689 918.95820
9.05000 -4920.43053 99.26821 54.27140 4884.39169 2957.60824 1139.59849
9.15000 -5015.63580 -2.47607 148.71561 306.35088 273.35770 825.91501
9.25000 -4988.69175 17.26964 95.06035 345.43299 302.46163 810.22228
9.35000 -4925.00995 1.04594 95.24549 219.03779 207.68935 787.29629
9.45000 -4875.32824 5.27839 113.33461 295.93565 210.03647 777.45484
9.55000 -4831.83524 5.74431 133.05700 329.95591 185.77144 757.65254
9.65000 -4797.26110 -10.94166 80.73944 183.75324 288.72316 754.15098
9.75000 -4754.95415 6.30943 103.98803 203.76851 173.32371 684.82553
9.85000 -4731.56919 -2.05575 142.81380 844.66912 825.15443 832.47245
9.95000 -4675.62407 24.67585 42.61150 547.57533 675.92504 842.76821
10.05000 -4623.49148 10.58596 92.95840 186.22334 129.99541 650.55032
10.15000 -4575.45531 10.82599 85.99097 247.70732 175.89525 656.46649
10.25000 -4553.22680 13.83422 104.85742 451.39253 323.84656 708.09877
10.35000 -4503.91066 -0.83707 118.74333 217.41259 273.27682 621.49702
10.45000 -4446.29689 5.12228 103.71772 168.46250 209.81439 625.28622
10.55000 -4399.36768 -4.39751 83.25356 180.08214 245.89155 630.32506
10.65000 -4361.19225 4.73768 69.46962 118.20249 144.29297 587.07739
10.75000 -4324.79779 5.46069 67.18724 204.19026 164.74817 573.85068
10.85000 -4284.38224 0.38407 65.60148 146.42023 132.35203 564.26785
10.95000 -4250.71419 4.57375 52.94870 181.25075 138.80506 566.94725
11.05000 -4216.15893 1.96001 87.79775 149.20186 179.26188 552.63508
11.15000 -4172.50288 6.50097 72.44988 317.76000 260.00333 542.57948
11.25000 -4126.07585 -6.67451 49.33252 190.57847 151.75279 524.37149
11.35000 -4087.26388 8.83869 50.21326 280.12081 135.74315 533.44611
11.45000 -4061.75972 13.42816 63.97963 1132.88721 412.19566 709.54194
11.55000 -4019.85848 6.24666 79.82649 123.50528 107.52360 493.92210
11.65000 -4007.85849 12.30047 73.79574 278.50079 222.45102 502.21152
11.75000 -3966.17627 8.03963 43.26373 126.99029 151.44160 520.91675
11.85000 -3933.72852 13.68495 49.76833 109.26796 107.76533 448.97222
11.95000 -3893.42341 -1.19410 48.28931 131.59964 153.11387 469.60044
12.05000 -3843.72607 9.14003 38.85660 374.56827 177.68283 481.59889
12.15000 -3814.22502 3.35055 42.52270 113.52697 96.28792 450.06709
12.25000 -3790.98968 9.23149 57.27471 174.39388 92.19514 428.28968
12.35000 -3763.45011 4.59042 29.80986 161.75133 90.45197 421.54096
12.45000 -3729.64138 7.78648 40.18916 122.82831 124.40422 403.13893
12.55000 -3683.81886 4.53218 85.83960 134.04504 155.06695 427.98562
12.65000 -3645.30495 7.05533 89.42364 301.59455 123.99726 460.06575
12.75000 -3637.88752 11.85222 82.97666 221.46956 304.79656 454.65531
12.85000 -3606.15914 6.49324 61.86597 111.72981 69.34528 398.05442
12.95000 -3457.85330 -52.56732 15.60185 2298.31666 1200.48643 1334.48372
13.05000 -3543.39755 4.12715 62.43024 115.40103 137.90367 405.05218
13.15000 -3524.60255 4.56919 113.61925 108.58876 83.87773 368.17274
13.25000 -3498.29935 8.08929 66.84450 97.89905 76.11289 340.43719
13.35000 -3455.50336 5.37847 93.57465 187.43401 90.24302 364.09723
13.45000 -3449.53518 23.60493 67.45131 156.56016 502.55228 359.94987
13.55000 -3414.59207 11.45724 72.06225 100.83282 99.69922 340.06794
13.65000 -3389.04694 7.49194 126.41086 74.50628 70.35933 320.58948
13.75000 -3374.89803 8.24317 96.26740 103.77911 89.89217 314.42189
13.85000 -3330.52019 -7.52313 100.45192 209.91015 210.71859 358.80503
13.95000 -3345.74775 16.52712 121.58049 418.75652 281.49651 482.54026
14.05000 -3293.57476 5.59061 101.34274 114.70352 92.09447 312.14169
14.15000 -3257.04913 1.86544 60.47934 116.89322 70.61264 301.19374
14.25000 -3253.79265 8.80258 121.03109 96.07905 94.75421 301.55174
14.35000 -3236.71822 1.26663 81.42332 88.97472 112.14560 298.74513
14.45000 -3201.56259 5.42423 65.42425 76.75505 76.47967 297.78702
14.55000 -3177.83319 10.88628 80.55496 71.77946 89.80993 271.94209
14.65000 -3155.72668 7.67535 100.91496 85.27778 96.65882 293.81407
14.75000 -3134.79132 11.75112 96.90723 83.30922 95.28000 274.56471
14.85000 -3103.39774 7.31712 85.33987 84.02719 77.31941 262.51953
14.95000 -3094.85752 -0.02507 86.32494 219.75965 142.32818 291.45864
15.05000 -3073.32420 3.56387 114.55158 119.74587 71.50853 271.21102
15.15000 -3046.04751 -2.95003 70.45094 94.19777 68.92985 265.30172
15.25000 -3009.23745 1.28957 91.39091 92.01516 80.47674 278.48223
15.35000 -2998.19449 3.74688 86.50874 69.97975 63.46396 240.42439
15.45000 -2981.63245 2.03496 87.32095 75.87345 53.01445 217.19826
15.55000 -2952.39865 0.73382 49.21834 104.45382 79.61133 249.23187
15.65000 -2922.75719 10.25544 98.00223 151.16502 119.52334 269.70016
15.75000 -2904.99262 16.78337 78.65454 128.48866 160.61639 233.45614
15.85000 -2898.18386 0.32507 84.81624 93.04712 58.56958 210.25515
15.95000 -2864.34196 2.04831 89.69718 136.57653 58.04742 225.98014
16.05000 -2854.20734 5.51558 87.99436 65.19743 63.85983 217.17072
16.15000 -2837.59094 4.75602 85.16929 83.91640 57.92426 216.39709
16.25000 -2819.19619 8.44511 68.69282 79.23198 73.34371 225.74143
16.35000 -2796.99207 -3.62244 87.50215 70.21220 232.56606 223.45180
16.45000 -2771.22840 7.92740 78.98172 82.48129 53.92360 219.02494
16.55000 -2750.60818 2.27084 67.15715 58.05935 43.66291 203.65590
16.65000 -2731.87684 9.93624 74.80017 80.07173 64.35769 209.44743
16.75000 -2708.40613 -1.03297 87.28187 121.19195 61.41198 213.07591
16.85000 -2699.53552 2.51914 70.65384 77.33569 59.30176 190.84710
16.95000 -2676.71892 -0.32023 63.48918 63.05209 74.67291 187.47542
17.05000 -2669.04272 -0.00354 75.79547 73.19850 50.48383 183.83437
17.15000 -2653.36665 8.84330 65.98398 69.08468 50.62188 169.73913
17.25000 -2601.59605 -29.56411 58.86816 338.92272 404.33967 195.82276
17.35000 -2592.45109 6.62499 55.90722 132.74237 95.44225 201.57178
17.45000 -2564.15118 11.68775 102.01454 446.86263 165.14471 222.45370
17.55000 -2602.21011 -2.72950 68.04153 254.29074 53.06669 170.83829
17.65000 -2559.48667 20.54101 64.26973 135.24034 301.94255 279.63701
17.75000 -2548.12228 10.78933 96.96229 56.01508 55.04707 178.40949
17.85000 -2533.13819 3.36957 63.96058 56.29854 43.68898 169.58483
17.95000 -2516.95050 -2.45292 90.13408 55.38394 55.45857 172.93437
18.05000 -2516.06798 0.36247 85.00636 60.29626 60.34465 163.95902
18.15000 -2484.36988 -1.70713 73.03294 68.03403 45.58681 135.83741
18.25000 -2475.89283 -1.65352 66.96744 51.89736 58.35469 150.84021
18.35000 -2451.51349 -1.89330 87.58074 74.52464 39.37925 180.80324
18.45000 -2424.33571 3.20956 41.59547 91.00678 44.05626 165.79512
18.55000 -2436.36962 -0.45999 83.92099 70.67521 47.61248 147.98136
18.65000 -2436.88740 18.25434 61.34572 133.03024 116.79741 236.49739
18.75000 -2396.52580 6.77771 102.92901 67.72227 42.82410 152.44444
18.85000 -2386.75524 -1.92858 67.35266 63.19974 48.53245 154.15075
18.95000 -2368.87015 8.33145 57.25610 70.63415 102.78881 189.83067
19.05000 -2355.86366 -4.76575 108.02062 56.40245 31.02233 146.53183
19.15000 -2350.41409 12.83690 118.92259 51.16049 50.59404 147.30540
19.25000 -2350.66077 6.39648 79.79540 62.08775 54.60380 141.24084
19.35000 -2321.10186 10.70360 65.26622 63.31591 38.83675 150.71156
19.45000 -2306.11768 7.70616 110.48334 46.21249 39.14866 123.15739
19.55000 -2288.28896 11.93393 84.49697 66.06741 39.60288 143.35374
19.65000 -2272.46894 7.23452 87.76296 73.06700 49.29232 169.76877
19.75000 -2269.96911 -2.83492 106.16450 52.81250 36.59867 143.87038
19.85000 -2256.91133 1.33346 97.09434 46.46148 42.25798 134.33513
19.95000 -2254.31911 3.36603 109.52813 45.94959 46.52386 165.49876
