0.05000 -71709.44655 -100.76103 -21969.99269 43231.84472 37241.55734 75416.72963
0.15000 -84102.03944 -886.68683 -5638.31131 32024.18129 20709.58787 66637.39901
0.25000 -65941.79540 9.01671 -2131.79177 22818.35508 10301.11907 52764.26159
0.35000 -51387.61662 161.72291 90.19997 16359.55241 6352.84025 41299.51873
0.45000 -41910.65477 5.88810 -425.97756 13009.99843 4489.31249 33784.47873
0.55000 -35249.33148 38.54894 475.40882 10611.16202 3883.59302 28251.20020
0.65000 -30576.28485 84.83574 307.09643 8986.17847 3260.98605 24158.64215
0.75000 -27026.75351 127.31488 722.01973 7507.04334 3148.10313 21119.66479
0.85000 -24370.91334 67.72234 188.78993 6664.78544 1981.92943 18558.57733
0.95000 -22287.11178 60.03433 -299.35293 5974.90074 2307.19568 16737.99847
1.05000 -20461.56027 21.34986 46.35583 5573.17134 1896.63091 15037.62842
1.15000 -18847.32375 48.53311 377.96782 4908.69108 1486.46102 13918.50240
1.25000 -17634.45923 95.42918 397.30394 4216.33169 1267.95234 12678.63749
1.35000 -16621.52530 33.05754 -128.48308 4058.03078 1549.89234 11680.55822
1.45000 -15747.09383 53.88523 271.16451 3527.68338 1237.98402 10763.04740
1.55000 -14780.75577 110.39477 361.87526 3358.69880 1343.97642 10218.85957
1.65000 -14246.73243 106.47704 156.53527 2995.41307 2071.26241 9519.03646
1.75000 -13668.73919 63.27147 48.93758 2908.26241 1262.89962 8737.34913
1.85000 -13164.64704 68.81808 357.52858 2743.33472 1546.08205 8184.66616
1.95000 -12662.96773 52.24480 -125.24449 2563.01617 1333.60018 7702.91128
2.05000 -12234.88028 54.17309 -57.53293 2124.34972 1072.42459 7301.20900
2.15000 -11895.78346 32.23900 385.73075 1958.73777 1330.36227 6836.00984
2.25000 -11582.46935 52.35070 67.66620 1973.94218 1046.37598 6557.17702
2.35000 -11284.75997 64.04490 14.64902 1617.41607 997.16201 6006.69962
2.45000 -10940.56936 45.99755 171.96769 1643.86099 823.89042 5824.72274
2.55000 -10663.00210 18.63700 174.97760 1514.00526 1313.78926 5411.58254
2.65000 -10453.21387 12.46759 161.86485 1336.21799 985.66991 5092.97931
2.75000 -10103.53336 1.11842 108.91762 1290.68321 807.27533 4989.82088
2.85000 -9929.72159 27.26575 47.75112 2233.85329 1152.58611 4584.70905
2.95000 -9712.21888 31.52595 76.05796 1149.67526 841.16659 4398.21167
3.05000 -9466.61355 39.44955 100.38806 1130.34927 921.15831 4277.54756
3.15000 -9300.46085 -13.80199 2.08229 1485.81162 1299.99291 4090.97069
3.25000 -9168.50257 9.23117 116.96913 971.57503 925.87753 3880.35795
3.35000 -9063.44533 39.59921 133.23811 877.42946 758.07832 3620.76618
3.45000 -8859.06809 -5.57357 32.77942 861.37058 1797.86296 3893.84431
3.55000 -8739.24261 7.91811 161.06222 833.03748 659.73418 3355.01121
3.65000 -8595.00385 12.39665 32.95976 736.03481 487.91397 3206.76447
3.75000 -8429.47269 24.17490 121.64547 715.63939 503.84662 3202.86724
3.85000 -8311.86661 43.31325 29.05621 945.24912 2058.35048 3079.29092
3.95000 -8204.76596 36.31106 110.72680 798.37544 653.29054 2957.24836
4.05000 -8105.04015 15.26639 68.86787 660.39978 489.85922 2852.90053
4.15000 -8017.51025 18.38114 -17.42552 730.52183 468.37253 2802.37561
4.25000 -7938.28788 27.78970 0.15067 601.30182 588.34229 2644.47326
4.35000 -7842.84191 32.99924 30.82775 602.02909 550.67158 2601.33815
4.45000 -7745.37148 28.37511 58.21772 610.29262 561.71686 2583.15496
4.55000 -7630.07195 50.83446 17.34797 1381.68609 1027.84082 2566.78459
4.65000 -7548.93071 18.69831 22.53756 568.61109 562.09239 2456.41978
4.75000 -7488.89307 28.47998 -30.71043 557.36666 454.45924 2348.03977
4.85000 -7422.22632 10.72927 -3.99543 486.26873 387.54658 2214.00926
4.95000 -7301.76524 -2.92620 53.01798 846.48327 723.97959 2309.40313
5.05000 -7245.38836 2.59747 13.95549 534.53990 461.35522 2133.80994
5.15000 -7146.12729 11.00280 -47.70693 547.18054 631.94266 2124.25259
5.25000 -7087.26027 24.46308 12.25896 1089.09788 910.51224 2034.04219
5.35000 -6978.44643 21.03633 -70.67949 482.85601 439.85937 2020.12222
5.45000 -6923.40861 7.23745 -13.08387 1347.03174 616.50185 2304.16204
5.55000 -6825.09961 22.10502 -89.13261 491.36522 396.08585 1917.98192
5.65000 -6788.54545 13.44435 -3.83982 596.69669 379.45385 1800.33412
5.75000 -6715.89718 6.45614 10.48148 615.00186 458.80957 1778.00690
5.85000 -6620.84503 4.89470 -37.72483 806.19802 1098.69800 1820.24480
5.95000 -6585.89938 21.78590 -57.65100 445.22162 513.70641 1684.33182
6.05000 -6510.35793 17.44009 0.02860 438.20582 340.71922 1646.10432
6.15000 -6465.30918 13.39258 -28.72024 613.17508 719.53605 1572.98747
6.25000 -6375.09424 21.75236 -36.36326 427.84774 353.94155 1540.22651
6.35000 -6330.94996 -0.05368 -10.84588 435.45866 765.28376 1557.70208
6.45000 -6270.53804 29.30750 28.35687 386.59531 407.93521 1493.71560
6.55000 -6222.81737 28.27849 16.36963 385.56927 343.13179 1413.54275
6.65000 -6169.79839 29.48682 -26.81418 315.87505 535.55600 1450.27060
6.75000 -6113.45172 15.35283 -42.81489 296.42140 258.92749 1349.20269
6.85000 -6065.93968 -12.13446 -36.08461 488.68229 706.61562 1365.64937
6.95000 -6011.93253 19.50359 6.58250 359.19196 587.22144 1300.67496
7.05000 -5951.22460 13.50804 4.97113 367.20320 316.59904 1356.76135
7.15000 -5896.85768 7.46730 13.60347 447.81894 269.58310 1307.34146
7.25000 -5854.03992 15.82085 -45.82225 435.95304 378.10981 1223.82665
7.35000 -5779.14927 14.67865 47.06099 276.96284 385.96158 1168.90809
7.45000 -5720.82318 14.36373 22.39156 297.13849 280.01315 1156.85135
7.55000 -5664.31531 27.63542 42.97690 371.13019 422.25216 1161.65133
7.65000 -5629.03144 10.47367 27.51772 468.88100 323.01420 1108.29944
7.75000 -5571.78154 6.84603 29.21279 326.16580 325.63625 1171.68950
7.85000 -5503.06407 21.05119 29.34857 364.49515 389.15802 1038.70165
7.95000 -5448.98886 12.67046 14.51331 296.73927 273.50416 1020.92955
8.05000 -5384.06293 -1.13840 11.75513 344.08664 486.00084 1061.65989
8.15000 -5362.42542 -4.46424 31.84223 406.24160 414.25602 1027.58973
8.25000 -5286.64623 -3.44890 3.33711 391.90293 403.59386 963.68400
8.35000 -5238.07434 -0.81741 -8.76082 436.30136 306.54360 1035.50346
8.45000 -5175.97758 4.60579 37.66972 264.56102 280.88383 922.03486
8.55000 -5131.97747 5.91014 23.15251 286.41901 302.09443 901.86528
8.65000 -5089.13084 17.94024 25.18395 291.96746 284.40845 916.43133
8.75000 -5052.32042 0.50216 31.04926 254.44627 270.94577 864.24699
8.85000 -4987.45341 -2.61741 -37.63726 266.47267 193.43155 814.24771
8.95000 -4938.37407 13.69052 -2.58153 429.67691 299.39994 1009.48542
9.05000 -4898.62436 8.42882 -3.49369 387.65749 159.90875 954.70632
9.15000 -4851.12233 20.82164 -27.08362 273.06149 331.29530 819.80317
9.25000 -4810.33294 -0.05162 -36.02910 269.72223 324.16650 1036.06066
9.35000 -4776.53683 1.55671 15.52198 171.73967 153.72747 748.09690
9.45000 -4737.22152 19.12471 -5.65020 321.86926 251.15325 733.19646
9.55000 -4702.28968 10.66060 20.18579 244.85472 295.23619 725.46880
9.65000 -4644.11842 14.43896 27.72198 206.05351 192.16359 722.40228
9.75000 -4607.40703 24.93964 23.43437 376.79914 412.63132 774.99968
9.85000 -4575.81223 3.00148 -30.32250 306.66502 199.02195 687.59592
9.95000 -4521.54585 9.37936 20.37814 224.70414 214.84012 675.18731
10.05000 -4472.50556 -8.44593 -0.52182 257.99385 256.35868 683.66640
10.15000 -4440.37122 0.60851 6.02513 179.83825 198.55567 613.14982
10.25000 -4402.15325 -5.13423 1.28833 207.68232 367.14523 725.88329
10.35000 -4361.53841 4.84026 2.18177 141.99720 114.32228 591.83460
10.45000 -4337.52743 7.39826 5.81454 189.94394 207.30411 552.35740
10.55000 -4278.83311 13.68292 30.31148 558.33022 388.05215 615.13602
10.65000 -4253.26068 5.67107 81.20331 223.64082 528.57358 611.45630
10.75000 -4214.96668 5.59435 5.60508 140.27553 125.79036 561.57506
10.85000 -4195.99713 7.63686 32.90239 317.78144 243.10480 564.70777
10.95000 -4148.38819 7.58339 28.04400 219.15766 191.69179 559.69929
11.05000 -4112.87643 10.90462 23.24438 131.42502 113.03820 518.81169
11.15000 -4072.24759 14.58230 -4.31687 232.18590 323.73948 535.26660
11.25000 -4050.85085 18.48764 49.09007 166.11216 143.64379 487.27808
11.35000 -4024.78598 7.56186 -4.72182 147.55672 154.52856 505.89090
11.45000 -3959.16633 10.73311 23.13253 226.15613 155.96761 741.98415
11.55000 -3942.09728 8.20020 4.30571 280.44804 132.16837 494.08075
11.65000 -3909.85752 9.90256 33.32443 156.67184 111.26079 447.09313
11.75000 -3876.66062 4.86427 -12.44681 176.84097 145.41245 493.13782
11.85000 -3853.89068 8.45591 -2.70897 116.67455 102.76965 461.45088
11.95000 -3790.56563 15.22817 -8.26593 438.53204 233.31783 558.01781
12.05000 -3788.90911 4.17002 79.45977 230.24050 224.93101 442.78877
12.15000 -3760.89711 10.20197 -1.51167 107.37140 112.79878 425.80699
12.25000 -3726.01351 -20.81345 26.32155 242.60635 435.25353 427.52026
12.35000 -3691.61428 14.95304 31.93213 124.94011 103.24481 422.80324
12.45000 -3667.32593 -10.16534 35.10832 143.67362 147.96583 399.00688
12.55000 -3654.90022 21.23966 -12.65472 244.50028 261.54718 405.98900
12.65000 -3608.84874 5.13648 -5.81563 158.02603 171.21894 425.90548
12.75000 -3579.61269 11.69654 40.15170 108.62663 135.39055 397.92892
12.85000 -3559.86289 -9.56691 58.33587 175.49104 145.45645 388.30116
12.95000 -3523.26054 8.20212 20.44375 113.31475 99.41753 371.68481
13.05000 -3505.64958 -2.31688 31.99728 115.64121 121.82344 365.64324
13.15000 -3465.61694 -0.86964 51.39997 133.42904 86.81771 354.97223
13.25000 -3435.29152 9.86930 67.55215 123.67700 86.43534 380.93964
13.35000 -3413.94338 -2.57462 23.91111 103.06564 70.75528 368.26521
13.45000 -3382.18005 -2.94989 24.92542 72.85173 85.28280 337.95801
13.55000 -3355.19162 2.53223 28.95943 90.43350 77.61219 313.71673
13.65000 -3318.89689 -9.31429 23.49575 172.35661 198.51629 347.40874
13.75000 -3305.36204 3.37523 61.34431 76.28898 75.91846 302.38485
13.85000 -3283.48383 6.05223 44.08875 76.67566 100.57496 291.59278
13.95000 -3253.19847 1.27388 65.49481 164.79606 139.97152 294.97497
14.05000 -3229.32940 0.14560 50.15750 94.47509 111.00881 301.52802
14.15000 -3224.13641 22.64249 22.79741 343.53334 351.58443 328.27752
14.25000 -3187.74570 -0.77367 70.46837 157.52044 105.84567 259.72131
14.35000 -3216.64710 -59.99426 89.61385 696.61963 1063.52606 427.43460
14.45000 -3151.51384 10.95616 43.41566 90.96995 65.21609 345.55987
14.55000 -3128.59012 -13.32518 18.75489 92.28560 242.95115 355.08257
14.65000 -3113.65815 -0.83008 35.33923 80.76757 79.05966 275.92257
14.75000 -3086.19936 -1.72641 48.43307 64.19284 68.20273 257.31396
14.85000 -3068.24654 6.11291 34.72475 89.63905 96.48476 277.53503
14.95000 -3038.89089 13.28017 44.43375 146.89957 147.05677 256.67443
15.05000 -3034.77235 5.49849 13.97100 121.95588 85.32505 246.86007
15.15000 -3025.53671 31.49481 57.78452 240.92702 364.46189 376.40744
15.25000 -2980.14813 15.36301 45.57321 166.04118 129.48047 283.70196
15.35000 -2955.45634 -5.25739 -1.75909 62.93990 48.71789 223.82829
15.45000 -2938.23515 3.51789 49.05546 87.53554 71.45025 240.32766
15.55000 -2908.70386 -1.66268 14.80297 65.46097 69.24750 221.75141
15.65000 -2891.09345 -0.26146 8.66886 66.09077 72.72601 230.51791
15.75000 -2869.89148 6.28726 33.21437 84.72077 69.77702 228.30946
15.85000 -2854.77884 9.97717 5.17131 105.64629 91.21102 252.90999
15.95000 -2847.54098 7.09888 1.06243 84.41676 96.01838 238.88272
16.05000 -2815.05571 3.04605 6.06411 129.46036 112.74307 219.65346
16.15000 -2788.77004 -5.67951 13.09560 87.47302 91.46299 213.74290
16.25000 -2782.77498 0.72663 -8.15927 96.86986 60.03022 200.59626
16.35000 -2751.91088 -6.01739 21.52926 115.09536 81.89413 221.31673
16.45000 -2753.21064 3.52798 -0.41741 68.05087 51.90744 216.32479
16.55000 -2733.15981 4.47485 14.94730 52.47709 56.33713 190.33260
16.65000 -2709.95261 7.71008 4.36311 64.86696 48.20921 182.52292
16.75000 -2686.98222 -2.78531 19.44114 57.52593 47.53566 199.92094
16.85000 -2660.77535 1.92666 -43.71458 158.65085 58.89746 392.68711
16.95000 -2652.28387 5.22761 0.46868 76.73258 50.03724 197.54983
17.05000 -2694.54465 5.94868 -8.93944 523.26109 54.95840 197.66628
17.15000 -2617.01693 12.67080 -2.54015 72.85176 138.84486 283.67821
17.25000 -2611.43746 -3.18641 -5.12678 49.89042 43.96463 174.37655
17.35000 -2586.89712 10.24572 -12.55149 87.97976 59.77506 166.34544
17.45000 -2567.16455 10.86870 -1.22147 50.03650 52.48094 163.52351
17.55000 -2566.72008 8.32402 -20.36132 90.16582 48.95644 212.50200
17.65000 -2542.88190 0.26804 -11.15315 75.09371 59.79500 170.87508
17.75000 -2527.07239 8.86291 -17.56100 50.68411 45.96949 164.89723
17.85000 -2499.37260 -4.02665 1.30784 43.14570 41.70361 184.07074
17.95000 -2495.07143 -0.30866 -39.10944 41.71488 40.18158 145.23298
18.05000 -2481.75630 4.63999 -19.02169 55.16410 48.52971 164.06152
18.15000 -2464.51681 -6.17272 -6.85510 36.11088 37.75954 175.47286
18.25000 -2461.09585 8.61909 -12.39068 83.90817 49.02271 156.14289
18.35000 -2443.92238 -3.64597 -2.46757 136.34903 64.77605 219.17614
18.45000 -2442.98503 16.97506 -32.99510 266.07110 137.48438 255.15696
18.55000 -2360.48977 -19.34455 11.74353 363.38393 265.80231 166.85924
18.65000 -2381.47522 -1.45323 -4.62769 38.78693 40.38352 157.79569
18.75000 -2373.75334 11.19198 -27.01189 41.09447 42.26990 163.82719
18.85000 -2352.48663 1.59039 -6.19404 53.10702 44.00922 130.81548
18.95000 -2360.65741 -8.08216 -53.25329 131.21284 50.78333 142.92073
19.05000 -2330.66495 14.80990 9.74500 32.28655 61.83517 146.25225
19.15000 -2316.21619 6.41202 12.90735 72.54324 45.56423 129.91881
19.25000 -2309.24756 2.19342 15.07392 29.77619 35.25941 126.08485
19.35000 -2290.66423 -9.42849 6.25951 55.13563 73.06038 143.63415
19.45000 -2295.20859 21.50551 23.26996 104.07494 62.03415 172.63283
19.55000 -2257.84514 5.75022 1.32595 38.35137 33.32444 141.84334
19.65000 -2239.66762 0.72277 -0.00522 60.84405 40.28442 128.81381
19.75000 -2218.82625 4.12388 42.59421 82.32371 159.35631 225.92424
19.85000 -2231.54401 3.41374 3.00400 52.35758 58.45455 141.81296
19.95000 -2216.81116 2.29020 36.87180 37.15945 43.87727 126.05864
