0.12500 0.05813
0.37500 0.03828
0.62500 0.08429
0.87500 0.14378
1.12500 0.21019
1.37500 0.25836
1.62500 0.30956
1.87500 0.34303
2.12500 0.39751
2.37500 0.40889
2.62500 0.43753
2.87500 0.46150
3.12500 0.47376
3.37500 0.50385
3.62500 0.52453
3.87500 0.52905
4.12500 0.56826
4.37500 0.56002
4.62500 0.54795
4.87500 0.56558
5.12500 0.55598
5.37500 0.54975
5.62500 0.53978
5.87500 0.56154
6.12500 0.50603
6.37500 0.46978
6.62500 0.44640
6.87500 0.45786
7.12500 0.39738
7.37500 0.38572
7.62500 0.34198
7.87500 0.35602
8.12500 0.34548
8.37500 0.35186
8.62500 0.35619
8.87500 0.34454
9.12500 0.33019
9.37500 0.25879
9.62500 0.24879
9.87500 0.23281
10.12500 0.18638
10.37500 0.14647
10.62500 0.12010
10.87500 0.10514
11.12500 0.06788
11.37500 0.09645
11.62500 0.05541
11.87500 0.06396
12.12500 0.09201
12.37500 0.06309
12.62500 0.06881
12.87500 0.07278
13.12500 0.07804
13.37500 0.07550
13.62500 0.04348
13.87500 0.08074
14.12500 0.09923
14.37500 0.08479
14.62500 0.07963
14.87500 0.09141
15.12500 0.06481
15.37500 0.08449
15.62500 0.09634
15.87500 0.09689
16.12500 0.11835
16.37500 0.09960
16.62500 0.07863
16.87500 0.06257
17.12500 0.11596
17.37500 0.08642
17.62500 0.13235
17.87500 0.13871
18.12500 0.15298
18.37500 0.17964
18.62500 0.13955
18.87500 0.18712
19.12500 0.19482
19.37500 0.22753
19.62500 0.24531
19.87500 0.22797
