0.12500 0.00884
0.37500 0.00706
0.62500 0.00308
0.87500 0.01247
1.12500 0.01967
1.37500 0.04461
1.62500 0.06634
1.87500 0.10618
2.12500 0.12401
2.37500 0.12706
2.62500 0.13399
2.87500 0.13806
3.12500 0.13536
3.37500 0.11292
3.62500 0.08948
3.87500 0.07493
4.12500 0.06272
4.37500 0.05475
4.62500 0.04558
4.87500 0.04601
5.12500 0.04159
5.37500 0.04271
5.62500 0.03962
5.87500 0.04219
6.12500 0.03381
6.37500 0.03764
6.62500 0.03381
6.87500 0.02941
7.12500 0.02896
7.37500 0.03956
7.62500 0.03432
7.87500 0.05167
8.12500 0.05092
8.37500 0.05809
8.62500 0.05746
8.87500 0.05236
9.12500 0.02983
9.37500 0.06107
9.62500 0.05670
9.87500 0.05651
10.12500 0.05160
10.37500 0.05543
10.62500 0.05404
10.87500 0.04435
11.12500 0.04655
11.37500 0.04415
11.62500 0.04814
11.87500 0.05516
12.12500 0.05510
12.37500 0.04729
12.62500 0.03911
12.87500 0.04729
13.12500 0.03824
13.37500 0.04015
13.62500 0.03257
13.87500 0.04637
14.12500 0.01468
14.37500 0.03733
14.62500 0.02716
14.87500 0.03718
