0.05000 -2450.39198 -363.87108 2730.70480 4936.12764 5161.93265 3857.09302
0.15000 -4795.58929 29.22927 1557.69264 4308.58133 4664.00596 6658.46574
0.25000 -7390.27790 172.82351 1066.07691 4367.05502 4423.45671 9241.65191
0.35000 -9597.81329 -41.75025 919.14389 4277.17746 4279.26678 11237.03463
0.45000 -11171.10521 75.17337 207.97078 4317.48450 4246.33745 12661.26439
0.55000 -12307.05510 -13.83908 535.47203 4478.78834 4161.56332 13263.70802
0.65000 -12777.82362 49.27202 167.69453 4566.47730 4079.21624 13650.68127
0.75000 -13155.67938 -17.21258 70.99159 4425.97142 4046.41671 13522.17047
0.85000 -13376.51575 37.68840 180.18548 4266.89543 4000.70511 13240.46008
0.95000 -13508.72581 125.65099 -187.65526 4040.79565 3911.37231 12707.65138
1.05000 -13440.90453 21.05233 -61.82505 3777.78112 3777.86539 12082.88252
1.15000 -13250.56963 17.39962 -65.19470 3667.41699 3661.41867 11607.32704
1.25000 -13165.63639 4.71265 -108.25189 3386.24693 3530.95012 11001.98873
1.35000 -13056.09702 50.58752 -239.94448 3181.34234 3408.73884 10401.77267
1.45000 -12875.34053 48.08837 -163.01139 3056.23946 3285.95417 9899.33999
1.55000 -12614.92545 -8.98301 -78.40332 2880.07542 3144.80998 9483.48392
1.65000 -12397.59009 23.61368 -63.43355 2671.02667 3051.82699 8993.66336
1.75000 -12154.82201 41.01264 -121.82518 2520.00660 2924.31886 8509.70165
1.85000 -11928.65691 63.41558 -18.33414 2390.27443 2835.21688 8101.82731
1.95000 -11696.95329 29.57310 -43.91944 2241.77666 2733.89775 7650.82129
2.05000 -11393.05023 43.79033 -183.67010 2125.64970 2655.03213 7364.48970
2.15000 -11145.09080 43.24392 -49.46108 2001.30686 2539.36222 7047.10071
2.25000 -10909.29882 31.73721 -103.61009 1919.03206 2469.09752 6759.07464
2.35000 -10686.25218 -18.96709 -58.55526 1831.36553 2388.32842 6461.18820
2.45000 -10444.87311 42.68001 -69.45150 1693.74840 2311.67234 6166.45656
2.55000 -10229.32578 9.85788 -106.64103 1612.53310 2207.83125 5886.79154
2.65000 -9987.40997 28.53377 -179.34907 1531.20698 2120.25639 5724.63670
2.75000 -9791.36427 -19.13728 -107.43046 1439.47931 2057.98243 5440.66568
2.85000 -9548.27563 28.33977 -28.76157 1379.17723 1967.74626 5286.12318
2.95000 -9332.68319 26.73697 -46.56777 1290.73753 1907.99924 5137.36421
3.05000 -9174.68721 13.67545 -47.08997 1218.36806 1843.92661 4916.52521
3.15000 -9039.92992 -10.27158 -125.08539 1150.44647 1807.03995 4693.28611
3.25000 -8859.65121 -20.51858 -76.42959 1106.33778 1739.50472 4626.98106
3.35000 -8687.60380 -43.40058 -6.74815 1065.03023 1676.05681 4488.60574
3.45000 -8546.41435 24.29533 -67.59358 1013.76345 1612.44157 4291.78119
3.55000 -8424.42393 16.42120 -44.99198 978.77484 1551.07271 4147.87392
3.65000 -8277.97416 26.35856 -1.40045 928.97563 1508.41413 3999.91347
3.75000 -8165.27980 13.23507 -40.45862 907.31136 1430.68551 3909.63626
3.85000 -8022.47831 23.86724 -38.18784 885.93410 1391.73299 3774.98624
3.95000 -7899.12790 28.35939 -20.99914 831.74840 1340.29091 3664.62714
4.05000 -7769.43353 30.40448 -81.50612 822.08483 1279.19717 3567.23075
4.15000 -7644.59308 30.94599 -59.08595 796.21780 1223.29285 3431.92009
4.25000 -7526.14626 76.07266 56.26456 758.14650 1186.09681 3306.75406
4.35000 -7410.77751 32.20411 82.26830 724.67418 1150.29511 3197.25539
4.45000 -7309.85890 52.09345 -89.21496 732.84048 1087.10450 3112.83953
4.55000 -7185.92628 25.15152 -3.26997 698.66051 1041.58172 2988.70734
4.65000 -7115.20328 48.01234 7.84275 693.92060 1007.99721 2858.85802
4.75000 -7007.61217 60.91055 -15.76103 696.15467 960.55007 2806.79388
4.85000 -6895.99129 61.19896 12.29027 686.18387 923.08613 2659.17293
4.95000 -6794.41413 99.41402 16.87146 683.56350 875.65808 2574.74920
5.05000 -6693.52845 84.19144 80.31760 664.12089 842.61857 2452.69985
5.15000 -6600.36204 72.17417 -22.05706 657.11491 798.69674 2392.70084
5.25000 -6497.00190 76.19331 7.11160 629.32393 774.07703 2270.12822
5.35000 -6410.43057 98.92963 20.48790 617.02318 734.53048 2179.44405
5.45000 -6330.11553 92.22021 55.73561 607.76443 701.62785 2084.62373
5.55000 -6255.56513 78.56956 67.78392 581.61025 669.86107 2008.39618
5.65000 -6171.90569 68.62040 57.43869 574.61630 634.35547 1868.99339
5.75000 -6097.53758 70.39597 59.08821 561.41349 614.49295 1811.24360
5.85000 -6038.63296 58.47733 39.05874 550.99226 587.60838 1771.71452
5.95000 -5959.75040 50.92062 90.07342 532.97673 562.66078 1689.83366
6.05000 -5919.95101 57.18891 46.45317 519.45189 539.68508 1623.40147
6.15000 -5854.59547 66.80208 21.08438 501.63727 512.49263 1555.24338
6.25000 -5818.35285 56.92278 66.37030 496.04191 495.69528 1523.09428
6.35000 -5774.79149 61.58937 54.58173 490.19906 468.76115 1464.41186
6.45000 -5751.80400 72.43055 61.14112 489.97989 448.30994 1421.05760
6.55000 -5713.71185 65.14233 43.99130 478.84767 428.60645 1361.48309
6.65000 -5668.91111 65.05764 43.20386 468.59018 412.05907 1314.06769
6.75000 -5642.78204 53.73453 45.36009 467.10734 388.28009 1286.29834
6.85000 -5609.18595 61.24172 44.06545 456.41687 374.06100 1242.21270
6.95000 -5548.46493 55.12835 50.43311 451.09986 359.34237 1212.23504
7.05000 -5522.63164 57.56914 86.23819 451.38859 339.75495 1172.40515
7.15000 -5475.58203 60.30252 50.21370 451.27903 322.27567 1132.15026
7.25000 -5407.74524 57.26452 21.07501 441.96630 306.94903 1097.26201
7.35000 -5360.58374 43.38920 31.19977 426.83857 294.06326 1043.68726
7.45000 -5311.78431 40.34064 22.22111 414.42698 286.26076 1039.51023
7.55000 -5253.66765 35.01140 18.65147 405.02764 273.41536 997.43055
7.65000 -5195.94843 43.59693 30.55218 384.44012 258.39067 958.47002
7.75000 -5126.74823 39.54182 15.33586 365.84222 241.31962 937.81685
7.85000 -5081.68265 40.80566 14.37796 358.83712 232.23851 909.63973
7.95000 -5023.55013 32.79396 7.51134 347.45484 225.55827 889.41882
8.05000 -4972.57979 33.52359 6.51657 338.82122 214.00004 848.38661
8.15000 -4917.95457 27.80592 -15.00473 317.43452 206.57998 840.57873
8.25000 -4853.72128 30.21627 -13.47171 289.48727 199.17613 820.56768
8.35000 -4820.21758 33.99597 -7.78527 280.17328 195.91318 798.78794
8.45000 -4780.07982 29.48295 -1.98765 273.85096 186.63045 777.54906
8.55000 -4730.11529 31.23169 -18.55925 260.74859 174.15189 748.18057
8.65000 -4678.37989 30.75307 -17.12269 242.51799 166.16979 729.05841
8.75000 -4636.49162 33.26974 -7.79169 232.68926 164.10388 715.57871
8.85000 -4594.57753 28.79139 -27.35193 228.91914 156.87086 700.80853
8.95000 -4556.02753 31.41046 -17.02774 220.92289 155.81010 699.64889
9.05000 -4505.83110 33.57735 -2.38701 205.62628 148.55404 662.10906
9.15000 -4469.91962 35.12109 -17.28067 199.58805 147.39939 654.43255
9.25000 -4432.29950 29.17307 -13.86909 193.93702 149.80576 646.11632
9.35000 -4392.62613 25.83500 -20.21326 186.03825 136.17954 634.04226
9.45000 -4354.47307 28.31694 -7.95512 179.68689 129.98565 627.06979
9.55000 -4320.58150 27.04445 -6.80984 182.65602 133.04553 631.78923
9.65000 -4285.96101 29.59077 -22.49439 171.04068 127.44170 604.43261
9.75000 -4256.59385 26.13259 -1.61647 173.01717 130.28540 585.86602
9.85000 -4222.92986 22.76734 -11.69212 178.33178 127.83061 584.67447
9.95000 -4198.15748 27.59857 3.50985 163.15547 120.51423 553.80272
10.05000 -4166.68811 27.71986 -8.77138 158.76537 114.85965 553.35468
10.15000 -4132.34212 24.81266 3.78662 155.39713 121.44874 542.69557
10.25000 -4101.97882 28.61102 -2.70640 154.67250 111.27924 541.53735
10.35000 -4065.62517 26.68173 11.51309 153.32057 115.04797 526.79677
10.45000 -4037.91604 24.44085 2.31906 151.81738 110.94067 516.86457
10.55000 -4011.56176 23.92970 5.84218 148.19020 111.01445 503.99875
10.65000 -3984.76740 23.17457 2.03361 150.54394 116.74735 494.20683
10.75000 -3960.20082 25.50811 9.32423 141.62032 105.81891 472.36937
10.85000 -3926.32646 22.14661 22.07877 148.33796 108.08276 479.16045
10.95000 -3896.37064 24.81150 -3.58987 140.16216 107.97085 463.92712
11.05000 -3865.78391 21.69068 -2.58436 140.54388 103.98943 464.35505
11.15000 -3836.77944 23.17400 7.05001 133.71927 99.96930 456.95137
11.25000 -3817.70911 19.38381 13.72143 129.88031 99.72576 427.14827
11.35000 -3794.89176 21.44367 -6.47280 134.79891 100.19000 425.70035
11.45000 -3768.19855 22.38333 -10.73050 131.16973 98.09994 430.64167
11.55000 -3739.29681 19.83952 12.01601 126.38630 95.03186 410.22679
11.65000 -3717.76621 19.39995 -15.56225 129.02170 105.10028 403.19184
11.75000 -3690.07358 21.36121 0.76844 129.46364 91.60551 400.91312
11.85000 -3660.58791 20.41552 2.34594 117.59361 91.67421 389.59847
11.95000 -3630.32127 16.40733 0.56281 118.37347 88.63085 389.40589
12.05000 -3606.24075 20.17406 -8.03020 114.17877 85.60199 368.73171
12.15000 -3571.49121 18.45961 -5.53377 117.51201 89.88670 369.16067
12.25000 -3548.88260 19.43315 -20.21942 112.74055 88.67576 353.00385
12.35000 -3525.42878 21.21679 -24.03505 111.82016 89.00581 353.51874
12.45000 -3496.96351 21.05750 -14.91732 105.10378 82.11370 341.73868
12.55000 -3467.62155 18.45209 -7.69115 104.97858 85.34719 334.01025
12.65000 -3440.84321 21.82610 -25.99460 110.91665 85.89216 330.80825
12.75000 -3420.05673 16.57509 -3.88900 101.78782 83.10710 326.08280
12.85000 -3393.63193 17.52903 -27.59036 104.19202 82.03001 315.06638
12.95000 -3373.40239 14.24102 -10.34199 102.91153 74.74003 304.47216
13.05000 -3341.91079 15.69457 -10.14582 97.00267 78.48672 306.95678
13.15000 -3317.47742 14.93636 -18.04627 99.53104 75.96014 299.44099
13.25000 -3292.69762 16.36088 -11.10815 96.79931 73.20186 282.32103
13.35000 -3265.60598 19.22702 -10.81035 96.12341 79.92643 283.89250
13.45000 -3245.02505 14.06385 -3.27338 102.15994 83.44222 274.44106
13.55000 -3221.61925 15.63545 -15.72429 106.27349 88.52428 271.68197
13.65000 -3203.06898 13.05444 -5.06662 97.13586 81.49291 261.07996
13.75000 -3179.21124 15.50567 -12.38177 86.22253 74.94429 260.23296
13.85000 -3158.76207 14.27084 -0.42484 89.33953 71.14381 251.79957
13.95000 -3133.36922 11.81107 -1.34575 84.86097 68.76077 248.62569
14.05000 -3102.49065 13.80583 9.30413 83.68864 67.99698 243.45078
14.15000 -3087.96136 13.84283 6.03804 93.62708 73.68646 239.12643
14.25000 -3062.47672 13.12665 7.29511 83.63532 69.54061 237.44173
14.35000 -3041.29633 15.67724 4.38772 84.68498 76.97762 235.04434
14.45000 -3020.71626 12.72992 18.88716 84.79649 71.00683 225.82723
14.55000 -2996.57737 15.38916 9.53078 78.84533 61.33394 224.76616
14.65000 -2976.57560 13.57719 1.80995 78.50646 75.64894 219.52714
14.75000 -2953.23557 12.01107 11.43014 82.09349 67.73492 219.82740
14.85000 -2938.02512 15.09536 12.99570 79.05387 63.57162 209.55923
14.95000 -2921.18412 14.36530 7.79469 82.35791 69.93570 207.96008
15.05000 -2897.27525 19.71607 14.83919 83.14543 61.62913 206.09653
15.15000 -2879.88055 17.44934 3.68473 70.57287 60.94686 210.64209
15.25000 -2859.06355 15.87623 8.29323 70.08772 72.31121 208.03708
15.35000 -2846.26430 13.51412 10.16495 74.07436 67.05729 201.39086
15.45000 -2825.19405 16.53126 3.77687 71.11213 60.50684 196.07140
15.55000 -2805.95627 13.87278 8.55613 71.83408 64.79938 201.35531
15.65000 -2795.79106 14.45392 4.28674 74.43040 71.50952 194.32704
15.75000 -2773.39426 13.26242 15.86841 71.21769 69.81505 201.55786
15.85000 -2758.93328 16.53645 22.42029 74.76753 72.57215 191.49959
15.95000 -2740.37621 14.11723 16.21409 74.63538 59.13705 183.88478
16.05000 -2718.75409 6.38807 15.72165 69.86524 67.33035 184.62823
16.15000 -2705.12915 14.71589 4.58122 80.16547 63.72418 182.35146
16.25000 -2689.74166 12.66857 16.28811 75.52854 64.75769 180.30991
16.35000 -2681.91462 13.98488 8.48862 69.25487 64.29808 169.01005
16.45000 -2661.31015 7.71772 13.56253 76.13888 57.37271 168.60786
16.55000 -2643.51084 12.29699 18.38022 72.10794 57.67707 174.84035
16.65000 -2629.53923 13.07301 8.88465 70.20715 61.48427 161.24420
16.75000 -2615.85313 9.49602 10.23975 67.23063 59.41741 165.27771
16.85000 -2604.63205 13.15537 16.32492 65.78220 56.53839 157.73590
16.95000 -2576.20753 10.06072 9.15074 79.76192 55.23918 156.04002
17.05000 -2565.60829 7.07102 9.12004 80.72904 68.60203 154.95088
17.15000 -2551.99280 6.00653 11.28682 63.36316 52.58127 149.96768
17.25000 -2532.27820 9.74201 16.89904 77.16422 62.67411 149.17254
17.35000 -2523.65944 8.29848 4.66793 75.40757 60.31079 147.68024
17.45000 -2509.02856 6.61158 7.59863 67.10750 57.74324 149.28757
17.55000 -2491.82597 6.14832 7.44186 61.46826 51.89129 140.97355
17.65000 -2471.78709 5.59831 22.00879 62.55096 53.85819 134.66392
17.75000 -2466.63686 6.07583 13.78178 66.67054 50.24974 133.44070
17.85000 -2447.24694 8.99824 8.36688 61.14123 50.06519 125.91208
17.95000 -2439.88314 10.01373 6.42913 68.05303 50.43981 132.37876
18.05000 -2416.48102 12.51924 1.02552 56.47566 45.00981 125.67622
18.15000 -2395.69314 12.50746 13.28131 70.98309 52.76879 146.40642
18.25000 -2382.94977 13.48108 13.05952 56.65697 47.89798 124.62264
18.35000 -2368.46994 7.16057 12.95959 61.66465 45.66597 124.73371
18.45000 -2356.37603 16.97523 19.74407 74.02825 66.31725 127.76353
18.55000 -2354.65193 9.17354 -0.93930 75.45329 54.06392 124.15519
18.65000 -2336.39803 16.74159 -0.29616 68.66394 47.04597 124.58269
18.75000 -2313.15955 17.69840 5.40829 61.87626 45.72892 115.01982
18.85000 -2300.90455 17.99823 0.59642 55.20391 54.26764 108.41069
18.95000 -2291.49451 16.03695 -3.47787 65.07904 47.94106 115.12972
19.05000 -2274.76167 14.53910 -4.64625 50.36432 51.20721 110.25466
19.15000 -2263.88777 16.49497 -0.27272 65.73853 61.55901 117.58218
19.25000 -2253.08452 10.96823 13.15652 61.08008 48.22026 111.58182
19.35000 -2238.66189 14.79846 7.75960 67.33423 86.02676 117.75180
19.45000 -2230.82117 6.18286 -1.73109 53.48659 66.82521 119.54044
19.55000 -2212.14355 15.62613 -12.42333 55.46952 58.40212 118.58965
19.65000 -2206.54611 10.08523 -3.38287 99.91236 48.53366 106.41874
19.75000 -2187.34963 13.41513 -6.10931 50.90552 60.20047 106.43932
19.85000 -2180.87334 4.41364 -3.85848 60.89109 52.86812 102.31217
19.95000 -2168.87696 12.65642 0.51914 48.72907 49.79788 102.53180
