0.12500 0.02545
0.37500 0.02188
0.62500 0.01303
0.87500 0.04748
1.12500 0.07309
1.37500 0.10411
1.62500 0.12872
1.87500 0.16538
2.12500 0.18021
2.37500 0.19892
2.62500 0.21107
2.87500 0.22881
3.12500 0.23641
3.37500 0.23897
3.62500 0.23272
3.87500 0.24086
4.12500 0.22519
4.37500 0.22294
4.62500 0.20253
4.87500 0.19881
5.12500 0.17414
5.37500 0.15983
5.62500 0.15135
5.87500 0.13451
6.12500 0.12555
6.37500 0.10367
6.62500 0.09281
6.87500 0.08296
7.12500 0.06214
7.37500 0.05939
7.62500 0.04751
7.87500 0.06013
8.12500 0.05430
8.37500 0.04700
8.62500 0.03966
8.87500 0.04944
9.12500 0.04256
9.37500 0.07043
9.62500 0.06097
9.87500 0.05511
10.12500 0.06891
10.37500 0.05067
10.62500 0.04432
10.87500 0.05234
11.12500 0.04410
11.37500 0.03088
11.62500 0.03708
11.87500 0.03453
12.12500 0.02594
12.37500 0.02810
12.62500 0.04434
12.87500 0.02063
13.12500 0.05245
13.37500 0.03459
13.62500 0.02977
13.87500 0.05428
14.12500 0.03790
14.37500 0.02079
14.62500 0.02223
14.87500 0.03162
