0.1875 0.43803 17.81726 1.39161 79.25648 80.56862 71.73885
0.5625 -1.07562 44.57727 0.12925 76.97563 75.98639 67.00582
0.9375 -1.3013 68.47868 2.03671 72.02235 70.65238 63.25027
1.3125 -0.45296 85.71199 2.07266 68.47294 65.54399 60.08354
1.6875 -0.22257 101.19099 1.80229 64.96513 61.37035 56.00633
2.0625 0.04543 115.87226 2.09185 60.71616 56.2124 52.87123
2.4375 1.49928 127.50975 0.34767 56.16335 52.97317 49.48901
2.8125 2.50218 137.58401 0.83114 52.42742 47.88246 46.57501
3.1875 1.17153 145.51966 0.23773 49.51301 45.00354 43.72521
3.5625 -0.13963 153.19631 0.067 46.90578 42.3736 41.40371
3.9375 -2.19006 160.34343 -0.18138 44.43252 38.93327 39.02053
4.3125 -2.42764 166.63921 -0.07614 41.90625 36.17135 36.67867
4.6875 -0.60988 171.65719 -0.57436 40.51134 33.6098 34.90107
5.0625 -0.30635 175.60052 -1.41211 38.82052 32.74146 33.60228
5.4375 1.89962 180.1079 -0.93604 37.05468 31.12967 31.54951
5.8125 2.15002 183.33369 -1.50583 35.67114 30.4471 30.10843
6.1875 1.18094 186.15043 -1.23734 34.06673 29.21198 28.26547
6.5625 2.1415 189.55777 -2.04647 32.84894 28.62537 27.17795
6.9375 0.80255 192.71135 -1.09345 31.31724 27.21437 25.91001
7.3125 0.41589 195.80228 -1.0282 30.12419 25.46983 24.49051
7.6875 0.63676 197.2858 -0.90823 29.3067 23.92162 23.4708
8.0625 0.69106 198.4 -0.01887 27.8235 22.81516 22.38637
8.4375 0.22452 200.09572 -0.17256 26.39254 21.11051 21.49436
8.8125 -1.21678 201.12008 -0.09214 26.41699 20.066 20.69107
9.1875 -1.45234 201.78675 -0.37391 25.60544 18.84846 19.43895
9.5625 0.13654 203.61132 -1.67708 24.29108 18.83099 18.53764
9.9375 0.91423 204.04252 -0.88709 23.32045 18.12087 17.64537
10.3125 1.85497 204.68154 -1.1795 23.09083 17.34844 16.88397
10.6875 1.42981 204.7816 -0.5667 21.69937 16.45058 16.37748
11.0625 1.94961 204.79291 0.48645 20.84108 15.49773 15.77816
11.4375 1.02914 203.93147 1.13093 20.15776 15.44222 15.42089
11.8125 -0.42835 204.38153 0.58421 20.33463 15.47048 14.85729
12.1875 0.25269 206.00403 0.07702 18.70765 14.38549 14.28917
12.5625 0.02485 206.72673 0.42035 18.04821 12.82224 13.82495
12.9375 0.71095 206.3214 0.17744 18.10142 12.5883 13.3252
13.3125 1.89856 206.34344 1.05126 16.78542 12.50816 12.75073
13.6875 1.43972 207.54781 -0.06714 15.91046 12.43482 12.30837
14.0625 1.49807 206.75552 0.56579 15.18814 12.95305 11.79772
14.4375 1.09902 206.64411 0.84713 14.83552 11.06042 11.31493
14.8125 1.34659 206.66198 0.56609 14.30626 11.1854 10.66329
15.1875 0.09558 207.18618 0.2039 13.77473 10.20224 10.48663
15.5625 -0.077 207.70707 0.35547 13.96772 10.14273 9.56293
15.9375 -1.13943 208.00553 -0.53534 13.45289 10.40048 9.06191
16.3125 0.92881 207.74279 -0.35618 12.7251 9.31914 9.18409
16.6875 1.39114 207.80887 -0.69649 12.0647 10.49337 8.82147
17.0625 1.51572 207.74488 -0.25563 12.4364 9.44664 8.17708
17.4375 0.54067 207.94619 -0.57328 11.45002 8.52564 8.39173
17.8125 0.50219 206.63927 0.19989 11.97088 9.264 7.95983
18.1875 -1.82171 206.71819 1.06034 11.6624 7.92855 7.8751
18.5625 -0.8007 206.7479 0.17972 10.92661 8.06279 7.28782
18.9375 -1.91964 206.73072 0.88761 9.62363 6.90745 7.35315
19.3125 -2.19104 207.08581 2.20104 10.49505 5.79518 6.93397
19.6875 -1.29851 207.02274 1.6495 10.32516 5.42842 6.77864
20.0625 -0.33247 206.1241 2.5793 10.49329 6.44341 7.1439
20.4375 -0.43102 206.59785 1.54603 8.56604 6.70259 6.89594
20.8125 0.7366 206.88426 1.69586 9.59525 6.63926 7.07498
21.1875 3.79574 206.90966 1.09364 8.29035 6.54274 7.14911
21.5625 2.34482 206.40964 0.37982 8.55277 6.74986 5.64783
21.9375 2.45805 205.21223 0.04963 8.80718 7.17749 7.13622
22.3125 0.29669 206.48728 -0.46239 8.81872 7.07908 6.8229
22.6875 0.3507 206.03135 -0.56238 6.69405 5.56593 5.74367
23.0625 -0.80563 205.98945 -1.02394 9.42673 5.23102 5.77529
23.4375 -0.77508 206.28966 -1.89322 7.89638 4.88903 5.01227
23.8125 -2.73202 205.39067 -0.57465 9.15971 3.65892 5.51737
24.1875 0.19139 205.69456 -2.10046 8.16153 4.96818 3.92646
24.5625 -0.29598 205.56608 -1.44872 7.72062 3.50398 4.93549
24.9375 -3.57967 203.80048 -0.24946 8.17486 3.36508 5.84366
25.3125 -1.82513 203.45024 -1.60591 6.16286 3.27846 4.23809
25.6875 1.95805 204.90503 -2.63879 5.29871 4.21413 4.55619
26.0625 0.27817 202.65017 0.64435 5.53967 5.17939 4.62863
26.4375 0.15043 202.32333 -0.66849 6.90161 5.06015 5.67839
26.8125 3.12034 204.27798 -0.97575 7.27099 5.4667 5.02446
27.1875 3.90788 202.17534 0.10025 5.73239 5.25964 5.52933
27.5625 4.07899 203.71985 -0.3551 6.14015 5.95785 4.47533
27.9375 1.86558 202.65395 -2.08933 7.14325 5.16312 3.68581
28.3125 2.10272 204.25052 -1.50743 4.11849 4.20018 5.57888
28.6875 -1.583 205.11353 1.01716 7.24291 4.22114 3.40458
29.0625 -1.04945 206.05718 0.36088 4.55402 4.47404 3.72781
29.4375 2.30775 203.10635 -1.31372 7.70555 2.92611 4.01262
29.8125 -5.02587 203.81228 -5.03986 5.83991 5.29967 4.87141
