0.05000 -12942.27209 -943.40005 -9574.75753 25855.60944 24684.30681 21913.34605
0.15000 -22764.58713 -2152.92339 -4015.86410 16984.55297 21517.52268 28793.47603
0.25000 -26909.04250 19.78761 -1627.90534 12181.45317 13774.24798 26962.03466
0.35000 -23507.89911 316.75007 1105.47687 10171.34962 8380.58186 23496.97028
0.45000 -21908.12203 -180.47599 -283.81723 7676.08196 6474.12063 19570.65111
0.55000 -19220.87691 -17.31104 403.36783 6693.03134 4822.73043 17751.69475
0.65000 -17728.61898 29.44965 503.62278 5827.32808 4254.02717 15649.64062
0.75000 -16485.11125 164.31874 -186.78164 5303.02328 3440.56749 14072.21460
0.85000 -15639.47104 24.53904 430.92604 4681.16711 2962.06270 12973.67638
0.95000 -14616.33302 -58.43543 304.04644 4282.40560 3024.96437 12025.21184
1.05000 -13769.08972 30.72351 322.45506 3868.04459 2953.72763 11081.22954
1.15000 -13114.67964 -1.35780 20.04182 3627.64431 2304.44421 10250.76162
1.25000 -12447.94816 72.87826 3.92837 3195.18435 2431.92794 9738.38172
1.35000 -11956.05433 -125.79756 527.21719 2904.42488 2419.69070 9254.77572
1.45000 -11555.19580 -13.48247 239.04091 2734.15621 2270.21728 8778.36877
1.55000 -11126.61157 11.86321 508.16514 2930.95990 1898.24419 8250.74957
1.65000 -10838.27665 -53.61515 346.79411 2362.51388 2172.53223 7873.01760
1.75000 -10449.74559 -10.03314 73.64785 2169.71365 1612.58432 7491.03574
1.85000 -10171.85364 -59.91016 153.33420 1968.58299 1764.74007 7212.14383
1.95000 -9894.80962 18.72977 209.30166 1831.92301 1540.23234 6737.99912
2.05000 -9623.95575 16.88371 283.79807 1776.96204 1363.01293 6557.40914
2.15000 -9448.11711 4.51858 -214.09644 1670.13437 1371.97380 6253.98753
2.25000 -9231.54200 -15.68866 -17.02406 1625.03593 1291.24567 6028.01313
2.35000 -8974.81131 -43.77526 39.67762 1623.70984 1298.92220 5945.54665
2.45000 -8832.00641 8.23084 -205.11728 1526.47133 1211.72338 5648.16236
2.55000 -8667.79764 4.83402 -88.94836 1361.61004 1093.95530 5352.14295
2.65000 -8478.03340 12.83869 157.52604 1281.40542 1298.37243 5186.64565
2.75000 -8375.98706 4.00674 -29.26199 1103.94339 1076.15293 4915.99417
2.85000 -8207.60662 21.28125 28.51881 1230.03501 1116.78996 4803.47027
2.95000 -8122.02588 13.36811 56.11071 1114.76700 1004.98819 4584.43350
3.05000 -8019.40442 3.62493 -35.98339 1263.00899 976.29835 4444.12381
3.15000 -7886.26244 -8.68084 -0.07732 1215.53830 1016.48646 4348.75035
3.25000 -7827.97114 41.13314 -115.92357 1044.68081 908.57228 4172.35797
3.35000 -7739.61432 20.05763 -114.64237 987.10770 1095.83278 3980.13472
3.45000 -7667.61164 0.35134 20.39897 893.17019 969.54758 4003.15248
3.55000 -7646.66624 20.14808 -32.86926 872.37474 1025.62060 3733.06008
3.65000 -7559.43256 28.77909 122.30588 791.11574 767.14356 3634.69311
3.75000 -7497.26596 63.01221 -22.92173 807.42937 770.51854 3598.10734
3.85000 -7434.65231 41.36072 38.00295 1025.99029 858.70691 3480.56937
3.95000 -7383.11104 55.63965 -16.43675 775.47367 771.63951 3403.13846
4.05000 -7382.06262 31.89646 14.85413 761.66110 693.64455 3274.26789
4.15000 -7323.98595 46.25747 -55.23108 790.29017 804.52968 3242.11582
4.25000 -7319.02518 64.13106 49.40540 682.34719 629.26010 3129.14431
4.35000 -7266.10012 40.86162 6.73758 736.88499 752.39067 3117.86359
4.45000 -7311.80992 45.35798 -93.07999 844.95616 683.92033 3032.41286
4.55000 -7293.06207 52.82282 -60.80815 772.17084 727.75502 2918.08032
4.65000 -7274.00765 50.89930 -125.33351 708.17077 607.61827 2858.51483
4.75000 -7246.92461 24.06211 -37.92897 762.12360 710.63787 2810.25360
4.85000 -7194.84947 38.21891 11.08319 788.03699 608.12532 2773.67215
4.95000 -7162.01077 22.33564 23.56907 737.24894 500.50317 2708.61957
5.05000 -7127.87256 49.27948 -65.42749 644.32416 479.66632 2567.20389
5.15000 -7083.29786 31.87501 -39.13467 645.27299 571.83241 2489.01078
5.25000 -7050.41796 22.67033 -38.28756 777.34308 713.16763 2511.11796
5.35000 -7018.84023 14.04130 4.61890 627.27689 462.21327 2392.58959
5.45000 -6963.06876 -18.72292 12.24509 920.93906 983.30050 2360.99519
5.55000 -6905.12028 38.37348 -19.28908 692.90613 465.48717 2301.08844
5.65000 -6881.61849 40.55244 117.26681 518.92079 492.30729 2228.86308
5.75000 -6869.59446 34.48588 16.94757 542.30880 428.46200 2094.08728
5.85000 -6796.71666 45.50709 1.94315 618.27936 631.05917 2080.09433
5.95000 -6755.59206 23.88716 -51.72229 534.42133 621.69727 2027.61458
6.05000 -6677.80427 38.83601 -24.45012 545.95019 500.89100 2040.23633
6.15000 -6639.30558 -4.00305 -27.59123 600.58893 804.69932 1983.11887
6.25000 -6601.12491 19.26874 -36.80913 542.46348 539.67232 1868.17250
6.35000 -6541.03234 22.83342 -40.16539 497.20552 375.64105 1867.65001
6.45000 -6464.22118 27.62295 -33.01347 571.93369 342.69774 1777.48655
6.55000 -6415.73065 32.49395 -9.36407 551.54557 397.46036 1759.32757
6.65000 -6345.73683 15.00414 -52.44136 418.24059 327.96764 1700.19331
6.75000 -6297.99848 34.01868 -57.28143 502.60022 367.16984 1627.00649
6.85000 -6227.95757 33.89511 -70.28592 468.21033 383.29532 1622.08493
6.95000 -6159.98041 40.70846 -27.36899 427.98522 341.25208 1617.63137
7.05000 -6128.37437 24.34282 -23.35003 340.04170 361.10348 1506.61912
7.15000 -6064.94486 29.89253 -45.73004 593.00475 444.09945 1530.49603
7.25000 -6004.24307 7.18953 -1.54624 427.70465 477.17526 1458.45935
7.35000 -5938.13992 15.39130 20.75755 359.56773 315.97683 1451.09434
7.45000 -5870.54462 26.42861 1.22440 321.45246 247.23833 1398.11372
7.55000 -5793.73269 23.05696 -63.62929 381.84205 337.09390 1369.03879
7.65000 -5754.08460 25.11219 -70.05123 444.70831 368.55243 1343.53546
7.75000 -5703.40807 19.29232 14.37050 327.58729 270.75395 1307.79647
7.85000 -5651.42763 19.98688 -54.73398 408.26185 435.67519 1271.55565
7.95000 -5607.35314 24.29781 -57.92799 321.81701 262.81614 1234.73230
8.05000 -5545.55908 23.97689 -56.25765 282.17373 268.89109 1262.37029
8.15000 -5504.16444 32.18032 31.73709 279.52496 327.77981 1207.01161
8.25000 -5443.52466 13.61945 -55.67709 407.61463 370.86673 1207.38318
8.35000 -5401.52382 12.27574 -19.64613 328.33008 233.83060 1124.74060
8.45000 -5331.92703 16.78136 -49.93512 477.12139 247.49531 1132.92038
8.55000 -5304.82708 18.42828 39.37218 413.84256 396.75267 1153.00938
8.65000 -5262.35232 21.41621 -9.68268 306.09742 254.38290 1067.68739
8.75000 -5218.74230 15.25620 14.93266 394.64070 254.60735 1155.62752
8.85000 -5148.53208 24.89943 -33.83074 332.17176 234.65788 1037.55050
8.95000 -5113.96606 17.04180 -53.17110 318.68598 338.79169 1015.24338
9.05000 -5088.61803 19.81276 -43.84050 394.21272 246.96149 1004.33788
9.15000 -5041.73370 12.06146 -40.39727 261.85034 227.24465 971.10658
9.25000 -4994.47820 25.04132 -19.33482 248.73189 261.94146 949.10569
9.35000 -4950.75474 20.85944 -58.88874 421.86911 196.18821 904.73175
9.45000 -4914.76092 23.61030 6.50613 255.42271 224.38561 894.75736
9.55000 -4895.42488 23.08368 11.51759 524.49943 258.29896 917.74917
9.65000 -4836.53752 9.08811 -19.80150 341.53392 217.33913 906.15686
9.75000 -4801.73849 19.07035 -61.58281 241.26034 202.73442 832.36883
9.85000 -4751.29159 20.88724 -50.02683 289.98944 261.91662 879.30946
9.95000 -4707.86732 7.56773 -26.69650 254.08174 183.31301 833.72823
10.05000 -4670.68249 10.94299 -66.49628 260.39893 197.63109 805.73765
10.15000 -4613.13862 14.28845 -49.84166 542.10332 306.31467 803.30022
10.25000 -4579.48393 15.85327 -59.81957 225.07004 161.03665 765.68015
10.35000 -4539.96642 17.32461 -10.22791 355.49525 226.12944 735.63619
10.45000 -4509.53244 15.91437 -37.13871 289.00062 334.45319 754.12437
10.55000 -4471.26198 23.08018 -56.74376 215.39875 157.82549 744.19110
10.65000 -4436.41353 13.33269 -19.71157 226.56537 151.50591 707.30347
10.75000 -4384.70305 17.67439 -62.99122 227.08382 247.31757 704.09708
10.85000 -4353.38228 16.36710 -73.90475 339.96573 349.60654 742.71887
10.95000 -4292.67065 44.17549 -54.83305 607.55496 785.75221 720.54703
11.05000 -4274.97478 16.37566 -19.31035 273.66411 178.54616 654.33260
11.15000 -4250.20306 10.54446 -48.93625 251.33356 343.55026 661.33324
11.25000 -4215.16692 14.00898 -50.23769 155.30099 162.67191 620.56108
11.35000 -4182.99651 6.42086 -24.38071 175.17465 275.89719 635.15048
11.45000 -4136.63484 4.98231 -36.79815 234.81803 175.04864 628.57819
11.55000 -4118.05971 10.50360 -47.52994 179.06178 156.14763 647.57999
11.65000 -4068.21129 23.55665 -11.48523 272.73639 226.92804 817.40072
11.75000 -4048.41730 7.02242 15.57469 164.66942 110.89929 558.17691
11.85000 -4021.30933 11.26942 -33.94429 189.22850 200.12197 565.99603
11.95000 -3981.60349 13.76689 0.79212 162.49433 154.09964 537.96579
12.05000 -3950.61749 15.50445 -47.21292 187.96586 180.04090 580.63500
12.15000 -3935.64203 17.24348 -24.37319 155.22819 155.00849 547.55510
12.25000 -3902.98238 6.03008 -21.15989 149.86630 135.64551 530.16716
12.35000 -3855.11754 -2.54938 -19.41643 206.00505 347.19049 507.80978
12.45000 -3839.62411 6.82117 -28.50588 191.19127 117.83230 496.11913
12.55000 -3808.53695 11.74104 -1.06384 123.60868 101.71352 482.19470
12.65000 -3774.07378 11.64383 -9.84370 124.94299 107.09519 488.17046
12.75000 -3744.91951 7.50704 -15.17513 415.75803 225.54765 558.69207
12.85000 -3717.82481 6.01373 -14.86613 297.49561 273.92572 676.70228
12.95000 -3683.81264 23.32351 -6.77905 224.29268 168.68495 502.40434
13.05000 -3666.12923 6.91794 -6.92661 160.22073 114.65415 445.13924
13.15000 -3637.29012 4.74031 -15.40780 129.61116 125.76571 448.08701
13.25000 -3610.09576 14.83959 6.35431 128.19719 114.87348 442.79343
13.35000 -3577.54950 16.32135 -8.09161 133.65454 124.11170 451.48868
13.45000 -3556.22747 7.48454 -17.39033 159.75259 201.57328 480.24999
13.55000 -3537.76332 10.41855 7.81108 113.10312 109.94862 466.47265
13.65000 -3504.58119 6.44251 -0.61813 180.34880 193.35695 450.91436
13.75000 -3505.48113 11.72823 2.09502 129.82097 158.46715 389.30918
13.85000 -3470.71164 11.14071 -16.70051 166.76795 137.43528 414.11900
13.95000 -3442.26114 16.66810 10.18682 130.40189 142.26206 406.76439
14.05000 -3423.29025 20.53432 -5.92559 114.38890 257.38201 431.48674
14.15000 -3382.76517 5.40618 -6.96131 150.08340 227.86060 398.69685
14.25000 -3373.52939 8.06782 -45.56150 132.35080 279.50375 398.65369
14.35000 -3360.03978 7.46395 13.43271 148.71714 179.15812 393.08763
14.45000 -3329.77222 7.37266 -14.45137 99.15942 107.37184 352.43808
14.55000 -3312.23451 8.24279 -0.19043 110.73961 151.52409 368.19432
14.65000 -3281.31178 16.25091 -18.78984 129.87808 104.63537 361.52654
14.75000 -3248.22034 6.50225 -5.14914 249.72840 128.78152 443.19486
14.85000 -3244.95283 10.70659 -13.52753 132.12925 105.41899 346.65868
14.95000 -3217.50240 5.88859 -40.28472 151.06536 76.49761 326.76050
15.05000 -3192.30348 9.71667 -51.74853 177.85864 96.17459 391.62910
15.15000 -3169.12815 9.50805 -16.70616 105.07559 91.31395 321.68296
15.25000 -3151.33779 10.77625 -11.25307 113.42173 89.43046 326.69661
15.35000 -3129.69456 15.00853 -57.31115 95.73385 472.84195 411.78898
15.45000 -3113.12110 12.84212 -51.32809 121.67209 82.75767 335.37695
15.55000 -3077.05960 22.65740 -27.32952 177.52694 268.00024 318.89992
15.65000 -3071.23572 16.15394 -14.30876 107.12016 96.06303 284.60343
15.75000 -3045.87948 8.06164 -40.19924 82.26990 60.31427 286.83411
15.85000 -3022.76257 16.73207 -44.62346 117.19042 132.94453 287.96354
15.95000 -2998.76144 2.26675 -29.90724 108.55536 122.23041 290.46093
16.05000 -2983.49890 5.85378 10.19801 83.13071 58.85979 289.11417
16.15000 -2972.37566 6.55482 -30.86483 155.42276 136.25329 279.93825
16.25000 -2952.78220 3.16748 -18.29118 142.47459 112.71232 285.95570
16.35000 -2920.00209 4.39302 -34.23958 111.11556 120.93781 263.39374
16.45000 -2910.29246 10.96355 -14.35697 75.21752 238.74285 259.63010
16.55000 -2892.92092 8.79172 -39.94787 105.62293 95.18201 250.97466
16.65000 -2869.27811 7.05400 -7.92339 73.75138 89.50453 239.95304
16.75000 -2852.86340 5.25047 -45.09287 110.68465 65.07544 236.28649
16.85000 -2849.20348 -7.07420 -32.95175 167.61475 211.56755 300.69272
16.95000 -2815.93575 8.07299 -21.50166 96.55055 60.13666 255.44620
17.05000 -2803.68384 -0.77448 -13.66489 162.19685 229.35062 228.17621
17.15000 -2773.61885 11.45470 -17.42842 75.07360 59.85995 234.83600
17.25000 -2762.26531 1.00306 -14.06061 101.63180 83.15486 230.86041
17.35000 -2743.91098 5.35468 -1.82416 95.56860 67.43190 235.33643
17.45000 -2718.20173 4.32754 0.02975 85.76073 64.79522 217.35575
17.55000 -2708.07105 10.78870 -28.96081 88.16877 64.54611 241.36905
17.65000 -2703.71655 6.98876 -12.29430 70.68629 58.41368 209.86049
17.75000 -2674.53167 6.72865 -10.13093 71.15993 53.62707 220.35416
17.85000 -2663.12982 7.47131 -33.18643 77.12760 79.49068 203.45086
17.95000 -2644.46173 2.07415 -7.47825 63.55381 100.62311 203.83651
18.05000 -2624.99604 7.69030 -25.44147 79.70153 66.30503 214.48510
18.15000 -2604.31382 5.09974 -19.39508 124.78704 109.94844 232.58479
18.25000 -2593.86412 3.30498 -20.31424 82.87192 87.47106 191.68260
18.35000 -2567.77403 -1.21747 -25.24253 89.23688 83.82286 185.76434
18.45000 -2559.97774 5.39121 -6.96981 96.92149 76.53270 203.25872
18.55000 -2539.17036 6.63942 -42.39086 56.48519 40.79632 176.21635
18.65000 -2521.63664 1.23813 -45.31308 55.48049 60.00761 173.62808
18.75000 -2504.81667 -12.82271 -21.54887 122.12323 128.36398 179.63272
18.85000 -2494.38348 11.08752 -34.78772 61.19370 105.38536 183.56039
18.95000 -2478.73971 10.02280 -50.42360 57.43776 192.75997 278.04765
19.05000 -2468.03611 -3.32804 -38.80984 98.14733 73.01747 181.69683
19.15000 -2441.02201 -11.58605 -31.36982 159.68100 123.49659 208.27988
19.25000 -2442.45804 2.70854 -46.27097 80.28478 58.33729 167.25093
19.35000 -2427.72651 4.11940 -38.65204 46.50357 48.44387 153.48938
19.45000 -2408.67868 2.10808 -39.42885 47.52863 45.95509 218.90230
19.55000 -2387.63340 4.75275 -24.88153 102.13682 40.93483 324.83761
19.65000 -2375.65443 -10.28841 -38.76662 51.08369 95.50186 163.82835
19.75000 -2363.03393 -0.70162 -21.52245 90.09926 70.64504 168.18094
19.85000 -2361.13044 3.43613 -47.88114 65.01552 64.21400 143.80093
19.95000 -2339.96565 3.34314 -21.14976 44.50703 83.84542 155.01521
