0.05000 -4186.27949 275.62506 29565.83875 3372.25890 3985.62984 842273.29378
0.15000 -6987.21089 105.00939 35001.58550 3481.45854 3648.89009 663451.43533
0.25000 -9858.90984 59.12729 -17092.52569 3187.93545 3567.65537 559237.74425
0.35000 -12397.49351 146.88685 -4024.99498 3031.62478 3573.22066 614025.54172
0.45000 -14015.99957 172.40220 -2433.77490 2918.27359 3559.83081 562635.66570
0.55000 -15029.24167 103.36233 -3532.05587 2837.80001 3561.81898 490735.36903
0.65000 -15632.75304 138.11907 1730.71560 2800.07546 3597.88566 491562.97237
0.75000 -15978.88445 61.43295 -207.23321 2634.03970 3562.72627 442674.41298
0.85000 -15849.10699 178.69973 8154.80840 2376.02430 3548.01111 398971.40288
0.95000 -15717.07923 156.28483 7879.01127 2110.89632 3492.93205 365751.90415
1.05000 -15466.32926 197.33059 4395.26524 1934.84582 3448.01879 341954.66772
1.15000 -15194.59691 179.48009 -668.36286 1706.26050 3388.40279 333676.84448
1.25000 -14789.67445 210.80427 2261.35559 1510.40136 3276.66773 303603.65786
1.35000 -14462.11679 185.67327 835.26087 1289.89227 3175.31625 282864.73744
1.45000 -14089.13216 146.65797 -3211.34901 1115.04235 3063.97859 276474.20016
1.55000 -13730.59490 157.11078 -5890.28768 960.18452 2957.33383 233152.15375
1.65000 -13375.47284 228.89200 -3583.63406 831.31177 2848.85049 228506.68747
1.75000 -13091.91710 147.17553 -4785.56957 672.77652 2809.48611 204855.41950
1.85000 -12812.19458 191.09812 -9051.65776 577.07968 2665.28291 198890.58165
1.95000 -12506.16064 154.29370 -10329.73046 499.15831 2535.56620 199916.08977
2.05000 -12174.57430 166.38285 -8656.52899 479.98287 2439.66135 181907.51520
2.15000 -11847.44651 131.91598 -11331.89889 455.68922 2311.71322 175512.24271
2.25000 -11546.70491 120.42497 -12900.98574 451.25813 2212.06056 172757.08629
2.35000 -11290.55181 136.67678 -11671.02156 461.11873 2125.88345 161267.30547
2.45000 -11028.58163 105.59201 -11523.27790 475.73248 2038.48923 157921.69060
2.55000 -10785.12731 144.15597 -13874.39621 482.42112 1964.71980 128735.70270
2.65000 -10563.78980 147.61201 -12978.91805 504.20001 1897.09149 132899.27090
2.75000 -10352.89158 72.35080 -15556.88278 533.03644 1823.77990 124473.83405
2.85000 -10153.20682 89.90604 -16044.74526 552.51579 1754.69853 128711.12165
2.95000 -9951.63518 -20.26728 -12113.02137 581.45039 1675.97416 147922.43132
3.05000 -9732.35577 -35.22200 -11430.61148 585.28151 1593.64104 112803.18178
3.15000 -9515.17128 -98.25703 -10994.69956 596.26252 1496.01228 113992.80324
3.25000 -9297.95324 -101.88290 -10766.03111 594.24168 1452.70918 107743.66136
3.35000 -9090.86504 -90.76468 -9365.50261 624.21816 1379.64235 104314.52352
3.45000 -8896.97066 -40.50076 -10521.90373 638.73548 1292.14090 99063.27435
3.55000 -8719.35846 11.21738 -9777.38397 652.01336 1241.84140 97956.74037
3.65000 -8529.04027 59.97173 -8117.86638 662.66836 1190.85071 93246.59621
3.75000 -8369.31476 70.12324 -8476.14348 679.87792 1124.78797 91013.59894
3.85000 -8215.18215 126.93520 -7803.07938 692.71688 1061.40160 93639.92292
3.95000 -8065.82292 106.43619 -8852.06167 689.83888 1016.89206 79979.93824
4.05000 -7910.85390 127.68224 -5959.81947 674.71130 975.56516 81767.04823
4.15000 -7772.62364 111.90878 -5102.87232 679.40321 936.55047 77006.44601
4.25000 -7634.29927 127.37027 -3997.91827 684.80725 882.95669 76921.94978
4.35000 -7499.58453 148.72978 -2492.51451 692.39926 831.68001 68631.28596
4.45000 -7396.77437 151.19183 -1601.14808 693.64013 781.77001 70287.95881
4.55000 -7312.53303 141.06195 -1009.54612 692.89816 735.74034 64622.98865
4.65000 -7210.19706 139.61766 -431.86626 704.45549 689.12170 56960.10515
4.75000 -7108.65105 122.01470 -315.69116 701.98033 637.23647 52838.72691
4.85000 -7026.19859 135.58585 -1489.13318 691.38390 596.46393 54285.24175
4.95000 -6941.42083 115.88113 -489.83250 671.61485 562.94786 52236.41507
5.05000 -6825.52412 115.33937 -833.17956 643.29831 520.74014 52490.58581
5.15000 -6750.45746 117.73292 -334.43607 603.65884 488.06204 46225.08411
5.25000 -6658.03962 92.11662 -589.67617 577.64139 467.75537 44562.22208
5.35000 -6593.60752 100.47190 -694.12982 549.86451 438.20886 38714.48567
5.45000 -6523.16085 94.10538 -691.17870 527.93829 412.39677 58478.72459
5.55000 -6453.30628 87.13213 467.75946 508.46679 386.11843 41774.18121
5.65000 -6378.77641 86.91297 -724.91881 486.43744 366.74951 35649.58847
5.75000 -6335.76476 83.48100 276.00638 463.32521 345.63502 34781.61637
5.85000 -6276.44254 84.72102 384.47945 446.75950 327.84806 32187.95573
5.95000 -6246.98645 91.73079 866.06071 430.14900 301.85528 47865.77465
6.05000 -6197.04581 85.40699 264.37144 417.77618 284.42745 30042.07861
6.15000 -6160.83097 77.91000 -600.83979 417.06025 268.88969 28209.62032
6.25000 -6113.29647 66.37804 -342.91481 407.23547 252.86523 24857.28120
6.35000 -6062.56331 64.44718 -39.61052 384.42485 234.34060 27075.38714
6.45000 -6008.51006 62.52045 -705.23404 359.37006 220.25313 24160.00455
6.55000 -5956.13912 52.09008 -261.27872 339.66809 206.39015 23003.42341
6.65000 -5910.72952 46.72415 502.09397 312.69788 196.21044 23261.53106
6.75000 -5856.03456 46.01031 -499.34830 291.46820 186.15073 30995.45758
6.85000 -5801.80770 44.38542 336.82411 264.81779 176.93955 21090.88419
6.95000 -5744.31401 35.44582 533.06998 240.14758 166.64457 21725.77532
7.05000 -5684.82150 33.11026 134.27991 216.24657 162.64993 34011.11196
7.15000 -5639.46648 30.87913 -556.77242 201.14746 155.19010 26405.30478
7.25000 -5574.70500 30.23712 282.14058 194.54362 147.76613 20619.27703
7.35000 -5514.07271 32.26189 649.77256 179.15085 145.87614 18323.14151
7.45000 -5452.48592 30.07819 134.52218 170.89033 142.40768 17294.90073
7.55000 -5390.42499 31.37591 -30.51517 161.82097 139.19840 18582.98528
7.65000 -5333.25508 31.52153 344.77526 160.74242 135.32123 30027.20946
7.75000 -5271.85029 34.50955 -62.62362 152.53699 132.40748 16050.28395
7.85000 -5212.76192 34.98302 326.18179 152.40059 128.77300 15610.17855
7.95000 -5154.17177 38.32510 -552.73574 150.42108 127.73262 16386.06523
8.05000 -5099.75791 37.99914 -234.55465 153.82712 124.36652 14966.91402
8.15000 -5045.74981 36.42498 -200.55170 156.86030 123.49219 11700.48215
8.25000 -4993.00470 36.63834 -219.17497 150.28240 123.69129 11123.16660
8.35000 -4951.30979 37.35437 -93.47918 146.41925 121.09935 11658.75149
8.45000 -4902.28062 32.52636 -398.17881 142.49322 116.12951 26695.30790
8.55000 -4851.00735 42.39505 -184.72125 139.75441 114.45999 10787.77290
8.65000 -4806.36795 41.74586 43.39104 137.03378 111.57210 10462.17633
8.75000 -4771.60254 41.81858 92.00347 140.80873 108.88519 10058.71076
8.85000 -4732.74675 44.22119 -179.45450 135.43043 107.30030 9549.14716
8.95000 -4689.18441 46.78733 -307.96695 140.19099 105.95594 10497.44754
9.05000 -4652.72095 49.45417 -92.04840 137.86288 103.91164 9239.92883
9.15000 -4612.21552 54.49042 -50.23206 136.40771 100.59135 10453.89713
9.25000 -4573.11634 55.71125 -251.52313 135.57507 96.60386 8138.30586
9.35000 -4535.72407 55.65618 -428.38687 129.98432 93.43618 11846.80572
9.45000 -4501.52636 59.20849 -582.51577 127.98302 92.88515 38277.79697
9.55000 -4462.54533 62.82023 51.06594 126.27655 88.51608 11217.00497
9.65000 -4427.41044 61.69502 -12.18772 121.59883 84.02433 8572.05072
9.75000 -4389.08480 61.15139 179.48394 124.59112 82.75377 7449.32960
9.85000 -4347.88505 62.10126 79.79382 126.18926 82.26723 6720.13334
9.95000 -4316.98830 60.21402 -278.45970 127.20981 80.12500 7182.19541
10.05000 -4280.03784 59.70508 -49.49247 124.76322 78.90911 6755.30730
10.15000 -4239.13704 59.52493 112.32105 125.54976 75.98055 6514.17625
10.25000 -4206.09777 59.07768 -11.75821 123.07052 73.87623 6838.09671
10.35000 -4169.17078 57.43569 -70.24407 116.32296 73.27269 7112.23575
10.45000 -4132.13089 58.75737 -391.94759 116.12521 71.71009 7071.01585
10.55000 -4098.48010 53.41988 -14.90957 116.93553 68.86713 6364.03144
10.65000 -4064.24813 57.05970 156.31337 113.47439 69.82641 6456.61549
10.75000 -4028.95284 54.99853 22.81047 112.46363 67.71267 7596.29551
10.85000 -3997.26355 53.81863 -116.13520 110.95765 68.35687 6579.41218
10.95000 -3960.65733 56.18567 164.80068 113.05656 66.37873 5651.41628
11.05000 -3931.33486 53.76387 -155.53870 108.44747 65.54273 6434.82527
11.15000 -3901.53913 51.88867 -136.26451 103.04298 63.17649 6114.02865
11.25000 -3874.06368 54.69415 -7.42749 99.46723 63.90508 5839.53136
11.35000 -3843.39415 52.38807 -286.53470 98.14002 61.10834 6092.62770
11.45000 -3815.68225 51.47560 -126.36652 98.89123 60.52255 4686.67326
11.55000 -3783.95320 50.36374 -244.52560 92.72319 60.17722 5853.24339
11.65000 -3754.61455 50.27681 139.62765 92.56461 61.77975 6025.44461
11.75000 -3725.37998 48.81373 203.87141 92.39676 58.41206 5878.74199
11.85000 -3693.82417 47.72488 -72.18920 86.57337 62.00796 5909.34355
11.95000 -3667.17289 47.22670 -131.00936 91.18344 59.33542 5446.42869
12.05000 -3641.59137 46.22715 43.83292 83.12045 56.95692 4216.16162
12.15000 -3613.19828 46.39538 -17.22575 85.04926 61.12611 4228.86376
12.25000 -3588.50826 46.14621 1.44346 81.62031 57.45303 4095.92224
12.35000 -3562.34293 43.59106 -244.15122 79.75630 57.13169 5249.51621
12.45000 -3536.89933 41.77549 -24.69522 78.94568 56.04578 4261.93382
12.55000 -3508.80317 41.75039 -26.89209 79.59989 56.07575 4478.24659
12.65000 -3485.02793 42.95148 -75.45751 72.39009 56.15626 4007.67206
12.75000 -3461.52537 41.93393 -7.31348 74.38103 56.20092 3439.55563
12.85000 -3433.09397 40.35316 13.22952 70.71612 58.73777 4142.86695
12.95000 -3408.29467 39.89354 8.24466 70.02707 55.58085 3579.09063
13.05000 -3383.00704 37.07748 -252.76637 67.48164 52.87027 3486.06288
13.15000 -3358.05144 38.15258 -241.97052 67.33642 56.47429 4112.26113
13.25000 -3334.84265 39.40924 -37.86839 66.90104 54.51757 3472.58038
13.35000 -3308.35574 37.01676 14.99817 66.48544 54.82710 2928.46902
13.45000 -3284.66121 34.83008 13.51071 60.70416 53.72471 2609.78594
13.55000 -3265.04281 38.87666 -62.11471 61.35935 51.50393 3186.62117
13.65000 -3233.68879 35.25794 -132.14550 62.23390 51.16096 3012.94875
13.75000 -3210.62876 36.23471 -17.17055 58.48906 54.74161 2653.94873
13.85000 -3187.43558 33.67733 25.00781 61.12908 51.05769 2771.50962
13.95000 -3161.10682 34.72196 -77.40474 60.53885 50.81914 2378.18635
14.05000 -3138.98613 34.56574 36.27683 61.30350 51.35319 3112.56544
14.15000 -3117.10279 33.65805 -68.46453 58.61097 49.89960 2573.87742
14.25000 -3096.73252 31.03746 58.61727 58.98632 50.81954 2264.41740
14.35000 -3070.22323 31.98355 -126.84805 53.70095 48.78183 2824.00399
14.45000 -3048.77397 31.31535 19.23047 55.77610 52.30830 1800.22596
14.55000 -3026.56299 30.52016 -91.21756 54.71744 48.89500 2526.94501
14.65000 -3006.04291 28.93675 31.85373 58.49345 51.32120 2042.35005
14.75000 -2983.30726 30.54147 56.02128 57.64041 52.13706 1636.20989
14.85000 -2968.88166 29.87399 -184.18077 55.99199 49.59430 1718.82994
14.95000 -2947.05168 26.03900 62.19452 55.76633 48.71831 1924.10585
15.05000 -2924.80220 28.30122 -74.86615 52.89145 50.04982 1824.07775
15.15000 -2910.25823 27.71344 142.24263 53.84792 49.71824 1809.49994
15.25000 -2879.87676 23.97156 29.26658 50.91751 44.29405 1572.30665
15.35000 -2863.30471 28.17239 -130.78288 53.47374 51.70265 2397.58957
15.45000 -2840.84033 25.80750 121.58433 52.74337 46.29941 1584.04561
15.55000 -2831.18081 23.69907 120.92546 52.30110 47.18989 1424.74860
15.65000 -2803.37317 25.26247 -57.55743 51.52813 48.28176 1347.59081
15.75000 -2787.06969 25.51137 77.69978 49.99073 43.56069 1354.04545
15.85000 -2768.21542 25.63390 -40.37673 52.52046 48.25908 1508.62158
15.95000 -2747.39175 22.69582 20.80680 50.20706 45.12196 1412.35097
16.05000 -2723.51252 23.36533 49.06711 51.92576 45.35025 1159.34155
16.15000 -2709.72689 23.41930 29.73151 51.14156 44.74622 1175.28954
16.25000 -2690.45647 21.38132 21.08751 53.27990 43.51276 1606.90664
16.35000 -2668.42924 24.71009 121.15117 50.90627 44.40413 1449.72402
16.45000 -2652.23859 21.44079 8.23424 50.57954 46.04044 983.10645
16.55000 -2635.05011 23.78519 78.45684 52.96690 44.37419 951.35540
16.65000 -2619.60504 21.77001 36.48365 53.76651 42.71788 1301.54689
16.75000 -2601.52555 20.59127 197.09648 49.20717 43.81442 1217.48139
16.85000 -2584.29530 25.40609 102.61684 51.80920 43.20799 865.18904
16.95000 -2569.42308 18.49817 62.90064 54.09998 42.76475 1285.39712
17.05000 -2551.38656 21.87304 57.96008 50.28679 43.73776 932.42744
17.15000 -2540.76793 21.58686 -3.76330 50.65063 44.88930 1031.81741
17.25000 -2524.62038 18.67709 29.94657 49.27215 44.88663 766.03521
17.35000 -2511.02785 21.51251 55.15231 50.22165 43.69167 837.91926
17.45000 -2498.57271 17.29848 -25.19831 50.83470 41.29009 929.03013
17.55000 -2482.81714 21.02272 9.45190 53.45678 44.69271 982.73976
17.65000 -2471.93665 19.05489 64.22905 50.15981 43.59432 1041.75394
17.75000 -2452.29238 16.20909 24.14493 49.80046 40.47690 778.60603
17.85000 -2438.23963 20.66150 14.84812 50.83569 40.26785 840.03720
17.95000 -2425.96680 18.82427 43.11715 53.23032 44.04253 748.68849
18.05000 -2406.14478 17.55184 105.46072 44.47415 40.70252 1347.21455
18.15000 -2387.08668 16.04529 88.04047 47.43453 40.03125 758.42591
18.25000 -2377.59251 13.15762 64.69922 43.92524 40.21588 728.04431
18.35000 -2358.00385 22.02323 22.59534 48.40151 38.71726 1101.39550
18.45000 -2348.95710 18.63399 61.62622 48.77131 41.46384 1018.16653
18.55000 -2336.78030 15.56607 -24.48730 48.41093 43.41416 1068.17574
18.65000 -2323.12183 18.42132 47.55882 40.75971 43.28459 837.04682
18.75000 -2306.02144 13.53072 23.74204 42.90808 44.14171 1062.81495
18.85000 -2293.30704 16.39632 -1.37862 47.57714 42.52405 788.17646
18.95000 -2284.41207 15.23825 28.26382 46.08323 42.91825 787.28341
19.05000 -2273.68680 15.82673 22.42556 45.60817 43.24115 942.17868
19.15000 -2254.77240 17.37571 8.68597 50.99000 40.91261 826.26583
19.25000 -2248.29987 14.26431 12.27423 45.76570 43.38605 395.02621
19.35000 -2235.96544 16.24995 119.63877 47.14117 41.07410 497.04406
19.45000 -2226.77344 15.90353 99.00358 42.28327 45.08654 668.13985
19.55000 -2208.04172 15.21064 27.66845 41.52897 39.57355 773.26252
19.65000 -2200.43735 16.52090 52.77282 44.46736 46.36740 707.37928
19.75000 -2189.61433 15.88776 126.93116 42.03666 43.78195 618.62404
19.85000 -2170.44583 17.24069 52.09933 49.65273 46.15579 820.47142
19.95000 -2161.79183 13.12730 -24.55931 48.50950 35.84723 672.07294
