0.125 -0.001 -0.001 0.000
0.375 0.002 -0.001 0.024
0.625 -0.008 0.003 0.155
0.875 -0.014 0.003 0.535
1.125 -0.051 0.026 1.141
1.375 -0.028 0.001 1.931
1.625 -0.026 0.015 2.747
1.875 0.021 0.053 3.620
2.125 -0.019 0.071 4.311
2.375 -0.025 0.060 5.029
2.625 -0.049 0.056 5.710
2.875 -0.038 0.054 6.013
3.125 -0.030 0.082 6.689
3.375 -0.024 0.042 7.090
3.625 -0.032 0.068 7.423
3.875 0.030 0.072 7.567
4.125 -0.064 0.062 7.758
4.375 -0.077 0.084 7.967
4.625 -0.038 0.069 8.151
4.875 -0.056 0.053 8.502
5.125 -0.071 0.106 8.773
5.375 -0.045 0.102 8.803
5.625 -0.101 0.080 9.102
5.875 -0.093 0.105 9.125
6.125 -0.089 0.068 9.500
6.375 -0.076 0.058 9.834
6.625 -0.123 0.088 10.256
6.875 -0.138 0.132 10.865
7.125 -0.168 0.113 11.198
7.375 -0.059 0.125 11.740
7.625 -0.103 0.148 12.631
7.875 -0.219 0.138 13.299
8.125 -0.184 0.179 14.462
8.375 -0.203 0.162 15.609
8.625 -0.261 0.159 16.713
8.875 -0.236 0.254 18.307
9.125 -0.222 0.264 20.333
9.375 -0.248 0.315 22.293
9.625 -0.277 0.268 23.249
9.875 -0.405 0.322 24.515
10.125 -0.389 0.289 25.125
10.375 -0.345 0.301 25.980
10.625 -0.404 0.306 25.856
10.875 -0.489 0.294 26.502
11.125 -0.425 0.263 25.793
11.375 -0.446 0.268 24.771
11.625 -0.363 0.249 23.549
11.875 -0.337 0.281 22.449
12.125 -0.319 0.204 21.275
12.375 -0.344 0.192 20.517
12.625 -0.301 0.187 20.407
12.875 -0.250 0.214 19.402
13.125 -0.289 0.123 19.534
13.375 -0.259 0.150 18.619
13.625 -0.261 0.149 19.338
13.875 -0.258 0.153 18.892
14.125 -0.272 0.182 19.143
14.375 -0.261 0.182 18.935
14.625 -0.235 0.182 18.480
14.875 -0.237 0.195 17.618
