0.12500 0.01169
0.37500 0.00835
0.62500 0.01765
0.87500 0.00493
1.12500 0.03152
1.37500 0.01194
1.62500 0.00398
1.87500 0.01536
2.12500 0.01043
2.37500 0.01628
2.62500 0.00984
2.87500 0.01610
3.12500 0.00466
3.37500 0.01848
3.62500 0.02275
3.87500 0.01918
4.12500 0.01517
4.37500 0.02450
4.62500 0.02343
4.87500 0.02976
5.12500 0.03658
5.37500 0.03112
5.62500 0.03213
5.87500 0.02723
6.12500 0.00362
6.37500 0.01798
6.62500 0.00701
6.87500 0.00547
7.12500 0.01343
7.37500 0.02057
7.62500 0.02280
7.87500 0.02320
8.12500 0.03143
8.37500 0.06613
8.62500 0.02651
8.87500 0.02760
9.12500 0.04057
9.37500 0.00591
9.62500 0.03894
9.87500 0.01662
10.12500 0.02817
10.37500 0.02631
10.62500 0.03030
10.87500 0.04393
11.12500 0.01186
11.37500 0.00875
11.62500 0.02961
11.87500 0.02148
12.12500 0.02342
12.37500 0.03497
12.62500 0.05795
12.87500 0.01323
13.12500 0.00415
13.37500 0.00628
13.62500 0.03488
13.87500 0.03725
14.12500 0.05714
14.37500 0.02526
14.62500 0.04407
14.87500 0.03116
15.12500 0.00747
15.37500 0.05389
15.62500 0.06231
15.87500 0.04186
16.12500 0.09637
16.37500 0.02490
16.62500 0.06517
16.87500 0.09093
17.12500 0.07173
17.37500 0.08182
17.62500 0.05249
17.87500 0.04988
18.12500 0.03827
18.37500 0.20280
18.62500 0.11144
18.87500 0.09080
19.12500 0.08450
19.37500 0.10011
19.62500 0.08644
19.87500 0.07238
