0.120000 -2.143830
0.380000 -1.650200
0.620000 2.904650
0.880000 -1.849990
1.120000 3.140030
1.380000 2.525230
1.620000 -0.613070
1.880000 -0.084970
2.120000 -1.326620
2.380000 -0.043690
2.620000 -0.336980
2.880000 0.571440
3.120000 0.761930
3.380000 0.252010
3.620000 -0.084770
3.880000 -0.274910
4.120000 0.125220
4.380000 -0.601140
4.620000 -2.078930
4.880000 2.124370
5.120000 1.394880
5.380000 0.952560
5.620000 1.084220
5.880000 2.320710
6.120000 1.497830
6.380000 -1.452820
6.620000 -1.174460
6.880000 -1.086750
7.120000 -2.251050
7.380000 -0.599820
7.620000 -0.734960
7.880000 -1.418680
8.120000 -1.793600
8.380000 -2.070820
8.620000 -1.557530
8.880000 2.385080
9.120000 -2.297900
9.380000 -2.074000
9.620000 1.043920
9.880000 -2.863800
10.120000 2.854760
10.380000 -2.845650
10.620000 -2.344940
10.880000 -1.437010
11.120000 -0.685290
11.380000 0.966100
11.620000 -2.792200
11.880000 0.153260
12.120000 1.044680
12.380000 0.838990
12.620000 -3.018650
12.880000 -2.141760
13.120000 -0.713770
13.380000 -2.781430
13.620000 2.741810
13.880000 -2.956390
14.120000 -0.008260
14.380000 2.272480
14.620000 -3.012120
14.880000 2.573050
15.120000 -1.583370
15.380000 -0.618710
15.620000 0.557760
15.880000 0.827310
16.120000 2.150020
16.380000 0.197180
16.620000 2.568090
16.880000 2.354830
17.120000 -0.142720
17.380000 2.435500
17.620000 0.648410
17.880000 -2.241960
18.120000 2.396720
18.380000 2.238070
18.620000 -0.392880
18.880000 2.616680
19.120000 -2.900900
19.380000 -0.851090
19.620000 -0.178670
19.880000 -1.175650
