0.05000 -20755.05675 2649.49484 4777.77302 31936.72884 32438.58356 26161.46622
0.15000 -28821.93036 -604.42971 -1800.19501 18112.57975 21210.88044 29148.47330
0.25000 -30502.98056 58.70129 -450.90992 13663.30351 14230.04480 27317.67389
0.35000 -28155.93167 466.33410 314.70848 10190.92517 9254.94111 24107.07151
0.45000 -24686.08698 23.99956 824.31351 8629.76441 6980.24656 21535.59643
0.55000 -22781.04858 23.52935 302.44443 7858.10680 5687.81169 19354.15225
0.65000 -20396.41962 109.93384 773.41560 6786.21975 4247.15204 17580.29725
0.75000 -19054.04017 -71.82844 -30.93019 5945.72257 3657.80429 15938.17726
0.85000 -17588.22979 178.32022 42.18412 5345.05356 2939.11847 14657.48548
0.95000 -16467.51032 -96.99571 -330.23716 4907.01467 2531.88479 13229.15589
1.05000 -15539.54420 0.68464 0.94934 4368.98667 2384.51392 12184.02514
1.15000 -14396.89920 18.57120 -198.89890 3947.56891 1930.88203 11397.36451
1.25000 -13590.89074 1.84650 -524.81566 3579.74231 2058.50981 10569.24840
1.35000 -12864.37018 22.20922 35.76621 3141.57699 1867.14307 9946.58902
1.45000 -12218.98366 -24.72112 401.67914 2825.78996 1757.64257 9457.19475
1.55000 -11820.51844 -11.25998 97.59179 2685.93616 1773.65334 8659.54110
1.65000 -11285.67657 -24.85672 -267.20445 2562.67803 1955.28366 8411.81825
1.75000 -10937.28071 45.70705 191.16393 2346.84904 1519.63492 7862.37201
1.85000 -10538.45029 22.38572 211.95885 2359.61372 1663.67674 7786.21424
1.95000 -10422.57927 -20.31046 125.72002 2363.12963 1747.51905 7111.36846
2.05000 -10026.65285 30.72349 54.48444 2017.14000 1362.71454 6785.25666
2.15000 -9703.31749 48.08402 -239.22908 2217.00574 1407.18762 6625.26332
2.25000 -9446.80895 22.67351 -18.88634 1764.05024 1207.66959 6552.60658
2.35000 -9303.99032 -29.13839 117.05777 1637.53143 1142.55094 6173.20418
2.45000 -9021.78788 -17.32734 196.63971 1636.01626 1766.72292 6013.50194
2.55000 -8900.35873 60.32655 262.53173 1557.00085 1139.06598 5651.31629
2.65000 -8661.97826 -1.42343 -131.12273 1315.65150 1434.91605 5480.28586
2.75000 -8567.73883 22.43549 -129.26809 1361.80526 1616.79610 5330.68825
2.85000 -8412.11251 50.56472 52.48514 1565.90690 1248.25497 5093.14533
2.95000 -8282.75188 37.03050 118.27125 1162.50839 1144.51278 4958.73217
3.05000 -8216.37337 29.66122 -33.50884 1177.66673 1258.87492 4709.91710
3.15000 -8139.26289 34.99010 -52.64111 1105.28606 1030.76019 4572.00434
3.25000 -8027.09647 6.22424 169.10625 1208.31572 970.54595 4378.36557
3.35000 -7930.70147 12.57281 55.25641 1182.23145 910.65188 4145.24139
3.45000 -7882.11120 46.88533 130.82590 1276.04742 1168.61543 4260.08810
3.55000 -7734.53826 11.78991 116.71214 1096.38349 878.54717 3935.01700
3.65000 -7656.82491 35.05627 96.09209 878.33762 732.28393 3814.89670
3.75000 -7601.76509 32.21983 119.40889 1009.27454 966.70584 3808.02437
3.85000 -7518.32145 16.28257 -0.18347 987.49892 716.88714 3617.89580
3.95000 -7504.47769 12.24499 -84.65412 934.22301 701.25007 3410.34540
4.05000 -7395.50853 78.65846 -2.46607 889.68931 1101.39375 3361.98186
4.15000 -7341.68832 14.08765 84.04129 740.58704 749.67483 3202.55531
4.25000 -7311.20359 45.19156 -62.16885 1347.83240 838.55268 3274.06219
4.35000 -7251.21143 18.94627 -43.46645 909.55372 1264.58725 3135.28960
4.45000 -7186.70189 11.87502 67.44884 876.20951 1055.25291 3147.64083
4.55000 -7133.78751 19.55274 -47.44208 738.31723 501.84723 2982.38971
4.65000 -7101.86450 17.63181 -71.16160 663.95825 598.44093 2884.20049
4.75000 -7030.06721 1.22081 10.34904 1332.88090 675.09599 2825.78862
4.85000 -7007.14737 10.47056 4.52507 809.09019 640.30669 2772.02362
4.95000 -6963.13367 -6.20635 -25.08312 1343.45389 1161.65728 2847.57779
5.05000 -6953.89851 0.69398 -17.49719 645.81347 550.92552 2602.81478
5.15000 -6917.90389 -8.55621 50.95542 652.56435 479.28443 2510.40094
5.25000 -6871.56293 -2.15794 -31.10154 655.10779 620.07841 2500.51574
5.35000 -6848.02424 4.24535 7.90541 633.95309 487.91174 2399.07064
5.45000 -6796.83281 -3.81591 -37.61774 748.40861 581.30148 2410.77626
5.55000 -6755.41082 12.22247 -33.21147 858.19979 1087.19829 2395.83530
5.65000 -6723.25737 -0.53970 -89.02780 536.15718 488.47501 2366.40491
5.75000 -6700.50817 -7.00093 -78.29418 555.12952 421.34693 2134.91909
5.85000 -6625.01032 -1.74244 -22.87631 556.01494 482.22367 2165.63323
5.95000 -6598.37485 -2.21218 6.55539 592.20696 437.88243 2143.96309
6.05000 -6516.68832 -0.43074 -27.86548 1248.46620 614.74579 2238.66135
6.15000 -6520.25824 -6.60819 32.15396 509.47724 423.53092 2033.28590
6.25000 -6470.06691 -17.83983 9.52728 1107.32004 764.93663 1957.87849
6.35000 -6451.31002 0.02620 -7.85413 594.67720 462.14050 1936.82452
6.45000 -6396.15107 3.28687 -104.31846 694.81238 414.55546 1906.82971
6.55000 -6363.17112 18.64523 -38.29636 490.26078 800.58505 1864.08776
6.65000 -6293.98341 5.41175 -106.56912 536.92022 425.14997 1811.42411
6.75000 -6260.56563 3.61423 -82.28618 507.26319 300.86425 1742.95006
6.85000 -6181.55149 8.07883 -7.72649 562.26559 399.67611 1698.25993
6.95000 -6134.40162 -5.28704 -1.54593 573.35262 517.73143 1706.29122
7.05000 -6092.46424 5.02147 -67.71336 461.69342 416.01089 1602.80004
7.15000 -6041.36860 -3.44246 22.50493 516.17300 404.32725 1557.67935
7.25000 -5984.02757 -0.54407 -64.30887 388.48192 299.74814 1547.85757
7.35000 -5914.68845 3.40994 3.78500 602.73801 382.27955 1527.30326
7.45000 -5873.02600 6.51511 -29.72019 437.49202 358.24676 1498.58160
7.55000 -5817.48453 4.38604 54.76517 525.71715 436.50443 1460.11804
7.65000 -5800.28906 3.94896 -78.54270 614.05403 289.71351 1423.17774
7.75000 -5736.79461 -3.16088 -81.97724 389.22575 278.52439 1370.48710
7.85000 -5669.14104 12.56145 22.88974 394.88463 309.71531 1354.08527
7.95000 -5598.39116 19.86813 -80.39071 1206.97833 572.38156 1331.69209
8.05000 -5578.76997 10.91772 -94.48795 477.50042 392.73774 1299.43027
8.15000 -5530.29063 14.16859 -43.99604 492.28656 696.65711 1276.91364
8.25000 -5487.33877 6.56974 -20.34828 369.94109 324.34241 1251.24773
8.35000 -5434.03603 0.09626 -22.62771 422.95641 359.08090 1278.70342
8.45000 -5393.26740 4.63555 17.20728 478.89102 297.27701 1214.02554
8.55000 -5328.45513 5.79971 -6.12838 463.79225 518.27652 1176.30478
8.65000 -5296.29512 -3.09994 -2.99420 369.49854 220.48905 1130.95717
8.75000 -5236.03350 21.18160 -77.36995 317.10667 297.33655 1135.14366
8.85000 -5198.17558 3.56486 -29.00468 259.74569 340.15036 1071.64790
8.95000 -5152.17269 14.81075 -44.97288 252.58047 337.90953 1048.99373
9.05000 -5103.75031 -4.16959 -23.92273 251.96383 197.82935 1045.66208
9.15000 -5067.81391 0.73449 -10.91477 304.63808 198.90416 1009.04241
9.25000 -5013.63655 -6.26953 -7.84202 238.88414 188.72674 1023.31424
9.35000 -4971.23717 -2.30290 -59.51400 345.60610 223.24061 1012.96973
9.45000 -4919.54424 2.69909 -51.37878 391.86224 368.19434 986.63986
9.55000 -4895.75104 11.03659 -1.76514 274.02116 233.86939 941.19141
9.65000 -4860.73589 4.03243 39.99847 216.16173 212.78791 908.83668
9.75000 -4850.92613 17.58049 -3.43177 510.27095 364.44629 913.20753
9.85000 -4792.54477 12.20015 8.49802 208.53359 331.24963 899.62783
9.95000 -4758.04155 6.92497 -22.51928 212.57000 205.49284 854.01148
10.05000 -4721.68884 5.51029 -8.61402 301.61699 291.28122 875.68331
10.15000 -4672.93068 -5.77694 8.70869 316.88799 242.03576 860.92106
10.25000 -4651.52127 13.05705 22.15781 553.95783 310.44502 801.55433
10.35000 -4610.81562 6.59164 -10.03268 197.23791 164.53847 768.45360
10.45000 -4577.40163 -6.32109 5.93863 220.47041 175.90499 763.98880
10.55000 -4524.83112 1.80765 6.19611 259.46201 407.54021 842.37913
10.65000 -4481.24461 -6.21596 -33.73017 208.79742 278.24376 749.90840
10.75000 -4453.99928 -0.11049 -26.97005 274.25765 369.17681 722.18468
10.85000 -4411.77575 5.02593 -17.93216 220.42509 151.29693 731.00012
10.95000 -4369.72195 -4.78539 49.93447 454.85014 329.37705 734.05578
11.05000 -4350.33478 22.32368 -32.51016 457.18093 533.62047 718.72010
11.15000 -4305.29863 9.15078 -12.40544 278.70842 170.97557 715.23422
11.25000 -4270.07696 -4.04249 16.22282 142.04228 118.46103 655.99657
11.35000 -4237.68667 -4.15867 -15.94678 233.86261 161.26589 631.57183
11.45000 -4175.29965 -10.48922 -24.47997 654.09559 263.06509 650.34949
11.55000 -4162.13840 0.85694 -68.54051 165.30139 175.08585 623.13569
11.65000 -4146.13134 -50.76005 -45.18984 411.23099 1540.42638 740.01195
11.75000 -4091.08983 -6.57867 -11.02364 210.10433 142.33381 613.80109
11.85000 -4061.30903 4.29250 -52.37612 249.04038 203.83095 626.37346
11.95000 -4032.93584 -4.25302 -37.05677 203.61220 198.72998 588.18234
12.05000 -4001.46223 -1.67785 -60.44392 209.06444 164.36424 610.86831
12.15000 -3975.08566 4.82213 -33.66673 217.88361 142.24546 615.68683
12.25000 -3946.64971 -2.75192 -7.75824 194.91518 145.31323 561.93406
12.35000 -3909.98404 6.54109 -31.66063 169.91701 125.52694 544.09536
12.45000 -3908.62570 14.31525 -20.29547 530.86271 402.32317 539.85497
12.55000 -3850.48923 0.07523 -17.83212 133.82218 88.75074 516.80347
12.65000 -3819.26700 6.11344 -68.77845 192.67950 135.98541 521.91274
12.75000 -3803.39863 -1.17879 -14.04258 176.99421 108.45228 514.37100
12.85000 -3767.81667 1.83801 17.25939 199.76537 140.63946 501.31264
12.95000 -3735.63358 7.52492 2.87362 173.70413 380.27604 642.17056
13.05000 -3706.33296 0.36042 -32.95976 228.08568 127.00448 478.97698
13.15000 -3682.40153 17.47958 -39.79021 309.27184 465.32748 722.62797
13.25000 -3646.35670 2.58804 -52.84704 127.20952 120.24802 476.21459
13.35000 -3625.25216 -1.30472 -15.62497 193.25084 96.30072 503.77353
13.45000 -3605.06765 -1.56019 -28.11062 121.93994 103.04909 441.72586
13.55000 -3565.57676 9.33820 -36.39198 461.31755 282.84233 474.41918
13.65000 -3562.17301 -2.62642 -29.69310 180.08315 160.76160 451.36008
13.75000 -3539.96448 11.61069 -6.85551 147.40451 130.91795 428.77689
13.85000 -3521.97581 2.02091 10.48391 181.37053 202.62622 416.43232
13.95000 -3485.24356 5.51185 3.60075 137.73037 359.37620 448.20623
14.05000 -3454.12436 2.38767 -4.77785 91.54124 90.82273 410.81376
14.15000 -3429.96043 1.48296 -20.54253 123.15163 92.22592 385.95998
14.25000 -3412.04997 -2.31879 16.20248 105.14823 93.30509 377.60982
14.35000 -3390.11621 1.18832 5.67061 125.58540 102.75789 379.39972
14.45000 -3358.83981 -3.61247 -28.21702 125.77945 149.47859 383.24110
14.55000 -3343.09033 1.35353 -2.63727 95.50801 69.96608 361.91799
14.65000 -3304.25119 7.35837 1.36630 215.66946 220.11105 373.70274
14.75000 -3292.57658 11.21829 -12.14140 205.58170 184.82416 448.93143
14.85000 -3268.56871 10.74389 -30.03825 282.34440 335.64814 402.64817
14.95000 -3251.33282 1.45173 8.26018 106.35871 95.63095 336.66272
15.05000 -3227.91444 3.16703 14.62750 91.72799 141.80279 349.01727
15.15000 -3202.62608 -6.74441 12.18873 124.18333 201.86180 378.91251
15.25000 -3186.71678 5.95805 -10.23183 120.02427 186.01324 358.08888
15.35000 -3155.45890 3.94466 -38.13701 94.64427 91.41657 343.82870
15.45000 -3147.44028 0.10462 14.65999 83.59137 96.73678 312.24088
15.55000 -3116.75311 0.53411 -10.61398 94.01351 74.50325 319.03453
15.65000 -3097.49104 3.51434 -13.78289 83.69988 56.28369 310.25321
15.75000 -3065.91901 6.13463 9.31346 207.33686 326.79851 322.83584
15.85000 -3052.96757 -1.36674 13.27211 106.89304 79.42108 305.84512
15.95000 -3036.38258 5.84320 -32.99649 106.86365 80.51468 278.50513
16.05000 -3032.90999 8.00897 15.72742 270.12367 83.81027 501.14506
16.15000 -2988.98218 -1.05731 -1.29106 80.95888 97.82912 285.32315
16.25000 -2972.50640 -2.52172 -28.69943 156.34659 152.80970 275.42950
16.35000 -2952.93172 4.20977 10.09065 95.45383 71.66649 287.91453
16.45000 -2939.26312 0.40069 -3.48795 74.74416 77.00129 268.90242
16.55000 -2917.21789 0.70714 -22.78958 75.91120 53.73221 283.86305
16.65000 -2895.86588 2.98484 -24.76666 68.61447 83.04613 265.00699
16.75000 -2878.02621 5.42804 -11.82947 155.57968 125.89712 298.26140
16.85000 -2862.21860 1.80720 -20.72272 61.72379 58.27738 244.06900
16.95000 -2838.87156 0.39385 -17.83034 240.52112 298.43015 763.14806
17.05000 -2826.98704 0.14081 -19.75833 75.73735 73.09194 243.57595
17.15000 -2799.48024 -6.91787 -22.11810 103.27758 92.12137 253.55612
17.25000 -2783.94396 5.64497 -26.41229 69.66575 59.85778 240.93159
17.35000 -2774.64229 -16.21874 10.84360 138.33034 328.96248 596.48647
17.45000 -2754.14416 -1.49376 -39.66066 79.98866 79.62551 235.40599
17.55000 -2738.75550 -0.31902 -48.96719 69.50249 61.93426 219.62779
17.65000 -2718.60354 5.12799 -41.59965 150.43914 85.58642 237.56226
17.75000 -2704.23066 -22.27519 -40.41980 293.98417 536.96845 309.03710
17.85000 -2689.97194 0.95293 -12.01060 177.58465 87.41635 231.24745
17.95000 -2671.32400 2.03334 -23.40664 188.26905 85.74943 247.89187
18.05000 -2649.79165 0.47202 -6.43543 90.91634 59.63066 224.30648
18.15000 -2634.84668 1.76078 -36.12724 56.30700 63.03689 219.99959
18.25000 -2684.20132 5.51540 7.53991 1016.09355 152.81077 724.20258
18.35000 -2607.72686 -2.02056 -26.28113 46.59917 43.71569 196.95420
18.45000 -2587.73372 1.48934 -23.51803 63.02213 88.05206 223.37898
18.55000 -2575.24699 11.30033 -65.85477 48.00664 166.16861 198.85654
18.65000 -2552.54619 10.44530 -24.16543 88.39632 86.21814 210.04635
18.75000 -2527.38133 7.54631 -26.23696 58.45731 38.39116 209.65749
18.85000 -2543.42419 -4.84013 -66.99003 118.09142 83.46007 207.65506
18.95000 -2514.45047 2.52870 -47.92566 103.88381 105.12058 235.84325
19.05000 -2493.29846 -3.06251 0.41969 84.15903 72.19524 252.28747
19.15000 -2483.49221 5.75114 -27.21992 56.95876 79.10344 211.44363
19.25000 -2464.97882 7.92384 -32.84630 128.48782 75.83480 221.57808
19.35000 -2445.04373 -1.28137 -53.15630 68.21708 44.61749 185.38971
19.45000 -2444.18059 7.40001 -0.04525 100.27324 85.74814 209.38997
19.55000 -2418.67605 1.72338 -38.73417 285.43668 210.15123 200.04727
19.65000 -2402.62857 6.32777 -45.51515 50.01960 43.98870 190.45380
19.75000 -2373.98737 7.58182 12.98991 209.81782 126.06040 578.90977
19.85000 -2370.22855 11.84330 -21.72471 100.58793 95.07799 174.75276
19.95000 -2362.41081 -0.61097 -26.13895 57.65426 73.00552 179.53040
