0.12500 0.00364
0.37500 0.04861
0.62500 0.09055
0.87500 0.16068
1.12500 0.23697
1.37500 0.31205
1.62500 0.37236
1.87500 0.41846
2.12500 0.45792
2.37500 0.49522
2.62500 0.52099
2.87500 0.53431
3.12500 0.54951
3.37500 0.57151
3.62500 0.58014
3.87500 0.58288
4.12500 0.58082
4.37500 0.57111
4.62500 0.55365
4.87500 0.51002
5.12500 0.46679
5.37500 0.42002
5.62500 0.37184
5.87500 0.33423
6.12500 0.32879
6.37500 0.29857
6.62500 0.29130
6.87500 0.30576
7.12500 0.31754
7.37500 0.32633
7.62500 0.32691
7.87500 0.33406
8.12500 0.31262
8.37500 0.29256
8.62500 0.25652
8.87500 0.21011
9.12500 0.17900
9.37500 0.12374
9.62500 0.13708
9.87500 0.11052
10.12500 0.10586
10.37500 0.09963
10.62500 0.07973
10.87500 0.08392
11.12500 0.07124
11.37500 0.06950
11.62500 0.04831
11.87500 0.04247
12.12500 0.04490
12.37500 0.04375
12.62500 0.03452
12.87500 0.05102
13.12500 0.05452
13.37500 0.03462
13.62500 0.07321
13.87500 0.06639
14.12500 0.04746
14.37500 0.07037
14.62500 0.07223
14.87500 0.06484
