0.1875 2.4158 19.17156 -0.9288 103.72753 101.99528 81.8423
0.5625 -2.21143 45.42328 -0.92734 103.31369 97.60645 79.50669
0.9375 -1.26027 65.91739 0.44683 99.51186 89.89872 75.13771
1.3125 0.75504 80.05846 0.55184 96.916 83.10959 70.8728
1.6875 1.35377 90.03565 1.49818 93.5553 79.81586 65.719
2.0625 -0.74096 98.4336 0.40372 90.60626 74.61182 61.97462
2.4375 -0.88382 106.4252 0.36659 86.49682 71.40837 59.34606
2.8125 -2.67669 114.95855 0.34532 83.62883 66.55666 55.17157
3.1875 -4.55035 124.19934 0.69218 78.91684 62.64989 52.49559
3.5625 -1.53586 132.18507 1.51951 73.05598 60.16284 49.68379
3.9375 -1.02732 139.8128 1.37192 67.79878 58.16893 48.281
4.3125 -1.93605 149.78412 1.96118 61.49422 55.55351 45.23994
4.6875 -0.32879 159.0087 1.53742 55.83378 52.38306 42.69941
5.0625 -0.23968 168.06977 0.46103 51.21346 46.90268 40.95692
5.4375 -0.42362 172.93535 0.67512 47.1479 43.2195 38.38527
5.8125 0.56517 179.45017 -0.20573 44.44443 38.62115 36.32911
6.1875 -1.03357 183.439 0.44237 41.87172 36.17903 34.52889
6.5625 -1.50578 188.53763 -0.42353 40.03861 33.74962 32.72107
6.9375 -0.73997 191.65147 -1.31166 37.97114 32.47727 31.55084
7.3125 -0.41756 195.29197 -1.51959 36.43494 30.16895 29.86329
7.6875 -1.09833 196.78766 -2.3201 35.76275 28.06895 28.87771
8.0625 -0.47634 197.27839 -2.7785 34.34651 26.8839 27.79941
8.4375 -0.17752 198.90186 -3.53098 32.54918 26.66804 26.62057
8.8125 0.25945 200.30864 -3.64303 32.54701 26.42268 25.87217
9.1875 -0.05393 202.12231 -3.18291 30.92866 25.94175 24.08378
9.5625 -1.03974 203.77707 -2.36945 29.84446 24.44282 23.37217
9.9375 -1.98435 206.21267 -2.66353 29.65292 23.57067 23.08691
10.3125 -1.52552 207.64902 -0.70046 28.111 21.98804 22.04458
10.6875 -1.30567 208.43595 -0.25606 27.3974 20.82141 21.68347
11.0625 -2.003 208.98914 -0.01941 26.84615 19.85981 21.38054
11.4375 -1.23108 208.88939 0.0797 25.85452 19.15483 21.0161
11.8125 -0.12236 208.9908 0.73955 25.60343 18.01906 20.50101
12.1875 0.13077 208.86412 1.43084 24.56571 17.95449 19.97127
12.5625 -0.69216 208.2851 0.16974 23.85408 17.50704 18.63437
12.9375 -0.25838 207.51764 0.38905 23.5711 17.47116 18.63165
13.3125 -0.53786 208.1539 -0.30022 23.08914 17.68845 17.89807
13.6875 -1.85703 208.46904 1.05377 22.44034 16.89382 17.76342
14.0625 -0.76393 209.03354 0.52175 21.49359 17.02648 16.79807
14.4375 -1.85861 209.90148 1.69223 19.91524 16.35566 16.39319
14.8125 -0.86372 209.79538 1.0741 20.41971 15.9556 15.67677
15.1875 0.14387 210.45645 1.74575 19.09673 15.10043 15.05127
15.5625 -0.27419 210.12612 0.96606 18.65227 14.18511 15.00992
15.9375 0.68017 210.8915 0.71369 18.82321 13.96701 14.49461
16.3125 0.52037 210.25272 0.46926 18.25554 14.07462 13.73229
16.6875 1.33268 210.69374 0.39197 18.16343 13.64545 13.39944
17.0625 0.9462 210.04388 0.46077 17.23732 13.15822 13.2473
17.4375 0.64125 209.42757 -0.13422 16.81498 12.08787 12.31461
17.8125 -0.27761 209.61475 0.72467 15.74279 12.36727 12.03839
18.1875 -0.11416 209.28424 1.10588 16.69807 12.19136 11.92759
18.5625 -0.6788 209.25661 0.60759 15.99742 11.4638 11.17078
18.9375 -1.55283 210.07256 1.2827 14.88011 10.68134 11.18081
19.3125 -2.92896 210.6311 1.88431 15.34226 10.54228 10.10541
19.6875 -1.14127 210.44311 3.11312 14.74797 10.01467 10.98241
20.0625 -0.22088 209.88799 2.34061 13.47428 10.26246 10.30821
20.4375 0.21766 210.42485 3.61367 13.90151 9.44763 11.04816
20.8125 -0.8911 209.12008 2.77825 12.82737 9.35197 10.73792
21.1875 -0.02313 207.87592 2.31247 12.49597 8.85765 10.70859
21.5625 -0.4039 207.89974 1.74549 12.32089 9.38662 10.02198
21.9375 -0.05366 209.00847 0.58783 11.83315 8.93362 10.12156
22.3125 0.72582 209.71164 0.68216 11.84796 8.21657 10.5287
22.6875 1.19761 209.262 -0.23869 12.53051 8.50919 8.81505
23.0625 2.24713 208.45144 0.17062 10.7246 8.15946 8.37454
23.4375 2.74262 207.60658 0.65597 10.33291 7.0015 8.44052
23.8125 1.18133 207.49273 0.84764 11.08133 6.95986 8.7206
24.1875 0.57412 206.732 1.01851 10.44023 7.2193 7.59183
24.5625 1.09174 204.70636 1.35728 10.14845 8.24738 8.17991
24.9375 -1.41691 206.02004 1.79282 9.74757 8.15048 7.56641
25.3125 0.00077 206.38909 0.40437 10.97616 7.18003 7.10196
25.6875 -0.17494 207.43951 -0.51004 9.42765 7.17688 7.70744
26.0625 0.35572 205.90308 -0.11636 11.14401 6.52748 7.54566
26.4375 0.65002 206.50551 0.40105 9.49758 6.27588 7.09823
26.8125 1.43637 206.28838 0.21853 8.02735 7.24771 6.46208
27.1875 0.63872 206.08349 0.12022 8.08222 6.17258 5.98072
27.5625 2.39879 204.89656 -0.348 8.72642 5.91471 7.0189
27.9375 0.98112 205.44706 0.0814 8.59585 6.31871 6.68029
28.3125 -0.04966 204.40778 -0.3284 8.26246 6.30153 6.01381
28.6875 -0.03141 203.84575 2.84232 6.71205 5.63981 5.14961
29.0625 -0.52269 204.31511 1.07069 6.96392 7.00594 5.93487
29.4375 1.39177 204.4669 0.60443 7.61867 5.65542 5.45858
29.8125 -0.85429 203.99417 1.80892 7.76402 4.43763 4.21213
