0.125 0.001 -0.000 0.002
0.375 -0.000 -0.000 0.056
0.625 -0.002 0.006 0.229
0.875 -0.016 -0.001 0.576
1.125 -0.007 0.010 1.041
1.375 -0.012 -0.002 1.596
1.625 0.005 -0.025 2.194
1.875 0.004 -0.020 2.999
2.125 -0.019 -0.047 3.765
2.375 -0.032 -0.015 4.566
2.625 0.020 -0.011 5.470
2.875 -0.037 0.003 6.561
3.125 -0.047 -0.013 7.793
3.375 -0.030 -0.013 9.046
3.625 -0.070 -0.023 10.479
3.875 -0.052 -0.007 12.148
4.125 -0.050 -0.002 13.622
4.375 -0.056 0.047 15.289
4.625 -0.090 -0.013 16.611
4.875 -0.072 0.074 17.776
5.125 -0.052 0.027 19.297
5.375 -0.079 0.059 20.569
5.625 -0.047 0.009 21.989
5.875 -0.091 0.033 23.069
6.125 -0.144 0.013 24.466
6.375 -0.097 -0.016 25.173
6.625 -0.100 -0.014 26.075
6.875 -0.098 0.072 27.017
7.125 -0.155 0.100 27.853
7.375 -0.097 0.048 27.729
7.625 -0.083 0.030 27.695
7.875 -0.116 0.012 27.585
8.125 -0.132 -0.023 27.727
8.375 -0.136 -0.032 27.356
8.625 -0.118 -0.009 26.956
8.875 -0.131 -0.035 26.748
9.125 -0.117 -0.062 26.552
9.375 -0.049 -0.013 25.723
9.625 -0.094 0.021 25.744
9.875 -0.089 0.001 25.147
10.125 -0.087 -0.044 24.589
10.375 -0.077 0.027 24.171
10.625 -0.088 0.006 23.952
10.875 -0.059 0.003 23.977
11.125 -0.071 -0.005 23.504
11.375 -0.107 0.001 22.995
11.625 -0.146 0.064 22.150
11.875 -0.109 -0.011 22.484
12.125 -0.124 0.008 22.027
12.375 -0.131 0.041 21.552
12.625 -0.098 0.029 21.389
12.875 -0.110 -0.009 20.968
13.125 -0.084 0.002 20.341
13.375 -0.126 -0.002 20.111
13.625 -0.138 0.009 19.601
13.875 -0.111 -0.013 19.426
14.125 -0.143 -0.017 18.767
14.375 -0.062 -0.014 18.434
14.625 -0.109 -0.024 18.128
14.875 -0.086 -0.030 17.551
15.125 -0.059 0.012 17.315
15.375 -0.044 0.001 17.056
15.625 -0.008 -0.006 16.455
15.875 -0.060 0.008 15.854
16.125 -0.047 0.004 14.861
16.375 -0.040 -0.000 14.827
16.625 -0.038 0.035 14.153
16.875 -0.030 0.025 13.604
17.125 -0.044 0.054 13.085
17.375 -0.061 0.070 12.845
17.625 -0.057 0.054 12.126
17.875 -0.069 0.051 11.904
18.125 -0.072 0.053 11.430
18.375 -0.066 0.015 10.717
18.625 -0.079 0.021 10.553
18.875 -0.055 0.011 10.021
19.125 -0.063 -0.003 9.204
19.375 -0.073 0.004 9.500
19.625 -0.033 -0.013 8.900
19.875 -0.053 -0.015 8.524
