0.05000 2357.54484
0.15000 4201.93877
0.25000 6074.14342
0.35000 7555.32665
0.45000 8718.86136
0.55000 9574.07795
0.65000 10138.09436
0.75000 10219.90864
0.85000 10055.56686
0.95000 9901.73918
1.05000 9715.55632
1.15000 9335.25092
1.25000 8972.58803
1.35000 8535.60030
1.45000 8148.61304
1.55000 7701.59326
1.65000 7325.69761
1.75000 7011.38544
1.85000 6592.14504
1.95000 6406.77679
2.05000 6120.65148
2.15000 5849.12088
2.25000 5533.44188
2.35000 5333.44098
2.45000 5072.51143
2.55000 4884.01938
2.65000 4695.71550
2.75000 4487.93521
2.85000 4314.92388
2.95000 4124.54040
3.05000 4082.19605
3.15000 3935.99230
3.25000 3761.01958
3.35000 3624.43178
3.45000 3483.54811
3.55000 3328.29558
3.65000 3244.70816
3.75000 3163.91824
3.85000 3045.05199
3.95000 2923.92779
4.05000 2864.69635
4.15000 2761.32277
4.25000 2662.57310
4.35000 2569.44434
4.45000 2484.99244
4.55000 2392.01970
4.65000 2353.95321
4.75000 2247.50974
4.85000 2125.62129
4.95000 1985.95251
5.05000 1902.52198
5.15000 1819.22693
5.25000 1758.79610
5.35000 1698.95331
5.45000 1618.14596
5.55000 1534.69107
5.65000 1505.93772
5.75000 1445.70249
5.85000 1407.67151
5.95000 1359.53273
6.05000 1305.77931
6.15000 1244.69766
6.25000 1239.59523
6.35000 1214.11734
6.45000 1174.21082
6.55000 1146.82160
6.65000 1121.36220
6.75000 1108.19517
6.85000 1055.02991
6.95000 1033.36126
7.05000 1015.95414
7.15000 999.42388
7.25000 972.94371
7.35000 953.33860
7.45000 935.21533
7.55000 906.55811
7.65000 867.39934
7.75000 855.86548
7.85000 839.28660
7.95000 817.17159
8.05000 789.69649
8.15000 793.58733
8.25000 755.44015
8.35000 730.96814
8.45000 716.89803
8.55000 699.20046
8.65000 672.97153
8.75000 647.36978
8.85000 633.17252
8.95000 628.44671
9.05000 609.81988
9.15000 592.80175
9.25000 587.81988
9.35000 568.99235
9.45000 547.49421
9.55000 540.27168
9.65000 538.90292
9.75000 532.66635
9.85000 509.29055
9.95000 515.93349
10.05000 502.65826
10.15000 492.28620
10.25000 477.32021
10.35000 468.32578
10.45000 465.16505
10.55000 441.55008
10.65000 448.54837
10.75000 445.86458
10.85000 427.57300
10.95000 418.74928
11.05000 410.12099
11.15000 402.01309
11.25000 399.98908
11.35000 390.88439
11.45000 383.18292
11.55000 370.98672
11.65000 369.37888
11.75000 361.61957
11.85000 357.25802
11.95000 338.17231
12.05000 343.32460
12.15000 338.31455
12.25000 329.24780
12.35000 314.98117
12.45000 317.57744
12.55000 315.62559
12.65000 302.83684
12.75000 299.65913
12.85000 283.69138
12.95000 279.09171
13.05000 274.14273
13.15000 278.74104
13.25000 265.34396
13.35000 255.55726
13.45000 247.44251
13.55000 252.52353
13.65000 237.69348
13.75000 232.95431
13.85000 230.82049
13.95000 222.06645
14.05000 221.66991
14.15000 213.29394
14.25000 214.14740
14.35000 199.94945
14.45000 195.51729
14.55000 191.89351
14.65000 195.81484
14.75000 190.34602
14.85000 176.79034
14.95000 172.02568
15.05000 175.42131
15.15000 171.85336
15.25000 168.67122
15.35000 165.12334
15.45000 169.76083
15.55000 159.11489
15.65000 151.12304
15.75000 149.47460
15.85000 153.70154
15.95000 144.29869
16.05000 143.16799
16.15000 138.66789
16.25000 139.56734
16.35000 135.55638
16.45000 132.87243
16.55000 125.86735
16.65000 129.78816
16.75000 123.84698
16.85000 117.71042
16.95000 116.31219
17.05000 117.75453
17.15000 115.52553
17.25000 111.87447
17.35000 110.18077
17.45000 107.25210
17.55000 105.33214
17.65000 107.90691
17.75000 102.08513
17.85000 93.56560
17.95000 104.85937
18.05000 101.49826
18.15000 94.64041
18.25000 102.22939
18.35000 95.09026
18.45000 93.27903
18.55000 92.07724
18.65000 92.44225
18.75000 93.61396
18.85000 87.24926
18.95000 89.04809
19.05000 83.78185
19.15000 83.69147
19.25000 83.99488
19.35000 80.88336
19.45000 75.60352
19.55000 70.30735
19.65000 71.62419
19.75000 79.62259
19.85000 80.44879
19.95000 70.26344
