0.05000 1487.79700
0.15000 2214.80084
0.25000 3351.11966
0.35000 4271.35858
0.45000 4871.20957
0.55000 5306.54722
0.65000 5536.83438
0.75000 5673.08704
0.85000 5889.30267
0.95000 5864.56521
1.05000 5879.05885
1.15000 5808.21256
1.25000 5729.81797
1.35000 5556.23360
1.45000 5448.15183
1.55000 5357.19264
1.65000 5194.95784
1.75000 5029.60140
1.85000 4890.90700
1.95000 4722.47876
2.05000 4629.44763
2.15000 4457.84654
2.25000 4320.35114
2.35000 4178.28995
2.45000 4172.93331
2.55000 4057.12690
2.65000 3948.62103
2.75000 3779.93780
2.85000 3669.70487
2.95000 3624.03749
3.05000 3496.30568
3.15000 3405.78078
3.25000 3317.62408
3.35000 3231.76001
3.45000 3129.20876
3.55000 3021.03421
3.65000 2973.85496
3.75000 2884.73822
3.85000 2807.28890
3.95000 2727.47534
4.05000 2645.58735
4.15000 2598.41776
4.25000 2494.50552
4.35000 2472.55328
4.45000 2383.77184
4.55000 2301.00465
4.65000 2258.18649
4.75000 2218.80452
4.85000 2149.56724
4.95000 2073.90411
5.05000 2028.76679
5.15000 1976.45191
5.25000 1946.87819
5.35000 1856.55365
5.45000 1826.78505
5.55000 1799.27985
5.65000 1743.62867
5.75000 1710.29494
5.85000 1663.90106
5.95000 1624.37690
6.05000 1562.67503
6.15000 1534.59322
6.25000 1511.49774
6.35000 1472.72554
6.45000 1441.04886
6.55000 1396.64857
6.65000 1363.59522
6.75000 1345.32966
6.85000 1301.52196
6.95000 1271.23610
7.05000 1247.48586
7.15000 1220.64619
7.25000 1194.87989
7.35000 1154.69003
7.45000 1133.41812
7.55000 1123.60744
7.65000 1102.66380
7.75000 1071.34460
7.85000 1033.33624
7.95000 1019.77021
8.05000 1021.43987
8.15000 979.87887
8.25000 949.87030
8.35000 933.10917
8.45000 919.48130
8.55000 902.42205
8.65000 867.07297
8.75000 850.18712
8.85000 839.56564
8.95000 816.12203
9.05000 811.09766
9.15000 781.85602
9.25000 758.84439
9.35000 742.24053
9.45000 728.25266
9.55000 708.84423
9.65000 698.24089
9.75000 685.84693
9.85000 667.27270
9.95000 668.91536
10.05000 640.46489
10.15000 622.64952
10.25000 602.70996
10.35000 606.19665
10.45000 587.03230
10.55000 568.80108
10.65000 561.12003
10.75000 551.93235
10.85000 530.53504
10.95000 526.03241
11.05000 505.13507
11.15000 502.05850
11.25000 492.14508
11.35000 471.77263
11.45000 474.17250
11.55000 456.65854
11.65000 447.45478
11.75000 450.10704
11.85000 439.07564
11.95000 424.71661
12.05000 417.51908
12.15000 415.17815
12.25000 404.14543
12.35000 393.85380
12.45000 383.68028
12.55000 376.58103
12.65000 371.29113
12.75000 361.02576
12.85000 350.44862
12.95000 355.47402
13.05000 355.07777
13.15000 339.34185
13.25000 332.07987
13.35000 333.81607
13.45000 324.51366
13.55000 317.99652
13.65000 318.95068
13.75000 303.04511
13.85000 301.81541
13.95000 298.97763
14.05000 283.52796
14.15000 281.17543
14.25000 277.62517
14.35000 277.66387
14.45000 271.15244
14.55000 262.94904
14.65000 256.90905
14.75000 250.38972
14.85000 248.33928
14.95000 241.60592
15.05000 239.98210
15.15000 234.04063
15.25000 230.84555
15.35000 232.50414
15.45000 224.77483
15.55000 223.85127
15.65000 212.25118
15.75000 206.49156
15.85000 210.48334
15.95000 208.06423
16.05000 199.45280
16.15000 194.01531
16.25000 198.04789
16.35000 182.56336
16.45000 176.36925
16.55000 180.74768
16.65000 173.86071
16.75000 178.71055
16.85000 175.30533
16.95000 168.08902
17.05000 156.85590
17.15000 155.97120
17.25000 161.38032
17.35000 156.92727
17.45000 155.55844
17.55000 144.46548
17.65000 149.11207
17.75000 150.70107
17.85000 148.91620
17.95000 144.83743
18.05000 142.16851
18.15000 133.46810
18.25000 135.04757
18.35000 130.89355
18.45000 132.44603
18.55000 128.08985
18.65000 124.82065
18.75000 127.74608
18.85000 116.77421
18.95000 119.83082
19.05000 126.16664
19.15000 121.04516
19.25000 116.77440
19.35000 112.94487
19.45000 113.86147
19.55000 108.66217
19.65000 112.49086
19.75000 103.32826
19.85000 111.06673
19.95000 110.39017
