0.120000 0.398160
0.380000 -1.666700
0.620000 -1.858680
0.880000 -1.887840
1.120000 -1.943610
1.380000 -1.920760
1.620000 -1.984940
1.880000 -1.990320
2.120000 -2.017820
2.380000 -2.002890
2.620000 -1.953750
2.880000 -2.042440
3.120000 -2.117000
3.380000 -2.023640
3.620000 -2.083600
3.880000 -2.108540
4.120000 -2.053060
4.380000 -2.066290
4.620000 -2.162680
4.880000 -2.190690
5.120000 -2.320470
5.380000 -2.461630
5.620000 -2.596650
5.880000 -2.439830
6.120000 -2.470180
6.380000 -2.589390
6.620000 -2.668690
6.880000 -2.729910
7.120000 -2.467310
7.380000 -2.879070
7.620000 -2.814130
7.880000 -2.613020
8.120000 -2.772990
8.380000 -2.560260
8.620000 -2.790190
8.880000 -2.840360
9.120000 3.093640
9.380000 2.658980
9.620000 2.334350
9.880000 1.830860
10.120000 1.151550
10.380000 0.856340
10.620000 1.058110
10.880000 0.836270
11.120000 0.551770
11.380000 0.387840
11.620000 0.244290
11.880000 -0.230450
12.120000 -0.633800
12.380000 -0.559320
12.620000 -1.200750
12.880000 -1.905450
13.120000 -2.539180
13.380000 3.122140
13.620000 3.118670
13.880000 1.877610
14.120000 2.710950
14.380000 2.293350
14.620000 -0.267880
14.880000 0.079000
