0.1875 1.19713 15.16532 -2.03542 115.09022 114.81557 94.77273
0.5625 0.05506 32.69899 -1.91923 115.54929 110.4939 90.82324
0.9375 0.86756 50.86445 -1.15081 114.52589 103.74674 86.47988
1.3125 0.39001 61.61222 -1.09504 115.49649 95.80426 80.87668
1.6875 -0.41995 71.65099 -2.58882 113.77824 89.63266 77.68354
2.0625 -1.10347 76.23677 -1.09721 112.69136 85.72103 73.36177
2.4375 1.60844 82.10859 -0.56668 109.51104 81.37231 70.62261
2.8125 -0.21433 86.28162 -1.77013 107.08327 76.67121 67.05088
3.1875 -0.64013 89.14243 -1.4841 103.96187 72.85939 65.00926
3.5625 -0.38855 92.25672 -0.03652 100.12241 70.01982 62.25357
3.9375 -0.10245 94.47943 0.1959 95.70864 68.16948 60.00705
4.3125 1.43144 102.34313 -0.74276 91.08774 65.90009 59.22778
4.6875 0.18932 106.83175 0.19157 85.61837 65.11288 56.49658
5.0625 3.24218 112.27347 -0.04182 79.28461 63.2194 54.67678
5.4375 -1.02131 119.91002 1.20514 71.46884 63.59142 52.18324
5.8125 -0.00995 127.9368 0.71294 66.23922 61.7807 50.01813
6.1875 0.33438 138.18889 3.07201 60.50569 60.7509 46.71228
6.5625 -0.36397 149.40976 3.09043 55.04359 59.37458 43.10995
6.9375 -0.71152 160.00716 2.70077 48.82239 55.36794 39.70797
7.3125 -1.25274 168.24195 3.97514 43.85283 50.53153 36.70668
7.6875 -1.2023 176.03537 2.02356 39.72126 42.49553 33.95041
8.0625 -1.1831 181.19554 0.69243 36.89297 35.79601 32.14486
8.4375 -0.81918 182.9647 0.72146 34.68628 31.42206 30.80989
8.8125 -0.0978 185.90223 -0.77259 32.49249 29.05889 30.1317
9.1875 -0.35027 188.73771 0.62218 31.42026 27.83912 28.0682
9.5625 -0.35533 190.95518 1.28614 30.0651 26.3972 27.46311
9.9375 0.03016 194.27105 2.00826 29.20205 24.74855 26.47799
10.3125 -0.20385 195.48963 2.31487 28.85743 23.35972 25.29178
10.6875 -0.2021 197.2025 1.68728 27.53465 21.9606 24.88841
11.0625 -1.18512 198.49629 2.49947 26.64786 20.05377 23.27286
11.4375 -0.73198 198.42071 1.6625 26.40569 19.63671 22.58022
11.8125 -0.497 199.38846 2.55699 25.34644 18.56148 22.23184
12.1875 -0.51474 199.50672 1.21919 24.30121 18.34697 21.59645
12.5625 0.25756 199.45362 1.50807 23.68549 17.35967 21.12452
12.9375 -0.72357 199.33907 1.49441 23.09718 16.89325 20.73021
13.3125 -0.45389 199.58567 1.09412 22.42167 16.89072 19.4727
13.6875 -1.61964 198.58745 0.45847 22.69104 16.31072 18.89553
14.0625 0.11566 199.08354 0.03258 20.36414 15.65926 18.27177
14.4375 -2.29319 200.48288 -0.14734 20.64761 15.31614 17.78588
14.8125 -2.00753 200.33654 -1.50778 18.80829 15.98509 17.17389
15.1875 -2.04929 200.53717 -1.94767 20.20327 14.63528 16.62271
15.5625 -2.22109 202.6588 -2.87407 17.47058 15.11988 16.37983
15.9375 -1.98099 203.49989 -2.22835 17.94111 14.97859 15.99829
16.3125 -0.66757 204.22414 -0.84984 17.63863 15.9015 17.34448
16.6875 1.00502 205.85027 -1.20467 17.6705 14.18562 17.97778
17.0625 2.04263 206.13469 -1.27142 17.0034 13.87052 17.48214
17.4375 1.86883 205.91902 -0.64858 17.57081 12.79464 17.81116
17.8125 1.46111 205.93697 -0.37235 17.79565 11.52985 19.09325
18.1875 0.50355 204.59222 0.06681 17.63073 10.45582 18.716
18.5625 0.33286 203.14413 0.15678 17.19978 10.37778 18.2728
18.9375 1.10352 202.14203 0.82123 17.40409 9.87042 18.28796
19.3125 1.09407 201.33364 1.41789 18.09393 9.5756 17.54033
19.6875 1.11029 200.47573 3.3048 16.50521 10.11387 16.99635
20.0625 0.3818 198.69825 3.7352 15.30942 10.29573 16.263
20.4375 0.13234 199.24241 2.65964 15.10157 10.77969 16.39738
20.8125 1.77589 197.24495 1.22631 14.98571 11.22147 15.92057
21.1875 -1.21198 198.89032 3.86699 14.8676 10.41207 16.7931
21.5625 -0.49294 200.23313 -0.15536 12.67362 10.92029 16.01613
21.9375 -0.07875 201.4834 0.92631 12.87409 10.78028 16.21125
22.3125 -2.98462 201.83554 -1.05583 12.87493 9.88395 15.42639
22.6875 -0.38717 203.47102 0.43094 13.09777 9.12687 15.78635
23.0625 -2.14104 202.62347 0.3972 13.36896 8.43104 14.05753
23.4375 2.64143 201.25401 0.15315 10.1619 9.41192 12.27169
23.8125 -2.55404 202.99769 -0.01352 12.30642 7.12038 12.78977
24.1875 -0.40876 201.45233 0.24484 10.0362 8.21273 11.665
24.5625 -2.90796 197.76691 -4.8122 11.11407 8.78684 12.32221
24.9375 -2.33589 198.70205 -1.70379 10.44913 7.46887 12.77823
25.3125 -1.19368 201.39941 0.1459 9.76938 6.88817 13.15265
25.6875 0.47199 201.52899 -0.022 9.84287 5.96268 13.32346
26.0625 -0.33595 200.8124 0.86948 7.58025 7.09213 11.50311
26.4375 -2.59238 200.49309 1.24046 9.62887 6.21458 10.64441
26.8125 -0.15739 200.63809 0.57475 9.75665 5.66954 10.65056
27.1875 0.53758 200.23029 -0.03581 10.55903 6.24587 9.5656
27.5625 -0.25941 196.43509 -0.79127 8.91788 5.83976 10.13173
27.9375 -1.29631 199.34601 -1.30529 8.80214 5.77541 8.42703
28.3125 0.84106 197.6306 0.47102 9.9171 6.94665 8.25786
28.6875 2.26798 199.335 -2.63242 14.69232 8.04127 7.77901
29.0625 0.99272 197.06111 1.58047 5.71115 5.27993 9.10699
29.4375 -0.04282 199.78269 2.43517 10.33161 6.93915 7.97432
29.8125 5.4906 200.02812 -0.43223 10.5843 6.29214 10.08521
