0.05000 -1640.99955 -52.28831 204027.05697 1182.49491 1336.82712 822781.70350
0.15000 -3061.30610 103.91624 -22653.64026 1456.74106 1071.97919 378689.20957
0.25000 -4683.95939 197.40017 16734.82607 1130.79525 936.55822 360135.74405
0.35000 -5718.57892 211.41593 11439.58514 1094.67528 805.67753 387088.29391
0.45000 -6448.24562 226.14189 8835.20509 1144.20524 705.37684 338561.34898
0.55000 -6894.71624 227.20034 -19086.25329 1203.30482 655.48140 359553.83488
0.65000 -7203.47856 204.09999 -2142.68262 1251.88849 548.80058 362167.35518
0.75000 -7475.81515 221.09622 2291.04567 1301.39230 501.58136 334802.11307
0.85000 -7586.30043 223.27419 -11461.70790 1288.37646 484.04773 302115.70908
0.95000 -7763.96776 222.27028 -4778.36696 1312.61250 447.45349 303723.84371
1.05000 -7837.31635 227.98465 156.20430 1295.26793 451.66807 306755.27307
1.15000 -7992.66720 229.62993 -2247.14793 1279.02785 432.92113 269792.74464
1.25000 -7997.78437 234.55353 3219.38713 1208.88073 429.12414 271696.43450
1.35000 -8034.72865 232.02120 3277.75821 1156.06298 424.30235 242514.76307
1.45000 -8032.65415 236.48870 8515.16778 1079.80000 437.58834 246911.81786
1.55000 -8026.58118 244.70108 -1232.79334 1025.52211 430.28419 257402.11371
1.65000 -8064.57843 243.91558 -1696.04309 961.23853 426.54976 232353.41627
1.75000 -8069.60734 238.14829 874.52630 892.45172 404.37112 232941.50375
1.85000 -8072.34323 242.82487 282.29949 827.16471 404.83106 222968.72911
1.95000 -8051.83297 248.40926 2859.37356 766.78120 400.93625 199317.66134
2.05000 -8029.47789 231.88827 -272.24800 710.82895 397.97611 196861.64092
2.15000 -8011.67222 237.34831 2220.95014 650.16394 393.27956 199760.90337
2.25000 -7977.99721 239.59617 80.62070 610.47401 388.43215 195007.19814
2.35000 -7910.48610 240.93589 288.33277 558.47182 393.72946 174215.13840
2.45000 -7864.48165 231.85730 -607.64774 519.81589 395.91813 179684.87491
2.55000 -7823.20264 238.61851 -1735.66932 475.34452 385.03638 159209.39812
2.65000 -7778.06861 242.10205 3634.14586 432.79515 379.49498 182425.99410
2.75000 -7744.93780 230.73141 -1791.98401 396.71680 376.72138 158470.18379
2.85000 -7715.05310 226.21443 2472.14406 367.19286 370.37160 149407.65332
2.95000 -7672.27989 228.88279 446.89344 327.27469 363.22050 153457.88220
3.05000 -7637.20904 224.50850 3283.85967 313.66174 350.44810 135885.25428
3.15000 -7596.42341 215.65752 665.28615 294.95603 339.80822 136561.95556
3.25000 -7554.89833 212.47623 1126.99543 279.67727 327.44301 140592.47319
3.35000 -7518.19535 220.28642 797.15829 272.37841 311.67357 124818.16649
3.45000 -7476.65221 207.68931 1045.25516 274.04411 294.52604 124311.58615
3.55000 -7433.53302 202.90343 2261.13434 268.11409 286.79114 113498.42512
3.65000 -7391.01777 203.23552 1592.51159 260.56493 275.66834 115449.53312
3.75000 -7332.47183 201.07252 2509.50304 257.50781 260.33595 107913.27409
3.85000 -7272.64034 193.51064 1240.29891 247.23172 247.11790 120870.00269
3.95000 -7214.87624 190.74742 3613.84233 245.60800 238.65147 107081.06907
4.05000 -7159.06208 185.77750 1269.85133 231.62806 226.61797 104038.38484
4.15000 -7113.98278 182.17792 -306.28087 224.25765 214.48606 101479.03386
4.25000 -7062.17316 180.56054 209.99684 214.97419 203.52729 96990.45634
4.35000 -7017.88216 180.05525 -523.75575 209.08947 191.12562 93918.58894
4.45000 -6952.74133 171.32113 1588.06438 203.18370 186.48392 89726.86231
4.55000 -6908.16902 166.90202 378.39433 189.25083 176.20585 98372.66065
4.65000 -6864.49660 165.30660 -687.50611 181.15123 166.41300 105597.11509
4.75000 -6821.52264 159.87784 -272.82574 170.92304 157.51552 78586.59773
4.85000 -6777.66055 162.52351 1591.23029 163.96269 153.30891 80573.83005
4.95000 -6727.26933 157.37596 -148.11710 164.73193 147.65826 71921.36021
5.05000 -6683.97426 156.88402 -121.86570 162.83938 140.94659 74470.55067
5.15000 -6633.12833 152.09273 402.02347 158.51821 134.44642 71555.30489
5.25000 -6582.08851 148.05682 -145.56465 152.98219 131.56308 67161.66318
5.35000 -6546.14947 149.20348 -2385.10411 148.15889 127.27807 70486.97977
5.45000 -6503.19465 145.02460 394.27879 140.78873 123.22959 63941.35763
5.55000 -6464.49359 141.19536 -254.83886 138.26287 122.62848 63195.36826
5.65000 -6419.93717 142.31322 -930.78661 137.38435 118.08557 73474.75631
5.75000 -6371.89424 140.01855 -877.21231 131.40610 115.20879 61966.50355
5.85000 -6326.74394 138.49648 -1126.52768 127.14836 111.06250 59915.44576
5.95000 -6278.22132 131.63035 360.18125 120.72079 110.53078 57753.70108
6.05000 -6235.17160 130.19347 -52.67870 120.13588 109.49639 63862.17140
6.15000 -6189.49204 131.25463 954.08271 114.98950 105.19192 54157.49651
6.25000 -6145.54669 128.49070 -483.78228 109.92265 103.73157 50515.50869
6.35000 -6102.79377 126.85115 99.84801 107.44101 101.80609 61511.32233
6.45000 -6063.13122 122.19032 -475.95545 108.05140 97.56086 46924.73370
6.55000 -6020.23726 122.86696 -48.78201 109.58026 97.67547 54087.59077
6.65000 -5977.16602 120.23477 -787.43163 109.88143 93.57748 49017.16306
6.75000 -5931.58483 116.93783 2023.01358 112.18963 92.23936 46370.71972
6.85000 -5888.13512 116.49845 280.42045 108.93679 89.85145 40367.05566
6.95000 -5844.67487 114.54976 271.12593 107.09142 86.84118 44345.82514
7.05000 -5795.09960 111.25223 -551.55439 102.38222 85.04100 42619.11310
7.15000 -5750.56686 108.86531 -1111.13549 99.51018 80.44179 43326.71061
7.25000 -5713.75485 108.97821 -647.67760 97.79406 79.17779 39533.96962
7.35000 -5669.48808 107.46006 -222.30857 99.95450 76.61500 35006.74471
7.45000 -5627.40291 103.55800 3.91268 101.61670 75.39228 34943.16919
7.55000 -5586.54846 102.33314 55.23004 98.01494 71.12327 34159.88801
7.65000 -5538.62093 101.23279 -770.30306 94.29455 68.56431 32158.38950
7.75000 -5493.57475 100.03459 -87.60365 89.03010 67.74107 30244.79732
7.85000 -5452.61990 97.96228 30.70092 83.87280 66.11790 34086.14191
7.95000 -5405.80614 96.63600 12.97723 85.78393 65.35584 29980.56789
8.05000 -5361.29734 94.28116 392.42871 84.49992 63.77952 27024.35956
8.15000 -5314.61344 93.13143 -673.54937 85.90998 63.72606 29409.92285
8.25000 -5270.99385 90.77946 -431.31119 82.22155 62.47967 28326.67313
8.35000 -5228.89680 88.96994 25.86355 79.67151 62.64097 27208.52813
8.45000 -5190.51701 87.81885 -630.93342 76.71927 63.60045 29454.58283
8.55000 -5148.04095 86.99380 -377.29356 74.55816 62.47331 28676.20515
8.65000 -5109.25967 84.80798 -395.10829 76.36197 60.99273 28390.47296
8.75000 -5068.95017 83.27413 -19.65412 75.77924 61.72068 23924.36858
8.85000 -5029.16006 83.88054 -197.36494 75.71769 60.08059 23376.51631
8.95000 -4993.41403 79.97836 -325.06746 79.53098 58.55242 29618.70536
9.05000 -4953.03748 79.75416 -339.58496 76.91304 58.65496 20602.57205
9.15000 -4913.62793 78.16501 -257.26785 75.10790 58.10123 24632.39675
9.25000 -4876.53825 78.46978 16.93491 75.05331 58.34963 24326.17475
9.35000 -4842.26899 77.32837 -345.15102 71.87495 57.98414 22014.80396
9.45000 -4805.84133 74.49300 218.17997 71.10937 57.32315 21528.94390
9.55000 -4772.97878 73.34983 33.04600 68.29781 56.30203 19404.84312
9.65000 -4735.31748 73.21527 -106.59491 65.47862 54.66847 20432.80505
9.75000 -4700.64297 70.64040 -381.02810 64.62538 55.26077 19881.14787
9.85000 -4665.05436 69.97681 -186.62325 62.30410 54.39377 19459.97274
9.95000 -4627.53711 67.25154 -405.42089 63.77580 53.98027 24110.65826
10.05000 -4592.02487 68.93684 -89.84390 63.07788 52.87791 18163.41258
10.15000 -4559.90234 65.89300 -51.37047 63.84874 52.38594 16801.69294
10.25000 -4528.53956 65.72539 -383.67794 65.38905 50.39608 16104.49286
10.35000 -4494.61584 65.39281 -275.13424 66.56627 49.15199 16377.70301
10.45000 -4457.25014 63.43244 93.50231 67.45776 48.10397 15352.26089
10.55000 -4423.62076 61.31091 -266.09457 64.67363 47.84501 14364.97563
10.65000 -4386.69243 62.43202 -244.91760 62.46359 46.09688 13364.15776
10.75000 -4354.79215 60.82692 -960.31806 59.87831 47.02042 39920.86500
10.85000 -4323.32092 60.11409 -289.88488 61.20815 46.47863 16084.98782
10.95000 -4292.55212 60.16764 -679.09109 62.77916 47.43965 16165.62607
11.05000 -4258.07033 58.84468 22.94812 60.30814 45.41341 14656.71170
11.15000 -4227.62806 57.37025 -699.57762 63.07597 45.18513 14640.90982
11.25000 -4193.15983 57.16287 155.84322 60.91473 45.27616 13726.17935
11.35000 -4159.71774 55.54154 36.01863 60.26009 43.35146 12077.21530
11.45000 -4129.62122 56.28680 149.87369 59.50022 43.38786 11014.38045
11.55000 -4097.32723 53.75322 138.54971 57.15990 43.08817 12014.15613
11.65000 -4068.63339 53.14254 -170.43071 56.58325 43.85605 10506.08795
11.75000 -4036.00617 52.46145 -114.68055 56.09888 42.00781 10102.13287
11.85000 -4003.33601 52.66765 -214.10643 54.96935 42.28012 11460.15557
11.95000 -3970.25113 49.89993 -274.24518 52.83660 41.92225 10562.57124
12.05000 -3937.91605 50.50497 36.90808 53.37190 42.06422 12250.12715
12.15000 -3905.57839 48.66119 -140.05282 51.81943 39.97064 10085.53097
12.25000 -3877.47738 48.13269 -454.88612 51.12952 41.70312 10023.22290
12.35000 -3846.91718 47.71576 120.01078 51.00506 39.56970 9873.87726
12.45000 -3818.38851 47.63122 -360.30271 51.07561 38.69016 8395.30761
12.55000 -3789.26865 47.09667 35.99123 51.72516 39.58703 8557.35521
12.65000 -3761.27091 45.07447 -5.68398 49.48770 38.86554 9149.08667
12.75000 -3731.68229 45.73302 -245.62982 48.06686 39.24060 9038.80833
12.85000 -3704.46365 43.51279 336.46323 47.01162 38.34649 22353.69054
12.95000 -3677.99209 45.66738 129.40983 47.79285 37.51630 8800.30157
13.05000 -3654.50423 43.16348 -285.40134 44.97056 38.68792 7903.70589
13.15000 -3629.79971 42.62438 -28.18471 44.54508 38.10256 7938.80812
13.25000 -3604.40580 42.32687 -309.71425 44.23635 37.58343 6701.16019
13.35000 -3578.08764 40.93988 214.91873 44.77436 36.07335 6645.31714
13.45000 -3551.09408 40.56832 -275.61077 43.39538 35.74188 7679.68214
13.55000 -3525.93466 39.27801 67.00382 42.76422 35.75103 6462.13337
13.65000 -3502.69974 40.56638 -15.76947 42.84542 36.40076 6976.08196
13.75000 -3477.27384 37.82600 -267.90493 41.26945 35.30827 7777.97054
13.85000 -3453.24695 37.45974 -78.54431 39.41423 34.91840 6567.44146
13.95000 -3429.62438 36.66713 -222.47269 38.23659 34.79343 6873.66176
14.05000 -3405.48743 37.15601 132.96667 39.42296 35.15828 7382.55832
14.15000 -3383.03517 38.06324 -233.67322 36.05757 34.52878 5911.41968
14.25000 -3359.17905 34.63657 -5.52614 36.52290 34.74710 6105.53027
14.35000 -3336.34458 35.79290 176.20595 39.90566 34.83262 6074.61342
14.45000 -3314.40709 33.06268 118.20011 37.95193 35.15771 5737.64449
14.55000 -3289.63533 34.18899 -52.60594 38.42951 36.30316 4817.76385
14.65000 -3270.51463 32.79332 -51.82817 39.31786 34.56979 6333.89479
14.75000 -3242.78222 33.95931 183.11770 38.84854 33.65009 6018.25235
14.85000 -3220.20945 34.44995 -129.00964 38.72483 32.84869 4948.39865
14.95000 -3199.06513 32.62411 66.68971 36.57931 34.36097 4878.24791
15.05000 -3174.72813 32.87071 -16.83792 35.81346 32.25835 5751.12739
15.15000 -3153.45488 30.53391 70.05515 35.81946 32.33073 5306.63954
15.25000 -3129.53865 31.08814 -96.41231 36.96807 32.50194 4515.56592
15.35000 -3110.27517 31.91287 -75.91053 37.12435 32.41402 3660.07879
15.45000 -3086.97173 28.73641 54.01180 36.16136 31.76576 5908.17191
15.55000 -3065.18922 30.88183 -134.20117 35.85592 30.58350 4137.98950
15.65000 -3043.79694 29.91818 -46.09764 36.54855 30.32024 4112.34759
15.75000 -3020.92265 28.24516 40.67052 36.87107 30.90168 4767.02866
15.85000 -3002.83503 29.53076 21.13711 35.26148 28.19227 4697.69511
15.95000 -2982.32529 29.60354 -172.46278 35.17636 30.02957 3873.89005
16.05000 -2964.44157 27.95551 141.25943 34.20531 30.82871 4208.00471
16.15000 -2947.31857 28.47645 308.72992 34.76980 30.24750 3928.91969
16.25000 -2927.72355 27.18220 20.43466 33.86929 29.38428 3981.53174
16.35000 -2908.78843 27.49692 82.89287 32.28943 28.34781 3393.40050
16.45000 -2889.46622 27.24144 106.70884 30.43254 28.80169 3224.38084
16.55000 -2870.73327 27.65750 7.11683 30.43787 28.95083 4086.57464
16.65000 -2854.29826 27.19556 -53.08061 30.44408 28.83138 2869.89202
16.75000 -2833.93786 25.31446 -47.59626 29.53678 29.02257 3285.84891
16.85000 -2815.43847 26.79857 58.90803 30.23000 27.27788 2802.82464
16.95000 -2798.30069 24.96426 -37.79685 27.87575 27.04560 3092.03292
17.05000 -2780.46939 25.85041 91.23576 30.00740 28.26242 3868.71100
17.15000 -2764.05765 24.83354 47.10924 29.72943 27.77364 3358.68108
17.25000 -2744.89747 25.36423 -95.21130 28.88547 28.28461 2826.40804
17.35000 -2729.29474 23.87542 62.61360 27.62732 26.79332 2573.00080
17.45000 -2713.06880 23.89152 -37.70769 27.09668 25.78068 4055.52289
17.55000 -2698.47310 24.24354 -51.56612 27.57071 27.79749 2672.95524
17.65000 -2680.44669 24.29214 162.94523 28.91125 27.80769 3913.69133
17.75000 -2663.06251 22.74953 -70.40296 26.71545 25.90289 3187.01443
17.85000 -2648.07126 22.82729 126.48482 26.58086 26.26491 2875.84093
17.95000 -2631.06970 22.58672 -86.96300 27.36295 26.14391 2460.11160
18.05000 -2615.81915 24.26543 33.47693 27.40868 26.11742 2993.01404
18.15000 -2600.12862 21.54722 -25.31726 26.44964 26.30092 2081.78915
18.25000 -2584.56799 23.96144 -103.86706 26.70968 25.40508 2649.78346
18.35000 -2570.55805 22.18928 234.48428 28.03046 26.18288 2447.82233
18.45000 -2553.87160 22.71706 -14.61748 26.34926 24.74489 2128.55887
18.55000 -2538.79207 20.03999 9.17483 27.08936 24.50873 2442.35774
18.65000 -2524.10203 21.12001 -26.29780 28.26319 25.45145 3229.71884
18.75000 -2509.09884 20.95478 39.46293 25.84974 24.59194 1998.66924
18.85000 -2493.89934 20.47861 -80.54415 25.57216 23.76804 1734.32026
18.95000 -2477.47434 20.27133 44.92213 27.02743 23.41158 2470.46293
19.05000 -2463.93154 21.05905 -4.60337 26.78871 24.48003 1866.29463
19.15000 -2447.61485 18.32130 12.58583 25.42876 24.11604 2027.57506
19.25000 -2430.76855 20.39666 -8.23066 26.59390 24.97348 2850.79545
19.35000 -2418.36425 17.93478 45.28684 26.98674 24.45264 1954.79808
19.45000 -2400.55273 19.04560 178.23026 26.57425 24.38947 2379.76492
19.55000 -2388.73304 18.96404 -47.83768 26.28896 24.33122 1941.97348
19.65000 -2373.46387 20.44076 84.54029 27.53387 23.91077 1797.29523
19.75000 -2361.39739 20.03020 11.50312 28.66587 24.59691 1758.62820
19.85000 -2345.82587 22.35924 144.21914 27.03791 25.28532 2090.31262
19.95000 -2330.07603 28.10950 8.57060 26.03414 24.89393 2322.41589
