0.10101 0.26786 0.50876
0.30303 0.19007 0.26917
0.50505 0.12754 0.13809
0.70707 0.09266 0.08009
0.90909 0.07258 0.05049
1.11111 0.05784 0.03434
1.31313 0.04919 0.02478
1.51515 0.04138 0.01832
1.71717 0.03526 0.01398
1.91919 0.03060 0.01108
2.12121 0.02743 0.00891
2.32323 0.02401 0.00729
2.52525 0.02252 0.00617
2.72727 0.02055 0.00524
2.92929 0.01908 0.00460
3.13131 0.01783 0.00402
3.33333 0.01699 0.00356
3.53535 0.01636 0.00321
3.73737 0.01559 0.00285
3.93939 0.01512 0.00264
4.14141 0.01457 0.00239
4.34343 0.01424 0.00223
4.54545 0.01371 0.00204
4.74747 0.01299 0.00187
4.94949 0.01249 0.00172
5.15152 0.01177 0.00155
5.35354 0.01118 0.00141
5.55556 0.01080 0.00132
5.75758 0.01006 0.00119
5.95960 0.00961 0.00108
6.16162 0.00923 0.00101
6.36364 0.00876 0.00093
6.56566 0.00835 0.00086
6.76768 0.00798 0.00079
6.96970 0.00766 0.00074
7.17172 0.00719 0.00068
7.37374 0.00695 0.00063
7.57576 0.00663 0.00059
7.77778 0.00628 0.00055
7.97980 0.00613 0.00051
8.18182 0.00580 0.00048
8.38384 0.00563 0.00044
8.58586 0.00543 0.00043
8.78788 0.00517 0.00039
8.98990 0.00503 0.00037
9.19192 0.00476 0.00035
9.39394 0.00453 0.00033
9.59596 0.00444 0.00031
9.79798 0.00416 0.00029
10.00000 0.00402 0.00027
10.20202 0.00383 0.00025
10.40404 0.00369 0.00024
10.60606 0.00340 0.00022
10.80808 0.00330 0.00020
11.01010 0.00320 0.00020
11.21212 0.00300 0.00018
11.41414 0.00289 0.00017
11.61616 0.00278 0.00016
11.81818 0.00260 0.00015
12.02020 0.00250 0.00014
12.22222 0.00234 0.00013
12.42424 0.00222 0.00012
12.62626 0.00203 0.00011
12.82828 0.00189 0.00010
13.03030 0.00186 0.00010
13.23232 0.00161 0.00008
13.43434 0.00158 0.00008
13.63636 0.00147 0.00007
13.83838 0.00138 0.00007
14.04040 0.00130 0.00006
14.24242 0.00126 0.00006
14.44444 0.00117 0.00005
14.64646 0.00112 0.00005
14.84848 0.00106 0.00005
15.05051 0.00100 0.00004
15.25253 0.00092 0.00004
15.45455 0.00089 0.00004
15.65657 0.00086 0.00004
15.85859 0.00079 0.00003
16.06061 0.00078 0.00003
16.26263 0.00073 0.00003
16.46465 0.00068 0.00003
16.66667 0.00063 0.00003
16.86869 0.00064 0.00003
17.07071 0.00058 0.00002
17.27273 0.00057 0.00002
17.47475 0.00053 0.00002
17.67677 0.00052 0.00002
17.87879 0.00047 0.00002
18.08081 0.00046 0.00002
18.28283 0.00044 0.00002
18.48485 0.00042 0.00002
18.68687 0.00040 0.00001
18.88889 0.00037 0.00001
19.09091 0.00037 0.00001
19.29293 0.00034 0.00001
19.49495 0.00032 0.00001
19.69697 0.00031 0.00001
19.89899 0.00031 0.00001
