0.05000 1397.76871
0.15000 3440.33822
0.25000 5117.18349
0.35000 6424.03190
0.45000 7570.51823
0.55000 8257.54899
0.65000 8682.09755
0.75000 8880.03017
0.85000 8896.01269
0.95000 8944.51053
1.05000 8715.75868
1.15000 8537.48666
1.25000 8214.94149
1.35000 8055.88482
1.45000 7684.57769
1.55000 7412.50755
1.65000 7176.30072
1.75000 6945.26739
1.85000 6561.87241
1.95000 6466.65330
2.05000 6145.00575
2.15000 5885.67532
2.25000 5765.84282
2.35000 5613.73450
2.45000 5311.64634
2.55000 5268.36905
2.65000 5020.11297
2.75000 4834.69285
2.85000 4706.05806
2.95000 4501.36242
3.05000 4305.39114
3.15000 4213.92246
3.25000 4047.40564
3.35000 3896.50922
3.45000 3821.53291
3.55000 3656.78718
3.65000 3610.77657
3.75000 3453.90413
3.85000 3366.03835
3.95000 3278.26902
4.05000 3253.52062
4.15000 3134.01608
4.25000 3067.31235
4.35000 2915.28534
4.45000 2812.18633
4.55000 2777.20754
4.65000 2661.09138
4.75000 2575.17800
4.85000 2479.15536
4.95000 2463.72746
5.05000 2394.50691
5.15000 2302.75258
5.25000 2247.70907
5.35000 2175.41745
5.45000 2129.23363
5.55000 2085.40440
5.65000 1983.75171
5.75000 1931.89344
5.85000 1847.75365
5.95000 1802.46966
6.05000 1727.30029
6.15000 1673.62015
6.25000 1592.85588
6.35000 1574.95925
6.45000 1503.41329
6.55000 1453.27458
6.65000 1399.48851
6.75000 1340.07898
6.85000 1301.43580
6.95000 1262.73859
7.05000 1200.72294
7.15000 1172.76944
7.25000 1150.65442
7.35000 1103.82294
7.45000 1084.65658
7.55000 1050.38176
7.65000 1028.34615
7.75000 993.64718
7.85000 981.72639
7.95000 945.59479
8.05000 940.97231
8.15000 955.72165
8.25000 887.72683
8.35000 895.03803
8.45000 864.76418
8.55000 850.76903
8.65000 835.65608
8.75000 822.20450
8.85000 789.28237
8.95000 791.30631
9.05000 748.29614
9.15000 749.65212
9.25000 729.78238
9.35000 707.43388
9.45000 694.85438
9.55000 676.19228
9.65000 661.32695
9.75000 652.47493
9.85000 624.60574
9.95000 622.78801
10.05000 608.37658
10.15000 584.93689
10.25000 575.00429
10.35000 568.42192
10.45000 559.27323
10.55000 541.89451
10.65000 545.74119
10.75000 522.89936
10.85000 513.37608
10.95000 509.73811
11.05000 496.61166
11.15000 483.68524
11.25000 485.59788
11.35000 466.60966
11.45000 459.02194
11.55000 460.83240
11.65000 452.15844
11.75000 442.53777
11.85000 421.14028
11.95000 427.73078
12.05000 411.36457
12.15000 403.25686
12.25000 400.19548
12.35000 393.06350
12.45000 394.58016
12.55000 375.95275
12.65000 375.22984
12.75000 370.20425
12.85000 358.89514
12.95000 355.18436
13.05000 355.17408
13.15000 344.80451
13.25000 334.48493
13.35000 328.14159
13.45000 324.86608
13.55000 318.81389
13.65000 317.66992
13.75000 304.79543
13.85000 300.67769
13.95000 296.42608
14.05000 295.13194
14.15000 283.65610
14.25000 283.63437
14.35000 275.12389
14.45000 270.74303
14.55000 272.01271
14.65000 262.56800
14.75000 261.40254
14.85000 255.87712
14.95000 260.20883
15.05000 250.21472
15.15000 244.02796
15.25000 240.41246
15.35000 229.16054
15.45000 224.99718
15.55000 226.55838
15.65000 225.51656
15.75000 215.69094
15.85000 218.64934
15.95000 217.50103
16.05000 212.54804
16.15000 200.88646
16.25000 205.22343
16.35000 195.82692
16.45000 190.29480
16.55000 195.93101
16.65000 192.71915
16.75000 182.88188
16.85000 180.00212
16.95000 180.15361
17.05000 170.07962
17.15000 168.68653
17.25000 166.76731
17.35000 162.78972
17.45000 155.73772
17.55000 166.73197
17.65000 156.43036
17.75000 148.11205
17.85000 149.01530
17.95000 150.31505
18.05000 148.67201
18.15000 141.26831
18.25000 139.44060
18.35000 139.21251
18.45000 131.40910
18.55000 130.34405
18.65000 129.04844
18.75000 128.82307
18.85000 124.95163
18.95000 126.59849
19.05000 114.77878
19.15000 130.69831
19.25000 124.29447
19.35000 112.48514
19.45000 120.01637
19.55000 121.60168
19.65000 119.77421
19.75000 116.47224
19.85000 120.41939
19.95000 113.71832
