0.120000 -1.408060
0.380000 -2.467750
0.620000 -2.285190
0.880000 -2.232380
1.120000 -2.235250
1.380000 -2.276550
1.620000 -2.281540
1.880000 -2.296890
2.120000 -2.286740
2.380000 -2.276220
2.620000 -2.268000
2.880000 -2.293010
3.120000 -2.281820
3.380000 -2.272060
3.620000 -2.241750
3.880000 -2.237390
4.120000 -2.227270
4.380000 -2.215150
4.620000 -2.206200
4.880000 -2.204960
5.120000 -2.163880
5.380000 -2.175410
5.620000 -2.184030
5.880000 -2.160700
6.120000 -2.159050
6.380000 -2.216350
6.620000 -2.252450
6.880000 -2.331000
7.120000 -2.357740
7.380000 -2.442580
7.620000 -2.467290
7.880000 -2.404850
8.120000 -2.463180
8.380000 -2.493090
8.620000 -2.608830
8.880000 -2.540900
9.120000 -2.655820
9.380000 -2.744010
9.620000 -3.018200
9.880000 -3.001700
10.120000 -3.026600
10.380000 -3.014840
10.620000 3.067160
10.880000 -2.847490
11.120000 3.058590
11.380000 -3.081500
11.620000 2.465850
11.880000 -2.925240
12.120000 -2.562090
12.380000 -2.233200
12.620000 -2.715080
12.880000 -2.654010
13.120000 -2.583930
13.380000 -2.649400
13.620000 -2.691090
13.880000 -2.898010
14.120000 -2.807510
14.380000 -2.961520
14.620000 -2.846240
14.880000 -2.743620
