0.125 0.000 -0.000 0.002
0.375 0.002 -0.003 0.043
0.625 -0.004 -0.016 0.273
0.875 0.002 -0.007 0.725
1.125 -0.008 -0.039 1.396
1.375 -0.000 -0.036 2.191
1.625 -0.014 -0.033 2.857
1.875 -0.019 -0.054 3.525
2.125 0.009 -0.084 4.158
2.375 0.019 -0.073 4.705
2.625 -0.030 -0.034 5.137
2.875 -0.047 -0.015 5.590
3.125 -0.044 -0.062 5.860
3.375 -0.002 -0.103 6.165
3.625 -0.003 -0.139 6.658
3.875 -0.009 -0.025 6.991
4.125 0.020 -0.095 7.190
4.375 -0.021 -0.082 7.763
4.625 -0.071 -0.032 8.228
4.875 -0.011 -0.054 8.555
5.125 0.005 -0.086 9.085
5.375 0.007 -0.142 9.392
5.625 -0.040 -0.084 9.989
5.875 0.018 -0.061 10.643
6.125 0.019 -0.149 11.292
6.375 -0.011 -0.002 11.618
6.625 0.031 -0.092 13.065
6.875 -0.008 -0.120 13.899
7.125 -0.089 -0.043 14.806
7.375 -0.063 -0.096 16.580
7.625 -0.033 -0.018 17.561
7.875 -0.006 0.001 19.599
8.125 -0.037 -0.090 20.820
8.375 -0.067 -0.083 22.239
8.625 -0.102 -0.054 23.572
8.875 -0.073 -0.090 24.487
9.125 -0.060 -0.098 24.140
9.375 -0.136 -0.054 24.304
9.625 -0.087 -0.085 23.605
9.875 -0.102 -0.085 22.815
10.125 -0.189 -0.043 22.196
10.375 -0.153 -0.052 22.003
10.625 -0.092 -0.011 21.855
10.875 -0.083 -0.038 21.284
11.125 -0.135 0.011 21.550
11.375 -0.093 0.013 20.531
11.625 -0.106 0.034 21.246
11.875 -0.122 -0.026 21.015
12.125 -0.138 0.022 20.743
12.375 -0.101 -0.013 21.015
12.625 -0.136 0.025 22.020
12.875 -0.108 -0.015 22.432
13.125 -0.139 0.022 22.820
13.375 -0.136 -0.022 22.690
13.625 -0.149 0.001 22.554
13.875 -0.171 -0.022 22.678
14.125 -0.196 0.002 22.596
14.375 -0.153 -0.024 21.564
14.625 -0.176 -0.032 20.493
14.875 -0.164 -0.002 19.562
