0.12500 0.00651
0.37500 0.01340
0.62500 0.00942
0.87500 0.01512
1.12500 0.02245
1.37500 0.02419
1.62500 0.02518
1.87500 0.03306
2.12500 0.04007
2.37500 0.03480
2.62500 0.03223
2.87500 0.02424
3.12500 0.01275
3.37500 0.02735
3.62500 0.02539
3.87500 0.03230
4.12500 0.02514
4.37500 0.02179
4.62500 0.01951
4.87500 0.01408
5.12500 0.02598
5.37500 0.02665
5.62500 0.03553
5.87500 0.03034
6.12500 0.01776
6.37500 0.01856
6.62500 0.01448
6.87500 0.02364
7.12500 0.02272
7.37500 0.02853
7.62500 0.02641
7.87500 0.02247
8.12500 0.02094
8.37500 0.02262
8.62500 0.03023
8.87500 0.02008
9.12500 0.03390
9.37500 0.01342
9.62500 0.02178
9.87500 0.01472
10.12500 0.01121
10.37500 0.01256
10.62500 0.00453
10.87500 0.01112
11.12500 0.00860
11.37500 0.01390
11.62500 0.00951
11.87500 0.01608
12.12500 0.01808
12.37500 0.02680
12.62500 0.00480
12.87500 0.01515
13.12500 0.01262
13.37500 0.01311
13.62500 0.01847
13.87500 0.03025
14.12500 0.04315
14.37500 0.03215
14.62500 0.02081
14.87500 0.05411
