0.125 0.002 -0.001 0.004
0.375 -0.010 -0.005 0.112
0.625 -0.020 0.007 0.408
0.875 -0.062 -0.022 0.957
1.125 -0.075 -0.038 1.608
1.375 -0.122 -0.073 2.403
1.625 -0.143 -0.097 3.192
1.875 -0.154 -0.130 3.980
2.125 -0.174 -0.165 4.971
2.375 -0.276 -0.206 5.819
2.625 -0.265 -0.186 6.670
2.875 -0.205 -0.235 8.001
3.125 -0.267 -0.300 9.185
3.375 -0.348 -0.322 10.969
3.625 -0.339 -0.263 12.877
3.875 -0.363 -0.302 14.972
4.125 -0.426 -0.243 16.960
4.375 -0.368 -0.268 17.563
4.625 -0.428 -0.225 19.444
4.875 -0.426 -0.025 20.061
5.125 -0.505 -0.056 20.837
5.375 -0.541 -0.138 21.822
5.625 -0.563 -0.136 22.899
5.875 -0.645 -0.120 23.073
6.125 -0.708 -0.050 23.287
6.375 -0.638 -0.145 24.017
6.625 -0.659 -0.163 24.204
6.875 -0.678 -0.113 24.404
7.125 -0.708 -0.078 24.130
7.375 -0.814 -0.158 24.836
7.625 -0.776 -0.232 23.969
7.875 -0.720 -0.218 24.293
8.125 -0.715 -0.295 24.574
8.375 -0.737 -0.333 24.165
8.625 -0.702 -0.297 23.478
8.875 -0.772 -0.299 23.736
9.125 -0.781 -0.243 24.343
9.375 -0.710 -0.260 24.039
9.625 -0.671 -0.309 24.125
9.875 -0.655 -0.377 23.173
10.125 -0.615 -0.273 22.890
10.375 -0.583 -0.308 22.608
10.625 -0.599 -0.287 23.196
10.875 -0.514 -0.367 23.195
11.125 -0.519 -0.216 22.806
11.375 -0.536 -0.191 22.488
11.625 -0.558 -0.239 21.419
11.875 -0.426 -0.202 20.422
12.125 -0.520 -0.235 20.948
12.375 -0.431 -0.243 19.215
12.625 -0.417 -0.207 19.182
12.875 -0.412 -0.216 18.817
13.125 -0.419 -0.229 18.133
13.375 -0.456 -0.270 17.244
13.625 -0.263 -0.297 17.623
13.875 -0.276 -0.235 15.513
14.125 -0.232 -0.297 15.642
14.375 -0.306 -0.278 15.770
14.625 -0.243 -0.160 15.508
14.875 -0.251 -0.207 14.848
15.125 -0.230 -0.229 13.301
15.375 -0.234 -0.170 13.145
15.625 -0.245 -0.126 12.073
15.875 -0.197 -0.109 12.069
16.125 -0.239 -0.150 11.682
16.375 -0.213 -0.078 10.217
16.625 -0.217 -0.066 10.414
16.875 -0.215 -0.070 9.836
17.125 -0.236 -0.120 10.557
17.375 -0.278 -0.108 9.724
17.625 -0.274 -0.070 9.233
17.875 -0.282 -0.087 9.146
18.125 -0.224 -0.112 7.957
18.375 -0.216 -0.106 7.756
18.625 -0.176 -0.140 7.497
18.875 -0.176 -0.182 7.342
19.125 -0.151 -0.175 7.201
19.375 -0.150 -0.188 7.096
19.625 -0.093 -0.209 7.294
19.875 -0.098 -0.172 7.130
