0.120000 -1.643370
0.380000 -0.602420
0.620000 -0.634010
0.880000 -0.694780
1.120000 -0.733420
1.380000 -0.719600
1.620000 -0.718860
1.880000 -0.723270
2.120000 -0.730620
2.380000 -0.761400
2.620000 -0.736790
2.880000 -0.777380
3.120000 -0.753970
3.380000 -0.731330
3.620000 -0.779310
3.880000 -0.798480
4.120000 -0.794870
4.380000 -0.852870
4.620000 -0.897420
4.880000 -0.958780
5.120000 -1.067430
5.380000 -1.162230
5.620000 -1.186920
5.880000 -1.308450
6.120000 -1.272080
6.380000 -0.990750
6.620000 -1.138960
6.880000 1.325710
7.120000 1.726210
7.380000 1.348630
7.620000 1.564020
7.880000 1.531820
8.120000 1.617140
8.380000 1.535140
8.620000 1.546580
8.880000 1.495680
9.120000 1.675150
9.380000 1.308060
9.620000 2.225400
9.880000 2.961560
10.120000 1.946740
10.380000 1.604180
10.620000 1.240480
10.880000 0.287030
11.120000 0.416070
11.380000 0.266650
11.620000 0.599500
11.880000 0.436980
12.120000 0.312470
12.380000 0.326250
12.620000 0.308610
12.880000 0.153340
13.120000 0.455700
13.380000 0.297610
13.620000 0.343920
13.880000 0.391670
14.120000 0.568960
14.380000 0.466030
14.620000 0.804570
14.880000 1.088090
