0.12500 0.02199
0.37500 0.06908
0.62500 0.12500
0.87500 0.19106
1.12500 0.24225
1.37500 0.28259
1.62500 0.32453
1.87500 0.34126
2.12500 0.37379
2.37500 0.40933
2.62500 0.42850
2.87500 0.45445
3.12500 0.47831
3.37500 0.48839
3.62500 0.49840
3.87500 0.49385
4.12500 0.48471
4.37500 0.46824
4.62500 0.44067
4.87500 0.39234
5.12500 0.34877
5.37500 0.31157
5.62500 0.27315
5.87500 0.25096
6.12500 0.23368
6.37500 0.24572
6.62500 0.21866
6.87500 0.23744
7.12500 0.23454
7.37500 0.22345
7.62500 0.19535
7.87500 0.17966
8.12500 0.16357
8.37500 0.13088
8.62500 0.11572
8.87500 0.10947
9.12500 0.07824
9.37500 0.08929
9.62500 0.10090
9.87500 0.07997
10.12500 0.08122
10.37500 0.07607
10.62500 0.08538
10.87500 0.06686
11.12500 0.05328
11.37500 0.04939
11.62500 0.03394
11.87500 0.04516
12.12500 0.07259
12.37500 0.06908
12.62500 0.06934
12.87500 0.09247
13.12500 0.06593
13.37500 0.04428
13.62500 0.08392
13.87500 0.08191
14.12500 0.10888
14.37500 0.09983
14.62500 0.12197
14.87500 0.15094
