0.12500 0.03481
0.37500 0.02324
0.62500 0.04865
0.87500 0.06033
1.12500 0.05911
1.37500 0.08755
1.62500 0.09430
1.87500 0.11031
2.12500 0.14222
2.37500 0.14602
2.62500 0.14727
2.87500 0.12933
3.12500 0.11676
3.37500 0.11845
3.62500 0.09063
3.87500 0.07261
4.12500 0.05116
4.37500 0.02179
4.62500 0.03481
4.87500 0.01006
5.12500 0.02437
5.37500 0.02184
5.62500 0.05065
5.87500 0.03464
6.12500 0.03416
6.37500 0.05469
6.62500 0.04322
6.87500 0.04000
7.12500 0.03577
7.37500 0.03456
7.62500 0.04273
7.87500 0.05235
8.12500 0.04532
8.37500 0.02080
8.62500 0.02727
8.87500 0.01496
9.12500 0.03427
9.37500 0.00747
9.62500 0.02773
9.87500 0.02209
10.12500 0.03616
10.37500 0.04949
10.62500 0.02550
10.87500 0.02739
11.12500 0.02756
11.37500 0.01960
11.62500 0.05927
11.87500 0.05120
12.12500 0.01795
12.37500 0.03285
12.62500 0.01484
12.87500 0.01485
13.12500 0.02663
13.37500 0.07350
13.62500 0.02697
13.87500 0.07782
14.12500 0.06286
14.37500 0.05331
14.62500 0.01504
14.87500 0.01948
15.12500 0.01149
15.37500 0.05917
15.62500 0.01725
15.87500 0.04535
16.12500 0.02813
16.37500 0.03377
16.62500 0.01387
16.87500 0.03174
17.12500 0.03368
17.37500 0.06628
17.62500 0.02008
17.87500 0.05735
18.12500 0.03793
18.37500 0.02513
18.62500 0.05410
18.87500 0.01988
19.12500 0.03545
19.37500 0.02329
19.62500 0.01076
19.87500 0.07281
