0.05000 7875.62793
0.15000 6921.40911
0.25000 6802.46454
0.35000 7522.80241
0.45000 8222.77907
0.55000 8626.29985
0.65000 8923.67211
0.75000 8819.85285
0.85000 8880.41950
0.95000 8575.97298
1.05000 8368.28781
1.15000 8162.19870
1.25000 7850.35391
1.35000 7419.50049
1.45000 7074.76381
1.55000 6816.40242
1.65000 6633.68616
1.75000 6204.61754
1.85000 6005.28881
1.95000 5770.38778
2.05000 5667.44414
2.15000 5545.90501
2.25000 5392.12932
2.35000 5137.08092
2.45000 5008.31423
2.55000 4834.98990
2.65000 4659.69906
2.75000 4622.79046
2.85000 4339.24238
2.95000 4196.48091
3.05000 4165.27328
3.15000 3920.32592
3.25000 3890.83099
3.35000 3729.41717
3.45000 3622.73279
3.55000 3502.55160
3.65000 3354.80205
3.75000 3206.39899
3.85000 3152.12074
3.95000 2972.93605
4.05000 2863.50197
4.15000 2741.85640
4.25000 2685.73712
4.35000 2609.67120
4.45000 2491.49512
4.55000 2442.15519
4.65000 2385.07751
4.75000 2302.49900
4.85000 2210.50739
4.95000 2143.87219
5.05000 2092.41587
5.15000 2007.99559
5.25000 1955.44458
5.35000 1875.77332
5.45000 1784.77602
5.55000 1739.19351
5.65000 1706.80451
5.75000 1603.00238
5.85000 1510.76790
5.95000 1451.52281
6.05000 1400.22977
6.15000 1333.62841
6.25000 1280.64482
6.35000 1238.06513
6.45000 1189.08407
6.55000 1163.63120
6.65000 1097.32537
6.75000 1075.39634
6.85000 1025.60964
6.95000 1031.92556
7.05000 976.89140
7.15000 965.55325
7.25000 921.81857
7.35000 875.63635
7.45000 849.12129
7.55000 849.92524
7.65000 823.86530
7.75000 774.83223
7.85000 788.00694
7.95000 758.91830
8.05000 735.30668
8.15000 683.89741
8.25000 681.51509
8.35000 664.08899
8.45000 671.03420
8.55000 628.50635
8.65000 617.82518
8.75000 618.68430
8.85000 607.13006
8.95000 569.69238
9.05000 556.87929
9.15000 545.60578
9.25000 543.03501
9.35000 509.55239
9.45000 541.01458
9.55000 502.45922
9.65000 494.47841
9.75000 495.50582
9.85000 470.98439
9.95000 470.78846
10.05000 460.70133
10.15000 443.96401
10.25000 445.96937
10.35000 443.47859
10.45000 422.91160
10.55000 396.88508
10.65000 421.24143
10.75000 401.34548
10.85000 406.79675
10.95000 388.11308
11.05000 392.45636
11.15000 386.06983
11.25000 371.39165
11.35000 350.10833
11.45000 353.52461
11.55000 343.66596
11.65000 335.16828
11.75000 337.72263
11.85000 336.23765
11.95000 323.05315
12.05000 320.34549
12.15000 309.69009
12.25000 310.99601
12.35000 286.04022
12.45000 284.52305
12.55000 281.01066
12.65000 281.75111
12.75000 276.51963
12.85000 268.91114
12.95000 254.91728
13.05000 251.25821
13.15000 254.01848
13.25000 239.58531
13.35000 233.52582
13.45000 236.83017
13.55000 220.42815
13.65000 228.70086
13.75000 219.41895
13.85000 204.64693
13.95000 217.59433
14.05000 196.70365
14.15000 192.56728
14.25000 180.61214
14.35000 190.64909
14.45000 180.98056
14.55000 178.99423
14.65000 158.30447
14.75000 175.66579
14.85000 159.95451
14.95000 161.14944
15.05000 168.13680
15.15000 171.05326
15.25000 164.21778
15.35000 153.44812
15.45000 156.10392
15.55000 137.53075
15.65000 147.75441
15.75000 141.54859
15.85000 149.05765
15.95000 147.80466
16.05000 120.12089
16.15000 134.83878
16.25000 123.81099
16.35000 118.09126
16.45000 124.28707
16.55000 119.79292
16.65000 111.36838
16.75000 122.96479
16.85000 108.45137
16.95000 114.79223
17.05000 128.89158
17.15000 116.27640
17.25000 113.33399
17.35000 104.89894
17.45000 119.23416
17.55000 115.84762
17.65000 127.95466
17.75000 105.71479
17.85000 107.07415
17.95000 121.00102
18.05000 113.43261
18.15000 114.68385
18.25000 114.19258
18.35000 120.50403
18.45000 103.74238
18.55000 100.94421
18.65000 116.54710
18.75000 113.96926
18.85000 104.14260
18.95000 125.50986
19.05000 103.95142
19.15000 109.50320
19.25000 114.01632
19.35000 112.26431
19.45000 104.60021
19.55000 107.93583
19.65000 105.50478
19.75000 104.15290
19.85000 86.85312
19.95000 106.25402
