0.120000 1.606760
0.380000 1.326630
0.620000 1.382540
0.880000 1.298090
1.120000 1.062060
1.380000 1.224770
1.620000 1.193090
1.880000 1.240830
2.120000 1.278300
2.380000 1.208200
2.620000 1.236270
2.880000 1.323570
3.120000 1.372600
3.380000 1.384430
3.620000 1.450360
3.880000 1.438590
4.120000 1.350190
4.380000 1.305770
4.620000 1.430610
4.880000 0.978240
5.120000 1.190710
5.380000 0.696010
5.620000 0.854230
5.880000 0.373540
6.120000 0.840500
6.380000 0.573190
6.620000 0.585050
6.880000 0.142650
7.120000 -0.063090
7.380000 0.173500
7.620000 0.331130
7.880000 -0.021710
8.120000 -0.295150
8.380000 -0.099400
8.620000 -0.006370
8.880000 -0.063060
9.120000 -0.348030
9.380000 -0.495280
9.620000 -0.684980
9.880000 -0.784970
10.120000 -1.281530
10.380000 -1.336440
10.620000 -1.446890
10.880000 -1.668530
11.120000 -2.182020
11.380000 -2.277130
11.620000 -2.437600
11.880000 -2.066610
12.120000 -1.951130
12.380000 -2.593620
12.620000 2.144650
12.880000 -1.509660
13.120000 -0.350700
13.380000 -2.871290
13.620000 -0.657840
13.880000 -1.287490
14.120000 -2.055690
14.380000 -1.575150
14.620000 -1.432210
14.880000 -1.985890
15.120000 -2.582740
15.380000 -2.414030
15.620000 -2.940600
15.880000 -2.876110
16.120000 2.817020
16.380000 -2.824890
16.620000 2.582270
16.880000 2.780460
17.120000 2.138900
17.380000 1.885370
17.620000 2.427390
17.880000 1.881330
18.120000 1.302080
18.380000 1.275260
18.620000 0.873030
18.880000 1.070780
19.120000 0.921520
19.380000 0.229470
19.620000 0.218990
19.880000 -0.414140
