0.125 -0.000 -0.000 0.001
0.375 0.002 0.000 0.032
0.625 0.003 0.004 0.176
0.875 -0.010 0.009 0.500
1.125 -0.023 0.006 1.100
1.375 -0.017 0.041 1.923
1.625 -0.011 0.034 3.043
1.875 -0.058 0.025 4.185
2.125 0.002 0.069 5.606
2.375 -0.039 0.019 6.916
2.625 -0.021 0.044 8.241
2.875 -0.032 0.034 9.558
3.125 -0.047 0.069 10.982
3.375 -0.064 0.069 12.289
3.625 -0.116 0.138 13.674
3.875 -0.045 0.066 15.028
4.125 -0.126 0.067 16.209
4.375 -0.104 0.020 17.868
4.625 -0.086 0.090 19.125
4.875 -0.139 0.056 20.867
5.125 -0.104 0.098 21.781
5.375 -0.148 0.100 22.545
5.625 -0.177 0.015 22.886
5.875 -0.131 0.086 22.864
6.125 -0.096 0.084 23.787
6.375 -0.113 0.010 24.077
6.625 -0.133 -0.001 24.817
6.875 -0.085 0.008 25.288
7.125 -0.083 0.084 25.455
7.375 -0.078 -0.025 25.719
7.625 -0.106 0.003 26.445
7.875 -0.075 0.023 27.088
8.125 -0.137 0.034 28.066
8.375 -0.091 0.022 26.800
8.625 -0.053 0.026 25.394
8.875 -0.049 -0.025 24.702
9.125 -0.063 0.043 23.423
9.375 -0.062 0.032 23.545
9.625 -0.008 0.084 23.966
9.875 -0.047 0.039 25.740
10.125 -0.017 0.040 26.116
10.375 -0.006 0.045 27.412
10.625 0.029 0.051 26.869
10.875 -0.003 -0.006 25.651
11.125 -0.029 0.021 23.949
11.375 0.013 0.016 21.727
11.625 0.032 0.047 19.784
11.875 0.012 0.023 19.023
12.125 0.015 0.014 17.282
12.375 0.017 0.016 16.390
12.625 -0.002 0.004 15.176
12.875 -0.003 0.040 15.317
13.125 0.014 0.021 14.720
13.375 0.017 0.014 15.130
13.625 -0.030 0.044 16.337
13.875 -0.008 0.032 17.244
14.125 0.028 0.021 17.549
14.375 0.022 0.065 16.850
14.625 -0.011 0.028 15.876
14.875 -0.011 0.020 14.865
