0.125 -0.000 0.001 0.002
0.375 -0.006 -0.003 0.056
0.625 0.004 -0.009 0.314
0.875 -0.002 -0.003 0.809
1.125 -0.003 -0.015 1.532
1.375 -0.003 -0.013 2.203
1.625 0.011 -0.046 3.050
1.875 0.011 -0.027 3.769
2.125 -0.009 -0.009 4.546
2.375 0.001 -0.040 5.213
2.625 -0.006 -0.028 5.889
2.875 0.002 -0.056 6.676
3.125 -0.020 -0.079 7.580
3.375 0.029 0.003 8.582
3.625 0.023 -0.024 9.455
3.875 0.013 -0.055 10.803
4.125 0.025 -0.017 12.310
4.375 -0.006 -0.064 13.861
4.625 0.016 -0.051 15.609
4.875 0.036 -0.074 17.838
5.125 0.024 -0.151 20.026
5.375 0.063 -0.081 22.271
5.625 0.138 -0.123 23.773
5.875 0.113 -0.160 24.421
6.125 0.167 -0.059 25.357
6.375 0.124 -0.061 25.351
6.625 0.182 -0.033 25.549
6.875 0.140 -0.088 25.811
7.125 0.185 -0.040 25.972
7.375 0.117 -0.059 26.443
7.625 0.139 -0.060 26.145
7.875 0.140 -0.020 26.150
8.125 0.099 -0.039 26.252
8.375 0.055 -0.060 25.811
8.625 0.080 -0.064 25.212
8.875 0.110 -0.094 24.877
9.125 0.091 -0.043 23.858
9.375 0.077 -0.106 23.494
9.625 0.110 -0.050 22.474
9.875 0.103 -0.073 22.480
10.125 0.131 -0.063 21.891
10.375 0.103 -0.036 21.785
10.625 0.129 -0.032 21.311
10.875 0.179 0.004 21.000
11.125 0.151 -0.030 21.347
11.375 0.173 -0.023 21.187
11.625 0.182 -0.048 20.783
11.875 0.115 -0.046 20.652
12.125 0.133 -0.037 20.676
12.375 0.132 -0.016 20.620
12.625 0.114 0.010 20.227
12.875 0.092 -0.014 19.957
13.125 0.113 -0.020 18.931
13.375 0.092 0.003 19.067
13.625 0.067 0.046 18.612
13.875 0.055 -0.005 17.351
14.125 0.071 0.033 16.824
14.375 0.040 -0.018 16.770
14.625 0.032 0.009 15.898
14.875 0.043 -0.013 15.343
