0.05000 1965.69991
0.15000 4478.23482
0.25000 7097.89001
0.35000 9222.38607
0.45000 10541.34784
0.55000 11555.58126
0.65000 12091.35153
0.75000 12122.85725
0.85000 12035.54089
0.95000 11758.85328
1.05000 11540.33168
1.15000 10894.04661
1.25000 10480.54286
1.35000 9995.26721
1.45000 9509.01583
1.55000 9111.50097
1.65000 8619.61827
1.75000 8133.29646
1.85000 7797.39460
1.95000 7490.04144
2.05000 7134.80400
2.15000 6737.18171
2.25000 6489.45037
2.35000 6282.27551
2.45000 6001.40744
2.55000 5712.49994
2.65000 5514.36426
2.75000 5265.01738
2.85000 5059.97668
2.95000 4935.61568
3.05000 4697.67015
3.15000 4588.11223
3.25000 4473.18398
3.35000 4240.19277
3.45000 4152.85475
3.55000 4016.96622
3.65000 3871.13100
3.75000 3786.40246
3.85000 3595.53008
3.95000 3531.00050
4.05000 3407.91526
4.15000 3310.74808
4.25000 3163.31012
4.35000 3080.43219
4.45000 2965.99106
4.55000 2846.70779
4.65000 2761.21473
4.75000 2696.34558
4.85000 2584.11777
4.95000 2538.25033
5.05000 2423.16080
5.15000 2308.43807
5.25000 2247.83595
5.35000 2173.58615
5.45000 2113.91491
5.55000 2079.52988
5.65000 1960.37089
5.75000 1927.07833
5.85000 1881.61752
5.95000 1796.81006
6.05000 1783.93358
6.15000 1741.27060
6.25000 1661.37725
6.35000 1625.04658
6.45000 1601.99294
6.55000 1547.86714
6.65000 1514.82388
6.75000 1501.10163
6.85000 1447.99780
6.95000 1411.42770
7.05000 1339.21417
7.15000 1318.99251
7.25000 1263.78410
7.35000 1250.67008
7.45000 1191.01037
7.55000 1207.67742
7.65000 1159.03186
7.75000 1106.52907
7.85000 1053.74593
7.95000 1055.27989
8.05000 988.65280
8.15000 974.66559
8.25000 936.11290
8.35000 914.90899
8.45000 884.09884
8.55000 863.05826
8.65000 842.83931
8.75000 809.01809
8.85000 795.11663
8.95000 770.85856
9.05000 738.84165
9.15000 702.20846
9.25000 687.24577
9.35000 668.85868
9.45000 650.05438
9.55000 629.04895
9.65000 628.29869
9.75000 596.93078
9.85000 595.12405
9.95000 584.34843
10.05000 569.49010
10.15000 535.93595
10.25000 534.49382
10.35000 521.12861
10.45000 507.15576
10.55000 500.67432
10.65000 484.69623
10.75000 476.69560
10.85000 462.12906
10.95000 453.78791
11.05000 423.47154
11.15000 431.92986
11.25000 418.26207
11.35000 404.62482
11.45000 405.13975
11.55000 403.00460
11.65000 386.63602
11.75000 380.67964
11.85000 367.66237
11.95000 366.46694
12.05000 355.96234
12.15000 343.93648
12.25000 340.01750
12.35000 337.11389
12.45000 318.85605
12.55000 315.31269
12.65000 311.88470
12.75000 305.98479
12.85000 302.78916
12.95000 296.73350
13.05000 285.05547
13.15000 286.03169
13.25000 281.00410
13.35000 270.10317
13.45000 270.60015
13.55000 252.91093
13.65000 254.60743
13.75000 243.25072
13.85000 251.09083
13.95000 243.03826
14.05000 237.59998
14.15000 237.43572
14.25000 231.65497
14.35000 228.92721
14.45000 212.85121
14.55000 222.14729
14.65000 213.59000
14.75000 213.90759
14.85000 213.07041
14.95000 200.16923
15.05000 194.23119
15.15000 193.27575
15.25000 201.15547
15.35000 190.57085
15.45000 180.85321
15.55000 186.61993
15.65000 185.09124
15.75000 178.36523
15.85000 166.20208
15.95000 163.65793
16.05000 166.68314
16.15000 159.47776
16.25000 167.77778
16.35000 155.81614
16.45000 156.34957
16.55000 150.39669
16.65000 146.59556
16.75000 150.43434
16.85000 153.42910
16.95000 144.85308
17.05000 144.09763
17.15000 138.50563
17.25000 137.51123
17.35000 135.82177
17.45000 127.65269
17.55000 125.53769
17.65000 119.91531
17.75000 118.27301
17.85000 115.88388
17.95000 114.52681
18.05000 119.77510
18.15000 120.66269
18.25000 114.15864
18.35000 112.57150
18.45000 122.34545
18.55000 112.95051
18.65000 103.05232
18.75000 105.86290
18.85000 103.65687
18.95000 104.88435
19.05000 97.94356
19.15000 109.58941
19.25000 100.51727
19.35000 96.48649
19.45000 93.69827
19.55000 90.43120
19.65000 96.97821
19.75000 91.79769
19.85000 92.56108
19.95000 92.81414
