0.05000 -3362.39668 -186.84273 -2044.06245 3464.13840 4048.91092 5702.33475
0.15000 -8110.23725 -107.22805 -1374.95396 4743.59077 4184.36876 8845.11446
0.25000 -10510.22889 13.78685 -877.69693 4695.05134 4135.71162 11349.02472
0.35000 -11889.11114 36.92940 -506.21995 4865.15207 4101.36595 13085.33206
0.45000 -12826.36496 187.52474 -341.27335 5035.03330 4204.58701 13534.10111
0.55000 -13065.16748 18.97112 -114.38613 4947.54311 4275.54522 13758.69939
0.65000 -13363.72089 0.07470 229.28149 4762.82015 4327.61866 13558.40412
0.75000 -13235.42158 17.69090 -252.44506 4631.34160 4276.34733 13350.53698
0.85000 -13172.80626 49.88037 4.03445 4353.48009 4280.77381 12779.05678
0.95000 -12929.77104 -30.30133 197.76546 4111.86626 4261.32643 12419.54860
1.05000 -12752.14007 -24.31643 102.70309 3830.84497 4132.13775 11950.38491
1.15000 -12534.80416 -20.87958 -193.82370 3650.09901 4008.81302 11475.05830
1.25000 -12367.37074 -31.97801 237.56588 3512.90824 3955.03286 10914.67350
1.35000 -12249.76887 27.08524 316.31033 3278.58219 3854.86030 10382.66856
1.45000 -12067.33607 -42.27122 248.66738 3088.86707 3710.97493 9974.23074
1.55000 -11928.30349 -5.00252 168.77308 2890.08922 3659.87644 9463.85580
1.65000 -11729.41292 35.06574 81.11735 2711.33086 3509.89787 9011.33262
1.75000 -11488.50181 53.11489 113.45332 2595.33164 3398.11738 8690.25629
1.85000 -11319.72031 42.68777 73.79116 2444.71869 3312.17877 8282.14321
1.95000 -11108.17283 37.06316 21.80533 2321.18497 3170.06169 7968.76519
2.05000 -10918.96582 10.88203 -107.38955 2180.51131 3074.55562 7653.86905
2.15000 -10742.40691 34.25500 13.12213 2113.22983 3037.67041 7328.06406
2.25000 -10563.43446 20.46242 26.30895 2060.69969 2921.59796 7084.75638
2.35000 -10401.89372 9.07935 124.45384 1887.22894 2813.74546 6773.48185
2.45000 -10183.03889 -21.45333 -58.32732 1909.77633 2673.53598 6625.46668
2.55000 -10096.92664 -5.71432 80.10971 1770.42497 2627.13178 6287.11729
2.65000 -9959.22152 -6.55377 56.11911 1691.12805 2525.99978 6073.07332
2.75000 -9772.77812 2.31533 -0.57407 1676.30058 2419.07018 5899.12232
2.85000 -9649.21318 55.19435 14.89629 1577.25620 2337.36938 5652.49014
2.95000 -9474.49280 -19.91521 -62.93560 1519.96953 2263.77317 5479.68402
3.05000 -9309.05717 9.85322 -42.72386 1494.04522 2191.30836 5372.75058
3.15000 -9157.07317 -6.70095 -68.54373 1431.49294 2098.61034 5196.37534
3.25000 -9029.32069 58.50576 -96.73260 1347.32189 2008.00679 4996.30544
3.35000 -8930.74429 -22.44194 -0.72002 1315.76299 1968.32260 4770.50632
3.45000 -8768.39181 46.95779 -30.66309 1298.96155 1869.63078 4708.54259
3.55000 -8638.67972 -26.29471 8.71298 1234.74087 1811.12754 4537.46759
3.65000 -8555.47840 -47.07359 -48.01866 1156.60920 1782.12116 4354.16932
3.75000 -8401.57931 22.66751 -93.13746 1102.20437 1716.04567 4262.33581
3.85000 -8276.83625 -13.09608 -83.47343 1142.85206 1646.77069 4096.34328
3.95000 -8166.71309 -14.40716 -61.13546 1080.83038 1595.38330 4027.56105
4.05000 -8058.85276 -30.93126 -57.63861 1055.63617 1570.93060 3877.31458
4.15000 -7959.99432 -14.77304 -68.96376 1068.12027 1496.62774 3733.98353
4.25000 -7839.55915 -28.37476 8.73129 933.26180 1426.78178 3592.44558
4.35000 -7709.54403 -14.84778 -55.16906 976.97679 1384.10413 3536.60870
4.45000 -7588.27320 -25.51607 2.70212 946.37128 1316.43822 3410.07607
4.55000 -7502.59476 -40.02613 -60.69404 875.78577 1303.15462 3312.20615
4.65000 -7392.28372 -36.88311 -68.19254 855.10283 1288.38308 3188.12319
4.75000 -7289.23699 -39.61357 -0.99379 808.48969 1164.54160 3105.66929
4.85000 -7154.81561 -34.51898 58.07297 855.34345 1129.80491 3019.27848
4.95000 -7056.10191 -9.92672 -71.74775 788.31877 1127.20318 2896.89638
5.05000 -6944.00700 -24.73426 38.18944 739.81508 1049.25113 2826.19379
5.15000 -6836.67181 -27.98203 2.49344 740.99023 1015.46201 2760.69732
5.25000 -6744.81007 -28.23776 97.19231 665.45220 1043.18415 2673.66142
5.35000 -6639.27350 -22.65695 7.73900 670.56442 953.32303 2581.19071
5.45000 -6530.29031 -2.66372 -23.10358 613.47818 889.35984 2497.52696
5.55000 -6442.13818 -3.09147 -24.21889 602.20768 851.04032 2389.49397
5.65000 -6361.01433 -9.60016 6.25013 584.99494 843.33069 2315.37391
5.75000 -6269.72498 8.44766 49.44517 563.08265 813.07033 2217.43781
5.85000 -6179.24631 12.38781 19.81081 539.31282 772.70884 2127.94313
5.95000 -6105.85526 7.18312 98.19098 542.37539 762.89473 2112.38448
6.05000 -6027.05537 14.45205 -11.19201 499.94692 759.20210 2040.43037
6.15000 -5945.66855 30.17267 2.69560 484.88266 681.36599 1953.66087
6.25000 -5863.80855 13.93415 -14.53185 486.09538 690.27216 1911.32371
6.35000 -5812.77186 21.20853 25.25873 468.28357 670.28642 1852.22784
6.45000 -5753.38095 8.67301 14.87199 452.64307 649.15391 1760.91561
6.55000 -5699.53077 -6.78374 50.69597 461.34849 637.35695 1728.00777
6.65000 -5642.90424 7.20639 0.34831 425.32458 606.33633 1709.62134
6.75000 -5607.57718 26.28404 36.41151 436.21574 583.73744 1651.14911
6.85000 -5567.67939 5.78454 -33.95219 441.68290 581.52572 1565.07839
6.95000 -5529.47522 5.32877 -1.85163 449.96675 581.26593 1554.44245
7.05000 -5479.72510 2.77678 -44.37754 423.87633 562.16193 1500.79633
7.15000 -5442.17233 14.33514 -52.35549 451.18830 529.03306 1443.06836
7.25000 -5418.62942 0.15325 -62.68094 437.97358 530.68161 1383.56352
7.35000 -5396.94534 -0.94124 -2.61347 428.71945 490.18092 1348.11648
7.45000 -5359.95867 3.74940 -46.77721 431.97644 476.85379 1317.33761
7.55000 -5319.48107 -6.07849 -53.32204 462.71411 488.56146 1283.54660
7.65000 -5281.21617 6.29650 -39.27884 447.21297 443.56383 1225.44525
7.75000 -5257.13445 11.56316 -10.04298 455.96932 444.93556 1229.58148
7.85000 -5227.52838 14.11300 -38.83100 451.40688 431.88629 1148.44026
7.95000 -5199.69614 27.45734 -50.23163 455.18940 411.06206 1111.89401
8.05000 -5171.46297 9.96716 -10.56640 450.98498 386.65915 1088.82165
8.15000 -5118.26804 18.20023 -13.15588 467.97263 370.19874 1049.77855
8.25000 -5090.09442 20.51983 10.23231 453.18842 374.62505 1020.30907
8.35000 -5056.01023 19.44672 -32.44634 455.73270 343.81508 971.90384
8.45000 -5022.90695 19.16251 -7.73909 435.63306 335.84313 945.89814
8.55000 -4966.98558 19.23267 2.57375 468.86485 357.16960 933.29958
8.65000 -4915.81708 21.32193 3.51199 430.78620 303.90423 900.51090
8.75000 -4864.80247 10.09236 -11.11077 452.02676 302.95226 910.65481
8.85000 -4816.27044 17.16596 24.11641 398.11955 296.46119 849.69751
8.95000 -4774.53192 20.47933 -6.30864 368.91979 268.22589 825.20988
9.05000 -4727.95481 19.91457 -24.22416 362.98662 294.16651 812.94267
9.15000 -4686.87820 17.68119 -6.20100 340.38676 252.29887 781.25360
9.25000 -4643.84035 9.61278 -2.09756 339.43907 278.17753 772.53381
9.35000 -4609.45411 8.97342 -1.07363 320.53369 240.17355 749.07124
9.45000 -4561.23703 17.99995 -17.61667 331.01388 237.07554 723.81763
9.55000 -4509.71178 23.16147 -3.01062 282.58925 212.22853 692.52373
9.65000 -4476.24883 16.82868 11.55290 279.09694 232.53778 681.99106
9.75000 -4427.66423 7.92548 -0.13286 290.39267 240.10266 670.91030
9.85000 -4390.04660 8.78054 -3.25449 264.77088 242.21900 676.61408
9.95000 -4346.67090 9.05492 -5.49827 269.23291 267.26638 645.44777
10.05000 -4303.16607 15.93783 3.37341 252.09583 202.01381 623.89551
10.15000 -4269.99111 11.12523 -3.89523 246.02660 253.50433 613.08964
10.25000 -4235.96514 5.97183 -22.11382 271.05148 273.86577 586.44080
10.35000 -4192.16023 12.77571 -6.24597 237.22569 180.63580 598.56848
10.45000 -4166.07953 10.07207 -5.13029 239.74911 213.61297 576.53290
10.55000 -4119.78128 13.78690 8.26944 218.30330 160.44677 546.04077
10.65000 -4088.45299 9.01859 -20.25268 210.18567 156.58609 538.92715
10.75000 -4059.88618 4.42705 -16.17490 223.63391 193.01136 669.40623
10.85000 -4017.25445 8.54907 -1.66812 193.93207 143.82555 513.60643
10.95000 -3987.90116 6.82195 -29.15324 225.86356 187.11400 515.64930
11.05000 -3951.30506 8.21819 -10.33247 208.92330 173.68484 515.85357
11.15000 -3920.44433 6.01574 -12.36584 173.80035 193.82075 482.30527
11.25000 -3888.00671 4.17196 -1.46123 194.92196 180.19548 488.73301
11.35000 -3858.14255 8.86106 -12.17375 191.22737 141.10485 469.71507
11.45000 -3829.80111 6.38542 -21.97079 176.10285 207.88852 469.05061
11.55000 -3799.34661 6.94138 -8.41740 201.16068 195.35485 468.79527
11.65000 -3768.84195 12.93304 -12.77964 167.63839 124.33343 447.51643
11.75000 -3739.07836 10.78026 -0.39481 208.38122 182.48522 447.13612
11.85000 -3707.71954 12.96679 10.24755 428.78729 173.20748 434.46781
11.95000 -3677.54350 11.15582 5.34801 216.51625 144.36441 417.48367
12.05000 -3660.27479 9.53748 -4.21563 133.65229 115.92226 406.57136
12.15000 -3636.77580 8.51276 -0.50877 145.30875 139.77982 399.23015
12.25000 -3601.67175 7.98744 3.41180 164.11740 145.10233 397.96333
12.35000 -3577.88226 8.36003 3.01802 140.41946 117.37351 399.62392
12.45000 -3548.17629 6.27535 14.73413 133.63913 108.01841 376.61895
12.55000 -3521.93852 1.47951 6.35868 134.35384 108.37266 362.70354
12.65000 -3493.34825 5.86935 10.74045 125.28657 169.24398 369.06431
12.75000 -3464.02713 8.96675 16.62365 137.59402 112.34006 365.71637
12.85000 -3443.85161 4.97590 26.18939 121.20494 102.48466 358.07364
12.95000 -3421.01897 4.00290 14.99305 130.21409 121.62732 400.48301
13.05000 -3387.71014 9.28617 -7.59174 193.02527 161.83143 372.23828
13.15000 -3364.17838 1.36480 14.90805 127.43423 157.10919 372.51054
13.25000 -3341.22906 3.22173 41.89091 111.60566 105.83725 340.92397
13.35000 -3317.23149 4.26519 22.48086 108.69390 97.86603 322.80910
13.45000 -3288.32296 7.78458 18.91188 146.77669 102.03453 319.10758
13.55000 -3264.31511 4.72470 17.17003 115.37548 127.35509 325.98116
13.65000 -3249.61924 5.82587 16.11750 101.33009 90.98317 314.02872
13.75000 -3231.59210 1.41420 21.96599 110.16227 103.57473 315.05833
13.85000 -3209.82968 4.55522 17.82683 96.07080 101.98337 322.40795
13.95000 -3192.35005 -6.42244 19.76190 159.82445 151.06607 314.85953
14.05000 -3170.15839 2.31082 30.44039 111.14551 90.01635 309.17768
14.15000 -3151.89544 4.95650 7.00581 127.95251 152.21565 298.52029
14.25000 -3123.28820 4.52347 25.11907 95.07598 78.47560 297.88070
14.35000 -3102.85542 5.47814 20.53438 91.51621 70.54203 276.98623
14.45000 -3081.92523 1.21522 11.81055 102.15172 83.09125 278.73374
14.55000 -3060.34371 -0.28667 14.72834 125.23860 89.75424 288.21139
14.65000 -3041.83843 -0.50729 12.31265 118.68390 90.02334 282.87855
14.75000 -3024.05238 1.85995 11.76980 90.50374 82.75518 266.79857
14.85000 -3003.75662 2.41476 11.44123 119.32626 112.15419 275.10490
14.95000 -2983.45061 2.79135 8.77177 95.08215 86.66559 254.47155
15.05000 -2957.71149 -0.44216 24.13485 105.59963 115.85245 254.55762
15.15000 -2948.18310 -2.14240 8.21511 82.37313 109.51254 245.81983
15.25000 -2924.29993 8.49059 21.55201 140.24890 160.64779 264.13905
15.35000 -2912.89623 4.13475 0.21694 158.36558 66.85324 241.51185
15.45000 -2883.41078 2.75647 10.62775 142.97523 111.10838 256.28757
15.55000 -2872.05031 6.16727 6.15575 96.76902 88.14157 233.72255
15.65000 -2853.88109 4.72231 9.13500 103.59290 72.57403 226.52801
15.75000 -2836.98979 11.21165 2.37225 134.51783 142.78752 244.03318
15.85000 -2824.30113 2.60162 8.75961 150.66482 100.19383 244.17155
15.95000 -2794.40563 5.81314 12.20028 90.23720 66.65776 221.56933
16.05000 -2777.32412 2.72380 -4.08727 78.19926 101.21808 214.10033
16.15000 -2758.07396 7.28548 -7.82164 88.71008 107.59543 212.07827
16.25000 -2742.89710 7.37616 -6.63445 83.59636 76.99097 225.73409
16.35000 -2716.29478 6.74869 -2.85112 204.13735 73.44431 198.00479
16.45000 -2700.54430 9.78870 4.58491 78.03359 63.03226 203.82008
16.55000 -2685.85961 2.03649 -5.87382 69.50972 88.58474 201.08954
16.65000 -2671.63206 7.81129 2.51698 65.87133 59.24680 194.51754
16.75000 -2652.57396 4.43946 -16.32468 75.50317 48.56926 195.19902
16.85000 -2635.98196 5.96331 -0.86664 61.98251 41.78131 186.23058
16.95000 -2619.94581 8.32500 -4.21300 79.09125 75.58973 188.89458
17.05000 -2600.22965 8.33897 0.09986 67.70606 91.06644 187.31081
17.15000 -2580.78412 4.32050 -23.86430 77.42765 81.95790 197.31422
17.25000 -2570.39576 9.50593 -2.20462 68.44255 41.59269 175.34953
17.35000 -2551.51676 10.57530 -11.65582 60.21249 56.97959 175.43156
17.45000 -2539.18678 9.47942 -17.79679 60.81026 47.72172 185.83821
17.55000 -2526.62132 10.78703 0.86834 70.34193 116.44940 168.84260
17.65000 -2510.24262 7.51668 -14.21686 56.10016 40.83402 165.92431
17.75000 -2495.52049 8.68458 -13.94857 65.09439 62.59659 181.66702
17.85000 -2481.80664 7.08723 1.15962 63.14903 53.21020 164.27131
17.95000 -2461.59867 5.15355 -6.37664 110.86701 66.35213 170.94140
18.05000 -2455.08542 5.80450 -18.90199 52.31159 50.07145 166.57748
18.15000 -2437.36909 7.41117 -14.45166 73.60124 47.37236 165.78985
18.25000 -2428.09412 3.52414 -2.98007 84.43982 97.25511 164.64183
18.35000 -2409.55418 3.99526 -1.15283 88.75061 66.39934 184.07577
18.45000 -2400.77879 8.05703 -15.03323 45.48722 43.46939 155.37786
18.55000 -2377.78458 20.33643 -1.93326 235.09884 294.84675 162.12102
18.65000 -2370.54034 10.35899 -11.93069 103.60951 83.54950 156.62764
18.75000 -2360.20279 -8.41865 -15.06371 72.55321 267.82378 146.05414
18.85000 -2348.08273 6.19338 -0.75839 67.04014 51.55658 157.29821
18.95000 -2335.52265 8.36333 -6.97325 41.28757 41.28129 132.87860
19.05000 -2311.45599 4.44713 -12.13679 177.33555 63.81791 249.40482
19.15000 -2303.94249 3.31724 -4.78596 112.71086 73.76958 212.99645
19.25000 -2307.07461 1.44018 -3.72920 191.21160 78.67125 143.84346
19.35000 -2286.38945 8.84878 4.54401 73.23214 106.26518 183.70464
19.45000 -2271.01692 3.08684 -19.91635 56.09796 44.80884 140.60833
19.55000 -2259.51045 5.71148 -13.64471 50.57456 31.86881 133.83081
19.65000 -2247.44661 3.80505 -10.85450 45.38348 53.58414 135.71954
19.75000 -2230.46733 4.34631 -3.17092 41.53379 39.42052 119.36199
19.85000 -2215.63194 8.71845 -18.05409 72.52169 125.47699 123.41910
19.95000 -2235.78542 19.29693 -13.97812 489.74567 436.32597 136.55746
