0.12500 0.01183
0.37500 0.03483
0.62500 0.00870
0.87500 0.01098
1.12500 0.03036
1.37500 0.04212
1.62500 0.05184
1.87500 0.08131
2.12500 0.08457
2.37500 0.11615
2.62500 0.13073
2.87500 0.12696
3.12500 0.13430
3.37500 0.14255
3.62500 0.13121
3.87500 0.11276
4.12500 0.09675
4.37500 0.09518
4.62500 0.07081
4.87500 0.07559
5.12500 0.05978
5.37500 0.04547
5.62500 0.04437
5.87500 0.04559
6.12500 0.03551
6.37500 0.04599
6.62500 0.04016
6.87500 0.03425
7.12500 0.02912
7.37500 0.03161
7.62500 0.02583
7.87500 0.00821
8.12500 0.01489
8.37500 0.01053
8.62500 0.02027
8.87500 0.01920
9.12500 0.02125
9.37500 0.02296
9.62500 0.01575
9.87500 0.01550
10.12500 0.04300
10.37500 0.02435
10.62500 0.03570
10.87500 0.03092
11.12500 0.03636
11.37500 0.04942
11.62500 0.03501
11.87500 0.04670
12.12500 0.02251
12.37500 0.03128
12.62500 0.02114
12.87500 0.01144
13.12500 0.02835
13.37500 0.00567
13.62500 0.03072
13.87500 0.03950
14.12500 0.01423
14.37500 0.01423
14.62500 0.02122
14.87500 0.01312
15.12500 0.03188
15.37500 0.01080
15.62500 0.04024
15.87500 0.01482
16.12500 0.03761
16.37500 0.01795
16.62500 0.02996
16.87500 0.01377
17.12500 0.00652
17.37500 0.04122
17.62500 0.02555
17.87500 0.03116
18.12500 0.04174
18.37500 0.04941
18.62500 0.03484
18.87500 0.05222
19.12500 0.03498
19.37500 0.04581
19.62500 0.00416
19.87500 0.02901
