0.05000 -2012.21508 -59.27890 771.56425 933.52836 959.38577 1230.56471
0.15000 -2425.31597 4.44903 559.99206 1218.43870 970.02145 2817.05064
0.25000 -3434.10885 74.14430 373.39678 1269.59942 819.14995 3983.91216
0.35000 -4154.23429 71.24473 2.88832 1234.24356 780.96957 4926.43106
0.45000 -4565.96676 83.58440 -162.27480 1306.64001 779.85231 5496.01647
0.55000 -5016.37883 104.36382 -35.10214 1395.36653 723.91919 6198.19993
0.65000 -5405.55966 86.91824 -100.91767 1438.40875 707.98153 6470.96441
0.75000 -5659.46339 66.09406 95.82036 1473.15786 660.12942 6664.38940
0.85000 -5917.65914 84.35137 -9.23614 1435.68686 643.11559 6803.89386
0.95000 -6118.56255 68.77862 86.28445 1431.34552 624.53285 6781.94551
1.05000 -6265.85210 57.48355 15.80423 1424.26684 589.85158 6837.58612
1.15000 -6485.84970 72.01387 2.13904 1415.37298 578.19253 6667.85764
1.25000 -6633.31520 62.64458 -140.45750 1411.07180 545.31704 6528.74408
1.35000 -6724.56152 83.26795 12.09713 1331.79077 533.98763 6398.94442
1.45000 -6831.90786 71.26323 -139.30103 1283.69346 512.35759 6205.69627
1.55000 -6950.28478 72.09229 -66.56706 1183.72001 522.08524 5972.67669
1.65000 -7002.42756 72.03242 -68.77975 1202.21183 500.55886 5851.05791
1.75000 -7105.58644 79.06482 -64.54467 1114.15724 486.45534 5694.11902
1.85000 -7150.07418 73.32168 2.45465 1108.68799 487.09843 5587.82200
1.95000 -7249.73559 65.82852 -10.59995 1046.83081 481.63972 5389.79723
2.05000 -7310.53629 69.41518 -39.08182 994.57465 466.58345 5242.35400
2.15000 -7369.53748 68.48744 -18.84593 978.86217 462.64448 5114.96408
2.25000 -7444.82574 68.14578 -142.82124 919.47749 439.77175 4955.54616
2.35000 -7487.55849 70.87250 -72.02418 894.81505 420.59638 4832.29229
2.45000 -7503.50094 71.86778 -13.94614 907.35115 406.26837 4693.74693
2.55000 -7533.30195 73.15757 -1.38226 870.57198 390.45393 4534.79747
2.65000 -7543.43853 65.63469 -92.24801 839.25236 375.34577 4420.23762
2.75000 -7529.00736 63.32093 33.39171 802.47871 361.75065 4303.25893
2.85000 -7525.65632 73.48993 -124.23014 745.34465 353.70132 4172.43366
2.95000 -7524.94784 68.59910 -30.49215 724.15299 333.01172 4058.12325
3.05000 -7493.38567 68.90573 13.72865 697.21412 321.42566 3959.74146
3.15000 -7459.78562 64.97817 33.69015 666.79601 317.23985 3819.28106
3.25000 -7411.66812 69.21807 -38.07932 665.43143 303.17943 3739.79845
3.35000 -7377.56531 77.84004 -0.02842 624.71721 294.13744 3613.33687
3.45000 -7336.53633 73.69274 -13.59182 591.51102 280.33369 3467.63585
3.55000 -7289.35687 76.26586 60.85406 544.35511 280.53293 3390.06209
3.65000 -7239.73063 73.50001 -64.14127 530.34585 280.38527 3310.22792
3.75000 -7192.02752 71.55991 -26.62398 518.33370 274.63808 3245.81526
3.85000 -7161.60427 66.75841 -11.48738 488.86930 263.81747 3142.55889
3.95000 -7112.44324 70.77845 1.66889 491.00085 261.06123 3062.17488
4.05000 -7064.31105 75.40346 -107.25053 470.29267 254.25342 3001.67783
4.15000 -7039.68337 65.57077 -51.84545 432.57152 254.54661 2917.90634
4.25000 -6999.12922 64.30028 -17.42552 417.87116 250.47497 2814.32015
4.35000 -6951.84782 66.87656 -30.39458 397.38736 246.74783 2757.50833
4.45000 -6921.67443 60.77133 -33.04760 402.29585 240.02058 2698.26848
4.55000 -6879.11648 59.54576 -8.82148 394.80047 232.92538 2627.71555
4.65000 -6839.52681 60.72193 -31.57433 402.30003 231.22371 2614.51571
4.75000 -6824.36390 59.76415 -35.60622 386.30415 230.80762 2484.08946
4.85000 -6774.92676 58.14859 -18.38159 382.29406 216.26235 2443.69909
4.95000 -6742.18234 55.88758 -3.37528 361.47637 218.69988 2367.99275
5.05000 -6706.04899 56.06866 9.48123 361.07986 208.85756 2327.51131
5.15000 -6675.73193 50.58655 23.31682 359.98035 198.15470 2247.64655
5.25000 -6632.20245 52.57643 -23.03211 370.54612 196.50652 2207.90649
5.35000 -6585.07035 57.72633 53.02366 366.41954 191.21173 2195.64664
5.45000 -6546.15556 51.97803 26.40181 362.46553 188.50774 2111.55627
5.55000 -6494.53336 49.49992 31.70538 347.24426 182.75731 2068.53914
5.65000 -6449.10631 49.30053 -41.22192 336.39577 180.55174 2016.87734
5.75000 -6400.77902 49.17093 0.84708 320.44864 171.90739 1950.55575
5.85000 -6344.33764 48.53918 -15.35427 314.16176 165.01178 1898.67975
5.95000 -6299.01406 45.87024 -2.82664 316.41324 168.78534 1859.08686
6.05000 -6249.76044 50.37243 -6.06252 298.84942 172.23515 1802.65243
6.15000 -6199.66172 47.08899 36.01552 295.29828 158.93502 1765.47936
6.25000 -6150.86786 47.39613 20.62626 278.62145 158.34501 1703.14809
6.35000 -6095.41972 46.68390 23.23753 276.53864 155.74977 1680.62246
6.45000 -6050.94165 41.49444 22.66172 276.36174 149.72163 1640.12119
6.55000 -5993.72395 46.22371 -10.71685 268.19725 148.85926 1601.15957
6.65000 -5949.01196 42.01244 49.60827 268.79921 149.17161 1551.94241
6.75000 -5903.41195 42.60477 14.30936 245.45356 139.42272 1508.05307
6.85000 -5849.05130 41.68035 51.13376 238.89666 139.07179 1477.99633
6.95000 -5797.76191 41.01541 32.87785 246.76626 136.88178 1456.39047
7.05000 -5751.15664 37.67127 18.92402 223.65003 131.63725 1422.49953
7.15000 -5700.48926 38.40567 -7.14844 212.48031 131.09229 1376.97532
7.25000 -5644.63895 37.70915 11.19543 226.82391 129.15201 1358.89698
7.35000 -5601.11230 38.38631 37.65112 198.55008 125.29462 1321.27304
7.45000 -5555.90394 35.65448 38.31182 195.98450 127.06294 1295.40061
7.55000 -5516.56407 36.21223 43.99383 197.10977 127.15002 1249.88597
7.65000 -5468.52176 35.73010 24.13856 203.32277 123.43070 1232.38544
7.75000 -5417.89892 35.59381 33.02814 206.47829 118.01937 1223.76482
7.85000 -5378.47475 35.41612 21.69866 196.67716 119.72046 1190.20897
7.95000 -5338.55545 34.80226 37.97825 192.61406 117.23497 1158.35065
8.05000 -5298.60649 32.14822 27.12457 175.60623 113.07899 1119.51851
8.15000 -5261.65130 32.69895 31.16150 184.99636 114.14753 1091.06235
8.25000 -5220.04555 31.36232 30.59961 161.65595 116.94422 1064.93973
8.35000 -5182.11418 29.70492 25.90397 166.01950 115.03003 1044.12812
8.45000 -5135.51260 29.84090 40.59645 175.31568 107.96320 1041.85927
8.55000 -5099.69254 28.56996 44.81164 160.30604 113.13334 999.23826
8.65000 -5054.60990 30.40373 56.65936 177.68820 107.46447 993.72780
8.75000 -5014.95834 28.20794 8.89603 154.69624 102.61492 960.45214
8.85000 -4974.26730 27.79780 27.92926 152.00063 102.42843 943.15011
8.95000 -4935.65654 26.93820 52.22944 145.01015 103.19667 919.30760
9.05000 -4893.30873 27.00124 33.73625 164.25639 98.63364 899.16252
9.15000 -4857.60719 22.39871 49.73195 145.38615 101.86735 874.87488
9.25000 -4821.34598 26.23986 29.33062 152.60816 98.27356 857.34456
9.35000 -4786.75158 25.72216 44.46311 145.40188 107.97017 834.02060
9.45000 -4751.68135 24.16036 35.47366 143.65083 97.84144 817.81863
9.55000 -4709.88630 23.93033 31.46067 140.54643 99.98909 803.81867
9.65000 -4673.48783 26.60941 21.80843 135.71874 92.59720 778.45520
9.75000 -4632.50124 25.15603 13.18948 140.72850 94.08479 760.65525
9.85000 -4591.42075 23.38384 22.87964 143.20808 91.17011 745.80806
9.95000 -4554.37552 21.45838 21.28227 142.69012 89.12740 736.14180
10.05000 -4511.42819 23.83135 1.18843 126.73543 83.13874 712.43446
10.15000 -4472.29748 20.17475 13.62866 120.42732 88.81941 692.70431
10.25000 -4430.04597 22.65433 10.99827 115.31789 87.90442 691.01712
10.35000 -4391.82100 23.13315 7.40912 119.55506 86.13502 674.20303
10.45000 -4355.51509 21.87318 13.20472 114.24187 81.65618 661.24517
10.55000 -4321.93913 21.83031 19.11789 116.31078 85.97830 640.38736
10.65000 -4285.89198 18.94391 0.06726 115.08137 85.72175 635.45854
10.75000 -4251.56629 20.14050 25.13616 104.15472 83.45378 612.22727
10.85000 -4216.30878 20.56909 18.98441 108.00950 82.40103 597.03241
10.95000 -4181.60279 17.62918 4.11152 108.31151 85.86246 597.58316
11.05000 -4146.65226 19.04807 -3.21871 102.22946 78.60444 572.72976
11.15000 -4111.02036 18.10292 15.36009 102.65249 89.29917 572.42503
11.25000 -4081.03654 20.67190 13.38520 99.38062 75.66833 541.98364
11.35000 -4045.47562 18.33342 13.89769 94.27864 73.59601 537.71302
11.45000 -4010.17394 19.41164 2.97661 97.45384 81.28904 532.85748
11.55000 -3983.18792 16.69327 28.36594 100.35539 80.60016 511.59064
11.65000 -3953.27279 16.23681 1.31608 98.14028 79.50075 505.44917
11.75000 -3918.28862 18.17148 39.15740 105.01286 78.33828 504.84887
11.85000 -3889.01919 17.70066 17.10887 95.18435 72.35436 492.44784
11.95000 -3859.15047 17.77687 15.38351 89.80709 79.75778 483.34132
12.05000 -3831.13624 15.31871 16.46329 87.23354 69.64582 462.20255
12.15000 -3802.41137 13.69034 20.37953 83.36117 71.52971 463.62302
12.25000 -3772.57105 16.70503 20.14937 89.01332 74.85324 447.54432
12.35000 -3744.35132 15.85204 14.45639 81.50838 74.80197 445.36144
12.45000 -3712.68889 13.37531 28.61058 82.02113 69.85516 440.69474
12.55000 -3686.54427 14.62402 18.60834 85.82543 72.62005 419.14065
12.65000 -3659.68586 14.11167 18.35561 80.61241 72.97847 410.27304
12.75000 -3633.96188 13.28823 22.65723 91.36270 73.46547 407.50063
12.85000 -3605.91394 16.40052 13.60017 85.36639 70.43125 394.53342
12.95000 -3580.71583 15.68128 22.19734 75.77171 64.06081 387.25213
13.05000 -3552.49900 13.41983 33.81662 76.28058 73.03791 386.41854
13.15000 -3531.65413 15.70579 26.70942 77.12247 73.80912 373.52273
13.25000 -3504.39441 14.37986 31.48420 80.72659 68.04412 369.83042
13.35000 -3480.33154 13.22642 37.35281 78.53653 71.91019 353.30671
13.45000 -3457.36680 14.42542 19.22082 81.99840 67.69708 350.94693
13.55000 -3431.74113 12.56265 34.50436 79.20983 59.73413 347.66911
13.65000 -3410.14674 10.92995 29.07719 73.56007 73.04474 336.69525
13.75000 -3384.49553 12.06378 38.78318 75.90087 57.36038 332.15492
13.85000 -3359.03332 11.55214 14.93837 66.33559 63.56705 328.43614
13.95000 -3334.54605 14.69250 4.07958 66.18965 65.86217 316.75889
14.05000 -3312.58908 15.56353 15.27540 62.48483 61.95998 311.60686
14.15000 -3284.86888 14.25272 13.64931 69.36277 68.59139 308.20115
14.25000 -3263.10455 13.05383 29.25009 69.00709 65.27739 307.33829
14.35000 -3241.38512 10.08025 24.77052 64.36144 57.61360 301.35813
14.45000 -3221.11227 13.16860 36.22030 76.83174 66.70080 293.78721
14.55000 -3194.26493 10.07151 30.78006 63.61153 65.52397 282.15112
14.65000 -3171.24882 10.52080 19.51284 61.04962 57.26802 282.80662
14.75000 -3150.66590 8.13459 33.79534 67.86324 56.03374 282.85202
14.85000 -3127.79182 9.50152 37.54566 57.77657 54.09164 274.63839
14.95000 -3108.42272 12.79049 29.09539 58.91897 59.99285 264.25614
15.05000 -3087.43782 12.01270 25.02507 60.81570 57.75435 257.91783
15.15000 -3061.75890 8.87265 48.10550 56.39342 51.99718 269.73411
15.25000 -3045.15324 9.81127 33.07805 68.99800 60.20867 246.27046
15.35000 -3025.68805 8.77308 42.05052 58.10168 58.61194 245.11286
15.45000 -3004.52449 8.71642 46.17251 60.35215 50.25164 249.03365
15.55000 -2983.42018 11.39753 45.75837 59.85012 62.76183 232.46482
15.65000 -2965.58600 11.14171 35.15983 50.97427 57.26376 232.95684
15.75000 -2946.48168 7.86497 46.25533 54.65734 47.89106 228.45068
15.85000 -2926.14332 9.77170 48.49719 54.28263 45.85543 232.32864
15.95000 -2905.48195 8.14009 42.32729 52.62518 57.23022 222.87084
16.05000 -2884.12576 6.69559 40.78772 52.75942 52.67630 231.08528
16.15000 -2864.69916 10.72152 36.26868 59.04564 55.17668 226.80077
16.25000 -2847.34523 11.06450 34.98207 49.40668 48.96069 215.30919
16.35000 -2828.02020 5.54486 30.67549 74.07362 53.37814 202.04061
16.45000 -2809.55859 7.32808 45.06446 54.81088 62.78010 205.12573
16.55000 -2791.36036 7.29208 48.21030 46.84109 48.72231 201.87301
16.65000 -2769.40570 4.89913 24.48973 61.89513 54.99505 198.68652
16.75000 -2750.19525 9.60422 34.81055 56.53251 45.61036 197.81226
16.85000 -2734.66871 10.49552 31.90097 43.92844 42.64400 190.29243
16.95000 -2714.07548 8.89128 28.12723 45.38122 46.02190 186.87862
17.05000 -2701.32648 9.12249 16.29825 65.89403 48.93462 187.68203
17.15000 -2683.35674 5.40139 9.49857 53.17730 50.94289 187.62213
17.25000 -2666.23023 7.38679 3.41361 49.20431 52.22823 180.07147
17.35000 -2651.32400 5.95242 11.83168 53.86594 43.66749 181.48313
17.45000 -2636.32416 11.42820 14.66610 49.14155 61.02890 171.06709
17.55000 -2618.63084 7.56197 -0.06860 54.36791 42.59684 183.09187
17.65000 -2604.46825 6.40038 -7.48653 43.10266 57.75159 161.58586
17.75000 -2589.92295 9.62979 0.18701 46.76987 50.84963 163.04567
17.85000 -2574.86672 9.08858 6.86808 53.70072 34.89535 171.85966
17.95000 -2555.57745 7.79459 8.16094 54.36055 44.52529 169.89846
18.05000 -2541.37976 11.01754 3.40660 50.02818 53.84181 157.64007
18.15000 -2524.60003 8.38859 4.99799 47.29642 36.63919 161.27579
18.25000 -2509.00280 6.25033 -0.54287 50.35474 43.96782 151.96663
18.35000 -2494.33737 7.39138 4.67980 36.33570 31.46984 152.07719
18.45000 -2476.79227 7.25891 -2.33697 49.47168 50.46168 143.18614
18.55000 -2463.27522 3.18929 3.94756 48.63448 38.09971 154.57242
18.65000 -2449.11955 9.74153 -2.53775 35.53897 35.85012 140.18138
18.75000 -2436.61761 8.86602 0.69627 42.12042 40.75292 139.11787
18.85000 -2419.04291 7.05032 8.02046 50.85862 41.40438 146.27294
18.95000 -2407.29600 7.24401 2.14744 35.11416 42.38259 139.79201
19.05000 -2396.22653 5.37643 8.58742 39.42079 33.31705 139.15638
19.15000 -2375.55373 6.27076 -0.02109 54.78727 48.82989 140.08624
19.25000 -2368.06909 5.26970 2.67061 63.01500 52.92538 132.42193
19.35000 -2348.93585 5.15390 4.29978 40.07776 35.57536 135.82864
19.45000 -2339.52984 10.61144 0.06659 32.26370 45.16687 131.35641
19.55000 -2321.79400 9.00974 7.22732 43.73979 59.97343 138.86618
19.65000 -2311.36077 5.06464 -3.91228 45.95150 55.12451 128.48696
19.75000 -2300.25040 7.88330 16.92554 33.54934 39.90822 116.43149
19.85000 -2286.36888 9.16723 11.88159 35.67728 47.63151 127.13653
19.95000 -2276.57785 8.60108 -0.24714 33.13141 34.51240 118.68039
