0.120000 0.220100
0.380000 -0.306210
0.620000 -0.891320
0.880000 -2.062900
1.120000 3.092820
1.380000 3.087360
1.620000 2.806170
1.880000 2.731580
2.120000 2.698710
2.380000 2.733140
2.620000 2.724280
2.880000 2.759420
3.120000 2.773030
3.380000 2.797050
3.620000 2.734630
3.880000 2.686110
4.120000 2.612410
4.380000 2.605110
4.620000 2.515500
4.880000 2.256420
5.120000 2.047810
5.380000 1.586300
5.620000 1.556510
5.880000 1.559710
6.120000 1.440950
6.380000 0.997200
6.620000 2.162500
6.880000 1.948960
7.120000 1.591130
7.380000 1.700940
7.620000 1.712690
7.880000 1.428610
8.120000 1.602390
8.380000 1.301530
8.620000 1.814110
8.880000 1.718910
9.120000 1.939470
9.380000 1.989210
9.620000 2.368070
9.880000 1.503450
10.120000 1.791320
10.380000 1.438200
10.620000 1.952350
10.880000 1.684440
11.120000 1.375970
11.380000 1.450610
11.620000 1.571900
11.880000 2.424510
12.120000 1.342410
12.380000 1.124470
12.620000 1.164290
12.880000 0.988980
13.120000 1.318580
13.380000 0.346860
13.620000 -0.148240
13.880000 0.219890
14.120000 0.494770
14.380000 -0.172400
14.620000 -0.500990
14.880000 -0.388100
