0.05000 1597.17156
0.15000 3276.28129
0.25000 4529.52850
0.35000 5530.83642
0.45000 5950.56811
0.55000 6356.90035
0.65000 6555.86632
0.75000 6614.18007
0.85000 6615.29277
0.95000 6417.13946
1.05000 6275.52546
1.15000 6148.96608
1.25000 5964.58993
1.35000 5781.47287
1.45000 5586.85404
1.55000 5463.59860
1.65000 5208.45978
1.75000 5076.25980
1.85000 4854.63445
1.95000 4740.41684
2.05000 4516.99534
2.15000 4421.91655
2.25000 4260.04382
2.35000 4094.54478
2.45000 4019.19001
2.55000 3892.56325
2.65000 3755.01283
2.75000 3659.28325
2.85000 3474.20603
2.95000 3411.46974
3.05000 3326.70649
3.15000 3165.84511
3.25000 3113.84804
3.35000 2994.08948
3.45000 2904.42472
3.55000 2798.97851
3.65000 2706.97248
3.75000 2628.66753
3.85000 2498.81750
3.95000 2435.43173
4.05000 2339.11546
4.15000 2262.62967
4.25000 2211.11077
4.35000 2135.02414
4.45000 2015.98239
4.55000 2001.99110
4.65000 1948.35994
4.75000 1869.33079
4.85000 1843.28277
4.95000 1752.20238
5.05000 1715.26832
5.15000 1662.51677
5.25000 1607.71494
5.35000 1568.26071
5.45000 1503.59648
5.55000 1478.32152
5.65000 1421.99129
5.75000 1379.84506
5.85000 1330.82483
5.95000 1300.63610
6.05000 1285.92195
6.15000 1247.22107
6.25000 1196.23636
6.35000 1157.68498
6.45000 1134.60146
6.55000 1115.65510
6.65000 1077.04272
6.75000 1046.04847
6.85000 1019.69710
6.95000 966.11724
7.05000 960.63831
7.15000 934.28514
7.25000 914.81252
7.35000 879.01666
7.45000 864.30793
7.55000 834.91189
7.65000 816.91348
7.75000 786.37115
7.85000 770.05696
7.95000 745.61937
8.05000 719.07315
8.15000 707.17256
8.25000 678.91816
8.35000 669.26594
8.45000 650.33302
8.55000 648.13320
8.65000 629.76199
8.75000 603.07779
8.85000 588.82212
8.95000 566.28838
9.05000 570.38295
9.15000 549.83000
9.25000 540.38960
9.35000 521.58777
9.45000 498.33142
9.55000 484.94551
9.65000 484.13421
9.75000 465.58451
9.85000 449.72590
9.95000 453.63136
10.05000 433.70401
10.15000 427.87798
10.25000 413.57595
10.35000 404.23792
10.45000 395.33791
10.55000 391.33706
10.65000 376.14734
10.75000 367.86811
10.85000 354.76911
10.95000 348.42935
11.05000 341.20764
11.15000 328.24822
11.25000 322.07861
11.35000 315.74758
11.45000 305.69581
11.55000 296.36115
11.65000 300.83635
11.75000 271.56785
11.85000 272.93558
11.95000 265.49629
12.05000 260.28820
12.15000 262.55823
12.25000 260.65443
12.35000 239.29489
12.45000 239.73840
12.55000 236.98984
12.65000 230.33687
12.75000 223.13116
12.85000 214.53650
12.95000 217.05940
13.05000 211.89361
13.15000 209.12818
13.25000 202.50667
13.35000 197.30529
13.45000 193.89869
13.55000 190.61504
13.65000 182.53005
13.75000 181.67477
13.85000 179.53916
13.95000 169.61421
14.05000 167.17389
14.15000 167.08305
14.25000 162.63839
14.35000 157.64989
14.45000 157.06986
14.55000 147.57922
14.65000 153.75708
14.75000 150.09115
14.85000 137.02195
14.95000 135.73529
15.05000 142.14948
15.15000 134.03558
15.25000 138.69763
15.35000 132.12634
15.45000 132.30844
15.55000 128.23064
15.65000 126.91301
15.75000 127.63665
15.85000 118.40523
15.95000 114.44042
16.05000 110.43976
16.15000 114.79288
16.25000 112.85923
16.35000 109.27966
16.45000 104.47070
16.55000 111.59768
16.65000 105.32910
16.75000 111.28766
16.85000 100.25580
16.95000 101.44820
17.05000 96.98871
17.15000 100.83922
17.25000 99.27102
17.35000 100.21165
17.45000 98.89091
17.55000 104.72093
17.65000 96.51864
17.75000 91.05192
17.85000 85.63771
17.95000 95.86786
18.05000 83.01429
18.15000 78.68201
18.25000 98.64574
18.35000 79.81316
18.45000 79.02077
18.55000 72.92693
18.65000 80.85014
18.75000 75.28605
18.85000 79.12555
18.95000 71.01856
19.05000 73.04451
19.15000 73.38156
19.25000 64.96641
19.35000 64.53734
19.45000 68.89588
19.55000 57.50698
19.65000 63.65326
19.75000 62.87252
19.85000 61.28505
19.95000 62.40459
