0.05000 -1327.20301 135.39353 501.83608 1549.42353 1238.91225 1632.12690
0.15000 -2550.84974 64.82786 35.16978 1526.08039 1463.78876 2909.21821
0.25000 -4089.34225 34.54502 -89.59506 1805.09530 1575.02807 4480.87759
0.35000 -5290.05182 5.69229 131.32332 2102.40320 1706.13514 5824.80081
0.45000 -6403.91371 101.03719 -39.42557 2412.40170 1923.17978 6672.83417
0.55000 -7414.76035 147.96318 -99.22627 2820.07255 2143.07158 7613.31474
0.65000 -8232.94327 113.12617 -178.69031 3036.38166 2277.34934 8298.68685
0.75000 -8735.51083 86.18948 37.67802 3232.27781 2428.79602 8948.57045
0.85000 -9281.43460 72.78704 -40.09387 3294.65178 2557.26638 9307.06797
0.95000 -9537.64805 78.87419 21.21249 3344.09094 2649.18415 9588.41020
1.05000 -9767.31711 141.16509 6.97351 3294.57172 2654.21706 9713.24313
1.15000 -9987.92244 85.18067 -230.85201 3290.79481 2708.14764 9704.95746
1.25000 -10070.04571 103.70220 -49.89423 3180.28749 2704.16376 9575.89335
1.35000 -10062.83677 102.25467 -219.06451 3154.06332 2686.22130 9556.79186
1.45000 -10123.43624 79.17432 -228.88591 2983.25320 2700.65498 9292.35072
1.55000 -10106.70037 79.59808 61.84551 2875.80772 2690.91807 9085.85363
1.65000 -10060.75965 96.25696 80.97555 2831.45073 2630.18999 8870.49885
1.75000 -9993.24975 96.21312 -44.91595 2702.84235 2594.16316 8652.81691
1.85000 -10012.43559 127.96866 -179.03318 2580.22751 2562.21948 8363.80238
1.95000 -9960.01066 93.64830 -142.64817 2521.81987 2507.62851 8121.67779
2.05000 -9917.91402 85.40696 -193.77944 2390.35773 2455.54509 7796.29821
2.15000 -9784.62178 52.78106 49.34207 2255.88407 2413.89107 7631.37412
2.25000 -9640.41501 77.69026 -44.91292 2198.50161 2322.09993 7425.46662
2.35000 -9588.63904 26.30583 -65.63759 2088.88204 2288.48266 7131.38460
2.45000 -9464.72506 82.32426 -108.51357 2029.54551 2241.37402 6918.26847
2.55000 -9393.08664 52.35846 -115.89565 1902.43285 2206.42507 6641.37736
2.65000 -9247.96950 76.53735 -57.03702 1852.03619 2128.14385 6450.36818
2.75000 -9141.29465 77.92696 28.62845 1753.81114 2101.95225 6254.29762
2.85000 -9099.43720 65.52725 22.32735 1625.05294 2064.08519 5958.82352
2.95000 -8914.46307 104.28208 46.44920 1580.81875 1989.66520 5868.70912
3.05000 -8815.21792 73.32249 -37.81913 1517.55997 1965.55138 5656.79035
3.15000 -8683.58896 82.46438 -13.59245 1423.32477 1917.10721 5452.04707
3.25000 -8565.78295 3.17245 8.35786 1337.17040 1875.55322 5286.63645
3.35000 -8444.78257 55.72028 39.70478 1318.43948 1851.72509 5144.94633
3.45000 -8302.81059 31.72459 123.23946 1289.65705 1797.82574 5010.80463
3.55000 -8217.63328 87.42175 51.85922 1175.21609 1770.38057 4770.80708
3.65000 -8087.32207 -4.95420 18.30401 1129.45351 1728.59349 4660.78688
3.75000 -7944.35974 17.93623 16.61756 1117.46831 1696.14202 4542.66781
3.85000 -7818.96138 47.37419 -44.76314 1078.82045 1668.60018 4459.59847
3.95000 -7709.53131 47.17698 95.29094 1020.93828 1627.25168 4284.72328
4.05000 -7600.62837 23.64070 -67.13243 991.00720 1600.14020 4192.03026
4.15000 -7518.49880 44.60355 -18.54469 915.40930 1590.92713 4012.81221
4.25000 -7393.63188 66.75276 143.51653 890.32798 1552.77942 3952.91432
4.35000 -7320.09201 44.92861 127.50830 823.16804 1524.09562 3828.47091
4.45000 -7231.64284 62.16747 131.17095 807.55977 1488.33250 3775.43030
4.55000 -7156.19316 37.56816 102.93548 775.17669 1475.18796 3627.96837
4.65000 -7043.16541 42.22000 148.83161 758.22925 1423.90794 3582.83133
4.75000 -6958.58662 56.97056 66.97786 716.02833 1413.11171 3517.30471
4.85000 -6879.75112 26.56885 42.92762 692.24775 1375.34972 3450.12383
4.95000 -6809.07542 35.40735 117.62183 660.32835 1361.86147 3352.99064
5.05000 -6718.78296 52.76285 108.05359 669.46081 1334.09967 3286.19403
5.15000 -6645.48160 45.58122 153.55346 642.68542 1294.92773 3199.85621
5.25000 -6561.20485 50.96966 194.04833 632.65385 1274.93946 3153.76581
5.35000 -6508.67391 22.72152 158.98684 601.16414 1244.81724 3046.11071
5.45000 -6417.88505 21.15380 177.26274 574.58414 1185.17513 2981.71481
5.55000 -6341.10417 10.14581 141.34703 563.75644 1173.78387 2936.27694
5.65000 -6278.59454 41.68772 158.32673 553.32469 1140.08290 2856.52009
5.75000 -6224.30110 38.06671 160.07713 523.68446 1133.04823 2754.08954
5.85000 -6137.33485 42.61657 145.19043 519.24920 1094.18451 2656.94173
5.95000 -6060.02246 22.89084 97.06461 507.45257 1068.64809 2616.98664
6.05000 -5967.70502 19.23738 39.84113 488.91022 1027.88091 2562.96484
6.15000 -5899.51677 28.05785 78.55251 454.74090 1021.47040 2503.32141
6.25000 -5813.42142 31.95770 71.97323 436.57893 986.90258 2404.42279
6.35000 -5754.68039 28.57630 33.16989 426.55703 967.81460 2316.26632
6.45000 -5669.34628 48.06107 21.64269 417.56299 936.67914 2277.61075
6.55000 -5607.06691 54.95947 35.22168 387.26040 904.09723 2196.74395
6.65000 -5543.53811 38.13847 -50.17321 396.68418 907.96154 2144.17048
6.75000 -5488.52116 19.76797 -44.98890 373.57289 891.08863 2045.29072
6.85000 -5419.13853 36.97293 -31.81539 380.94143 854.56543 2045.18040
6.95000 -5378.23633 39.05982 -67.43942 367.81974 847.66318 1963.64997
7.05000 -5313.55766 29.43605 -114.44906 360.07133 819.45205 1912.08925
7.15000 -5270.38086 30.11305 -113.84390 371.11496 805.37712 1856.35521
7.25000 -5221.64224 20.51931 -92.08547 363.18302 797.04565 1827.20990
7.35000 -5166.98712 24.84554 -87.91629 363.64522 776.19665 1744.85710
7.45000 -5141.82585 27.09934 -51.13108 355.35802 763.84028 1691.23460
7.55000 -5118.70179 28.12203 -36.29717 358.69618 756.11119 1658.68619
7.65000 -5078.31753 -2.91219 -11.79640 369.32085 740.23156 1622.26575
7.75000 -5036.81422 7.74961 -61.03859 379.33354 725.11738 1587.17088
7.85000 -5013.86364 5.10241 -19.64098 384.63684 709.74669 1546.17411
7.95000 -4990.29907 -2.45761 -32.91881 385.99009 689.95116 1519.16832
8.05000 -4975.58308 -14.10382 12.42056 406.01136 678.99139 1483.17963
8.15000 -4962.93730 -3.10490 -8.08318 432.24119 665.41879 1457.62239
8.25000 -4927.05957 -21.09853 8.81734 432.73939 639.16782 1419.84537
8.35000 -4933.94565 -12.01638 22.68422 451.40173 628.19678 1376.30570
8.45000 -4901.27812 -15.99730 30.22239 448.12282 600.94018 1365.86084
8.55000 -4906.37902 -16.44659 6.35202 469.09838 596.13872 1323.80384
8.65000 -4891.11826 -33.34763 12.74913 497.58328 565.76096 1296.23952
8.75000 -4892.11671 -32.73478 11.47236 515.98663 545.20489 1292.09585
8.85000 -4877.36895 -16.23927 14.59550 521.59494 530.96600 1247.76764
8.95000 -4858.62544 -14.48767 25.56472 543.20894 503.35176 1216.38885
9.05000 -4843.11555 -12.61948 52.91987 553.74449 484.40077 1209.34944
9.15000 -4823.89557 -20.78072 46.13425 549.58257 471.13425 1146.00376
9.25000 -4778.41366 -31.28853 25.02753 553.22203 444.14995 1116.24363
9.35000 -4762.14443 -27.60140 2.02162 541.90500 423.25492 1091.27401
9.45000 -4727.22005 -12.07551 0.90286 539.67252 408.97431 1054.34228
9.55000 -4690.62276 -15.12380 14.39147 535.54014 387.86120 1022.01603
9.65000 -4642.47017 -0.30886 10.88618 536.90745 367.83139 983.23253
9.75000 -4598.64456 -6.62512 25.43647 525.32158 354.83475 965.60655
9.85000 -4555.77527 -4.04298 7.70910 512.40969 333.15907 930.18012
9.95000 -4507.69069 -1.17717 11.48564 489.86902 321.55268 903.36725
10.05000 -4459.46784 2.45412 12.56940 478.11438 305.98245 873.24770
10.15000 -4420.14633 -0.95481 26.78371 467.07458 294.68812 868.66786
10.25000 -4376.36058 -7.58151 39.56407 453.32266 280.38915 825.95421
10.35000 -4316.20823 6.96213 40.15469 426.10245 267.27166 812.26018
10.45000 -4277.73856 9.98912 -8.22721 413.74999 264.70585 782.21015
10.55000 -4241.06719 5.97076 19.40439 399.45819 247.88231 765.67987
10.65000 -4199.26779 6.79168 18.18237 384.18263 240.63851 746.57706
10.75000 -4169.00966 10.24252 26.05240 374.73277 230.94090 736.59123
10.85000 -4129.59531 8.13038 26.59863 363.04356 223.01242 722.00623
10.95000 -4077.14692 11.88500 -1.76574 347.22006 211.98311 696.22450
11.05000 -4041.71918 10.04092 7.85893 327.87535 201.46665 670.02328
11.15000 -4009.56085 8.05858 10.41455 316.78403 198.49895 660.33389
11.25000 -3965.17014 9.43309 14.30449 307.25256 186.21999 638.35782
11.35000 -3935.87238 3.76483 10.79469 292.28811 177.88933 642.00339
11.45000 -3905.56532 11.60768 -11.99725 284.51794 177.49837 595.83883
11.55000 -3874.97879 6.99666 9.83587 268.42704 172.88003 594.08232
11.65000 -3836.24349 7.97849 3.27625 267.51012 167.27861 600.37679
11.75000 -3808.61515 2.49926 34.38269 250.46893 160.53771 583.21372
11.85000 -3775.77216 5.37948 -2.31690 244.85640 158.02708 573.09215
11.95000 -3749.73293 8.00509 9.58649 236.95838 149.50609 547.76107
12.05000 -3709.48494 11.35080 -4.98225 234.07228 145.94643 542.20590
12.15000 -3677.91249 9.67655 -13.36686 222.17952 140.06324 533.65571
12.25000 -3647.07287 11.03070 4.59304 214.34239 136.08539 515.22866
12.35000 -3615.31421 8.17603 9.25995 209.52858 130.77315 512.59166
12.45000 -3592.92139 5.05819 6.53619 205.86754 135.47760 498.73661
12.55000 -3570.06520 5.92133 23.81211 190.46136 123.01920 487.19278
12.65000 -3537.81645 8.68726 5.39765 187.58818 121.40425 477.25010
12.75000 -3518.54192 10.31551 -6.14688 186.33182 115.99063 482.25131
12.85000 -3475.71124 1.51542 28.20625 177.17935 115.27967 464.55525
12.95000 -3452.69400 4.41492 -14.25832 171.70654 111.71722 448.68060
13.05000 -3426.40899 5.54069 -8.59896 168.25995 108.69165 447.51898
13.15000 -3399.60273 6.26826 8.51807 166.42596 106.06551 441.16108
13.25000 -3373.77318 4.85882 11.03341 158.79997 102.41447 442.34492
13.35000 -3349.97273 6.26944 -10.36772 150.06975 107.68952 419.66026
13.45000 -3322.81173 8.61109 -3.43432 150.38490 102.45018 426.43737
13.55000 -3297.09835 7.48828 -10.79722 151.76460 103.36432 412.74199
13.65000 -3273.85895 5.80650 -8.71961 148.83696 100.55153 413.14983
13.75000 -3255.51036 5.80048 8.24831 140.32593 96.48777 406.83686
13.85000 -3234.70576 2.23011 6.05469 144.32604 101.46858 387.95111
13.95000 -3210.71889 8.48507 -12.52243 140.10761 97.43061 381.30832
14.05000 -3185.95091 4.69669 -9.71157 130.25385 82.14594 377.37568
14.15000 -3161.92690 4.12400 -3.93305 131.60342 87.39970 382.10497
14.25000 -3143.59025 5.75919 -19.68335 129.00564 86.86975 368.49788
14.35000 -3124.11180 3.69515 7.39002 121.19919 90.53715 368.04439
14.45000 -3098.20009 5.15535 4.20684 122.06537 88.89176 361.83703
14.55000 -3078.26071 6.03767 -15.84328 112.39075 82.08137 358.43423
14.65000 -3054.58795 7.68096 -12.87787 114.26391 83.41187 349.50100
14.75000 -3037.82051 6.27241 4.50902 107.27134 80.68627 344.40905
14.85000 -3019.27491 5.59598 -0.90457 111.60537 75.47440 336.27900
14.95000 -2999.25106 3.93107 4.43002 108.37661 76.58999 339.30199
15.05000 -2978.46722 6.46825 0.92612 105.28740 71.96136 329.63649
15.15000 -2955.89796 7.90970 -11.47515 103.58272 80.10156 318.86367
15.25000 -2939.01680 5.37429 -7.41648 113.05410 78.94443 319.01749
15.35000 -2915.24407 3.78805 5.69868 106.90899 67.16590 319.19541
15.45000 -2896.70632 7.94331 -0.68157 101.36164 67.79991 314.78654
15.55000 -2876.12279 8.85385 16.69616 108.85613 74.26781 312.23036
15.65000 -2857.67445 5.45664 7.84506 107.07819 66.33128 304.16076
15.75000 -2838.36201 4.46904 -0.30224 108.06762 65.21762 298.81758
15.85000 -2820.37963 2.10625 -10.03080 104.04365 68.37840 295.16734
15.95000 -2805.29107 8.50194 11.23756 101.28386 68.74481 298.88232
16.05000 -2781.88202 7.18643 5.46627 103.24210 78.69896 277.62633
16.15000 -2767.35119 3.46707 -7.04104 106.05555 68.96763 286.57100
16.25000 -2748.22480 2.66181 0.75584 101.91890 71.79147 272.91747
16.35000 -2731.55185 7.47444 7.15284 101.57666 62.33285 277.32478
16.45000 -2713.66753 7.28070 7.59654 97.42122 60.66753 262.53440
16.55000 -2690.01733 7.43276 10.45885 99.72397 71.40239 273.16207
16.65000 -2674.23853 7.95422 10.29202 93.08861 60.52643 261.61180
16.75000 -2656.32878 7.44023 7.66589 103.00115 69.78523 264.49106
16.85000 -2639.42176 8.00977 10.98750 92.12603 57.14412 249.56639
16.95000 -2618.56353 8.67896 8.85766 99.61591 54.24611 253.91666
17.05000 -2605.62606 7.34085 20.69710 95.32319 59.45555 248.49095
17.15000 -2591.16196 7.00748 6.48525 94.78932 52.79231 239.68147
17.25000 -2575.54871 7.70859 4.89235 95.50210 67.12085 247.31618
17.35000 -2554.14437 8.07575 9.50673 88.93107 64.24705 249.00394
17.45000 -2537.27683 7.92339 14.03125 94.50905 52.95678 232.78633
17.55000 -2522.50737 9.79477 -7.94501 86.80349 50.26029 238.98163
17.65000 -2504.46288 6.33418 2.39384 90.35749 54.67775 238.47490
17.75000 -2491.68581 9.87607 4.93047 76.56543 47.43896 227.54156
17.85000 -2477.18659 8.60900 4.26058 79.35036 50.20350 231.85496
17.95000 -2467.04184 5.74272 6.62585 80.52940 59.95831 226.82144
18.05000 -2452.98900 5.47053 7.51278 73.63656 54.18260 224.57113
18.15000 -2446.30958 9.49932 5.05020 72.44672 61.10139 225.77408
18.25000 -2428.21044 7.72840 4.57228 66.00281 46.21759 220.49308
18.35000 -2422.38109 4.12981 2.99747 75.78240 69.31678 210.35295
18.45000 -2406.58702 7.72206 12.42862 77.76219 60.28814 217.02893
18.55000 -2395.13208 7.73729 8.99673 74.76931 54.98283 207.22685
18.65000 -2381.76914 8.08170 10.22000 62.15728 47.02477 220.20979
18.75000 -2373.69267 9.85052 -4.50072 67.77048 51.50206 201.71932
18.85000 -2361.22297 9.97752 5.06933 66.06088 49.55595 202.42602
18.95000 -2354.66805 10.27313 6.56916 76.74618 53.59329 204.59290
19.05000 -2337.80771 8.36600 9.26285 60.38352 50.74741 207.78959
19.15000 -2329.74709 5.11260 13.97858 58.19019 44.85050 200.66005
19.25000 -2313.96124 9.06375 8.70289 58.57001 41.08971 199.48095
19.35000 -2302.88217 6.83283 15.23555 55.39017 54.81313 207.46570
19.45000 -2296.10858 2.76709 4.06651 59.26495 45.93341 186.56140
19.55000 -2281.95299 6.17617 2.08383 57.79705 51.49348 187.51740
19.65000 -2270.54813 7.11516 10.74683 60.48571 56.25619 191.72674
19.75000 -2261.75208 6.94409 16.60057 51.12503 43.22126 177.26289
19.85000 -2252.20185 7.59549 11.55702 49.18283 41.85197 173.70172
19.95000 -2240.71472 4.49666 10.64460 52.90023 48.16601 172.47376
