0.120000 -0.212030
0.380000 -0.472250
0.620000 -0.689450
0.880000 -0.620340
1.120000 -0.669950
1.380000 -0.617690
1.620000 -0.636340
1.880000 -0.619790
2.120000 -0.610960
2.380000 -0.619820
2.620000 -0.611360
2.880000 -0.561370
3.120000 -0.616520
3.380000 -0.595420
3.620000 -0.596130
3.880000 -0.601450
4.120000 -0.593790
4.380000 -0.588630
4.620000 -0.624400
4.880000 -0.585340
5.120000 -0.568240
5.380000 -0.564380
5.620000 -0.589240
5.880000 -0.540750
6.120000 -0.580310
6.380000 -0.546310
6.620000 -0.466890
6.880000 -0.495990
7.120000 -0.514400
7.380000 -0.514560
7.620000 -0.512880
7.880000 -0.484540
8.120000 -0.501030
8.380000 -0.498230
8.620000 -0.547120
8.880000 -0.584430
9.120000 -0.527290
9.380000 -0.587770
9.620000 -0.698130
9.880000 -0.659090
10.120000 -0.791340
10.380000 -0.656880
10.620000 -0.817740
10.880000 -0.968960
11.120000 -1.034110
11.380000 -1.286930
11.620000 -1.523290
11.880000 -1.357220
12.120000 -1.482800
12.380000 -1.696230
12.620000 -1.748320
12.880000 -1.588890
13.120000 -1.810500
13.380000 -1.969390
13.620000 -1.416480
13.880000 -2.143920
14.120000 -1.112880
14.380000 -1.820770
14.620000 -1.258770
14.880000 -1.106190
15.120000 -1.194220
15.380000 -1.108740
15.620000 -1.456280
15.880000 -1.181400
16.120000 -1.583680
16.380000 -1.528300
16.620000 -1.201830
16.880000 -1.781930
17.120000 -0.775820
17.380000 -1.006360
17.620000 -1.523650
17.880000 -1.107270
18.120000 -1.400940
18.380000 -1.712690
18.620000 -1.741060
18.880000 -1.871060
19.120000 -2.038640
19.380000 -1.977800
19.620000 -2.276690
19.880000 -2.338390
