0.120000 -3.116450
0.380000 1.271010
0.620000 1.087970
0.880000 1.076720
1.120000 1.117180
1.380000 1.109640
1.620000 1.091130
1.880000 1.122860
2.120000 1.147540
2.380000 1.150890
2.620000 1.141530
2.880000 1.105640
3.120000 1.115710
3.380000 1.123770
3.620000 1.053240
3.880000 0.955200
4.120000 0.960850
4.380000 0.843680
4.620000 0.774990
4.880000 0.786410
5.120000 0.696930
5.380000 0.583880
5.620000 0.851850
5.880000 0.708870
6.120000 0.748260
6.380000 0.535540
6.620000 0.600200
6.880000 -0.151490
7.120000 0.078550
7.380000 0.245190
7.620000 0.951040
7.880000 -0.083670
8.120000 -2.251800
8.380000 1.442470
8.620000 -2.180360
8.880000 -2.786360
9.120000 2.203040
9.380000 2.442000
9.620000 -2.653130
9.880000 2.871860
10.120000 -2.581420
10.380000 -2.458690
10.620000 -1.803540
10.880000 -1.064890
11.120000 -0.937660
11.380000 -1.429610
11.620000 -1.646680
11.880000 -1.932430
12.120000 -0.661980
12.380000 -2.345120
12.620000 -2.347950
12.880000 -1.835570
13.120000 -2.027120
13.380000 -1.568910
13.620000 -2.002270
13.880000 -2.871570
14.120000 -2.978260
14.380000 -2.931910
14.620000 -2.390570
14.880000 -2.369110
15.120000 -2.484070
15.380000 -0.465640
15.620000 -1.951740
15.880000 -0.229090
16.120000 -0.846660
16.380000 0.511110
16.620000 -0.967400
16.880000 -0.108600
17.120000 0.489550
17.380000 0.818980
17.620000 -1.253710
17.880000 -1.784860
18.120000 -1.929170
18.380000 -0.758410
18.620000 -2.338540
18.880000 2.461760
19.120000 1.707990
19.380000 2.014650
19.620000 -1.242010
19.880000 2.569790
