0.05000 1738.00000
0.15000 2580.08922
0.25000 3567.09349
0.35000 4493.67550
0.45000 5282.13416
0.55000 5655.01339
0.65000 5895.72409
0.75000 5880.72194
0.85000 5915.00607
0.95000 5916.39581
1.05000 5887.55358
1.15000 5810.03127
1.25000 5695.39515
1.35000 5538.44500
1.45000 5287.41761
1.55000 5232.39933
1.65000 5025.33005
1.75000 4867.08028
1.85000 4818.10376
1.95000 4703.87411
2.05000 4515.19895
2.15000 4358.74916
2.25000 4275.55148
2.35000 4088.42560
2.45000 3977.76364
2.55000 3887.07193
2.65000 3750.77627
2.75000 3592.46169
2.85000 3537.44527
2.95000 3406.13394
3.05000 3359.98220
3.15000 3184.06362
3.25000 3142.70729
3.35000 3037.08264
3.45000 2989.68756
3.55000 2870.78480
3.65000 2785.65047
3.75000 2705.71564
3.85000 2587.54462
3.95000 2547.55288
4.05000 2485.02327
4.15000 2415.22865
4.25000 2367.99166
4.35000 2306.89713
4.45000 2227.87820
4.55000 2170.91169
4.65000 2106.83624
4.75000 2066.03875
4.85000 1995.66825
4.95000 1935.98428
5.05000 1907.61231
5.15000 1870.84730
5.25000 1816.06507
5.35000 1746.31167
5.45000 1722.54925
5.55000 1668.74290
5.65000 1631.26948
5.75000 1577.03822
5.85000 1555.66194
5.95000 1508.35835
6.05000 1458.02860
6.15000 1434.27355
6.25000 1382.26024
6.35000 1355.45858
6.45000 1315.57599
6.55000 1288.54636
6.65000 1251.73325
6.75000 1237.90674
6.85000 1176.47573
6.95000 1174.44577
7.05000 1127.53087
7.15000 1088.26484
7.25000 1051.56354
7.35000 1022.95956
7.45000 1025.39921
7.55000 996.14862
7.65000 947.25805
7.75000 941.65246
7.85000 927.38323
7.95000 907.95764
8.05000 890.34004
8.15000 853.33091
8.25000 829.83379
8.35000 823.66193
8.45000 815.80730
8.55000 767.28386
8.65000 760.48648
8.75000 734.66812
8.85000 718.22033
8.95000 706.57737
9.05000 687.24047
9.15000 672.25058
9.25000 654.19566
9.35000 637.90512
9.45000 622.68655
9.55000 598.99469
9.65000 594.11197
9.75000 579.89288
9.85000 565.85706
9.95000 556.20407
10.05000 534.99404
10.15000 527.42170
10.25000 511.62622
10.35000 496.00739
10.45000 470.64534
10.55000 473.85873
10.65000 467.10738
10.75000 446.35065
10.85000 451.51084
10.95000 431.85634
11.05000 426.68688
11.15000 414.70167
11.25000 406.31401
11.35000 392.69867
11.45000 388.56770
11.55000 380.23146
11.65000 365.46900
11.75000 364.48353
11.85000 352.36198
11.95000 350.60094
12.05000 335.85193
12.15000 332.05567
12.25000 322.65233
12.35000 318.84106
12.45000 310.59383
12.55000 300.03964
12.65000 295.18759
12.75000 281.30292
12.85000 283.46906
12.95000 286.27050
13.05000 276.21415
13.15000 267.37140
13.25000 262.04698
13.35000 258.07381
13.45000 249.84116
13.55000 242.83093
13.65000 239.30573
13.75000 243.80936
13.85000 235.66137
13.95000 230.93956
14.05000 226.70000
14.15000 222.95800
14.25000 205.50471
14.35000 211.48392
14.45000 203.34897
14.55000 199.56359
14.65000 205.52019
14.75000 197.03076
14.85000 198.49946
14.95000 195.84693
15.05000 193.52017
15.15000 182.67614
15.25000 176.41460
15.35000 173.53845
15.45000 175.40592
15.55000 171.46209
15.65000 169.50120
15.75000 163.65966
15.85000 163.65688
15.95000 155.79057
16.05000 156.56979
16.15000 152.68976
16.25000 144.77304
16.35000 148.67289
16.45000 142.39501
16.55000 137.08628
16.65000 139.85913
16.75000 141.06331
16.85000 133.74078
16.95000 133.20097
17.05000 140.06741
17.15000 131.76034
17.25000 127.02891
17.35000 134.50415
17.45000 124.98896
17.55000 126.36103
17.65000 123.51445
17.75000 123.16937
17.85000 122.71900
17.95000 115.65265
18.05000 109.59987
18.15000 108.00780
18.25000 101.39735
18.35000 103.98528
18.45000 111.96553
18.55000 102.89356
18.65000 100.10877
18.75000 100.11270
18.85000 101.11725
18.95000 88.88589
19.05000 94.26896
19.15000 92.65662
19.25000 91.78879
19.35000 89.97067
19.45000 88.13855
19.55000 90.49527
19.65000 82.34474
19.75000 86.76843
19.85000 74.88833
19.95000 85.76803
