0.2 0.98763 14.49859 0.74819 120.80041 119.54782 89.51432
0.6 0.54357 33.63619 -0.25852 121.32572 114.23924 85.53567
1.0 0.20578 54.17647 0.89427 121.02828 104.97342 81.47542
1.4 0.44689 66.71725 0.74642 120.76722 97.89197 77.30302
1.8 -0.19097 73.31014 0.20315 118.53543 91.29535 73.01188
2.2 0.33459 76.81757 0.07536 114.39002 86.19745 68.52857
2.6 -0.20393 81.39485 -0.29581 111.73208 81.7773 64.9617
3.0 -0.35014 83.75649 0.3324 106.4106 77.61399 61.40069
3.4 -0.03942 86.63714 0.38137 102.15747 75.00323 57.71366
3.8 -0.97435 90.43122 -0.11276 97.34445 71.5317 55.05088
4.2 -0.46643 93.91246 0.36338 91.64242 70.17404 51.82651
4.6 -0.94939 102.5008 -0.02417 85.6498 70.22507 49.63884
5.0 -1.25522 112.73471 -0.72635 80.92509 70.84768 47.91081
5.4 -1.93803 124.98992 -1.10741 76.49995 70.56946 46.46673
5.8 -0.47746 139.96918 -0.29225 71.75262 68.17816 43.95843
6.2 -0.60078 154.17615 -1.27805 65.78451 64.16883 41.76117
6.6 0.2708 164.97088 -0.80417 60.626 58.9585 39.33381
7.0 -0.47044 171.10622 -1.38304 55.32381 53.52514 36.2257
7.4 0.00707 174.22884 -0.88852 50.69214 48.95607 33.79581
7.8 0.30865 176.87459 -0.71425 46.6053 44.7175 31.32951
8.2 -0.23203 180.17199 -0.65215 43.91875 40.7203 29.01429
8.6 -0.30211 183.20844 -0.69228 42.03032 36.46469 27.00825
9.0 -0.9739 186.99145 -0.01985 41.1674 32.00523 25.88748
9.4 -0.99316 189.85106 0.30616 39.71042 29.54946 24.57079
9.8 -0.2588 192.03322 0.07184 38.02094 28.61993 23.96082
10.2 -0.43947 193.56829 -0.09221 36.54275 28.3993 22.96821
10.6 0.1794 194.86241 -0.2158 34.97039 27.26564 22.23005
11.0 0.39211 195.94287 -0.24411 33.2505 26.55216 21.29515
11.4 -0.08984 196.34249 0.01808 32.28767 26.09313 20.28951
11.8 0.40905 196.80322 -0.10909 30.78169 25.82592 19.59229
12.2 0.09484 197.76278 -0.13809 29.96698 25.04827 19.03595
12.6 0.11073 198.59567 -0.12294 28.66623 24.13684 18.08528
13.0 1.05784 199.41291 0.40918 28.25494 23.7707 17.43561
13.4 -0.09253 200.61958 0.38108 27.54973 22.12528 16.86669
13.8 0.77993 201.63927 0.68132 26.7305 20.93436 16.42813
14.2 0.23545 202.40807 0.88914 26.62111 20.0044 16.15604
14.6 0.01285 202.72096 0.55874 25.73691 18.4049 15.50121
15.0 -0.42429 203.16576 0.66971 25.22818 17.76446 14.85387
15.4 0.72451 204.27769 0.28931 24.53851 17.35099 14.72159
15.8 0.33584 203.43675 0.43259 22.95343 17.66283 13.85593
16.2 0.42235 204.22702 0.82457 22.00369 17.25 13.46526
16.6 0.15413 204.27519 0.48527 21.6153 17.04589 13.41189
17.0 0.50449 205.10976 0.7272 20.76912 16.85854 12.55236
17.4 1.11522 205.14408 0.37881 19.84969 15.96675 12.72876
17.8 0.24901 205.27354 0.73624 20.00377 15.36197 12.38683
18.2 0.82844 205.56079 0.68658 20.12416 14.40278 11.99687
18.6 0.72289 204.77514 0.78867 18.95863 13.84338 12.34931
19.0 0.79127 205.10115 0.45267 18.96934 12.50439 11.71039
19.4 0.43928 203.87891 0.34269 17.67689 11.87099 11.87027
19.8 1.16127 203.81933 0.19719 17.73391 11.47155 11.33971
