0.05000 18997.95969
0.15000 26716.80214
0.25000 25594.62822
0.35000 23156.82427
0.45000 21244.44581
0.55000 18646.85648
0.65000 17342.58140
0.75000 15330.24767
0.85000 13979.24766
0.95000 12918.81408
1.05000 12117.83713
1.15000 10967.76687
1.25000 10401.76618
1.35000 9635.14374
1.45000 8852.28680
1.55000 8440.65682
1.65000 7997.62271
1.75000 7420.74052
1.85000 7168.22254
1.95000 6716.64653
2.05000 6323.23716
2.15000 6079.38979
2.25000 5833.47270
2.35000 5493.83269
2.45000 5345.30645
2.55000 5207.01919
2.65000 4947.23386
2.75000 4810.24625
2.85000 4592.32526
2.95000 4545.23921
3.05000 4311.59259
3.15000 4099.30418
3.25000 3975.48317
3.35000 3963.28703
3.45000 3728.40265
3.55000 3629.13905
3.65000 3637.89501
3.75000 3393.16453
3.85000 3269.89882
3.95000 3123.48651
4.05000 3082.77761
4.15000 2975.99675
4.25000 2828.49466
4.35000 2782.61552
4.45000 2701.41040
4.55000 2696.27131
4.65000 2590.85487
4.75000 2539.33149
4.85000 2429.09821
4.95000 2438.52977
5.05000 2318.84984
5.15000 2280.23607
5.25000 2298.03285
5.35000 2179.98704
5.45000 2122.06815
5.55000 2082.27567
5.65000 2043.35864
5.75000 1931.06003
5.85000 1954.08666
5.95000 1848.62499
6.05000 1811.97362
6.15000 1772.16133
6.25000 1741.71421
6.35000 1727.10289
6.45000 1669.53169
6.55000 1611.98386
6.65000 1597.85038
6.75000 1561.85052
6.85000 1497.31590
6.95000 1444.56239
7.05000 1453.27110
7.15000 1413.97470
7.25000 1378.35069
7.35000 1325.02171
7.45000 1311.78000
7.55000 1276.91109
7.65000 1214.28011
7.75000 1218.04390
7.85000 1195.59648
7.95000 1218.61659
8.05000 1114.07806
8.15000 1077.97537
8.25000 1089.58825
8.35000 1032.45215
8.45000 1007.36130
8.55000 1002.63006
8.65000 970.18229
8.75000 961.78550
8.85000 919.82824
8.95000 950.07368
9.05000 904.58217
9.15000 866.07270
9.25000 859.40683
9.35000 854.38681
9.45000 810.03646
9.55000 771.94536
9.65000 774.40913
9.75000 747.86341
9.85000 733.35250
9.95000 696.36030
10.05000 709.66114
10.15000 685.85025
10.25000 704.34392
10.35000 650.55518
10.45000 658.72109
10.55000 670.07818
10.65000 641.12058
10.75000 612.41505
10.85000 609.26420
10.95000 608.42333
11.05000 600.80459
11.15000 592.23566
11.25000 580.80194
11.35000 563.03264
11.45000 548.62181
11.55000 531.42556
11.65000 534.57820
11.75000 536.60030
11.85000 510.23368
11.95000 505.22372
12.05000 521.06903
12.15000 477.81122
12.25000 486.15699
12.35000 465.97537
12.45000 468.73923
12.55000 450.73906
12.65000 433.95809
12.75000 435.24805
12.85000 447.59054
12.95000 424.88556
13.05000 403.61531
13.15000 424.63414
13.25000 409.67524
13.35000 391.02198
13.45000 401.01813
13.55000 407.49090
13.65000 382.35163
13.75000 382.89015
13.85000 364.74545
13.95000 378.98921
14.05000 357.47137
14.15000 372.56424
14.25000 342.74665
14.35000 327.38742
14.45000 346.23032
14.55000 318.59164
14.65000 347.15364
14.75000 327.26882
14.85000 325.46484
14.95000 301.99979
15.05000 298.31661
15.15000 305.72963
15.25000 291.00209
15.35000 290.50563
15.45000 296.22317
15.55000 292.27052
15.65000 262.12872
15.75000 272.11889
15.85000 255.51320
15.95000 262.16656
16.05000 255.26627
16.15000 255.21225
16.25000 243.82376
16.35000 243.93370
16.45000 280.08362
16.55000 266.11469
16.65000 253.96816
16.75000 232.29761
16.85000 224.26090
16.95000 233.49786
17.05000 216.68627
17.15000 219.40584
17.25000 214.68323
17.35000 209.10954
17.45000 206.07259
17.55000 186.25954
17.65000 190.28067
17.75000 193.25606
17.85000 193.19869
17.95000 185.78265
18.05000 187.98552
18.15000 189.77221
18.25000 193.59587
18.35000 192.36156
18.45000 196.93122
18.55000 181.98624
18.65000 181.82629
18.75000 170.31759
18.85000 176.93974
18.95000 188.33410
19.05000 163.28826
19.15000 146.63591
19.25000 160.25106
19.35000 167.25796
19.45000 151.59371
19.55000 159.65495
19.65000 150.21422
19.75000 165.33383
19.85000 154.45379
19.95000 134.24962
