0.05000 -881.72991 -188.55088 -31.43427 935.06759 1466.74897 1368.66757
0.15000 -2052.46138 47.62737 573.08556 1103.02389 1255.11551 2600.07652
0.25000 -2722.84305 77.90274 -38.55597 1109.36211 992.83051 3410.89763
0.35000 -3172.64888 68.38241 -88.73914 1339.87429 810.58912 4161.71948
0.45000 -3603.88602 64.22325 388.75119 1197.35775 737.39723 4526.56268
0.55000 -3870.48235 62.45541 9.55866 1158.83296 641.46278 4825.75486
0.65000 -4066.15692 45.71351 135.37340 1193.99249 592.16440 5228.16187
0.75000 -4361.43314 57.47482 179.38693 1205.85797 550.91730 5544.59413
0.85000 -4633.37445 79.31519 -197.95276 1259.81227 541.75928 5708.30777
0.95000 -4884.01101 95.01472 20.72812 1255.01150 498.99701 5785.57104
1.05000 -5037.40276 73.88551 80.79650 1254.46958 470.78796 5878.50553
1.15000 -5266.14390 98.90313 -61.03619 1206.00730 456.45719 5848.23467
1.25000 -5476.68937 84.13370 -181.00889 1158.67099 433.63952 5829.13222
1.35000 -5604.69692 79.96536 -28.73032 1087.86644 417.44730 5785.51353
1.45000 -5740.24854 97.41744 -113.97821 1099.23783 392.70409 5641.59321
1.55000 -5863.97354 102.25788 -64.77653 1059.43612 384.50845 5625.34237
1.65000 -6009.76049 99.80974 0.70529 1059.97831 376.25649 5496.53972
1.75000 -6143.03406 104.80556 80.89788 1030.69421 371.47167 5412.90909
1.85000 -6292.76743 104.54271 -25.97328 974.45557 352.04555 5250.96911
1.95000 -6398.86018 104.93717 -26.89484 958.69750 351.21846 5154.51311
2.05000 -6493.54597 104.69440 58.75550 985.98054 331.52170 5078.20902
2.15000 -6607.66237 105.52667 -47.08648 917.74612 319.74857 4938.97896
2.25000 -6671.41145 102.99973 60.25681 888.33807 318.36632 4860.35664
2.35000 -6752.89543 112.41688 -87.88144 889.15784 313.48687 4731.71309
2.45000 -6823.65227 113.65038 -16.43356 887.34609 316.77936 4647.92059
2.55000 -6886.06307 118.71894 37.58697 831.65375 293.23133 4529.25639
2.65000 -6930.62481 110.96210 39.33565 809.68105 290.38653 4359.68619
2.75000 -6932.21768 118.53684 -5.41102 797.69117 278.26315 4337.53554
2.85000 -6929.87091 113.74410 -46.52055 752.61512 269.95053 4196.03555
2.95000 -6931.35200 122.14531 -19.80649 705.09502 276.28027 4103.40429
3.05000 -6967.25919 117.28786 -4.40100 680.91394 274.40822 3948.54271
3.15000 -6953.65077 110.63178 -25.19534 689.95833 267.00818 3907.55435
3.25000 -6964.53118 120.99319 8.24054 634.92981 262.83653 3799.80451
3.35000 -6967.54420 123.80695 -16.88951 621.17623 248.68603 3704.56471
3.45000 -6953.04849 119.84242 -7.41111 621.85498 246.66857 3617.84223
3.55000 -6984.33505 124.10432 5.20976 556.46092 248.24545 3495.64186
3.65000 -6960.47356 124.20537 32.71710 562.98269 232.14728 3435.21148
3.75000 -6939.34540 125.12009 -33.73448 567.41799 236.04510 3362.53048
3.85000 -6960.12229 121.02147 20.16899 544.37756 234.67380 3255.31391
3.95000 -6935.97336 118.14947 -40.68439 532.18630 223.78483 3193.53266
4.05000 -6919.52677 120.45837 -55.40821 519.23971 214.22234 3076.63261
4.15000 -6871.55192 120.45203 -37.63076 514.45630 213.89716 3029.02791
4.25000 -6811.45559 117.21431 -26.21977 501.40609 210.18542 2965.07841
4.35000 -6772.80589 115.42097 18.42303 470.84629 206.45941 2900.59113
4.45000 -6722.71222 117.65628 3.95663 453.30343 196.41010 2801.29703
4.55000 -6659.26436 115.58432 60.94087 429.06203 197.36198 2742.04970
4.65000 -6594.29720 117.08390 64.98503 439.12304 196.09539 2684.01885
4.75000 -6534.49212 113.52960 -40.62873 408.35048 196.85919 2606.67879
4.85000 -6455.04612 116.70548 -38.71729 391.88779 184.51728 2581.41366
4.95000 -6394.10520 117.11976 0.68313 374.33481 188.31493 2499.16170
5.05000 -6338.39283 115.44940 -73.55775 344.73372 180.05094 2446.54478
5.15000 -6289.22164 119.37110 -8.89941 325.68080 178.38304 2377.63031
5.25000 -6243.40245 118.08170 -48.86394 314.45490 182.30507 2303.46869
5.35000 -6208.98889 117.19832 -12.13352 292.10636 175.58239 2240.36887
5.45000 -6179.45036 122.41492 -42.79011 305.95115 176.73785 2203.23429
5.55000 -6145.92676 118.52806 -41.31528 297.80684 175.19455 2178.17718
5.65000 -6126.13572 117.78724 -100.11249 291.53877 175.48869 2135.41119
5.75000 -6114.00899 117.20172 -16.73161 283.81077 169.54994 2075.38358
5.85000 -6103.67829 117.81802 9.89927 298.24924 176.29591 2046.38503
5.95000 -6090.81920 115.25307 -32.40227 291.33606 159.70245 2011.79505
6.05000 -6079.64804 115.97912 -78.59001 299.13810 160.02948 1953.94251
6.15000 -6064.53072 112.78807 -27.78427 310.11538 166.73573 1923.94918
6.25000 -6049.41554 112.63305 7.14294 307.55801 158.87472 1887.01905
6.35000 -6023.33875 111.65927 -38.27385 313.93787 157.98908 1847.76898
6.45000 -6000.31015 116.72281 -19.81949 286.33546 153.22267 1782.77941
6.55000 -5962.27691 113.17442 13.36895 310.65027 152.80997 1763.47882
6.65000 -5922.12531 108.96001 -28.86270 318.07632 150.59058 1735.98531
6.75000 -5877.86067 111.83120 49.48532 313.91592 146.81526 1682.27593
6.85000 -5837.40109 110.98975 91.27454 293.35921 143.76447 1633.21320
6.95000 -5786.54564 105.66977 38.59239 283.07230 144.11455 1615.57555
7.05000 -5732.38019 112.05786 56.25819 278.01635 137.72502 1572.61794
7.15000 -5679.18637 108.02771 49.26757 268.49696 138.25142 1560.38884
7.25000 -5636.89559 108.17586 44.58200 258.02149 129.90171 1482.40182
7.35000 -5570.40183 109.07919 63.89777 241.66676 132.83760 1466.74937
7.45000 -5525.89627 107.46864 68.91849 248.60165 128.63408 1422.61825
7.55000 -5470.70459 110.15656 109.96554 235.63326 127.60876 1390.81323
7.65000 -5423.64188 106.60855 44.98581 246.34444 134.61412 1357.07394
7.75000 -5373.84554 107.30473 44.41944 218.92175 124.25215 1344.35828
7.85000 -5323.71792 107.06760 72.16285 215.39949 120.47188 1301.93461
7.95000 -5272.95203 109.57039 30.74447 219.02368 121.20125 1277.38329
8.05000 -5224.90115 105.33154 40.88984 207.14107 126.72313 1229.35533
8.15000 -5172.90970 108.51528 27.97231 190.34536 118.81238 1205.05726
8.25000 -5135.99667 104.64732 -1.66462 188.82866 121.99747 1172.00557
8.35000 -5089.68714 101.81805 16.91954 191.97551 117.52714 1155.34263
8.45000 -5046.53605 105.61137 33.36447 175.05662 118.92996 1122.83568
8.55000 -4990.89350 100.83125 -8.65877 173.65218 112.63685 1119.98539
8.65000 -4941.76869 98.83448 -9.30197 162.89317 114.19003 1076.11444
8.75000 -4900.22595 103.54850 -53.23834 166.30893 112.21521 1051.28428
8.85000 -4857.36443 98.60581 -26.64393 166.48690 117.81193 1028.51064
8.95000 -4821.13777 100.06051 -22.71677 164.03185 116.40179 997.07985
9.05000 -4778.96446 99.25988 -24.72487 153.92026 109.67183 972.98437
9.15000 -4735.54468 99.00040 -20.24930 146.01745 103.44054 968.17084
9.25000 -4698.17514 96.79644 -33.75850 152.52817 114.78165 946.30541
9.35000 -4661.33166 97.23194 -58.72705 158.48596 109.17998 928.16499
9.45000 -4624.27842 97.29002 -45.17771 150.89532 103.31728 898.69706
9.55000 -4591.97830 95.60541 -58.94032 147.67527 109.07421 871.72038
9.65000 -4561.89560 97.35887 -48.18902 134.53196 108.45612 845.32631
9.75000 -4522.52510 95.36234 -40.83697 143.24765 100.83442 841.89242
9.85000 -4487.10279 94.88518 -43.04590 140.46663 102.66918 828.91746
9.95000 -4451.23975 92.18730 -31.14199 146.38386 97.50947 807.97668
10.05000 -4427.51138 93.56860 -44.90531 141.89064 98.74727 786.23208
10.15000 -4389.60581 93.68049 -38.50470 131.98434 92.68801 775.49926
10.25000 -4360.30032 92.68340 -43.19265 130.82373 97.38451 753.67710
10.35000 -4326.32710 91.64931 -1.70877 135.50029 101.20455 741.26350
10.45000 -4297.09218 94.08488 -7.68559 147.42954 97.51203 726.03273
10.55000 -4266.18072 91.28106 -8.46161 126.84159 91.95433 718.01164
10.65000 -4238.30665 89.33385 -1.15267 129.05359 95.72217 704.67536
10.75000 -4196.71479 88.03924 8.50611 145.42029 95.34643 694.57586
10.85000 -4158.61745 87.99491 39.58174 138.71753 88.80097 676.19663
10.95000 -4124.13278 85.35686 -0.76726 120.76823 89.39490 661.29818
11.05000 -4090.85712 86.37175 21.01846 128.20775 95.81527 651.57898
11.15000 -4056.07994 85.87262 45.32689 121.41027 90.23240 629.99060
11.25000 -4016.16208 86.89532 40.20059 144.08752 89.02297 624.44764
11.35000 -3983.37149 82.34374 59.09733 109.27800 90.61017 604.64602
11.45000 -3950.64601 83.05047 16.44283 135.02286 93.42706 580.92150
11.55000 -3911.23493 81.45730 56.90679 108.87971 82.09552 591.63456
11.65000 -3883.68177 83.52922 45.74726 110.93723 86.11698 571.91589
11.75000 -3848.26602 85.97834 56.20225 104.23963 79.55682 555.53951
11.85000 -3808.51716 83.38174 48.29279 109.98947 89.46272 545.12693
11.95000 -3775.63249 81.42966 51.66072 96.46702 76.56585 539.85902
12.05000 -3739.45497 80.16300 45.04833 95.35260 83.06148 531.07616
12.15000 -3711.57742 81.01621 74.67040 108.84378 83.13794 519.33200
12.25000 -3685.25245 79.44069 78.81090 97.28120 83.15620 501.65674
12.35000 -3652.83341 78.20297 36.57419 96.55393 78.68894 499.43344
12.45000 -3623.44864 79.75814 70.09299 94.87955 91.20007 489.78221
12.55000 -3595.59823 76.89171 44.59183 91.22148 71.91169 479.42254
12.65000 -3565.70168 77.95151 50.87212 89.64475 73.17148 475.69527
12.75000 -3544.51392 75.60338 57.99434 90.29998 75.97529 469.85901
12.85000 -3516.29821 76.78611 35.56767 85.42864 68.89458 467.44096
12.95000 -3489.75882 75.27085 53.03667 83.40069 81.88945 452.09967
13.05000 -3467.24863 74.42035 49.67235 82.26312 67.96281 446.45820
13.15000 -3440.09466 78.39480 28.65936 85.64462 75.25801 442.04497
13.25000 -3420.51638 73.53293 40.75675 80.72097 75.06777 429.98931
13.35000 -3394.31438 72.57125 50.55581 81.11130 72.68893 428.93225
13.45000 -3376.00566 73.97113 33.21257 82.89058 71.28057 418.59663
13.55000 -3354.14817 73.85997 34.09189 86.02915 76.59410 420.74858
13.65000 -3334.29371 71.89335 22.25142 78.83512 68.98325 412.60840
13.75000 -3307.00267 70.03905 29.59517 82.35025 63.36735 408.43810
13.85000 -3290.00900 70.92425 26.46683 86.83617 70.71705 399.56270
13.95000 -3267.82098 70.88985 43.89546 84.43027 78.37492 400.14314
14.05000 -3247.12274 67.80407 20.07994 77.97798 69.94447 393.03552
14.15000 -3229.24958 72.42601 35.34957 84.61738 71.01129 383.92256
14.25000 -3212.41012 68.83561 28.72992 81.20722 65.52174 376.23797
14.35000 -3193.92015 67.77988 24.80606 83.11914 64.65167 369.74659
14.45000 -3171.12192 69.38784 13.04088 82.43290 60.78488 367.66660
14.55000 -3152.98997 67.27215 7.71957 81.40879 71.79627 355.38256
14.65000 -3134.51036 68.93466 1.36315 75.21843 60.02144 350.34226
14.75000 -3118.21535 64.88941 10.08998 74.12131 76.65247 339.03186
14.85000 -3096.10831 67.14110 6.63650 81.54103 77.51691 334.79228
14.95000 -3081.62681 66.51502 5.85195 77.05247 63.76387 330.97479
15.05000 -3064.13565 66.52352 -4.34861 72.57415 64.11405 322.36968
15.15000 -3039.71260 66.89243 15.94446 79.62857 61.21583 319.77196
15.25000 -3023.16550 64.40079 5.18991 70.79423 52.41963 314.78413
15.35000 -3000.58105 64.57715 6.62932 79.14485 71.37443 302.44787
15.45000 -2983.24182 63.47107 0.33173 76.45967 62.35735 306.18406
15.55000 -2965.26432 65.24996 11.91251 71.86377 57.66285 294.30867
15.65000 -2946.99428 63.65715 -23.09784 72.24025 66.20852 275.14743
15.75000 -2927.87832 62.24132 10.19213 67.48389 53.78724 272.43651
15.85000 -2907.30392 61.03144 -4.94393 71.59820 61.68337 277.41824
15.95000 -2888.94283 63.86140 -3.52304 75.55199 60.97844 262.73680
16.05000 -2875.97760 60.45782 -7.07399 66.70403 52.29076 264.77594
16.15000 -2854.22338 61.30716 -14.00337 65.90433 57.33410 247.63233
16.25000 -2835.97763 60.93901 -4.59669 61.05714 56.57689 249.72553
16.35000 -2817.80392 59.84818 -4.54291 63.98296 61.76942 238.02048
16.45000 -2801.20974 62.03534 -15.04571 69.04927 64.64952 236.86562
16.55000 -2783.07656 63.95433 -5.46211 74.17318 53.49287 231.69054
16.65000 -2762.98589 58.50154 -14.54922 63.64320 53.61289 227.77031
16.75000 -2745.55500 59.91101 -17.82839 64.80686 52.25388 227.86505
16.85000 -2727.69421 59.80713 -18.06604 61.48958 54.48013 222.82522
16.95000 -2711.21551 55.34417 -12.17428 57.03506 50.58583 219.22691
17.05000 -2693.40025 56.07489 -23.55519 59.62293 58.86533 207.16067
17.15000 -2680.48769 58.05187 -8.13712 67.42764 69.05824 206.37830
17.25000 -2663.54765 57.30890 -10.55895 66.04015 60.17683 200.23249
17.35000 -2646.20933 54.95648 -8.02485 56.56162 46.58639 194.98265
17.45000 -2624.64098 52.64285 -11.97351 58.01742 53.94399 195.82936
17.55000 -2611.18783 53.86804 -16.97301 60.98641 49.83046 190.98577
17.65000 -2591.94780 53.90858 -12.77942 57.06222 51.46224 191.40579
17.75000 -2575.94085 55.53238 4.28581 59.90455 52.98170 192.14644
17.85000 -2562.49320 54.36595 -10.12994 63.62849 62.26740 183.73879
17.95000 -2543.44291 55.06512 -10.76632 55.22538 70.17625 187.74875
18.05000 -2529.18479 52.41865 -5.60994 64.05736 61.22022 183.99390
18.15000 -2516.41970 55.77807 3.27416 46.38854 54.01094 169.23726
18.25000 -2500.84284 50.31397 -9.72972 50.45098 42.58098 171.71527
18.35000 -2487.23564 52.61369 -6.66178 46.42646 52.09161 164.27105
18.45000 -2471.54460 50.45146 -16.46379 52.28778 42.04726 163.77146
18.55000 -2457.00892 50.70425 -2.83796 53.35963 60.49236 162.82749
18.65000 -2439.56996 53.09602 -4.43006 44.23422 47.38062 162.62725
18.75000 -2425.19253 48.56516 -17.21832 50.93410 47.43074 162.09992
18.85000 -2409.59882 54.15793 -0.88968 54.29475 54.43529 157.27444
18.95000 -2400.43991 51.18661 0.84161 48.81190 48.19476 152.94089
19.05000 -2382.97296 49.14177 -0.75649 55.15368 48.14217 156.53346
19.15000 -2364.02270 46.56977 -1.34226 45.94807 46.82410 145.51351
19.25000 -2355.09146 46.74042 -9.50996 40.05651 39.09205 144.25900
19.35000 -2337.21677 48.98190 8.73654 51.57208 58.61379 145.16146
19.45000 -2323.61501 45.23309 -11.74116 46.17563 45.64775 152.05208
19.55000 -2315.70743 46.07158 -2.11872 48.37648 38.53070 136.75229
19.65000 -2303.25887 44.55246 1.67998 44.62886 56.43385 142.56697
19.75000 -2292.52066 45.59519 6.10515 60.33317 47.54609 138.12241
19.85000 -2279.57287 43.36850 -0.62690 50.32786 37.38388 135.91592
19.95000 -2267.08089 47.21210 0.19766 44.56343 54.70310 136.81292
