0.12500 0.03310
0.37500 0.05273
0.62500 0.10750
0.87500 0.11356
1.12500 0.15070
1.37500 0.16636
1.62500 0.19290
1.87500 0.19381
2.12500 0.20977
2.37500 0.20702
2.62500 0.20626
2.87500 0.19954
3.12500 0.19499
3.37500 0.17677
3.62500 0.19474
3.87500 0.17369
4.12500 0.16096
4.37500 0.15401
4.62500 0.14684
4.87500 0.13553
5.12500 0.13080
5.37500 0.13024
5.62500 0.11276
5.87500 0.10739
6.12500 0.08514
6.37500 0.07875
6.62500 0.07981
6.87500 0.06119
7.12500 0.04257
7.37500 0.08557
7.62500 0.06411
7.87500 0.03860
8.12500 0.06429
8.37500 0.07454
8.62500 0.07536
8.87500 0.06494
9.12500 0.04908
9.37500 0.03834
9.62500 0.04662
9.87500 0.07171
10.12500 0.04595
10.37500 0.01866
10.62500 0.04917
10.87500 0.01487
11.12500 0.01953
11.37500 0.01718
11.62500 0.00890
11.87500 0.03499
12.12500 0.01481
12.37500 0.02608
12.62500 0.00895
12.87500 0.04558
13.12500 0.02986
13.37500 0.03342
13.62500 0.01252
13.87500 0.02564
14.12500 0.02945
14.37500 0.04839
14.62500 0.02406
14.87500 0.01672
