0.120000 -2.744320
0.380000 -2.144900
0.620000 -2.012840
0.880000 -1.969150
1.120000 -1.945720
1.380000 -1.945690
1.620000 -1.949050
1.880000 -1.944210
2.120000 -1.925880
2.380000 -1.935040
2.620000 -1.931840
2.880000 -1.927790
3.120000 -1.913150
3.380000 -1.919300
3.620000 -1.893060
3.880000 -1.883490
4.120000 -1.857500
4.380000 -1.829050
4.620000 -1.839310
4.880000 -1.825120
5.120000 -1.800680
5.380000 -1.782680
5.620000 -1.765700
5.880000 -1.715550
6.120000 -1.698870
6.380000 -1.716650
6.620000 -1.661000
6.880000 -1.655040
7.120000 -1.627670
7.380000 -1.610530
7.620000 -1.610060
7.880000 -1.643470
8.120000 -1.720040
8.380000 -1.762260
8.620000 -1.793630
8.880000 -1.914650
9.120000 -2.085990
9.380000 -2.192250
9.620000 -2.318820
9.880000 -2.380240
10.120000 -2.652630
10.380000 -2.874500
10.620000 -2.831380
10.880000 2.963690
11.120000 2.277390
11.380000 2.006530
11.620000 2.142430
11.880000 1.912410
12.120000 1.619920
12.380000 1.697250
12.620000 2.280370
12.880000 -1.886340
13.120000 -1.197610
13.380000 -1.730250
13.620000 -1.716590
13.880000 -1.810350
14.120000 -2.221410
14.380000 -2.140560
14.620000 -2.127940
14.880000 -2.375530
