0.05000 -3883.20229 251.66226 -161665.21550 3720.59876 3707.53976 648338.94516
0.15000 -7723.67005 97.98614 -12053.01113 3540.44176 3749.72120 704879.55394
0.25000 -10268.70831 -23.08290 -35236.33858 3225.36543 3930.27130 794462.24157
0.35000 -12572.49436 23.08985 -34838.58808 3209.49761 3950.11740 680644.65556
0.45000 -14154.79822 52.66769 -6513.03969 3318.62868 3991.28661 600273.10649
0.55000 -14640.72280 27.04974 -1636.14829 3264.91728 4135.02650 584838.93415
0.65000 -14770.38218 91.87042 -675.28716 3138.75767 4245.45091 557095.33791
0.75000 -14733.45591 119.03941 3263.41765 3104.16970 4314.84541 490314.65323
0.85000 -14561.37740 250.46459 -4595.83430 2969.66419 4378.42938 479603.38280
0.95000 -14304.43022 166.07656 3692.72380 2702.23984 4447.66593 453233.22347
1.05000 -14035.26036 139.05985 11916.95352 2401.86620 4441.57116 428448.77845
1.15000 -13769.84511 103.80433 3598.74060 2122.99584 4377.24252 401270.45108
1.25000 -13366.16728 86.19870 5982.96880 1910.09310 4350.64722 340065.06693
1.35000 -13158.24353 139.46646 8889.88065 1642.59377 4243.72412 327264.93744
1.45000 -12879.58509 119.72909 4524.28437 1492.47668 4137.43682 309724.83203
1.55000 -12680.73650 162.62529 9336.15038 1263.14173 4085.30438 285865.83549
1.65000 -12519.06646 80.68887 3563.12548 1046.46385 3963.11939 275362.46093
1.75000 -12416.74339 78.11982 66.30103 861.55349 3851.73761 256487.78120
1.85000 -12258.74311 -25.23461 5735.62511 692.92718 3735.32636 232973.74032
1.95000 -12090.74325 -6.71879 6948.13258 571.00910 3584.79380 236560.37449
2.05000 -11940.06187 -61.72334 5086.26703 502.18977 3460.97092 213130.25261
2.15000 -11821.34367 -77.51106 5744.51304 460.25469 3318.72767 208930.74599
2.25000 -11638.88426 -31.36964 4612.62139 464.32777 3182.04215 210026.15969
2.35000 -11438.44904 -14.03703 2016.20881 498.84232 3027.32950 190889.54534
2.45000 -11249.78155 42.44960 2980.70525 538.21728 2863.61858 197291.49437
2.55000 -11022.03878 88.77741 3089.85058 597.38474 2733.82575 163797.68721
2.65000 -10768.50968 159.85237 1919.27266 604.90889 2616.98987 161216.38951
2.75000 -10531.56370 160.73932 1699.10685 595.85734 2540.52534 167565.36417
2.85000 -10297.71314 243.08626 470.17026 578.76124 2416.38227 152191.81433
2.95000 -10096.17760 253.08336 2703.97969 576.69143 2346.45372 152096.58834
3.05000 -9894.85860 238.65102 2692.96479 577.90135 2237.69618 150080.66511
3.15000 -9714.30769 196.79274 1744.58509 583.67503 2146.06416 150695.77802
3.25000 -9505.53884 168.32384 2731.58182 615.26068 2103.45654 153125.82642
3.35000 -9296.24357 101.91186 2650.96950 613.57271 2000.35270 138259.27788
3.45000 -9090.96316 5.38584 387.72735 602.92545 1885.52464 136884.30193
3.55000 -8911.24897 -18.39116 3593.89349 599.38711 1808.47096 131904.05080
3.65000 -8728.04158 -103.63552 4268.14454 588.74632 1734.26808 129291.07880
3.75000 -8560.43783 -88.78826 792.98563 578.16861 1650.36877 116679.17985
3.85000 -8433.21049 -102.33954 1583.58080 554.43683 1581.34979 118928.51670
3.95000 -8294.59275 -139.60317 3154.41793 556.47527 1511.63454 113071.87688
4.05000 -8186.97006 -131.06815 3538.37029 584.43472 1451.48983 118927.52486
4.15000 -8094.19066 -128.58497 -909.62095 628.30356 1375.14197 103102.03503
4.25000 -8038.72325 -75.89303 4284.88767 677.40676 1327.99121 104147.70555
4.35000 -7929.43926 -58.97913 2471.60620 731.71323 1261.97078 92791.14553
4.45000 -7816.85939 -38.07102 -1288.22428 775.47485 1193.88208 92368.35107
4.55000 -7693.26742 -45.77505 1469.39544 808.49010 1134.78756 79232.13637
4.65000 -7596.38381 -1.43998 875.60158 832.32357 1079.95973 106691.25095
4.75000 -7478.28170 22.78284 1322.53160 831.25415 1020.30965 78359.92290
4.85000 -7383.99529 34.15599 2011.20314 846.53443 956.34458 77653.66606
4.95000 -7253.85984 57.95128 2411.22254 851.08881 923.59008 67633.31641
5.05000 -7132.49575 64.85277 2977.86063 851.89416 872.93454 63881.56176
5.15000 -7030.40610 94.28138 1667.42047 838.30734 812.32381 70521.15028
5.25000 -6896.79153 84.25461 761.61009 814.43618 779.24905 55387.71694
5.35000 -6801.18213 110.34627 146.68480 784.89296 732.01073 55795.02107
5.45000 -6715.51493 112.95486 297.84397 771.96586 696.04715 49527.94100
5.55000 -6625.52162 127.51370 1303.94476 758.83077 656.25813 46316.40638
5.65000 -6557.16102 124.88532 1046.37142 739.99251 616.56655 51643.66602
5.75000 -6499.72700 130.10620 1296.37333 715.88203 585.59912 44380.38008
5.85000 -6422.14998 126.64758 484.54934 694.22867 556.34074 40961.04188
5.95000 -6359.95707 142.61172 352.29127 697.09048 521.63997 41445.37958
6.05000 -6314.34487 137.99570 199.88731 679.64402 487.19658 55826.94423
6.15000 -6231.99624 130.70095 183.13374 672.83284 462.76141 35135.46122
6.25000 -6187.89982 122.93190 1059.72072 648.91605 435.79277 36238.06431
6.35000 -6130.80748 109.02827 341.89697 633.35110 414.33263 30648.12488
6.45000 -6084.13440 98.73753 -234.38985 622.10100 388.92825 32102.28668
6.55000 -6031.67613 102.89704 -192.89881 621.73823 363.82420 30501.71398
6.65000 -5975.25795 92.61262 1195.35052 593.11467 348.03139 29271.40428
6.75000 -5909.82693 85.53146 774.17299 585.54822 316.52304 27562.16721
6.85000 -5852.75783 86.23062 351.24207 570.48986 299.12038 31473.96056
6.95000 -5797.41174 74.39795 826.40890 554.64890 283.09458 25738.47816
7.05000 -5745.20028 69.41722 80.02236 532.90133 261.42010 24625.14709
7.15000 -5658.19057 68.08812 500.75137 509.56496 245.98528 22979.89396
7.25000 -5585.87407 55.58839 717.39592 482.25413 233.76332 34657.13377
7.35000 -5518.81838 53.47662 -513.00377 450.53848 220.62968 23755.76443
7.45000 -5457.82478 47.51950 196.22713 424.38609 219.58226 20376.94639
7.55000 -5404.58813 41.36619 276.43754 395.65015 203.05591 21257.16435
7.65000 -5337.34780 41.95209 -338.67758 374.12208 189.13374 20075.11101
7.75000 -5281.22240 37.63272 935.02589 340.21950 185.85748 56074.71679
7.85000 -5221.08797 40.11364 54.42549 314.96019 169.88944 21816.40890
7.95000 -5159.39228 36.12066 -45.62705 292.97492 167.47695 18367.78150
8.05000 -5102.57021 35.27159 -542.54247 273.91517 164.50553 21376.15821
8.15000 -5050.42683 40.01846 214.76885 247.51693 161.36097 21460.39407
8.25000 -5014.83053 29.63879 94.83228 222.84706 162.23244 15785.98989
8.35000 -4971.80263 37.48493 267.53406 206.21979 157.69242 18063.13326
8.45000 -4934.82276 37.94670 -370.98084 193.40339 149.12838 17125.43866
8.55000 -4892.29555 35.46762 145.95040 174.82289 146.31143 13423.18026
8.65000 -4849.06084 36.26922 619.40704 159.00603 142.46344 41168.39368
8.75000 -4813.13270 37.54714 -639.93615 149.76003 136.59556 14766.87060
8.85000 -4773.04929 39.55605 1510.64215 145.44254 140.78086 113285.07121
8.95000 -4741.19714 38.01682 -22.46135 141.52616 126.50821 13763.80392
9.05000 -4703.68959 37.59020 -67.97298 134.53765 126.91470 12707.28551
9.15000 -4673.66492 34.09314 341.12963 134.65767 125.15333 13095.95457
9.25000 -4641.75065 35.72569 -156.39410 139.27550 125.78029 12446.22744
9.35000 -4609.16432 35.89340 -139.65977 129.43558 122.80010 11199.76682
9.45000 -4573.66032 33.21572 -68.88651 128.95458 119.15771 10842.95307
9.55000 -4539.97144 33.18702 146.71194 122.13442 113.33227 9838.80457
9.65000 -4509.38901 28.02099 -126.21454 126.03345 111.99275 10718.33419
9.75000 -4474.56805 30.69720 257.59165 125.26745 108.81206 22084.50086
9.85000 -4443.90528 29.51849 127.33251 124.27871 102.74078 10207.67641
9.95000 -4405.13845 30.84930 -112.97817 125.56797 105.19453 9761.60454
10.05000 -4374.75579 29.37100 99.10920 121.94574 107.29265 9657.73501
10.15000 -4339.50350 28.25001 -314.27846 118.18732 105.78999 8517.35519
10.25000 -4306.00449 26.60002 256.20634 121.22385 102.97696 12352.65998
10.35000 -4274.06917 28.86817 -20.72810 122.27046 99.51523 11155.73438
10.45000 -4242.63175 27.31770 150.47508 118.83521 90.11104 9620.48342
10.55000 -4198.58881 27.78796 -142.04175 125.73635 96.10904 9258.21424
10.65000 -4165.27788 28.00457 250.89131 121.67525 93.69419 12678.49781
10.75000 -4136.93185 27.94029 -73.04289 131.78177 100.25031 8630.47825
10.85000 -4096.55280 31.18788 171.70416 125.32850 89.45432 12475.18745
10.95000 -4061.50434 30.16768 102.55952 121.37318 88.67971 7306.16699
11.05000 -4026.33896 28.90109 74.88251 114.63095 84.91952 7727.85421
11.15000 -3992.62805 29.17632 228.69956 113.01735 88.23048 6558.17197
11.25000 -3959.69785 27.77973 -106.78679 114.36357 83.96891 6806.98327
11.35000 -3926.69946 27.38506 15.15956 118.11376 91.02657 7364.57596
11.45000 -3899.71927 28.69875 269.37415 113.08191 86.66765 7061.61455
11.55000 -3877.00204 24.83266 -145.60223 112.79323 91.18515 6468.68370
11.65000 -3842.89361 26.73304 313.96707 108.66771 77.65970 10657.50446
11.75000 -3810.42962 26.96445 -85.56087 103.38606 75.00477 6962.14303
11.85000 -3779.89894 26.99633 -9.75750 103.26014 75.52543 6482.08196
11.95000 -3747.54897 23.11387 -232.97788 102.09438 74.33589 6527.52520
12.05000 -3718.71033 28.21966 -26.60837 99.36764 79.13152 6867.18350
12.15000 -3687.79089 24.86361 -58.24301 94.81079 76.30948 6216.67542
12.25000 -3662.41419 25.77641 -30.24909 94.84162 70.73807 5747.62587
12.35000 -3626.81221 27.10624 -25.67876 95.10681 71.69030 6922.71907
12.45000 -3606.92662 23.24760 175.51891 94.06642 71.43416 6363.96440
12.55000 -3581.66985 24.72547 -66.71228 87.87591 70.22493 5365.68030
12.65000 -3550.85379 24.74397 87.52306 85.07451 70.21845 5616.27841
12.75000 -3522.74197 20.39646 -134.65017 86.45851 73.07816 5011.21057
12.85000 -3495.47493 19.62833 -197.33870 89.23096 67.51600 5379.27125
12.95000 -3471.90745 23.46532 -223.83081 86.40019 71.32530 5640.93962
13.05000 -3448.51962 20.60126 107.52207 85.22334 72.41502 5358.76721
13.15000 -3424.65122 23.91311 -33.53061 76.98991 65.35196 3986.96273
13.25000 -3399.73139 20.35844 81.14063 77.09563 63.43454 4945.40096
13.35000 -3375.95423 23.23939 -261.99857 80.76387 70.69041 4502.36731
13.45000 -3354.40561 18.75515 55.26768 77.72795 62.58242 4284.22124
13.55000 -3332.45396 22.33066 -37.36830 72.93835 65.51177 4067.41759
13.65000 -3306.27504 19.42404 -139.86722 76.62113 69.31776 4449.14367
13.75000 -3285.80748 21.29388 18.10733 71.45107 59.43315 3894.05029
13.85000 -3267.28550 17.73599 -19.05408 79.84713 77.53420 4559.70432
13.95000 -3241.37209 17.89909 90.03841 69.72280 61.96012 3477.37340
14.05000 -3220.02649 16.65891 -7.49757 65.81926 59.11893 3209.10180
14.15000 -3197.54995 15.49213 -89.12926 66.83286 62.31534 2891.10134
14.25000 -3168.88183 15.61779 4.43379 68.87320 62.79241 2765.02747
14.35000 -3146.92710 19.13770 200.78174 69.14575 55.21799 3268.67567
14.45000 -3119.66773 16.03703 97.15279 78.66257 62.51216 2966.29289
14.55000 -3103.42981 19.27469 -172.59980 71.49077 65.87537 3179.92830
14.65000 -3081.37311 17.40851 -55.30010 57.19693 68.06548 2735.75957
14.75000 -3064.46073 18.69842 -118.87142 68.03977 55.49635 3630.98212
14.85000 -3039.47446 17.92080 73.03356 70.59268 68.58308 2973.56469
14.95000 -3017.09330 14.03041 26.61161 77.15005 58.04780 2629.48613
15.05000 -2995.19409 15.98040 57.56937 60.37528 55.24574 2515.65025
15.15000 -2972.46002 14.90008 168.81615 56.83465 51.53513 2225.78933
15.25000 -2953.99073 15.30551 36.97000 65.10539 54.26163 2864.73335
15.35000 -2930.72989 12.19772 59.98971 53.22496 53.66826 2173.52581
15.45000 -2911.84191 17.36439 -4.17331 54.74354 68.64848 1975.60275
15.55000 -2893.47691 12.38785 -66.72540 58.95283 67.59269 2249.31821
15.65000 -2868.16906 11.91109 -181.43403 51.54663 52.02841 2367.99582
15.75000 -2850.79645 12.02750 87.79987 52.27098 45.83250 1863.68433
15.85000 -2828.13188 11.03904 84.96236 64.43816 55.25262 2010.65507
15.95000 -2813.02282 9.98190 45.43674 56.38558 47.61757 2053.45120
16.05000 -2788.67747 11.44999 -4.13269 51.18901 42.71768 1661.52523
16.15000 -2772.10489 12.26673 -81.06468 53.26780 44.19805 1520.61321
16.25000 -2752.71094 10.79367 145.17157 46.00941 44.32999 2806.77678
16.35000 -2734.07541 15.26138 -8.81102 72.94969 55.66038 1841.02322
16.45000 -2710.93489 12.07138 7.31605 64.28930 37.30311 1995.73796
16.55000 -2698.86458 15.50262 -8.60451 51.81670 71.97968 1771.91098
16.65000 -2686.85796 11.88106 -42.75968 48.13259 51.65695 1260.15625
16.75000 -2662.72223 18.09929 -92.34400 68.46925 57.32888 1610.75543
16.85000 -2652.02167 14.38156 64.43015 55.59559 53.74839 1172.24379
16.95000 -2629.25172 12.91205 -133.60977 52.12640 55.96667 2630.82737
17.05000 -2613.24618 7.16112 279.50198 50.41978 41.83067 4090.15792
17.15000 -2598.95871 14.06033 13.72577 51.76586 48.71659 1564.76430
17.25000 -2586.11569 9.36646 -28.99237 55.82657 43.92480 1125.66369
17.35000 -2564.26365 10.99453 -23.49390 39.48451 35.20207 1053.83022
17.45000 -2548.21778 12.27024 29.27532 58.77164 52.80796 1351.08025
17.55000 -2532.46329 17.31189 -6.23102 55.63927 61.15235 1063.00421
17.65000 -2515.50201 11.30297 45.60927 44.57520 43.69250 868.41416
17.75000 -2500.43338 11.98446 38.46098 53.36217 62.18369 894.91194
17.85000 -2486.50856 5.65572 73.39742 53.36461 39.13500 1215.47831
17.95000 -2471.37219 10.57257 -12.38151 40.43563 39.02211 1142.55238
18.05000 -2458.98758 11.22365 111.42434 48.65951 42.03937 1260.65082
18.15000 -2441.33313 9.46153 -24.10794 44.39814 45.47937 1153.23486
18.25000 -2425.92913 7.72238 -27.33714 43.43299 38.40278 1016.05930
18.35000 -2410.41680 6.99375 9.52021 58.84867 41.96501 1128.88608
18.45000 -2401.54685 12.05048 4.73346 49.78551 46.37655 997.04991
18.55000 -2383.64753 13.85729 -32.97697 45.77528 66.55194 1024.78260
18.65000 -2371.50749 16.59372 -12.41708 45.22425 60.19131 1023.58635
18.75000 -2354.84276 11.11066 -9.27749 48.30944 38.48300 1160.57388
18.85000 -2340.28036 11.84292 -14.23737 37.90507 37.42556 1031.42623
18.95000 -2328.04986 14.66758 -13.42748 50.60888 29.13505 711.03844
19.05000 -2308.50800 15.23056 -47.81805 41.63831 33.35789 657.51775
19.15000 -2298.82397 17.25129 18.58676 49.61004 40.76038 781.29589
19.25000 -2284.40278 19.41217 -8.68564 45.89709 73.21430 947.09416
19.35000 -2276.54511 16.84613 -11.95639 33.83073 36.20557 835.26683
19.45000 -2262.09195 19.80019 57.40119 41.82947 37.71952 891.75604
19.55000 -2247.27538 13.01850 12.75910 55.59450 35.30644 699.57870
19.65000 -2241.71836 15.56476 -15.73054 40.93207 40.05338 618.77947
19.75000 -2222.85283 14.81303 -107.73596 36.62266 36.89592 702.64681
19.85000 -2214.01300 12.16512 54.78305 29.42662 27.06090 629.49397
19.95000 -2201.42777 18.00220 -99.69059 33.65305 31.35744 961.01883
