0.05000 1778.64178 287.46600 3850.11090 80.44374 1062.91377 66.68213
0.15000 -432.95411 -468.52191 3955.82555 1279.62350 1266.28149 78.03084
0.25000 6.73715 -224.67728 4108.63074 1178.01535 1267.34831 217.34560
0.35000 -961.32412 47.62755 3983.30333 1107.52433 1314.80133 301.20580
0.45000 -691.09085 176.26131 3950.10089 1256.70343 1245.02190 395.92383
0.55000 -786.79838 -59.32916 3960.25415 1269.72084 1269.75208 348.79798
0.65000 -1123.98567 106.69586 3809.21247 1230.00858 1304.35275 413.10385
0.75000 -1136.33948 154.17246 3748.69376 1279.65658 1259.49747 506.11856
0.85000 -1454.02296 -147.10272 3682.92356 1197.96547 1321.67043 530.11124
0.95000 -1642.65584 -145.44823 3529.44320 1250.33915 1353.60995 623.28633
1.05000 -1692.37056 95.80315 3428.25912 1335.04888 1390.98999 662.33411
1.15000 -1954.57626 5.12540 3300.54422 1243.84004 1394.87228 707.09200
1.25000 -2136.17519 -54.35131 3122.84077 1248.03627 1434.96702 824.75153
1.35000 -2283.44491 49.59526 2985.96872 1206.34138 1456.28860 939.76104
1.45000 -2245.03103 58.44410 2769.48807 1399.04794 1555.65553 1058.43477
1.55000 -2534.86337 -11.73213 2459.38586 1405.08268 1558.00775 1167.84542
1.65000 -2683.77866 -84.14551 2325.59079 1313.10078 1523.35137 1271.32209
1.75000 -2787.64540 -24.32608 1947.24481 1389.86782 1559.76891 1463.24290
1.85000 -2929.49104 -38.78896 1608.06476 1391.03846 1577.16863 1699.94432
1.95000 -3062.16045 56.95030 1378.62756 1330.78152 1511.58099 1901.98298
2.05000 -3083.45857 -36.02374 1293.27658 1337.35575 1301.62556 2084.45340
2.15000 -3179.60834 -13.80885 1060.47444 1234.64345 1334.55021 2154.19974
2.25000 -3223.91680 41.68965 962.97646 1171.41539 1250.60895 2243.48843
2.35000 -3275.90885 -5.43698 913.12466 1170.03612 1101.18285 2255.10770
2.45000 -3270.88637 0.91347 799.24969 1185.33630 1075.91939 2332.24590
2.55000 -3377.33144 -10.92068 764.89348 1071.85100 982.83031 2245.67098
2.65000 -3301.45630 25.64964 878.99920 1128.95869 919.64642 2268.88044
2.75000 -3276.82093 40.57234 680.23479 1142.01489 876.49178 2361.26532
2.85000 -3392.90249 -8.35596 432.43959 1062.02096 847.66932 2326.18273
2.95000 -3326.82846 -5.62267 596.78331 1078.13796 795.14534 2318.43972
3.05000 -3331.69559 -28.82129 445.18856 1069.11653 756.51438 2329.93555
3.15000 -3334.11609 -9.84118 431.18378 1021.46459 711.10388 2330.31520
3.25000 -3318.80719 -11.04308 381.98747 1027.06708 699.35364 2334.27359
3.35000 -3317.33032 -7.15973 325.21653 1036.15197 667.17298 2334.43741
3.45000 -3258.39668 -6.48614 424.43846 1022.21918 621.22278 2338.36507
3.55000 -3273.91124 -20.04489 387.32120 1024.23700 611.58785 2299.24004
3.65000 -3222.29656 16.10071 344.39781 1028.34443 592.75673 2339.15432
3.75000 -3218.76182 -10.65159 257.16206 1011.11278 571.57539 2344.45550
3.85000 -3231.28498 34.67744 254.81963 983.09420 548.57354 2308.65714
3.95000 -3227.17076 -4.26992 224.70485 958.76857 530.58051 2288.20157
4.05000 -3194.22665 6.05853 214.83719 990.46380 516.36926 2287.95574
4.15000 -3104.99550 -4.62009 229.10671 997.68985 501.74248 2371.81245
4.25000 -3129.44799 -8.45337 188.61810 967.93887 478.42022 2320.24286
4.35000 -3165.17508 -13.12807 144.80997 943.31350 464.11086 2269.72625
4.45000 -3126.25213 3.55986 131.35771 944.18567 447.05162 2288.82011
4.55000 -3098.00371 2.43825 178.52497 947.36609 435.49396 2291.18037
4.65000 -3105.59077 -1.41381 129.90315 944.76239 422.75587 2252.47678
4.75000 -3101.16390 7.41294 175.94194 906.05257 410.38331 2222.03188
4.85000 -3037.27239 8.14357 147.86083 903.43519 391.56535 2279.76182
4.95000 -3033.97118 -12.04903 124.77912 910.97512 387.68502 2255.14897
5.05000 -3045.59434 -5.04367 172.93726 913.87031 371.32122 2182.38424
5.15000 -3008.27221 -8.69492 160.96039 920.05494 368.07478 2192.10483
5.25000 -3041.20753 8.14594 68.23561 861.04689 354.06317 2155.97217
5.35000 -3026.89264 -5.37671 63.36478 856.69565 354.00507 2129.32364
5.45000 -2938.80198 0.69777 168.38103 892.41799 341.46882 2173.76399
5.55000 -2932.00162 -5.12173 39.41196 911.40181 328.76156 2172.41182
5.65000 -2932.20229 -5.39610 101.71434 862.21428 322.71381 2139.10124
5.75000 -2923.65792 -1.80891 63.58964 861.96501 315.20647 2120.31915
5.85000 -2874.20990 2.58932 60.52570 859.54665 311.36060 2150.91867
5.95000 -2876.73071 2.11164 38.74198 867.81444 307.43141 2124.04710
6.05000 -2839.43068 1.65515 35.05053 877.50137 294.90394 2139.23409
6.15000 -2843.37242 -0.18011 -5.72464 850.55699 289.04144 2116.81864
6.25000 -2841.32754 -1.74001 76.40752 829.26796 282.71521 2078.81101
6.35000 -2853.99483 7.73705 -50.80781 824.30925 272.98186 2057.35461
6.45000 -2795.36528 -2.38619 83.58459 842.89929 268.84566 2071.79948
6.55000 -2781.24371 3.94722 20.41684 825.68059 261.62010 2077.34034
6.65000 -2771.47925 9.15169 40.55072 810.04959 253.24436 2057.27525
6.75000 -2797.50926 1.93015 7.10196 793.88666 256.02617 1997.23846
6.85000 -2779.24427 -0.65588 -2.71070 796.64045 249.99411 1993.46696
6.95000 -2748.58243 1.54607 -22.36446 806.01792 243.31007 2007.08320
7.05000 -2730.22322 -6.61135 39.65045 788.71882 235.50733 1988.90657
7.15000 -2720.28405 -0.79777 38.61150 797.74815 237.17032 1972.86484
7.25000 -2708.34713 4.27223 -77.46013 775.14381 229.79272 1977.68125
7.35000 -2688.86230 4.57726 -30.61022 780.75479 222.19373 1959.93046
7.45000 -2676.17740 0.33428 31.86811 789.59437 216.36410 1931.81638
7.55000 -2692.85170 7.03904 -8.79145 750.39068 215.19233 1900.34942
7.65000 -2661.24586 7.19571 -35.39434 774.98158 209.29626 1919.42692
7.75000 -2605.47014 -5.03186 -1.83295 788.11400 205.84700 1946.70506
7.85000 -2595.64838 2.42547 39.31986 767.76111 204.59288 1932.80651
7.95000 -2616.79091 -2.13388 -3.07292 742.29160 199.84837 1890.91900
8.05000 -2590.74670 -2.67936 -16.20389 751.43934 196.92783 1894.56417
8.15000 -2585.07761 0.38463 -82.83817 747.06265 193.89271 1880.39987
8.25000 -2563.00814 4.61873 49.49855 737.83915 187.94301 1866.95064
8.35000 -2543.64923 -5.13946 -28.20490 745.79891 186.77393 1873.77385
8.45000 -2542.40008 0.49501 -56.69370 732.14345 185.76129 1851.73902
8.55000 -2551.01963 4.98225 -30.03773 732.24490 181.51747 1805.86909
8.65000 -2473.32815 -3.43094 -58.06643 740.85837 177.77297 1877.13793
8.75000 -2485.34103 2.51724 -28.08303 742.66256 175.38428 1836.29614
8.85000 -2489.95885 1.01751 -32.28503 725.48934 173.37286 1799.95649
8.95000 -2469.96706 -1.94956 6.18136 721.87251 167.53815 1798.02332
9.05000 -2433.90855 2.47215 -59.98829 735.08316 165.47499 1821.59294
9.15000 -2427.96054 -3.19145 -34.59671 718.37045 164.49282 1804.42430
9.25000 -2415.81169 3.03578 -2.38241 720.75679 163.27701 1785.43824
9.35000 -2404.55116 1.08302 -99.76221 699.06424 162.65460 1791.72935
9.45000 -2409.50404 -3.45787 -60.50556 693.35782 157.70848 1758.91105
9.55000 -2405.56595 4.12147 -22.39264 684.40397 154.77501 1738.81793
9.65000 -2372.52185 -0.82973 -90.60703 699.75229 154.90060 1750.67407
9.75000 -2389.18739 -2.53418 -52.43839 677.01909 152.06468 1714.50256
9.85000 -2350.24261 -3.83524 -58.11219 683.01628 145.86732 1734.89465
9.95000 -2321.66457 6.16068 -29.66344 683.14842 148.73000 1741.49231
10.05000 -2312.79506 1.25323 -41.84420 689.23013 143.93643 1724.09356
10.15000 -2322.51029 2.07593 -62.40174 659.95838 142.77868 1699.80446
10.25000 -2286.93005 -4.78746 -51.23922 667.01057 138.92985 1710.96705
10.35000 -2302.06714 1.09033 -43.06254 645.72275 139.02476 1673.56848
10.45000 -2273.10553 0.34991 -22.08163 656.77852 133.69584 1677.42402
10.55000 -2258.61665 -0.86547 -98.49552 649.16030 137.01264 1684.87782
10.65000 -2264.79885 1.13769 -32.27640 648.67840 129.49130 1647.25921
10.75000 -2260.01891 3.94875 -57.92274 648.80929 132.24405 1625.28521
10.85000 -2238.34796 -3.80881 -55.84147 641.21019 130.98948 1629.35033
10.95000 -2206.69541 -0.92132 -85.51533 647.50619 127.17741 1645.18433
11.05000 -2205.73290 2.34982 -45.29352 635.95616 124.93298 1623.22963
11.15000 -2203.36878 -3.43451 -78.01345 646.22647 127.25559 1601.09683
11.25000 -2176.89605 3.16944 -30.30813 634.36667 120.97252 1607.97578
11.35000 -2156.34287 1.09070 -57.57750 624.33788 119.90510 1619.59372
11.45000 -2179.50587 -0.15775 -74.73786 617.63038 118.61638 1563.84990
11.55000 -2139.18249 -0.93865 -16.60287 631.69937 117.13489 1581.64128
11.65000 -2144.05748 -2.91686 -22.46500 610.18400 114.72776 1563.47468
11.75000 -2131.76497 -3.97051 -6.39603 616.00134 115.30970 1551.28370
11.85000 -2107.18778 -1.55523 -52.89634 614.82152 114.69788 1566.34382
11.95000 -2106.62912 0.76066 -25.88682 607.87105 113.15543 1546.07286
12.05000 -2097.92096 1.46719 -108.90325 597.10229 109.70220 1542.41547
12.15000 -2092.28094 -3.22965 -47.33023 595.03765 108.11554 1525.76031
12.25000 -2084.13093 0.22666 -70.22472 597.26423 110.23893 1517.36477
12.35000 -2080.86033 -1.97342 -37.36558 572.60284 104.90002 1497.73875
12.45000 -2038.51456 0.63791 -58.53258 594.40192 105.78074 1526.30414
12.55000 -2047.67928 2.12600 -47.43955 588.19407 102.85727 1493.64284
12.65000 -2043.00207 -0.38231 -56.18687 581.48137 102.66257 1482.53018
12.75000 -2025.33925 0.29263 -77.90841 583.75600 100.84037 1483.87297
12.85000 -2015.87627 -0.04752 -70.80502 570.49360 100.82664 1474.75998
12.95000 -1997.63571 4.09714 -33.74498 587.88738 99.19205 1466.32016
13.05000 -1990.94999 -2.40648 -26.25655 576.80831 96.40687 1461.60949
13.15000 -1957.42816 1.45124 -99.46000 575.87523 96.22704 1483.24498
13.25000 -1948.40341 0.27446 -84.50352 574.47299 95.57154 1479.00268
13.35000 -1965.65202 1.91443 -86.58611 560.67684 97.16244 1436.74803
13.45000 -1935.70356 1.66719 -37.78934 558.29583 93.13453 1453.26558
13.55000 -1941.75343 -0.92240 -90.37882 559.62078 93.34455 1428.47986
13.65000 -1944.83091 -1.09019 -60.79478 552.67172 91.39486 1403.29874
13.75000 -1921.95443 1.12895 -72.76147 548.96827 92.09798 1417.06287
13.85000 -1924.27146 -0.21693 -95.95073 543.71000 91.22841 1398.44403
13.95000 -1900.46705 1.38769 -81.51809 550.00512 91.57050 1407.48240
14.05000 -1882.57549 -0.66544 -32.15812 551.00229 87.10871 1402.36739
14.15000 -1882.40969 0.27479 -61.45296 550.20154 87.34504 1389.12571
14.25000 -1867.84787 -0.87903 -79.60123 542.21496 86.73660 1394.25386
14.35000 -1870.14969 -0.19009 -129.76499 527.23427 85.01549 1378.31603
14.45000 -1855.11109 1.03760 -52.03656 542.61534 84.96048 1369.69055
14.55000 -1843.63465 -0.71177 -54.75003 541.52917 83.35319 1364.84821
14.65000 -1851.53196 -2.22455 -64.53351 520.80660 81.40782 1347.89286
14.75000 -1821.23281 -2.83143 -105.67738 542.08924 82.14243 1360.02594
14.85000 -1830.56966 -0.32457 -115.18085 523.74062 79.67645 1334.15351
14.95000 -1806.26754 -3.24871 -47.39045 523.81474 79.94129 1344.86381
15.05000 -1805.49061 1.48771 -66.40794 531.39578 78.55392 1327.56841
15.15000 -1810.24061 -0.72853 -67.31844 504.52723 77.85995 1311.27803
15.25000 -1790.41660 2.35367 -103.69379 509.10939 76.93586 1318.45694
15.35000 -1783.12511 -0.60071 -48.89416 521.32351 76.40412 1304.24130
15.45000 -1788.55550 2.24127 -85.04978 505.65567 76.24674 1284.69133
15.55000 -1772.00806 0.61403 -76.46049 504.99852 75.12018 1290.65732
15.65000 -1764.38469 0.69929 -14.80537 504.05119 72.70436 1277.69997
15.75000 -1749.75809 1.70551 -63.97884 498.43232 74.39909 1285.10211
15.85000 -1759.07446 -0.93318 -47.71132 491.24977 73.01163 1253.92738
15.95000 -1734.35825 1.74916 -57.23256 498.57127 72.60734 1270.77963
16.05000 -1734.52658 1.44004 -104.89266 490.35063 70.92902 1255.13327
16.15000 -1711.32079 2.01744 -42.01201 495.00417 70.36645 1262.42523
16.25000 -1712.48521 -1.44806 -78.79824 486.10823 69.40122 1250.46008
16.35000 -1710.19923 -0.11912 -100.23083 483.78733 68.30296 1239.80506
16.45000 -1684.58958 -1.10087 -46.70238 487.59975 68.56573 1253.04775
16.55000 -1685.93400 -0.01943 -7.86411 475.52386 68.18059 1233.78755
16.65000 -1675.30237 1.20585 -116.06172 485.65761 67.13798 1238.46170
16.75000 -1673.48543 -0.01533 -35.43925 472.74119 65.20990 1220.61590
16.85000 -1661.68100 -1.30282 -28.77584 486.40147 66.13945 1213.23495
16.95000 -1656.16607 1.32166 -50.84416 480.34624 65.52495 1207.39149
17.05000 -1665.51200 2.28847 -59.15070 465.21263 63.51750 1185.45046
17.15000 -1638.82482 -1.38528 -88.21665 471.57335 63.81345 1205.71016
17.25000 -1636.10069 -1.14622 -47.61454 468.24572 63.77467 1189.25482
17.35000 -1613.57642 -1.55856 -46.21883 473.83190 63.68077 1202.19267
17.45000 -1615.32824 -0.32702 -86.61832 467.52742 62.15654 1188.31652
17.55000 -1622.98863 0.58533 -69.04448 455.18700 60.93751 1168.15799
17.65000 -1602.68240 -0.37130 -69.57273 457.54000 60.33518 1175.43678
17.75000 -1583.59763 1.89387 -32.36378 465.73347 60.11754 1180.29891
17.85000 -1581.97088 0.54109 -88.21393 462.19208 58.24347 1172.28254
17.95000 -1576.00144 2.20139 -135.47649 460.46613 59.42269 1164.71488
18.05000 -1558.08682 -0.35791 -25.75139 455.92933 59.94310 1171.05053
18.15000 -1567.91113 -1.40822 -61.49608 445.66384 56.69187 1147.02514
18.25000 -1552.70105 -0.19868 -89.01997 446.41411 58.14054 1155.07099
18.35000 -1551.50120 0.08778 -37.73099 447.56404 58.11259 1137.67261
18.45000 -1548.90710 -2.03719 -57.76388 442.45462 58.32609 1128.50935
18.55000 -1519.11296 0.59688 -48.87542 441.85668 54.75342 1153.47819
18.65000 -1522.51693 2.02168 -44.58596 443.68867 53.51032 1133.14477
18.75000 -1519.27381 0.06968 -27.85822 448.06988 54.58046 1122.24259
18.85000 -1522.45811 -1.54600 -68.97697 427.60940 54.79245 1113.10821
18.95000 -1518.84980 1.07095 -50.31219 428.93306 53.43590 1102.35420
19.05000 -1497.20205 -1.85343 -54.41324 430.69195 54.64289 1116.18059
19.15000 -1499.49924 0.20203 -77.94027 433.34534 53.11540 1098.52067
19.25000 -1500.48514 -0.42960 -44.11127 421.99455 52.88253 1083.43066
19.35000 -1475.17327 -1.53435 -37.54714 425.33730 53.77669 1101.07710
19.45000 -1478.48432 -2.28998 -100.91720 424.56578 51.55355 1087.26736
19.55000 -1467.96127 -0.07022 -42.40057 429.89514 50.36221 1082.82286
19.65000 -1467.33565 -0.87872 -76.97463 419.76877 51.68399 1076.57726
19.75000 -1461.58454 -0.28009 -35.82075 415.39874 51.83471 1068.80119
19.85000 -1442.62575 1.13170 -42.62023 422.60654 50.94997 1079.40351
19.95000 -1451.25729 1.01263 -31.22766 419.21333 50.29530 1054.76437
