0.2 -0.35411 18.33277 0.88648 89.07991 87.67292 68.53789
0.6 -0.27594 45.57748 0.54496 89.03754 86.55866 66.81923
1.0 1.00562 71.26961 -0.38199 89.31022 82.85159 63.07521
1.4 0.09644 87.02293 0.35799 89.59409 76.55557 59.60668
1.8 1.21976 95.95501 0.60538 87.64807 71.19146 56.38559
2.2 -1.41853 102.36511 0.50209 86.73556 66.94297 53.63825
2.6 -4.15057 108.77875 0.34454 85.09808 64.64313 51.13697
3.0 -4.98408 112.9305 0.62755 80.98915 62.59565 48.56304
3.4 -5.79844 117.26795 0.50875 74.26453 61.63621 46.51045
3.8 -8.01446 126.43722 0.26328 67.72384 59.38727 44.41465
4.2 -8.50134 137.05846 0.03824 59.55436 57.36543 42.04437
4.6 -8.03188 148.08137 0.131 51.69299 54.81761 39.46724
5.0 -5.27567 158.8484 0.31473 45.80237 50.41933 37.20995
5.4 -2.64847 169.41092 0.02013 41.85474 43.88885 35.10619
5.8 -0.33848 177.54524 0.22972 39.4246 37.22758 32.8553
6.2 1.03284 181.11099 -0.26156 37.81673 33.51939 30.93404
6.6 1.12512 185.00764 0.11502 36.10038 31.2309 28.98989
7.0 1.00545 189.22067 0.24381 34.51059 29.88615 27.28249
7.4 0.59929 192.98968 0.01612 32.30745 26.78245 25.80941
7.8 0.23071 194.12419 -0.33714 31.05339 24.01264 24.71119
8.2 -0.53405 194.60118 -0.7161 29.57132 23.1696 23.41102
8.6 -0.2949 196.55559 -0.87893 27.84129 22.68358 21.78521
9.0 -0.46857 198.57312 -1.27018 26.66013 22.24506 20.76838
9.4 -0.43947 200.60635 -1.0999 25.24752 21.35513 19.92472
9.8 -0.46789 202.42215 -1.19447 24.1614 20.83016 19.04581
10.2 0.21606 204.31259 -0.58272 23.30013 19.34378 18.14577
10.6 0.6121 205.79996 -0.93609 22.1624 18.30995 17.68418
11.0 0.79341 206.82222 -0.29002 21.61288 16.66631 17.16365
11.4 0.49092 206.51989 -0.04712 21.27626 15.5641 16.85663
11.8 0.57825 206.53236 -0.57717 20.58387 14.74441 16.247
12.2 0.10831 205.95556 0.02628 20.03946 14.50194 15.67724
12.6 0.86482 205.54008 0.02654 19.2384 14.57429 15.22107
13.0 0.24953 205.81678 -0.14869 18.84577 14.4178 14.38891
13.4 0.83757 206.17496 -0.36236 17.90028 14.23577 13.80878
13.8 0.64667 206.65744 -0.01943 16.98523 13.66096 12.91536
14.2 0.34912 206.78908 -0.04257 16.66634 13.33709 12.24344
14.6 0.35288 207.4799 0.33619 15.78143 12.61532 11.92513
15.0 -0.25564 208.20195 -0.04865 15.26945 11.57067 11.44057
15.4 -1.06936 208.18329 0.1233 14.33558 11.28237 11.06435
15.8 -0.99908 208.26022 -0.06875 13.8948 11.50472 10.76617
16.2 -0.59509 209.27842 -0.37514 13.63503 10.88554 10.49545
16.6 -0.54827 208.94154 -0.95752 13.31342 9.74959 10.15681
17.0 -0.16401 208.34497 -1.21194 13.41861 10.1645 9.86245
17.4 -0.78219 208.62771 -1.81367 13.43112 9.43104 10.13121
17.8 -0.85127 208.01832 -1.36574 13.10988 8.81887 9.7577
18.2 -0.69524 208.04994 -1.22262 12.81172 8.51333 9.03324
18.6 -0.95794 207.8132 -0.46395 12.38685 8.03117 8.65137
19.0 -1.39644 207.30191 -0.35826 11.45989 8.28361 8.39011
19.4 -1.38487 206.50562 -0.1175 10.71855 7.5945 8.40665
19.8 -0.58287 206.78815 0.01788 10.40476 8.00569 8.45293
