0.120000 3.016420
0.380000 -3.017490
0.620000 -3.108920
0.880000 -3.093960
1.120000 -3.036630
1.380000 -3.064540
1.620000 -3.014900
1.880000 -3.051250
2.120000 -3.008180
2.380000 -3.035350
2.620000 -3.033920
2.880000 -3.027950
3.120000 -3.056840
3.380000 -3.043520
3.620000 -3.035030
3.880000 -3.015630
4.120000 -3.005980
4.380000 -3.026820
4.620000 -2.990620
4.880000 -3.004150
5.120000 -3.051750
5.380000 -2.993770
5.620000 -2.967990
5.880000 -3.045350
6.120000 -2.974170
6.380000 -2.923100
6.620000 -2.962540
6.880000 -2.944870
7.120000 -2.908010
7.380000 -2.969580
7.620000 -3.050190
7.880000 -3.085210
8.120000 2.975580
8.380000 2.828450
8.620000 2.492540
8.880000 2.504420
9.120000 2.369120
9.380000 2.944970
9.620000 2.669300
9.880000 2.280550
10.120000 1.873570
10.380000 2.340480
10.620000 2.157560
10.880000 1.581320
11.120000 2.182610
11.380000 1.721180
11.620000 1.630130
11.880000 2.334210
12.120000 2.789000
12.380000 -2.467760
12.620000 -3.077460
12.880000 -2.397900
13.120000 -2.746540
13.380000 -2.572540
13.620000 -3.112570
13.880000 -2.542830
14.120000 -3.125270
14.380000 -2.621880
14.620000 2.506450
14.880000 2.672250
15.120000 2.253620
15.380000 2.140920
15.620000 1.579640
15.880000 1.376870
16.120000 1.097590
16.380000 1.017210
16.620000 0.758150
16.880000 0.972480
17.120000 0.667580
17.380000 0.821290
17.620000 0.846860
17.880000 0.588710
18.120000 0.466750
18.380000 0.341790
18.620000 0.153350
18.880000 -0.216180
19.120000 0.909030
19.380000 0.091740
19.620000 -0.330090
19.880000 0.167680
