0.2 -1.24621 19.8523 -1.23486 102.29033 102.29964 92.14695
0.6 -0.27288 44.46095 -2.43941 94.82044 91.95053 82.80888
1.0 -1.96728 68.48529 -2.56821 88.65949 83.83541 75.43267
1.4 1.09254 88.19363 -0.79304 81.77978 77.64129 70.66463
1.8 1.18902 104.43656 0.47449 74.50536 71.24028 65.22314
2.2 1.03192 120.88687 1.52648 69.39906 65.7257 61.31989
2.6 -0.29573 133.83258 1.05088 65.1153 60.36932 58.55306
3.0 0.5625 144.29834 0.95391 61.1665 55.91797 53.84475
3.4 0.33595 154.04834 0.75252 57.92418 51.6773 50.51609
3.8 1.36499 160.99903 -0.05331 54.71493 48.14388 47.51501
4.2 0.70291 166.60703 -0.58748 52.6245 44.93536 43.9511
4.6 0.0496 171.76081 -0.86155 49.94027 42.34418 41.50982
5.0 -0.14363 178.31393 -1.2115 47.78403 39.96421 39.00514
5.4 -0.78732 182.25925 -2.23041 46.53506 38.10814 37.18813
5.8 -1.48617 187.14857 -0.45997 43.77405 36.6233 35.18049
6.2 -0.60644 189.47983 0.58729 42.44018 34.20402 33.71337
6.6 -0.63257 191.90456 0.79948 40.51214 32.01641 32.16795
7.0 -0.1874 193.72227 1.5201 39.67526 31.42154 30.69424
7.4 -0.37054 196.04031 0.94008 37.31668 30.69006 29.4481
7.8 -0.0264 198.62221 1.78234 36.10916 29.77911 28.13394
8.2 1.11515 200.75521 0.88426 34.72673 28.34135 26.23461
8.6 0.83885 202.37067 0.19232 33.82972 27.38321 25.45225
9.0 -0.48224 203.66331 -0.08224 32.05139 25.39616 24.76037
9.4 -0.19909 205.49621 -0.38293 31.15095 23.79856 24.30862
9.8 -0.82433 205.61985 -1.39702 30.37363 23.01053 23.06254
10.2 -0.13999 205.83624 -0.31103 29.43465 21.95608 22.15925
10.6 -0.44638 206.23166 -0.45499 28.00578 20.77946 21.35144
11.0 -0.9496 206.21933 0.15284 26.8812 20.32353 20.03237
11.4 -0.03069 206.36088 1.30972 26.00458 20.04118 20.01056
11.8 -0.10129 206.81376 1.8486 25.74694 19.57431 18.95288
12.2 0.08508 207.99273 2.11572 24.26874 19.14069 17.93528
12.6 -0.28227 207.86414 1.59347 24.39971 18.7686 17.44366
13.0 0.23504 208.4999 1.51711 23.40561 17.75405 16.48381
13.4 0.66026 208.18824 1.04818 23.22374 17.37277 16.63792
13.8 1.39555 209.66238 0.09543 21.53109 16.29388 15.93206
14.2 0.58589 209.06879 -0.04836 21.08882 16.05843 15.48651
14.6 1.65989 209.79155 -0.26904 20.62771 15.08713 14.30974
15.0 0.59662 209.00455 -0.56764 20.69706 15.04589 14.21194
15.4 0.47262 209.48784 -0.41562 20.42311 13.87195 13.9419
15.8 1.07783 209.88839 -1.05328 18.68929 13.82916 13.30249
16.2 0.5021 209.76433 -0.32581 18.54629 13.854 12.32707
16.6 0.5162 209.88428 -0.60078 17.73216 12.94768 11.49044
17.0 0.83592 208.64754 -0.89241 17.88492 12.56019 11.61235
17.4 0.82896 208.8396 -0.92891 16.33908 12.18988 12.31891
17.8 0.57301 209.22214 -0.90138 16.24839 11.24695 11.16811
18.2 0.53223 208.63402 -0.69817 15.82976 10.84961 10.66378
18.6 0.40613 208.02898 0.29905 15.69749 10.70196 10.86578
19.0 1.21991 208.73983 1.16075 16.19417 10.56741 10.45425
19.4 2.03048 207.90238 1.22536 14.78246 10.51985 9.83102
19.8 2.39282 208.53254 2.75857 14.53723 11.67214 10.41221
