0.12500 0.02757
0.37500 0.11574
0.62500 0.22729
0.87500 0.31805
1.12500 0.39405
1.37500 0.43414
1.62500 0.45390
1.87500 0.46964
2.12500 0.46730
2.37500 0.48513
2.62500 0.49641
2.87500 0.50618
3.12500 0.51321
3.37500 0.53099
3.62500 0.54110
3.87500 0.54020
4.12500 0.54898
4.37500 0.53714
4.62500 0.54423
4.87500 0.52422
5.12500 0.49846
5.37500 0.48212
5.62500 0.44387
5.87500 0.40826
6.12500 0.37936
6.37500 0.35269
6.62500 0.33904
6.87500 0.31144
7.12500 0.30733
7.37500 0.30144
7.62500 0.27538
7.87500 0.24859
8.12500 0.21660
8.37500 0.17943
8.62500 0.13886
8.87500 0.13717
9.12500 0.13510
9.37500 0.11481
9.62500 0.09242
9.87500 0.09288
10.12500 0.08515
10.37500 0.08518
10.62500 0.09136
10.87500 0.08034
11.12500 0.09780
11.37500 0.09377
11.62500 0.11145
11.87500 0.11257
12.12500 0.11041
12.37500 0.12106
12.62500 0.13810
12.87500 0.14168
13.12500 0.14534
13.37500 0.13684
13.62500 0.12799
13.87500 0.13256
14.12500 0.12027
14.37500 0.10988
14.62500 0.13859
14.87500 0.12562
15.12500 0.12163
15.37500 0.11582
15.62500 0.11545
15.87500 0.08682
16.12500 0.07162
16.37500 0.07370
16.62500 0.07152
16.87500 0.09492
17.12500 0.05945
17.37500 0.04999
17.62500 0.05810
17.87500 0.03709
18.12500 0.05108
18.37500 0.04155
18.62500 0.04715
18.87500 0.01927
19.12500 0.02151
19.37500 0.01669
19.62500 0.03872
19.87500 0.05836
