0.05000 2318.88562
0.15000 3449.31511
0.25000 5236.19130
0.35000 5266.47678
0.45000 6049.80162
0.55000 6326.75361
0.65000 6309.93473
0.75000 6270.12560
0.85000 6237.34340
0.95000 6333.15865
1.05000 6190.91018
1.15000 5982.24772
1.25000 5883.10756
1.35000 5648.84509
1.45000 5380.09287
1.55000 5202.28137
1.65000 5170.38586
1.75000 4957.05373
1.85000 4835.40123
1.95000 4635.73318
2.05000 4444.65238
2.15000 4307.77737
2.25000 4155.80444
2.35000 4146.17959
2.45000 3869.01058
2.55000 3742.58145
2.65000 3668.37317
2.75000 3558.77890
2.85000 3423.54592
2.95000 3309.59758
3.05000 3264.61825
3.15000 3107.32031
3.25000 3032.74157
3.35000 2922.38945
3.45000 2868.07690
3.55000 2742.17799
3.65000 2641.73975
3.75000 2534.22272
3.85000 2497.76941
3.95000 2431.35819
4.05000 2335.35150
4.15000 2281.40789
4.25000 2214.92841
4.35000 2175.25603
4.45000 2091.11292
4.55000 2040.09623
4.65000 1983.33983
4.75000 1907.47020
4.85000 1877.62833
4.95000 1776.15361
5.05000 1775.97629
5.15000 1698.76581
5.25000 1649.58190
5.35000 1605.73764
5.45000 1567.89049
5.55000 1540.55444
5.65000 1475.68351
5.75000 1413.36577
5.85000 1364.59512
5.95000 1320.86207
6.05000 1305.48584
6.15000 1268.47723
6.25000 1208.61006
6.35000 1213.83445
6.45000 1155.08423
6.55000 1102.83930
6.65000 1072.36114
6.75000 1036.66860
6.85000 1036.94303
6.95000 989.33305
7.05000 957.24858
7.15000 909.73326
7.25000 913.57040
7.35000 891.96500
7.45000 856.27444
7.55000 824.09860
7.65000 815.50960
7.75000 816.99317
7.85000 793.75185
7.95000 765.19421
8.05000 731.30407
8.15000 724.80585
8.25000 709.95855
8.35000 693.05447
8.45000 700.03836
8.55000 659.63352
8.65000 643.64219
8.75000 651.47893
8.85000 614.26897
8.95000 630.76875
9.05000 578.74864
9.15000 565.78256
9.25000 545.58685
9.35000 549.49259
9.45000 533.75191
9.55000 511.90829
9.65000 508.29912
9.75000 469.22949
9.85000 481.40384
9.95000 471.38720
10.05000 447.81382
10.15000 428.80573
10.25000 415.95822
10.35000 404.95708
10.45000 409.30635
10.55000 397.49626
10.65000 387.09557
10.75000 354.12505
10.85000 368.23819
10.95000 376.46690
11.05000 342.35978
11.15000 333.46752
11.25000 305.68807
11.35000 304.05619
11.45000 305.53656
11.55000 300.13518
11.65000 299.77773
11.75000 268.37561
11.85000 291.89509
11.95000 281.20742
12.05000 246.75309
12.15000 258.47133
12.25000 233.79517
12.35000 235.31309
12.45000 236.39434
12.55000 228.42265
12.65000 215.99122
12.75000 220.29759
12.85000 217.11469
12.95000 227.92711
13.05000 207.23409
13.15000 190.55060
13.25000 209.10849
13.35000 194.41496
13.45000 181.62808
13.55000 173.30692
13.65000 187.01694
13.75000 166.09876
13.85000 184.56168
13.95000 169.75172
14.05000 171.75848
14.15000 153.10846
14.25000 170.93608
14.35000 152.30096
14.45000 163.53196
14.55000 145.32095
14.65000 141.28799
14.75000 140.66610
14.85000 136.91566
14.95000 131.76824
15.05000 132.50848
15.15000 130.64428
15.25000 147.65906
15.35000 123.03917
15.45000 131.89437
15.55000 126.30544
15.65000 124.66272
15.75000 120.51875
15.85000 147.18623
15.95000 128.06138
16.05000 123.36418
16.15000 118.04799
16.25000 113.72625
16.35000 107.98358
16.45000 108.62802
16.55000 100.68722
16.65000 108.12772
16.75000 101.98390
16.85000 92.35920
16.95000 95.35228
17.05000 95.15405
17.15000 112.97353
17.25000 106.10376
17.35000 90.09953
17.45000 98.50252
17.55000 92.45941
17.65000 93.58653
17.75000 96.14370
17.85000 93.04054
17.95000 93.09592
18.05000 104.67338
18.15000 91.51502
18.25000 80.75930
18.35000 102.80524
18.45000 92.24479
18.55000 83.73423
18.65000 86.45943
18.75000 85.40592
18.85000 76.52050
18.95000 107.95398
19.05000 83.58898
19.15000 72.10963
19.25000 76.38637
19.35000 84.62006
19.45000 79.71167
19.55000 83.25242
19.65000 74.21982
19.75000 75.33631
19.85000 69.58149
19.95000 74.18793
