0.05000 -4185.41918 1881.21348 2085.34437 7746.67815 7199.40467 7821.01231
0.15000 -6995.66110 172.54080 1498.94501 7190.09767 9616.39121 12603.24430
0.25000 -9838.96113 418.33856 525.31179 8018.32873 10714.69290 13925.54613
0.35000 -11027.46516 -100.17865 1005.60025 7658.53458 6561.16280 14689.10618
0.45000 -12159.16981 105.08458 231.50215 6084.94030 5765.19386 15003.77187
0.55000 -12676.61216 258.51530 221.90375 6452.76396 5864.76133 14241.58793
0.65000 -13115.29830 -116.25875 438.58223 6428.42766 6689.53825 13717.04780
0.75000 -13119.19270 16.33404 -17.16680 5378.41533 6186.38816 13373.01115
0.85000 -13037.00765 32.49009 78.89958 4703.44420 4803.03195 12469.50778
0.95000 -12881.28325 -22.29626 -14.82479 4182.19018 4277.62185 11553.43289
1.05000 -12510.00970 44.53185 -306.75736 4487.95542 4385.32339 11024.00663
1.15000 -12222.67112 -84.44555 -38.33524 3960.94706 3874.83743 10241.24468
1.25000 -11850.23207 -19.46906 -647.13741 4355.92725 4144.55823 9668.13820
1.35000 -11595.07281 0.40042 64.93767 4449.77402 3950.90221 9364.87322
1.45000 -11372.41324 -23.85336 -228.14893 3592.31823 3785.40060 8944.49473
1.55000 -11280.10736 -166.22547 233.08579 2385.24677 3712.92044 10699.71043
1.65000 -11095.28863 -89.79234 -144.87325 3176.65198 3733.76667 8194.94442
1.75000 -11025.64271 -123.73366 -182.39505 2023.35806 3110.89825 7492.52884
1.85000 -10828.71556 -133.17026 -141.88641 1859.06094 2967.77282 7244.53919
1.95000 -10590.96461 -117.49441 113.30581 1814.14051 2836.95641 6868.46464
2.05000 -10332.10507 -41.66088 -20.15482 2229.72607 4477.80213 6609.38225
2.15000 -10107.51164 -101.47396 -15.77048 3390.96507 5288.68703 7025.38130
2.25000 -10053.07460 -90.17187 -238.66488 1653.65392 3442.35040 6165.76718
2.35000 -9857.80646 -13.15709 169.74567 1645.03646 2572.15255 5741.33773
2.45000 -9830.08215 -50.42980 -85.29004 1875.71958 2658.14193 5690.58400
2.55000 -9707.48241 -112.49248 -121.20564 1632.58303 2305.56920 5177.39946
2.65000 -9612.23080 -99.26509 -7.90736 1669.83805 2235.42891 5104.79631
2.75000 -9536.02682 -35.32646 -238.97221 1546.49428 2269.95117 4943.06791
2.85000 -9448.45118 -33.24992 -121.22942 1810.87227 1915.03111 4684.65661
2.95000 -9277.05795 -44.86123 -279.22103 2271.91136 2048.64835 4476.79913
3.05000 -9166.99160 -75.53122 -174.88042 1559.31981 1693.64901 4282.23087
3.15000 -9151.39708 -64.98868 -127.74903 1475.76098 1547.32502 4016.57052
3.25000 -8965.74534 -46.16072 -108.19546 1315.30179 1399.98434 3852.62874
3.35000 -8801.24084 -44.41385 74.36414 1286.20859 1222.83430 3606.01796
3.45000 -8709.17099 -14.78052 123.67776 1700.78874 1530.61709 4605.42142
3.55000 -8647.69460 -45.81652 89.27989 1309.15991 1145.19077 3430.66934
3.65000 -8447.05999 -12.64216 -183.70142 1581.67949 1374.68254 3344.67109
3.75000 -8318.08401 -6.73540 -17.87757 1245.13134 1181.34071 3136.53466
3.85000 -8212.98060 15.22478 -4.21959 1316.13279 866.22728 3020.65240
3.95000 -8044.63106 11.37585 -26.81731 3235.34680 988.01474 5455.85122
4.05000 -7959.90023 33.06432 44.03754 1906.70557 1226.65986 2835.82204
4.15000 -7913.06965 9.50906 -39.50276 1008.38922 989.65653 2769.93816
4.25000 -7816.31418 31.34864 34.00098 913.42788 730.88491 2647.14314
4.35000 -7718.83532 26.57263 60.29422 1028.83621 844.36043 2593.91969
4.45000 -7628.77744 19.34678 49.98065 954.64782 835.61423 2546.72249
4.55000 -7531.20595 34.48615 1.56603 1061.11455 1237.96851 2453.75031
4.65000 -7462.79337 25.73571 -15.86318 1134.86782 1261.97518 2530.76303
4.75000 -7380.09100 6.09752 14.03175 931.76289 984.85844 2297.27597
4.85000 -7338.73059 31.37537 -3.88086 662.52896 933.48349 2190.91712
4.95000 -7383.79153 -26.97708 -28.45523 5686.73097 4040.01194 2156.81853
5.05000 -7199.77909 6.51602 6.52841 742.31594 647.37455 2138.22235
5.15000 -7085.17614 24.04669 69.41833 708.07547 538.19912 1999.29669
5.25000 -7040.80702 20.06487 -11.66711 912.85634 850.62158 2238.72691
5.35000 -6952.06354 14.73292 61.17777 784.21188 975.67382 2042.58333
5.45000 -6928.92604 26.85212 95.94928 2599.38627 550.96020 2528.06826
5.55000 -6831.07628 32.79867 11.21139 488.32689 553.27583 1770.45321
5.65000 -6749.63777 4.17793 12.16244 1750.97459 937.95811 2248.06337
5.75000 -6653.40879 5.81145 -12.51638 446.70490 438.29881 1677.84594
5.85000 -6588.81080 18.01132 46.49332 516.28811 437.04036 1674.88062
5.95000 -6509.34811 13.18077 89.02786 566.40685 758.01237 2174.84170
6.05000 -6450.97055 -10.82064 39.90782 467.83528 367.41050 1574.05326
6.15000 -6382.13117 7.41340 84.57456 448.75208 416.11312 1572.85757
6.25000 -6359.96915 10.84016 -0.07485 1217.58328 838.34591 1625.34447
6.35000 -6288.73206 0.87967 60.00033 423.60282 746.41445 1461.35793
6.45000 -6040.20082 -78.21964 47.27969 8377.97930 3353.03180 1853.36443
6.55000 -6179.40775 -16.87708 100.11328 1159.15467 1110.74712 1611.23199
6.65000 -6104.85446 -4.05621 82.73503 480.07625 402.09391 1354.50775
6.75000 -6025.33699 3.71819 50.88962 1444.48406 604.21981 1429.01213
6.85000 -5949.85385 8.62649 30.24017 380.89657 309.68597 1234.70604
6.95000 -5889.64140 -0.27554 80.11026 368.66065 327.08358 1198.79508
7.05000 -5825.09001 -0.11484 64.64148 388.65179 276.27184 1180.02769
7.15000 -5770.60015 17.13152 75.47147 373.22037 284.44093 1174.28249
7.25000 -5715.59986 9.23107 38.09375 324.46595 271.53558 1109.65414
7.35000 -5662.22581 8.98574 81.38250 544.82713 474.51968 1249.07358
7.45000 -5603.94751 -4.11871 15.33999 316.35166 346.80253 1096.01163
7.55000 -5535.40122 6.53645 30.04628 396.33528 283.72803 1076.49015
7.65000 -5500.46952 5.06037 25.82953 321.61326 269.38566 1053.84799
7.75000 -5443.58652 4.88166 34.26635 310.79663 239.06713 986.43847
7.85000 -5394.70389 7.34441 -14.00598 304.78714 215.74309 1000.07831
7.95000 -5340.37736 1.04178 12.26291 292.86849 289.45361 923.48227
8.05000 -5286.27885 8.88905 43.49401 324.38671 279.00858 1026.53544
8.15000 -5221.21951 8.69900 4.37538 272.39683 183.58411 884.49130
8.25000 -5195.46687 6.88626 -14.80981 434.87017 273.51743 967.07564
8.35000 -5107.85256 -7.18278 -12.77385 796.42335 258.62020 886.80010
8.45000 -5079.43785 9.63068 8.00025 276.09789 207.70536 839.43646
8.55000 -5028.19812 -5.35986 -22.50772 250.62063 285.53146 835.15763
8.65000 -4969.58843 2.40669 -12.61786 264.87308 220.09431 799.70956
8.75000 -4930.43303 5.37294 -16.57004 293.33015 287.97338 763.22016
8.85000 -4864.18876 10.77546 -8.78762 665.15101 223.88269 787.43965
8.95000 -4849.66040 -4.41901 3.73357 428.46332 394.29369 812.77459
9.05000 -4812.28307 -1.32007 -38.26796 826.70484 246.20123 736.85586
9.15000 -4734.82252 11.89097 -17.61506 411.25337 329.96179 771.81566
9.25000 -4706.12653 5.57880 -6.56808 268.38760 367.85838 777.63900
9.35000 -4681.70191 -0.16674 -41.03668 266.61263 245.18106 709.76659
9.45000 -4639.97339 14.52743 -5.61920 354.52692 309.55249 672.76836
9.55000 -4609.24381 -1.28208 0.27504 369.47734 279.32065 702.19087
9.65000 -4565.57283 -1.68985 22.69633 436.84894 384.77489 684.34144
9.75000 -4570.62352 -6.56612 8.02425 761.49195 278.51290 792.41504
9.85000 -4496.80244 3.63477 -7.71962 221.38070 180.92879 588.63947
9.95000 -4449.45679 5.71250 29.18377 197.55823 158.06365 640.54711
10.05000 -4409.43179 9.74338 6.54572 206.31278 172.69605 557.68739
10.15000 -4831.06943 245.57977 -58.38487 12867.21370 6070.79759 1640.26924
10.25000 -4334.59792 5.66574 15.37757 193.58629 147.27761 536.70271
10.35000 -4303.33133 -6.54648 9.15732 242.45305 253.40303 523.70572
10.45000 -4256.37271 3.72431 -16.68472 195.81816 151.12986 491.59970
10.55000 -4218.54840 7.48427 2.99632 217.07558 229.06901 485.28097
10.65000 -4167.56802 1.68863 -9.96916 144.38499 117.34177 494.08320
10.75000 -4132.18641 19.52843 12.42723 289.87486 458.35124 474.38927
10.85000 -4089.00603 1.18827 11.13824 146.64442 192.90777 816.29752
10.95000 -4046.63759 -8.52196 -11.30640 233.89200 165.75094 441.77715
11.05000 -4010.37464 1.80520 40.52252 134.59071 139.58012 438.27345
11.15000 -3939.85004 91.63543 53.85502 891.94793 2167.35075 1019.25705
11.25000 -3929.70931 -3.25589 3.78912 287.47149 196.96767 461.33007
11.35000 -3907.01980 -2.22666 -2.21508 193.09165 172.75581 409.25761
11.45000 -3870.55682 4.74178 22.67589 127.23424 243.20069 408.87170
11.55000 -3833.02816 -0.72635 31.09066 155.72570 114.30011 405.61472
11.65000 -3813.82445 10.21728 16.22030 117.95909 133.28089 363.71923
11.75000 -3793.01013 5.57958 26.17021 249.29253 263.17604 378.18802
11.85000 -3740.01323 -3.84136 27.72650 137.44308 128.92411 366.32991
11.95000 -3710.12161 -0.14467 16.79319 135.07993 159.12019 358.72733
12.05000 -3684.45479 -13.53346 24.32831 234.05661 220.38307 376.63442
12.15000 -3651.96379 -11.45801 71.76269 333.20274 496.96618 874.25440
12.25000 -3629.07252 6.81624 38.78895 191.47258 149.89975 496.23541
12.35000 -3608.70008 10.70956 28.10134 192.51088 151.45273 372.00978
12.45000 -3583.90322 -2.53270 6.31728 127.42564 148.21436 351.61417
12.55000 -3551.86747 5.02426 33.62214 110.29368 94.68698 314.73711
12.65000 -3674.05477 -21.38488 -106.74632 3239.14428 540.50597 2911.89593
12.75000 -3494.24717 23.47825 29.70947 185.45524 302.64175 349.77834
12.85000 -3488.47009 -14.03353 -20.55802 256.48987 218.45264 617.54976
12.95000 -3449.09835 -10.40305 17.00908 132.18546 127.55381 312.06831
13.05000 -3438.51068 8.78152 23.14995 131.76570 119.56380 280.43440
13.15000 -3404.56032 17.07275 39.37574 120.81659 145.44371 311.71676
13.25000 -3383.01352 3.11275 26.14056 110.05551 89.38798 294.52390
13.35000 -3358.13848 -2.38625 31.05422 123.62048 98.94023 280.43774
13.45000 -3305.85370 0.28126 31.49926 294.27922 157.36154 290.06541
13.55000 -3304.76228 -0.40114 28.05510 119.64761 162.60361 270.61137
13.65000 -3269.82958 -2.18421 29.31015 93.67659 91.59074 265.62489
13.75000 -3251.52814 0.77317 44.68831 104.34537 112.84707 253.71261
13.85000 -3222.76767 10.01207 16.64912 106.78458 113.88986 291.76050
13.95000 -3191.61771 10.07165 19.61203 204.51667 92.93602 253.55623
14.05000 -3185.77746 2.44405 15.30162 92.40860 121.66044 259.31220
14.15000 -3145.66506 4.72712 1.11196 167.90033 116.22781 236.03244
14.25000 -3142.82495 -2.92482 13.47632 130.21593 124.29687 246.34175
14.35000 -3114.26782 -1.67756 -4.68040 98.34278 83.95849 238.29149
14.45000 -3083.84103 -0.59366 2.05899 56.17028 63.85645 203.62009
14.55000 -3067.53696 -9.32197 -0.59445 91.41869 125.26694 236.58785
14.65000 -3020.43002 -20.08870 -22.35066 370.43023 326.40469 226.69429
14.75000 -3025.56080 4.37462 -25.85196 94.64621 108.33591 205.33070
14.85000 -2993.48058 -3.78324 14.32645 154.29284 127.71026 211.38031
14.95000 -2979.93907 6.92107 -24.77469 79.38939 81.07080 198.82902
15.05000 -2959.59731 11.91988 10.46328 97.13575 81.94854 192.33299
15.15000 -2928.98073 5.61621 1.74576 57.38200 77.92465 201.68704
15.25000 -2921.27880 0.06864 0.03714 84.20708 52.24085 204.42556
15.35000 -2884.06559 -6.42951 22.45116 69.72075 71.26439 185.20795
15.45000 -2874.31926 1.77247 9.84857 60.83734 64.89601 172.97208
15.55000 -2856.68328 14.17153 -7.56364 215.49227 184.39023 209.52810
15.65000 -2834.75067 4.59546 0.77289 115.25845 140.83878 175.95678
15.75000 -2822.74094 5.02733 11.94478 87.29271 81.46548 177.35978
15.85000 -2804.28021 3.83796 19.30567 71.06716 126.14935 198.03571
15.95000 -2781.09880 4.27723 -13.55898 82.56119 61.84171 171.16478
16.05000 -2751.66792 5.83740 48.20438 110.38570 94.20828 166.37311
16.15000 -2742.82920 5.92025 17.05222 46.97511 58.49616 152.39253
16.25000 -2725.98700 4.01206 7.58401 49.50458 46.46337 158.80732
16.35000 -2718.79864 9.43738 -2.09227 85.95756 138.47668 229.32047
16.45000 -2697.56694 3.56701 11.52344 60.52748 69.46995 158.45211
16.55000 -2669.44524 4.55564 23.73682 65.20419 67.35584 148.74377
16.65000 -2648.87925 0.37919 19.95003 98.62136 81.26282 143.07859
16.75000 -2638.35627 -1.40708 35.91137 79.85859 105.50239 146.94102
16.85000 -2627.40569 2.06458 47.61974 79.89801 63.54605 147.65032
16.95000 -2603.94506 -2.70671 57.23741 42.47261 60.51633 150.83449
17.05000 -2601.79345 1.86344 44.41291 64.62469 51.69567 158.41247
17.15000 -2581.63701 9.77742 35.60135 61.92344 53.42085 130.57394
17.25000 -2569.01093 8.76282 18.75753 46.21884 59.20534 142.51745
17.35000 -2545.34229 -5.92659 15.45379 93.31574 87.67709 144.32145
17.45000 -2533.86841 0.88181 19.21086 74.70003 49.57478 132.08697
17.55000 -2499.14329 4.68216 34.77742 201.93564 83.58474 136.61339
17.65000 -2501.68249 3.65427 20.97859 53.90062 79.05053 146.59455
17.75000 -2490.94922 -6.77647 28.75265 49.90613 55.97072 121.36182
17.85000 -2480.53980 4.23249 9.53979 70.23220 45.31434 109.90717
17.95000 -2464.99082 -2.34013 -12.32649 48.87856 53.96755 126.34229
18.05000 -2434.62117 -6.49216 36.01880 99.37471 178.63401 131.95979
18.15000 -2425.12758 2.16820 -5.33123 45.65794 45.03888 110.34336
18.25000 -2409.71445 12.87340 -13.67586 54.03564 98.89976 216.17878
18.35000 -2392.57845 4.32562 -9.08079 29.08574 32.13564 107.94433
18.45000 -2374.02696 -6.40237 -26.62919 57.20112 66.94395 82.44865
18.55000 -2358.07384 -0.89045 -19.66775 49.08920 36.38861 126.19516
18.65000 -2346.04301 13.69164 -3.27965 55.85131 60.69429 137.55541
18.75000 -2328.43802 -16.80016 -46.96977 73.44184 102.32291 158.84301
18.85000 -2327.74538 -0.19925 -7.80892 46.20251 51.53255 101.59258
18.95000 -2306.81369 -3.92472 -7.55247 37.27323 33.26457 117.32263
19.05000 -2298.46941 -1.62829 -23.30041 36.47309 28.13339 86.63358
19.15000 -2279.08950 1.75597 2.22052 37.84944 42.19112 96.59401
19.25000 -2280.09598 15.96084 -16.14326 220.14146 156.95146 168.34186
19.35000 -2262.46889 9.45019 4.05985 67.70225 97.20929 94.29763
19.45000 -2237.40651 -7.97723 -13.21479 39.69351 56.67126 97.09542
19.55000 -2221.88966 5.12085 13.33305 32.14245 40.41868 74.58731
19.65000 -2208.32063 -2.39634 15.25420 41.43002 41.37458 105.45453
19.75000 -2206.19039 -0.68433 5.44422 23.46977 37.04614 80.32965
19.85000 -2191.96572 -0.77067 41.21653 43.46019 39.23089 163.78053
19.95000 -2183.11018 -8.93590 32.83253 67.15161 80.57188 140.86878
