0.12500 0.01217
0.37500 0.01145
0.62500 0.01493
0.87500 0.03662
1.12500 0.06371
1.37500 0.09819
1.62500 0.12928
1.87500 0.13991
2.12500 0.15215
2.37500 0.15724
2.62500 0.17054
2.87500 0.15662
3.12500 0.14908
3.37500 0.12038
3.62500 0.09705
3.87500 0.08144
4.12500 0.05895
4.37500 0.04678
4.62500 0.04774
4.87500 0.05451
5.12500 0.05028
5.37500 0.04834
5.62500 0.03293
5.87500 0.02559
6.12500 0.02505
6.37500 0.02604
6.62500 0.02518
6.87500 0.03576
7.12500 0.02604
7.37500 0.03738
7.62500 0.03210
7.87500 0.04403
8.12500 0.04237
8.37500 0.05403
8.62500 0.04790
8.87500 0.04813
9.12500 0.03832
9.37500 0.03675
9.62500 0.03697
9.87500 0.02906
10.12500 0.01199
10.37500 0.01349
10.62500 0.00759
10.87500 0.01309
11.12500 0.01842
11.37500 0.01550
11.62500 0.01283
11.87500 0.01011
12.12500 0.03120
12.37500 0.01725
12.62500 0.01881
12.87500 0.03646
13.12500 0.03400
13.37500 0.01975
13.62500 0.01770
13.87500 0.04405
14.12500 0.03457
14.37500 0.04385
14.62500 0.06668
14.87500 0.05441
