0.2 0.0746 17.1009 -2.53818 82.63804 82.75396 69.40432
0.6 -0.01627 40.59799 -0.83091 81.53154 79.70003 69.2799
1.0 0.28815 63.03511 -1.08421 79.87288 75.70816 66.19277
1.4 -0.49633 78.18819 0.09404 78.12687 72.97159 62.69094
1.8 0.73653 90.29498 -1.26908 75.45019 68.02309 60.57155
2.2 -0.45276 100.59987 -0.57761 73.34103 65.24992 57.51542
2.6 -0.08452 110.06985 -0.372 71.19808 62.73333 55.35725
3.0 0.06915 119.02806 -0.45457 67.41991 59.91901 52.91596
3.4 0.45045 128.28129 -0.27339 64.04278 57.00584 51.29195
3.8 0.11772 138.34135 0.14143 60.17615 53.39842 48.91776
4.2 1.05096 147.5926 -0.11626 56.01425 50.46755 46.97268
4.6 0.38122 155.31911 -0.27315 52.41584 47.7538 44.83729
5.0 0.89291 163.28477 0.52573 49.08246 44.85265 42.67298
5.4 0.82547 169.49414 0.11566 46.86491 41.45685 40.59496
5.8 0.69087 175.45178 0.27883 44.95224 38.92398 38.79021
6.2 0.16033 180.60708 0.50329 42.52038 37.13543 36.96224
6.6 -0.0274 185.01052 0.97849 40.94968 35.00961 34.99178
7.0 -0.11577 188.79964 0.61139 39.50431 33.56348 33.60196
7.4 0.35279 192.02299 1.30535 38.24116 31.66087 32.30045
7.8 0.32698 194.56782 1.1909 37.03386 30.00087 30.9098
8.2 0.13841 196.92889 0.80333 35.90097 29.02385 30.01011
8.6 0.38754 199.27008 1.18154 34.77975 27.97802 28.8889
9.0 0.01019 201.16237 1.11619 33.10886 26.97543 27.70058
9.4 0.40344 202.81258 0.5569 32.06169 25.70169 26.86247
9.8 0.14545 204.10032 0.1287 31.62205 25.1287 25.54723
10.2 0.19243 204.54222 0.09122 30.82493 24.06877 25.07249
10.6 0.09133 206.2651 -0.49419 29.79474 23.22315 24.13675
11.0 -0.25997 207.17206 -0.33238 28.55395 21.9308 22.78669
11.4 0.3192 207.64896 -0.69679 27.58827 21.56602 21.92041
11.8 -0.10119 208.96785 -0.56991 26.58684 20.59213 21.10073
12.2 0.63366 209.8439 -0.58703 25.83262 20.21074 20.51172
12.6 0.51423 210.85264 -0.39562 24.96134 19.35303 19.37838
13.0 0.13756 211.08237 0.16442 25.04597 18.37911 18.70395
13.4 0.44078 211.53461 -0.22855 23.69867 17.62531 18.12536
13.8 0.5765 211.37443 0.39199 23.37305 17.23413 17.62521
14.2 0.36039 211.23715 0.26324 22.74902 16.66102 17.14804
14.6 0.68492 211.3242 0.59558 21.75897 15.93674 16.60583
15.0 0.10448 211.50805 0.255 21.06165 15.72399 16.34176
15.4 0.04766 211.10296 0.75946 20.85243 14.91279 15.7603
15.8 0.22245 211.51755 0.5008 19.72697 14.8603 15.5826
16.2 -0.58383 211.41231 0.61417 18.50648 14.56448 14.86257
16.6 -0.35119 211.6408 0.57698 18.60123 14.53768 14.5051
17.0 -0.07824 212.08567 -0.2351 17.95898 14.02544 13.76352
17.4 0.49225 212.37088 -0.63386 17.43452 13.62095 13.17534
17.8 0.78267 212.81532 -1.65385 17.05982 12.97531 13.0816
18.2 0.2456 212.74521 -1.91683 16.43299 12.78724 12.69772
18.6 0.46768 212.71417 -2.51333 15.93263 12.20677 12.18832
19.0 0.04841 212.81537 -2.42726 15.67751 11.7272 11.69293
19.4 0.6452 212.49985 -2.5462 15.1747 11.19181 11.10607
19.8 0.69154 211.93259 -1.88103 15.50065 10.96196 11.00989
