0.125 -0.001 0.000 0.004
0.375 -0.003 -0.000 0.052
0.625 0.012 0.011 0.250
0.875 -0.026 0.007 0.692
1.125 0.030 0.022 1.377
1.375 0.023 -0.029 2.173
1.625 -0.004 0.007 2.889
1.875 0.043 0.002 3.650
2.125 0.036 -0.002 4.406
2.375 0.120 -0.014 4.917
2.625 0.041 0.045 5.559
2.875 -0.010 -0.000 5.819
3.125 -0.010 0.018 6.357
3.375 -0.014 -0.008 6.668
3.625 -0.122 0.006 6.973
3.875 0.012 0.018 7.443
4.125 -0.015 0.012 7.600
4.375 0.019 0.040 7.770
4.625 0.041 -0.030 8.215
4.875 0.047 0.019 8.329
5.125 0.026 -0.046 8.687
5.375 -0.044 -0.042 9.221
5.625 -0.024 -0.013 9.769
5.875 -0.025 -0.004 10.399
6.125 -0.054 -0.007 10.518
6.375 -0.100 -0.051 11.103
6.625 -0.099 -0.053 12.056
6.875 -0.046 -0.040 13.204
7.125 -0.125 -0.048 14.350
7.375 -0.048 -0.062 16.010
7.625 -0.129 -0.118 17.925
7.875 -0.157 -0.103 19.333
8.125 -0.147 -0.191 21.835
8.375 -0.195 -0.190 23.281
8.625 -0.119 -0.218 25.447
8.875 -0.157 -0.204 25.272
9.125 -0.171 -0.195 26.333
9.375 -0.158 -0.174 25.156
9.625 -0.102 -0.206 24.498
9.875 -0.081 -0.124 23.232
10.125 -0.100 -0.187 22.042
10.375 -0.090 -0.168 21.304
10.625 -0.067 -0.169 20.724
10.875 -0.037 -0.144 19.932
11.125 -0.018 -0.115 19.691
11.375 -0.045 -0.147 19.644
11.625 -0.023 -0.189 19.715
11.875 -0.046 -0.158 20.085
12.125 -0.005 -0.171 20.237
12.375 -0.020 -0.171 20.492
12.625 -0.013 -0.143 20.333
12.875 -0.012 -0.124 19.940
13.125 0.002 -0.095 19.749
13.375 -0.016 -0.125 19.877
13.625 0.009 -0.064 18.824
13.875 0.028 -0.102 18.346
14.125 0.048 -0.059 17.989
14.375 0.015 -0.027 17.122
14.625 0.024 -0.030 16.741
14.875 0.020 -0.035 16.623
