0.12500 0.00816
0.37500 0.04870
0.62500 0.10730
0.87500 0.16398
1.12500 0.20331
1.37500 0.23486
1.62500 0.26086
1.87500 0.28852
2.12500 0.30351
2.37500 0.31059
2.62500 0.32487
2.87500 0.33331
3.12500 0.34286
3.37500 0.35599
3.62500 0.34778
3.87500 0.34948
4.12500 0.33353
4.37500 0.29670
4.62500 0.26462
4.87500 0.21896
5.12500 0.16461
5.37500 0.12053
5.62500 0.07700
5.87500 0.05745
6.12500 0.03974
6.37500 0.02020
6.62500 0.02025
6.87500 0.02890
7.12500 0.01895
7.37500 0.02627
7.62500 0.03438
7.87500 0.02479
8.12500 0.03598
8.37500 0.02338
8.62500 0.00834
8.87500 0.01018
9.12500 0.00457
9.37500 0.01758
9.62500 0.01136
9.87500 0.02576
10.12500 0.02639
10.37500 0.04888
10.62500 0.07873
10.87500 0.08311
11.12500 0.07045
11.37500 0.09029
11.62500 0.10314
11.87500 0.10473
12.12500 0.11545
12.37500 0.12577
12.62500 0.13901
12.87500 0.14450
13.12500 0.13429
13.37500 0.10909
13.62500 0.05282
13.87500 0.05552
14.12500 0.03098
14.37500 0.01928
14.62500 0.00489
14.87500 0.03788
