0.120000 -2.604900
0.380000 -2.769970
0.620000 -2.483200
0.880000 -2.671050
1.120000 -2.404240
1.380000 2.732090
1.620000 2.575450
1.880000 1.678690
2.120000 3.140780
2.380000 -0.868460
2.620000 -1.712980
2.880000 -0.931600
3.120000 -1.722370
3.380000 -1.966780
3.620000 -0.542440
3.880000 -1.497440
4.120000 -2.486850
4.380000 1.794680
4.620000 0.124810
4.880000 2.733080
5.120000 2.698480
5.380000 -1.862250
5.620000 -3.138420
5.880000 -2.431570
6.120000 -2.550210
6.380000 -2.319670
6.620000 2.028260
6.880000 0.974080
7.120000 2.710570
7.380000 2.803010
7.620000 0.579030
7.880000 -0.784910
8.120000 -0.834420
8.380000 -2.371320
8.620000 2.622160
8.880000 -2.780250
9.120000 -2.607710
9.380000 2.624010
9.620000 2.694370
9.880000 2.871830
10.120000 -3.005320
10.380000 2.665230
10.620000 1.876000
10.880000 0.605350
11.120000 1.603550
11.380000 -1.837270
11.620000 1.168990
11.880000 -0.201530
12.120000 0.665690
12.380000 -0.325670
12.620000 -0.271000
12.880000 0.626420
13.120000 2.886310
13.380000 2.771630
13.620000 -2.689840
13.880000 1.953270
14.120000 1.612650
14.380000 2.757050
14.620000 2.712580
14.880000 2.424100
15.120000 2.603870
15.380000 2.218360
15.620000 2.429560
15.880000 1.999480
16.120000 0.181370
16.380000 -0.003280
16.620000 -0.001110
16.880000 -0.749270
17.120000 2.476640
17.380000 -0.641950
17.620000 -0.003830
17.880000 -2.202280
18.120000 1.391030
18.380000 -1.456740
18.620000 -2.036330
18.880000 -2.407380
19.120000 0.310870
19.380000 -1.456960
19.620000 -2.512260
19.880000 -0.564900
