0.12500 0.02259
0.37500 0.04143
0.62500 0.08414
0.87500 0.10758
1.12500 0.14912
1.37500 0.17795
1.62500 0.20347
1.87500 0.23105
2.12500 0.25067
2.37500 0.22249
2.62500 0.23334
2.87500 0.25837
3.12500 0.23128
3.37500 0.21127
3.62500 0.18576
3.87500 0.16796
4.12500 0.13833
4.37500 0.10978
4.62500 0.10979
4.87500 0.08883
5.12500 0.05828
5.37500 0.07557
5.62500 0.05862
5.87500 0.05924
6.12500 0.06873
6.37500 0.07841
6.62500 0.05536
6.87500 0.05072
7.12500 0.06012
7.37500 0.05757
7.62500 0.06658
7.87500 0.07206
8.12500 0.02993
8.37500 0.04591
8.62500 0.03638
8.87500 0.04822
9.12500 0.03268
9.37500 0.01305
9.62500 0.02008
9.87500 0.04747
10.12500 0.03389
10.37500 0.03650
10.62500 0.06692
10.87500 0.03627
11.12500 0.01002
11.37500 0.03863
11.62500 0.00528
11.87500 0.03952
12.12500 0.01975
12.37500 0.06185
12.62500 0.05415
12.87500 0.01404
13.12500 0.01373
13.37500 0.00722
13.62500 0.00863
13.87500 0.04451
14.12500 0.03300
14.37500 0.00652
14.62500 0.04805
14.87500 0.02993
15.12500 0.02011
15.37500 0.02918
15.62500 0.02500
15.87500 0.00755
16.12500 0.06848
16.37500 0.10058
16.62500 0.10431
16.87500 0.06699
17.12500 0.12133
17.37500 0.09723
17.62500 0.11571
17.87500 0.03563
18.12500 0.04023
18.37500 0.06421
18.62500 0.03169
18.87500 0.02361
19.12500 0.00352
19.37500 0.06147
19.62500 0.04160
19.87500 0.01704
