0.12500 0.03425
0.37500 0.05057
0.62500 0.08495
0.87500 0.15349
1.12500 0.18163
1.37500 0.22763
1.62500 0.26107
1.87500 0.29286
2.12500 0.33096
2.37500 0.38290
2.62500 0.38399
2.87500 0.40790
3.12500 0.42695
3.37500 0.42788
3.62500 0.38244
3.87500 0.37669
4.12500 0.33058
4.37500 0.31185
4.62500 0.28665
4.87500 0.24061
5.12500 0.21890
5.37500 0.18108
5.62500 0.14430
5.87500 0.09097
6.12500 0.07830
6.37500 0.08935
6.62500 0.06135
6.87500 0.06053
7.12500 0.07268
7.37500 0.07930
7.62500 0.06196
7.87500 0.06195
8.12500 0.06660
8.37500 0.04781
8.62500 0.03935
8.87500 0.04237
9.12500 0.04587
9.37500 0.03716
9.62500 0.05368
9.87500 0.03200
10.12500 0.03774
10.37500 0.05981
10.62500 0.06346
10.87500 0.04939
11.12500 0.07455
11.37500 0.06333
11.62500 0.07435
11.87500 0.08217
12.12500 0.08360
12.37500 0.09898
12.62500 0.05687
12.87500 0.07098
13.12500 0.05155
13.37500 0.06216
13.62500 0.03687
13.87500 0.04606
14.12500 0.07291
14.37500 0.08067
14.62500 0.06034
14.87500 0.01401
15.12500 0.07512
15.37500 0.02075
15.62500 0.02708
15.87500 0.03073
16.12500 0.05238
16.37500 0.05246
16.62500 0.01941
16.87500 0.05574
17.12500 0.06411
17.37500 0.02713
17.62500 0.01621
17.87500 0.08088
18.12500 0.11217
18.37500 0.05710
18.62500 0.10676
18.87500 0.08148
19.12500 0.01697
19.37500 0.06157
19.62500 0.03595
19.87500 0.11340
