0.12500 0.02561
0.37500 0.07975
0.62500 0.14051
0.87500 0.19661
1.12500 0.26461
1.37500 0.29779
1.62500 0.28642
1.87500 0.27047
2.12500 0.27347
2.37500 0.25956
2.62500 0.25770
2.87500 0.21161
3.12500 0.20208
3.37500 0.16629
3.62500 0.14093
3.87500 0.14367
4.12500 0.12796
4.37500 0.14944
4.62500 0.12093
4.87500 0.10581
5.12500 0.10622
5.37500 0.08795
5.62500 0.08645
5.87500 0.06419
6.12500 0.05075
6.37500 0.03385
6.62500 0.00481
6.87500 0.03326
7.12500 0.02104
7.37500 0.03127
7.62500 0.01899
7.87500 0.03240
8.12500 0.00385
8.37500 0.01689
8.62500 0.01781
8.87500 0.01642
9.12500 0.02095
9.37500 0.02929
9.62500 0.01407
9.87500 0.03859
10.12500 0.02390
10.37500 0.05032
10.62500 0.04121
10.87500 0.06963
11.12500 0.07884
11.37500 0.09328
11.62500 0.06524
11.87500 0.07537
12.12500 0.09525
12.37500 0.07888
12.62500 0.07856
12.87500 0.08319
13.12500 0.07253
13.37500 0.03771
13.62500 0.02175
13.87500 0.02149
14.12500 0.04246
14.37500 0.03416
14.62500 0.05810
14.87500 0.06905
15.12500 0.04310
15.37500 0.05491
15.62500 0.08408
15.87500 0.02475
16.12500 0.07202
16.37500 0.07651
16.62500 0.08069
16.87500 0.17725
17.12500 0.11158
17.37500 0.04162
17.62500 0.04949
17.87500 0.09369
18.12500 0.06532
18.37500 0.06237
18.62500 0.15235
18.87500 0.11141
19.12500 0.15853
19.37500 0.14738
19.62500 0.06854
19.87500 0.16534
