0.120000 -2.646010
0.380000 2.138800
0.620000 1.872270
0.880000 1.873670
1.120000 1.934740
1.380000 1.920120
1.620000 1.890430
1.880000 1.830660
2.120000 1.913190
2.380000 1.906930
2.620000 1.891180
2.880000 1.881360
3.120000 1.918090
3.380000 1.904710
3.620000 1.855950
3.880000 1.822350
4.120000 1.837280
4.380000 1.849060
4.620000 1.781110
4.880000 1.797910
5.120000 1.843530
5.380000 1.696880
5.620000 1.889800
5.880000 2.245890
6.120000 1.802670
6.380000 1.879340
6.620000 1.692680
6.880000 1.826990
7.120000 1.182990
7.380000 0.814940
7.620000 1.568660
7.880000 1.584970
8.120000 1.139240
8.380000 1.316610
8.620000 2.204850
8.880000 2.213290
9.120000 2.422420
9.380000 2.125870
9.620000 2.010800
9.880000 1.984720
10.120000 2.046060
10.380000 1.823580
10.620000 1.471120
10.880000 1.367140
11.120000 1.473970
11.380000 1.730600
11.620000 -0.291000
11.880000 -0.894400
12.120000 -0.382160
12.380000 -1.054820
12.620000 -1.135870
12.880000 -1.219100
13.120000 -1.183940
13.380000 -0.582970
13.620000 -1.032570
13.880000 -1.626380
14.120000 -1.479750
14.380000 -1.049450
14.620000 -0.949210
14.880000 -1.406040
15.120000 -1.147110
15.380000 -1.657810
15.620000 -2.030730
15.880000 -2.021030
16.120000 -2.095800
16.380000 -2.034460
16.620000 -1.663910
16.880000 -1.744520
17.120000 -0.963410
17.380000 -2.986810
17.620000 2.612270
17.880000 3.136600
18.120000 2.247430
18.380000 2.746910
18.620000 -0.032290
18.880000 0.925120
19.120000 1.176090
19.380000 -0.179290
19.620000 -0.019500
19.880000 0.382990
