0.120000 -0.606000
0.380000 -1.755180
0.620000 -2.532510
0.880000 1.004460
1.120000 0.926280
1.380000 -0.259030
1.620000 2.455970
1.880000 -0.103670
2.120000 -0.459780
2.380000 0.197170
2.620000 0.636250
2.880000 0.817580
3.120000 0.241690
3.380000 0.336130
3.620000 -0.511770
3.880000 -0.376880
4.120000 -1.711490
4.380000 -1.044660
4.620000 -2.035710
4.880000 -1.330870
5.120000 -2.464180
5.380000 -1.348740
5.620000 -1.984480
5.880000 -2.760820
6.120000 -1.288630
6.380000 -1.973740
6.620000 2.874050
6.880000 -1.112500
7.120000 -0.103320
7.380000 -0.795610
7.620000 -1.077920
7.880000 -1.016090
8.120000 -1.673390
8.380000 -1.981410
8.620000 -2.202790
8.880000 -2.394930
9.120000 -2.305490
9.380000 -2.654020
9.620000 -2.596530
9.880000 -3.063320
10.120000 2.868720
10.380000 3.133180
10.620000 2.809080
10.880000 1.936460
11.120000 2.988130
11.380000 1.450790
11.620000 2.106790
11.880000 0.643170
12.120000 2.176210
12.380000 0.935800
12.620000 1.294030
12.880000 0.542700
13.120000 1.394230
13.380000 0.017700
13.620000 -1.205180
13.880000 -0.145280
14.120000 -2.244400
14.380000 -0.191210
14.620000 -2.049300
14.880000 1.901300
15.120000 1.196660
15.380000 1.738930
15.620000 2.076600
15.880000 0.986570
16.120000 1.255820
16.380000 0.830710
16.620000 0.549350
16.880000 -0.580580
17.120000 0.491840
17.380000 0.134010
17.620000 -0.061410
17.880000 0.271130
18.120000 -0.814960
18.380000 3.138010
18.620000 -0.882440
18.880000 -1.302860
19.120000 -0.961340
19.380000 -0.712120
19.620000 0.239820
19.880000 2.158900
