0.120000 0.216360
0.380000 0.193170
0.620000 0.077700
0.880000 0.224400
1.120000 0.277040
1.380000 0.292860
1.620000 0.297280
1.880000 0.291100
2.120000 0.291060
2.380000 0.289850
2.620000 0.262730
2.880000 0.266590
3.120000 0.247760
3.380000 0.266110
3.620000 0.270910
3.880000 0.283360
4.120000 0.328630
4.380000 0.325630
4.620000 0.354800
4.880000 0.413470
5.120000 0.462110
5.380000 0.400040
5.620000 0.377990
5.880000 0.265440
6.120000 0.145120
6.380000 -0.033200
6.620000 -0.211490
6.880000 -0.207780
7.120000 -0.171010
7.380000 -0.230830
7.620000 -0.244810
7.880000 -0.097280
8.120000 -0.244790
8.380000 -0.060370
8.620000 -0.370120
8.880000 -0.152550
9.120000 -0.199120
9.380000 -1.306510
9.620000 -2.004410
9.880000 -2.545190
10.120000 -2.492170
10.380000 -2.704700
10.620000 -2.698270
10.880000 -2.677450
11.120000 -2.681260
11.380000 -2.654290
11.620000 -2.641540
11.880000 -2.677390
12.120000 -2.567240
12.380000 -2.722290
12.620000 -2.766880
12.880000 -2.809640
13.120000 -2.828210
13.380000 -2.645520
13.620000 2.871860
13.880000 2.819460
14.120000 2.612750
14.380000 1.089800
14.620000 -0.197150
14.880000 -0.695680
