0.12500 0.01455
0.37500 0.04664
0.62500 0.10028
0.87500 0.15626
1.12500 0.22838
1.37500 0.27215
1.62500 0.32249
1.87500 0.36870
2.12500 0.39860
2.37500 0.43380
2.62500 0.45026
2.87500 0.48642
3.12500 0.51020
3.37500 0.54523
3.62500 0.54702
3.87500 0.55543
4.12500 0.57690
4.37500 0.55629
4.62500 0.54671
4.87500 0.53611
5.12500 0.51251
5.37500 0.50624
5.62500 0.46375
5.87500 0.43025
6.12500 0.39073
6.37500 0.37387
6.62500 0.35403
6.87500 0.32302
7.12500 0.30124
7.37500 0.28395
7.62500 0.29911
7.87500 0.23954
8.12500 0.25172
8.37500 0.22965
8.62500 0.20742
8.87500 0.18802
9.12500 0.16015
9.37500 0.12994
9.62500 0.10067
9.87500 0.08784
10.12500 0.05983
10.37500 0.05643
10.62500 0.05248
10.87500 0.02694
11.12500 0.01548
11.37500 0.03957
11.62500 0.02370
11.87500 0.05048
12.12500 0.05727
12.37500 0.09208
12.62500 0.10949
12.87500 0.12206
13.12500 0.11789
13.37500 0.17162
13.62500 0.16009
13.87500 0.16895
14.12500 0.14861
14.37500 0.16807
14.62500 0.19372
14.87500 0.18069
15.12500 0.19686
15.37500 0.20674
15.62500 0.21409
15.87500 0.25694
16.12500 0.19874
16.37500 0.22938
16.62500 0.22138
16.87500 0.25445
17.12500 0.24791
17.37500 0.19892
17.62500 0.21678
17.87500 0.18686
18.12500 0.17667
18.37500 0.13686
18.62500 0.16652
18.87500 0.14905
19.12500 0.21410
19.37500 0.19914
19.62500 0.16155
19.87500 0.19001
