0.12500 0.01238
0.37500 0.03515
0.62500 0.10280
0.87500 0.18367
1.12500 0.24963
1.37500 0.31181
1.62500 0.36532
1.87500 0.41664
2.12500 0.46423
2.37500 0.45987
2.62500 0.47461
2.87500 0.46251
3.12500 0.45088
3.37500 0.43648
3.62500 0.41469
3.87500 0.40779
4.12500 0.39490
4.37500 0.37963
4.62500 0.34886
4.87500 0.29840
5.12500 0.24121
5.37500 0.18933
5.62500 0.15227
5.87500 0.12371
6.12500 0.12093
6.37500 0.11517
6.62500 0.11489
6.87500 0.09593
7.12500 0.08781
7.37500 0.08479
7.62500 0.09061
7.87500 0.09359
8.12500 0.06721
8.37500 0.05185
8.62500 0.07374
8.87500 0.07012
9.12500 0.08296
9.37500 0.09614
9.62500 0.09239
9.87500 0.09293
10.12500 0.08443
10.37500 0.09118
10.62500 0.07911
10.87500 0.08675
11.12500 0.08594
11.37500 0.08872
11.62500 0.10537
11.87500 0.11333
12.12500 0.11180
12.37500 0.10222
12.62500 0.11965
12.87500 0.11452
13.12500 0.13770
13.37500 0.13836
13.62500 0.13990
13.87500 0.12523
14.12500 0.11410
14.37500 0.11466
14.62500 0.08188
14.87500 0.04463
