0.120000 -0.898400
0.380000 0.065060
0.620000 0.051180
0.880000 0.143120
1.120000 0.154570
1.380000 0.135330
1.620000 0.154070
1.880000 0.156550
2.120000 0.159250
2.380000 0.170220
2.620000 0.167090
2.880000 0.159010
3.120000 0.187160
3.380000 0.175520
3.620000 0.182380
3.880000 0.164400
4.120000 0.180720
4.380000 0.194460
4.620000 0.194440
4.880000 0.218330
5.120000 0.192370
5.380000 0.226420
5.620000 0.222410
5.880000 0.199520
6.120000 0.238680
6.380000 0.259330
6.620000 0.278310
6.880000 0.313560
7.120000 0.296590
7.380000 0.264240
7.620000 0.232790
7.880000 0.258430
8.120000 0.195850
8.380000 0.147000
8.620000 0.107710
8.880000 0.095170
9.120000 0.092700
9.380000 -0.077910
9.620000 -0.120850
9.880000 -0.204490
10.120000 -0.140600
10.380000 -0.163560
10.620000 -0.108610
10.880000 -0.276020
11.120000 -0.330550
11.380000 -0.647220
11.620000 -0.820330
11.880000 -1.158740
12.120000 -1.252790
12.380000 -1.527970
12.620000 -1.545920
12.880000 -1.508770
13.120000 -1.735320
13.380000 -1.412350
13.620000 -1.559730
13.880000 -1.345250
14.120000 -1.479400
14.380000 -1.219960
14.620000 -1.827800
14.880000 -1.825760
