0.05000 158825.21035
0.15000 155886.56577
0.25000 94160.88078
0.35000 64282.69669
0.45000 48763.19706
0.55000 37989.08861
0.65000 31284.14803
0.75000 26329.46415
0.85000 22253.73901
0.95000 19875.03804
1.05000 17253.97223
1.15000 15383.36810
1.25000 13911.17932
1.35000 12793.80566
1.45000 11593.90454
1.55000 10712.12031
1.65000 9987.72229
1.75000 9203.50481
1.85000 8714.17961
1.95000 8072.10485
2.05000 7677.60058
2.15000 7240.06291
2.25000 6931.43037
2.35000 6478.73984
2.45000 6091.59525
2.55000 5855.20746
2.65000 5531.17224
2.75000 5278.88280
2.85000 4922.64637
2.95000 4631.67254
3.05000 4387.81074
3.15000 4111.08315
3.25000 3860.92110
3.35000 3662.02347
3.45000 3400.68242
3.55000 3240.90254
3.65000 3048.26069
3.75000 2878.42106
3.85000 2769.59650
3.95000 2591.75260
4.05000 2525.26641
4.15000 2376.22967
4.25000 2277.60724
4.35000 2168.91379
4.45000 2108.11638
4.55000 2020.21567
4.65000 1985.91728
4.75000 1904.22344
4.85000 1859.50226
4.95000 1860.77115
5.05000 1755.98195
5.15000 1714.41815
5.25000 1697.41069
5.35000 1655.34768
5.45000 1622.50089
5.55000 1591.05960
5.65000 1526.19238
5.75000 1491.33128
5.85000 1458.25661
5.95000 1417.71186
6.05000 1358.59732
6.15000 1337.54484
6.25000 1297.09294
6.35000 1268.09331
6.45000 1247.11911
6.55000 1221.24124
6.65000 1216.82644
6.75000 1165.74803
6.85000 1123.85023
6.95000 1087.11790
7.05000 1077.78032
7.15000 1034.57681
7.25000 1009.69113
7.35000 955.67044
7.45000 951.00735
7.55000 922.06956
7.65000 913.84281
7.75000 886.29138
7.85000 867.68880
7.95000 863.10290
8.05000 849.84281
8.15000 810.39553
8.25000 782.11656
8.35000 768.25753
8.45000 751.50525
8.55000 734.68630
8.65000 708.36568
8.75000 708.14373
8.85000 684.91610
8.95000 669.59137
9.05000 647.12956
9.15000 639.20324
9.25000 628.06423
9.35000 592.60319
9.45000 608.97570
9.55000 594.44479
9.65000 572.42198
9.75000 576.38174
9.85000 565.24127
9.95000 540.54648
10.05000 521.05037
10.15000 522.31778
10.25000 507.08919
10.35000 503.56652
10.45000 496.46733
10.55000 469.37918
10.65000 449.78201
10.75000 462.95441
10.85000 473.72354
10.95000 447.84194
11.05000 435.96955
11.15000 433.90442
11.25000 422.75201
11.35000 414.73501
11.45000 409.36622
11.55000 401.64452
11.65000 398.81556
11.75000 395.31697
11.85000 384.55816
11.95000 365.72103
12.05000 369.73346
12.15000 358.69619
12.25000 340.81705
12.35000 333.07104
12.45000 335.80692
12.55000 324.74207
12.65000 319.30067
12.75000 301.21302
12.85000 307.36510
12.95000 304.41285
13.05000 287.40357
13.15000 286.21697
13.25000 274.98355
13.35000 277.20023
13.45000 275.67896
13.55000 254.31396
13.65000 248.41003
13.75000 237.06321
13.85000 237.80971
13.95000 234.10385
14.05000 229.97717
14.15000 234.71762
14.25000 218.39033
14.35000 230.19673
14.45000 209.94777
14.55000 204.20993
14.65000 196.29469
14.75000 264.42902
14.85000 194.36178
14.95000 190.79391
15.05000 186.15971
15.15000 183.11324
15.25000 184.61192
15.35000 174.67331
15.45000 177.22678
15.55000 170.64169
15.65000 180.80302
15.75000 170.87816
15.85000 158.16648
15.95000 159.00844
16.05000 150.52375
16.15000 152.84610
16.25000 149.80838
16.35000 144.68953
16.45000 142.87619
16.55000 141.21917
16.65000 140.83521
16.75000 149.05294
16.85000 138.15984
16.95000 128.62131
17.05000 145.11471
17.15000 122.72580
17.25000 128.40121
17.35000 129.05559
17.45000 130.70271
17.55000 146.01009
17.65000 120.14070
17.75000 119.20945
17.85000 129.82371
17.95000 121.02448
18.05000 119.07754
18.15000 114.66774
18.25000 116.33098
18.35000 113.96435
18.45000 109.63262
18.55000 108.79535
18.65000 104.16339
18.75000 112.89951
18.85000 107.92009
18.95000 112.78717
19.05000 103.24667
19.15000 105.23993
19.25000 102.23454
19.35000 109.86906
19.45000 110.86044
19.55000 96.03294
19.65000 92.82650
19.75000 97.92961
19.85000 95.80435
19.95000 97.55158
