0.26 1.44237 136.00872 0.04601
0.51 1.40678 130.49134 0.04503
0.77 1.56651 130.76917 0.04061
1.02 1.36101 113.71271 0.03873
1.28 1.578 116.45113 0.03398
1.54 1.46357 108.54083 0.0327
1.79 1.50019 107.04762 0.03045
2.05 1.47837 103.68408 0.02904
2.31 1.53331 104.16578 0.02697
2.56 1.34522 91.22029 0.02667
2.82 1.55924 97.79777 0.02419
3.08 1.37231 85.97767 0.02345
3.33 1.48812 90.74802 0.02265
3.59 1.41598 83.53872 0.02119
3.84 1.46307 80.27033 0.0194
4.1 1.53591 79.72448 0.01779
4.36 1.48009 73.63968 0.01638
4.61 1.62676 75.48687 0.01505
4.87 1.52088 69.06724 0.01443
5.12 1.67837 70.94361 0.01291
5.38 1.64298 67.5339 0.0122
5.64 1.54615 61.48463 0.0116
5.89 1.84735 68.21567 0.0107
6.15 1.69829 59.72202 0.00987
6.41 1.63355 57.28258 0.00959
6.66 1.89707 61.77923 0.00893
6.92 1.72571 53.82122 0.0082
7.17 1.90288 57.49032 0.00786
7.43 1.80717 53.25451 0.00749
7.69 1.85285 50.63555 0.0068
7.94 1.9426 52.52186 0.00648
8.2 1.84026 48.57256 0.00619
8.46 1.9065 47.97946 0.00577
8.71 2.01517 48.77262 0.00557
8.97 2.12052 46.70356 0.00487
9.22 2.06417 44.29452 0.00472
9.48 2.12328 44.5849 0.00443
9.74 2.2668 43.83462 0.00404
9.99 2.1435 42.24695 0.00396
