0.05000 -4965.11864 956.11926 -1391.66996 5052.15608 4331.22377 4979.51343
0.15000 -7365.01832 -16.38390 128.48014 5135.58031 4236.99593 7846.53489
0.25000 -9945.99902 22.00536 303.55478 4661.23505 3965.14528 9813.41218
0.35000 -10671.60784 57.78012 -28.73587 4274.63527 3114.87957 10621.97899
0.45000 -11183.52474 -14.75507 241.28919 3807.91935 2521.38451 10807.85144
0.55000 -10997.19176 5.43829 -151.82618 3686.53287 2498.76562 10784.61707
0.65000 -10848.10096 42.06083 -14.27890 3317.68601 2203.17442 10398.43273
0.75000 -10534.11803 58.68644 -24.29301 3011.64958 2082.14794 10019.18697
0.85000 -10315.88381 54.24235 79.65649 2940.25449 2025.55857 9532.62355
0.95000 -10133.79593 33.92269 -112.81073 2807.46491 1911.02900 9142.27343
1.05000 -9916.13482 102.12498 65.72363 2617.79651 1917.41248 8695.32895
1.15000 -9647.94321 55.92991 87.70744 2413.13157 1742.48598 8547.60686
1.25000 -9460.35655 101.97334 -171.88912 2229.35444 1681.09373 8061.28501
1.35000 -9367.60990 36.41778 -147.78666 2104.58747 1698.41730 7737.93162
1.45000 -9251.28883 52.01750 80.81987 1898.49519 1574.28369 7276.17773
1.55000 -9028.10348 52.79904 172.02743 1874.91957 1490.05013 7065.78656
1.65000 -8889.51058 57.26133 -7.48403 1761.70638 1644.37736 6785.06500
1.75000 -8757.71525 62.89430 95.18415 1659.42757 1479.58429 6489.00211
1.85000 -8634.06740 24.60746 3.27153 1477.45565 1377.43520 6264.60343
1.95000 -8529.52235 59.36377 24.58588 1464.49411 1351.49972 6030.22582
2.05000 -8474.00025 42.95750 17.60172 1358.64327 1275.48937 5831.19148
2.15000 -8415.75880 65.32459 63.64141 1400.34680 1285.02269 5626.69207
2.25000 -8330.93652 13.32355 55.11671 1209.45420 1173.43803 5368.63384
2.35000 -8258.67339 53.60324 43.24232 1139.49118 1167.39187 5179.83932
2.45000 -8162.08710 65.84334 68.00920 1162.75493 1063.26726 5017.78887
2.55000 -8089.97337 53.92581 112.55586 1105.37978 1013.17032 4874.36747
2.65000 -8040.28981 51.28667 -8.18354 1044.38735 1019.87970 4645.08216
2.75000 -7970.90119 42.58577 8.76863 1014.90799 959.21885 4525.32428
2.85000 -7886.10533 40.79787 101.72982 959.63240 903.94318 4467.09481
2.95000 -7822.00762 30.42990 24.72861 1028.07182 863.77386 4260.16256
3.05000 -7741.92425 23.19409 46.54126 883.97768 782.76645 4146.14636
3.15000 -7675.48207 23.41386 131.67958 969.75183 899.00651 4035.76991
3.25000 -7638.43457 42.41863 76.50578 839.42696 736.21025 3883.33530
3.35000 -7574.42631 15.78183 162.34604 913.40533 975.20142 3764.81500
3.45000 -7534.94216 18.98735 88.71760 760.12389 696.47106 3647.67337
3.55000 -7462.50878 16.58869 49.56219 772.71154 719.46039 3557.29590
3.65000 -7398.09180 3.83143 25.77155 791.66433 656.76385 3529.07910
3.75000 -7332.92907 23.69818 84.48489 729.76115 610.21406 3409.88057
3.85000 -7290.58732 11.03709 52.66774 687.59878 592.85165 3302.93245
3.95000 -7245.03370 7.68384 -36.96437 626.88974 610.27877 3223.81327
4.05000 -7198.52172 12.38571 53.51511 646.05322 558.50845 3104.58258
4.15000 -7144.63253 21.54972 70.15256 648.83324 511.58548 3078.67375
4.25000 -7101.25356 17.01882 -44.49479 678.81497 554.51210 2968.59496
4.35000 -7054.36004 11.13718 31.78072 636.41463 569.26188 2906.63577
4.45000 -7002.66678 11.77079 7.63247 582.53455 508.02083 2821.79351
4.55000 -6948.92606 20.49164 34.56179 561.78394 513.62040 2758.57065
4.65000 -6893.39045 15.66694 20.53003 609.61684 461.40359 2679.95304
4.75000 -6847.91224 23.00749 5.88008 620.95728 472.16984 2626.73367
4.85000 -6792.28063 12.01981 17.99800 551.37227 457.84062 2583.36458
4.95000 -6745.35615 24.41017 -30.02349 555.88987 449.92518 2472.60191
5.05000 -6687.72380 18.62232 -6.97514 551.81291 465.51138 2438.34681
5.15000 -6627.93236 24.90257 5.64475 503.49901 468.60332 2378.35025
5.25000 -6585.26773 15.71304 -47.50478 480.52048 387.09531 2332.11518
5.35000 -6543.07392 16.64836 -6.87316 456.89119 403.78500 2270.01956
5.45000 -6485.91331 19.20025 5.18485 497.66214 376.13358 2222.35517
5.55000 -6435.24360 11.83982 -27.94470 546.93913 552.10942 2193.90062
5.65000 -6391.45340 25.83646 -7.39245 491.32883 403.10553 2098.81995
5.75000 -6352.95665 12.62480 -53.85740 502.68901 430.81388 2086.56125
5.85000 -6310.16294 16.54439 22.31018 468.17934 384.13202 2041.56528
5.95000 -6267.67230 21.12247 -55.09343 470.81232 344.59294 1982.87783
6.05000 -6209.77293 16.84949 -3.99314 441.86071 315.66297 1965.11141
6.15000 -6168.50938 21.48257 -2.46290 391.72502 304.71975 1885.32884
6.25000 -6118.91197 16.69158 -22.59721 446.91495 363.78418 1888.02086
6.35000 -6080.21144 15.26672 -22.21229 429.74062 318.72198 1817.35601
6.45000 -6029.51467 13.75833 -47.92632 401.70603 310.02481 1805.52233
6.55000 -5987.49315 21.89919 -18.24580 560.95877 597.24239 1780.89007
6.65000 -5944.58785 19.81412 -11.65088 435.96881 405.84170 1730.99318
6.75000 -5907.81653 17.63633 -52.09734 380.59417 287.21087 1641.83447
6.85000 -5855.69527 13.57982 -63.91111 519.15283 320.99084 1636.93995
6.95000 -5812.14152 14.02413 -3.72903 408.84889 261.96228 1566.75489
7.05000 -5765.48732 7.56782 -22.48632 342.76197 310.38370 1578.17425
7.15000 -5712.93601 19.11736 -54.27916 301.30352 300.64876 1578.02405
7.25000 -5668.37808 19.26449 -42.38863 340.72259 308.39746 1494.96852
7.35000 -5627.79679 9.89468 2.45246 461.86024 306.41899 1487.30276
7.45000 -5585.31426 7.95550 -4.36292 294.25659 351.67748 1428.82496
7.55000 -5532.28516 12.35283 -5.45519 376.65985 331.19394 1416.86813
7.65000 -5499.50025 13.93762 -19.62010 360.49402 286.90540 1385.28437
7.75000 -5439.83958 13.68591 -44.46866 352.01831 237.68395 1361.88785
7.85000 -5404.47029 9.26846 -33.91231 279.90157 231.35170 1316.45639
7.95000 -5368.28798 11.36291 7.89946 290.19386 226.63474 1299.51373
8.05000 -5333.52813 17.91331 -19.83008 287.59505 269.77422 1249.11466
8.15000 -5290.47950 9.27940 -31.22130 361.62271 217.98860 1256.24714
8.25000 -5235.60026 11.46698 -31.08561 245.28320 202.09034 1212.59781
8.35000 -5194.25776 11.40080 -20.57065 273.05688 215.48376 1176.08144
8.45000 -5154.81982 12.21325 -13.64276 256.48969 239.57623 1150.20190
8.55000 -5120.62879 12.53067 -3.97146 314.72691 259.96801 1137.15971
8.65000 -5078.80299 12.19195 0.85426 282.00419 263.24775 1149.30387
8.75000 -5037.50802 8.00771 -19.37042 253.61902 202.04787 1117.66841
8.85000 -4998.92679 10.52871 -18.44310 250.75885 274.72568 1074.68432
8.95000 -4965.36881 16.07632 -30.45706 250.16866 229.86109 1053.32547
9.05000 -4926.42070 12.30230 -9.24228 240.55511 197.21545 1037.35507
9.15000 -4892.35779 7.88165 -8.60436 253.93856 236.50568 1015.74316
9.25000 -4860.48211 8.12317 -26.91416 245.89739 248.22606 1008.22959
9.35000 -4826.31908 9.25159 -17.41832 309.37701 281.34699 980.05807
9.45000 -4781.24530 16.41119 -6.19062 250.22487 219.25165 972.22533
9.55000 -4754.30692 13.34310 -10.66004 267.87937 177.36956 937.60171
9.65000 -4713.19181 10.85740 -15.74166 200.24007 181.55647 921.53849
9.75000 -4679.06254 8.91529 -33.88908 212.02235 229.27122 894.12284
9.85000 -4646.91474 14.80041 -0.54334 320.09828 186.21678 898.66255
9.95000 -4606.79709 12.37014 -35.95656 218.24712 141.77503 859.19943
10.05000 -4583.09985 11.91959 -23.99365 214.89862 190.33189 828.37184
10.15000 -4550.55552 10.71743 -33.21125 298.95102 201.87219 841.88711
10.25000 -4520.40305 5.86047 -34.05697 299.17500 276.28325 805.37804
10.35000 -4486.35747 14.81998 -15.36999 194.91409 254.05853 827.90236
10.45000 -4450.77958 10.91401 -5.23086 167.36823 135.13411 789.71323
10.55000 -4414.49286 10.92475 -38.28150 221.94689 201.72884 763.10629
10.65000 -4383.00092 11.24079 -24.55258 288.59332 187.09544 754.91329
10.75000 -4357.61773 11.57613 -17.47336 221.86582 186.25454 755.26338
10.85000 -4320.87445 10.62485 -7.04167 174.18477 143.42059 704.45974
10.95000 -4291.00176 15.64919 -13.69468 171.09113 141.02847 708.08174
11.05000 -4261.59098 15.24474 -19.78802 162.71451 259.03596 705.35765
11.15000 -4236.54142 11.78352 -9.93291 258.88916 147.75267 676.65194
11.25000 -4199.18328 13.05963 -28.15117 165.19001 145.88862 661.72183
11.35000 -4172.70571 14.14599 -27.47431 163.99210 115.53045 649.70755
11.45000 -4143.26522 10.31450 -38.11711 379.45141 342.78432 662.64947
11.55000 -4110.09446 8.67825 -23.28790 197.81646 184.44531 646.58241
11.65000 -4077.49404 15.85770 -32.45197 215.99476 263.68218 618.94210
11.75000 -4043.65608 9.86994 -3.20464 186.75651 146.90648 606.33149
11.85000 -4022.17359 13.99045 -46.52504 147.27908 151.19971 577.64225
11.95000 -3985.45611 14.11103 -35.89296 146.04215 94.85343 604.58342
12.05000 -3955.64031 15.53992 -7.12326 198.26182 173.61020 609.03199
12.15000 -3933.63731 14.75867 -18.11036 215.25409 164.92288 576.62696
12.25000 -3901.26221 12.75482 -40.03365 218.26016 120.22987 622.09858
12.35000 -3874.28620 10.46247 -59.34750 126.25515 90.40793 531.33713
12.45000 -3844.02927 8.53692 -36.58672 162.61239 103.05006 532.82312
12.55000 -3818.51998 9.57751 -17.52207 148.90688 110.99037 509.79515
12.65000 -3791.39320 13.17264 -43.81070 121.26020 100.92423 499.75563
12.75000 -3772.10685 8.37484 -37.92784 108.71946 190.32255 488.60169
12.85000 -3736.73556 10.93477 -35.52308 120.34722 119.69099 497.64724
12.95000 -3715.30365 7.95975 -28.61583 158.16645 131.14143 499.17905
13.05000 -3688.02851 11.10874 -5.20481 121.31942 112.39157 466.75169
13.15000 -3665.78164 13.83444 -30.16636 198.74211 112.04938 479.21617
13.25000 -3636.81530 8.50348 -26.55656 153.17144 125.41572 464.12806
13.35000 -3613.06505 9.30984 -28.06890 109.45615 108.80689 440.14347
13.45000 -3584.79134 12.19948 -17.64761 141.10889 104.36419 436.09618
13.55000 -3559.03164 10.30451 -29.80312 113.27153 88.80769 415.87654
13.65000 -3528.57716 12.59350 -9.48859 172.56897 142.67422 425.57522
13.75000 -3504.57656 13.11022 -16.37164 118.48276 117.99385 407.43926
13.85000 -3477.38244 10.39025 -22.06474 87.01907 86.28914 396.96789
13.95000 -3453.50492 11.22041 -8.21725 81.34754 77.48491 401.01334
14.05000 -3427.56950 8.27349 -15.73581 113.39052 89.97985 424.56702
14.15000 -3407.12063 9.83199 -4.47300 77.43191 74.01895 374.57332
14.25000 -3384.07267 7.70222 2.06429 128.80878 203.68185 388.74778
14.35000 -3358.16069 10.25393 3.20409 108.63656 76.63653 361.40413
14.45000 -3333.39800 9.16324 -6.61771 98.47212 98.18895 371.59930
14.55000 -3309.69951 11.25510 6.74809 86.61303 93.81492 346.95896
14.65000 -3290.92764 7.23544 2.17089 96.01317 100.14992 367.34224
14.75000 -3267.21178 6.74308 2.97710 147.21198 121.62957 382.63597
14.85000 -3242.76223 8.09651 6.48152 106.14035 107.06561 335.73822
14.95000 -3220.27821 8.02898 5.58508 82.55063 71.76908 332.11793
15.05000 -3197.74544 10.61919 -16.22747 77.47398 64.16939 329.89858
15.15000 -3175.61271 6.88847 0.49378 77.50107 104.35274 322.15385
15.25000 -3153.26634 10.17085 -14.92964 81.95178 65.85400 319.79103
15.35000 -3130.66391 8.94362 -9.23767 68.15159 59.46208 313.32249
15.45000 -3109.68595 6.86857 -6.62510 106.98239 93.21326 301.23276
15.55000 -3091.99528 8.13087 8.33677 68.67439 61.88662 289.12735
15.65000 -3069.80959 8.36319 -15.13930 90.72861 76.95484 293.35265
15.75000 -3049.90606 9.38454 -17.75019 76.42286 57.74472 284.47924
15.85000 -3033.72604 11.91553 -21.67135 137.22305 79.14267 284.22326
15.95000 -3008.28406 6.79442 -15.22061 55.80292 67.62661 274.94160
16.05000 -2989.39215 4.53885 -15.95176 56.41027 81.50835 271.33028
16.15000 -2965.64848 7.19370 -20.88196 104.64313 139.96843 279.61297
16.25000 -2945.55764 6.94880 -33.61458 80.56602 102.35329 263.50227
16.35000 -2930.70643 6.68296 -43.36078 76.16957 54.90460 244.52333
16.45000 -2912.47263 6.76896 -37.62390 76.47396 60.93234 268.43381
16.55000 -2894.85572 1.04207 -49.41049 99.51299 83.37054 272.14276
16.65000 -2873.89920 7.22203 -38.84520 52.84518 53.65098 242.06391
16.75000 -2853.09787 6.57485 -42.92322 59.39837 52.72296 244.62960
16.85000 -2833.12675 5.56844 -41.23982 80.01429 70.22587 228.76805
16.95000 -2813.46465 6.47962 -38.72986 132.85909 65.41524 234.63330
17.05000 -2801.62770 2.20354 -38.14143 139.63220 121.21607 243.12242
17.15000 -2780.23542 6.55026 -39.38645 60.62372 126.52329 229.34548
17.25000 -2762.88486 7.05316 -43.08681 92.72033 92.33693 237.09665
17.35000 -2744.60850 4.87538 -37.50041 76.45346 55.80882 218.71999
17.45000 -2727.77486 4.93487 -57.56253 53.78564 50.82213 217.99721
17.55000 -2711.36815 5.24809 -38.90003 97.33895 82.40569 232.87802
17.65000 -2693.26724 2.35561 -50.15068 49.62570 50.02204 210.72538
17.75000 -2676.61663 6.25271 -44.32635 54.31160 58.58855 204.07465
17.85000 -2661.00405 3.29847 -49.38245 63.83874 66.97670 202.79803
17.95000 -2643.12576 5.11879 -37.55447 52.60469 60.57810 197.88145
18.05000 -2624.76884 4.87059 -35.81026 63.03585 71.88156 226.04000
18.15000 -2606.58409 2.38681 -35.58707 134.09052 129.45201 210.90922
18.25000 -2594.15236 7.01736 -40.63108 45.55952 43.30447 183.86813
18.35000 -2578.08351 6.68336 -32.65002 54.15491 42.57349 194.74431
18.45000 -2564.44794 3.47973 -35.89683 47.13547 88.75466 185.71276
18.55000 -2547.39164 6.38027 -37.66926 45.72337 52.10232 178.86196
18.65000 -2532.53428 4.54421 -28.59883 59.87614 103.89673 186.17771
18.75000 -2513.84694 2.95014 -29.19320 82.79811 69.59090 182.63533
18.85000 -2501.66157 6.03122 -18.84161 44.27960 42.80564 167.31542
18.95000 -2490.50904 4.57335 -24.26926 73.42297 55.18744 166.86010
19.05000 -2472.79889 5.94565 -19.86100 40.90474 40.02695 164.49080
19.15000 -2467.58478 -0.92358 -11.86400 221.72813 196.70811 267.40318
19.25000 -2445.63371 3.95303 -30.68430 35.46806 45.98189 156.12802
19.35000 -2430.45364 4.71975 -23.97972 37.55696 44.69615 164.75332
19.45000 -2402.47836 11.60041 -13.22877 139.55397 156.99710 158.25115
19.55000 -2402.33671 10.09039 -17.27933 49.92912 62.03622 149.61294
19.65000 -2388.14993 4.54259 -24.34667 50.52879 38.87262 152.86420
19.75000 -2374.15878 3.44823 -22.04154 34.72050 52.28816 154.28310
19.85000 -2357.90600 5.46083 -22.06986 41.13590 49.89789 156.33095
19.95000 -2345.13844 4.73517 -12.35711 34.42712 27.44354 148.02204
