0.05000 1931.34997
0.15000 2569.25893
0.25000 3609.25173
0.35000 4219.41073
0.45000 4739.62575
0.55000 5236.81532
0.65000 5607.87934
0.75000 5728.30549
0.85000 5716.77183
0.95000 5759.93813
1.05000 5707.23421
1.15000 5629.49559
1.25000 5540.83863
1.35000 5391.31569
1.45000 5300.56597
1.55000 5145.18078
1.65000 5050.42934
1.75000 4861.35326
1.85000 4783.05845
1.95000 4629.66345
2.05000 4550.74600
2.15000 4373.96664
2.25000 4240.78926
2.35000 4104.83877
2.45000 4008.25043
2.55000 3863.50674
2.65000 3827.79802
2.75000 3694.83170
2.85000 3545.76501
2.95000 3468.11336
3.05000 3360.92533
3.15000 3260.48637
3.25000 3172.69760
3.35000 3077.96576
3.45000 2970.33596
3.55000 2885.34820
3.65000 2844.70835
3.75000 2734.37719
3.85000 2678.09313
3.95000 2604.04422
4.05000 2515.17653
4.15000 2469.77562
4.25000 2381.28851
4.35000 2326.92002
4.45000 2263.41969
4.55000 2212.95860
4.65000 2164.78567
4.75000 2112.53695
4.85000 2051.04875
4.95000 2030.53237
5.05000 1949.85715
5.15000 1923.86447
5.25000 1863.24480
5.35000 1810.01867
5.45000 1758.10378
5.55000 1704.01783
5.65000 1699.47803
5.75000 1611.41314
5.85000 1599.13084
5.95000 1541.85488
6.05000 1547.89523
6.15000 1457.79510
6.25000 1451.15045
6.35000 1410.06726
6.45000 1350.51137
6.55000 1343.40826
6.65000 1313.23728
6.75000 1272.42675
6.85000 1249.76679
6.95000 1222.84528
7.05000 1195.82210
7.15000 1161.38265
7.25000 1134.19146
7.35000 1107.78542
7.45000 1074.12978
7.55000 1070.11162
7.65000 1017.36968
7.75000 999.53915
7.85000 982.64449
7.95000 953.57239
8.05000 948.75428
8.15000 902.85108
8.25000 895.37936
8.35000 869.30217
8.45000 859.38668
8.55000 832.21288
8.65000 825.85774
8.75000 795.81588
8.85000 782.27085
8.95000 761.47753
9.05000 744.89114
9.15000 728.09050
9.25000 708.84393
9.35000 707.14190
9.45000 674.42848
9.55000 661.71451
9.65000 664.21748
9.75000 642.81838
9.85000 625.06819
9.95000 604.92212
10.05000 593.14778
10.15000 575.15115
10.25000 570.59656
10.35000 556.21566
10.45000 539.70752
10.55000 528.58858
10.65000 524.13968
10.75000 507.07680
10.85000 499.77853
10.95000 485.37022
11.05000 463.83347
11.15000 453.13467
11.25000 451.86952
11.35000 443.78354
11.45000 426.64761
11.55000 425.03233
11.65000 421.13389
11.75000 402.80590
11.85000 394.55320
11.95000 387.81413
12.05000 381.15400
12.15000 366.46484
12.25000 373.87552
12.35000 353.56545
12.45000 351.93851
12.55000 345.81590
12.65000 332.07883
12.75000 337.25352
12.85000 329.33623
12.95000 321.22922
13.05000 308.53326
13.15000 304.00654
13.25000 304.98562
13.35000 295.96138
13.45000 278.79282
13.55000 278.40316
13.65000 269.42738
13.75000 260.21634
13.85000 262.40128
13.95000 261.05690
14.05000 251.79621
14.15000 248.93432
14.25000 241.05603
14.35000 245.66474
14.45000 229.57251
14.55000 230.15180
14.65000 225.13904
14.75000 219.78376
14.85000 211.75187
14.95000 215.84094
15.05000 207.04909
15.15000 206.12126
15.25000 200.49436
15.35000 189.39740
15.45000 189.19097
15.55000 192.67035
15.65000 179.13726
15.75000 177.14360
15.85000 179.88213
15.95000 170.92697
16.05000 175.22845
16.15000 169.26068
16.25000 169.18953
16.35000 171.68824
16.45000 157.50627
16.55000 161.59599
16.65000 151.58474
16.75000 147.33654
16.85000 148.37220
16.95000 148.79889
17.05000 139.80761
17.15000 138.20933
17.25000 143.85590
17.35000 137.89548
17.45000 130.03654
17.55000 134.10881
17.65000 129.41602
17.75000 123.65835
17.85000 119.98408
17.95000 121.64378
18.05000 116.67847
18.15000 114.46190
18.25000 114.22524
18.35000 113.41558
18.45000 110.79078
18.55000 103.21910
18.65000 100.88929
18.75000 107.58438
18.85000 98.66207
18.95000 105.04439
19.05000 106.19829
19.15000 102.56115
19.25000 96.01898
19.35000 93.61847
19.45000 91.90902
19.55000 100.87053
19.65000 95.96307
19.75000 93.10917
19.85000 97.48770
19.95000 88.06335
