0.05000 -4156.75362 381.63271 92531.55831 4969.53871 4850.19113 1248384.00252
0.15000 -8364.93949 -321.11271 -120274.97597 4467.24769 5036.59032 1666258.25930
0.25000 -12492.83485 203.02456 -27848.50669 4207.83033 5177.01291 1400775.38751
0.35000 -15192.30648 -38.95847 10308.03384 3680.89908 5102.87078 1437825.89410
0.45000 -17339.35851 -71.72208 -12879.72185 3423.86667 4891.82448 1333960.25328
0.55000 -18681.63549 -159.20108 4345.85837 3174.29995 4777.96611 1268285.91689
0.65000 -19275.10658 1.54676 -12201.88660 3061.52546 4707.40954 1165905.85592
0.75000 -19570.92181 -72.27832 4011.38277 2711.05406 4570.05043 1081283.14955
0.85000 -19576.78722 -133.47476 12447.23500 2425.27998 4468.70512 1057108.72209
0.95000 -19241.99208 -33.25436 4345.49785 2200.87545 4360.19800 958535.29481
1.05000 -18741.74070 -23.34591 12699.41388 1963.98925 4253.85811 909730.62899
1.15000 -18231.39372 -26.77215 8950.49238 1729.03641 4105.69914 854862.56523
1.25000 -17716.98457 -90.83401 4304.62092 1527.51179 3980.30963 825243.24214
1.35000 -17213.40935 -43.39144 -3150.92530 1320.96487 3839.46243 763264.71396
1.45000 -16717.49107 -91.25490 -3045.20447 1165.37976 3705.35733 715348.41501
1.55000 -16232.71860 22.70682 1166.80442 1057.59700 3633.19475 688187.72601
1.65000 -15742.52913 -45.59821 3101.61320 939.74816 3464.92255 634201.98070
1.75000 -15288.92100 -12.20482 12281.39117 815.17572 3353.17080 598325.32360
1.85000 -14840.02246 -7.06543 1916.60637 739.30140 3247.98790 545789.73932
1.95000 -14400.35645 -6.93820 -1298.36403 670.79715 3096.16302 537925.53470
2.05000 -13998.62501 -43.30299 3892.99014 603.56992 2980.49080 500808.95401
2.15000 -13614.50960 27.92702 -8203.40548 559.17429 2864.06590 505201.10417
2.25000 -13253.35487 -39.81573 2830.33857 536.84550 2787.65288 443700.40000
2.35000 -12893.95737 2.15605 6771.88469 499.94065 2643.83297 437907.60921
2.45000 -12558.51885 -43.19837 -2731.71160 495.51363 2513.80703 426118.12152
2.55000 -12229.73679 -68.59803 -2191.14862 487.80713 2424.75191 404030.80253
2.65000 -11906.49272 -23.85079 -5437.80143 469.30410 2349.41290 366983.14469
2.75000 -11599.96875 -1.73175 -2067.75637 479.97072 2268.99356 374362.25435
2.85000 -11334.83093 9.63258 1835.39091 473.92285 2185.28969 330543.87225
2.95000 -11060.53134 -35.27882 -3585.48609 488.06983 2118.31999 324061.06813
3.05000 -10802.36106 -0.36241 3842.20108 470.58839 2013.99975 293494.92562
3.15000 -10551.65753 22.69652 4499.95332 487.92237 1942.43821 290105.67667
3.25000 -10336.85080 7.82825 -3235.10095 482.44319 1875.95320 282698.88307
3.35000 -10135.13248 6.13755 1375.21327 492.54066 1808.67979 256296.31171
3.45000 -9923.50418 24.43933 -84.22711 500.26922 1742.67794 246498.38253
3.55000 -9754.13161 13.13241 -1179.23777 514.36678 1674.01509 236395.48631
3.65000 -9567.72503 10.42388 108.04682 535.57767 1611.38028 222314.49399
3.75000 -9393.91740 47.20634 572.00297 538.32818 1543.67308 220801.35750
3.85000 -9199.35350 32.90302 -542.01074 528.83561 1485.20243 212525.65955
3.95000 -9034.61900 57.08986 -2912.76458 536.37602 1428.77169 191768.25611
4.05000 -8857.74412 20.61232 -1289.85333 540.50176 1358.59592 194518.34241
4.15000 -8693.81834 51.35521 484.07792 538.03681 1310.15907 183844.01632
4.25000 -8520.47729 45.01714 -512.61401 531.85784 1261.13288 172144.26064
4.35000 -8353.06198 78.77476 -874.65096 527.19131 1227.74461 164975.73720
4.45000 -8202.72801 38.72713 -796.47841 511.50415 1158.46293 162429.07604
4.55000 -8067.98334 88.16755 -414.31189 512.01167 1123.11088 150369.49666
4.65000 -7903.29214 60.95240 -871.01678 513.41645 1065.13138 154305.00804
4.75000 -7769.44457 28.65157 -1208.90880 511.91048 1026.55118 150157.09605
4.85000 -7620.65004 66.71925 -1180.68272 527.32226 985.02581 139665.74215
4.95000 -7478.56312 74.29152 -2996.66506 511.01526 955.99475 133197.25863
5.05000 -7357.83644 58.73004 -2157.60984 501.69784 924.40267 145313.83833
5.15000 -7205.14805 45.22675 49.33001 515.22279 871.72578 131988.04098
5.25000 -7068.89194 50.31140 -3121.76455 511.08811 838.91114 129250.97798
5.35000 -6944.67223 27.67909 -17.25437 504.81299 820.45705 123004.25345
5.45000 -6809.68440 18.90228 -568.93986 492.55508 776.16957 129371.55333
5.55000 -6684.07011 7.94121 591.68745 479.22056 751.00789 111548.82916
5.65000 -6567.34124 11.27120 -4.99275 466.63522 731.37115 110515.65257
5.75000 -6460.95752 23.37932 -3257.05813 444.83931 698.00908 108852.83311
5.85000 -6326.17113 21.47257 -2393.84235 438.69590 674.13191 110323.06483
5.95000 -6225.78941 35.97706 -4447.43322 443.08555 657.36000 104702.38315
6.05000 -6145.63082 8.47783 -4111.87677 426.72405 647.01982 95442.05435
6.15000 -6042.66050 14.61011 -3494.54204 411.44674 621.82723 96970.36855
6.25000 -5951.01605 12.53490 273.81654 404.14843 606.30951 87773.70912
6.35000 -5874.89063 23.30591 -949.02821 405.63124 587.81265 77294.43563
6.45000 -5791.30907 7.47341 1540.86363 398.12372 564.28183 76923.84819
6.55000 -5713.68585 -10.19659 -3223.87973 397.60422 547.68230 72223.33009
6.65000 -5638.00641 -3.76800 -3186.98196 386.74888 540.27320 68637.63671
6.75000 -5562.41694 3.50678 -940.63535 383.25061 519.17797 64278.60981
6.85000 -5495.84362 -11.69422 -1958.45877 379.01422 509.47976 62941.40733
6.95000 -5438.21366 2.29959 -541.12136 378.05591 499.04594 52936.18853
7.05000 -5391.73871 4.50437 -1329.90027 370.37829 490.10347 56615.65070
7.15000 -5344.07435 -2.78257 -1314.09355 377.18778 479.02349 50170.58795
7.25000 -5290.72097 8.28348 -664.04826 379.25467 458.44242 48795.45326
7.35000 -5260.20833 4.51911 297.50973 377.73375 452.71297 41964.55208
7.45000 -5226.16710 2.72522 -237.10565 381.92994 445.12764 45674.02880
7.55000 -5196.77094 -6.24364 220.38818 392.01530 430.52112 38348.44022
7.65000 -5159.52281 16.75743 -276.88259 393.21186 416.77326 35746.01401
7.75000 -5126.30052 11.59659 406.61731 407.91826 405.76531 31959.58866
7.85000 -5090.85455 12.11644 177.08076 413.00720 389.09832 33083.50006
7.95000 -5059.69943 17.09991 -171.81002 424.96714 364.59386 32305.86172
8.05000 -5016.91791 17.79693 518.59451 421.33541 355.40467 35731.52158
8.15000 -4976.12663 30.23521 153.88430 415.51346 336.25094 31930.43597
8.25000 -4935.95407 25.35705 872.52916 417.33351 323.53492 29043.84867
8.35000 -4900.09355 35.70127 210.04861 425.06454 306.59188 25933.72093
8.45000 -4843.57520 25.80102 155.64880 401.11475 297.08073 22573.85491
8.55000 -4788.39238 40.82447 179.60532 397.63782 275.71085 25981.79609
8.65000 -4740.20642 33.91220 600.84721 381.24991 267.85664 23502.52725
8.75000 -4686.76278 35.32410 215.73237 364.35107 253.54400 21660.92600
8.85000 -4634.12396 34.25905 1032.64781 349.97969 237.88268 20890.21807
8.95000 -4589.41969 32.91406 34.91005 331.13377 233.35076 20278.56241
9.05000 -4542.75380 33.10845 633.73724 315.63472 223.63160 20655.05485
9.15000 -4486.74855 36.29954 26.59570 303.13281 214.52940 18229.82654
9.25000 -4449.74343 30.09775 299.55681 291.20330 205.77584 17385.95053
9.35000 -4400.88314 29.17619 -394.18071 275.63261 195.10542 18983.63827
9.45000 -4365.54056 28.55911 -250.70225 263.14829 188.55379 17847.42671
9.55000 -4318.73244 27.34591 -114.07842 247.68277 183.64405 13910.85475
9.65000 -4289.84250 19.17262 467.20614 243.82262 178.62331 15201.81612
9.75000 -4246.07169 22.18175 796.73771 233.97937 170.37517 15184.64053
9.85000 -4213.91289 28.40376 -134.61102 226.22156 164.01878 13009.68307
9.95000 -4177.14180 16.52160 163.23889 223.71647 161.29139 12248.14837
10.05000 -4148.15871 17.65398 -778.85497 218.25174 158.94884 49571.94819
10.15000 -4112.71805 19.91981 -422.05594 207.51658 149.15261 20761.17740
10.25000 -4078.03314 16.57586 -69.51047 203.05997 144.06470 12631.54436
10.35000 -4050.15208 18.35773 102.80238 196.69671 140.12274 11217.49581
10.45000 -4012.61909 13.40942 52.39510 192.72185 140.45624 9771.33592
10.55000 -3985.00307 16.74771 -407.16523 189.83893 140.21153 10399.11525
10.65000 -3953.81906 16.53750 275.47916 176.42827 135.55650 11836.26825
10.75000 -3935.06998 18.02104 408.45358 173.12876 134.04636 9014.55592
10.85000 -3910.45586 15.33564 -50.19848 167.21583 123.84233 8863.40822
10.95000 -3883.75060 16.62575 110.20534 171.79883 127.66330 9109.99968
11.05000 -3858.55371 15.69878 74.62096 159.23895 118.65609 8246.00637
11.15000 -3822.96478 14.36865 70.05081 157.59395 118.05546 7964.58484
11.25000 -3812.86278 15.01471 -76.44041 150.97360 120.49363 7614.00036
11.35000 -3779.23968 13.68127 58.17147 147.73928 119.48809 7294.20333
11.45000 -3762.58534 17.15273 142.25395 136.54880 116.68920 8949.96468
11.55000 -3732.29798 11.52440 425.24783 139.62466 111.46409 8218.08914
11.65000 -3704.72074 15.29921 -39.31176 133.56218 106.76420 8145.89801
11.75000 -3684.10103 13.11435 -134.09445 127.08999 106.19911 7725.87860
11.85000 -3665.91938 10.62309 -139.85480 124.38804 104.85007 6668.66342
11.95000 -3637.87539 10.99701 286.84758 132.35761 103.74377 6421.18282
12.05000 -3616.86163 9.96012 -27.12415 126.80158 100.19251 6173.54157
12.15000 -3591.43205 14.42743 42.57273 123.83972 96.24256 7175.79030
12.25000 -3567.20201 9.86688 142.25959 122.13458 96.11046 6692.72115
12.35000 -3538.88558 10.39238 33.17046 122.68869 105.94732 6023.55159
12.45000 -3515.31178 9.53267 64.40397 117.24740 90.78724 5998.01331
12.55000 -3492.27062 9.33214 49.96502 114.88285 91.89248 5438.57097
12.65000 -3462.80420 11.44652 204.91103 114.29631 94.19535 6651.27396
12.75000 -3438.72574 10.52196 -25.17289 109.12064 85.57833 5253.37531
12.85000 -3409.98026 10.87216 81.48314 112.00608 87.89969 5444.32323
12.95000 -3385.46242 11.28113 268.65345 106.34079 84.60140 5918.97323
13.05000 -3365.74224 13.70808 268.33152 103.45746 92.88232 5021.46755
13.15000 -3339.99609 12.96855 216.74187 98.01479 79.63695 4626.64218
13.25000 -3309.65346 12.27781 321.81055 102.54312 80.70390 5444.97451
13.35000 -3286.89187 8.01200 365.86019 100.65140 81.80252 4626.16231
13.45000 -3262.25043 12.14990 701.24913 103.85797 76.70328 13279.56513
13.55000 -3247.57122 13.60516 418.59330 95.50455 77.51773 4429.46866
13.65000 -3219.34451 13.12641 184.49415 98.11754 73.24232 4880.47496
13.75000 -3193.16467 14.43492 195.96988 105.56028 79.07386 3451.60208
13.85000 -3164.70922 16.35021 -33.12248 100.39022 78.46959 4263.53987
13.95000 -3136.04381 15.98266 123.20924 105.13904 77.36297 3266.69274
14.05000 -3112.21038 13.06086 6.91483 97.15138 80.22008 3559.34192
14.15000 -3090.85215 13.85227 197.79323 89.81913 72.99118 3158.15419
14.25000 -3070.84550 13.01640 81.13138 100.65213 76.30785 3482.18668
14.35000 -3046.90232 14.23513 231.42469 88.25709 81.79483 3720.50204
14.45000 -3021.90160 15.44354 -110.08941 96.15175 71.22852 3551.78299
14.55000 -3002.75246 15.22987 90.61203 89.56006 75.33057 3944.01728
14.65000 -2975.30987 12.06954 157.60739 85.69946 70.20418 3317.11879
14.75000 -2959.15982 13.91377 214.56523 91.69992 73.64643 3145.51089
14.85000 -2936.47234 8.80517 110.70611 86.00081 69.61442 2676.65685
14.95000 -2919.96767 8.59257 -42.52756 80.96956 60.24316 2667.71519
15.05000 -2893.87669 11.13787 284.02749 86.70114 72.67664 3061.47434
15.15000 -2879.55172 8.20194 180.93281 85.05480 58.65095 3165.35557
15.25000 -2857.29918 5.98971 242.20848 77.55790 59.42851 2578.67719
15.35000 -2834.68879 10.24352 246.40069 83.85780 85.51194 3249.60507
15.45000 -2811.53995 9.89160 247.11510 84.15212 62.38861 3373.20767
15.55000 -2797.56299 3.00419 80.48507 100.41756 68.61957 2856.74525
15.65000 -2767.48100 4.79321 80.07437 76.25778 68.26138 2597.06679
15.75000 -2762.21206 6.10022 -192.59324 81.01115 65.87443 2162.94581
15.85000 -2738.03420 1.97964 -107.35901 78.33368 61.47355 5258.12573
15.95000 -2727.17469 4.87144 119.19336 81.41073 75.37693 2610.22805
16.05000 -2705.45981 6.18704 33.53948 72.08296 59.78143 2292.47012
16.15000 -2688.51589 8.87801 72.89101 70.66800 65.29174 1675.01534
16.25000 -2677.58532 6.19259 -24.02912 78.20350 53.33496 2126.08700
16.35000 -2651.84864 1.45069 62.96800 81.68435 57.80488 2909.42470
16.45000 -2640.42804 6.26914 -54.28859 72.36270 58.82552 2322.27213
16.55000 -2619.15877 7.36607 133.48152 81.36120 57.65980 2645.19653
16.65000 -2604.77151 4.84992 -45.08659 80.68915 56.48252 1690.51676
16.75000 -2590.76212 8.44164 22.64896 77.79271 61.22091 1822.37488
16.85000 -2576.97420 4.60826 8.61022 72.99288 52.97637 2449.77148
16.95000 -2551.51911 6.09307 173.81345 78.86189 64.17805 2839.58820
17.05000 -2541.21291 4.17340 48.55675 72.56599 53.53160 1880.97840
17.15000 -2525.52642 5.81571 -47.52967 72.02045 60.09674 1423.23501
17.25000 -2509.66870 8.73017 135.39260 85.23349 70.58185 3241.50891
17.35000 -2497.76277 9.02272 125.09200 69.41190 52.38071 2931.00871
17.45000 -2482.78529 7.04137 35.28874 74.50139 49.94366 2457.10025
17.55000 -2469.55799 3.69977 94.37580 76.71232 73.82507 2180.65577
17.65000 -2457.99009 7.34026 -20.01083 73.72426 56.52471 2114.60242
17.75000 -2440.22326 9.25142 183.84587 85.50084 53.59143 2415.19943
17.85000 -2423.96950 4.55251 112.09972 65.23438 51.29300 1850.56865
17.95000 -2409.11465 10.37944 82.73289 78.65565 56.40770 1689.13841
18.05000 -2392.69477 3.95420 42.32719 74.08435 56.99707 1864.91881
18.15000 -2379.83540 8.59976 179.36696 60.07182 49.92432 2286.31080
18.25000 -2366.55067 10.73002 13.80088 71.57557 69.04506 1391.86834
18.35000 -2347.79249 9.48162 20.44165 67.62225 66.18401 1688.12151
18.45000 -2339.15679 13.12996 50.09719 85.09742 81.18487 1791.88286
18.55000 -2326.47991 9.72661 26.45907 59.49967 51.95235 1525.89534
18.65000 -2317.30053 11.48675 74.51277 59.35142 50.99053 2197.80571
18.75000 -2302.94328 7.00453 134.41305 58.00451 57.97298 1365.61858
18.85000 -2291.75029 9.49882 -9.33970 69.65151 58.28208 1868.85920
18.95000 -2281.89709 12.46837 -43.24147 57.45475 54.54594 1207.03327
19.05000 -2267.10292 6.42793 199.66846 63.85516 57.87022 1492.84911
19.15000 -2260.64342 9.05594 -17.74468 55.90660 47.75847 1374.29199
19.25000 -2246.60783 9.46853 51.02912 65.50287 57.49177 1324.97529
19.35000 -2234.78383 7.45501 152.44091 63.02057 63.55295 1699.84308
19.45000 -2227.93463 6.83120 16.29613 72.60579 51.79053 1386.74750
19.55000 -2209.42791 4.36281 65.23937 66.28189 62.65751 1452.76803
19.65000 -2198.75840 11.65333 133.23704 51.46702 45.62042 1413.46794
19.75000 -2186.18650 7.58562 116.42194 68.50597 69.62235 1200.78447
19.85000 -2175.46741 5.62190 111.94443 53.24297 52.94944 1465.55845
19.95000 -2169.46924 3.86134 23.39015 62.10344 56.24744 1806.14868
