0.12500 0.18507
0.37500 0.13599
0.62500 0.06988
0.87500 0.05936
1.12500 0.06144
1.37500 0.08959
1.62500 0.11009
1.87500 0.13664
2.12500 0.16244
2.37500 0.17022
2.62500 0.15225
2.87500 0.14695
3.12500 0.13228
3.37500 0.12514
3.62500 0.10345
3.87500 0.08437
4.12500 0.07237
4.37500 0.07285
4.62500 0.04549
4.87500 0.05757
5.12500 0.04149
5.37500 0.03557
5.62500 0.04279
5.87500 0.04498
6.12500 0.05202
6.37500 0.06419
6.62500 0.06879
6.87500 0.06142
7.12500 0.07911
7.37500 0.08521
7.62500 0.08511
7.87500 0.08792
8.12500 0.06423
8.37500 0.06538
8.62500 0.05149
8.87500 0.03719
9.12500 0.03194
9.37500 0.02896
9.62500 0.00409
9.87500 0.01986
10.12500 0.00566
10.37500 0.01120
10.62500 0.00326
10.87500 0.00958
11.12500 0.01139
11.37500 0.03867
11.62500 0.02430
11.87500 0.03020
12.12500 0.01830
12.37500 0.03523
12.62500 0.03072
12.87500 0.03585
13.12500 0.02752
13.37500 0.04489
13.62500 0.05027
13.87500 0.03917
14.12500 0.04345
14.37500 0.06409
14.62500 0.06826
14.87500 0.07448
