0.12500 0.01780
0.37500 0.03276
0.62500 0.10946
0.87500 0.17283
1.12500 0.22783
1.37500 0.29971
1.62500 0.36956
1.87500 0.42388
2.12500 0.46218
2.37500 0.48785
2.62500 0.51722
2.87500 0.51239
3.12500 0.50224
3.37500 0.48749
3.62500 0.45634
3.87500 0.41652
4.12500 0.37488
4.37500 0.35529
4.62500 0.34686
4.87500 0.33545
5.12500 0.30806
5.37500 0.27900
5.62500 0.24498
5.87500 0.20757
6.12500 0.16710
6.37500 0.12598
6.62500 0.10611
6.87500 0.09263
7.12500 0.07031
7.37500 0.05756
7.62500 0.05046
7.87500 0.07065
8.12500 0.05577
8.37500 0.06870
8.62500 0.07993
8.87500 0.07939
9.12500 0.06830
9.37500 0.06317
9.62500 0.07071
9.87500 0.05689
10.12500 0.05796
10.37500 0.04999
10.62500 0.01883
10.87500 0.00876
11.12500 0.03639
11.37500 0.02793
11.62500 0.05049
11.87500 0.05934
12.12500 0.06270
12.37500 0.06225
12.62500 0.06225
12.87500 0.07528
13.12500 0.06828
13.37500 0.09677
13.62500 0.11438
13.87500 0.10207
14.12500 0.10007
14.37500 0.06716
14.62500 0.11956
14.87500 0.07668
