0.1875 -0.28363 18.82734 -1.92973 93.44993 92.59607 82.23962
0.5625 -1.19918 41.76089 3.54517 93.13964 87.36018 80.27284
0.9375 1.03933 59.57401 9.44343 90.53566 81.89875 76.99993
1.3125 -0.88724 74.53208 12.57174 87.5425 76.71712 73.97406
1.6875 -1.1204 87.34381 11.97592 84.68098 73.02551 69.96317
2.0625 -1.90058 94.71123 3.91512 82.02186 67.91208 66.87558
2.4375 -1.4827 102.27782 0.14578 79.81009 64.21403 63.45944
2.8125 -3.52661 108.03798 -4.47764 77.96279 61.80003 60.28239
3.1875 -1.4377 114.69665 -7.82176 73.16632 61.08474 55.35412
3.5625 -2.97537 122.75333 -8.87326 67.67676 59.20273 53.13403
3.9375 -2.02476 135.12292 -9.70037 62.6023 57.49053 48.7067
4.3125 0.25818 145.77197 -9.78504 56.68903 53.73604 45.46291
4.6875 2.05479 156.93028 -8.70991 51.40886 48.33902 41.27058
5.0625 2.58494 163.14555 -7.73392 47.20699 43.1472 38.01958
5.4375 2.3585 167.55861 -5.68717 43.52166 38.57686 35.66565
5.8125 2.6392 171.37844 -4.27837 40.22357 36.02602 32.52596
6.1875 -0.04553 177.91269 -2.0702 37.29785 33.41165 30.8179
6.5625 -0.57777 183.38036 0.23771 35.10192 30.83907 28.719
6.9375 -0.21552 187.73219 0.64671 33.40759 27.44995 27.99748
7.3125 0.42418 189.1928 1.48626 32.07426 25.26936 26.52941
7.6875 0.67804 189.45465 0.24254 31.1447 24.07099 25.67924
8.0625 0.78713 190.76697 0.19455 30.36553 23.56281 24.47214
8.4375 0.95677 192.26244 -0.2902 28.41788 23.41675 23.10155
8.8125 0.75281 193.75056 0.00579 27.17901 22.88897 21.71012
9.1875 0.78085 196.04993 0.53322 26.67634 21.49407 21.13423
9.5625 1.51918 197.40602 0.94738 25.45865 21.29308 20.80105
9.9375 1.62643 199.03619 1.258 24.25832 20.55163 20.61334
10.3125 2.23849 200.68326 1.75903 23.78496 19.55374 19.42931
10.6875 3.30421 203.18324 2.48289 22.95718 18.85694 19.33665
11.0625 3.35515 204.73515 1.58291 22.81445 17.71176 19.35811
11.4375 2.84456 205.1238 1.4696 21.90865 16.77527 19.19759
11.8125 3.25501 205.1548 2.48293 22.5117 14.91062 18.5776
12.1875 2.93801 204.87726 2.03899 21.58872 14.64255 18.16206
12.5625 2.15638 204.30312 1.45902 21.0214 13.73445 17.89473
12.9375 1.24535 203.85331 1.18487 19.88946 13.33106 17.29909
13.3125 0.89972 202.71239 1.54568 19.77417 13.8492 16.81834
13.6875 0.19527 202.96591 2.34955 18.19586 14.18905 15.90758
14.0625 0.56867 203.27384 1.65779 17.66678 13.83707 15.24941
14.4375 -0.01651 203.96972 2.66548 16.68685 13.9368 13.92113
14.8125 -0.26609 204.29078 2.62414 16.22822 12.90727 13.51786
15.1875 -1.92882 205.00776 2.91203 14.94421 12.70933 12.28167
15.5625 -1.92874 204.12383 2.55521 14.59056 11.73005 12.39914
15.9375 -2.96765 205.23978 1.58358 14.25251 10.15252 11.10994
16.3125 -2.66635 204.52993 0.47322 14.77568 10.46001 11.17261
16.6875 -1.69523 204.29573 -0.26778 13.994 10.43619 10.79716
17.0625 -3.22701 204.00571 -0.52863 13.4861 9.59857 11.69056
17.4375 -1.6039 204.31351 -0.03039 13.07717 10.15484 11.39719
17.8125 1.0241 204.46225 -0.01557 12.86972 8.97563 11.5925
18.1875 0.9427 205.22685 0.31789 12.94425 8.75122 11.33152
18.5625 1.15896 205.16998 0.76309 13.26385 9.31185 11.12612
18.9375 0.43012 203.94204 2.28904 11.65219 8.51239 11.38575
19.3125 1.09896 203.38424 1.6632 12.23604 8.32108 10.92995
19.6875 -0.11034 202.21951 3.57151 11.49162 8.26985 10.15644
20.0625 -0.86971 203.03715 2.71253 11.31803 8.95591 10.74558
20.4375 -0.72431 202.9976 3.29525 10.43916 8.75871 10.25485
20.8125 -0.7143 202.98404 2.88338 9.78766 8.28365 10.63467
21.1875 1.94055 204.24953 0.50903 10.41328 7.66703 10.14769
21.5625 2.50437 201.97948 2.39298 10.47519 7.42103 9.45772
21.9375 1.64411 202.99773 1.76968 10.33175 7.39848 8.42602
22.3125 1.72691 201.68237 3.01135 9.26253 7.87738 8.66016
22.6875 3.46921 203.51007 2.31799 9.69647 8.05643 9.18592
23.0625 3.1432 203.7647 1.20169 9.65323 7.65309 7.3486
23.4375 1.74354 203.42005 0.50707 8.50355 7.77215 8.03102
23.8125 3.04937 203.74094 -0.45151 8.37044 6.91682 7.64484
24.1875 2.25491 203.06755 -2.40424 7.19775 7.03986 8.79573
24.5625 2.29693 202.54704 -1.40217 7.80199 5.95302 7.51785
24.9375 0.76107 203.97854 1.01069 8.47317 7.06245 7.36944
25.3125 0.76407 204.02445 -0.23246 8.45273 5.34603 8.56812
25.6875 0.44714 205.88556 -1.02098 6.70029 4.77648 6.76726
26.0625 1.05679 202.85507 3.91258 7.08507 4.67791 6.87191
26.4375 1.33274 202.21716 6.14502 5.06759 3.8937 6.8265
26.8125 0.04888 202.8051 1.54433 7.12099 4.89487 7.04906
27.1875 2.08492 200.93774 -0.10015 7.11374 5.09371 6.94805
27.5625 -2.38506 201.24711 2.26416 7.42361 5.09247 6.06945
27.9375 -0.19706 204.36853 0.35586 8.88137 6.63373 4.85647
28.3125 2.32264 202.06628 -0.49173 5.87066 5.11118 8.06428
28.6875 -2.82427 201.89957 0.67118 8.29135 4.19238 4.79488
29.0625 1.44119 199.75106 -3.75523 10.02956 4.19305 4.16432
29.4375 0.86469 204.34373 -0.96881 6.02119 5.29289 6.07034
29.8125 1.29755 201.83906 1.53128 6.27391 4.33176 4.81242
