0.15 -2.33233 14.20504 -1.67639 102.99318 102.33517 91.79497
0.45 -1.108 28.33876 -0.3164 102.42986 98.99125 92.8649
0.75 -0.58311 46.29766 -1.79038 100.75066 93.82479 90.12106
1.05 0.21816 59.2219 -0.47444 98.79879 89.65612 87.19507
1.35 0.3719 67.58229 -0.61424 96.96241 86.24444 84.45066
1.65 0.10585 77.31481 -0.29178 96.0834 84.49393 82.7324
1.95 -0.75813 83.67892 -0.63529 96.67708 82.27737 80.48198
2.25 -0.17066 93.15249 1.03627 94.82076 80.78744 78.85993
2.55 -1.3305 100.86305 0.28362 92.63948 78.402 76.26596
2.85 -1.38839 106.80659 -0.12134 92.16262 75.64948 73.54653
3.15 0.54811 112.08425 1.95968 90.90524 73.25063 70.33787
3.45 -0.55132 117.77086 1.6649 88.91335 71.58031 67.04564
3.75 -0.32669 122.57946 1.55998 86.95171 68.32229 65.10589
4.05 0.29476 126.84304 3.12293 84.96541 65.74832 62.06517
4.35 -0.80323 130.59467 2.19886 81.46542 62.82248 58.99896
4.65 -0.38688 133.60132 0.74071 78.24178 61.09115 55.59931
4.95 -0.14779 137.37812 -0.74459 74.4971 58.97695 53.48371
5.25 -1.04688 142.0616 -1.26074 71.02617 57.95755 51.01954
5.55 -0.36522 147.91636 -2.39685 67.77084 56.25768 47.67069
5.85 -0.17217 152.55933 -0.47418 64.02543 55.5995 45.65577
6.15 0.83234 158.8505 -1.32085 61.18134 53.77073 43.79354
6.45 -0.54306 164.21811 -0.66462 57.97128 50.62056 42.10064
6.75 0.53118 168.57585 -0.61847 54.6401 48.62175 39.70243
7.05 -0.01509 172.14486 -0.61709 50.18552 46.70729 38.49925
7.35 -0.57579 175.42677 -1.36647 46.59102 44.10111 36.99494
7.65 -0.70566 179.2611 -1.53964 43.63397 41.68035 34.81339
7.95 -0.48584 182.942 -1.62538 40.19834 38.53955 32.75852
8.25 0.53151 186.39552 -0.78078 38.4969 35.21497 31.13563
8.55 -0.34442 188.90884 -0.44943 36.50826 32.93907 29.90338
8.85 -0.52972 191.56159 0.22661 35.34255 31.12263 28.26871
9.15 -0.42155 193.91024 -0.13503 34.18448 29.29248 27.75093
9.45 -1.13796 196.1329 -0.30409 33.10138 27.73789 26.34676
9.75 -0.45952 197.49253 0.02989 32.44086 26.12161 25.57612
10.05 -0.13001 198.18061 0.38868 31.71864 25.48488 24.86366
10.35 0.15945 199.36018 -0.01438 30.80624 24.54985 24.09744
10.65 0.03887 199.63532 0.05846 30.10361 23.61626 23.18715
10.95 -0.29324 200.12631 0.02303 29.21696 22.77835 22.45831
11.25 0.57421 200.45826 -0.62745 28.41735 22.61139 21.83955
11.55 -0.28248 201.11073 -0.31056 27.93043 22.69532 21.45785
11.85 0.04443 201.50045 -0.42212 27.23741 21.90573 20.80134
12.15 0.207 202.56277 -0.32862 26.14854 21.52214 19.81953
12.45 -0.26493 202.83622 -0.37697 25.43329 20.83939 19.39156
12.75 0.44051 203.89102 -0.07127 25.00047 20.08691 18.97877
13.05 -0.17874 204.54549 0.0559 24.77786 19.64465 18.21355
13.35 -0.45993 204.93576 0.28683 23.6417 19.47767 18.06766
13.65 0.1482 205.78709 0.21855 23.63706 18.82452 17.9032
13.95 0.25346 206.30238 0.2904 23.27994 17.95154 17.46769
14.25 0.55865 206.52222 1.0421 23.10744 17.66679 17.51938
14.55 1.211 207.27401 1.02143 23.10672 17.16152 17.03314
14.85 0.90576 207.82404 1.18021 22.10171 16.60713 16.38009
15.15 1.34364 207.61379 0.96248 21.73817 16.02345 16.17128
15.45 1.86088 207.87164 1.70995 21.76026 15.97126 15.93657
15.75 1.20311 207.54433 1.71528 21.73572 15.10015 15.98733
16.05 1.18355 207.59247 1.81134 21.5132 14.48896 15.42534
16.35 1.84716 207.35755 1.66786 21.05444 14.36354 15.42587
16.65 1.38444 207.03964 1.42505 20.21434 13.43116 14.79161
16.95 1.534 206.45092 1.62086 20.38108 13.40741 14.85947
17.25 2.29196 205.99911 1.46702 19.62768 12.98116 14.56871
17.55 1.36014 205.26416 1.27104 19.50674 13.52232 13.87774
17.85 0.72902 205.01709 0.8624 19.04561 12.96373 13.58285
18.15 1.10661 204.50871 1.42597 19.02389 13.33614 13.435
18.45 0.89167 205.23975 1.12579 17.96011 13.81803 13.11606
18.75 0.82264 204.8033 0.62293 17.55101 13.78535 12.19869
19.05 0.35242 205.43867 0.81449 17.23878 14.26753 12.29408
19.35 0.76819 205.68856 0.53908 16.53331 14.36601 11.66736
19.65 0.21032 206.03529 0.82309 16.28649 13.84595 11.32129
19.95 -0.16636 206.49995 0.33141 16.20785 13.36917 10.84141
20.25 0.31151 207.06528 -0.02929 15.71607 12.9811 11.13986
20.55 0.13655 206.0644 0.20615 16.15896 12.45503 10.52608
20.85 1.05647 206.40861 0.03433 16.12108 11.5659 9.98739
21.15 0.98817 206.41987 0.15509 16.3342 11.30338 9.7826
21.45 1.33705 206.17368 -0.42571 15.82662 11.62032 9.76112
21.75 0.4617 206.18906 -0.32682 17.19147 11.00956 9.45312
22.05 1.1519 206.55892 -0.62466 16.85141 11.32483 9.23291
22.35 0.77734 205.55466 -0.77515 17.47623 10.90831 9.66267
22.65 0.51085 205.63928 -0.92992 17.46466 10.90669 9.3221
22.95 0.34472 205.59101 -1.01917 16.43878 9.97906 9.32442
23.25 0.31395 205.59843 -1.06514 17.10842 8.95913 8.37158
23.55 -0.86718 204.99525 -0.59675 15.67087 9.50399 8.617
23.85 0.88757 204.41397 -0.34019 15.04511 9.40934 8.22911
24.15 0.73215 204.09486 -0.53007 14.5225 9.07623 8.04414
24.45 0.79004 203.85781 -0.06465 13.17807 9.84434 8.33685
24.75 1.16739 202.30666 -0.10701 13.88961 9.54327 8.00675
25.05 0.01989 202.01214 -0.31674 12.88109 9.82702 7.56806
25.35 0.7751 203.02891 0.72308 12.96507 10.41908 7.68535
25.65 0.27935 202.93481 0.83257 12.03525 10.57502 7.6604
25.95 1.38313 203.94682 0.82471 11.6794 9.94832 6.56641
26.25 1.05488 204.68419 1.0155 11.28985 9.6104 7.1467
26.55 1.35029 203.49265 0.84515 11.25812 9.36179 6.71521
26.85 1.00542 204.17377 1.27864 11.00127 8.66683 6.62025
27.15 0.15209 203.66834 0.98949 10.92654 8.20128 6.82534
27.45 0.73263 202.70748 1.34731 11.01074 7.62426 7.16867
27.75 0.44891 202.60219 0.88668 10.222 7.61969 6.88765
28.05 0.50364 202.92638 1.51126 10.48459 8.89084 6.80036
28.35 -0.66663 203.72622 0.39176 9.96773 7.86174 6.22721
28.65 1.51711 204.04543 0.27642 10.05883 8.03444 6.4142
28.95 0.31192 204.77918 -0.49457 9.38126 5.92216 5.90114
29.25 2.544 204.56138 -0.50384 8.81718 6.27453 5.92345
29.55 1.88519 203.37499 -0.41522 8.94584 5.34459 5.66354
29.85 0.79697 202.10612 0.13558 8.94043 6.46011 5.80314
