0.05000 1908.13874
0.15000 3739.02117
0.25000 4941.11097
0.35000 5533.19497
0.45000 6205.14288
0.55000 6518.75058
0.65000 6545.51311
0.75000 6521.69776
0.85000 6535.22811
0.95000 6378.71093
1.05000 6279.12100
1.15000 6043.55297
1.25000 5897.38147
1.35000 5713.05032
1.45000 5486.97974
1.55000 5337.34500
1.65000 5203.88365
1.75000 4988.00444
1.85000 4765.33480
1.95000 4629.51661
2.05000 4500.95846
2.15000 4327.12541
2.25000 4202.47287
2.35000 4131.39217
2.45000 3889.31019
2.55000 3793.00333
2.65000 3692.22329
2.75000 3574.72231
2.85000 3448.00595
2.95000 3320.79667
3.05000 3228.99920
3.15000 3117.92005
3.25000 3012.73762
3.35000 2935.47843
3.45000 2823.67927
3.55000 2777.06572
3.65000 2698.30791
3.75000 2608.43969
3.85000 2510.25002
3.95000 2453.56394
4.05000 2384.83302
4.15000 2298.67418
4.25000 2230.91887
4.35000 2167.71395
4.45000 2126.73794
4.55000 2055.53383
4.65000 1976.44034
4.75000 1957.95530
4.85000 1889.72029
4.95000 1835.90559
5.05000 1773.09664
5.15000 1717.12293
5.25000 1692.69775
5.35000 1632.31774
5.45000 1564.26160
5.55000 1544.32048
5.65000 1494.82242
5.75000 1432.29646
5.85000 1405.68308
5.95000 1360.67550
6.05000 1343.71648
6.15000 1263.27895
6.25000 1237.60168
6.35000 1201.87049
6.45000 1166.01149
6.55000 1128.89693
6.65000 1105.85832
6.75000 1053.48700
6.85000 1018.66337
6.95000 1010.33013
7.05000 985.80480
7.15000 948.71900
7.25000 928.08348
7.35000 899.33626
7.45000 873.09706
7.55000 860.51641
7.65000 826.10717
7.75000 811.64292
7.85000 778.03057
7.95000 758.51262
8.05000 733.21336
8.15000 721.41040
8.25000 710.70164
8.35000 705.92804
8.45000 675.56861
8.55000 654.64738
8.65000 639.64776
8.75000 617.98233
8.85000 584.97120
8.95000 585.55891
9.05000 575.37307
9.15000 539.30881
9.25000 542.03034
9.35000 527.05602
9.45000 501.88506
9.55000 496.62636
9.65000 479.08570
9.75000 470.82421
9.85000 455.53352
9.95000 453.05204
10.05000 438.57610
10.15000 415.42020
10.25000 421.59565
10.35000 390.45740
10.45000 388.10528
10.55000 382.13428
10.65000 380.72722
10.75000 372.05687
10.85000 352.36563
10.95000 355.87080
11.05000 348.88106
11.15000 339.61265
11.25000 326.15031
11.35000 318.30669
11.45000 313.00560
11.55000 300.49248
11.65000 294.36760
11.75000 285.28807
11.85000 284.66688
11.95000 283.70903
12.05000 274.89457
12.15000 266.53970
12.25000 270.15664
12.35000 253.97899
12.45000 248.26005
12.55000 238.94388
12.65000 236.47304
12.75000 232.18215
12.85000 225.81236
12.95000 222.06157
13.05000 217.53042
13.15000 208.96153
13.25000 213.01271
13.35000 197.48450
13.45000 197.51300
13.55000 195.66738
13.65000 183.23271
13.75000 177.83567
13.85000 186.97294
13.95000 175.27648
14.05000 169.38822
14.15000 172.64976
14.25000 163.06070
14.35000 163.23126
14.45000 166.75839
14.55000 165.84568
14.65000 161.53506
14.75000 150.28645
14.85000 157.17770
14.95000 146.38470
15.05000 140.76593
15.15000 146.53978
15.25000 136.54549
15.35000 140.31788
15.45000 129.25384
15.55000 133.91060
15.65000 127.42695
15.75000 129.27205
15.85000 119.50450
15.95000 117.63304
16.05000 105.78748
16.15000 108.75093
16.25000 106.74718
16.35000 112.50338
16.45000 110.65593
16.55000 100.70060
16.65000 112.76068
16.75000 106.74579
16.85000 109.41960
16.95000 102.96191
17.05000 104.48065
17.15000 96.36270
17.25000 97.81900
17.35000 99.40744
17.45000 98.33580
17.55000 94.93435
17.65000 92.97018
17.75000 94.63723
17.85000 84.15026
17.95000 80.56816
18.05000 88.86050
18.15000 83.49530
18.25000 86.60576
18.35000 82.40921
18.45000 76.57209
18.55000 77.10069
18.65000 84.34438
18.75000 71.06807
18.85000 76.33346
18.95000 72.42846
19.05000 70.91284
19.15000 67.70122
19.25000 66.29244
19.35000 74.17060
19.45000 66.59746
19.55000 76.93387
19.65000 69.51763
19.75000 64.25250
19.85000 64.62538
19.95000 66.93648
