0.12500 0.04802
0.37500 0.08829
0.62500 0.17140
0.87500 0.24464
1.12500 0.30245
1.37500 0.33706
1.62500 0.36797
1.87500 0.39488
2.12500 0.42259
2.37500 0.43932
2.62500 0.44889
2.87500 0.45685
3.12500 0.47418
3.37500 0.47734
3.62500 0.49362
3.87500 0.50349
4.12500 0.50014
4.37500 0.50249
4.62500 0.49454
4.87500 0.48771
5.12500 0.47303
5.37500 0.45373
5.62500 0.41698
5.87500 0.39837
6.12500 0.40243
6.37500 0.40168
6.62500 0.38394
6.87500 0.39725
7.12500 0.39606
7.37500 0.40640
7.62500 0.40127
7.87500 0.37797
8.12500 0.35837
8.37500 0.31533
8.62500 0.27666
8.87500 0.23639
9.12500 0.19533
9.37500 0.17777
9.62500 0.13298
9.87500 0.09663
10.12500 0.10482
10.37500 0.06660
10.62500 0.03506
10.87500 0.02980
11.12500 0.03189
11.37500 0.03527
11.62500 0.03729
11.87500 0.03607
12.12500 0.05940
12.37500 0.04236
12.62500 0.05280
12.87500 0.05482
13.12500 0.06131
13.37500 0.07896
13.62500 0.06009
13.87500 0.08981
14.12500 0.10301
14.37500 0.08468
14.62500 0.09733
14.87500 0.07986
