0.05000 1981.11971
0.15000 3714.11548
0.25000 4951.18681
0.35000 6310.66758
0.45000 6343.64067
0.55000 6732.09893
0.65000 6933.99769
0.75000 6881.47389
0.85000 6959.02315
0.95000 7006.69917
1.05000 6662.05534
1.15000 6507.16217
1.25000 6314.60431
1.35000 5942.56626
1.45000 5715.64011
1.55000 5672.21189
1.65000 5328.78003
1.75000 5169.65421
1.85000 5069.81586
1.95000 4879.91644
2.05000 4748.25912
2.15000 4523.53907
2.25000 4313.25139
2.35000 4140.00856
2.45000 4154.95523
2.55000 3916.86687
2.65000 3797.30582
2.75000 3684.22480
2.85000 3612.78615
2.95000 3466.23717
3.05000 3357.62868
3.15000 3236.83546
3.25000 3157.03119
3.35000 3034.73271
3.45000 2877.63486
3.55000 2878.97489
3.65000 2762.41433
3.75000 2679.15616
3.85000 2581.11214
3.95000 2531.64466
4.05000 2442.19628
4.15000 2381.18265
4.25000 2296.93731
4.35000 2168.64830
4.45000 2157.63938
4.55000 2127.53578
4.65000 2061.21468
4.75000 1969.68089
4.85000 1921.38873
4.95000 1870.82390
5.05000 1811.42822
5.15000 1742.54901
5.25000 1699.79352
5.35000 1656.48053
5.45000 1599.31686
5.55000 1549.58328
5.65000 1521.18251
5.75000 1485.01728
5.85000 1411.51902
5.95000 1378.14752
6.05000 1351.01148
6.15000 1272.38882
6.25000 1269.26003
6.35000 1199.67408
6.45000 1218.67811
6.55000 1169.99465
6.65000 1127.33117
6.75000 1112.21658
6.85000 1065.21863
6.95000 1022.94860
7.05000 1050.57528
7.15000 1001.67288
7.25000 944.99283
7.35000 925.57009
7.45000 929.99307
7.55000 863.69691
7.65000 853.29777
7.75000 840.53941
7.85000 801.05828
7.95000 792.63731
8.05000 764.97379
8.15000 766.30354
8.25000 736.78212
8.35000 707.39855
8.45000 664.81980
8.55000 694.08693
8.65000 644.57718
8.75000 633.52168
8.85000 629.05949
8.95000 608.71561
9.05000 596.62138
9.15000 576.95209
9.25000 555.21677
9.35000 532.37721
9.45000 544.63003
9.55000 518.41198
9.65000 513.06528
9.75000 503.84205
9.85000 492.48554
9.95000 465.16979
10.05000 463.31428
10.15000 442.19469
10.25000 442.36326
10.35000 415.97547
10.45000 418.74755
10.55000 408.76296
10.65000 415.50852
10.75000 393.76191
10.85000 392.72106
10.95000 374.92521
11.05000 382.18985
11.15000 360.79624
11.25000 368.94600
11.35000 359.11514
11.45000 344.26056
11.55000 339.92474
11.65000 312.97126
11.75000 328.46128
11.85000 317.46840
11.95000 311.87155
12.05000 309.59756
12.15000 285.88890
12.25000 290.91071
12.35000 272.89230
12.45000 279.09088
12.55000 261.30252
12.65000 259.93065
12.75000 255.09268
12.85000 250.05651
12.95000 244.78107
13.05000 240.76459
13.15000 222.53251
13.25000 213.34366
13.35000 218.85301
13.45000 220.93441
13.55000 212.62289
13.65000 197.32251
13.75000 208.99936
13.85000 197.52046
13.95000 196.16654
14.05000 181.31675
14.15000 184.54941
14.25000 178.86075
14.35000 177.97434
14.45000 179.22215
14.55000 169.77845
14.65000 173.48243
14.75000 178.42144
14.85000 169.91852
14.95000 177.39167
15.05000 153.35100
15.15000 162.14667
15.25000 158.37755
15.35000 153.69001
15.45000 160.17920
15.55000 156.55456
15.65000 168.73679
15.75000 169.60112
15.85000 148.39696
15.95000 147.59958
16.05000 172.51675
16.15000 150.02358
16.25000 136.34732
16.35000 152.60116
16.45000 149.28060
16.55000 134.86910
16.65000 133.17541
16.75000 117.59601
16.85000 131.07293
16.95000 126.38569
17.05000 129.97774
17.15000 119.14266
17.25000 131.37395
17.35000 113.96099
17.45000 126.51526
17.55000 102.75984
17.65000 117.71073
17.75000 124.36204
17.85000 117.02298
17.95000 102.92095
18.05000 110.34334
18.15000 118.86095
18.25000 98.90408
18.35000 112.26719
18.45000 114.14547
18.55000 87.87948
18.65000 93.28301
18.75000 103.33448
18.85000 89.23158
18.95000 80.41319
19.05000 76.77199
19.15000 90.92539
19.25000 95.94350
19.35000 87.54951
19.45000 92.86595
19.55000 92.56344
19.65000 86.78117
19.75000 97.89485
19.85000 92.25511
19.95000 80.94232
