0.125 -0.000 -0.000 0.000
0.375 -0.000 -0.000 -0.001
0.625 -0.001 0.000 -0.000
0.875 -0.002 0.001 0.004
1.125 0.001 0.000 0.001
1.375 -0.004 0.001 0.002
1.625 0.003 -0.001 -0.000
1.875 -0.005 0.009 0.007
2.125 -0.000 -0.003 0.004
2.375 -0.005 0.011 -0.004
2.625 0.012 0.009 0.002
2.875 -0.011 0.000 0.011
3.125 -0.007 0.007 0.030
3.375 0.006 0.022 0.034
3.625 0.006 -0.008 0.012
3.875 0.004 0.035 0.006
4.125 -0.013 0.031 0.014
4.375 -0.007 -0.023 -0.021
4.625 0.032 0.012 0.023
4.875 0.013 -0.007 0.057
5.125 0.004 -0.003 -0.001
5.375 0.046 -0.004 -0.007
5.625 -0.003 -0.015 0.039
5.875 -0.054 -0.001 -0.026
6.125 0.057 0.016 -0.018
6.375 -0.018 0.006 -0.003
6.625 0.027 0.028 0.013
6.875 -0.011 -0.014 -0.010
7.125 0.016 -0.009 -0.030
7.375 0.009 -0.060 -0.024
7.625 -0.015 0.034 -0.024
7.875 -0.034 0.011 -0.043
8.125 -0.043 -0.056 -0.007
8.375 -0.021 0.041 0.058
8.625 0.049 0.010 0.052
8.875 0.040 -0.013 0.026
9.125 -0.030 0.006 0.076
9.375 0.086 0.021 -0.033
9.625 -0.015 0.045 -0.019
9.875 -0.033 0.058 0.014
10.125 -0.096 0.078 0.036
10.375 0.071 -0.013 -0.009
10.625 -0.043 -0.105 0.008
10.875 0.047 -0.039 -0.022
11.125 -0.089 -0.003 0.049
11.375 0.011 -0.014 -0.017
11.625 0.001 0.165 -0.086
11.875 -0.026 -0.007 -0.031
12.125 0.078 -0.050 -0.081
12.375 -0.046 -0.016 -0.041
12.625 -0.008 0.031 -0.099
12.875 0.076 0.007 0.037
13.125 -0.029 0.107 0.030
13.375 0.094 -0.180 0.020
13.625 0.125 0.120 0.088
13.875 0.028 0.002 -0.100
14.125 -0.059 0.032 -0.054
14.375 -0.039 0.013 -0.101
14.625 0.047 -0.045 -0.042
14.875 0.029 0.050 -0.053
