0.12500 0.02268
0.37500 0.04778
0.62500 0.12367
0.87500 0.20850
1.12500 0.27841
1.37500 0.34538
1.62500 0.38857
1.87500 0.43166
2.12500 0.46757
2.37500 0.50136
2.62500 0.52982
2.87500 0.54996
3.12500 0.58114
3.37500 0.60074
3.62500 0.62412
3.87500 0.63710
4.12500 0.63462
4.37500 0.64509
4.62500 0.64427
4.87500 0.63689
5.12500 0.61993
5.37500 0.60751
5.62500 0.57618
5.87500 0.55079
6.12500 0.51826
6.37500 0.51074
6.62500 0.49736
6.87500 0.46655
7.12500 0.44384
7.37500 0.41407
7.62500 0.40138
7.87500 0.36827
8.12500 0.36890
8.37500 0.37706
8.62500 0.36985
8.87500 0.34739
9.12500 0.30324
9.37500 0.26803
9.62500 0.22913
9.87500 0.19240
10.12500 0.15595
10.37500 0.11882
10.62500 0.11019
10.87500 0.07560
11.12500 0.04935
11.37500 0.04904
11.62500 0.04320
11.87500 0.03771
12.12500 0.05288
12.37500 0.05589
12.62500 0.06128
12.87500 0.06553
13.12500 0.06826
13.37500 0.07350
13.62500 0.08584
13.87500 0.08685
14.12500 0.07437
14.37500 0.08086
14.62500 0.08577
14.87500 0.05507
