0.1875 2.80432 21.63733 3.2994 102.82701 99.1495 89.87097
0.5625 0.69817 42.57161 2.01783 100.06481 94.21918 86.55353
0.9375 -0.24671 59.55298 0.69197 98.34805 86.23174 81.04707
1.3125 -0.12654 71.18307 0.03332 96.6037 81.24275 77.28426
1.6875 1.00153 80.35015 -0.9593 93.39544 76.90364 73.47484
2.0625 -0.1037 89.73973 -0.94587 92.28969 73.28149 69.31942
2.4375 0.12739 99.3719 -0.8619 87.75223 70.25142 65.74311
2.8125 -0.32483 105.9228 0.01567 82.11473 67.24365 61.74529
3.1875 -0.63766 112.95585 -0.15615 77.29147 64.71932 57.98481
3.5625 -1.70524 119.23774 -1.08651 72.36306 60.66616 55.36425
3.9375 -1.63362 127.5364 -1.42605 68.87353 58.26703 51.67803
4.3125 -1.03653 141.30263 -1.02818 64.5807 56.71877 46.80746
4.6875 -1.91447 148.51298 -1.1845 58.1436 54.08076 43.79651
5.0625 -2.10311 156.45149 -1.83014 51.75272 49.70043 39.41693
5.4375 -2.43747 165.97784 -1.17832 47.42337 43.47074 36.8337
5.8125 -2.18765 170.26054 -0.94212 43.43822 38.58954 34.84052
6.1875 -1.87623 173.98567 -1.04027 39.69405 35.85479 32.86701
6.5625 -1.46402 177.42036 -0.73528 36.72769 34.27316 30.53767
6.9375 -1.19438 179.90335 -1.12167 35.00548 31.94992 28.91492
7.3125 -2.03288 183.92201 -0.66258 33.68526 30.62855 27.33453
7.6875 -0.61972 188.48453 -0.18477 32.39792 27.95215 26.0093
8.0625 -0.12833 190.58374 0.04143 31.66857 25.76013 25.35546
8.4375 0.30006 191.8237 1.13417 31.33503 24.2173 23.82068
8.8125 0.34802 192.89393 0.53619 29.88815 22.33906 23.13695
9.1875 -0.7244 193.74361 1.40805 28.22029 22.35549 22.26698
9.5625 -0.19616 194.48833 1.59507 26.65369 22.03318 21.65226
9.9375 -0.87106 196.14422 1.22987 26.03547 21.95816 21.04957
10.3125 -0.14285 197.953 2.22578 24.75794 21.27376 20.7164
10.6875 0.01008 199.18867 2.52167 23.67038 19.59402 20.10158
11.0625 -0.74738 200.1615 2.64378 23.15119 18.55124 19.66866
11.4375 -0.6932 201.25615 2.59362 22.68701 17.96929 18.83172
11.8125 0.1885 201.94201 2.82762 21.91502 16.42803 18.81709
12.1875 -0.33395 202.50051 2.20733 21.18617 16.45414 18.70567
12.5625 0.17251 202.83223 1.72679 20.55021 15.78647 18.5131
12.9375 1.16047 203.5997 0.73709 20.00279 15.4192 18.02014
13.3125 0.65896 202.94815 1.84326 20.65693 14.73025 18.03449
13.6875 1.40397 203.06336 0.57799 19.78458 14.04812 18.08299
14.0625 1.00348 202.50123 -0.30435 19.06394 13.60633 17.50605
14.4375 1.79732 202.33587 -0.64802 18.17353 13.43003 16.87206
14.8125 0.76622 202.79184 -0.5481 17.54442 13.19805 16.17551
15.1875 1.82534 202.87151 -0.29444 16.95912 13.48595 15.99776
15.5625 2.0933 203.67794 0.15004 16.71713 13.8813 14.70739
15.9375 1.64523 203.54026 0.07674 16.52441 13.45877 13.99348
16.3125 2.09822 205.05118 1.12116 14.18421 12.67328 13.27486
16.6875 0.85967 206.0434 2.05667 15.22375 10.83554 12.539
17.0625 -0.90954 205.09209 2.61667 13.5857 11.43249 12.90727
17.4375 -2.95324 205.06021 0.91648 13.79862 10.71978 11.48224
17.8125 -1.74149 205.45656 1.8058 14.14312 10.19618 10.78899
18.1875 -3.35053 205.62386 2.26731 14.20669 8.47833 11.187
18.5625 -3.20544 206.18091 2.54312 13.65731 8.10808 11.56804
18.9375 -3.92376 204.57647 1.49589 13.51751 8.33114 11.20438
19.3125 -3.10238 204.08325 1.76667 13.51385 7.69015 11.68966
19.6875 -0.97015 203.94527 -0.74473 13.12483 7.48169 12.21288
20.0625 -1.57888 202.91819 -0.24744 13.18523 8.43282 12.73264
20.4375 -0.76331 203.00586 -1.73287 11.71698 9.14661 10.58974
20.8125 0.14099 202.32535 -2.99126 12.10405 8.53362 12.09742
21.1875 1.03805 202.27267 -3.60843 11.93368 7.67029 12.04596
21.5625 1.8026 201.65311 -0.77172 12.15603 8.22266 11.89487
21.9375 2.18187 203.53052 -1.81994 11.66158 8.40004 10.31238
22.3125 2.25754 202.93288 0.46672 11.38458 9.04002 9.84022
22.6875 2.72486 203.59448 -0.43352 11.71517 7.91112 9.33704
23.0625 1.91171 203.35684 0.85777 10.73764 6.91522 8.47004
23.4375 1.61675 203.76622 0.39064 10.30081 6.83701 7.93184
23.8125 2.82975 202.04838 -0.27461 10.33469 8.5975 7.43418
24.1875 -3.35603 203.41265 1.37356 9.72782 7.81768 8.26582
24.5625 -0.83028 204.68503 0.21533 9.03287 6.3177 7.45545
24.9375 -1.00595 204.57228 -0.77699 7.21026 5.00877 8.68393
25.3125 -1.57778 204.2192 0.12972 6.8405 5.34982 9.24761
25.6875 2.01644 204.04336 -0.94336 7.6446 4.43874 7.05619
26.0625 -1.43924 202.70084 2.79347 5.70067 5.46415 6.08624
26.4375 0.55014 200.79498 -0.54319 6.99755 5.163 6.62923
26.8125 -1.11889 204.69099 0.93114 7.79854 6.13049 7.61127
27.1875 2.0802 204.9114 1.02925 6.82102 4.35 7.57477
27.5625 -0.70669 204.75511 0.06787 7.53365 4.46603 6.72662
27.9375 0.2696 201.78967 -2.86564 7.06242 4.58209 7.13735
28.3125 -0.05399 198.62081 3.13122 5.386 3.92492 5.11802
28.6875 -0.93044 203.61876 -3.98065 5.9485 4.17799 3.30761
29.0625 -4.84898 201.58643 1.72453 5.15422 5.88094 6.10785
29.4375 -1.69516 201.4935 -1.34376 9.63812 3.19659 6.94322
29.8125 0.27095 199.26165 -0.33296 6.19018 2.53234 4.97178
