0.05000 -4674.16331 607.30304 2742.96857 4895.98816 2846.22954 5808.46407
0.15000 -5215.51060 -992.06109 2254.10276 5088.50254 5927.61471 8068.77975
0.25000 -7613.11124 372.61506 2149.21045 7036.69816 7418.79204 10641.07259
0.35000 -8812.67809 -15.63832 895.75173 8739.47270 7455.63682 12329.40731
0.45000 -9928.79050 175.03154 -26.23120 4608.12468 6088.29734 11818.52138
0.55000 -10420.54787 114.24103 -115.12557 4453.41188 3119.50499 11882.24706
0.65000 -10747.63758 172.01347 168.63346 4361.49003 4017.86353 11588.95167
0.75000 -10792.61027 127.86704 -14.32325 4701.12968 3515.71696 11452.37747
0.85000 -11167.15439 -15.39929 -298.72862 3671.72057 2935.59582 10427.67966
0.95000 -11092.75119 -39.08096 -210.03231 8146.26745 3470.44099 11695.57601
1.05000 -11067.54524 29.20577 -171.69730 4058.43622 2410.63832 10597.17687
1.15000 -10901.52854 -22.74811 -190.50635 4232.44256 2879.06487 9339.68031
1.25000 -10778.25595 -20.86491 -313.07312 2924.81130 2578.39404 8690.05048
1.35000 -10769.11007 32.49435 -167.30894 2597.02179 2630.89826 8467.41318
1.45000 -10618.18786 62.37392 153.72412 3015.87401 2430.51639 7875.36350
1.55000 -10706.05567 22.18010 -71.20557 2231.60416 2418.12854 7480.62283
1.65000 -10559.70939 -8.95491 -21.86886 1968.82695 2046.66151 7269.12986
1.75000 -10524.25344 -23.71578 160.19950 2262.52792 2304.97373 6838.77317
1.85000 -10356.56277 9.91653 -196.90543 2604.38150 2525.62514 6555.98984
1.95000 -10241.59938 -54.12791 -93.69592 1986.32040 1936.00749 6330.93302
2.05000 -10138.96204 -33.68028 61.96756 1672.36008 1996.68361 6103.85516
2.15000 -10004.71672 32.23569 -232.27415 2156.25852 2802.93323 7067.08940
2.25000 -9861.08307 29.32370 88.64587 2052.86985 1766.02931 5453.25586
2.35000 -9708.75528 49.49467 -67.36865 1578.81750 1908.67503 5254.57183
2.45000 -9628.19219 20.07446 32.66135 1283.40851 1823.88431 5101.21878
2.55000 -9522.21980 26.80824 -50.83306 1185.11668 1383.86011 4849.45376
2.65000 -9340.53727 -16.52473 112.53004 1235.88350 1611.37377 4689.17485
2.75000 -9234.03293 -31.64835 39.23845 2498.71003 3210.40122 5041.56744
2.85000 -9061.05436 11.31464 65.59364 1114.90620 1296.04472 4262.27277
2.95000 -8940.49469 -8.26540 -63.22786 1600.32845 1408.81580 4450.28880
3.05000 -8865.48027 -48.13177 -19.57376 1135.00064 1657.95509 4038.79838
3.15000 -8804.15454 24.54099 10.58912 1020.13249 1108.45891 3877.69294
3.25000 -8733.82392 12.44135 -44.01491 932.85316 1052.18000 3700.33094
3.35000 -8597.94821 10.35497 -40.32398 1086.72894 978.71335 3580.38568
3.45000 -8527.26978 -2.52668 33.70854 1009.09787 1485.18699 3459.39771
3.55000 -8452.65937 -0.84585 -95.15811 1055.30941 1062.94991 3398.93667
3.65000 -8364.45448 -28.51472 110.09576 1766.32154 1767.37248 3604.85757
3.75000 -8224.30848 -5.08329 14.84365 1028.93734 786.99169 3148.35779
3.85000 -8128.04917 -16.38094 10.60766 1289.26587 1174.30070 3267.35884
3.95000 -8066.21448 -1.41514 -14.99604 957.19296 1383.89175 2974.26634
4.05000 -7982.56935 -7.34568 74.91969 1202.30153 983.59708 3031.01184
4.15000 -7923.50147 -7.37010 43.41228 951.93695 1338.07302 2758.53671
4.25000 -7806.02813 -15.01759 70.53145 864.17502 824.72080 2705.27419
4.35000 -7706.43848 -13.16610 -125.21183 2005.95192 695.07613 2708.88141
4.45000 -7664.53596 -18.08042 7.98369 790.98611 725.54351 2719.90688
4.55000 -7599.90318 33.96797 99.26343 857.87523 775.07680 2487.51771
4.65000 -7525.77863 3.22151 12.87769 717.67774 587.16269 2305.89781
4.75000 -7439.16248 -6.24173 -38.62923 761.77214 603.29544 2272.10982
4.85000 -7343.36521 11.19624 39.33265 679.82172 702.59475 2290.66511
4.95000 -7277.21721 18.81992 19.51512 585.19326 500.58395 2127.23353
5.05000 -7178.37448 29.61000 -55.37601 705.95794 625.29883 2137.22313
5.15000 -7107.58650 5.13572 22.51600 738.03157 537.59970 1983.45406
5.25000 -6991.07069 1.98471 38.53428 497.33588 491.47972 1989.14189
5.35000 -6937.87609 2.34507 -13.09709 1181.42741 586.70596 1922.80531
5.45000 -6841.92127 -27.24308 -40.88078 683.80695 1675.31035 1889.62680
5.55000 -6779.82712 11.69896 -42.13533 587.31364 416.79172 1802.43080
5.65000 -6702.77013 17.29994 -38.70367 521.67310 479.16722 1737.52934
5.75000 -6630.26503 15.64929 -16.57591 461.37282 393.61438 1696.64718
5.85000 -6569.26597 11.50631 12.78116 534.89748 488.20357 1691.18002
5.95000 -6519.98957 22.55711 -31.36145 820.57561 633.90045 1949.59965
6.05000 -6456.65812 9.79730 -8.55681 555.87399 500.61936 1576.64341
6.15000 -6385.56641 21.78354 -37.18605 554.49139 712.84533 1500.29349
6.25000 -6325.40684 4.62674 10.59985 512.52347 499.03631 1519.86496
6.35000 -6283.24236 5.47865 -6.68627 545.27398 677.02645 1524.79937
6.45000 -6221.06279 4.82059 -10.56220 413.33274 425.20765 1398.45469
6.55000 -6157.01862 12.23805 -21.61908 422.55481 433.80820 1386.61851
6.65000 -6094.42049 6.84240 -17.16700 503.28982 298.63739 1368.83670
6.75000 -6041.19135 15.02010 24.33780 390.74983 324.88224 1253.63705
6.85000 -5975.41090 3.39309 -16.50766 308.31787 249.89716 1225.47083
6.95000 -5903.42371 12.60706 53.19703 558.57928 453.85500 1343.91869
7.05000 -5837.03847 3.35186 19.86772 362.32429 319.50380 1349.45304
7.15000 -5790.35099 16.80029 49.41604 391.98931 464.38539 1145.32458
7.25000 -5730.09542 2.11211 22.01782 511.94300 1154.53974 1530.13220
7.35000 -5655.89899 -6.43512 49.07718 1090.95531 582.44018 1209.00775
7.45000 -5595.86482 8.73296 41.31268 315.30377 404.40378 1595.64844
7.55000 -5541.81675 9.19053 42.09561 355.75926 310.77779 1026.59857
7.65000 -5472.18666 -5.75579 71.49826 647.02225 538.95130 1019.74442
7.75000 -5415.38362 11.62957 75.92498 329.78567 478.75284 1265.50340
7.85000 -5379.26480 44.18005 7.07060 503.02129 994.71788 972.18901
7.95000 -5315.19293 13.64517 49.43803 724.70440 431.85528 1037.23390
8.05000 -5255.75392 3.49560 35.99544 320.77099 391.51162 925.80092
8.15000 -5201.10506 6.31778 59.27193 272.08211 289.05249 885.19691
8.25000 -5162.37500 4.63836 11.31607 713.96890 441.06222 956.23412
8.35000 -5126.86810 3.59165 34.03565 411.38403 369.85266 873.61990
8.45000 -5078.81480 1.33074 8.71103 284.68289 268.52500 826.54439
8.55000 -5036.92359 28.97679 11.84825 235.89073 936.05649 829.92392
8.65000 -4974.72540 -9.69518 41.95371 603.48682 296.91984 809.08265
8.75000 -4937.81911 12.06075 17.74269 239.66383 228.13962 783.64805
8.85000 -4895.73057 12.50326 23.73397 302.47558 284.46953 1102.25009
8.95000 -4866.15561 -4.77937 -1.35985 324.93917 391.10241 733.05810
9.05000 -4808.16821 9.04244 22.10651 313.72994 295.06762 726.82530
9.15000 -4783.10946 9.93222 -22.01226 226.03035 310.26179 663.08101
9.25000 -4710.57833 3.04978 -2.48222 195.86179 184.68710 683.19053
9.35000 -4677.67649 11.06618 -29.74162 194.17293 225.68999 663.02607
9.45000 -4623.69980 4.47193 -10.74858 396.47059 383.61265 689.41284
9.55000 -4591.54697 -3.52965 8.04476 729.35087 874.93071 648.41219
9.65000 -4566.81321 5.90150 4.71474 196.45057 146.82673 609.60008
9.75000 -4511.60486 8.61626 -12.43556 264.53586 332.68865 625.94363
9.85000 -4516.16685 -3.03115 -4.88204 1509.65096 284.75889 989.51802
9.95000 -4432.90013 1.55425 -7.13876 247.85032 219.33738 565.55257
10.05000 -4375.55956 -11.28228 35.61727 777.04342 676.40108 1146.43705
10.15000 -4345.05464 9.70190 -24.85085 174.33571 256.14408 545.52720
10.25000 -4306.17889 3.25821 -9.17188 1383.84822 1699.81108 947.48941
10.35000 -4270.98027 4.43626 -6.12167 186.06028 190.05804 524.70606
10.45000 -4231.61284 -2.30673 0.95832 205.11954 134.02166 487.37862
10.55000 -4188.47154 19.85834 3.06142 326.55772 450.53025 628.62081
10.65000 -4161.15907 -4.78186 7.48896 181.92300 153.43484 467.30641
10.75000 -4097.84680 3.69429 -9.86052 242.82139 253.32301 558.04143
10.85000 -4079.29439 -1.82882 37.23839 204.83443 170.43852 479.40236
10.95000 -4043.44926 -4.06066 15.88550 166.49163 218.35550 437.98501
11.05000 -4001.45388 29.89353 -5.92620 236.60892 693.25713 429.17626
11.15000 -3963.28968 5.69573 33.73996 169.49066 158.94682 416.51421
11.25000 -3947.98081 13.56123 25.61152 164.20817 215.67513 421.45689
11.35000 -3916.34681 7.05688 1.73669 157.28099 132.52183 428.24421
11.45000 -3844.05755 -7.23135 51.50383 1087.10951 323.99182 880.33716
11.55000 -3858.18241 6.17518 -1.63007 155.68514 111.95854 414.96364
11.65000 -3827.23048 -7.47556 -2.67263 158.66852 174.33086 394.60855
11.75000 -3796.59304 11.44589 1.44405 381.52352 179.72842 485.15000
11.85000 -3753.54659 5.59210 14.89678 191.97509 160.06283 353.91657
11.95000 -3741.62151 1.80610 2.43686 133.39542 109.61096 363.77339
12.05000 -3707.37804 6.29050 15.00415 361.56028 267.88698 551.16029
12.15000 -3684.96501 -11.29530 6.35054 108.15559 268.04420 577.02674
12.25000 -3660.37612 0.07606 -5.56599 125.14493 116.14053 345.13625
12.35000 -3633.20847 5.14888 -8.26388 122.54830 101.84412 343.43563
12.45000 -3604.51731 2.97059 -13.29075 105.85414 170.97300 427.71773
12.55000 -3569.56817 -5.78439 32.47727 206.67437 126.30757 358.43945
12.65000 -3546.53319 -0.61952 18.44059 201.80375 295.97653 323.79081
12.75000 -3517.69453 11.18540 10.95729 152.02604 148.41822 322.25169
12.85000 -3506.59551 -8.13198 29.99518 307.89194 639.62782 342.19072
12.95000 -3456.72989 2.34090 -0.49992 185.63417 108.19886 285.63809
13.05000 -3430.48244 4.75868 7.83867 174.67052 158.67632 344.40588
13.15000 -3409.76240 -4.92713 -16.80526 111.45133 155.96965 353.29630
13.25000 -3384.10699 -8.65867 24.30176 124.55522 170.63584 324.84425
13.35000 -3365.94371 8.11216 21.58822 106.97101 102.86898 265.66409
13.45000 -3325.04647 25.60577 54.06808 145.22251 552.06133 602.92026
13.55000 -3316.80599 2.18458 18.43314 222.96415 150.78557 273.05463
13.65000 -3273.88771 0.69790 17.93126 158.16624 119.59895 283.63794
13.75000 -3261.65334 -3.37456 17.96851 113.88990 103.68870 239.82219
13.85000 -3242.75476 5.29652 11.19128 154.04993 125.17275 272.76556
13.95000 -3209.37684 8.24208 5.53258 101.17677 92.97444 232.82050
14.05000 -3188.10237 7.10787 26.69987 104.48856 108.79832 249.78397
14.15000 -3173.66525 -11.02563 21.01223 139.12669 101.32634 254.23314
14.25000 -3126.33871 21.66197 38.50810 336.46642 483.90338 616.39472
14.35000 -3125.26280 2.40155 19.68301 193.86665 134.18915 259.74588
14.45000 -3094.93152 3.93534 51.49093 85.99470 69.86449 198.99887
14.55000 -3076.44000 -0.17548 8.78746 134.87801 123.80591 243.93593
14.65000 -3048.32083 -4.46755 22.79853 76.29571 58.03529 186.48765
14.75000 -2995.18273 10.66334 -35.56065 356.44218 153.49399 442.01967
14.85000 -3010.09358 0.96015 22.43250 62.72511 68.19086 186.78552
14.95000 -2986.95904 2.23201 16.94747 100.21509 75.59482 205.47285
15.05000 -2960.13426 -9.70217 0.23441 97.33505 88.53730 204.18114
15.15000 -2939.09094 -5.27090 1.12406 83.93892 118.36024 193.05531
15.25000 -2902.79385 -12.42547 -17.87393 143.84991 99.66489 206.93128
15.35000 -2897.09609 2.68481 -11.65997 62.08992 86.82705 173.30158
15.45000 -2877.04433 9.19462 -9.89921 108.09588 84.03987 174.94219
15.55000 -2852.65377 -0.85946 -15.96161 68.33369 75.32190 172.29795
15.65000 -2804.35328 2.62661 -0.88690 264.04110 112.70746 290.83774
15.75000 -2818.25298 -5.23758 2.88604 58.08093 56.98082 147.67086
15.85000 -2798.82079 0.24650 -26.01584 62.39160 62.55577 147.61628
15.95000 -2783.42560 -0.33208 -22.66735 92.19444 108.98850 157.76679
16.05000 -2763.94889 -7.04473 5.05212 173.62146 123.21355 240.97457
16.15000 -2741.31505 -2.73679 -30.45843 84.99817 71.85894 148.81026
16.25000 -2734.09869 8.72380 -20.14014 67.57626 91.00885 160.82580
16.35000 -2711.15930 4.13229 -22.90251 54.40694 45.78558 161.34999
16.45000 -2682.68885 3.82975 -21.02231 54.23183 76.98343 148.73167
16.55000 -2664.24989 0.73901 -13.46894 47.01868 42.55261 125.47010
16.65000 -2658.75567 4.65874 -23.47661 72.38462 101.20436 134.74674
16.75000 -2633.58951 -2.47700 -14.94301 146.85228 57.81697 186.56908
16.85000 -2616.61069 -2.21647 -7.02671 105.67608 103.73546 166.38636
16.95000 -2621.27437 8.21557 -12.09196 90.21345 64.39226 140.74201
17.05000 -2583.13068 1.42165 -0.60041 58.18992 55.31540 130.77470
17.15000 -2562.08855 -3.67507 14.08252 59.19540 53.33245 130.10678
17.25000 -2561.42459 11.12788 37.86149 95.09086 57.92584 122.10783
17.35000 -2535.92581 -2.85924 27.07369 55.14454 52.48952 116.00492
17.45000 -2511.53603 -2.47924 9.52482 106.02738 69.02338 145.92156
17.55000 -2521.45693 46.29282 -1.67355 190.64431 337.11224 124.04828
17.65000 -2484.67179 3.73017 -1.40647 52.11013 57.64441 115.65441
17.75000 -2478.82183 -2.38089 13.84355 100.06156 70.37422 125.32249
17.85000 -2454.18641 -2.00412 10.56969 72.40320 54.96951 110.36302
17.95000 -2432.35414 -9.11574 37.02298 66.26584 47.94349 107.67058
18.05000 -2420.90787 1.52685 38.74380 46.42888 44.93928 104.42856
18.15000 -2412.53742 -6.40097 40.77604 78.32616 77.68367 125.96655
18.25000 -2399.75199 8.34832 47.59449 72.22269 54.23006 135.51645
18.35000 -2371.27283 4.88012 22.12879 106.88370 65.55717 174.92326
18.45000 -2367.22307 -1.89194 20.71018 35.97789 42.05432 94.12146
18.55000 -2359.21129 -1.18401 28.83675 40.89400 45.51369 106.69979
18.65000 -2347.50310 5.02025 7.97479 85.59391 78.09018 104.88020
18.75000 -2316.08708 -2.31478 8.90058 88.90495 47.22980 131.50065
18.85000 -2316.82194 8.23544 42.65016 77.46107 48.46117 114.70681
18.95000 -2304.37809 9.60605 21.00112 59.14196 95.16337 183.62758
19.05000 -2303.81920 21.13359 35.27083 74.26607 167.39984 148.58482
19.15000 -2274.28699 -12.79634 29.35841 52.19537 83.33495 98.08398
19.25000 -2263.06802 8.38231 9.43036 61.90478 49.73625 79.47023
19.35000 -2256.29377 5.65290 2.83924 47.68726 45.46487 90.27094
19.45000 -2239.49391 6.59352 21.34703 37.77730 41.88394 125.51831
19.55000 -2225.19222 2.73059 -10.60551 39.15832 45.82019 87.32612
19.65000 -2213.98607 2.26811 -11.47009 61.29956 39.75468 81.92522
19.75000 -2190.90498 7.63819 4.57630 28.74322 44.60796 74.03400
19.85000 -2184.76378 1.45221 -13.86811 33.86314 85.85568 88.04812
19.95000 -2169.39067 6.35083 -4.59219 44.70899 35.44563 78.76225
