0.05000 37063.94065
0.15000 37928.37143
0.25000 31704.39235
0.35000 26217.43681
0.45000 23377.64614
0.55000 19715.75031
0.65000 17531.31098
0.75000 15585.13121
0.85000 13884.95310
0.95000 12495.68059
1.05000 11328.07517
1.15000 10477.11705
1.25000 9538.39301
1.35000 8921.67505
1.45000 8440.67418
1.55000 7653.11166
1.65000 7490.90964
1.75000 6644.10390
1.85000 6571.46446
1.95000 6249.85481
2.05000 5853.31744
2.15000 5583.59569
2.25000 5401.64939
2.35000 5117.45799
2.45000 4845.71902
2.55000 4541.03502
2.65000 4270.24935
2.75000 4076.10170
2.85000 3761.66709
2.95000 3668.15185
3.05000 3506.41217
3.15000 3213.49048
3.25000 3136.25042
3.35000 3026.92854
3.45000 2870.42202
3.55000 2776.70896
3.65000 2734.71502
3.75000 2627.74087
3.85000 2552.31733
3.95000 2506.63692
4.05000 2414.34980
4.15000 2266.73442
4.25000 2217.86395
4.35000 2229.63570
4.45000 2125.21810
4.55000 2040.98830
4.65000 1963.80915
4.75000 1952.92977
4.85000 1844.54726
4.95000 1887.19276
5.05000 1769.73719
5.15000 1715.74747
5.25000 1719.85738
5.35000 1675.82923
5.45000 1629.32143
5.55000 1592.40969
5.65000 1520.54400
5.75000 1498.28691
5.85000 1464.32403
5.95000 1431.79122
6.05000 1353.17337
6.15000 1317.85200
6.25000 1280.03349
6.35000 1293.95929
6.45000 1235.85773
6.55000 1180.43089
6.65000 1167.65142
6.75000 1101.63670
6.85000 1090.38158
6.95000 1043.70806
7.05000 1027.63562
7.15000 1001.37175
7.25000 985.19179
7.35000 943.24540
7.45000 916.73218
7.55000 923.48793
7.65000 895.30748
7.75000 840.12660
7.85000 838.69902
7.95000 830.57712
8.05000 812.91880
8.15000 791.11572
8.25000 746.85963
8.35000 743.55442
8.45000 745.92965
8.55000 790.86285
8.65000 703.92679
8.75000 680.76669
8.85000 665.92901
8.95000 683.11459
9.05000 632.94819
9.15000 627.89595
9.25000 615.30468
9.35000 607.97194
9.45000 595.97731
9.55000 568.88340
9.65000 558.17519
9.75000 582.27822
9.85000 526.23210
9.95000 536.25288
10.05000 512.69534
10.15000 521.26877
10.25000 489.76553
10.35000 495.15544
10.45000 472.52670
10.55000 439.90407
10.65000 437.71192
10.75000 414.39949
10.85000 426.11133
10.95000 412.82078
11.05000 432.58230
11.15000 419.30571
11.25000 399.02404
11.35000 395.74037
11.45000 370.37731
11.55000 365.44143
11.65000 370.50358
11.75000 376.10965
11.85000 352.53337
11.95000 357.51031
12.05000 348.32130
12.15000 328.86498
12.25000 324.09784
12.35000 322.50847
12.45000 326.55605
12.55000 291.20406
12.65000 312.53384
12.75000 268.70079
12.85000 288.28700
12.95000 261.38373
13.05000 311.55124
13.15000 299.15882
13.25000 282.73292
13.35000 255.56667
13.45000 249.45522
13.55000 263.84073
13.65000 257.15032
13.75000 245.39530
13.85000 263.40685
13.95000 228.27090
14.05000 223.34565
14.15000 229.29631
14.25000 209.11229
14.35000 210.99396
14.45000 221.29038
14.55000 199.81404
14.65000 191.25581
14.75000 198.68466
14.85000 208.66117
14.95000 191.90033
15.05000 196.73506
15.15000 181.00032
15.25000 176.25894
15.35000 175.73378
15.45000 173.82457
15.55000 172.88387
15.65000 176.29638
15.75000 169.16310
15.85000 179.30372
15.95000 191.13273
16.05000 181.53341
16.15000 191.99005
16.25000 162.80603
16.35000 181.83001
16.45000 169.19418
16.55000 172.99448
16.65000 152.69966
16.75000 149.45050
16.85000 183.54173
16.95000 147.44953
17.05000 162.66158
17.15000 152.37980
17.25000 141.85328
17.35000 137.57216
17.45000 188.45165
17.55000 120.87938
17.65000 114.95737
17.75000 120.52972
17.85000 125.55021
17.95000 119.75693
18.05000 130.88383
18.15000 118.55644
18.25000 109.64083
18.35000 146.00407
18.45000 103.04573
18.55000 124.69653
18.65000 104.41751
18.75000 112.09776
18.85000 115.37443
18.95000 102.45069
19.05000 118.31531
19.15000 110.80895
19.25000 98.74000
19.35000 128.75105
19.45000 86.85575
19.55000 104.29244
19.65000 105.71669
19.75000 119.10631
19.85000 112.86964
19.95000 99.63636
