0.05000 -1836.16914 -111.21754 39942.29133 1743.53754 1514.38740 298620.35672
0.15000 -3649.73730 110.17699 -2660.28637 1714.58428 2224.87414 400859.22570
0.25000 -5192.90458 -23.59916 9460.39016 1596.62953 1432.94585 422399.46160
0.35000 -6151.16617 81.85066 -14248.93336 1979.07316 1321.71821 315738.03867
0.45000 -7002.86063 41.77881 -19568.24364 1848.00313 1245.04862 368220.88592
0.55000 -7466.41454 -2.18164 4165.30827 1869.18511 1177.70363 275380.10257
0.65000 -7748.16196 20.95058 5792.17047 1916.34954 1119.75592 296915.74260
0.75000 -8058.95925 22.60120 -11857.29427 1808.26656 952.32690 280755.12726
0.85000 -8364.02615 12.78426 3399.11823 1722.67518 970.86656 296238.12607
0.95000 -8527.04353 43.85392 5077.15895 1634.16065 905.39946 263252.41132
1.05000 -8569.27489 41.18974 4517.66960 1584.88452 891.62921 297912.16517
1.15000 -8653.03711 30.07951 3689.36683 1483.37487 881.90327 249386.12137
1.25000 -8706.48608 10.52052 2656.14389 1503.01400 768.12595 213264.32018
1.35000 -8762.11327 17.18995 -710.58742 1313.08639 764.40335 206613.26449
1.45000 -8767.54026 39.96599 4280.29954 1254.16126 781.29358 202765.81193
1.55000 -8813.90218 28.65533 3190.71876 1233.17815 905.13613 205872.33263
1.65000 -8796.88733 46.64783 4151.63674 1101.09130 701.12934 203233.86770
1.75000 -8694.74391 36.03726 -514.94875 1043.13393 750.88951 172070.08572
1.85000 -8659.74989 19.28234 -96.07679 1015.23271 628.10580 176406.10743
1.95000 -8620.86730 32.65754 4627.64011 913.22736 764.33004 178289.87282
2.05000 -8605.62327 23.13405 1203.66632 944.85362 673.83060 164541.90623
2.15000 -8558.98438 32.97811 1957.26005 754.05881 694.86258 167073.26596
2.25000 -8534.74795 38.38300 1784.18639 760.48883 571.93627 161749.31965
2.35000 -8513.65666 24.80605 142.03406 777.73913 631.83430 141314.64116
2.45000 -8460.96539 32.30143 49.86418 760.32101 595.99302 137021.40332
2.55000 -8407.87235 33.25673 2336.94848 738.06740 751.78137 129232.83895
2.65000 -8331.95300 21.68564 4112.63301 634.44273 509.95928 127407.94037
2.75000 -8300.73515 27.90455 1194.85731 594.32376 476.85082 118863.56645
2.85000 -8255.39470 18.97274 3105.08358 551.67242 537.40428 123576.73042
2.95000 -8203.56424 24.27326 846.79175 652.93321 581.10118 115098.77594
3.05000 -8118.20805 17.73634 320.21246 605.01862 541.91684 116079.83956
3.15000 -8049.70466 17.19473 552.02228 618.34541 470.98091 99582.89776
3.25000 -7976.22594 22.91735 -2081.48023 517.00550 491.49499 103706.64824
3.35000 -7927.60519 13.31157 -1081.25070 506.76013 448.51083 99041.56803
3.45000 -7853.01623 17.29239 580.33613 481.35200 377.75807 90491.81166
3.55000 -7768.96708 21.96996 924.45725 518.33918 389.72376 84897.09478
3.65000 -7696.33877 26.99681 62.16872 490.41637 436.56276 82705.45926
3.75000 -7628.77595 19.08900 945.48124 515.95365 516.67206 86371.49250
3.85000 -7574.42091 28.90873 389.62151 451.86803 423.02298 84708.73594
3.95000 -7515.44238 19.76137 1446.28870 479.57063 441.93276 70604.15151
4.05000 -7454.27486 28.89746 16.55169 464.82858 439.51468 72011.99201
4.15000 -7396.87965 28.66323 -194.18682 370.41780 366.77117 68446.25369
4.25000 -7327.96339 30.40218 -79.59284 394.40623 451.03580 65607.09539
4.35000 -7271.64211 34.43145 -918.95229 415.26278 360.27808 63240.11577
4.45000 -7199.58198 24.49855 -685.46704 347.43980 350.49517 64341.32231
4.55000 -7141.18088 25.45883 386.80036 336.27649 417.01586 58874.32345
4.65000 -7087.65808 25.52652 346.41502 364.05437 418.21535 68051.13184
4.75000 -7031.06315 30.30192 310.63063 368.82443 316.77813 63474.66620
4.85000 -6975.78090 29.17610 966.19138 358.70118 326.33782 70657.72869
4.95000 -6931.57965 27.77301 1044.34934 310.16126 289.39069 51014.03442
5.05000 -6876.57019 31.98266 297.02802 307.97500 279.94227 54368.07560
5.15000 -6825.74122 26.85472 -669.74601 352.13694 313.81576 83062.00212
5.25000 -6781.53404 25.20055 -425.95439 303.92024 366.15639 51476.55647
5.35000 -6747.32534 23.86341 558.49612 397.04351 301.82684 43829.50442
5.45000 -6707.89739 32.08249 283.06249 280.44951 297.06820 59820.86288
5.55000 -6656.17650 25.67921 228.44369 297.00181 292.31276 40043.95904
5.65000 -6615.35963 27.81310 841.17354 387.86452 268.82481 42671.66613
5.75000 -6562.44230 28.46629 1615.93384 255.72552 267.98820 42823.94098
5.85000 -6509.36684 32.12200 470.48701 314.17877 273.32407 38980.98148
5.95000 -6470.35686 28.09622 -239.07554 281.50208 270.74871 34572.09475
6.05000 -6417.39075 28.91140 118.56074 280.88572 264.70019 36293.96696
6.15000 -6372.54360 23.97571 432.23070 267.97524 278.39742 47599.27573
6.25000 -6318.03915 20.57765 -455.78278 264.99831 259.39175 36085.25218
6.35000 -6262.27703 23.09278 -813.98250 259.94041 245.93475 58172.11962
6.45000 -6203.39325 21.75917 -305.04980 251.15771 265.89122 28850.66460
6.55000 -6139.28616 29.35094 -977.37820 234.77284 233.00693 63613.91825
6.65000 -6078.41594 21.37618 -487.23251 221.07247 239.21683 62269.39494
6.75000 -6015.39715 28.27419 334.43883 190.71649 202.74449 27076.32260
6.85000 -5951.94637 23.68120 -72.44576 252.95101 215.46032 29864.75969
6.95000 -5888.09440 26.81517 76.84441 231.73144 223.25903 24229.02194
7.05000 -5833.83863 27.90071 67.47490 195.90879 223.27801 25041.88174
7.15000 -5782.89475 19.01156 60.29736 189.53395 309.57382 24608.93844
7.25000 -5723.78120 20.65460 -270.99667 223.75452 204.34872 23889.66533
7.35000 -5679.63576 18.87128 344.48057 207.41855 191.45047 22063.51058
7.45000 -5639.72768 19.76367 113.50429 201.64201 205.45079 22441.11923
7.55000 -5596.70568 20.53357 -1127.52801 280.53973 247.27660 36649.72834
7.65000 -5565.81650 22.39961 -705.55775 207.35573 208.92898 20571.70197
7.75000 -5524.59968 18.75142 40.78975 247.72703 213.85090 18029.19412
7.85000 -5492.81087 18.05504 -501.94022 207.11134 215.50650 17907.79102
7.95000 -5469.18725 16.64448 -180.04023 292.47662 217.09205 17055.68666
8.05000 -5425.72226 16.64527 -20.61558 207.22456 301.27963 21329.44458
8.15000 -5382.09055 20.69016 -628.16514 167.64926 166.88257 17613.76748
8.25000 -5339.45640 16.77985 -430.83067 190.57639 202.66184 16137.76821
8.35000 -5289.97993 15.23103 -210.49846 181.09425 173.00096 18761.12860
8.45000 -5247.94743 14.07051 247.66443 184.86363 178.12310 17464.13896
8.55000 -5197.07804 19.71732 -564.47796 176.26897 183.24485 27564.78523
8.65000 -5144.34723 16.15442 110.16079 175.10589 165.62431 14527.88800
8.75000 -5090.16369 15.08895 -544.37954 171.51872 155.48268 15854.13789
8.85000 -5036.79235 15.88765 111.17919 168.02771 157.40050 15415.88780
8.95000 -4974.68589 17.83253 -59.17100 161.46627 171.62281 13261.53166
9.05000 -4922.46003 14.24127 -223.27133 153.88678 142.23688 13180.23012
9.15000 -4863.16547 9.31761 55.27030 209.83121 168.49310 13525.14313
9.25000 -4811.91060 13.73637 103.55755 135.00472 145.11633 14151.95447
9.35000 -4758.24386 13.42259 -203.26512 130.59758 124.94412 12389.37053
9.45000 -4698.08950 17.42602 -460.21552 159.64434 120.92453 12136.41204
9.55000 -4643.86326 14.63471 -43.53228 192.74808 191.68364 11576.13431
9.65000 -4597.67329 13.10073 107.50329 173.49747 148.62830 11856.31103
9.75000 -4552.88362 12.47297 -77.75698 159.21006 202.33883 14646.76637
9.85000 -4513.31447 13.96184 -79.82520 123.94097 148.86703 10667.62526
9.95000 -4467.27891 14.12079 -83.73109 178.44859 132.76859 10369.30687
10.05000 -4426.75174 10.70276 101.35048 320.84236 291.23120 9899.07793
10.15000 -4394.94458 9.54974 -140.83650 140.65781 182.64219 9090.70291
10.25000 -4357.52396 14.91700 -37.73195 135.56088 151.47940 9139.06034
10.35000 -4320.17487 7.80651 797.53101 133.90304 121.81909 41587.01934
10.45000 -4282.97245 10.14538 -208.06778 148.84523 135.48514 8053.92832
10.55000 -4252.54619 9.87951 -62.37702 158.33892 154.71955 7398.87936
10.65000 -4225.21964 10.51507 63.23527 133.66490 129.55166 7483.90717
10.75000 -4196.60710 11.30821 227.59957 157.87540 200.69947 7555.38491
10.85000 -4172.44047 9.79228 344.04501 107.81100 105.33345 14567.03651
10.95000 -4145.20364 7.22742 -199.79909 166.12790 134.44835 6158.33721
11.05000 -4107.70989 17.15063 78.91710 194.37185 166.45083 6495.13309
11.15000 -4081.47610 17.37454 50.93096 136.03005 145.59090 5913.03173
11.25000 -4053.42237 9.21183 -53.76454 117.66635 112.83044 7487.87261
11.35000 -4025.50606 14.43268 -141.74821 117.30209 99.36372 5762.00223
11.45000 -3999.47581 10.00335 83.19170 133.29446 134.33427 5957.92784
11.55000 -3972.87866 8.43128 953.92808 118.73581 112.17812 40767.75883
11.65000 -3936.61909 9.88582 145.01191 137.50906 141.69712 5311.56814
11.75000 -3905.11003 7.43932 -86.90477 178.79283 138.42185 6682.69188
11.85000 -3868.57706 4.13547 54.61378 165.88708 118.43190 6368.47345
11.95000 -3844.08915 10.25401 54.54481 145.16545 151.63114 6876.01652
12.05000 -3820.50733 9.28954 -133.91733 136.42357 153.44436 6292.24418
12.15000 -3789.27259 8.90124 -15.49249 114.24983 85.39057 5436.99436
12.25000 -3759.51909 10.95963 -138.02863 143.72679 129.38459 5966.91826
12.35000 -3728.37888 8.58816 -163.95287 109.62154 112.58607 5244.63445
12.45000 -3704.05860 9.04588 144.78319 95.52798 116.77924 4398.48209
12.55000 -3674.24936 9.80476 199.12595 119.64964 91.63203 4729.06926
12.65000 -3649.15434 10.03648 -106.99399 103.45202 134.28387 5776.07841
12.75000 -3627.36786 8.27422 33.38362 117.30604 119.71481 5536.67739
12.85000 -3592.13980 -1.43144 84.26528 126.20426 239.60137 4917.15689
12.95000 -3566.05970 7.39316 16.71675 108.86581 86.05816 4488.71385
13.05000 -3544.58058 9.66656 48.54664 145.83823 128.50471 4324.18846
13.15000 -3519.93420 7.11605 146.55452 98.26257 86.65860 3944.73456
13.25000 -3491.98328 11.68990 -33.14869 88.33391 82.47615 4940.47849
13.35000 -3467.85083 8.36721 -155.88241 109.39572 112.90666 3692.95989
13.45000 -3438.50370 7.85434 43.76401 114.14327 71.37790 4069.77929
13.55000 -3414.43120 7.11908 116.15538 101.97455 96.88891 3582.39339
13.65000 -3391.83982 8.26327 97.81572 91.71636 145.24990 3794.39152
13.75000 -3359.69544 3.42871 97.75001 121.20323 127.49061 3480.93520
13.85000 -3333.02388 6.04583 -22.01877 129.94322 80.50385 4944.73268
13.95000 -3308.62672 3.88838 78.12122 112.15627 79.15785 3919.97951
14.05000 -3291.61773 -4.94620 60.39360 119.70740 205.60932 4251.44422
14.15000 -3259.53548 9.18507 67.67773 180.91672 126.59902 3651.70629
14.25000 -3230.49549 3.72421 288.20814 134.08823 110.78659 3218.88911
14.35000 -3211.82329 7.31713 -29.89428 58.41114 67.22373 4117.39522
14.45000 -3181.82477 7.30073 88.02112 89.76994 69.39302 2685.80848
14.55000 -3153.30652 8.06906 -53.43846 58.17173 62.92355 2419.26762
14.65000 -3128.33182 6.03381 187.84910 60.27861 61.47377 3519.23105
14.75000 -3112.13691 7.52855 -8.23745 98.99726 97.29733 2283.00609
14.85000 -3089.64741 4.95231 55.10477 82.64504 57.83532 1909.22669
14.95000 -3059.55772 6.98750 -143.02356 86.14862 69.60016 3351.50015
15.05000 -3034.81454 7.16500 -2.98838 80.37265 88.17828 2663.88312
15.15000 -3012.96794 5.67381 12.92258 207.89641 153.54774 2029.32650
15.25000 -2996.37171 4.75483 106.89127 107.48320 49.58302 2657.45421
15.35000 -2977.80145 2.22673 104.04456 69.82609 82.97927 2483.19314
15.45000 -2953.23705 8.49599 -23.54677 80.55549 92.85585 2411.57579
15.55000 -2932.32410 3.73009 -17.35231 75.78592 115.45530 2219.86419
15.65000 -2914.22322 1.49834 -105.91376 79.50670 107.25225 2185.49019
15.75000 -2892.91270 4.52760 59.46279 61.75491 54.35293 1790.43999
15.85000 -2874.84489 1.90052 54.93777 64.21103 142.24571 2496.78217
15.95000 -2852.78070 4.20070 23.89904 80.15981 65.09893 1555.55843
16.05000 -2833.80600 6.06664 75.51863 89.92071 46.81369 2605.23322
16.15000 -2814.09337 8.19181 -0.17120 77.15754 64.79746 1506.47283
16.25000 -2795.43863 4.26654 -71.32828 75.98641 51.94742 1460.08470
16.35000 -2776.29178 5.62306 10.98411 72.59220 49.49757 1681.64996
16.45000 -2758.69918 9.32577 -27.74300 51.06575 46.01561 1226.47437
16.55000 -2740.82149 5.09576 -13.56929 71.46824 65.09838 1204.87480
16.65000 -2727.00332 6.26452 -98.65076 133.69971 64.64421 1795.93405
16.75000 -2706.83003 3.95608 -104.98803 61.49265 58.04450 1311.35107
16.85000 -2688.98396 5.80598 15.71652 58.60943 52.96359 1142.65596
16.95000 -2674.07313 7.58261 -37.87169 83.59124 60.09481 1475.91084
17.05000 -2652.83606 -1.71061 75.13694 180.62337 146.65949 1911.29037
17.15000 -2640.58597 2.52435 -31.94621 39.67927 56.58648 1455.35207
17.25000 -2621.85380 6.32147 1.37733 50.51971 58.70423 1629.12476
17.35000 -2593.07041 12.63727 -77.68608 235.69993 122.40472 1782.71957
17.45000 -2591.03100 4.84153 -31.70264 50.98401 45.18704 1783.98578
17.55000 -2579.17976 5.73727 71.20029 43.60250 42.59277 1549.64838
17.65000 -2565.59421 5.73833 -9.96136 64.40692 59.79513 980.48489
17.75000 -2548.88391 2.40957 -12.89495 59.30614 41.73358 1392.26163
17.85000 -2534.29764 6.20333 -49.91320 60.87604 70.51235 1326.48790
17.95000 -2520.08403 1.09106 -130.76520 136.20061 79.53494 1633.23947
18.05000 -2492.58199 -3.52761 -170.09965 92.19190 130.39520 1457.13021
18.15000 -2485.42610 9.59467 8.35618 42.52904 45.27291 915.15284
18.25000 -2472.43535 -0.88804 -19.28011 69.59059 90.38759 1770.07421
18.35000 -2454.61886 6.58213 19.69078 42.16875 49.54580 846.67353
18.45000 -2436.00981 10.34906 -84.67595 63.87215 50.79670 835.85191
18.55000 -2422.18038 2.45114 -2.66181 48.63254 36.88942 1422.51412
18.65000 -2409.92104 7.22197 8.30751 40.70854 47.79127 1410.59298
18.75000 -2391.69296 -9.54759 9.18066 95.55113 216.97016 1072.62948
18.85000 -2382.91769 2.87803 58.39522 37.75126 37.68240 1144.66247
18.95000 -2368.02914 3.93624 -7.39261 48.14363 40.87995 605.12869
19.05000 -2355.16438 5.22526 -40.58061 44.39376 35.29399 1494.14984
19.15000 -2339.42829 4.39395 -67.59695 34.25577 41.17204 1290.32118
19.25000 -2330.34865 7.08682 105.10265 80.59397 39.42717 1313.47305
19.35000 -2309.76622 4.05242 78.08738 57.39899 51.02974 948.69251
19.45000 -2304.83177 12.00549 -40.07081 69.83239 220.34228 1048.98124
19.55000 -2285.28930 6.42350 36.09428 50.20828 33.02870 784.57988
19.65000 -2278.40267 1.90519 43.64324 90.47105 59.95024 814.12998
19.75000 -2259.55214 6.18530 -73.49985 33.73976 38.53575 1075.48867
19.85000 -2250.25969 2.30477 -9.55347 54.12707 83.51964 1066.91411
19.95000 -2238.06022 3.56892 -2.75902 33.27395 39.43946 918.12192
