0.2 0.7812 18.03892 -0.12724 112.94602 112.46082 92.37318
0.6 0.99591 38.43028 0.25294 113.41972 106.30072 88.54946
1.0 -0.11845 57.16927 0.9399 112.49939 97.04529 84.86679
1.4 0.65838 67.70439 0.51108 110.32446 90.58885 80.83197
1.8 -0.89088 76.83104 0.42447 108.43153 86.3733 77.14512
2.2 -0.57715 83.8885 0.38485 106.55739 83.25389 73.89605
2.6 -0.30494 90.84564 -0.12311 103.82812 80.52932 70.40102
3.0 0.26429 96.18998 0.39631 100.63031 76.47805 67.032
3.4 0.70159 100.87801 1.02651 95.93466 73.05309 63.01128
3.8 0.70669 106.38491 0.65815 89.6385 70.95658 60.41623
4.2 1.83577 113.54818 0.15863 83.92102 69.36866 57.5814
4.6 2.24053 120.07803 -0.66638 78.51264 67.62005 54.6167
5.0 2.41627 130.06303 -0.75602 72.10876 65.34703 50.93065
5.4 2.04042 139.36392 -0.53413 66.24827 63.32633 48.41184
5.8 0.44644 150.97727 -0.84719 61.78034 60.42873 45.05195
6.2 -0.02058 160.91375 -1.11919 56.46113 55.26644 42.85444
6.6 -1.94749 168.2506 -0.78085 51.80715 51.10791 39.80648
7.0 -2.37139 173.45527 -0.74061 47.56159 47.52535 37.08594
7.4 -2.73348 180.05215 0.28136 43.70038 42.14418 34.62792
7.8 -2.82815 184.89336 -0.28036 40.47285 37.47157 32.67513
8.2 -2.15105 189.22929 -0.07388 38.47308 33.43201 30.38709
8.6 -2.4276 191.70537 -0.04335 36.85707 31.3217 28.83541
9.0 -2.06803 193.49825 0.16907 35.54527 29.89945 27.2041
9.4 -1.96568 196.30369 0.41703 34.50804 28.69666 26.24879
9.8 -1.97883 198.1563 0.04396 33.19881 26.85215 24.87584
10.2 -1.70627 198.64246 0.28899 32.38285 25.46509 23.78616
10.6 -1.05298 199.41299 0.5028 31.78152 24.07534 23.04685
11.0 -0.11798 200.60612 0.79587 30.63514 23.39133 22.41856
11.4 0.08903 201.9249 0.33382 29.62383 22.61371 21.46202
11.8 0.32053 202.76368 0.62897 28.67188 22.2999 20.54543
12.2 0.6678 204.02696 0.2126 27.54673 21.62179 19.54797
12.6 0.55553 203.93706 0.34159 26.55647 21.52161 18.81292
13.0 0.70274 205.46881 -0.26152 24.96386 20.76825 18.40226
13.4 0.78798 206.19721 -0.84935 24.97104 20.65424 17.71683
13.8 0.15657 206.5575 -1.24256 23.64543 19.76028 17.0893
14.2 0.16795 208.11359 -1.61576 22.81141 17.98093 16.77512
14.6 0.55295 208.98927 -1.75734 21.66412 16.8685 16.30463
15.0 1.13348 208.6503 -1.68889 20.5136 16.39133 15.62028
15.4 1.27169 209.09369 -1.87177 20.06204 16.29624 15.65933
15.8 1.36912 210.09055 -1.36122 19.62042 16.16054 15.35702
16.2 1.37883 210.55724 -0.78669 18.99777 16.07425 15.14155
16.6 1.68267 211.37937 -0.61749 18.89872 15.54968 14.60562
17.0 1.45818 211.89891 -0.0295 18.34964 14.06736 14.5907
17.4 1.12491 211.57747 -0.08633 18.30791 13.38262 14.48722
17.8 0.79806 211.18957 -0.30842 18.06277 11.80173 14.16487
18.2 0.927 210.27808 0.00398 17.70013 11.41576 13.8234
18.6 0.52613 209.71279 0.22991 17.12557 10.88469 13.76889
19.0 0.27798 208.66008 -0.09198 16.88662 11.58408 13.24265
19.4 0.60777 208.00818 0.27227 16.29293 11.64828 12.74163
19.8 0.78201 207.71533 0.03039 15.94763 12.12519 12.55318
