0.05000 -6911.04857 1696.27389 -3287.79375 6752.13780 7993.10948 7151.89608
0.15000 -8993.28230 -101.58274 -1013.41789 5636.31838 5507.30300 10863.86151
0.25000 -11649.75651 142.04532 654.61346 5723.31370 5273.72561 12289.76430
0.35000 -12513.40203 -16.39905 314.75989 4901.23346 4087.24809 12454.79592
0.45000 -12554.31346 3.73369 323.58835 4644.99636 3486.58577 12103.54088
0.55000 -12237.26777 29.10143 266.37177 4001.78471 2778.38377 11818.44461
0.65000 -11934.15552 -33.26357 285.69264 3686.03080 2790.93650 11151.45520
0.75000 -11570.42785 13.05271 -107.43138 3567.77249 2436.68744 10563.52731
0.85000 -11214.95341 10.84621 5.17267 3372.78027 2306.73368 10134.04225
0.95000 -10908.06739 10.53891 -8.77199 3008.85384 2202.52041 9568.61087
1.05000 -10547.46811 19.88519 231.61373 2805.43221 2059.55942 9160.75572
1.15000 -10283.63738 18.24647 279.49722 2616.66641 2157.67738 8608.72358
1.25000 -10062.78500 23.22876 267.19342 2647.70658 2056.54293 8331.85912
1.35000 -9833.64810 -38.33385 28.25034 2158.05613 1758.76939 7835.33410
1.45000 -9502.28129 23.23817 -10.23201 2127.54264 1818.72986 7574.58528
1.55000 -9365.18834 -6.05705 50.99753 1995.66475 1690.08822 7137.35322
1.65000 -9202.13798 46.63501 89.00555 2067.00520 1832.27699 6970.33362
1.75000 -8996.29471 -39.14901 60.10636 1654.53842 1556.65636 6582.73734
1.85000 -8851.45851 -17.13681 196.72746 1594.99078 1434.75798 6277.66168
1.95000 -8705.76034 -21.22740 254.41718 1534.77503 1370.68209 6103.76204
2.05000 -8574.65956 -36.52400 121.40021 1430.73551 1368.51458 5906.65959
2.15000 -8453.14649 -41.65038 116.51335 1299.81533 1243.84679 5672.68491
2.25000 -8381.63368 -70.33669 79.33745 1227.64503 1322.47166 5434.58431
2.35000 -8333.70649 -9.41381 49.71464 1243.04957 1260.02893 5221.35007
2.45000 -8208.80699 -33.94360 19.48525 1149.64602 1146.88430 5050.79587
2.55000 -8141.99080 -17.03462 83.95872 1289.29040 1072.51727 4858.71903
2.65000 -8002.82333 -29.50918 -42.19670 1212.57356 1034.58886 4807.35527
2.75000 -7971.29264 -27.32200 -67.26603 1197.21128 1087.99805 4567.99960
2.85000 -7917.47447 -2.63185 59.88790 1101.58888 944.23431 4436.11602
2.95000 -7881.38386 5.59679 -21.29102 954.71558 933.38169 4310.04543
3.05000 -7805.93794 1.12592 -44.09993 1109.12982 1022.91940 4182.36135
3.15000 -7736.04860 0.31651 -36.51170 890.49704 833.21839 4049.92330
3.25000 -7671.20608 -3.14482 -15.04474 894.71935 872.81799 3960.64711
3.35000 -7633.27099 -1.27647 58.34876 887.18140 785.68199 3839.82921
3.45000 -7563.60957 7.86198 -69.94642 892.14766 847.32363 3762.66431
3.55000 -7505.77997 18.95790 4.64291 1082.38820 1017.08518 3647.84051
3.65000 -7488.60389 8.93625 -61.08386 1145.05701 705.24892 3511.46831
3.75000 -7408.80126 10.36586 -73.12893 981.16725 738.05837 3446.33001
3.85000 -7375.74339 15.55638 -47.67665 741.49064 774.14457 3327.05997
3.95000 -7334.98910 1.62968 -62.88112 1010.79491 662.74690 3227.77031
4.05000 -7247.22024 5.90744 -59.72538 835.01807 606.26311 3260.05494
4.15000 -7204.37672 9.51960 -58.63215 743.98792 577.28126 3083.46504
4.25000 -7160.24569 6.45485 -82.90736 717.64482 578.25513 2981.17393
4.35000 -7120.09310 10.25966 -114.83288 664.62532 543.73672 2881.09696
4.45000 -7055.02850 0.54305 6.18104 923.59787 563.77255 2865.50646
4.55000 -6998.96247 2.11003 -45.60578 699.74121 701.99909 2789.48798
4.65000 -6965.31386 0.92389 3.09496 685.84080 545.86057 2709.63299
4.75000 -6926.90961 -6.38494 -18.86860 612.80586 478.18260 2628.83332
4.85000 -6880.16530 3.50511 -22.30311 846.42081 552.69146 2612.46820
4.95000 -6830.25964 2.84355 -13.25029 582.73323 470.25857 2498.50194
5.05000 -6777.48225 4.08748 44.31382 576.32769 420.50939 2441.93625
5.15000 -6723.48513 1.04643 -45.96560 574.28306 531.58449 2392.78938
5.25000 -6676.08135 -8.17437 24.90210 506.26082 504.16998 2331.52218
5.35000 -6614.47469 0.95339 -27.20018 549.82390 461.17522 2320.03049
5.45000 -6547.65183 -0.10683 -27.33151 497.71287 408.49019 2234.11246
5.55000 -6501.86320 0.50354 -22.56097 501.32686 348.07551 2242.68565
5.65000 -6462.42424 -0.74043 -11.90642 496.59807 334.03725 2117.28029
5.75000 -6410.40888 4.51993 22.82970 569.70730 371.10056 2082.37611
5.85000 -6338.48838 -0.58221 -29.93084 498.14003 387.32912 2083.17686
5.95000 -6288.98792 0.05495 6.20211 498.87310 470.67410 1977.54590
6.05000 -6228.66510 5.26664 -32.11776 433.86852 333.97344 1963.43659
6.15000 -6176.92554 6.07124 -0.49126 472.60485 581.42146 1994.00961
6.25000 -6135.22629 2.70866 -40.24109 608.85977 785.09827 1888.27780
6.35000 -6089.37877 1.34728 -0.29479 397.31920 347.04976 1784.42301
6.45000 -6049.18722 -5.10286 7.63083 356.48329 277.93441 1754.26596
6.55000 -5992.54785 -5.38967 -0.20627 485.63166 491.11195 1744.17159
6.65000 -5938.99689 1.03245 -17.11151 500.27707 286.38174 1702.92042
6.75000 -5887.95013 1.11602 -20.37833 464.46837 361.55153 1673.04970
6.85000 -5843.78727 6.55288 1.11666 383.58829 262.75176 1630.15090
6.95000 -5812.93320 3.10363 -11.16295 447.46827 342.44325 1647.37023
7.05000 -5742.45815 -2.61047 8.21048 524.49709 356.10693 1568.08726
7.15000 -5709.52393 3.61213 23.25113 373.07222 441.71928 1534.24093
7.25000 -5669.11951 -0.35339 -41.40431 384.02158 319.05135 1506.69665
7.35000 -5620.08027 -0.28941 -22.74040 284.37724 240.34807 1451.52297
7.45000 -5568.81147 -3.45731 -12.82308 320.78861 291.17253 1449.65582
7.55000 -5525.52652 11.43349 9.51279 340.55748 302.32333 1405.45259
7.65000 -5466.97098 -2.07087 -16.70835 452.77804 319.09166 1395.39246
7.75000 -5436.53345 3.29023 -3.98116 378.11441 298.56959 1376.59296
7.85000 -5403.15520 -1.44064 -16.51561 405.99571 323.47172 1323.12002
7.95000 -5358.82082 4.73146 -7.13421 350.94096 271.53403 1303.57089
8.05000 -5317.05643 2.57866 -10.92878 294.10036 249.60745 1279.93750
8.15000 -5291.11292 6.11109 11.17222 263.90058 262.03714 1225.53773
8.25000 -5240.09773 1.46576 36.22475 248.16633 180.17998 1212.27183
8.35000 -5202.10781 6.08807 -14.07995 343.97247 331.25072 1193.13388
8.45000 -5173.63162 -11.09226 -15.00426 284.84426 787.83385 1192.94033
8.55000 -5134.63766 -1.81204 -14.43351 268.29350 205.17786 1144.38049
8.65000 -5090.16656 5.79788 -24.27751 544.95339 249.16114 1148.76858
8.75000 -5062.08393 6.50387 13.03322 389.25667 268.37303 1244.22498
8.85000 -5038.24118 3.99577 -16.34715 265.67456 250.50777 1098.38328
8.95000 -4991.04833 5.43500 1.98090 257.02380 196.87961 1059.46074
9.05000 -4958.23426 4.13260 8.13227 310.32901 359.77155 1014.78797
9.15000 -4908.06037 6.99332 2.46464 413.59107 236.70343 1071.01401
9.25000 -4877.66621 4.92636 3.35373 263.16649 241.76007 1002.61014
9.35000 -4839.90101 2.85078 -5.39050 288.99373 276.23460 986.44240
9.45000 -4801.49733 1.82185 -9.31155 246.24806 179.73740 941.53411
9.55000 -4765.17611 3.99148 -1.20794 207.15553 174.75066 932.87926
9.65000 -4732.27173 -0.54786 -36.89541 250.82253 166.99702 912.01975
9.75000 -4700.45096 4.61288 -17.00122 207.89817 201.30502 887.98565
9.85000 -4658.73675 6.77155 2.83906 208.26315 163.75774 883.37082
9.95000 -4626.51068 -14.69461 -29.66210 239.88096 659.12341 877.14130
10.05000 -4601.48283 2.19479 -37.13411 195.22645 186.24277 838.69794
10.15000 -4568.01829 3.18697 0.31370 310.75157 220.19500 1089.31530
10.25000 -4534.95333 3.17405 -38.23024 383.67459 133.97840 1228.87428
10.35000 -4494.44904 2.73952 -23.06703 203.16169 158.02223 794.46659
10.45000 -4461.04755 10.01301 -39.99255 192.89058 234.39992 953.65428
10.55000 -4417.73708 0.63261 11.99711 197.86473 186.31768 762.40519
10.65000 -4383.53566 5.64288 -30.79690 150.96699 127.69865 742.92713
10.75000 -4353.58787 6.03661 -60.61302 187.28379 141.52985 729.46896
10.85000 -4316.12622 6.67900 -24.87421 175.29208 121.54766 722.38358
10.95000 -4289.96833 8.01930 -41.15477 186.72889 136.76446 707.45482
11.05000 -4250.56119 2.82571 -6.52567 222.29372 172.06848 723.77626
11.15000 -4220.74019 8.11615 -28.06673 400.86721 304.31379 908.24172
11.25000 -4198.75993 7.74734 -38.62523 161.37028 141.50999 662.27055
11.35000 -4166.83231 13.14189 -31.62307 176.65312 410.68508 698.34536
11.45000 -4132.15207 9.95447 -15.98963 213.27096 166.10390 639.76502
11.55000 -4105.90169 8.70886 -6.23901 177.41060 172.41451 636.43310
11.65000 -4074.91095 10.73179 -9.07353 173.85229 158.72998 612.48712
11.75000 -4045.80063 6.10898 -22.45145 137.46211 145.48266 597.32549
11.85000 -4013.83101 5.64308 -28.66684 192.70029 112.09966 591.61827
11.95000 -3981.40360 6.12557 -15.20744 139.61030 124.45762 595.58855
12.05000 -3957.67491 5.37689 2.09412 164.35090 127.91989 576.04778
12.15000 -3926.94940 7.57888 -44.94050 177.78390 168.25195 559.35947
12.25000 -3901.23038 3.08931 -24.17643 181.49740 166.36957 556.46792
12.35000 -3869.06809 4.65572 -33.60316 263.23895 196.41220 544.22225
12.45000 -3847.16341 6.68972 -31.55704 137.31111 99.11821 508.54992
12.55000 -3817.64223 8.30254 -24.11681 120.79525 126.62715 522.31549
12.65000 -3788.65048 4.45123 -19.36827 161.51589 136.51627 509.51945
12.75000 -3761.83703 6.71923 -45.00431 116.50965 86.63972 489.50287
12.85000 -3734.66590 5.89777 -37.88477 119.04416 164.47980 551.66876
12.95000 -3717.94849 5.60853 -34.32050 540.23235 212.00928 765.98060
13.05000 -3682.40134 3.40991 -22.52974 100.07358 105.17372 460.50646
13.15000 -3659.14201 5.45929 -25.29530 94.82847 76.03488 448.05622
13.25000 -3627.70115 7.42100 -22.45484 125.68181 169.66471 443.61907
13.35000 -3604.48888 2.46730 -31.54288 108.99533 108.07267 430.91345
13.45000 -3583.83343 5.49262 -10.21622 160.26014 96.84968 432.93172
13.55000 -3556.53589 5.50447 -36.78698 112.18759 95.00625 420.88577
13.65000 -3529.32266 5.05499 -26.95600 105.17543 107.31866 405.34047
13.75000 -3505.04755 2.47574 -18.76836 134.73525 171.76087 412.42276
13.85000 -3480.03033 5.05250 -43.62295 104.19002 108.94298 404.13270
13.95000 -3451.57595 5.83847 -35.56195 103.34500 110.02141 395.88657
14.05000 -3427.76429 4.37250 -43.55150 76.51378 86.90673 379.18431
14.15000 -3398.40703 4.68139 -35.80290 223.44459 155.20160 364.91995
14.25000 -3381.99020 3.47778 -30.72319 226.83556 190.66949 371.56269
14.35000 -3357.02310 5.48405 -33.12964 71.90106 86.94354 359.30888
14.45000 -3335.65217 7.26970 -37.73314 194.76201 106.57122 363.08508
14.55000 -3304.39456 8.79357 -33.80516 175.28081 202.13285 386.67372
14.65000 -3289.90570 4.04611 -16.41143 154.37590 174.33827 365.86788
14.75000 -3260.83402 5.39011 -3.09507 86.50436 70.72644 343.74960
14.85000 -3238.73611 4.88675 -16.95487 82.72809 79.87506 333.71985
14.95000 -3218.33232 7.66765 -24.04243 99.79400 70.43785 341.33551
15.05000 -3200.28758 4.73127 -21.51593 73.00542 79.69494 321.43258
15.15000 -3173.14838 3.94859 -11.34070 95.61940 113.84078 317.90335
15.25000 -3157.11558 5.27613 -6.23258 67.53702 64.39870 312.52751
15.35000 -3136.47766 0.56853 -19.09370 96.60498 172.63572 345.30398
15.45000 -3113.48765 1.86147 -23.99584 68.65311 75.98037 314.58573
15.55000 -3087.49643 9.46559 -17.31029 69.16275 83.31380 292.63422
15.65000 -3071.34382 1.62395 -41.02062 87.17575 86.70130 291.86923
15.75000 -3046.52233 0.34836 -18.89318 64.06421 59.10068 295.56113
15.85000 -3024.28795 5.11022 -17.34497 71.29794 83.35902 289.28836
15.95000 -3003.61947 2.12471 -13.99943 117.98048 83.62787 284.65474
16.05000 -2989.64839 3.35316 -22.12186 62.48664 48.51766 268.32408
16.15000 -2967.97331 0.86970 -33.59259 68.59372 86.78065 263.85336
16.25000 -2946.95070 0.74480 -28.05070 159.75317 116.00969 286.24897
16.35000 -2926.82329 4.21014 -22.07211 68.55579 104.23389 265.48041
16.45000 -2908.83500 4.49341 -29.89817 72.17850 88.32835 252.12851
16.55000 -2888.37033 0.96878 -34.24456 226.42037 148.11444 264.85715
16.65000 -2868.02389 5.82770 -32.55131 64.55904 62.60118 250.11329
16.75000 -2843.19965 6.55692 -34.64040 144.58983 157.71524 270.34251
16.85000 -2827.61939 1.76609 -45.72160 67.71174 93.85135 248.33956
16.95000 -2817.07687 3.97093 -33.45457 225.38278 60.90838 236.01034
17.05000 -2796.16137 5.90567 -37.77019 80.30098 119.26393 237.86232
17.15000 -2775.43144 3.19934 -49.98745 49.10289 48.31087 220.07398
17.25000 -2750.87961 5.03426 -36.74395 178.64928 84.72014 250.43104
17.35000 -2734.12720 -0.38887 -38.30012 154.44391 61.82399 218.10162
17.45000 -2723.09309 6.91695 -47.87349 74.65910 86.02281 214.90272
17.55000 -2705.10237 5.15028 -44.73583 76.32215 76.26074 215.37256
17.65000 -2689.55127 4.52167 -45.86579 58.12744 40.78512 202.11584
17.75000 -2672.89166 2.74973 -47.33436 60.44977 92.37471 218.99644
17.85000 -2655.89380 1.40505 -41.44336 80.75287 62.73555 231.37034
17.95000 -2640.61428 7.71362 -53.39226 80.35249 124.31331 216.24078
18.05000 -2622.99665 1.15888 -42.86727 55.83134 59.18840 198.21178
18.15000 -2610.22526 2.48536 -56.96883 78.50688 89.07422 199.45684
18.25000 -2593.47983 5.94064 -31.72723 59.18922 62.82558 199.27451
18.35000 -2577.41619 5.62682 -52.63945 54.44305 84.20378 190.04306
18.45000 -2563.90585 1.51599 -32.27895 55.11269 66.80237 180.47675
18.55000 -2541.62885 2.27091 -33.52022 64.16973 51.62933 178.85832
18.65000 -2529.83550 5.30864 -24.15070 59.85825 47.20801 172.72230
18.75000 -2514.11195 1.31742 -30.32648 69.43509 44.68643 166.08971
18.85000 -2500.54880 5.36759 -34.86915 39.50002 36.13610 174.60874
18.95000 -2483.37441 2.27814 -22.30823 77.61570 73.26901 209.26407
19.05000 -2471.22196 0.24888 -35.23460 38.81509 45.54798 161.27062
19.15000 -2459.64906 4.10580 -26.94936 95.00183 60.55718 162.10990
19.25000 -2440.43895 4.87295 -39.99664 118.72238 75.75717 165.99105
19.35000 -2429.71953 2.12088 -24.78793 63.45126 43.40850 164.26369
19.45000 -2413.84689 0.63957 -23.45537 34.70334 43.06043 159.80182
19.55000 -2402.07602 -0.57919 -27.69244 78.67376 81.92650 165.41299
19.65000 -2385.83785 5.27367 -35.02834 56.81161 40.39168 155.56621
19.75000 -2367.68676 -8.16309 -27.97628 95.70606 290.45179 164.87764
19.85000 -2361.58721 3.14040 -30.00729 50.64103 38.48376 151.31176
19.95000 -2345.69316 2.21552 -31.51114 34.35893 32.98212 139.52326
