0.12500 0.04016
0.37500 0.05553
0.62500 0.09126
0.87500 0.13299
1.12500 0.17094
1.37500 0.20851
1.62500 0.22876
1.87500 0.24128
2.12500 0.20234
2.37500 0.19925
2.62500 0.17429
2.87500 0.18743
3.12500 0.15621
3.37500 0.14581
3.62500 0.14860
3.87500 0.10428
4.12500 0.09310
4.37500 0.07579
4.62500 0.06065
4.87500 0.07441
5.12500 0.07359
5.37500 0.08157
5.62500 0.08109
5.87500 0.09257
6.12500 0.06349
6.37500 0.05512
6.62500 0.04796
6.87500 0.05827
7.12500 0.03283
7.37500 0.02713
7.62500 0.03964
7.87500 0.04423
8.12500 0.02309
8.37500 0.03341
8.62500 0.02257
8.87500 0.03575
9.12500 0.06719
9.37500 0.07064
9.62500 0.04456
9.87500 0.04999
10.12500 0.06196
10.37500 0.05294
10.62500 0.04771
10.87500 0.03915
11.12500 0.03672
11.37500 0.02001
11.62500 0.02160
11.87500 0.06528
12.12500 0.07778
12.37500 0.04305
12.62500 0.05286
12.87500 0.02696
13.12500 0.05484
13.37500 0.03112
13.62500 0.08811
13.87500 0.06363
14.12500 0.00767
14.37500 0.02648
14.62500 0.06570
14.87500 0.05404
15.12500 0.03836
15.37500 0.04942
15.62500 0.05843
15.87500 0.11398
16.12500 0.07342
16.37500 0.03624
16.62500 0.06393
16.87500 0.06890
17.12500 0.06901
17.37500 0.07459
17.62500 0.04682
17.87500 0.02901
18.12500 0.08319
18.37500 0.10403
18.62500 0.07313
18.87500 0.14921
19.12500 0.08564
19.37500 0.09811
19.62500 0.06599
19.87500 0.11043
