0.26 0.83788 86.21153 0.05032
0.51 1.10531 110.67146 0.0472
0.77 1.26932 121.33298 0.04301
1.02 1.33069 122.73054 0.0402
1.28 1.40315 127.25505 0.03785
1.54 1.38934 120.11265 0.03499
1.79 1.33345 112.60873 0.03281
2.05 1.37224 110.15719 0.0302
2.31 1.34192 105.01913 0.02838
2.56 1.35226 100.33918 0.02618
2.82 1.34764 96.2609 0.0243
3.08 1.3403 91.46951 0.02255
3.33 1.32977 88.26005 0.0211
3.59 1.32246 83.04028 0.0194
3.84 1.40718 84.77856 0.01817
4.1 1.33533 77.50935 0.01692
4.36 1.36628 76.10723 0.01569
4.61 1.36101 72.57449 0.01452
4.87 1.43284 73.6568 0.01349
5.12 1.37559 67.84576 0.01273
5.38 1.45564 68.13189 0.01166
5.64 1.4419 65.58537 0.01086
5.89 1.42496 62.13365 0.01014
6.15 1.51011 62.81906 0.00945
6.41 1.48035 59.75714 0.00884
6.66 1.50866 57.82761 0.00817
6.92 1.60805 57.65162 0.00746
7.17 1.54863 53.71962 0.00695
7.43 1.67173 54.42879 0.00638
7.69 1.66457 53.52437 0.00605
7.94 1.61304 49.96664 0.00564
8.2 1.69822 49.66878 0.00525
8.46 1.72626 49.46704 0.00488
8.71 1.71926 46.94599 0.00456
8.97 1.83079 46.06838 0.00416
9.22 1.87104 46.3573 0.00389
9.48 1.81619 43.43719 0.0037
9.74 1.90558 43.24924 0.00338
9.99 1.9142 42.09129 0.00316
