0.12500 0.02130
0.37500 0.02826
0.62500 0.08346
0.87500 0.14507
1.12500 0.18017
1.37500 0.22093
1.62500 0.27385
1.87500 0.30882
2.12500 0.34173
2.37500 0.37492
2.62500 0.40673
2.87500 0.44141
3.12500 0.45080
3.37500 0.45707
3.62500 0.47352
3.87500 0.47505
4.12500 0.47462
4.37500 0.46829
4.62500 0.45929
4.87500 0.43213
5.12500 0.38617
5.37500 0.35346
5.62500 0.31080
5.87500 0.25371
6.12500 0.21054
6.37500 0.18552
6.62500 0.13383
6.87500 0.11925
7.12500 0.11336
7.37500 0.10831
7.62500 0.11832
7.87500 0.10290
8.12500 0.11748
8.37500 0.13373
8.62500 0.12857
8.87500 0.12821
9.12500 0.11728
9.37500 0.09988
9.62500 0.10661
9.87500 0.09807
10.12500 0.09460
10.37500 0.07447
10.62500 0.07788
10.87500 0.05359
11.12500 0.06604
11.37500 0.05197
11.62500 0.06079
11.87500 0.06262
12.12500 0.05375
12.37500 0.06992
12.62500 0.07301
12.87500 0.07846
13.12500 0.09816
13.37500 0.08571
13.62500 0.07451
13.87500 0.09215
14.12500 0.08150
14.37500 0.10017
14.62500 0.11472
14.87500 0.10254
15.12500 0.12403
15.37500 0.10795
15.62500 0.08205
15.87500 0.11599
16.12500 0.10375
16.37500 0.08825
16.62500 0.10387
16.87500 0.08860
17.12500 0.08099
17.37500 0.08608
17.62500 0.07373
17.87500 0.09975
18.12500 0.02675
18.37500 0.05644
18.62500 0.05640
18.87500 0.05893
19.12500 0.07142
19.37500 0.02738
19.62500 0.06848
19.87500 0.00794
