0.12500 0.01484
0.37500 0.07090
0.62500 0.11710
0.87500 0.17445
1.12500 0.24070
1.37500 0.29025
1.62500 0.31827
1.87500 0.33844
2.12500 0.35469
2.37500 0.37277
2.62500 0.39566
2.87500 0.42339
3.12500 0.45317
3.37500 0.49452
3.62500 0.51163
3.87500 0.51986
4.12500 0.53210
4.37500 0.51949
4.62500 0.52748
4.87500 0.51993
5.12500 0.49950
5.37500 0.48341
5.62500 0.45831
5.87500 0.43980
6.12500 0.39413
6.37500 0.34287
6.62500 0.31172
6.87500 0.27553
7.12500 0.27988
7.37500 0.23206
7.62500 0.22879
7.87500 0.20861
8.12500 0.18642
8.37500 0.14559
8.62500 0.13160
8.87500 0.11514
9.12500 0.12064
9.37500 0.10104
9.62500 0.09459
9.87500 0.09892
10.12500 0.07443
10.37500 0.05523
10.62500 0.05708
10.87500 0.04047
11.12500 0.03312
11.37500 0.04010
11.62500 0.04588
11.87500 0.05893
12.12500 0.05214
12.37500 0.07085
12.62500 0.06381
12.87500 0.06822
13.12500 0.07072
13.37500 0.07200
13.62500 0.06906
13.87500 0.06456
14.12500 0.04808
14.37500 0.05218
14.62500 0.05023
14.87500 0.06665
