0.12500 0.01612
0.37500 0.05332
0.62500 0.11832
0.87500 0.19333
1.12500 0.26541
1.37500 0.30958
1.62500 0.33927
1.87500 0.36923
2.12500 0.40627
2.37500 0.41840
2.62500 0.44719
2.87500 0.47045
3.12500 0.50629
3.37500 0.54071
3.62500 0.56298
3.87500 0.58817
4.12500 0.59324
4.37500 0.60554
4.62500 0.60052
4.87500 0.59163
5.12500 0.56829
5.37500 0.53837
5.62500 0.51228
5.87500 0.48046
6.12500 0.44169
6.37500 0.39816
6.62500 0.35112
6.87500 0.30502
7.12500 0.28669
7.37500 0.25036
7.62500 0.22092
7.87500 0.19155
8.12500 0.15124
8.37500 0.11505
8.62500 0.09715
8.87500 0.04949
9.12500 0.03714
9.37500 0.03647
9.62500 0.05148
9.87500 0.07360
10.12500 0.07235
10.37500 0.06348
10.62500 0.08204
10.87500 0.08268
11.12500 0.08039
11.37500 0.08167
11.62500 0.11290
11.87500 0.14303
12.12500 0.11559
12.37500 0.11601
12.62500 0.14748
12.87500 0.11650
13.12500 0.11494
13.37500 0.08743
13.62500 0.06939
13.87500 0.10664
14.12500 0.08569
14.37500 0.06956
14.62500 0.08368
14.87500 0.09749
