0.05000 5577.95409
0.15000 10303.33236
0.25000 12301.30734
0.35000 13861.45912
0.45000 14176.68220
0.55000 13925.77544
0.65000 13634.79622
0.75000 13160.64855
0.85000 12582.29011
0.95000 12072.24566
1.05000 11341.63567
1.15000 10610.48325
1.25000 10013.16073
1.35000 9480.26667
1.45000 8913.63656
1.55000 8438.50331
1.65000 7976.77045
1.75000 7692.67315
1.85000 7383.29019
1.95000 6897.99978
2.05000 6678.34200
2.15000 6330.56916
2.25000 6113.89853
2.35000 5893.67619
2.45000 5655.86765
2.55000 5458.07806
2.65000 5153.71198
2.75000 5078.12233
2.85000 4790.81374
2.95000 4597.88502
3.05000 4411.38485
3.15000 4346.07570
3.25000 4104.30495
3.35000 3934.61708
3.45000 3802.94751
3.55000 3467.42055
3.65000 3472.47598
3.75000 3278.42312
3.85000 3112.02450
3.95000 3099.53147
4.05000 3002.88047
4.15000 2796.95744
4.25000 2725.26758
4.35000 2531.83487
4.45000 2436.13705
4.55000 2365.27807
4.65000 2166.57990
4.75000 2053.96552
4.85000 1916.10893
4.95000 1867.88759
5.05000 1792.79724
5.15000 1713.98014
5.25000 1676.32316
5.35000 1607.91243
5.45000 1522.63215
5.55000 1528.89369
5.65000 1420.63751
5.75000 1416.35989
5.85000 1375.14924
5.95000 1340.84313
6.05000 1288.43671
6.15000 1283.28526
6.25000 1230.59066
6.35000 1185.10721
6.45000 1171.72156
6.55000 1119.83845
6.65000 1112.87820
6.75000 1042.78817
6.85000 1021.72163
6.95000 1011.18795
7.05000 985.07301
7.15000 963.78303
7.25000 962.59703
7.35000 910.75852
7.45000 875.39443
7.55000 869.82007
7.65000 853.91200
7.75000 826.25876
7.85000 815.93631
7.95000 784.21312
8.05000 760.79670
8.15000 728.34378
8.25000 734.98452
8.35000 730.14457
8.45000 689.75063
8.55000 686.72998
8.65000 675.66179
8.75000 663.37189
8.85000 617.29118
8.95000 622.32365
9.05000 616.03559
9.15000 595.84132
9.25000 581.16368
9.35000 579.87006
9.45000 549.12981
9.55000 558.12195
9.65000 554.80347
9.75000 557.46846
9.85000 560.05172
9.95000 534.20014
10.05000 535.77933
10.15000 493.98866
10.25000 488.15111
10.35000 479.53898
10.45000 477.95446
10.55000 463.23387
10.65000 447.02852
10.75000 439.71388
10.85000 428.43322
10.95000 409.46962
11.05000 416.91278
11.15000 418.82901
11.25000 391.69047
11.35000 404.70964
11.45000 387.92314
11.55000 398.69443
11.65000 384.52791
11.75000 391.72739
11.85000 363.37167
11.95000 350.63557
12.05000 350.27139
12.15000 335.64854
12.25000 334.19923
12.35000 325.19611
12.45000 329.73503
12.55000 321.01097
12.65000 326.62198
12.75000 290.45120
12.85000 306.69345
12.95000 301.36552
13.05000 285.24560
13.15000 293.74561
13.25000 293.94822
13.35000 279.77156
13.45000 278.24294
13.55000 264.98425
13.65000 266.89886
13.75000 255.57173
13.85000 266.05943
13.95000 226.55475
14.05000 252.18779
14.15000 233.31904
14.25000 224.77992
14.35000 217.38207
14.45000 228.25098
14.55000 200.91436
14.65000 227.42418
14.75000 196.19477
14.85000 214.79492
14.95000 209.87703
15.05000 202.55644
15.15000 186.40982
15.25000 190.04561
15.35000 189.08876
15.45000 195.45255
15.55000 184.46933
15.65000 168.59151
15.75000 168.10254
15.85000 164.42572
15.95000 156.77538
16.05000 164.20589
16.15000 149.70382
16.25000 159.71689
16.35000 144.73179
16.45000 151.41058
16.55000 148.18102
16.65000 159.45918
16.75000 144.25498
16.85000 131.27321
16.95000 124.63694
17.05000 139.16951
17.15000 136.73562
17.25000 136.22935
17.35000 125.79978
17.45000 128.58461
17.55000 122.06994
17.65000 116.94550
17.75000 106.06831
17.85000 115.27544
17.95000 115.65590
18.05000 124.69855
18.15000 111.23305
18.25000 98.85816
18.35000 117.61581
18.45000 106.38855
18.55000 108.63254
18.65000 97.53800
18.75000 130.17318
18.85000 83.57212
18.95000 110.71806
19.05000 111.55192
19.15000 98.91247
19.25000 108.68815
19.35000 107.65492
19.45000 117.44407
19.55000 83.39034
19.65000 79.34591
19.75000 96.27760
19.85000 88.79899
19.95000 84.89759
