0.12500 0.01475
0.37500 0.04018
0.62500 0.08182
0.87500 0.11912
1.12500 0.17819
1.37500 0.20438
1.62500 0.23700
1.87500 0.26632
2.12500 0.26196
2.37500 0.27440
2.62500 0.27333
2.87500 0.26441
3.12500 0.22713
3.37500 0.22220
3.62500 0.17886
3.87500 0.11163
4.12500 0.05646
4.37500 0.06605
4.62500 0.07733
4.87500 0.07101
5.12500 0.07667
5.37500 0.06999
5.62500 0.06460
5.87500 0.06164
6.12500 0.04722
6.37500 0.04800
6.62500 0.03744
6.87500 0.02582
7.12500 0.03678
7.37500 0.06822
7.62500 0.04725
7.87500 0.04795
8.12500 0.04965
8.37500 0.05471
8.62500 0.05747
8.87500 0.03017
9.12500 0.05428
9.37500 0.01793
9.62500 0.04171
9.87500 0.04027
10.12500 0.01702
10.37500 0.04692
10.62500 0.04000
10.87500 0.05953
11.12500 0.05993
11.37500 0.06200
11.62500 0.06133
11.87500 0.04153
12.12500 0.06401
12.37500 0.03210
12.62500 0.05625
12.87500 0.04586
13.12500 0.02968
13.37500 0.02269
13.62500 0.01610
13.87500 0.02620
14.12500 0.07662
14.37500 0.06862
14.62500 0.07272
14.87500 0.06952
15.12500 0.02324
15.37500 0.10819
15.62500 0.06022
15.87500 0.04267
16.12500 0.08398
16.37500 0.08966
16.62500 0.06217
16.87500 0.07067
17.12500 0.04183
17.37500 0.05434
17.62500 0.09204
17.87500 0.01800
18.12500 0.05808
18.37500 0.06556
18.62500 0.02536
18.87500 0.09127
19.12500 0.04528
19.37500 0.06733
19.62500 0.05317
19.87500 0.08587
