0.05000 2601.63493
0.15000 4907.37605
0.25000 7233.60819
0.35000 9289.46500
0.45000 10784.85482
0.55000 11617.25526
0.65000 11986.29346
0.75000 12255.45516
0.85000 12102.69075
0.95000 11722.45864
1.05000 11404.12293
1.15000 10965.95473
1.25000 10421.75981
1.35000 10012.41153
1.45000 9484.67910
1.55000 9055.53626
1.65000 8607.81468
1.75000 8166.29191
1.85000 7780.68524
1.95000 7441.91636
2.05000 7112.38610
2.15000 6766.96246
2.25000 6449.10710
2.35000 6218.30341
2.45000 5995.02881
2.55000 5736.77696
2.65000 5544.37562
2.75000 5220.29265
2.85000 5137.24515
2.95000 4978.01638
3.05000 4743.39358
3.15000 4625.25326
3.25000 4490.61621
3.35000 4371.64571
3.45000 4205.76140
3.55000 4129.79548
3.65000 3882.11130
3.75000 3773.69246
3.85000 3626.35960
3.95000 3535.21657
4.05000 3431.10604
4.15000 3360.45498
4.25000 3249.12163
4.35000 3139.23745
4.45000 3034.83792
4.55000 2858.46186
4.65000 2789.25688
4.75000 2704.46002
4.85000 2591.44279
4.95000 2527.87449
5.05000 2481.40935
5.15000 2389.67897
5.25000 2330.75011
5.35000 2246.55365
5.45000 2132.48220
5.55000 2134.74099
5.65000 2060.58126
5.75000 1968.91256
5.85000 1923.42989
5.95000 1879.56624
6.05000 1820.37936
6.15000 1737.28112
6.25000 1706.38377
6.35000 1623.38433
6.45000 1625.94087
6.55000 1552.78818
6.65000 1513.44616
6.75000 1509.02120
6.85000 1463.82023
6.95000 1410.97136
7.05000 1409.65259
7.15000 1365.78062
7.25000 1319.78344
7.35000 1310.41403
7.45000 1274.06193
7.55000 1239.50687
7.65000 1206.07447
7.75000 1200.06146
7.85000 1161.37748
7.95000 1113.44531
8.05000 1073.67589
8.15000 1057.09418
8.25000 1028.10763
8.35000 996.73105
8.45000 971.95403
8.55000 940.29691
8.65000 916.82908
8.75000 870.94028
8.85000 822.71621
8.95000 823.34983
9.05000 791.79181
9.15000 756.25523
9.25000 722.36921
9.35000 728.54123
9.45000 685.90475
9.55000 671.12465
9.65000 638.47896
9.75000 617.41515
9.85000 595.99945
9.95000 575.19192
10.05000 554.23596
10.15000 533.11754
10.25000 521.92035
10.35000 513.10015
10.45000 498.32892
10.55000 499.30196
10.65000 471.10395
10.75000 478.07799
10.85000 452.84791
10.95000 450.86503
11.05000 438.06277
11.15000 415.34108
11.25000 413.91383
11.35000 411.64377
11.45000 412.59778
11.55000 393.67833
11.65000 376.90557
11.75000 371.91550
11.85000 373.66436
11.95000 359.60028
12.05000 353.51245
12.15000 345.04566
12.25000 335.81013
12.35000 322.57859
12.45000 325.58407
12.55000 323.25565
12.65000 314.11650
12.75000 304.60433
12.85000 307.14686
12.95000 296.20103
13.05000 291.43782
13.15000 281.34035
13.25000 279.30739
13.35000 264.48538
13.45000 271.68256
13.55000 260.45867
13.65000 264.39562
13.75000 257.38610
13.85000 247.96868
13.95000 241.46525
14.05000 234.44369
14.15000 234.82296
14.25000 230.41300
14.35000 225.24399
14.45000 224.76314
14.55000 220.22833
14.65000 213.40697
14.75000 209.91107
14.85000 213.25047
14.95000 204.93334
15.05000 198.45903
15.15000 191.91102
15.25000 187.24305
15.35000 187.34984
15.45000 196.29087
15.55000 182.40308
15.65000 181.15879
15.75000 171.76476
15.85000 175.98676
15.95000 179.03812
16.05000 169.06704
16.15000 162.55636
16.25000 171.78197
16.35000 160.57927
16.45000 159.92895
16.55000 157.85024
16.65000 154.14034
16.75000 147.21394
16.85000 145.98906
16.95000 141.20770
17.05000 142.52294
17.15000 145.75655
17.25000 128.33011
17.35000 128.41780
17.45000 134.88197
17.55000 129.42857
17.65000 131.50119
17.75000 122.04273
17.85000 119.62854
17.95000 123.87139
18.05000 110.01064
18.15000 108.63474
18.25000 118.63436
18.35000 113.25891
18.45000 107.46696
18.55000 103.92289
18.65000 105.76038
18.75000 103.90358
18.85000 101.95200
18.95000 97.80399
19.05000 89.95716
19.15000 93.21655
19.25000 97.38975
19.35000 96.33935
19.45000 93.35461
19.55000 94.53432
19.65000 93.24890
19.75000 87.94827
19.85000 96.00962
19.95000 90.20232
