0.05000 9984.89381
0.15000 9743.53073
0.25000 11041.25884
0.35000 12717.36224
0.45000 13357.91542
0.55000 13256.87453
0.65000 12878.59320
0.75000 12589.39002
0.85000 12407.07677
0.95000 11836.99423
1.05000 11239.06609
1.15000 10713.52557
1.25000 10236.57001
1.35000 9758.72453
1.45000 9255.16901
1.55000 8744.70837
1.65000 8317.93022
1.75000 7896.79172
1.85000 7568.62532
1.95000 7211.42273
2.05000 7016.44741
2.15000 6808.15697
2.25000 6524.22769
2.35000 6294.99997
2.45000 6129.74621
2.55000 5862.51427
2.65000 5785.05683
2.75000 5450.85809
2.85000 5341.65703
2.95000 5104.47781
3.05000 4992.96725
3.15000 4823.52991
3.25000 4644.14934
3.35000 4587.82143
3.45000 4448.53668
3.55000 4414.05318
3.65000 4132.36309
3.75000 4027.43191
3.85000 3901.05045
3.95000 3849.94170
4.05000 3733.04651
4.15000 3594.72786
4.25000 3508.78866
4.35000 3433.11625
4.45000 3288.45185
4.55000 3271.95029
4.65000 3194.59009
4.75000 3097.65609
4.85000 2927.56362
4.95000 2878.31826
5.05000 2846.91130
5.15000 2696.66833
5.25000 2613.29087
5.35000 2607.32071
5.45000 2508.68663
5.55000 2413.16482
5.65000 2359.20888
5.75000 2276.10460
5.85000 2211.89602
5.95000 2143.78112
6.05000 2040.07668
6.15000 2020.79194
6.25000 1939.98663
6.35000 1847.07017
6.45000 1852.03984
6.55000 1685.64331
6.65000 1690.74874
6.75000 1594.53647
6.85000 1511.62448
6.95000 1449.14483
7.05000 1394.65442
7.15000 1336.44375
7.25000 1309.34848
7.35000 1241.89403
7.45000 1240.64808
7.55000 1145.83119
7.65000 1122.95601
7.75000 1101.13618
7.85000 1026.62585
7.95000 1009.40954
8.05000 1001.13416
8.15000 957.53097
8.25000 922.29083
8.35000 915.89448
8.45000 912.00292
8.55000 887.14797
8.65000 870.16302
8.75000 850.27882
8.85000 799.64698
8.95000 807.39279
9.05000 798.96026
9.15000 818.55567
9.25000 753.27066
9.35000 725.91280
9.45000 749.92036
9.55000 717.80484
9.65000 685.73709
9.75000 668.39832
9.85000 664.36209
9.95000 651.09550
10.05000 650.94209
10.15000 624.40930
10.25000 617.82123
10.35000 582.73770
10.45000 577.84056
10.55000 582.10650
10.65000 608.27595
10.75000 579.33984
10.85000 567.67934
10.95000 527.57045
11.05000 506.33933
11.15000 533.39462
11.25000 508.97637
11.35000 517.78873
11.45000 527.60224
11.55000 488.96788
11.65000 487.04509
11.75000 469.24917
11.85000 461.87641
11.95000 453.49839
12.05000 453.10218
12.15000 439.81294
12.25000 434.21681
12.35000 421.52969
12.45000 407.68653
12.55000 407.47182
12.65000 396.24730
12.75000 400.28112
12.85000 406.95866
12.95000 386.76690
13.05000 362.24938
13.15000 399.41159
13.25000 351.26867
13.35000 361.01719
13.45000 368.60306
13.55000 341.83159
13.65000 335.86161
13.75000 345.98726
13.85000 347.51380
13.95000 311.15340
14.05000 312.80778
14.15000 343.67395
14.25000 340.97220
14.35000 320.84182
14.45000 306.06670
14.55000 300.56035
14.65000 301.74212
14.75000 292.65747
14.85000 289.13780
14.95000 284.41776
15.05000 297.45547
15.15000 293.38316
15.25000 286.54064
15.35000 276.67784
15.45000 276.55382
15.55000 256.95395
15.65000 282.31719
15.75000 267.16162
15.85000 296.36404
15.95000 293.05900
16.05000 252.11786
16.15000 258.55068
16.25000 257.24754
16.35000 259.89144
16.45000 255.34552
16.55000 254.31564
16.65000 229.10008
16.75000 254.91449
16.85000 247.21795
16.95000 241.20528
17.05000 218.52857
17.15000 230.34617
17.25000 220.94272
17.35000 231.52976
17.45000 234.97526
17.55000 197.59966
17.65000 200.23941
17.75000 202.51067
17.85000 215.31995
17.95000 220.31118
18.05000 200.77670
18.15000 215.23185
18.25000 204.70639
18.35000 182.50329
18.45000 183.67609
18.55000 201.28024
18.65000 181.44266
18.75000 169.06810
18.85000 176.49150
18.95000 161.19513
19.05000 156.76681
19.15000 146.49445
19.25000 145.80754
19.35000 148.87286
19.45000 143.45478
19.55000 144.95432
19.65000 136.77831
19.75000 126.74640
19.85000 139.04111
19.95000 134.63052
