0.120000 -0.548940
0.380000 2.403670
0.620000 2.197740
0.880000 1.668510
1.120000 2.315850
1.380000 1.985090
1.620000 2.119480
1.880000 2.135760
2.120000 2.107700
2.380000 2.022870
2.620000 2.038530
2.880000 2.041430
3.120000 2.182040
3.380000 2.174400
3.620000 2.185190
3.880000 2.180790
4.120000 2.249220
4.380000 2.290660
4.620000 2.237620
4.880000 2.318680
5.120000 2.309400
5.380000 2.244910
5.620000 2.204560
5.880000 2.352880
6.120000 2.497870
6.380000 2.434700
6.620000 2.381820
6.880000 2.398130
7.120000 2.389830
7.380000 2.461100
7.620000 2.403680
7.880000 2.044600
8.120000 1.885640
8.380000 2.038780
8.620000 1.282740
8.880000 1.309250
9.120000 1.310640
9.380000 1.703890
9.620000 1.492520
9.880000 1.418240
10.120000 0.691670
10.380000 1.897490
10.620000 1.607090
10.880000 1.869890
11.120000 0.948510
11.380000 0.585120
11.620000 -0.533890
11.880000 2.832120
12.120000 -0.568480
12.380000 0.388370
12.620000 -0.442570
12.880000 -0.654730
13.120000 -1.030870
13.380000 0.276300
13.620000 -2.220090
13.880000 -0.456350
14.120000 -0.675170
14.380000 -0.463880
14.620000 -1.924030
14.880000 -2.443950
