0.120000 -0.682230
0.380000 -0.662850
0.620000 -0.851790
0.880000 -1.462010
1.120000 -2.782690
1.380000 2.423140
1.620000 2.998860
1.880000 2.770480
2.120000 2.735770
2.380000 2.832130
2.620000 2.742660
2.880000 2.701270
3.120000 2.670950
3.380000 2.581490
3.620000 2.978570
3.880000 2.690040
4.120000 2.818680
4.380000 2.535170
4.620000 2.911260
4.880000 2.789410
5.120000 3.029630
5.380000 2.559730
5.620000 2.415640
5.880000 2.325120
6.120000 2.223360
6.380000 2.010830
6.620000 1.981620
6.880000 1.514640
7.120000 1.724400
7.380000 1.603640
7.620000 1.365730
7.880000 1.858790
8.120000 1.900340
8.380000 1.654410
8.620000 1.262600
8.880000 1.941240
9.120000 2.003880
9.380000 1.125330
9.620000 1.362170
9.880000 1.263200
10.120000 1.937870
10.380000 1.450030
10.620000 1.986220
10.880000 1.790210
11.120000 1.924610
11.380000 1.677910
11.620000 1.163770
11.880000 -0.643510
12.120000 -0.993380
12.380000 -0.678210
12.620000 -0.418560
12.880000 -1.885790
13.120000 -1.282760
13.380000 -0.475200
13.620000 -1.563310
13.880000 -0.839750
14.120000 -0.574320
14.380000 -0.932870
14.620000 -0.490400
14.880000 -0.920710
