0.05000 22241.28882
0.15000 30907.17043
0.25000 31290.58936
0.35000 27672.53095
0.45000 23450.99980
0.55000 20809.79550
0.65000 18609.37239
0.75000 16889.10288
0.85000 15518.00080
0.95000 14056.07903
1.05000 13019.63338
1.15000 12060.31034
1.25000 10903.80718
1.35000 10313.21171
1.45000 9479.28901
1.55000 8949.24009
1.65000 8465.29568
1.75000 7977.39364
1.85000 7354.84611
1.95000 6896.14364
2.05000 6670.85135
2.15000 6320.50339
2.25000 6003.06395
2.35000 5843.60983
2.45000 5388.28641
2.55000 5218.15948
2.65000 5024.40471
2.75000 4806.19478
2.85000 4541.96615
2.95000 4532.59850
3.05000 4302.83103
3.15000 4067.63082
3.25000 3941.08633
3.35000 3744.23418
3.45000 3618.93927
3.55000 3430.24811
3.65000 3429.72259
3.75000 3266.88702
3.85000 3139.13874
3.95000 3007.39819
4.05000 2889.73674
4.15000 2794.22862
4.25000 2654.05832
4.35000 2548.02663
4.45000 2518.31637
4.55000 2359.10176
4.65000 2316.24214
4.75000 2153.42808
4.85000 2133.84385
4.95000 2073.43418
5.05000 1958.40639
5.15000 1945.83276
5.25000 1897.23244
5.35000 1843.72629
5.45000 1762.93011
5.55000 1718.57196
5.65000 1627.07114
5.75000 1625.07200
5.85000 1556.58359
5.95000 1527.29142
6.05000 1511.98502
6.15000 1450.99348
6.25000 1361.75380
6.35000 1320.48233
6.45000 1337.75923
6.55000 1278.00661
6.65000 1225.67058
6.75000 1189.40884
6.85000 1155.09501
6.95000 1115.34763
7.05000 1129.14323
7.15000 1081.26057
7.25000 1024.16882
7.35000 988.85197
7.45000 979.46060
7.55000 945.09180
7.65000 929.25546
7.75000 891.69779
7.85000 890.92660
7.95000 823.66701
8.05000 797.44704
8.15000 796.41677
8.25000 772.74952
8.35000 756.21052
8.45000 743.16158
8.55000 717.65691
8.65000 710.52358
8.75000 684.13516
8.85000 654.96559
8.95000 647.54359
9.05000 633.89148
9.15000 631.61593
9.25000 606.86411
9.35000 620.53903
9.45000 562.91131
9.55000 581.75526
9.65000 615.96359
9.75000 540.02072
9.85000 520.08487
9.95000 551.51508
10.05000 496.33777
10.15000 497.87904
10.25000 461.03259
10.35000 476.56293
10.45000 486.02054
10.55000 461.22730
10.65000 440.08459
10.75000 432.43200
10.85000 433.13301
10.95000 415.13797
11.05000 409.34616
11.15000 403.12415
11.25000 406.31989
11.35000 405.91348
11.45000 389.09720
11.55000 366.90723
11.65000 366.23873
11.75000 354.77558
11.85000 365.38884
11.95000 361.10687
12.05000 344.51347
12.15000 348.19184
12.25000 342.63075
12.35000 332.23371
12.45000 366.03794
12.55000 330.94630
12.65000 313.89707
12.75000 315.81007
12.85000 299.68958
12.95000 317.40094
13.05000 316.06379
13.15000 289.33399
13.25000 299.44866
13.35000 289.88384
13.45000 292.71390
13.55000 283.78683
13.65000 274.11873
13.75000 276.29130
13.85000 260.41583
13.95000 258.37247
14.05000 274.01801
14.15000 322.29506
14.25000 274.78008
14.35000 246.15359
14.45000 252.99105
14.55000 226.25766
14.65000 230.20451
14.75000 224.98037
14.85000 225.88639
14.95000 233.64363
15.05000 261.32714
15.15000 196.85139
15.25000 199.48797
15.35000 232.54763
15.45000 202.62455
15.55000 205.66749
15.65000 185.68091
15.75000 182.90386
15.85000 186.70187
15.95000 223.48132
16.05000 245.84710
16.15000 179.70136
16.25000 188.43970
16.35000 179.69158
16.45000 174.85682
16.55000 145.01943
16.65000 151.96778
16.75000 157.62248
16.85000 151.41393
16.95000 158.69381
17.05000 202.98124
17.15000 162.85476
17.25000 159.37462
17.35000 162.83532
17.45000 154.45176
17.55000 164.66109
17.65000 198.24744
17.75000 164.99209
17.85000 159.73385
17.95000 164.48648
18.05000 148.86936
18.15000 143.44871
18.25000 208.60289
18.35000 160.68259
18.45000 168.29953
18.55000 162.04522
18.65000 158.09694
18.75000 150.35114
18.85000 144.19985
18.95000 160.09875
19.05000 126.72041
19.15000 143.96416
19.25000 139.04472
19.35000 140.34164
19.45000 156.07394
19.55000 144.43646
19.65000 151.53777
19.75000 134.37145
19.85000 131.32007
19.95000 145.70220
