0.12500 0.01891
0.37500 0.01368
0.62500 0.03335
0.87500 0.04022
1.12500 0.06307
1.37500 0.07641
1.62500 0.09772
1.87500 0.10087
2.12500 0.10949
2.37500 0.12071
2.62500 0.13926
2.87500 0.14189
3.12500 0.15440
3.37500 0.15308
3.62500 0.17251
3.87500 0.15965
4.12500 0.16233
4.37500 0.15616
4.62500 0.14299
4.87500 0.11928
5.12500 0.10438
5.37500 0.07549
5.62500 0.07497
5.87500 0.05150
6.12500 0.04029
6.37500 0.03090
6.62500 0.02292
6.87500 0.02221
7.12500 0.01856
7.37500 0.02314
7.62500 0.01288
7.87500 0.02322
8.12500 0.02162
8.37500 0.01599
8.62500 0.02877
8.87500 0.02865
9.12500 0.03096
9.37500 0.03940
9.62500 0.02875
9.87500 0.01486
10.12500 0.02252
10.37500 0.01341
10.62500 0.01594
10.87500 0.03184
11.12500 0.02471
11.37500 0.01112
11.62500 0.01669
11.87500 0.02010
12.12500 0.04035
12.37500 0.03653
12.62500 0.04499
12.87500 0.03792
13.12500 0.04402
13.37500 0.01822
13.62500 0.02768
13.87500 0.03603
14.12500 0.03937
14.37500 0.03771
14.62500 0.03210
14.87500 0.02685
15.12500 0.04614
15.37500 0.02086
15.62500 0.03373
15.87500 0.04941
16.12500 0.02792
16.37500 0.02866
16.62500 0.03665
16.87500 0.02572
17.12500 0.01784
17.37500 0.03617
17.62500 0.05061
17.87500 0.04970
18.12500 0.05097
18.37500 0.04900
18.62500 0.03230
18.87500 0.01774
19.12500 0.05643
19.37500 0.01689
19.62500 0.01562
19.87500 0.02545
