0.12500 0.00245
0.37500 0.03921
0.62500 0.08167
0.87500 0.13994
1.12500 0.20032
1.37500 0.25097
1.62500 0.30046
1.87500 0.32518
2.12500 0.35738
2.37500 0.37973
2.62500 0.39535
2.87500 0.42384
3.12500 0.44263
3.37500 0.47004
3.62500 0.49650
3.87500 0.53310
4.12500 0.56063
4.37500 0.59428
4.62500 0.61439
4.87500 0.62791
5.12500 0.63932
5.37500 0.65053
5.62500 0.64727
5.87500 0.64367
6.12500 0.63247
6.37500 0.62821
6.62500 0.58623
6.87500 0.57309
7.12500 0.55016
7.37500 0.49470
7.62500 0.47422
7.87500 0.44563
8.12500 0.42255
8.37500 0.40852
8.62500 0.37596
8.87500 0.38993
9.12500 0.37740
9.37500 0.38484
9.62500 0.37253
9.87500 0.38677
10.12500 0.37784
10.37500 0.37385
10.62500 0.36324
10.87500 0.35304
11.12500 0.34206
11.37500 0.32249
11.62500 0.30767
11.87500 0.29238
12.12500 0.24375
12.37500 0.21630
12.62500 0.17745
12.87500 0.12122
13.12500 0.12518
13.37500 0.10050
13.62500 0.08244
13.87500 0.09084
14.12500 0.07088
14.37500 0.07045
14.62500 0.02017
14.87500 0.03570
15.12500 0.03709
15.37500 0.04185
15.62500 0.03854
15.87500 0.05720
16.12500 0.02461
16.37500 0.04408
16.62500 0.04168
16.87500 0.02477
17.12500 0.04235
17.37500 0.00640
17.62500 0.05372
17.87500 0.05654
18.12500 0.09011
18.37500 0.12312
18.62500 0.15148
18.87500 0.15962
19.12500 0.18881
19.37500 0.21834
19.62500 0.22945
19.87500 0.24243
