0.120000 0.662230
0.380000 -2.166700
0.620000 -2.986330
0.880000 -3.007720
1.120000 -3.094710
1.380000 -3.089200
1.620000 -3.078050
1.880000 -3.093770
2.120000 -3.061240
2.380000 -3.061720
2.620000 -3.050090
2.880000 -3.054480
3.120000 -3.056110
3.380000 -3.051600
3.620000 -3.068160
3.880000 -3.047410
4.120000 -3.077940
4.380000 -3.071400
4.620000 -3.027570
4.880000 -3.045870
5.120000 -3.007790
5.380000 -2.992090
5.620000 -3.050320
5.880000 -2.977990
6.120000 -3.038270
6.380000 -2.997650
6.620000 -3.002380
6.880000 -2.929870
7.120000 -2.961740
7.380000 -2.943060
7.620000 -2.952770
7.880000 -2.826980
8.120000 -2.947350
8.380000 -2.909350
8.620000 -2.873240
8.880000 -2.964720
9.120000 -2.847550
9.380000 -3.054550
9.620000 3.140010
9.880000 2.989570
10.120000 -3.098590
10.380000 2.561070
10.620000 3.129680
10.880000 3.007660
11.120000 3.024300
11.380000 2.352340
11.620000 2.616390
11.880000 -2.957880
12.120000 -3.135890
12.380000 2.505260
12.620000 2.287320
12.880000 2.879400
13.120000 2.534000
13.380000 2.127700
13.620000 -2.940180
13.880000 2.116670
14.120000 -3.124480
14.380000 2.260720
14.620000 -2.813590
14.880000 2.415710
15.120000 3.074570
15.380000 1.308580
15.620000 2.869860
15.880000 2.300820
16.120000 1.889790
16.380000 1.579920
16.620000 1.883340
16.880000 1.157270
17.120000 1.126960
17.380000 1.299920
17.620000 1.240250
17.880000 1.244480
18.120000 1.061750
18.380000 0.827960
18.620000 1.064320
18.880000 0.879510
19.120000 0.811390
19.380000 1.119750
19.620000 0.751380
19.880000 0.778690
