0.12500 0.02386
0.37500 0.07710
0.62500 0.13986
0.87500 0.21918
1.12500 0.27940
1.37500 0.31535
1.62500 0.34923
1.87500 0.36561
2.12500 0.37328
2.37500 0.38442
2.62500 0.39162
2.87500 0.41117
3.12500 0.41816
3.37500 0.43077
3.62500 0.43215
3.87500 0.46006
4.12500 0.46106
4.37500 0.47466
4.62500 0.49457
4.87500 0.48365
5.12500 0.50554
5.37500 0.52416
5.62500 0.52436
5.87500 0.53423
6.12500 0.54555
6.37500 0.54766
6.62500 0.56679
6.87500 0.55356
7.12500 0.57525
7.37500 0.57046
7.62500 0.57277
7.87500 0.56849
8.12500 0.56132
8.37500 0.56681
8.62500 0.54064
8.87500 0.51307
9.12500 0.52092
9.37500 0.48103
9.62500 0.45890
9.87500 0.43238
10.12500 0.42670
10.37500 0.39147
10.62500 0.38664
10.87500 0.37354
11.12500 0.34083
11.37500 0.33409
11.62500 0.33017
11.87500 0.31835
12.12500 0.30994
12.37500 0.31640
12.62500 0.28633
12.87500 0.28217
13.12500 0.26339
13.37500 0.25416
13.62500 0.21896
13.87500 0.19922
14.12500 0.16887
14.37500 0.15159
14.62500 0.13388
14.87500 0.10718
15.12500 0.11507
15.37500 0.07355
15.62500 0.08652
15.87500 0.07872
16.12500 0.06385
16.37500 0.05122
16.62500 0.06827
16.87500 0.04740
17.12500 0.05949
17.37500 0.04867
17.62500 0.05352
17.87500 0.08365
18.12500 0.03538
18.37500 0.06059
18.62500 0.04059
18.87500 0.06905
19.12500 0.07697
19.37500 0.02467
19.62500 0.05754
19.87500 0.07697
