0.120000 -2.226600
0.380000 -2.103890
0.620000 -2.538300
0.880000 -2.317550
1.120000 -2.236610
1.380000 -2.235960
1.620000 -2.275230
1.880000 -2.287480
2.120000 -2.298620
2.380000 -2.264600
2.620000 -2.244990
2.880000 -2.284100
3.120000 -2.220350
3.380000 -2.220630
3.620000 -2.276690
3.880000 -2.260600
4.120000 -2.260530
4.380000 -2.240550
4.620000 -2.260920
4.880000 -2.252970
5.120000 -2.263530
5.380000 -2.259810
5.620000 -2.169280
5.880000 -2.201330
6.120000 -2.167670
6.380000 -2.167070
6.620000 -2.121840
6.880000 -2.093890
7.120000 -2.163660
7.380000 -2.173820
7.620000 -2.208200
7.880000 -2.184900
8.120000 -2.206550
8.380000 -2.306830
8.620000 -2.316460
8.880000 -2.339270
9.120000 -2.495000
9.380000 -2.766580
9.620000 -2.685500
9.880000 -2.855770
10.120000 -2.893070
10.380000 -3.078430
10.620000 -3.140960
10.880000 2.938730
11.120000 -2.575060
11.380000 -3.052820
11.620000 -3.010700
11.880000 2.954300
12.120000 -3.040820
12.380000 -2.731350
12.620000 2.829210
12.880000 -1.743400
13.120000 2.872780
13.380000 -2.507120
13.620000 -2.889590
13.880000 -2.328410
14.120000 -2.090230
14.380000 -3.011470
14.620000 -2.866590
14.880000 -2.784850
15.120000 -2.892290
15.380000 -3.068560
15.620000 -2.929390
15.880000 -2.986070
16.120000 2.634630
16.380000 2.019400
16.620000 2.396240
16.880000 2.238350
17.120000 2.170370
17.380000 2.090390
17.620000 1.920490
17.880000 1.880090
18.120000 1.776450
18.380000 1.886760
18.620000 1.611590
18.880000 1.640030
19.120000 1.414960
19.380000 1.341230
19.620000 1.071730
19.880000 1.076370
