0.05000 -550.26025 448.60941 4501.77739 1277.39757 1917.68522 187.63383
0.15000 -56.07285 76.91056 4584.24175 1185.25485 1627.07511 675.42126
0.25000 -415.06344 96.36706 4218.38540 1436.85193 1471.33117 598.28501
0.35000 -708.20327 -23.85954 4340.99363 1251.38839 2420.01315 844.09198
0.45000 -1025.12340 105.24455 4214.69196 1517.89017 1409.48924 602.00291
0.55000 -1241.28133 -12.04338 4139.90434 1309.24012 1513.82685 579.49075
0.65000 -1569.59304 107.09219 4014.66988 1382.50770 1380.50154 678.27404
0.75000 -1679.55837 -4.86974 3969.01306 1402.86991 1531.74446 749.72385
0.85000 -2030.74037 5.64202 3796.20467 1405.26135 1571.21440 970.12690
0.95000 -1801.71177 -6.95278 3702.26129 1725.24243 1833.95345 1016.98045
1.05000 -2248.48387 -21.98952 3386.82093 1542.21715 1752.20868 1107.66747
1.15000 -2550.35205 -53.17646 3141.88770 1783.32192 1898.34167 1217.96167
1.25000 -2755.22952 4.22441 2813.60072 1729.19923 1989.95231 1481.69988
1.35000 -2848.16714 -53.46913 2279.76514 1800.56451 2119.11577 1700.08255
1.45000 -3165.29495 -25.93121 1888.05599 1679.56045 1953.92581 1891.85248
1.55000 -3270.45220 -7.20025 1478.62189 1794.92933 1827.05356 2262.21344
1.65000 -3370.30826 -58.85777 1300.08722 1639.08777 1727.07852 2478.25300
1.75000 -3463.14278 42.84147 1056.43711 1455.78603 1559.31858 2509.79734
1.85000 -3605.22987 10.99149 790.42088 1459.86736 1439.69354 2614.37849
1.95000 -3598.40366 -18.33760 860.99566 1324.52264 1442.66753 2639.66294
2.05000 -3625.62505 16.80590 864.08031 1397.19147 1266.36658 2581.46458
2.15000 -3602.13587 -25.19593 669.06748 1257.27768 1105.81978 2606.42493
2.25000 -3532.56802 -46.60714 718.21899 1351.93475 1090.76493 2754.49939
2.35000 -3632.07378 8.80825 640.29632 1267.34412 997.26080 2620.53059
2.45000 -3602.43670 -3.67749 526.81758 1247.59637 930.29629 2613.80191
2.55000 -3606.08560 38.01972 518.13527 1199.92479 952.42396 2612.06646
2.65000 -3589.62524 2.29448 581.87493 1218.98786 832.07427 2531.66444
2.75000 -3554.93848 -10.94783 533.81424 1169.49491 816.16722 2551.27654
2.85000 -3544.69607 -1.82330 322.46660 1268.50793 920.41542 2584.51699
2.95000 -3511.92585 11.60476 354.67699 1148.96077 757.71148 2602.75222
3.05000 -3470.64747 22.69834 349.49043 1157.48540 731.44607 2609.61677
3.15000 -3527.51474 -15.28803 262.03971 1092.12281 692.29580 2545.11974
3.25000 -3445.15054 1.00763 256.28871 1088.23592 642.86231 2584.09917
3.35000 -3454.62779 -11.53890 269.04079 1093.70493 611.24152 2496.84290
3.45000 -3415.70797 14.37057 226.11038 1107.94061 598.70694 2533.03473
3.55000 -3393.45592 5.17886 225.65070 1067.59035 575.89057 2524.34898
3.65000 -3352.53876 -17.79644 224.91849 1121.05011 679.87659 2520.00918
3.75000 -3378.26309 6.20022 204.72938 1002.37979 515.13637 2472.48692
3.85000 -3319.15526 -3.66846 152.45004 1034.32264 533.42796 2490.71111
3.95000 -3320.33229 -14.52621 214.45942 1040.58583 487.00317 2478.67658
4.05000 -3272.75537 5.04331 198.29561 998.38948 465.42869 2454.36783
4.15000 -3281.80122 14.45070 122.27449 1012.59327 492.09073 2438.63922
4.25000 -3301.52406 3.85153 180.99162 991.71848 450.62081 2362.25464
4.35000 -3235.75224 -6.97625 128.21053 958.89025 414.45810 2401.36691
4.45000 -3276.30248 14.18580 153.36125 943.72972 457.27803 2295.22509
4.55000 -3160.71516 1.51564 119.73466 961.16960 415.34569 2391.34283
4.65000 -3142.22700 -12.50299 114.93567 996.18691 412.86825 2367.49293
4.75000 -3147.45225 10.21826 134.52217 952.14730 423.70008 2342.89334
4.85000 -3152.73897 0.36586 86.15302 927.90291 370.33121 2296.01854
4.95000 -3126.13693 -1.17387 -5.53211 941.00975 402.57042 2320.12825
5.05000 -3057.38578 3.36172 164.25552 926.00219 368.33685 2323.34477
5.15000 -3083.16587 -8.36555 108.28086 926.36560 366.90488 2251.25129
5.25000 -3100.64402 -11.84062 80.77971 897.05186 349.38963 2217.96851
5.35000 -3026.12525 -1.83602 89.73259 894.00536 337.29111 2270.24402
5.45000 -3032.61462 3.43018 125.72457 902.85719 359.02379 2216.72973
5.55000 -3004.34180 11.41675 68.39224 893.22396 303.94885 2215.49557
5.65000 -2985.25462 3.60891 74.51036 899.51559 343.47977 2203.62908
5.75000 -2959.45840 -6.63598 120.32555 873.66465 344.38482 2189.23627
5.85000 -2948.07610 6.18671 5.77120 902.36338 378.17172 2173.45676
5.95000 -2947.06513 -5.87738 29.24048 859.84328 318.02012 2149.32193
6.05000 -2896.97296 3.59256 -38.69872 887.16337 358.28776 2191.71280
6.15000 -2896.32006 -0.10388 26.44313 869.43453 292.84589 2156.36087
6.25000 -2885.22800 6.97471 34.19624 870.13961 277.76439 2123.11888
6.35000 -2886.55544 1.52799 18.38854 865.04270 301.95679 2127.03428
6.45000 -2826.17374 -7.15466 19.51162 849.90938 303.28328 2144.49311
6.55000 -2842.70643 -2.49640 35.11394 850.74789 269.41041 2087.85752
6.65000 -2827.71473 2.17321 46.18051 844.98235 250.38937 2083.98107
6.75000 -2832.79001 3.04920 20.56143 820.92518 248.50885 2043.49912
6.85000 -2806.79574 -0.37831 37.57199 825.73139 339.09467 2053.50540
6.95000 -2782.14795 -7.33762 48.11461 817.25157 286.42849 2035.38507
7.05000 -2763.28720 -0.62609 65.69969 835.07384 294.00376 2026.58712
7.15000 -2752.26448 2.93083 74.52696 800.50375 234.99602 2016.68921
7.25000 -2710.80563 -3.48319 4.74958 824.86424 247.50143 2032.69353
7.35000 -2719.41264 -9.78037 27.11595 804.51656 271.84535 2000.86421
7.45000 -2709.40915 10.00786 17.22533 806.65941 500.61761 1974.28010
7.55000 -2694.16066 -5.90257 22.71730 783.55494 394.80814 1968.71447
7.65000 -2673.21166 -5.37556 -9.32916 798.32892 204.79350 1956.08201
7.75000 -2640.92122 -2.67607 16.65128 965.20592 240.09731 2026.15974
7.85000 -2658.58667 -4.49240 6.89993 767.88572 234.62885 1924.34685
7.95000 -2642.49874 2.24886 -25.43387 753.00146 195.61446 1921.22453
8.05000 -2610.18563 2.00259 3.26646 757.67701 238.26519 1925.73439
8.15000 -2616.44719 -2.94500 -32.25884 763.27750 206.29965 1899.00726
8.25000 -2588.45514 0.40810 -53.12868 760.43995 210.44677 1898.58900
8.35000 -2569.22970 0.76673 -24.13297 760.73458 191.55159 1897.43813
8.45000 -2575.67727 -6.24741 -16.54333 749.66832 226.41370 1862.95874
8.55000 -2551.10359 0.48997 -48.24162 753.22296 192.03244 1864.74126
8.65000 -2534.10513 -3.75670 11.67193 757.59499 264.64147 1864.89114
8.75000 -2516.40051 -4.50419 -52.94724 740.24221 310.86910 1856.95248
8.85000 -2513.26302 1.60929 -45.13449 722.25429 194.71849 1835.24548
8.95000 -2498.35277 2.18776 -72.38301 730.31624 162.54274 1816.43634
9.05000 -2485.72109 -3.27449 -63.67384 731.06785 177.87794 1806.03976
9.15000 -2436.35496 0.41092 -3.58461 744.16512 180.80177 1831.62731
9.25000 -2429.97650 2.01156 -81.17556 747.71662 189.82935 1817.98557
9.35000 -2452.09169 -3.14870 -36.38734 710.26031 190.28489 1778.07895
9.45000 -2422.95915 2.72740 -97.46006 709.14250 197.24110 1801.51255
9.55000 -2423.71251 -2.64849 -64.27663 700.40444 158.26701 1762.39741
9.65000 -2405.69272 -1.08507 -44.70487 699.65917 167.64430 1761.54478
9.75000 -2354.79680 1.64470 -47.73505 701.99545 151.65543 1795.15478
9.85000 -2369.79234 -4.30937 -58.90192 693.88461 159.26922 1743.65885
9.95000 -2362.90909 -0.30694 -11.76986 710.31389 172.12336 1732.39268
10.05000 -2323.30473 -0.10519 -45.51081 704.39442 158.32952 1751.06813
10.15000 -2359.08815 1.83312 -14.58022 668.06890 141.73249 1686.13716
10.25000 -2315.48312 1.86315 -59.05982 685.57665 135.07758 1714.44376
10.35000 -2307.94743 5.09413 -3.77239 664.90095 148.34318 1697.18859
10.45000 -2318.57644 -1.31613 -65.27828 667.34834 154.09606 1673.00166
10.55000 -2258.27180 -5.71172 -42.98055 685.50531 143.26770 1705.45824
10.65000 -2248.75277 0.90226 -56.07821 664.35668 146.90068 1705.94280
10.75000 -2245.31822 1.42855 -3.86086 678.39220 214.99907 1676.06485
10.85000 -2254.46916 -0.64894 12.57679 669.32929 160.27101 1640.38752
10.95000 -2227.39171 0.09268 -28.08296 652.86399 131.96038 1651.11340
11.05000 -2216.64053 0.05013 -86.94610 630.13906 168.46693 1651.34042
11.15000 -2203.59175 -0.01985 -70.37854 647.28488 139.75429 1639.08117
11.25000 -2196.68040 -3.82746 -16.37890 634.42733 138.39953 1623.32423
11.35000 -2179.07720 0.23615 -40.92177 650.90604 137.86220 1632.89685
11.45000 -2169.69680 1.16697 -44.90982 645.62896 145.59773 1608.91883
11.55000 -2155.59499 -0.90909 -77.56258 633.69667 166.57292 1614.01473
11.65000 -2158.91465 -1.16610 -43.74346 614.38361 127.61798 1575.96105
11.75000 -2147.41743 3.89019 -43.80659 633.81105 142.22409 1577.36368
11.85000 -2123.47370 4.57938 -30.38516 626.61325 119.16575 1577.26609
11.95000 -2109.20390 -0.13396 -7.58163 626.60637 144.38865 1575.22479
12.05000 -2107.76885 -2.76794 -0.55536 603.24760 122.46819 1557.42195
12.15000 -2087.12335 4.60789 -31.31641 620.29613 129.50181 1552.56762
12.25000 -2079.45712 1.30872 -12.99049 609.91727 117.37756 1545.25232
12.35000 -2083.39452 -1.04714 -71.60199 608.41762 136.83940 1520.31960
12.45000 -2060.82276 3.42791 -3.37655 606.93229 108.04204 1522.59492
12.55000 -2075.59777 -0.92832 -23.01357 602.50767 217.47354 1489.62558
12.65000 -2062.17152 -1.00933 -49.26688 590.52246 116.69768 1485.57050
12.75000 -2040.10011 0.98677 -103.19515 578.65178 94.84522 1493.89775
12.85000 -2048.85462 0.66588 -109.49503 562.72315 94.74393 1468.24703
12.95000 -2026.38903 -1.41714 -88.65556 586.60987 138.39591 1467.24496
13.05000 -1997.16067 1.41022 -46.31795 585.04434 103.64647 1475.96456
13.15000 -1990.02039 0.66095 -27.81661 576.24840 101.38822 1469.21849
13.25000 -1956.65145 2.05952 -49.73117 585.90478 153.36007 1491.68169
13.35000 -1995.57406 2.39922 -83.49386 572.39423 106.08731 1432.17398
13.45000 -1963.19466 0.69021 -74.35395 553.56703 114.41896 1451.97367
13.55000 -1960.43294 0.28462 -76.57754 556.08532 95.78675 1431.30513
13.65000 -1945.96402 -1.34987 -67.07768 557.45797 128.10137 1432.06284
13.75000 -1935.16476 2.87605 -39.06954 582.86776 145.45931 1424.93019
13.85000 -1908.54508 2.48495 -71.76421 570.09579 96.84837 1434.92295
13.95000 -1907.54519 -3.73982 -14.99050 558.77877 100.83194 1415.16545
14.05000 -1901.63807 -0.52212 -78.59544 550.93596 149.20057 1411.11061
14.15000 -1919.31422 -2.25870 -62.70388 545.18003 124.12502 1365.74185
14.25000 -1896.51959 0.48163 -41.26642 535.25816 84.92843 1376.92481
14.35000 -1858.43594 1.75492 -21.07284 573.07966 125.43448 1397.01566
14.45000 -1860.95625 0.01908 -33.77445 529.89299 76.76911 1383.72775
14.55000 -1830.33303 2.58996 -36.85721 553.18204 91.47957 1399.07978
14.65000 -1849.99493 -3.43895 -56.93039 540.10085 517.67234 1378.53726
14.75000 -1833.47729 -0.10404 -103.79129 532.07783 157.10610 1361.68290
14.85000 -1842.73965 1.88954 -90.10538 527.00690 127.84441 1332.22236
14.95000 -1831.82781 -3.72963 -70.73316 544.37802 129.19207 1330.13847
15.05000 -1808.30244 -0.23293 -16.42553 534.33338 109.79873 1342.31136
15.15000 -1811.26433 -0.88980 -31.99929 522.45102 131.80772 1322.37736
15.25000 -1814.14379 -0.43941 -50.18352 511.51241 197.31487 1295.22999
15.35000 -1804.68270 -0.32098 -75.53369 505.04436 145.19263 1297.82732
15.45000 -1788.51767 0.09900 -51.78306 506.18726 77.25354 1294.42281
15.55000 -1769.43066 -0.14648 -22.41884 528.46873 101.82149 1303.17916
15.65000 -1769.44929 -1.32170 -41.23488 502.40532 80.32006 1288.87270
15.75000 -1765.24212 0.80154 -41.12435 502.02009 106.17389 1279.74946
15.85000 -1747.05081 -0.35956 -54.27591 512.43829 79.96459 1280.83209
15.95000 -1748.64209 1.27650 -45.58920 510.23976 83.32109 1262.64694
16.05000 -1730.89592 0.84819 -62.66993 498.29572 80.97275 1268.72497
16.15000 -1716.71845 -0.22092 -46.51949 506.09216 87.91341 1272.76388
16.25000 -1709.06937 1.40965 -86.08383 515.13007 112.22979 1264.59814
16.35000 -1700.72769 1.35951 -26.41099 496.88093 104.88212 1256.55650
16.45000 -1701.35928 -0.37183 -54.10326 496.50711 91.41154 1244.97787
16.55000 -1694.49634 -1.24975 -41.08157 477.31731 74.34319 1242.97440
16.65000 -1672.71553 0.56490 -67.33817 498.61998 62.26510 1247.76548
16.75000 -1693.59125 -1.91471 -31.57449 472.94795 79.31530 1207.68198
16.85000 -1665.00301 -0.40850 -46.79288 473.45513 72.30657 1228.12474
16.95000 -1637.32206 1.01513 -50.82258 492.50259 85.20081 1241.48770
17.05000 -1646.67629 -1.20666 -28.35107 493.07266 70.31877 1217.74172
17.15000 -1631.22338 -0.36366 -35.25442 474.92733 68.33716 1224.61784
17.25000 -1646.72418 -0.19860 -51.62885 460.05624 64.47199 1190.71647
17.35000 -1631.53496 1.92261 -53.78759 459.37914 61.66706 1205.92922
17.45000 -1615.18269 0.71880 -6.12999 470.09650 67.53307 1195.86928
17.55000 -1613.53885 -0.35106 -33.41048 459.66297 69.16259 1192.66753
17.65000 -1598.09662 -0.13143 -34.33532 463.31415 66.63501 1193.03071
17.75000 -1607.79820 -2.53666 -24.32708 458.99589 160.36110 1167.78734
17.85000 -1599.16735 0.79061 -43.97610 463.94195 56.08072 1160.73107
17.95000 -1597.53695 0.61741 -89.19953 447.82697 79.86272 1156.62784
18.05000 -1591.89909 -0.44526 -20.55833 451.17740 58.97247 1143.71400
18.15000 -1564.29677 -0.02477 -70.45938 457.88795 61.94442 1162.71353
18.25000 -1583.38475 1.01202 -67.43011 445.76268 155.14217 1129.74228
18.35000 -1557.95001 0.07220 -52.24583 448.05516 81.30771 1145.02898
18.45000 -1548.09404 2.05846 -22.74277 447.40409 56.63239 1140.01586
18.55000 -1539.65113 -0.43998 -67.81709 444.91031 77.37138 1141.47850
18.65000 -1509.44012 1.53654 -34.57457 474.48239 99.26780 1157.78611
18.75000 -1534.26032 -2.06910 -55.38071 444.76274 107.03712 1122.79771
18.85000 -1526.18186 0.05309 -38.23211 443.32229 107.32326 1116.58788
18.95000 -1522.32116 -0.13689 -38.39392 426.83041 139.20837 1108.68932
19.05000 -1508.08691 0.87189 -76.56955 430.27200 55.40860 1111.91192
19.15000 -1505.86779 0.61344 -30.03399 431.69100 127.76780 1104.32515
19.25000 -1502.04561 -0.34712 -7.34306 430.11156 49.91125 1089.46165
19.35000 -1487.30704 0.17892 -76.17522 431.46457 202.46131 1099.42659
19.45000 -1494.05406 -2.09873 -37.97362 418.53508 68.26801 1078.70821
19.55000 -1484.88516 -0.00704 -46.84794 449.96658 65.48336 1076.34161
19.65000 -1459.08112 -0.59720 -23.87195 431.87447 67.62226 1090.58501
19.75000 -1484.01608 0.73471 -13.30512 428.73903 62.50288 1106.98859
19.85000 -1458.66885 0.20842 -36.87143 421.54251 56.67946 1068.62683
19.95000 -1463.61013 -0.25416 -55.80435 419.45323 49.11445 1052.51354
