0.120000 0.141130
0.380000 2.814670
0.620000 -3.092410
0.880000 3.128520
1.120000 -2.907770
1.380000 -2.960430
1.620000 -2.999790
1.880000 -2.997620
2.120000 -2.932680
2.380000 -2.968770
2.620000 -2.938120
2.880000 -2.944680
3.120000 -2.968890
3.380000 -2.976410
3.620000 -3.114400
3.880000 3.120380
4.120000 -3.137010
4.380000 3.099490
4.620000 2.925580
4.880000 2.801970
5.120000 2.965040
5.380000 3.075850
5.620000 -2.873470
5.880000 -2.487130
6.120000 -2.663160
6.380000 -2.629730
6.620000 -2.797420
6.880000 3.096580
7.120000 -2.731390
7.380000 1.926780
7.620000 -2.944130
7.880000 -0.694700
8.120000 -1.694230
8.380000 -1.663020
8.620000 -1.760890
8.880000 -1.499720
9.120000 -2.086710
9.380000 -2.067150
9.620000 -2.069890
9.880000 -1.434970
10.120000 -2.767770
10.380000 1.315820
10.620000 0.246810
10.880000 0.960370
11.120000 0.100890
11.380000 0.442210
11.620000 0.517390
11.880000 -0.369940
12.120000 -0.139820
12.380000 0.142250
12.620000 0.260630
12.880000 -0.041440
13.120000 -0.175200
13.380000 0.363270
13.620000 0.544600
13.880000 -0.206530
14.120000 -0.914330
14.380000 1.032970
14.620000 0.623380
14.880000 1.204840
15.120000 -0.673500
15.380000 1.870590
15.620000 -0.236920
15.880000 -0.280330
16.120000 -0.965100
16.380000 -1.208510
16.620000 -1.444040
16.880000 -2.024720
17.120000 -1.046750
17.380000 -1.522420
17.620000 -1.545920
17.880000 -2.296810
18.120000 -1.078180
18.380000 -1.734870
18.620000 -1.549250
18.880000 -2.025440
19.120000 -2.536660
19.380000 -0.589920
19.620000 2.594130
19.880000 -2.421630
