0.05000 -1083.70730 79.26138 -1468.03644 1274.76981 1386.09880 1728.43604
0.15000 -2510.06134 -35.53872 49.52691 1432.83938 1121.89020 3303.11070
0.25000 -3498.17664 132.22770 339.05109 1445.52700 1026.52559 4372.34501
0.35000 -4389.75915 138.19113 257.29589 1455.22352 855.26373 5164.54394
0.45000 -4777.63991 134.01293 203.77882 1420.62150 741.31257 5817.76466
0.55000 -5048.22686 121.37410 285.32039 1291.50149 633.45810 6161.33183
0.65000 -5246.48395 103.97736 44.89354 1357.73681 567.99794 6596.51158
0.75000 -5482.75880 110.58243 -14.71332 1383.35579 517.27805 6650.00713
0.85000 -5724.90077 125.42584 -105.43581 1318.48189 504.81697 6666.71907
0.95000 -5892.80395 114.67131 106.69079 1321.64404 463.33176 6628.56030
1.05000 -6100.93095 135.97871 84.37049 1297.45458 460.04532 6591.33417
1.15000 -6293.87682 113.77279 12.76150 1281.79071 457.43580 6517.93908
1.25000 -6462.88855 130.37074 8.70954 1301.13963 435.78766 6394.55891
1.35000 -6617.79310 131.61022 83.20046 1276.37101 420.12466 6258.11211
1.45000 -6795.10239 132.82627 320.80983 1194.59306 396.64307 6039.99275
1.55000 -6868.42102 121.29807 -95.96283 1208.22864 374.85380 6031.00818
1.65000 -6961.11657 115.69427 -8.47248 1136.84999 372.74331 5816.46997
1.75000 -7017.43979 128.12577 -11.61490 1078.27688 363.59605 5671.32421
1.85000 -7130.58461 126.89423 -115.88002 1026.32733 356.88225 5453.54146
1.95000 -7188.52166 121.68362 -69.09596 1009.29957 342.81769 5366.18880
2.05000 -7294.02001 125.61741 3.33053 934.32093 326.49136 5139.64739
2.15000 -7347.06643 118.32717 -112.26759 916.11166 320.80248 5028.61792
2.25000 -7375.43875 118.16505 -83.33932 917.21492 305.39248 4907.42634
2.35000 -7395.59356 116.49529 -109.98062 857.84094 296.46016 4795.01405
2.45000 -7433.35402 123.29533 -188.57427 833.96636 295.49510 4628.77799
2.55000 -7475.73113 120.70334 -89.89546 805.05174 288.08955 4479.29924
2.65000 -7518.32305 119.63543 -35.68262 732.27848 277.64312 4372.57590
2.75000 -7502.89126 123.66638 -33.66024 742.37669 264.26211 4278.40982
2.85000 -7505.22692 121.51750 -53.49870 703.04564 261.77650 4107.61134
2.95000 -7491.23230 121.17167 -85.02032 661.59489 257.63736 4021.68278
3.05000 -7455.62087 115.76228 -75.74429 670.21996 251.08304 3895.92171
3.15000 -7437.38197 119.99103 -85.04939 604.97529 240.02493 3811.03309
3.25000 -7394.12057 114.68708 -27.81353 614.06891 220.13392 3686.79605
3.35000 -7346.46805 120.03570 -46.85280 587.68380 215.50647 3593.16472
3.45000 -7327.03966 112.41189 28.66201 534.37935 220.43907 3497.33132
3.55000 -7305.35876 108.95845 -7.09650 517.76737 215.93026 3382.84972
3.65000 -7270.95395 110.71354 -31.35965 514.67245 212.61470 3304.37542
3.75000 -7233.23229 110.01370 20.13177 493.49297 208.54495 3210.62821
3.85000 -7200.94485 106.34876 39.43100 481.28777 205.34085 3113.25988
3.95000 -7161.46380 104.13267 46.46668 458.83751 198.93620 3043.66744
4.05000 -7117.60803 100.74773 -23.30667 440.15425 198.06705 2969.38870
4.15000 -7090.16521 100.66981 4.01255 435.21565 197.44104 2900.95047
4.25000 -7047.67895 98.21318 57.59676 418.18678 196.61584 2850.22827
4.35000 -7012.33585 96.44056 -36.99932 405.74208 193.07092 2750.51545
4.45000 -6973.67875 96.60434 58.61766 402.27375 193.86949 2695.94655
4.55000 -6933.34274 94.74841 10.07617 404.91539 187.00229 2631.79291
4.65000 -6907.98409 90.38813 3.95329 390.67522 181.99340 2553.41678
4.75000 -6864.65036 91.35052 29.36281 377.06644 175.91368 2514.73266
4.85000 -6830.20007 86.25009 -42.78984 357.96597 171.76424 2426.06515
4.95000 -6780.84682 89.74385 37.25943 348.59307 166.42119 2355.19873
5.05000 -6723.04243 86.21851 56.25338 350.79134 162.01619 2302.02819
5.15000 -6667.81641 85.44333 5.69219 324.53647 159.19077 2231.95414
5.25000 -6617.44540 81.19424 -16.57140 322.71908 166.05343 2194.61572
5.35000 -6579.37232 79.67914 26.34633 330.67238 163.30062 2125.80117
5.45000 -6523.21077 77.87777 -32.46613 293.47754 162.62378 2088.91538
5.55000 -6469.88048 77.25037 4.93957 281.34702 155.48166 2041.58609
5.65000 -6423.22773 74.48831 11.03897 295.10301 160.39460 1967.73092
5.75000 -6377.03182 77.39732 -23.50215 271.98597 153.31513 1933.39239
5.85000 -6325.47393 68.70420 -1.20984 276.73754 153.48954 1908.30828
5.95000 -6288.30238 74.44392 2.88238 261.61189 154.05423 1849.87834
6.05000 -6239.44335 66.60080 -15.95202 280.70790 150.70114 1812.42441
6.15000 -6208.96718 69.48053 -24.62960 264.96404 148.30512 1759.63509
6.25000 -6171.78212 70.82238 14.45676 256.02682 149.46871 1703.12566
6.35000 -6116.67249 64.85506 -0.11784 259.18154 145.98416 1680.55546
6.45000 -6076.76993 63.19537 16.71627 241.98937 141.38107 1631.53752
6.55000 -6027.78872 63.36111 16.46858 241.91461 140.65542 1607.72068
6.65000 -5988.09508 62.61780 -33.68221 230.91462 137.62024 1554.52008
6.75000 -5940.93447 60.20170 -27.02413 242.38688 139.98263 1523.46722
6.85000 -5893.75023 59.94590 -1.49521 228.55645 140.12212 1481.12282
6.95000 -5841.72975 54.59764 -18.20957 236.64431 138.02282 1443.09134
7.05000 -5804.44725 54.30650 8.97935 221.88649 135.95661 1410.24933
7.15000 -5761.25181 56.83996 -33.84433 202.91688 129.75829 1358.82333
7.25000 -5702.97660 52.66054 9.66790 212.71775 124.31806 1357.49538
7.35000 -5657.32407 54.73400 1.78243 217.79910 132.38691 1321.97472
7.45000 -5611.24516 52.65548 -14.48953 206.21347 126.08887 1276.73158
7.55000 -5559.08926 53.64554 -16.35853 200.83330 123.81333 1258.34384
7.65000 -5510.01889 54.59992 -1.06150 192.30246 117.51951 1215.81432
7.75000 -5467.48741 54.22270 4.41834 181.17190 118.23196 1172.45084
7.85000 -5414.10851 51.70564 4.89425 175.16862 116.98853 1157.03751
7.95000 -5373.85246 49.97056 15.56621 167.36664 122.92506 1122.89673
8.05000 -5328.34677 48.13619 -0.93237 159.31986 121.67138 1104.92293
8.15000 -5285.20660 49.41703 -34.89958 164.44720 114.44415 1083.66129
8.25000 -5245.89669 44.32550 27.51715 167.26728 117.46034 1062.98878
8.35000 -5204.59646 47.88798 -6.09918 158.53817 115.44651 1031.82727
8.45000 -5158.38119 42.38316 10.38752 155.18449 111.88440 1005.51168
8.55000 -5125.10932 42.19573 0.36233 148.16196 108.27539 972.36810
8.65000 -5074.54087 43.37675 27.40383 157.87007 109.71603 967.43740
8.75000 -5038.21051 44.98980 16.80247 151.68660 109.69560 939.44126
8.85000 -4997.82579 41.12317 32.63262 162.77181 105.73589 910.31372
8.95000 -4954.77973 42.35125 32.24372 169.74587 101.02424 910.92992
9.05000 -4918.60213 39.38831 43.25436 164.92588 104.60353 884.85970
9.15000 -4873.10767 40.38996 29.39032 158.13304 96.18049 867.06868
9.25000 -4834.50562 37.26146 52.47187 141.82237 95.72752 841.09717
9.35000 -4790.90120 36.62983 35.87168 161.18595 94.52453 825.24146
9.45000 -4743.71857 38.93341 59.65159 148.55741 93.96100 807.45025
9.55000 -4707.56079 37.95295 31.04652 131.45690 95.23277 784.64640
9.65000 -4669.11911 37.19767 74.64982 132.37907 97.76817 765.49521
9.75000 -4625.41068 36.29795 50.95329 144.63632 92.43990 762.62916
9.85000 -4583.78245 36.16601 40.16641 128.80062 96.68606 736.94966
9.95000 -4548.53256 35.72702 20.29856 123.40925 89.06848 719.77116
10.05000 -4508.69030 33.20291 43.31449 122.23293 88.46744 708.87930
10.15000 -4470.73087 33.86429 41.37646 116.04044 97.62080 690.26243
10.25000 -4435.15125 32.20951 46.39312 117.36251 88.54153 667.66052
10.35000 -4395.60706 32.16694 23.79692 112.97783 85.57575 665.52905
10.45000 -4357.90101 30.95582 39.17513 112.13153 88.27946 643.29883
10.55000 -4323.05442 31.61067 22.99966 108.29409 83.75330 636.79180
10.65000 -4286.38688 33.04659 48.86997 106.11213 81.22171 626.17593
10.75000 -4251.47628 27.94812 21.12723 103.00133 83.83240 593.79364
10.85000 -4219.88324 26.96064 12.58238 99.53469 82.78505 587.50170
10.95000 -4183.71013 27.61402 15.54717 101.41229 80.78807 572.05896
11.05000 -4153.27519 30.21273 19.11085 109.66929 81.24731 571.12189
11.15000 -4118.25219 27.22670 28.92124 100.11972 82.80850 558.92450
11.25000 -4085.61394 28.88308 27.38852 97.63926 77.08656 548.57590
11.35000 -4054.90301 24.11269 26.25693 94.74374 83.47727 538.12346
11.45000 -4022.16870 27.18582 32.41363 94.73125 74.21764 528.31081
11.55000 -3991.53240 23.63986 18.08955 94.01687 79.50045 512.40310
11.65000 -3958.58717 27.43872 12.02582 90.22783 79.59726 493.83798
11.75000 -3931.24726 25.71798 2.65558 87.50283 71.48624 484.15249
11.85000 -3899.48182 26.44322 23.72199 89.82827 79.21936 471.25089
11.95000 -3871.86107 27.22387 18.90700 84.23399 77.25135 465.46636
12.05000 -3844.53407 23.58344 8.40581 91.61260 76.57915 445.94953
12.15000 -3817.12060 22.22209 25.32687 83.37365 66.55622 442.73841
12.25000 -3782.77117 25.73565 11.76344 79.11271 76.01287 437.47724
12.35000 -3757.69025 22.98940 22.57917 85.45006 70.36080 423.24246
12.45000 -3732.83085 24.03222 21.12161 87.96266 71.26226 413.91243
12.55000 -3707.02632 21.13632 3.84443 85.67187 70.75731 402.12575
12.65000 -3679.59523 23.33965 32.63565 83.42875 64.71535 397.51018
12.75000 -3654.77711 21.78214 15.40150 72.58977 60.73120 384.34211
12.85000 -3626.41087 22.73905 27.00372 79.55857 64.71812 383.52112
12.95000 -3599.47354 21.81031 40.24658 99.21314 70.35516 382.87702
13.05000 -3577.04625 20.56402 31.61558 79.22529 66.96159 364.91426
13.15000 -3550.91519 19.95255 14.14320 80.46147 64.81091 362.30612
13.25000 -3522.77150 20.49218 28.74717 69.75293 60.89907 355.80869
13.35000 -3494.90851 19.91682 7.73082 73.67234 73.25424 351.98800
13.45000 -3466.86494 18.80662 14.11877 81.14103 72.05676 347.55977
13.55000 -3438.69921 20.60553 12.01520 69.10384 57.69937 347.26895
13.65000 -3416.89054 19.64480 3.42496 68.64248 62.80765 335.87643
13.75000 -3387.73456 19.85372 -0.51957 72.77368 69.55154 322.77659
13.85000 -3365.07100 18.63001 4.63631 68.64677 55.16125 320.76632
13.95000 -3336.15098 21.34637 -5.64343 59.95662 68.98517 318.87626
14.05000 -3310.25229 20.46739 10.34346 70.02915 60.09160 306.43603
14.15000 -3285.43162 19.63501 -17.14760 71.68570 58.46262 298.68732
14.25000 -3258.60819 15.38824 -8.45264 61.52812 55.98993 295.13648
14.35000 -3233.89817 18.20495 -9.69320 69.11404 64.13874 287.09444
14.45000 -3211.16144 15.64868 7.21680 70.40441 61.91964 277.44926
14.55000 -3186.65159 16.89211 -14.05715 52.29209 50.76659 280.71904
14.65000 -3162.45823 14.83730 -1.72831 55.99091 55.14934 269.90689
14.75000 -3142.83286 15.93750 12.53999 62.17821 70.39696 267.42330
14.85000 -3118.85093 15.11209 3.36610 70.63829 58.50984 259.40430
14.95000 -3098.46388 15.43987 11.29808 63.43312 52.75118 255.94055
15.05000 -3078.56545 13.95632 7.73678 62.65795 69.20635 244.96253
15.15000 -3064.34623 15.19499 10.51043 69.62134 65.06240 243.64778
15.25000 -3042.38393 14.42584 12.25174 58.33251 56.50548 239.14913
15.35000 -3019.97122 15.18724 4.94491 57.73541 58.74270 236.00626
15.45000 -3003.61026 12.02195 0.69152 64.93529 55.98117 235.65329
15.55000 -2982.81604 15.89546 12.42763 73.70930 57.91112 225.33699
15.65000 -2966.41677 16.26152 21.99394 63.20510 70.99309 221.05237
15.75000 -2944.37296 14.00669 7.61766 62.92986 57.47158 223.07896
15.85000 -2926.55833 14.28919 4.09898 50.85620 56.35141 217.29565
15.95000 -2911.48587 12.65984 7.27803 57.15444 55.95684 218.13270
16.05000 -2890.74618 14.46397 -2.09855 48.13995 44.50842 210.76355
16.15000 -2871.13603 12.92790 12.84245 61.10390 51.70399 204.97589
16.25000 -2855.11318 15.88388 13.53353 50.14275 42.29847 206.62690
16.35000 -2833.58485 16.62756 5.63037 54.50158 59.58993 198.96583
16.45000 -2819.19628 9.85545 4.23915 63.27161 48.40391 187.24829
16.55000 -2796.17178 10.84637 13.23146 54.36333 45.21517 194.07862
16.65000 -2780.45715 11.68387 4.11617 54.47158 44.86422 187.27338
16.75000 -2757.03080 12.85164 7.46421 58.26000 44.00676 189.82533
16.85000 -2738.67128 8.87138 19.54670 63.74587 52.12086 185.14907
16.95000 -2720.00954 9.91871 0.54685 61.68212 56.83384 191.50806
17.05000 -2704.09022 11.49801 5.23205 46.95744 48.39840 181.94100
17.15000 -2690.14269 15.17041 12.05680 47.28855 51.34608 173.24805
17.25000 -2670.31791 11.30446 7.11848 63.67804 44.41516 172.27733
17.35000 -2652.41859 12.32604 8.00220 42.88008 40.69926 164.81235
17.45000 -2632.50335 12.77742 2.42950 56.77151 41.13187 163.50459
17.55000 -2617.78566 12.51173 12.64931 67.03837 53.14864 163.56027
17.65000 -2600.85375 10.75274 13.55826 45.92468 51.32995 167.07975
17.75000 -2586.24826 9.79484 11.02583 56.93183 43.50570 155.88863
17.85000 -2563.23208 7.50576 17.83623 44.79951 41.62069 148.15275
17.95000 -2547.63237 7.85538 24.58987 41.33514 39.06513 142.03958
18.05000 -2529.88107 9.52384 5.44444 56.94250 42.28178 139.91224
18.15000 -2518.26604 8.88006 20.73724 52.62832 42.75232 139.66394
18.25000 -2496.83996 9.31225 9.50805 57.92932 41.14055 144.80034
18.35000 -2485.61689 12.68125 14.76886 43.44587 42.56190 131.25843
18.45000 -2470.11362 5.07327 15.51930 52.47118 48.99873 132.38200
18.55000 -2453.08492 12.71661 24.47884 56.77200 63.24347 138.65608
18.65000 -2443.67575 11.29168 20.14779 42.34684 51.16060 128.92777
18.75000 -2424.60173 11.83067 -0.72755 50.26052 43.97063 133.04922
18.85000 -2413.52950 9.23540 17.84407 42.10961 50.11090 130.11027
18.95000 -2397.43116 9.53631 11.13495 46.33543 34.43098 128.30794
19.05000 -2385.93698 10.16545 12.26224 43.02231 40.16066 118.66648
19.15000 -2374.13343 7.81367 -0.73521 44.94739 52.96384 121.90508
19.25000 -2355.31503 9.98364 -0.92906 47.39235 29.64863 120.08011
19.35000 -2342.31175 8.66741 4.51766 53.24054 44.54801 133.17252
19.45000 -2329.31169 14.40496 -3.59784 43.14330 43.01909 122.02976
19.55000 -2320.31008 13.08161 -14.11986 36.07152 42.68165 110.08856
19.65000 -2302.92262 12.18190 -8.57056 43.68810 37.14066 113.15955
19.75000 -2292.82697 16.20582 -6.78086 40.23158 39.32916 107.38909
19.85000 -2279.65493 15.56004 -9.38098 32.99763 32.40341 105.25410
19.95000 -2262.31395 15.35879 -19.77714 31.96374 29.96877 104.95742
