0.12500 0.01380
0.37500 0.03220
0.62500 0.05263
0.87500 0.08123
1.12500 0.11485
1.37500 0.13617
1.62500 0.16401
1.87500 0.19112
2.12500 0.20095
2.37500 0.20783
2.62500 0.21313
2.87500 0.21603
3.12500 0.20012
3.37500 0.18325
3.62500 0.17511
3.87500 0.16661
4.12500 0.15511
4.37500 0.13943
4.62500 0.12557
4.87500 0.11433
5.12500 0.09744
5.37500 0.07834
5.62500 0.06732
5.87500 0.06963
6.12500 0.04935
6.37500 0.03269
6.62500 0.02757
6.87500 0.01377
7.12500 0.01576
7.37500 0.02677
7.62500 0.02506
7.87500 0.04062
8.12500 0.04335
8.37500 0.03569
8.62500 0.03099
8.87500 0.03778
9.12500 0.02515
9.37500 0.05874
9.62500 0.05311
9.87500 0.02524
10.12500 0.03305
10.37500 0.01574
10.62500 0.02713
10.87500 0.00665
11.12500 0.03690
11.37500 0.04940
11.62500 0.04361
11.87500 0.03623
12.12500 0.03620
12.37500 0.03811
12.62500 0.02327
12.87500 0.03022
13.12500 0.03155
13.37500 0.02257
13.62500 0.00707
13.87500 0.00827
14.12500 0.01874
14.37500 0.02082
14.62500 0.02224
14.87500 0.01903
15.12500 0.00832
15.37500 0.01326
15.62500 0.02080
15.87500 0.01054
16.12500 0.01619
16.37500 0.01751
16.62500 0.02279
16.87500 0.00467
17.12500 0.00394
17.37500 0.03390
17.62500 0.04673
17.87500 0.04540
18.12500 0.03359
18.37500 0.06301
18.62500 0.03329
18.87500 0.02335
19.12500 0.02941
19.37500 0.03835
19.62500 0.08240
19.87500 0.03250
