0.120000 0.227440
0.380000 0.491320
0.620000 0.294920
0.880000 0.399570
1.120000 0.397180
1.380000 0.372670
1.620000 0.457670
1.880000 0.398730
2.120000 0.390480
2.380000 0.443540
2.620000 0.463930
2.880000 0.450650
3.120000 0.418900
3.380000 0.428070
3.620000 0.385310
3.880000 0.296170
4.120000 0.183260
4.380000 0.151440
4.620000 0.206790
4.880000 0.180150
5.120000 0.280000
5.380000 0.283550
5.620000 0.305100
5.880000 0.129050
6.120000 0.222630
6.380000 0.080990
6.620000 0.112010
6.880000 0.251320
7.120000 0.179390
7.380000 -0.054880
7.620000 -0.334020
7.880000 -0.026210
8.120000 -0.353770
8.380000 -0.059970
8.620000 -0.339630
8.880000 -0.354680
9.120000 -0.347600
9.380000 -0.351680
9.620000 -0.216330
9.880000 -0.308670
10.120000 -0.290880
10.380000 -0.495590
10.620000 1.970240
10.880000 -2.836980
11.120000 2.794960
11.380000 -2.887640
11.620000 -2.743520
11.880000 -2.594150
12.120000 -2.864020
12.380000 -2.397120
12.620000 -2.719880
12.880000 -2.278060
13.120000 -3.097310
13.380000 -2.259160
13.620000 -2.610310
13.880000 1.394810
14.120000 -1.287780
14.380000 -2.475210
14.620000 -1.121850
14.880000 -1.629170
15.120000 -0.917560
15.380000 -0.922530
15.620000 -2.486410
15.880000 -1.998070
16.120000 -2.230960
16.380000 -1.947480
16.620000 -2.231970
16.880000 -2.647650
17.120000 -2.883880
17.380000 -3.121420
17.620000 2.709740
17.880000 2.040450
18.120000 2.550920
18.380000 1.576920
18.620000 1.552620
18.880000 1.697700
19.120000 0.543020
19.380000 -0.768210
19.620000 2.004410
19.880000 0.795500
