0.12500 0.01852
0.37500 0.05292
0.62500 0.11752
0.87500 0.16101
1.12500 0.20907
1.37500 0.26204
1.62500 0.30463
1.87500 0.33894
2.12500 0.36172
2.37500 0.37888
2.62500 0.40695
2.87500 0.43617
3.12500 0.44262
3.37500 0.43820
3.62500 0.46587
3.87500 0.46666
4.12500 0.44135
4.37500 0.44030
4.62500 0.36850
4.87500 0.32015
5.12500 0.28690
5.37500 0.27917
5.62500 0.23825
5.87500 0.21180
6.12500 0.18360
6.37500 0.17388
6.62500 0.13808
6.87500 0.13432
7.12500 0.11202
7.37500 0.09346
7.62500 0.06649
7.87500 0.04070
8.12500 0.05484
8.37500 0.03452
8.62500 0.04770
8.87500 0.04525
9.12500 0.07364
9.37500 0.05553
9.62500 0.04526
9.87500 0.06742
10.12500 0.06912
10.37500 0.08740
10.62500 0.06872
10.87500 0.04861
11.12500 0.03932
11.37500 0.05097
11.62500 0.06089
11.87500 0.07047
12.12500 0.04977
12.37500 0.07237
12.62500 0.08965
12.87500 0.10935
13.12500 0.11563
13.37500 0.11303
13.62500 0.08022
13.87500 0.11682
14.12500 0.11470
14.37500 0.11750
14.62500 0.11876
14.87500 0.14463
15.12500 0.17893
15.37500 0.15271
15.62500 0.15550
15.87500 0.10372
16.12500 0.12423
16.37500 0.07937
16.62500 0.10762
16.87500 0.07594
17.12500 0.06755
17.37500 0.05564
17.62500 0.06782
17.87500 0.05614
18.12500 0.10593
18.37500 0.01722
18.62500 0.08516
18.87500 0.09040
19.12500 0.10334
19.37500 0.08803
19.62500 0.08104
19.87500 0.11689
