0.125 -0.001 0.002 0.002
0.375 0.002 0.007 0.051
0.625 -0.012 -0.013 0.270
0.875 0.001 -0.005 0.699
1.125 -0.042 0.029 1.388
1.375 -0.015 -0.020 2.200
1.625 -0.093 0.027 3.265
1.875 -0.118 -0.006 4.054
2.125 -0.225 0.087 4.742
2.375 -0.146 -0.103 5.433
2.625 -0.244 0.077 5.820
2.875 -0.278 0.097 6.475
3.125 -0.156 0.018 6.620
3.375 -0.228 0.077 7.135
3.625 -0.275 -0.167 7.221
3.875 -0.264 -0.093 7.413
4.125 -0.353 -0.019 7.793
4.375 -0.347 0.059 7.612
4.625 -0.256 0.021 7.742
4.875 -0.279 -0.114 7.519
5.125 -0.256 -0.030 7.997
5.375 -0.245 0.024 7.973
5.625 -0.315 -0.094 8.458
5.875 -0.207 -0.046 8.613
6.125 -0.331 -0.028 8.592
6.375 -0.324 -0.071 8.774
6.625 -0.306 -0.109 9.464
6.875 -0.283 -0.219 9.778
7.125 -0.338 -0.181 10.094
7.375 -0.304 -0.243 10.852
7.625 -0.190 -0.253 11.146
7.875 -0.284 -0.272 12.091
8.125 -0.249 -0.385 12.968
8.375 -0.197 -0.391 14.334
8.625 -0.187 -0.518 14.825
8.875 -0.181 -0.562 16.180
9.125 -0.236 -0.572 17.480
9.375 -0.150 -0.712 19.066
9.625 -0.134 -0.630 20.021
9.875 -0.170 -0.692 21.160
10.125 -0.158 -0.737 21.566
10.375 -0.092 -0.740 23.513
10.625 -0.186 -0.685 23.021
10.875 -0.120 -0.674 22.578
11.125 -0.018 -0.674 23.576
11.375 -0.020 -0.624 22.402
11.625 -0.074 -0.588 21.482
11.875 0.023 -0.598 20.815
12.125 -0.066 -0.434 20.197
12.375 -0.075 -0.345 20.121
12.625 -0.094 -0.448 19.650
12.875 -0.031 -0.400 19.175
13.125 -0.022 -0.442 18.229
13.375 -0.045 -0.239 17.906
13.625 0.036 -0.320 17.751
13.875 -0.022 -0.307 17.566
14.125 -0.003 -0.298 16.100
14.375 -0.028 -0.253 15.651
14.625 -0.044 -0.252 15.831
14.875 -0.023 -0.261 15.225
15.125 -0.038 -0.273 14.219
15.375 -0.046 -0.188 14.510
15.625 -0.069 -0.170 13.223
15.875 0.020 -0.197 13.482
16.125 -0.009 -0.163 12.573
16.375 -0.036 -0.170 12.043
16.625 -0.038 -0.093 11.717
16.875 -0.037 -0.071 11.290
17.125 -0.059 -0.057 10.459
17.375 -0.085 -0.019 10.634
17.625 -0.054 -0.032 9.925
17.875 -0.122 -0.011 9.187
18.125 -0.128 -0.002 9.486
18.375 -0.123 0.045 9.065
18.625 -0.163 -0.023 8.540
18.875 -0.149 -0.024 8.098
19.125 -0.211 -0.034 8.068
19.375 -0.212 -0.034 7.825
19.625 -0.190 -0.020 6.669
19.875 -0.264 -0.089 7.363
