0.05000 -6082.34726 -1125.62579 -1323.90350 21175.70423 16113.63931 7304.16358
0.15000 -7364.08293 -437.09489 -722.46670 6584.90696 10458.39167 8868.54588
0.25000 -9569.47456 45.55757 -116.11921 9323.62430 5041.50795 11359.96293
0.35000 -10816.08105 2.36366 -412.02964 5139.13141 4017.99892 12593.74319
0.45000 -11178.00754 71.74936 -243.87529 4934.71864 3878.78393 12711.16759
0.55000 -11440.27834 72.93234 -435.28255 4095.55639 3479.58563 12172.16079
0.65000 -11277.22567 65.87959 -352.87772 3889.88561 3276.61888 11772.01692
0.75000 -11316.29265 41.11627 -42.20296 3435.75956 3242.73659 11119.54617
0.85000 -11158.54978 35.77078 -193.94938 3600.15082 3181.57712 10855.54424
0.95000 -11039.38917 79.56157 -148.41032 3159.30915 3065.46320 10052.33128
1.05000 -10905.54822 -7.84274 40.61954 2680.84913 2865.02174 9589.58373
1.15000 -10751.70901 -17.51878 31.52568 2567.18783 2811.11987 9028.02041
1.25000 -10642.78682 -2.19460 117.33562 2490.88518 2682.97360 8514.40022
1.35000 -10461.32694 60.39965 -161.09077 2477.68575 2753.15234 8099.10848
1.45000 -10236.57771 56.88448 146.34866 2226.63053 5160.70411 8896.38746
1.55000 -10110.50303 55.63589 145.40991 2064.87982 2452.94709 7375.62784
1.65000 -9938.00204 102.45451 143.17421 1985.17898 2388.82172 7107.49713
1.75000 -9801.57494 71.20045 204.34039 1777.05619 2295.74122 6725.31766
1.85000 -9689.61940 40.96143 141.21541 1754.13971 2198.31847 6490.47414
1.95000 -9553.10680 24.00959 -125.71722 1514.71462 2169.22073 6216.93728
2.05000 -9489.33742 77.17143 -30.02770 1500.00109 3939.48776 6658.86548
2.15000 -9383.57649 11.77213 45.81949 1360.30188 1949.71751 5783.19546
2.25000 -9239.94784 0.08822 27.62733 1235.49849 1854.02733 5492.18274
2.35000 -9174.00320 3.80542 -26.09455 1224.37668 1905.13307 5316.87206
2.45000 -9050.01580 6.11259 -47.70792 1111.82174 1794.52612 5143.23171
2.55000 -8936.19623 -7.27790 -42.78071 1354.06036 1785.33800 4965.66245
2.65000 -8873.45420 -38.31624 2.96884 1015.94479 1654.69170 4765.09763
2.75000 -8787.05176 -66.29815 33.67927 1052.24354 2380.07984 4948.69520
2.85000 -8721.44873 -66.53849 -63.21320 1399.46928 1404.88347 4455.58735
2.95000 -8621.70311 -25.72087 42.81453 971.48833 1347.46310 4294.48738
3.05000 -8554.32944 -50.44858 -49.56051 1926.18370 1676.17717 4269.93913
3.15000 -8463.45451 -32.50043 -58.34593 1058.85568 1468.87981 4056.49108
3.25000 -8415.63789 -33.32745 18.18615 997.32809 1169.74720 3853.29833
3.35000 -8324.60973 -24.57481 4.63123 953.40750 1128.29759 3751.69762
3.45000 -8278.39006 -18.40026 34.51258 962.37628 1029.45739 3622.49219
3.55000 -8212.42747 -2.87774 -32.52142 964.55314 1070.59342 3456.83719
3.65000 -8124.30368 -2.23542 -66.23126 982.22009 938.34758 3395.77171
3.75000 -8083.35924 6.55218 -35.02843 1205.56036 1075.32119 3253.19737
3.85000 -7985.49990 -7.46796 17.40703 926.91033 1328.76919 3173.41504
3.95000 -7926.66322 0.81201 112.32448 1207.84285 850.62293 3115.52777
4.05000 -7822.59218 28.25552 -7.26614 1265.58963 770.63956 2945.29129
4.15000 -7749.35556 18.66788 -58.56335 889.62651 744.69118 2849.12120
4.25000 -7704.26946 -0.96267 33.22356 795.39471 736.01513 2792.39718
4.35000 -7636.91755 -0.14778 -15.53898 877.31163 719.57737 2697.81246
4.45000 -7573.06719 5.38187 41.56138 935.38837 623.01358 2591.74514
4.55000 -7512.92216 4.23947 103.14490 693.59094 562.14967 2507.54520
4.65000 -7443.28815 4.74009 27.74255 692.00205 576.77350 2430.99032
4.75000 -7358.23638 5.20525 5.64682 619.91777 511.28657 2377.85860
4.85000 -7275.23453 16.99745 17.01085 659.41840 520.65430 2303.58395
4.95000 -7186.94406 17.51325 -2.73386 596.15024 491.51894 2234.01247
5.05000 -7113.33800 11.64043 45.33624 1209.06677 619.53474 2301.92511
5.15000 -7066.68850 6.24956 20.12683 505.64261 438.62616 2101.51372
5.25000 -6984.59466 22.47752 -11.11647 518.03595 465.18504 2043.19631
5.35000 -6912.50922 16.85290 21.10663 513.22395 419.59398 1967.69591
5.45000 -6856.30587 18.94132 32.52827 555.55101 543.08206 1938.06668
5.55000 -6780.15641 10.35517 26.84727 462.13949 436.66547 1870.44014
5.65000 -6711.55293 14.30953 0.79908 605.73413 811.56314 2048.23621
5.75000 -6657.71294 8.80374 -18.03648 490.73641 641.54195 1786.62883
5.85000 -6595.51071 19.32693 -27.41875 513.39508 401.16269 1722.93433
5.95000 -6528.70813 17.37580 -9.78067 648.20822 368.33290 1738.66312
6.05000 -6468.65623 20.06384 -11.80182 387.94194 321.59669 1628.67516
6.15000 -6405.23752 14.00574 25.75100 850.83506 446.90497 1637.86094
6.25000 -6349.93295 12.05572 10.92277 375.66278 322.59934 1581.10357
6.35000 -6293.87732 2.92893 -9.02031 459.02787 902.28250 1538.48361
6.45000 -6206.25439 23.01135 10.12566 537.55415 432.15058 1609.26949
6.55000 -6149.57375 21.84335 21.52131 502.38148 694.82999 1697.95614
6.65000 -6088.22199 21.18227 30.15211 418.84629 355.15462 1385.48051
6.75000 -6027.09608 14.02570 14.79669 394.63838 293.40553 1359.61317
6.85000 -5975.83122 14.37908 -4.98261 386.65321 299.90759 1314.96034
6.95000 -5919.74693 17.53406 47.89784 421.28568 263.71415 1292.68927
7.05000 -5859.73632 15.54320 17.27356 378.37494 378.36960 1245.65630
7.15000 -5799.67236 16.27747 7.00294 330.56111 305.33409 1217.92402
7.25000 -5740.81922 16.34673 39.39676 319.99079 254.20889 1176.97669
7.35000 -5685.32959 19.19675 35.30176 350.39525 419.49466 1196.56693
7.45000 -5632.75907 14.12068 26.17471 314.45563 262.89040 1141.90915
7.55000 -5580.72624 21.19469 60.81757 388.81891 304.23755 1179.24078
7.65000 -5527.24506 18.90298 42.69835 285.17583 214.95722 1068.75422
7.75000 -5478.61350 15.93918 35.61969 319.08265 233.33113 1058.38939
7.85000 -5422.86503 12.63518 19.19976 377.42323 286.06380 1030.50722
7.95000 -5383.33961 18.44159 27.11695 285.18999 242.96300 1008.93527
8.05000 -5336.36941 17.03000 24.72100 272.57345 280.97250 999.41065
8.15000 -5289.00005 10.09759 56.35346 373.59061 349.63606 997.72996
8.25000 -5246.92327 10.66389 41.13167 304.02518 198.61352 940.59755
8.35000 -5197.71866 19.14657 42.60070 326.32948 340.38370 921.65024
8.45000 -5146.16973 9.19917 39.41475 272.30670 224.54875 886.12205
8.55000 -5106.76062 10.28433 29.48545 203.26888 170.07667 866.63573
8.65000 -5060.89293 5.17890 34.22679 243.38343 168.70381 847.96306
8.75000 -5015.38890 11.22525 6.13046 261.18734 192.63378 833.06441
8.85000 -4975.45742 10.39375 26.27075 210.89211 210.70344 818.31523
8.95000 -4935.10358 7.93773 41.82662 497.57801 509.60953 856.78602
9.05000 -4888.88620 9.05754 17.88769 216.31343 198.15286 764.34411
9.15000 -4839.41498 0.00051 25.73016 277.25646 364.06923 970.19820
9.25000 -4802.29883 5.94723 23.74532 213.28700 204.90855 778.63040
9.35000 -4760.24927 2.02235 8.77385 227.09607 250.57235 825.52376
9.45000 -4713.79145 7.29593 10.33875 198.91299 167.68858 712.07629
9.55000 -4673.09770 8.50334 8.84601 250.47366 181.51307 681.47749
9.65000 -4639.84236 7.32793 31.65149 245.41642 149.99379 693.94073
9.75000 -4592.43942 6.92784 -5.49752 160.71356 139.09946 652.36995
9.85000 -4553.38187 3.90795 -1.62730 146.58755 129.17519 631.91258
9.95000 -4515.13645 11.08660 -6.32852 241.29136 175.99566 620.69680
10.05000 -4473.89444 5.34792 -30.50388 176.02941 309.86958 624.79220
10.15000 -4435.71104 9.47887 -18.10683 132.52967 133.48126 606.88373
10.25000 -4397.97806 5.51214 -34.41858 157.38848 119.82400 581.51058
10.35000 -4366.87978 3.50679 -11.19282 217.46632 140.48506 569.73559
10.45000 -4323.27818 5.94055 -33.78450 224.94867 135.61105 556.61626
10.55000 -4290.35813 8.11946 -27.30306 155.40425 157.98882 533.12607
10.65000 -4249.39107 5.77076 -6.16283 134.04709 138.38825 506.50238
10.75000 -4210.86848 3.56179 -29.62669 128.14925 151.08291 505.33586
10.85000 -4167.40978 5.64979 -37.16843 173.99291 140.27928 494.69865
10.95000 -4137.20178 4.66338 -23.64764 123.06728 134.75740 484.94629
11.05000 -4108.77855 8.94716 -18.27877 277.64585 214.28120 481.69057
11.15000 -4066.66703 4.93447 -10.94259 212.16292 142.75250 461.91353
11.25000 -4028.80082 11.08019 -35.32855 122.06401 118.90710 455.24133
11.35000 -3994.33096 0.48699 -27.12610 138.77645 247.18451 482.32602
11.45000 -3960.08694 8.35365 -29.92477 147.00994 146.50488 445.74307
11.55000 -3930.35245 -1.29491 -27.90014 116.10372 281.49879 528.56724
11.65000 -3905.36462 1.32357 -10.45492 216.74941 248.22604 439.68028
11.75000 -3877.82948 7.13463 -11.40469 217.56671 93.81640 399.86380
11.85000 -3841.68934 4.20660 -16.49629 153.68229 116.46612 395.55206
11.95000 -3809.37848 4.82869 -7.34517 136.56379 140.13884 377.69656
12.05000 -3778.09204 4.95883 2.40175 132.39432 94.62162 380.38287
12.15000 -3751.70768 3.53640 -12.08290 184.02331 99.11154 400.78405
12.25000 -3715.68782 3.85544 0.75835 102.93975 128.46636 370.60771
12.35000 -3688.20916 9.28439 5.66988 151.76554 125.80045 355.60199
12.45000 -3695.62246 -25.85209 -18.96612 1521.71206 1345.77374 1026.97089
12.55000 -3627.47163 3.72273 7.81458 127.06572 95.68617 332.41157
12.65000 -3602.68557 4.04486 5.24414 105.02991 94.27198 328.68006
12.75000 -3577.92523 11.75752 6.08394 174.48095 117.55733 317.64575
12.85000 -3547.94834 6.28567 10.05547 153.57676 125.65699 331.90490
12.95000 -3520.12125 2.80015 9.25026 84.75734 90.40359 316.94865
13.05000 -3494.61397 5.35436 5.78444 83.06541 102.61631 325.83346
13.15000 -3467.85976 2.57862 5.72165 80.59091 80.58705 300.67458
13.25000 -3442.79604 5.66782 3.58977 86.36006 71.51657 291.22174
13.35000 -3425.03058 4.98018 24.07275 202.44433 165.85575 322.41694
13.45000 -3388.94177 3.54603 11.86426 186.97125 155.58151 334.66870
13.55000 -3364.48419 3.99002 17.37917 110.08511 77.98985 279.15298
13.65000 -3336.22119 1.05522 11.58667 156.50242 107.98431 294.71684
13.75000 -3319.08070 -2.33195 18.68459 92.28511 143.49787 268.67656
13.85000 -3293.32552 2.84220 26.45545 91.17950 119.03355 291.75054
13.95000 -3268.10362 6.24599 21.46367 68.81365 81.89946 278.28487
14.05000 -3244.09195 5.69522 24.71752 152.83314 87.43057 265.52408
14.15000 -3218.35219 5.47712 34.95067 79.72305 73.54166 243.90964
14.25000 -3196.86280 -4.26409 20.15538 92.40392 123.74919 256.81721
14.35000 -3172.00736 3.69236 28.29335 76.41729 60.99799 237.28597
14.45000 -3152.48938 -1.51086 9.51267 126.69268 165.18353 310.02025
14.55000 -3124.17750 -3.77627 21.23430 75.19582 144.89697 221.49909
14.65000 -3107.69349 4.82888 29.25754 53.22009 74.86775 230.44844
14.75000 -3080.66926 1.73589 29.29281 65.59477 65.77890 233.41394
14.85000 -3062.21741 4.33670 22.98237 75.43205 85.77250 220.87377
14.95000 -3035.31830 3.30470 37.67896 156.83723 100.29408 215.74828
15.05000 -3014.00109 2.69869 23.01592 51.49326 51.31496 189.62356
15.15000 -2995.09739 -1.30914 36.79217 93.75271 91.46562 215.37339
15.25000 -2965.74843 4.46138 23.46171 88.75194 65.44404 198.18779
15.35000 -2949.91270 1.25695 25.00913 52.84969 46.04136 189.89492
15.45000 -2925.99585 1.82607 43.71250 102.35965 53.63083 190.24580
15.55000 -2908.70262 4.12711 29.28934 81.93689 85.19731 216.65366
15.65000 -2886.25188 2.99113 30.09217 143.63692 70.41181 182.74693
15.75000 -2868.90360 5.18576 28.66248 51.44895 56.10850 180.54050
15.85000 -2853.01881 4.27356 23.77072 130.41765 98.82797 183.75631
15.95000 -2820.01769 2.58356 32.73570 248.96519 49.24262 184.97895
16.05000 -2809.87547 6.54570 18.13784 104.82661 78.84095 185.06342
16.15000 -2791.03517 5.80448 28.00086 54.21572 54.57467 170.84868
16.25000 -2768.99150 3.52502 26.50079 70.98020 54.88124 171.59644
16.35000 -2756.85726 0.27810 21.26898 128.45060 74.75193 192.37402
16.45000 -2734.47366 3.85730 27.92002 42.25426 40.21229 162.35319
16.55000 -2721.62133 -1.31205 12.45901 52.54375 46.37572 159.46709
16.65000 -2699.62001 0.25364 8.30016 67.94184 53.53250 146.01577
16.75000 -2673.54998 0.80289 13.13999 717.60831 374.44553 2057.90553
16.85000 -2663.86354 -0.91241 21.21383 93.75032 100.09197 161.19852
16.95000 -2647.33328 4.66444 25.00096 48.52391 43.36365 155.57779
17.05000 -2632.30213 3.84785 12.65384 40.05034 51.01626 140.99870
17.15000 -2610.90588 6.88085 21.27890 76.25662 95.99655 150.04386
17.25000 -2595.76840 0.42080 15.74570 42.15035 41.60900 133.62126
17.35000 -2579.95419 0.00094 22.29693 53.81301 67.83633 137.48856
17.45000 -2563.58780 1.48372 22.34939 45.67765 40.50587 135.71783
17.55000 -2543.88060 8.14310 16.16479 45.39859 31.74765 136.30687
17.65000 -2531.92285 3.33911 24.62831 46.95492 61.23010 148.91652
17.75000 -2511.51649 6.70492 16.43515 97.23709 49.96170 171.63814
17.85000 -2497.94455 5.28713 15.67908 65.84497 70.80691 146.12797
17.95000 -2489.35789 -4.09429 31.97497 119.79965 105.26722 229.76190
18.05000 -2466.15315 1.00456 25.43994 40.38520 34.01747 126.42515
18.15000 -2457.20614 4.57737 18.90553 133.41338 58.24312 142.81670
18.25000 -2442.87825 -0.01094 25.95583 53.20673 44.99126 133.86998
18.35000 -2430.31980 4.36201 18.67736 77.09433 102.75924 129.23610
18.45000 -2413.39252 0.78188 27.69594 33.03918 35.38046 107.19055
18.55000 -2396.40571 0.62659 15.59871 68.86955 57.41586 116.84122
18.65000 -2384.64272 7.12188 26.57960 40.95653 37.95055 112.23842
18.75000 -2376.82885 1.21908 17.66985 44.77603 50.11041 113.03591
18.85000 -2360.20488 3.93366 15.29491 50.94461 47.71390 113.21583
18.95000 -2342.39467 2.52490 11.39326 56.49828 52.54876 113.67698
19.05000 -2334.28956 0.62121 29.95666 37.19399 39.54257 113.16371
19.15000 -2320.61602 4.75508 6.95077 40.02731 57.44269 106.77066
19.25000 -2300.71880 2.40264 21.18574 42.90976 38.28848 108.32269
19.35000 -2296.66844 -0.67032 13.99277 78.72249 35.77116 125.15623
19.45000 -2279.94450 1.89369 15.83275 31.05549 30.61362 107.80282
19.55000 -2273.70968 10.99066 9.33487 168.06110 283.17222 121.66720
19.65000 -2251.91069 1.56318 18.41866 41.73780 35.82032 104.46213
19.75000 -2238.36488 2.48039 20.93534 45.78406 43.36968 101.15086
19.85000 -2223.64743 0.02142 11.58502 31.15554 27.80124 90.37386
19.95000 -2220.36831 3.04251 28.94756 45.82892 48.39034 78.25303
