0.1875 -0.50423 25.8711 0.88233 97.51741 97.18042 79.95828
0.5625 -1.67643 52.9797 -0.54915 94.63426 88.14369 74.07266
0.9375 0.2109 73.76002 0.84939 90.67642 80.19494 69.07321
1.3125 -0.3951 88.7941 -0.61269 86.41469 72.84459 63.08978
1.6875 -0.7453 99.9935 -2.17903 80.93937 68.36413 58.39849
2.0625 -0.97194 110.94136 0.01894 75.53805 64.09771 54.795
2.4375 -0.47429 122.30566 -0.19883 68.03968 60.62003 51.48202
2.8125 -0.73321 134.3029 -0.09282 61.84242 54.18871 47.98451
3.1875 -0.66345 144.07383 -0.48606 55.40682 49.95825 45.32512
3.5625 0.13042 153.83842 -0.1802 51.45821 45.24885 42.62081
3.9375 1.04933 161.58215 -0.84724 47.99956 40.99801 39.34455
4.3125 1.17704 168.97707 -0.76871 43.93602 37.85728 37.26597
4.6875 1.93588 173.92802 -0.98896 41.39389 35.76408 34.7318
5.0625 1.10256 178.46852 -0.28801 40.01924 33.30415 33.313
5.4375 1.54685 182.5281 0.20426 37.97759 31.02357 31.34224
5.8125 1.12673 184.94476 -0.43557 36.02182 30.37915 29.62486
6.1875 0.80493 188.82981 0.29037 34.88745 29.39929 28.33407
6.5625 0.56746 192.36476 0.25412 32.91278 28.16481 26.83135
6.9375 -0.26102 194.79809 -0.00031 31.65071 26.01773 26.14191
7.3125 -0.64627 196.57435 -0.54251 30.68523 24.72612 24.87267
7.6875 0.65276 198.73139 -0.37342 29.53911 23.41819 24.193
8.0625 1.57991 199.84023 -0.81006 28.75512 22.19881 23.38497
8.4375 1.45252 200.56501 -0.47618 27.30416 20.89894 22.4377
8.8125 2.02143 200.96329 -0.14074 27.39374 20.83492 21.22696
9.1875 2.49416 201.7425 0.20736 26.03838 20.06508 20.4077
9.5625 2.30403 202.09346 0.3206 25.01628 20.39963 19.17359
9.9375 2.57155 203.38013 1.47464 24.59673 19.86763 18.72422
10.3125 2.04674 204.57295 1.93178 23.34925 19.56416 17.39258
10.6875 1.63557 204.76099 3.0962 22.8628 18.27234 17.0292
11.0625 0.1604 205.44098 3.3771 22.3923 16.95313 16.37929
11.4375 0.06408 205.54687 3.36606 21.44582 15.32521 15.36431
11.8125 -0.67837 206.36993 3.48104 20.25225 15.43201 14.5943
12.1875 -1.3023 206.47179 3.30445 19.25773 15.29326 13.64572
12.5625 -0.46868 207.46373 2.44089 19.5367 14.44756 13.37258
12.9375 -0.1335 208.76656 2.41346 18.77818 13.62146 13.22846
13.3125 1.38268 207.79709 2.28875 18.08214 13.19649 12.35416
13.6875 1.38014 207.92745 0.95231 18.31313 12.74237 12.17589
14.0625 0.03438 206.96496 1.16713 17.24831 12.40849 11.68123
14.4375 -0.19506 206.45629 1.35862 17.9564 12.07938 11.1386
14.8125 -2.34614 206.58845 0.23516 17.00459 12.03354 11.09489
15.1875 -1.84634 207.59094 1.61377 15.35923 11.22555 10.63427
15.5625 -1.16719 208.02273 0.47537 14.29226 10.54375 10.22947
15.9375 -0.48268 208.00848 0.29781 13.81289 10.25925 9.96969
16.3125 -0.1148 207.3354 0.07628 14.23891 10.22121 9.92952
16.6875 -0.96987 206.49412 -0.8141 12.93512 9.107 9.38974
17.0625 0.7942 206.74667 -1.0479 13.9195 8.09652 9.35567
17.4375 -0.51199 206.30797 0.01605 13.44248 9.20864 9.2682
17.8125 -0.95289 206.37323 0.48031 13.10322 9.14611 8.94012
18.1875 0.37904 206.61125 0.90713 11.40694 9.29531 8.53059
18.5625 0.37489 207.23306 0.63007 12.16686 8.60291 7.74056
18.9375 0.86407 207.10985 0.22727 11.95963 8.48708 7.01867
19.3125 1.10379 207.66397 -0.01607 10.94674 7.41136 7.86087
19.6875 1.84973 206.04754 -0.78316 11.56675 7.66501 7.56298
20.0625 1.44797 205.73049 -1.2731 10.23103 8.18695 6.69492
20.4375 0.60213 206.60902 -1.17991 10.03256 8.23965 7.05427
20.8125 0.67959 206.5063 -2.18046 9.84935 7.45507 6.79875
21.1875 0.24107 205.4859 -1.18309 8.77099 7.01691 7.15766
21.5625 -0.50323 206.7096 -0.41229 10.62185 5.91086 5.9694
21.9375 0.1452 206.02609 -0.48803 9.42324 6.72037 5.62887
22.3125 -2.15908 206.33969 -0.20915 8.525 5.38194 6.62756
22.6875 1.33855 205.524 0.9178 9.86378 5.53074 6.0767
23.0625 0.12437 205.66704 -0.46256 7.88019 6.62831 5.49049
23.4375 0.404 204.85265 1.73022 9.58189 5.42029 6.36732
23.8125 -0.45742 204.56679 0.31507 7.76492 6.28499 5.76789
24.1875 0.80426 204.42366 0.50723 8.45201 5.33928 5.07251
24.5625 -0.90918 203.7882 -0.43114 7.41453 6.92241 6.38948
24.9375 -0.29017 205.25632 -0.17252 10.61923 5.87139 5.64687
25.3125 -2.07737 203.61444 -1.99394 7.86806 5.86545 5.82701
25.6875 -1.14079 203.72206 -1.62872 7.71344 6.43554 6.79748
26.0625 0.89674 203.67351 -1.73291 8.80075 5.0574 5.39169
26.4375 -0.57807 204.13021 -2.24354 8.5535 5.95733 5.13892
26.8125 0.68027 203.5666 -0.18523 7.03791 5.85521 5.95873
27.1875 -0.86106 202.56342 -0.99874 7.09825 4.92808 4.17944
27.5625 2.5692 203.64926 -0.55674 8.16439 4.81397 4.84731
27.9375 -1.99281 202.54964 1.25731 8.11944 4.5524 2.11968
28.3125 -0.88007 200.19975 -0.78475 6.92327 5.89176 4.36468
28.6875 -0.75005 201.11814 3.17235 5.8151 5.78912 6.54596
29.0625 0.25892 202.36256 -0.82306 4.57772 3.46518 3.15307
29.4375 0.65959 198.14051 1.32147 5.03011 4.76306 4.42428
29.8125 3.47303 202.2976 1.17403 5.85289 4.60567 4.78657
