0.120000 2.485880
0.380000 -1.894070
0.620000 0.828840
0.880000 -2.503490
1.120000 -2.675320
1.380000 -2.041080
1.620000 -2.365120
1.880000 -2.035210
2.120000 -1.430450
2.380000 -1.211320
2.620000 -1.137810
2.880000 -1.287320
3.120000 -1.282360
3.380000 -1.171930
3.620000 -1.195160
3.880000 -1.263640
4.120000 -1.346950
4.380000 -1.282950
4.620000 -1.531370
4.880000 -1.554600
5.120000 -1.707130
5.380000 -1.542360
5.620000 -1.564590
5.880000 -1.448010
6.120000 -1.367460
6.380000 -1.493410
6.620000 -1.114700
6.880000 -0.954640
7.120000 -0.755100
7.380000 -1.204960
7.620000 -1.075050
7.880000 -1.147960
8.120000 -1.652090
8.380000 -1.800220
8.620000 -1.822010
8.880000 -1.611920
9.120000 -2.063170
9.380000 -2.402490
9.620000 -2.434790
9.880000 -2.063040
10.120000 -2.747100
10.380000 -2.774290
10.620000 -2.886540
10.880000 -2.434840
11.120000 -2.611370
11.380000 -2.781430
11.620000 -1.827160
11.880000 0.261630
12.120000 0.519570
12.380000 -0.431250
12.620000 -2.760700
12.880000 2.964570
13.120000 2.106240
13.380000 1.895220
13.620000 -2.917600
13.880000 2.337360
14.120000 2.148310
14.380000 2.684590
14.620000 1.834770
14.880000 2.404160
