0.120000 -2.088760
0.380000 -2.166690
0.620000 -2.092910
0.880000 -2.293040
1.120000 -2.325760
1.380000 -2.281230
1.620000 -2.281930
1.880000 -2.247270
2.120000 -2.229530
2.380000 -2.196110
2.620000 -2.194560
2.880000 -2.214330
3.120000 -2.229760
3.380000 -2.279640
3.620000 -2.323570
3.880000 -2.339370
4.120000 -2.302070
4.380000 -2.197630
4.620000 -2.066070
4.880000 -1.910790
5.120000 -1.799180
5.380000 -1.659330
5.620000 -1.638860
5.880000 -1.592950
6.120000 -1.572100
6.380000 -1.501070
6.620000 -1.393970
6.880000 -1.441030
7.120000 -1.650930
7.380000 -2.516770
7.620000 -3.021030
7.880000 3.134640
8.120000 -3.127250
8.380000 -3.041840
8.620000 -3.038530
8.880000 -2.959020
9.120000 -2.998460
9.380000 -3.133720
9.620000 3.125240
9.880000 2.913520
10.120000 2.760770
10.380000 2.664790
10.620000 2.548450
10.880000 2.388090
11.120000 2.313490
11.380000 2.077840
11.620000 1.765690
11.880000 1.417680
12.120000 2.013490
12.380000 2.158300
12.620000 2.897300
12.880000 2.588530
13.120000 2.793750
13.380000 2.782940
13.620000 2.582500
13.880000 2.420350
14.120000 2.351920
14.380000 2.393150
14.620000 2.062230
14.880000 2.136000
