0.05000 -2145.28260 444.53634 4178.29997 429.14526 12.55863 770.62415
0.15000 242.53128 294.79334 4293.87086 1711.76534 1293.91161 465.97880
0.25000 -343.37590 220.27737 3962.44276 1558.82758 1261.12348 313.68842
0.35000 -740.66847 -60.85543 3930.48492 1507.73538 1484.40638 292.36809
0.45000 -494.70218 -379.90741 3982.91024 1368.13345 1412.97907 379.77964
0.55000 -763.95162 208.20256 3913.19844 1390.82856 1512.99351 516.96989
0.65000 -1047.07348 -64.79779 3750.74103 1391.54827 1543.23769 527.06824
0.75000 -1423.49940 95.03783 3584.19555 1369.49876 1535.94238 580.56430
0.85000 -1381.97154 124.33848 3544.03500 1400.45447 1555.64117 680.09347
0.95000 -1507.08090 60.20129 3462.56831 1420.12856 1576.62779 727.53785
1.05000 -1702.98279 -28.72735 3315.38667 1397.67901 1573.71934 756.43802
1.15000 -1950.53773 -3.78964 3211.19278 1317.44245 1596.19133 840.93228
1.25000 -1894.78969 -1.87483 2957.52310 1507.41569 1691.84299 1000.65163
1.35000 -2150.66521 34.46432 2690.88429 1487.45870 1719.47582 1123.67433
1.45000 -2362.00780 67.45771 2511.43149 1404.82564 1625.30622 1257.34942
1.55000 -2450.91827 5.76339 2392.94200 1350.68160 1632.72640 1285.10688
1.65000 -2585.08000 2.03678 2008.54872 1403.44159 1690.83587 1447.53035
1.75000 -2733.32917 49.75691 1874.42070 1329.55405 1590.11681 1596.53632
1.85000 -2812.78768 -46.03814 1564.45292 1330.57065 1599.33588 1783.65298
1.95000 -2921.34522 26.13215 1298.63424 1327.88548 1499.80106 2020.59337
2.05000 -3014.17291 -67.82215 1144.54008 1292.96110 1407.18491 2075.22205
2.15000 -3055.15592 14.57459 1182.06083 1252.37556 1329.81596 2139.41269
2.25000 -3148.58275 11.55176 1040.37742 1166.39266 1237.91956 2184.69214
2.35000 -3187.79936 26.79582 989.88960 1141.19580 1175.68734 2198.84616
2.45000 -3213.90936 14.43654 799.26866 1167.15587 1127.18689 2273.71791
2.55000 -3229.49855 3.15171 702.94569 1120.17984 1074.23987 2345.77091
2.65000 -3292.02825 -39.95397 743.74148 1129.23559 990.79270 2279.67023
2.75000 -3277.85306 -14.94728 640.54090 1121.00932 978.95261 2315.49869
2.85000 -3248.98013 8.99419 676.69374 1109.69519 898.42969 2351.40692
2.95000 -3243.60503 -41.24147 568.61614 1114.67242 860.82510 2354.66343
3.05000 -3288.89974 -11.32728 584.95591 1035.65722 842.87993 2314.43459
3.15000 -3274.99137 5.72959 460.50398 1060.32090 803.47159 2328.15814
3.25000 -3287.51378 -19.20056 460.59025 1033.86615 776.68772 2300.70303
3.35000 -3305.85333 1.98561 398.80064 1047.57031 744.34114 2279.15244
3.45000 -3248.45025 -32.63497 311.66550 1055.15419 718.92050 2332.99409
3.55000 -3200.09555 1.82662 398.25746 1061.42593 682.53739 2335.16721
3.65000 -3285.60556 -29.46606 269.89847 998.42535 672.92259 2266.40088
3.75000 -3243.21426 31.62556 273.67956 1018.50617 640.08315 2306.49037
3.85000 -3195.48396 -5.95189 313.30941 990.47909 620.87319 2331.50023
3.95000 -3148.11862 -3.63226 283.36853 1030.91436 587.55333 2349.97946
4.05000 -3190.26513 13.25584 121.79952 984.01721 593.87915 2326.54953
4.15000 -3162.68731 23.23974 128.31583 995.62785 573.23767 2326.70674
4.25000 -3130.80246 -10.76801 232.79955 997.21537 545.67630 2308.51023
4.35000 -3132.35984 -8.25186 110.65357 961.55969 538.47268 2312.09935
4.45000 -3139.66855 6.06974 147.62221 954.25494 521.52223 2253.83325
4.55000 -3100.01884 3.93993 290.78419 944.43098 489.19991 2237.08203
4.65000 -3099.33116 12.64470 107.17304 940.45420 485.78421 2245.36740
4.75000 -3033.67020 1.68787 91.64639 948.84724 474.64704 2285.04047
4.85000 -3053.26052 -18.51153 144.20087 932.52742 456.36912 2216.14776
4.95000 -3018.23003 7.79461 156.55338 910.42564 454.62469 2239.50026
5.05000 -3014.83407 -16.73371 122.89039 887.65958 440.21211 2220.68992
5.15000 -3018.09584 -3.91023 179.51043 873.60669 415.62861 2168.79814
5.25000 -2981.89246 -15.55928 203.93386 903.14875 412.19810 2159.85102
5.35000 -2975.85166 16.57961 122.98507 887.70041 404.01655 2146.93440
5.45000 -2977.71442 -7.22513 78.00710 886.52927 398.33363 2121.53765
5.55000 -2917.04442 10.99142 133.88069 908.96622 387.12945 2156.73038
5.65000 -2952.41216 -2.72950 131.27842 844.24047 369.50958 2091.06937
5.75000 -2918.91931 14.12719 117.37501 867.34516 376.46361 2105.90211
5.85000 -2878.07115 1.60936 118.79467 859.46682 366.52623 2121.64541
5.95000 -2835.47020 -0.30234 111.08150 897.75687 355.41166 2128.21126
6.05000 -2849.20982 5.01660 14.59183 860.79241 356.05272 2110.39496
6.15000 -2844.99064 2.32302 74.45027 846.03890 333.26248 2084.18310
6.25000 -2850.18276 -2.62306 -22.79844 843.99593 332.78557 2058.27377
6.35000 -2805.07201 -1.54165 -12.74221 829.05978 320.91038 2091.12627
6.45000 -2816.95526 -10.24416 89.21197 812.35009 320.88700 2021.66848
6.55000 -2804.75595 0.01108 48.36202 833.27465 314.77105 2008.91261
6.65000 -2796.74341 -2.71498 -27.04068 812.21728 311.90822 2005.94227
6.75000 -2743.06778 -8.86040 15.68039 828.10007 301.12151 2026.76480
6.85000 -2767.81321 -1.48200 102.34256 788.94897 297.50769 1975.59855
6.95000 -2741.69385 -2.01769 -15.54547 830.79012 287.07939 1978.00072
7.05000 -2732.55366 1.79021 6.95578 795.12163 281.90829 1978.61468
7.15000 -2711.59859 -7.90891 -64.28250 814.52154 278.19681 1976.56205
7.25000 -2706.26888 6.42966 72.70620 793.71047 269.08884 1939.67193
7.35000 -2679.30538 -5.27366 -40.71686 792.53424 266.54727 1960.93133
7.45000 -2660.05642 -3.03219 32.54181 795.53874 265.84626 1950.06694
7.55000 -2684.89783 -3.20908 -89.12576 780.49337 262.12591 1907.99855
7.65000 -2620.78532 -3.66907 -64.04823 792.97898 258.17703 1948.30266
7.75000 -2613.51385 -3.19164 5.01058 784.31711 250.92406 1931.52466
7.85000 -2618.58571 -5.69681 -83.58440 777.84377 245.69624 1912.21018
7.95000 -2593.62030 9.74942 -42.02754 765.54556 242.19736 1907.83173
8.05000 -2561.28149 5.54867 -11.84508 785.83399 236.31619 1913.58814
8.15000 -2552.73690 -3.65934 -48.39532 758.32088 233.23898 1906.71339
8.25000 -2554.66271 5.97890 -95.70030 759.38002 236.58664 1883.91447
8.35000 -2524.85726 1.36429 -68.85179 764.62314 232.34515 1894.44078
8.45000 -2544.53116 4.81045 17.50192 736.44471 222.53383 1844.62268
8.55000 -2524.48524 -3.05695 -51.28619 740.32601 221.21859 1838.96987
8.65000 -2493.57462 1.20679 -17.26255 750.89198 220.44852 1853.01415
8.75000 -2513.56569 1.37639 -64.18327 715.16338 210.70283 1816.64890
8.85000 -2467.76519 -11.02360 -75.50523 730.46885 208.64081 1841.90940
8.95000 -2467.75641 8.81386 -16.37765 719.41501 211.10339 1802.52618
9.05000 -2446.31455 -2.61607 -12.83212 716.81333 202.84617 1805.87901
9.15000 -2416.44531 4.07615 -4.48640 725.52578 194.98595 1809.27625
9.25000 -2421.27918 -4.61177 -19.52502 725.25750 199.34324 1783.26586
9.35000 -2407.27987 2.51124 35.53907 711.34034 196.98123 1764.15622
9.45000 -2360.64812 -5.35759 -72.92987 722.58428 183.00937 1811.89856
9.55000 -2372.92917 -3.03582 -14.80564 701.69135 189.22332 1759.03152
9.65000 -2374.80080 -0.31943 -38.43465 696.24169 185.94594 1743.51751
9.75000 -2367.10285 -4.45846 -34.85881 685.15539 191.13838 1723.20181
9.85000 -2363.52994 -4.66844 -65.33309 690.75689 185.26477 1708.88614
9.95000 -2348.39672 1.98470 -67.77451 672.13100 180.68665 1706.64104
10.05000 -2316.98831 -4.23314 3.12435 683.74133 169.83238 1710.38348
10.15000 -2300.21485 -0.21101 -12.00410 667.10614 168.39679 1706.16457
10.25000 -2296.88632 2.28233 -45.57418 651.00179 165.78093 1697.58693
10.35000 -2288.39952 0.78191 -62.98273 649.21595 163.22506 1684.78045
10.45000 -2251.92585 -4.99594 -7.16671 664.44338 165.60846 1695.04002
10.55000 -2284.08365 -4.36108 -2.08496 641.71731 167.67224 1632.08593
10.65000 -2254.69730 4.61044 -66.58841 657.81476 160.92551 1652.01712
10.75000 -2237.80323 0.66195 -93.31520 652.73776 163.72527 1652.82952
10.85000 -2248.95938 1.93023 -33.08682 639.73591 155.88628 1613.70200
10.95000 -2208.85109 -3.16383 -52.35519 653.23613 151.86353 1636.18856
11.05000 -2196.28153 1.59983 -18.09077 650.98300 154.46339 1625.73549
11.15000 -2198.88221 -1.09316 -50.88136 635.23597 151.88852 1603.08309
11.25000 -2189.64298 -0.52892 -96.45043 630.31845 153.97899 1606.21155
11.35000 -2155.11177 2.22176 -22.65193 652.25984 149.23392 1606.60909
11.45000 -2169.12958 -2.32128 -33.60659 624.97871 143.52035 1574.72758
11.55000 -2156.56386 -0.62604 -23.95781 623.05826 142.42886 1563.37985
11.65000 -2137.48593 3.91961 -41.52121 630.96118 148.59667 1572.88487
11.75000 -2130.94756 -0.67178 -30.03008 614.34166 138.22356 1556.88916
11.85000 -2098.04368 -2.05131 -29.13929 632.47581 133.98274 1573.26345
11.95000 -2091.70496 -2.29821 -28.80063 614.27528 133.24100 1560.89432
12.05000 -2099.82899 0.54378 -24.48371 608.57558 135.49659 1530.20899
12.15000 -2067.71370 0.64840 -73.02973 611.66305 133.28042 1553.75156
12.25000 -2074.26620 2.20268 -21.17898 602.45452 135.84087 1523.16888
12.35000 -2058.00998 2.98064 -52.91171 594.56223 131.40409 1524.18527
12.45000 -2048.90936 1.91340 -80.64884 598.29798 130.13544 1515.05022
12.55000 -2053.27270 1.00495 9.28599 583.26105 129.43491 1481.84660
12.65000 -2043.43523 1.56590 -62.55924 585.90780 123.83929 1481.62115
12.75000 -2019.14648 -4.67028 -42.21852 583.93503 126.28930 1488.84291
12.85000 -2002.69063 -0.75706 -72.71561 581.16730 120.28398 1498.56562
12.95000 -1999.54467 3.78004 -89.65242 580.69882 119.73983 1480.42881
13.05000 -1994.42626 2.22038 -52.76411 580.53513 124.02607 1461.95716
13.15000 -1969.44237 -0.94954 -10.09060 573.35326 115.00465 1474.59969
13.25000 -1954.71564 2.04074 -39.34442 590.22780 114.21555 1464.79066
13.35000 -1971.48373 0.13118 -54.38193 558.94515 113.41184 1430.97933
13.45000 -1939.94583 -4.28173 -66.75619 576.53935 114.59518 1448.66808
13.55000 -1936.11305 -3.55489 -47.75397 562.63476 111.08501 1434.49203
13.65000 -1936.97727 0.19919 -111.53251 555.69222 112.94415 1423.82667
13.75000 -1911.20990 -2.64415 -34.16250 557.03761 107.20423 1434.22530
13.85000 -1915.20567 3.20458 -70.67713 555.04706 111.34081 1407.58261
13.95000 -1908.73728 -2.49276 -70.17503 541.21447 105.49734 1403.04826
14.05000 -1893.89958 -0.77687 -50.64253 548.65801 103.87272 1397.46173
14.15000 -1872.91724 -1.80392 -33.03718 553.25325 106.50369 1400.72251
14.25000 -1894.85758 4.55185 -44.27044 526.79126 108.88058 1360.26119
14.35000 -1883.51595 -1.72771 -56.05676 518.22124 102.97550 1361.34775
14.45000 -1864.98092 -1.34849 -109.57583 531.93328 97.69518 1363.63546
14.55000 -1859.29513 1.19252 -82.00439 525.08267 110.00503 1348.01836
14.65000 -1831.18431 0.68364 -29.35156 530.65120 103.69003 1363.16347
14.75000 -1828.17666 2.27780 -38.63015 528.33225 102.80985 1352.91519
14.85000 -1814.34754 -4.91845 -55.08208 530.16137 103.40393 1352.38916
14.95000 -1828.80066 1.50259 -59.36741 524.99073 93.55782 1321.07046
15.05000 -1810.25204 -0.45628 -66.25087 519.77616 96.16500 1324.65835
15.15000 -1810.62317 -0.00872 -117.52529 508.12599 95.19551 1310.92286
15.25000 -1791.15116 0.75822 -110.17536 519.24038 95.33632 1317.26228
15.35000 -1796.60197 0.59714 -10.70131 505.81340 99.73906 1290.78422
15.45000 -1765.08165 0.13985 -68.39610 515.20683 95.60069 1312.53355
15.55000 -1768.93295 1.05020 -61.98766 508.23167 94.88402 1294.44701
15.65000 -1744.66626 2.79754 -48.48043 506.46622 90.59187 1305.09675
15.75000 -1742.83434 -1.70492 -76.45382 504.15006 88.85725 1291.50505
15.85000 -1737.68885 -1.53254 -77.19877 500.61399 81.33886 1282.14836
15.95000 -1736.02700 -0.49842 -17.62921 499.10131 88.23122 1267.54902
16.05000 -1715.28404 0.21766 -90.70300 501.74066 90.88798 1279.58026
16.15000 -1700.11206 1.08917 -133.48000 499.44095 86.98046 1284.38886
16.25000 -1714.90146 -0.46574 -93.43478 489.21902 85.55602 1249.99114
16.35000 -1689.34291 0.16648 -4.19797 490.78195 80.08815 1258.05479
16.45000 -1685.01286 1.34524 -49.39905 491.28211 89.50913 1250.14087
16.55000 -1687.97400 -2.99475 -12.30963 481.48315 80.35357 1232.07418
16.65000 -1674.89657 -0.21862 -31.55304 477.09356 85.49749 1236.92726
16.75000 -1662.94667 -0.51836 -42.50829 479.81124 82.65858 1233.29326
16.85000 -1662.37209 -2.33669 -51.68895 477.11999 80.49780 1220.67210
16.95000 -1652.86719 -0.43279 -56.31565 478.03209 80.69380 1220.86826
17.05000 -1641.12996 0.39710 -62.48745 474.57789 80.03296 1218.00493
17.15000 -1643.21458 0.69072 -38.95494 468.00097 82.95527 1203.02376
17.25000 -1620.37483 0.63764 -36.74942 460.71881 79.30784 1218.53638
17.35000 -1617.35373 -1.08310 -68.04722 470.98082 81.21496 1206.03941
17.45000 -1609.60378 -0.80514 -45.41849 464.46738 79.18298 1199.88295
17.55000 -1614.26396 0.89988 -14.68135 471.35176 75.21982 1175.34894
17.65000 -1594.26469 0.90543 -42.54570 463.06824 80.40666 1189.28866
17.75000 -1570.63535 0.70938 -65.65908 465.38662 71.10927 1206.67400
17.85000 -1595.69217 -1.81890 -100.46960 448.68876 75.35626 1164.54641
17.95000 -1585.47093 -0.84239 -50.70452 454.83777 73.45139 1159.58015
18.05000 -1571.62748 -0.24724 -71.21162 452.77551 71.67139 1163.28439
18.15000 -1559.82086 -0.26815 -73.53160 461.16022 68.82851 1162.39551
18.25000 -1568.15476 1.04553 -60.19279 435.68394 66.63860 1145.75348
18.35000 -1561.50096 1.04728 -35.47475 434.46136 78.93691 1137.83032
18.45000 -1548.07915 0.98049 -75.15944 445.99509 73.86083 1140.43217
18.55000 -1537.87572 -0.40383 -52.06573 436.34604 64.44749 1139.04470
18.65000 -1533.03209 -0.70818 -109.85083 443.65219 67.84999 1130.59834
18.75000 -1522.28450 0.75703 -113.38891 436.63297 65.57751 1133.13506
18.85000 -1522.08846 1.39124 -39.10573 431.10017 66.15324 1116.12820
18.95000 -1513.94060 0.95938 -55.59727 442.28401 68.55164 1112.35244
19.05000 -1510.37431 1.73154 -73.98031 434.95919 66.28874 1103.44916
19.15000 -1499.56918 0.73515 -42.28583 422.85892 66.32945 1107.75988
19.25000 -1487.45818 -0.31564 -54.85411 439.66404 67.69191 1105.85482
19.35000 -1480.26818 0.38791 -4.67891 433.83014 58.26877 1098.45027
19.45000 -1470.61323 -0.58438 -68.90985 431.52374 60.49189 1104.52037
19.55000 -1469.53821 -0.03373 -22.98853 422.22220 62.12598 1090.30458
19.65000 -1463.89577 -2.11376 -33.37075 423.59664 60.93721 1081.62064
19.75000 -1466.45508 0.41328 -71.64022 419.32849 64.86800 1073.61076
19.85000 -1446.26527 -0.65075 -40.86048 424.53275 67.95581 1079.78597
19.95000 -1447.86026 -0.58049 -28.67789 413.64358 60.67409 1068.23458
