0.12500 0.05276
0.37500 0.00509
0.62500 0.01658
0.87500 0.00696
1.12500 0.01138
1.37500 0.01726
1.62500 0.01535
1.87500 0.01821
2.12500 0.02139
2.37500 0.02883
2.62500 0.04897
2.87500 0.04557
3.12500 0.05494
3.37500 0.03695
3.62500 0.02877
3.87500 0.01252
4.12500 0.01531
4.37500 0.02584
4.62500 0.02808
4.87500 0.03662
5.12500 0.03726
5.37500 0.03815
5.62500 0.03055
5.87500 0.02387
6.12500 0.01465
6.37500 0.01472
6.62500 0.00358
6.87500 0.01079
7.12500 0.00677
7.37500 0.01005
7.62500 0.01479
7.87500 0.00707
8.12500 0.00734
8.37500 0.01984
8.62500 0.01977
8.87500 0.01173
9.12500 0.00953
9.37500 0.01938
9.62500 0.03433
9.87500 0.03552
10.12500 0.02510
10.37500 0.02741
10.62500 0.02649
10.87500 0.02986
11.12500 0.04100
11.37500 0.03278
11.62500 0.05088
11.87500 0.01913
12.12500 0.02657
12.37500 0.01309
12.62500 0.01312
12.87500 0.02546
13.12500 0.00918
13.37500 0.00717
13.62500 0.02762
13.87500 0.02543
14.12500 0.01041
14.37500 0.01486
14.62500 0.00948
14.87500 0.01907
