0.12500 0.01891
0.37500 0.02168
0.62500 0.01468
0.87500 0.02260
1.12500 0.01353
1.37500 0.00428
1.62500 0.00676
1.87500 0.00496
2.12500 0.01675
2.37500 0.01113
2.62500 0.01050
2.87500 0.00612
3.12500 0.00812
3.37500 0.00877
3.62500 0.00585
3.87500 0.01037
4.12500 0.00558
4.37500 0.00748
4.62500 0.00207
4.87500 0.01397
5.12500 0.00872
5.37500 0.00650
5.62500 0.01574
5.87500 0.00599
6.12500 0.00854
6.37500 0.00945
6.62500 0.00927
6.87500 0.00898
7.12500 0.01219
7.37500 0.02051
7.62500 0.02394
7.87500 0.01234
8.12500 0.01220
8.37500 0.02042
8.62500 0.01442
8.87500 0.00871
9.12500 0.01944
9.37500 0.00610
9.62500 0.01419
9.87500 0.00677
10.12500 0.00831
10.37500 0.00713
10.62500 0.01145
10.87500 0.01189
11.12500 0.01205
11.37500 0.00206
11.62500 0.01437
11.87500 0.00985
12.12500 0.02208
12.37500 0.02426
12.62500 0.02791
12.87500 0.02689
13.12500 0.00737
13.37500 0.01854
13.62500 0.01784
13.87500 0.01854
14.12500 0.00375
14.37500 0.03170
14.62500 0.01621
14.87500 0.02192
