0.120000 3.028050
0.380000 -1.575550
0.620000 -0.725250
0.880000 -0.322200
1.120000 -0.906940
1.380000 -0.657210
1.620000 -0.824490
1.880000 -0.424550
2.120000 -0.238600
2.380000 -0.136610
2.620000 -0.048080
2.880000 0.025020
3.120000 -0.065170
3.380000 -0.286770
3.620000 -0.186330
3.880000 -0.157830
4.120000 -0.232690
4.380000 -0.774440
4.620000 -0.905320
4.880000 -0.778780
5.120000 1.192870
5.380000 1.326890
5.620000 0.838420
5.880000 -0.046830
6.120000 -0.416030
6.380000 0.110070
6.620000 -0.999660
6.880000 -0.910970
7.120000 -1.150040
7.380000 -1.682660
7.620000 -2.348010
7.880000 -2.478880
8.120000 -1.448090
8.380000 -2.247980
8.620000 -0.920300
8.880000 -0.519010
9.120000 -0.718380
9.380000 0.521380
9.620000 -1.219100
9.880000 -0.841200
10.120000 -1.445420
10.380000 -1.739570
10.620000 -2.203710
10.880000 -2.306810
11.120000 -2.239640
11.380000 -2.744640
11.620000 -1.750390
11.880000 -1.348810
12.120000 -1.772280
12.380000 -2.880290
12.620000 -2.227220
12.880000 2.232540
13.120000 2.140840
13.380000 2.452160
13.620000 -0.042800
13.880000 1.658170
14.120000 0.331980
14.380000 1.054840
14.620000 0.283300
14.880000 2.459810
