0.05000 2303.58353
0.15000 3990.80381
0.25000 6078.31435
0.35000 7700.10416
0.45000 8565.33408
0.55000 9299.76063
0.65000 9884.48089
0.75000 10178.38581
0.85000 10404.90249
0.95000 10153.90805
1.05000 9865.78464
1.15000 9743.72313
1.25000 9271.47135
1.35000 8862.33113
1.45000 8506.20940
1.55000 8117.81610
1.65000 7724.58298
1.75000 7345.81345
1.85000 6924.37103
1.95000 6614.94279
2.05000 6487.66989
2.15000 6034.92749
2.25000 5813.01740
2.35000 5655.83384
2.45000 5388.62788
2.55000 5157.26514
2.65000 4991.28149
2.75000 4674.56341
2.85000 4727.78276
2.95000 4291.76529
3.05000 4302.79396
3.15000 4162.67299
3.25000 3943.04802
3.35000 3725.79057
3.45000 3710.41071
3.55000 3610.31059
3.65000 3440.83575
3.75000 3437.16496
3.85000 3204.69744
3.95000 3144.18671
4.05000 3057.13557
4.15000 2965.27390
4.25000 2961.32079
4.35000 2876.38244
4.45000 2781.13808
4.55000 2709.90470
4.65000 2620.76317
4.75000 2605.20509
4.85000 2522.84904
4.95000 2446.59886
5.05000 2329.61968
5.15000 2233.15463
5.25000 2164.18614
5.35000 2103.23836
5.45000 1997.22584
5.55000 1922.23471
5.65000 1862.73082
5.75000 1828.18461
5.85000 1730.04682
5.95000 1675.30255
6.05000 1562.37279
6.15000 1527.49910
6.25000 1462.86568
6.35000 1456.39353
6.45000 1409.60403
6.55000 1302.50197
6.65000 1283.67158
6.75000 1234.89467
6.85000 1185.48735
6.95000 1147.89213
7.05000 1138.73193
7.15000 1051.76780
7.25000 1049.69602
7.35000 981.75850
7.45000 930.84772
7.55000 936.40979
7.65000 873.15331
7.75000 878.92501
7.85000 825.36506
7.95000 806.37704
8.05000 789.64590
8.15000 766.65577
8.25000 727.27929
8.35000 718.23192
8.45000 718.24553
8.55000 690.63395
8.65000 648.83148
8.75000 643.55197
8.85000 641.32580
8.95000 625.43621
9.05000 612.33640
9.15000 585.07260
9.25000 581.28552
9.35000 554.24725
9.45000 550.61740
9.55000 527.96735
9.65000 517.02086
9.75000 541.22664
9.85000 502.87020
9.95000 499.56970
10.05000 467.20061
10.15000 462.76697
10.25000 447.21992
10.35000 453.36963
10.45000 434.31350
10.55000 429.31901
10.65000 435.97028
10.75000 402.97398
10.85000 402.61480
10.95000 405.15614
11.05000 390.74610
11.15000 384.11695
11.25000 382.74601
11.35000 353.21937
11.45000 365.76940
11.55000 344.25253
11.65000 334.00291
11.75000 329.37188
11.85000 329.06639
11.95000 321.09090
12.05000 316.53119
12.15000 317.51600
12.25000 308.83969
12.35000 313.47761
12.45000 285.02948
12.55000 296.03119
12.65000 290.32411
12.75000 283.76785
12.85000 275.42963
12.95000 270.71326
13.05000 256.91980
13.15000 251.33171
13.25000 240.90542
13.35000 239.82556
13.45000 248.29659
13.55000 230.46106
13.65000 221.66145
13.75000 232.86172
13.85000 237.19565
13.95000 203.23068
14.05000 221.04330
14.15000 206.49903
14.25000 219.20236
14.35000 193.63515
14.45000 195.03336
14.55000 202.35032
14.65000 203.96619
14.75000 186.76360
14.85000 193.24702
14.95000 179.22528
15.05000 184.14591
15.15000 176.69241
15.25000 182.27772
15.35000 171.36446
15.45000 166.97398
15.55000 180.35685
15.65000 176.10730
15.75000 162.18591
15.85000 152.58174
15.95000 168.96943
16.05000 162.91621
16.15000 154.02762
16.25000 156.31697
16.35000 155.57165
16.45000 156.02378
16.55000 152.85139
16.65000 141.39566
16.75000 155.31696
16.85000 155.08541
16.95000 154.34616
17.05000 150.41164
17.15000 142.12552
17.25000 147.92094
17.35000 148.85952
17.45000 150.19819
17.55000 138.72042
17.65000 128.50022
17.75000 127.50172
17.85000 120.47547
17.95000 124.85356
18.05000 136.26527
18.15000 123.37630
18.25000 109.53803
18.35000 126.47049
18.45000 126.50422
18.55000 116.66480
18.65000 97.02835
18.75000 105.41772
18.85000 110.95958
18.95000 104.39791
19.05000 125.29700
19.15000 104.10697
19.25000 98.77888
19.35000 88.96750
19.45000 98.32491
19.55000 87.36721
19.65000 105.88519
19.75000 98.07633
19.85000 104.66139
19.95000 72.33531
