0.120000 -0.204010
0.380000 -0.097620
0.620000 2.114860
0.880000 -1.138050
1.120000 -0.306790
1.380000 -0.820820
1.620000 -1.505550
1.880000 1.193770
2.120000 -0.354000
2.380000 0.533810
2.620000 1.141080
2.880000 2.931740
3.120000 -0.377890
3.380000 -1.410180
3.620000 -1.939870
3.880000 1.240040
4.120000 0.901700
4.380000 -1.303030
4.620000 -1.986890
4.880000 -2.476800
5.120000 -2.947950
5.380000 -2.683790
5.620000 -3.073930
5.880000 0.280230
6.120000 -0.561380
6.380000 1.357810
6.620000 3.078480
6.880000 1.209740
7.120000 -0.234130
7.380000 -1.897080
7.620000 -2.561240
7.880000 0.871280
8.120000 2.602790
8.380000 -1.725600
8.620000 2.721180
8.880000 -2.986930
9.120000 1.201860
9.380000 2.598360
9.620000 0.427580
9.880000 2.680380
10.120000 -1.683550
10.380000 1.790020
10.620000 1.226220
10.880000 0.966850
11.120000 -0.437870
11.380000 -1.636030
11.620000 -1.679030
11.880000 -2.597580
12.120000 -2.635890
12.380000 -1.828380
12.620000 0.073300
12.880000 -0.587100
13.120000 -1.396290
13.380000 0.018220
13.620000 0.522460
13.880000 1.169550
14.120000 -2.260910
14.380000 -2.748550
14.620000 -2.232800
14.880000 -2.958770
15.120000 -3.023570
15.380000 1.555470
15.620000 1.300610
15.880000 2.612580
16.120000 -2.401230
16.380000 1.989280
16.620000 -0.017830
16.880000 -1.014200
17.120000 -0.956890
17.380000 0.717820
17.620000 -0.452230
17.880000 0.869160
18.120000 -0.200080
18.380000 2.961680
18.620000 0.112220
18.880000 2.684480
19.120000 -0.870600
19.380000 -2.543960
19.620000 0.158620
19.880000 -0.646520
