0.12500 0.02277
0.37500 0.06890
0.62500 0.07310
0.87500 0.15481
1.12500 0.15698
1.37500 0.18690
1.62500 0.21619
1.87500 0.22603
2.12500 0.26159
2.37500 0.23830
2.62500 0.21539
2.87500 0.19525
3.12500 0.17326
3.37500 0.17524
3.62500 0.16565
3.87500 0.13536
4.12500 0.13781
4.37500 0.10700
4.62500 0.11559
4.87500 0.09252
5.12500 0.05555
5.37500 0.05655
5.62500 0.05485
5.87500 0.05481
6.12500 0.04755
6.37500 0.03488
6.62500 0.03075
6.87500 0.03743
7.12500 0.03399
7.37500 0.03699
7.62500 0.04276
7.87500 0.04553
8.12500 0.07346
8.37500 0.08577
8.62500 0.05610
8.87500 0.06753
9.12500 0.06451
9.37500 0.03721
9.62500 0.03675
9.87500 0.07043
10.12500 0.04334
10.37500 0.04539
10.62500 0.05087
10.87500 0.04038
11.12500 0.02249
11.37500 0.02966
11.62500 0.03595
11.87500 0.01704
12.12500 0.02606
12.37500 0.02479
12.62500 0.04115
12.87500 0.07698
13.12500 0.06317
13.37500 0.07646
13.62500 0.07837
13.87500 0.09052
14.12500 0.09502
14.37500 0.06288
14.62500 0.04269
14.87500 0.08478
