0.05000 3657.31847
0.15000 6551.97003
0.25000 8868.03250
0.35000 9903.55139
0.45000 10285.51419
0.55000 10573.75268
0.65000 10544.83145
0.75000 10459.30639
0.85000 10219.34441
0.95000 9966.70042
1.05000 9599.93326
1.15000 9442.02846
1.25000 9143.63896
1.35000 8693.50149
1.45000 8362.56529
1.55000 8011.04803
1.65000 7735.60666
1.75000 7493.18265
1.85000 7179.68907
1.95000 6916.48509
2.05000 6623.37100
2.15000 6361.90465
2.25000 6177.64127
2.35000 5972.48368
2.45000 5750.81681
2.55000 5559.63360
2.65000 5417.10922
2.75000 5208.76991
2.85000 5147.92657
2.95000 4893.40354
3.05000 4733.23537
3.15000 4599.24853
3.25000 4445.64699
3.35000 4294.82037
3.45000 4200.78639
3.55000 4126.92666
3.65000 3945.40303
3.75000 3855.18476
3.85000 3773.12364
3.95000 3637.72611
4.05000 3550.89035
4.15000 3441.08828
4.25000 3374.56632
4.35000 3278.99155
4.45000 3184.19144
4.55000 3075.47019
4.65000 3018.08678
4.75000 2980.90681
4.85000 2911.79664
4.95000 2863.02989
5.05000 2746.00735
5.15000 2697.79400
5.25000 2598.64850
5.35000 2507.11385
5.45000 2485.50460
5.55000 2430.85923
5.65000 2388.66763
5.75000 2287.60733
5.85000 2213.19138
5.95000 2188.82858
6.05000 2089.42942
6.15000 2060.88754
6.25000 1993.15023
6.35000 1944.85420
6.45000 1830.36087
6.55000 1798.99337
6.65000 1804.84683
6.75000 1743.76720
6.85000 1662.58547
6.95000 1630.09224
7.05000 1625.90210
7.15000 1532.69719
7.25000 1452.01276
7.35000 1438.40683
7.45000 1391.21130
7.55000 1372.49447
7.65000 1325.72758
7.75000 1289.99610
7.85000 1243.44570
7.95000 1234.68600
8.05000 1202.28823
8.15000 1179.22352
8.25000 1136.85674
8.35000 1093.11203
8.45000 1080.69122
8.55000 1035.92165
8.65000 1008.83880
8.75000 987.21582
8.85000 959.77445
8.95000 931.89231
9.05000 921.06218
9.15000 890.04562
9.25000 856.06127
9.35000 842.94317
9.45000 820.58641
9.55000 801.57830
9.65000 766.87030
9.75000 745.03303
9.85000 709.31574
9.95000 688.75344
10.05000 671.47165
10.15000 657.46425
10.25000 635.91832
10.35000 611.55587
10.45000 603.91542
10.55000 576.98832
10.65000 568.38257
10.75000 540.53706
10.85000 542.67807
10.95000 517.84004
11.05000 507.87927
11.15000 494.50518
11.25000 481.16561
11.35000 487.71323
11.45000 465.61068
11.55000 459.83160
11.65000 449.76602
11.75000 428.92575
11.85000 426.34527
11.95000 404.69878
12.05000 399.11564
12.15000 400.99665
12.25000 397.24174
12.35000 378.73536
12.45000 372.76853
12.55000 359.75807
12.65000 352.86356
12.75000 357.99464
12.85000 345.84151
12.95000 341.69701
13.05000 331.18157
13.15000 323.81891
13.25000 311.76172
13.35000 318.11634
13.45000 305.95420
13.55000 305.89925
13.65000 300.40448
13.75000 290.59391
13.85000 295.87355
13.95000 282.08381
14.05000 282.15447
14.15000 285.58699
14.25000 281.44546
14.35000 274.04454
14.45000 265.84874
14.55000 253.79473
14.65000 263.08731
14.75000 247.08676
14.85000 252.41103
14.95000 240.53724
15.05000 235.99007
15.15000 229.60488
15.25000 237.31562
15.35000 230.41687
15.45000 220.35869
15.55000 231.22094
15.65000 219.85871
15.75000 218.88228
15.85000 215.77426
15.95000 209.27692
16.05000 214.72981
16.15000 204.24666
16.25000 198.91603
16.35000 200.85859
16.45000 182.83210
16.55000 194.74933
16.65000 183.67967
16.75000 182.08768
16.85000 175.51836
16.95000 179.41754
17.05000 173.79837
17.15000 174.84117
17.25000 165.08775
17.35000 170.58952
17.45000 166.23405
17.55000 163.65691
17.65000 155.72379
17.75000 161.60616
17.85000 153.28032
17.95000 150.13018
18.05000 147.06445
18.15000 150.89563
18.25000 143.34507
18.35000 145.68393
18.45000 138.09198
18.55000 137.80121
18.65000 140.67279
18.75000 135.73109
18.85000 132.27135
18.95000 127.96817
19.05000 129.60536
19.15000 128.32815
19.25000 123.65014
19.35000 127.12741
19.45000 123.39973
19.55000 130.22945
19.65000 121.25346
19.75000 125.43172
19.85000 122.48337
19.95000 112.97418
