0.12500 0.01111
0.37500 0.03167
0.62500 0.05738
0.87500 0.09778
1.12500 0.13755
1.37500 0.16074
1.62500 0.19731
1.87500 0.22743
2.12500 0.25524
2.37500 0.27710
2.62500 0.30631
2.87500 0.33452
3.12500 0.35598
3.37500 0.37497
3.62500 0.38128
3.87500 0.39421
4.12500 0.39190
4.37500 0.40247
4.62500 0.39000
4.87500 0.38970
5.12500 0.37294
5.37500 0.36604
5.62500 0.35407
5.87500 0.34146
6.12500 0.31602
6.37500 0.30397
6.62500 0.29482
6.87500 0.25170
7.12500 0.24488
7.37500 0.21103
7.62500 0.19164
7.87500 0.16483
8.12500 0.13798
8.37500 0.10956
8.62500 0.11173
8.87500 0.10619
9.12500 0.09198
9.37500 0.09780
9.62500 0.06400
9.87500 0.07225
10.12500 0.07742
10.37500 0.08153
10.62500 0.08416
10.87500 0.06079
11.12500 0.07828
11.37500 0.08440
11.62500 0.07403
11.87500 0.06706
12.12500 0.04493
12.37500 0.04829
12.62500 0.03144
12.87500 0.04160
13.12500 0.06476
13.37500 0.07213
13.62500 0.09209
13.87500 0.08788
14.12500 0.08972
14.37500 0.09860
14.62500 0.12102
14.87500 0.10956
