0.120000 2.042340
0.380000 0.959860
0.620000 2.086430
0.880000 2.673250
1.120000 2.605060
1.380000 2.707290
1.620000 2.571640
1.880000 2.580450
2.120000 2.658160
2.380000 2.646650
2.620000 2.621800
2.880000 2.595630
3.120000 2.577620
3.380000 2.556990
3.620000 2.524500
3.880000 2.475760
4.120000 2.399100
4.380000 2.338010
4.620000 2.269800
4.880000 2.229550
5.120000 2.163030
5.380000 1.994560
5.620000 1.866730
5.880000 1.802560
6.120000 1.714090
6.380000 1.637910
6.620000 1.620840
6.880000 1.551360
7.120000 1.554930
7.380000 1.416850
7.620000 1.379710
7.880000 1.481300
8.120000 1.386000
8.380000 1.214430
8.620000 1.334330
8.880000 1.458750
9.120000 1.508540
9.380000 1.352540
9.620000 1.792130
9.880000 1.601320
10.120000 1.788760
10.380000 1.608130
10.620000 1.401410
10.880000 1.560680
11.120000 1.485440
11.380000 1.449190
11.620000 0.902740
11.880000 0.634410
12.120000 0.097380
12.380000 0.419640
12.620000 -0.169760
12.880000 -0.328840
13.120000 -0.174710
13.380000 -0.499250
13.620000 -0.786130
13.880000 -1.060390
14.120000 -0.705530
14.380000 -1.122040
14.620000 -0.939940
14.880000 -1.251030
