0.12500 0.03058
0.37500 0.02965
0.62500 0.05542
0.87500 0.09032
1.12500 0.14360
1.37500 0.18011
1.62500 0.22006
1.87500 0.25027
2.12500 0.27653
2.37500 0.29393
2.62500 0.28970
2.87500 0.29021
3.12500 0.30030
3.37500 0.29670
3.62500 0.28071
3.87500 0.26651
4.12500 0.24776
4.37500 0.22810
4.62500 0.19642
4.87500 0.15609
5.12500 0.12506
5.37500 0.09756
5.62500 0.08415
5.87500 0.07230
6.12500 0.06693
6.37500 0.05253
6.62500 0.05337
6.87500 0.04402
7.12500 0.04495
7.37500 0.04778
7.62500 0.05765
7.87500 0.05313
8.12500 0.06387
8.37500 0.07101
8.62500 0.06389
8.87500 0.08799
9.12500 0.09460
9.37500 0.09756
9.62500 0.09912
9.87500 0.09443
10.12500 0.08926
10.37500 0.08089
10.62500 0.05184
10.87500 0.02631
11.12500 0.03522
11.37500 0.01914
11.62500 0.03658
11.87500 0.05321
12.12500 0.03871
12.37500 0.05683
12.62500 0.05882
12.87500 0.04869
13.12500 0.03969
13.37500 0.05649
13.62500 0.02633
13.87500 0.02609
14.12500 0.01351
14.37500 0.04042
14.62500 0.03249
14.87500 0.02590
