0.2 1.66223 17.4624 0.78847 111.61582 110.64114 93.30531
0.6 -0.33508 37.83298 0.06841 110.43304 104.5804 90.71756
1.0 0.98512 55.57224 0.33245 110.19206 96.99576 86.15106
1.4 0.70147 67.82534 0.0852 109.45778 91.7396 82.19448
1.8 1.82067 77.25864 0.43558 108.73492 86.71146 78.37476
2.2 1.13786 83.02835 -0.23051 108.26831 82.24527 74.71023
2.6 1.33035 89.17575 0.15907 105.65524 78.2297 70.80304
3.0 1.33898 92.72534 0.80229 102.61747 75.28081 66.94379
3.4 1.9416 96.64113 0.20287 99.6014 71.53053 63.02659
3.8 2.60901 100.43728 0.06473 94.08304 69.11883 60.80191
4.2 3.01183 104.31585 -0.01824 88.52853 67.56466 58.03317
4.6 3.46754 110.75447 -0.39312 81.96006 67.95286 55.49906
5.0 4.33499 120.5797 0.12069 75.45685 68.39783 53.20951
5.4 5.65452 132.19431 -0.05867 69.32758 67.92959 49.71352
5.8 5.80681 143.45148 -0.71311 63.51865 63.51845 46.92082
6.2 6.02563 154.95933 -0.6328 58.63931 57.16056 43.84584
6.6 4.85556 165.83511 -0.59787 54.2346 51.0478 40.54711
7.0 4.16378 173.38379 -1.21611 49.59359 46.30184 37.26967
7.4 1.48559 180.22168 -0.3846 45.64195 42.43551 34.76321
7.8 -0.26723 186.78643 -0.47175 42.74046 37.27915 32.49796
8.2 -1.01468 190.6499 -0.03748 40.40262 33.56947 30.41203
8.6 -0.77838 193.10389 0.18692 38.68316 31.70566 28.58558
9.0 -0.55952 195.55138 0.43111 37.33283 29.87831 27.46845
9.4 -0.80192 196.94136 0.22307 35.93158 27.46191 25.99413
9.8 -1.2204 197.95909 0.09938 35.89505 25.91404 25.30711
10.2 -1.10467 198.90432 -0.05078 34.94196 24.71742 23.98321
10.6 -0.92478 199.80961 -0.06939 33.69344 24.02594 22.76665
11.0 -1.40953 200.90069 -0.23882 32.42646 23.30313 21.99685
11.4 -0.40818 201.97393 -0.86998 30.90215 22.43671 21.33274
11.8 -0.52775 202.5399 -0.8881 29.57217 22.09873 19.9139
12.2 -0.33426 203.03347 -0.98278 27.92916 22.08518 19.52209
12.6 1.04572 203.56417 -0.62094 26.42088 22.22509 18.64312
13.0 0.93527 204.74464 -0.57757 25.27318 22.20518 18.25741
13.4 1.20237 205.88135 -0.19516 24.01321 21.00558 17.69145
13.8 1.30753 207.13653 -0.1054 23.57359 19.75769 17.07793
14.2 1.6254 208.22055 0.53429 23.0018 18.22589 16.90354
14.6 1.53452 208.44335 0.55369 21.91075 17.0801 16.05916
15.0 0.70628 208.30348 0.51376 21.09559 16.76926 15.80166
15.4 0.89907 209.16707 0.24506 20.82324 16.35673 15.09331
15.8 -0.38246 209.87014 -0.11866 20.20107 16.51877 14.8825
16.2 -0.27716 211.21385 -0.09358 19.20424 15.37413 14.6382
16.6 -0.50953 211.81944 0.16117 19.32401 14.07999 14.64788
17.0 -0.38168 211.24363 0.07601 19.04692 13.45302 14.23743
17.4 -0.75642 210.67789 0.00594 18.51989 12.29945 13.76226
17.8 -0.92719 210.20394 0.57286 18.27746 11.46351 13.4872
18.2 -0.47161 209.31844 0.65244 17.5933 11.72184 13.22215
18.6 -1.03663 208.57412 0.62277 17.62619 11.54973 12.76879
19.0 -0.42358 208.29234 1.37548 16.71814 11.86127 12.41206
19.4 0.09106 207.91156 1.62004 16.11425 11.84617 12.17133
19.8 0.14686 207.90006 1.3832 15.6654 11.9859 11.34669
