0.05000 -51082.46001 -388.89036 12525.91930 38324.78471 40917.93681 48208.24424
0.15000 -51167.92068 850.91166 2400.82758 21183.53920 19040.75715 45336.41344
0.25000 -40298.58013 90.40151 728.89101 14545.27889 8861.38901 33749.18643
0.35000 -31833.58489 22.90769 118.93151 10513.55892 6201.56474 26988.74520
0.45000 -27071.85210 6.68728 512.05786 8292.13571 4308.61831 22663.64723
0.55000 -23350.39297 27.89640 -16.70504 6958.05141 3856.84404 19889.42238
0.65000 -21216.45124 62.79830 298.42783 5981.34976 3253.81564 17468.81149
0.75000 -19304.78043 46.06900 215.61699 5626.01412 3189.40105 15959.05087
0.85000 -17956.36168 39.35261 11.79721 4783.36607 2830.67135 14552.45017
0.95000 -16719.90165 -15.40043 -141.25261 4353.13995 2513.82526 13359.43459
1.05000 -15838.37027 68.08518 -327.81292 4045.87253 2603.32487 12304.03840
1.15000 -15124.50289 -5.26672 10.73440 3727.72155 2393.13939 11464.82674
1.25000 -14351.80760 1.19550 -18.50358 3547.52435 2186.12774 11013.00599
1.35000 -13805.96815 -15.70524 -24.93404 3121.04973 2564.83099 10219.51548
1.45000 -13309.62899 19.91297 49.56209 3147.93304 1941.52928 9485.93388
1.55000 -12773.77381 3.76756 -283.64441 2677.73583 1826.37557 9016.72707
1.65000 -12239.10971 26.04829 -19.65566 2425.77869 1836.75185 8617.66297
1.75000 -11886.87110 4.20642 -17.33857 2584.61199 2100.38000 8207.29646
1.85000 -11433.38161 22.24019 -47.24382 2061.37217 1640.79421 7845.78626
1.95000 -11069.28658 -27.15763 317.53935 2006.66450 1570.33646 7520.21533
2.05000 -10826.15310 8.39283 -58.64618 2500.20971 1682.36115 7154.82362
2.15000 -10565.54810 5.35127 -49.05228 1716.39182 1717.20392 6893.69976
2.25000 -10275.82964 -40.59421 -95.75199 1718.05566 1642.86311 6699.14677
2.35000 -10058.60112 19.80270 64.12432 1603.81699 1735.64069 6260.06789
2.45000 -9803.20960 -33.49577 25.63120 1466.30993 1509.37962 6062.12757
2.55000 -9598.53929 -13.63031 -54.50787 1255.47568 1432.60693 5695.87726
2.65000 -9389.58518 -41.93561 70.58514 1255.37286 1429.06099 5424.51643
2.75000 -9201.80086 -26.15447 -50.91300 1114.69794 1429.99380 5275.94455
2.85000 -9014.56365 -15.90716 -65.11718 1269.69125 1368.65237 5067.56510
2.95000 -8899.49417 2.79659 -104.53506 1044.83111 1423.10252 4694.70877
3.05000 -8784.14906 -20.92030 63.99950 1187.30166 1633.58131 4563.37923
3.15000 -8660.22975 -63.69525 -65.27206 1350.82956 1535.26895 4364.99247
3.25000 -8599.54970 -13.17156 43.17191 836.32048 1423.71437 4230.11142
3.35000 -8517.38405 -31.44134 -56.16917 1302.79204 1290.31992 4137.81338
3.45000 -8430.92834 -18.30465 -23.67764 835.01143 1218.06624 3968.66111
3.55000 -8386.25809 -20.13594 -25.01569 859.85546 1207.36331 3779.40140
3.65000 -8301.97642 36.41001 -125.98442 875.29737 2051.88489 3727.40095
3.75000 -8255.65408 -11.41793 14.60478 772.66161 1083.11897 3597.07652
3.85000 -8226.08722 11.70064 -115.36791 978.06148 1445.09309 3544.70455
3.95000 -8193.42473 -16.90716 -1.69800 918.73927 1132.78417 3443.30452
4.05000 -8129.33169 -8.33666 -59.95729 1126.90144 1089.22335 3370.86876
4.15000 -8102.30447 -16.92230 22.63094 858.51530 934.08459 3214.29690
4.25000 -8005.94282 -3.43776 -3.25121 1127.47752 1083.57515 3171.49690
4.35000 -7961.31261 -14.70546 16.24819 807.02447 876.47482 3080.04946
4.45000 -7889.47939 -23.40198 -22.06969 864.27009 962.82483 3002.96515
4.55000 -7816.03908 -11.00751 -58.98475 935.86342 1241.76934 2906.06413
4.65000 -7736.85983 -5.10609 -46.07862 835.94018 883.69162 2818.26240
4.75000 -7699.85263 -6.96770 -3.51636 1840.99770 763.46098 2830.89544
4.85000 -7578.64793 -5.02056 -42.54168 732.20751 773.68664 2638.37902
4.95000 -7492.73501 -8.25726 -98.69266 814.02536 677.49728 2591.14913
5.05000 -7402.08860 3.58150 -65.31073 700.76939 684.32849 2484.15277
5.15000 -7328.04349 0.31011 -74.05454 994.91503 595.83327 2441.12468
5.25000 -7250.21012 -10.48392 -66.33584 731.35006 508.60611 2368.60670
5.35000 -7158.79378 -6.88594 -29.22770 638.19844 481.74692 2312.39343
5.45000 -7090.68804 8.75302 -49.55163 626.40893 555.33429 2260.45506
5.55000 -7027.44313 -11.66025 -60.90772 692.56053 1166.00314 2308.27642
5.65000 -6926.25549 -0.87828 -63.80745 636.93911 612.23018 2135.28549
5.75000 -6847.06670 3.98308 -67.97262 570.08738 426.60768 2075.69255
5.85000 -6785.10723 2.85300 -40.95672 577.29606 415.73428 1989.66458
5.95000 -6702.36827 0.20948 -61.07863 513.84118 363.60639 1958.72281
6.05000 -6643.12097 2.28772 -70.44856 649.27507 589.57772 1946.14950
6.15000 -6537.48134 5.33446 -64.71267 1333.09730 512.74525 2035.41386
6.25000 -6491.51813 9.51852 -69.47989 437.31262 372.84557 1804.56754
6.35000 -6422.42309 0.33030 16.37735 476.81068 331.17911 1782.75285
6.45000 -6350.36396 12.37235 -60.52515 586.80043 352.90598 1755.18061
6.55000 -6296.10637 5.14272 -28.08889 404.65321 374.20246 1703.70213
6.65000 -6239.96339 -0.99628 -0.53268 422.21818 541.24335 1675.64343
6.75000 -6178.97360 5.00843 -33.72508 376.12761 368.73934 1631.54669
6.85000 -6115.93668 5.47299 -30.85156 369.65080 329.94307 1600.74410
6.95000 -6073.04374 2.90363 -43.50660 454.93047 358.12937 1591.49183
7.05000 -6005.09296 13.75220 -11.45413 361.39364 339.52957 1520.30710
7.15000 -5957.05110 7.73881 -7.43033 555.25381 376.84909 1507.89551
7.25000 -5918.69335 -1.34136 -4.41707 394.68752 564.59093 1536.59876
7.35000 -5876.86719 7.53309 -48.42417 383.77569 246.83498 1400.59311
7.45000 -5818.27605 -2.22215 -24.26531 360.36061 342.68461 1407.13524
7.55000 -5759.78012 2.55423 31.92347 402.82287 270.51177 1381.63712
7.65000 -5708.24891 0.10980 -12.03749 360.57210 302.00247 1367.24214
7.75000 -5659.72546 -1.10910 -21.05458 320.44720 244.81156 1312.64371
7.85000 -5618.71540 -3.31773 6.88834 337.28771 340.86455 1277.41373
7.95000 -5568.60896 -0.06807 -8.32461 365.04081 280.92026 1245.01823
8.05000 -5513.29194 -0.22612 -22.17131 280.43554 226.60126 1221.29983
8.15000 -5468.58995 1.20369 -23.27952 288.84077 247.75841 1213.49967
8.25000 -5421.13755 -3.97112 -26.38361 410.06451 333.37253 1314.92842
8.35000 -5364.47894 8.01189 10.12293 316.86354 446.92931 1151.73564
8.45000 -5314.05244 2.95801 -4.18093 285.86934 240.61180 1137.97183
8.55000 -5266.85489 4.62732 10.50270 327.00584 306.10261 1131.83201
8.65000 -5227.53697 -7.62160 1.11306 288.43969 365.46075 1097.82604
8.75000 -5174.72348 -0.24109 8.97356 266.10247 175.73585 1054.82169
8.85000 -5120.48306 -0.20918 -28.86339 270.28538 264.80925 1050.88423
8.95000 -5066.84245 1.14468 -19.27405 277.53300 221.66687 1024.54962
9.05000 -5024.02038 5.90288 -14.60973 241.22236 228.85053 1018.83532
9.15000 -4976.57866 2.82994 35.16031 272.86496 519.14846 981.02762
9.25000 -4935.94629 -11.87238 18.14435 528.35515 560.68889 1689.80932
9.35000 -4876.16486 7.49860 18.70799 515.75221 465.57093 975.94552
9.45000 -4834.23594 9.79374 7.58093 286.98742 474.40071 940.10903
9.55000 -4804.22231 -1.29675 9.54804 392.59138 473.71065 924.77248
9.65000 -4763.83682 3.59111 -21.64588 283.81828 324.23212 932.70513
9.75000 -4717.68572 -1.29058 -4.36983 225.56314 271.99324 947.21121
9.85000 -4690.28758 0.83935 -24.51078 224.25868 148.44906 854.19788
9.95000 -4644.32519 0.08464 -4.21797 378.04266 316.57399 881.33049
10.05000 -4610.25111 3.05809 2.56819 248.35248 173.60690 831.36291
10.15000 -4564.67422 12.95025 5.18702 544.92503 733.36801 964.71691
10.25000 -4543.75296 -3.77151 10.28848 210.82680 420.51021 908.84321
10.35000 -4503.67832 1.51747 -23.05463 171.13426 192.55595 777.91116
10.45000 -4467.61839 4.38710 8.53483 218.28615 339.11683 894.18836
10.55000 -4441.40930 -6.85463 -37.30365 209.44666 204.85953 772.25091
10.65000 -4407.09917 2.92024 -9.33484 173.38103 130.95197 733.89939
10.75000 -4372.26307 -3.32646 -12.99600 261.63827 262.31593 781.93340
10.85000 -4348.12944 1.04613 -21.74262 272.80283 171.31252 780.26969
10.95000 -4313.91320 7.22723 -13.39480 176.68340 208.47658 694.85772
11.05000 -4286.18462 2.13533 -31.41461 154.47537 203.65458 681.81726
11.15000 -4252.48235 -0.42023 -32.99460 184.31723 177.57458 673.91102
11.25000 -4218.61138 -0.40912 -33.99770 150.81899 138.86676 665.42534
11.35000 -4187.32014 -0.89363 -20.02738 168.35040 123.62395 652.63851
11.45000 -4151.91282 0.13816 3.68153 171.26492 146.83455 639.53867
11.55000 -4121.65192 -0.37084 -13.78546 169.29428 110.85014 631.68303
11.65000 -4094.06543 -1.01250 -5.73800 199.01784 225.58369 627.70541
11.75000 -4066.63842 -5.17063 -12.07051 149.71065 175.69319 607.51948
11.85000 -4039.66781 -1.65023 -15.36785 188.04781 155.67835 592.15794
11.95000 -4009.64198 2.91337 -10.59899 170.67041 112.37235 587.00110
12.05000 -3975.48814 0.67098 -32.92509 185.57033 111.39523 571.10153
12.15000 -3951.52269 2.98135 -11.42546 148.12165 140.70721 534.59839
12.25000 -3922.27614 3.54633 -15.24150 154.61740 109.87156 538.36994
12.35000 -3887.91955 5.07403 2.90774 333.23113 373.50883 571.97091
12.45000 -3864.89088 -0.07351 -9.52755 168.28586 124.63287 530.32915
12.55000 -3846.75128 -3.49717 -1.89544 209.68669 156.41683 530.35583
12.65000 -3813.64487 1.14454 -19.77178 178.21663 123.80263 526.66628
12.75000 -3788.79823 -1.93638 -1.23650 105.32645 108.94471 491.69201
12.85000 -3758.32274 -5.29517 -5.78157 202.73825 294.71279 570.92792
12.95000 -3735.21937 1.27887 4.12313 187.52276 174.45074 501.31914
13.05000 -3701.43160 2.50508 -4.61131 113.06996 101.46540 468.71556
13.15000 -3681.12144 1.18579 13.98066 150.71434 133.25570 462.39289
13.25000 -3643.49215 4.24182 7.94320 148.83794 100.97097 472.68197
13.35000 -3624.65714 -3.33329 -3.86103 126.95697 231.96168 477.93416
13.45000 -3593.73698 0.02306 6.69188 260.80977 176.46053 438.11306
13.55000 -3575.34749 -0.11603 -3.33035 187.93642 137.19105 444.01221
13.65000 -3548.04629 -0.65971 -6.62050 116.80159 125.30328 429.30068
13.75000 -3520.90456 0.76304 10.34377 190.27889 119.83770 513.60751
13.85000 -3498.98396 4.08945 19.79868 130.68897 95.00528 440.29629
13.95000 -3474.64024 -0.04241 -9.48267 91.76361 77.08871 391.33404
14.05000 -3451.52859 -1.45473 -6.64222 113.73702 111.10081 385.89536
14.15000 -3429.64907 0.98153 -9.85059 148.02361 104.46867 391.90187
14.25000 -3400.78683 -0.85709 -16.25326 134.48980 88.38043 382.69968
14.35000 -3384.64166 -12.23847 3.71805 369.02120 275.84328 443.19848
14.45000 -3354.39861 -0.10481 -6.08819 186.66831 97.66030 361.34490
14.55000 -3331.37252 0.94761 -27.55257 84.75454 85.89354 363.41586
14.65000 -3309.46635 0.07765 -18.66782 107.12507 92.61924 352.87866
14.75000 -3288.89354 -1.85598 -39.19366 78.25210 98.85441 341.03419
14.85000 -3263.08999 -1.44629 -17.32372 173.65728 85.63448 343.05645
14.95000 -3245.82927 -4.80775 -10.74745 128.61858 109.81888 353.68364
15.05000 -3217.23635 3.19539 -32.02782 195.50943 99.71414 340.01133
15.15000 -3199.94010 4.53883 -14.59370 85.61909 140.60654 314.90939
15.25000 -3176.64219 -3.09878 -50.84610 104.12711 147.97707 351.76095
15.35000 -3154.26154 3.85580 -31.31751 82.38857 137.01211 307.24912
15.45000 -3132.15138 -0.74353 -23.74173 98.07856 77.08914 303.60898
15.55000 -3106.23779 -0.80504 -30.16375 78.56737 107.58742 314.87190
15.65000 -3086.15826 0.82012 -27.24320 167.05485 55.30867 320.54256
15.75000 -3067.40545 -2.68663 -38.34906 110.54255 175.03455 301.87211
15.85000 -3048.97823 3.09057 -36.28346 101.24282 109.81436 306.79717
15.95000 -3028.91545 -0.36630 -32.46691 82.40267 87.68259 275.27050
16.05000 -3010.38961 2.64514 -25.83589 95.27113 71.82051 332.85833
16.15000 -2995.43812 1.80234 -20.40547 77.75315 74.23006 274.03993
16.25000 -2971.59670 2.38019 -32.57276 62.37014 66.78521 266.55762
16.35000 -2952.63800 1.65896 -17.62164 117.91740 66.58648 271.12989
16.45000 -2930.15366 0.75688 -29.96397 152.95983 84.23807 270.11521
16.55000 -2911.77327 6.18138 -28.33330 72.87154 70.52853 252.60963
16.65000 -2894.66993 0.37266 -34.91813 48.77898 72.43163 284.11820
16.75000 -2870.04524 3.78746 -28.00367 57.32148 65.47385 247.03434
16.85000 -2865.45791 11.25726 -29.51272 240.13897 242.89998 242.02498
16.95000 -2831.20512 -1.54073 -20.60988 126.76041 168.43967 245.28184
17.05000 -2821.23727 -0.56897 -22.92201 70.14289 132.83871 232.77152
17.15000 -2798.30633 -0.30211 -36.38636 90.81061 50.68536 229.63138
17.25000 -2793.39273 0.72730 -51.58837 342.79383 70.43649 492.85727
17.35000 -2765.31801 4.84254 -25.97996 57.71704 40.77240 215.53686
17.45000 -2747.11763 4.62630 -26.40272 58.52571 46.97475 212.81934
17.55000 -2730.55140 1.61636 -32.19201 48.76756 48.06036 213.84995
17.65000 -2710.20906 2.20180 -27.90746 62.38285 52.61201 210.75039
17.75000 -2693.33799 4.62377 -24.80690 87.43312 78.83649 222.13168
17.85000 -2680.99748 2.98865 -29.42387 63.55069 58.05305 201.91018
17.95000 -2666.37433 2.04842 -25.25428 53.39793 43.69989 198.05877
18.05000 -2646.20300 3.97339 -32.09964 53.98198 51.34352 208.37765
18.15000 -2628.46541 3.77434 -21.08763 64.60514 142.07960 206.55699
18.25000 -2609.92446 3.55478 -17.98330 98.55479 61.66595 187.69651
18.35000 -2596.85469 3.89826 -25.85517 46.36968 44.39368 182.95099
18.45000 -2580.33951 -1.32875 -15.56520 99.87022 58.30516 204.58225
18.55000 -2565.55726 -4.03210 -22.63483 103.32787 124.12055 206.74006
18.65000 -2549.96551 4.42027 -19.67585 73.47630 41.04484 183.06040
18.75000 -2539.31341 2.31640 -13.54933 75.32094 44.39914 170.75595
18.85000 -2517.20197 4.51965 -14.27788 65.77618 44.31662 191.90749
18.95000 -2505.52479 4.38721 -23.48726 92.77006 60.18530 170.32368
19.05000 -2492.38494 4.52751 -19.17929 39.26669 43.76289 197.01401
19.15000 -2474.47688 0.76357 -22.76748 47.79753 48.39416 167.82006
19.25000 -2461.02045 1.01292 -20.51453 50.52855 40.14018 168.58999
19.35000 -2446.34472 0.00560 -29.98910 39.49615 53.71113 164.21936
19.45000 -2430.41337 2.06369 -21.33793 41.09285 44.32356 157.95524
19.55000 -2417.92918 2.63227 -30.83446 67.66838 50.83686 195.17860
19.65000 -2399.12277 0.60321 -14.21824 56.12771 74.07808 166.69994
19.75000 -2393.09578 4.24540 -16.74524 323.16471 1086.98409 359.97643
19.85000 -2378.51719 2.23755 -15.15262 44.22611 41.47003 150.43252
19.95000 -2361.65174 0.64901 -0.15253 64.22703 37.49392 151.07059
