0.05000 2572.44086
0.15000 3416.98551
0.25000 4824.24380
0.35000 5293.24674
0.45000 5973.64398
0.55000 6553.19289
0.65000 6573.02236
0.75000 6586.14629
0.85000 6610.72101
0.95000 6402.82578
1.05000 6137.78702
1.15000 6114.53836
1.25000 5956.20624
1.35000 5650.82149
1.45000 5462.88674
1.55000 5271.78954
1.65000 5080.46213
1.75000 5073.15198
1.85000 4887.69102
1.95000 4774.31439
2.05000 4538.93510
2.15000 4418.35566
2.25000 4185.27847
2.35000 4054.66680
2.45000 3928.84993
2.55000 3879.81066
2.65000 3724.64792
2.75000 3657.03317
2.85000 3499.63307
2.95000 3440.96869
3.05000 3285.06819
3.15000 3143.76485
3.25000 3121.68612
3.35000 3003.67956
3.45000 2939.75042
3.55000 2874.86384
3.65000 2715.93766
3.75000 2635.67606
3.85000 2554.40985
3.95000 2470.77631
4.05000 2415.26650
4.15000 2390.89304
4.25000 2252.42769
4.35000 2187.53986
4.45000 2086.23313
4.55000 2056.52057
4.65000 1984.13145
4.75000 1944.91773
4.85000 1862.23985
4.95000 1784.11971
5.05000 1744.40858
5.15000 1683.29303
5.25000 1674.15204
5.35000 1551.62363
5.45000 1517.02193
5.55000 1511.67337
5.65000 1454.43329
5.75000 1390.73579
5.85000 1358.67560
5.95000 1364.56177
6.05000 1285.53480
6.15000 1287.41030
6.25000 1224.55522
6.35000 1190.04186
6.45000 1154.76388
6.55000 1152.10419
6.65000 1104.72150
6.75000 1082.53868
6.85000 1069.02478
6.95000 1048.22253
7.05000 1015.58138
7.15000 988.33315
7.25000 961.83474
7.35000 914.65578
7.45000 936.13701
7.55000 880.15392
7.65000 840.73750
7.75000 840.54169
7.85000 803.98578
7.95000 776.29196
8.05000 758.24808
8.15000 733.60215
8.25000 714.40895
8.35000 704.97536
8.45000 672.10001
8.55000 661.65851
8.65000 634.96628
8.75000 615.41876
8.85000 615.83430
8.95000 574.03066
9.05000 582.56571
9.15000 563.58218
9.25000 537.21707
9.35000 543.34107
9.45000 507.24726
9.55000 472.95800
9.65000 499.77820
9.75000 488.37353
9.85000 482.80919
9.95000 472.58892
10.05000 443.53677
10.15000 437.83591
10.25000 410.04252
10.35000 422.75072
10.45000 390.22310
10.55000 389.39138
10.65000 382.90424
10.75000 369.87942
10.85000 376.41532
10.95000 363.75437
11.05000 365.14508
11.15000 327.62066
11.25000 348.14205
11.35000 330.96834
11.45000 336.65161
11.55000 318.89367
11.65000 324.32343
11.75000 305.31407
11.85000 304.14943
11.95000 301.26597
12.05000 288.47176
12.15000 280.67905
12.25000 274.18368
12.35000 279.01555
12.45000 263.90311
12.55000 258.33859
12.65000 238.83806
12.75000 252.05005
12.85000 247.72923
12.95000 241.27021
13.05000 231.89325
13.15000 217.40277
13.25000 223.67557
13.35000 227.80598
13.45000 200.32660
13.55000 206.95144
13.65000 184.10866
13.75000 189.49988
13.85000 191.46343
13.95000 184.76065
14.05000 176.91419
14.15000 175.36872
14.25000 169.50119
14.35000 166.16933
14.45000 157.91846
14.55000 166.89784
14.65000 159.90241
14.75000 153.79094
14.85000 152.77408
14.95000 138.02635
15.05000 127.80411
15.15000 142.07654
15.25000 131.72770
15.35000 119.02295
15.45000 119.43108
15.55000 134.73017
15.65000 141.68346
15.75000 145.51012
15.85000 133.12712
15.95000 116.78703
16.05000 119.36275
16.15000 125.94681
16.25000 124.03217
16.35000 123.20579
16.45000 116.37242
16.55000 111.45538
16.65000 105.44332
16.75000 123.14377
16.85000 101.16570
16.95000 103.06001
17.05000 111.07462
17.15000 106.53047
17.25000 109.11969
17.35000 101.88520
17.45000 102.43144
17.55000 108.75237
17.65000 97.68658
17.75000 88.04855
17.85000 105.07949
17.95000 84.36626
18.05000 100.37342
18.15000 88.13888
18.25000 89.54817
18.35000 88.83834
18.45000 78.66462
18.55000 86.45500
18.65000 69.85058
18.75000 76.66614
18.85000 67.89299
18.95000 65.49896
19.05000 66.37235
19.15000 76.73150
19.25000 79.15282
19.35000 79.12453
19.45000 62.58836
19.55000 72.18961
19.65000 64.35157
19.75000 81.96019
19.85000 70.15904
19.95000 80.03688
