0.12500 0.00943
0.37500 0.02250
0.62500 0.05017
0.87500 0.07864
1.12500 0.10441
1.37500 0.13219
1.62500 0.17705
1.87500 0.21657
2.12500 0.27161
2.37500 0.30830
2.62500 0.34956
2.87500 0.39029
3.12500 0.39226
3.37500 0.38585
3.62500 0.37015
3.87500 0.33346
4.12500 0.30932
4.37500 0.28259
4.62500 0.27680
4.87500 0.27839
5.12500 0.26702
5.37500 0.23993
5.62500 0.19626
5.87500 0.15091
6.12500 0.12225
6.37500 0.10207
6.62500 0.07800
6.87500 0.07650
7.12500 0.06680
7.37500 0.05976
7.62500 0.04350
7.87500 0.04780
8.12500 0.03990
8.37500 0.03612
8.62500 0.04514
8.87500 0.04223
9.12500 0.03308
9.37500 0.03586
9.62500 0.02814
9.87500 0.03295
10.12500 0.03782
10.37500 0.04833
10.62500 0.04589
10.87500 0.05828
11.12500 0.06318
11.37500 0.06743
11.62500 0.06670
11.87500 0.06248
12.12500 0.09269
12.37500 0.07861
12.62500 0.07760
12.87500 0.07885
13.12500 0.07245
13.37500 0.06197
13.62500 0.05092
13.87500 0.03633
14.12500 0.03229
14.37500 0.03041
14.62500 0.02321
14.87500 0.03672
15.12500 0.03150
15.37500 0.01011
15.62500 0.02735
15.87500 0.01947
16.12500 0.02590
16.37500 0.03250
16.62500 0.02966
16.87500 0.02331
17.12500 0.03141
17.37500 0.02292
17.62500 0.01572
17.87500 0.01483
18.12500 0.02524
18.37500 0.03790
18.62500 0.00162
18.87500 0.05014
19.12500 0.02622
19.37500 0.03013
19.62500 0.04280
19.87500 0.04634
