0.12500 0.01347
0.37500 0.02467
0.62500 0.00454
0.87500 0.00997
1.12500 0.02183
1.37500 0.02740
1.62500 0.01848
1.87500 0.01155
2.12500 0.01568
2.37500 0.00874
2.62500 0.00852
2.87500 0.02458
3.12500 0.02578
3.37500 0.02591
3.62500 0.02958
3.87500 0.03728
4.12500 0.03668
4.37500 0.04136
4.62500 0.04134
4.87500 0.03900
5.12500 0.03458
5.37500 0.03609
5.62500 0.03509
5.87500 0.03700
6.12500 0.03107
6.37500 0.01389
6.62500 0.03134
6.87500 0.01753
7.12500 0.01421
7.37500 0.02061
7.62500 0.02306
7.87500 0.02473
8.12500 0.02214
8.37500 0.02304
8.62500 0.01278
8.87500 0.01293
9.12500 0.02475
9.37500 0.02837
9.62500 0.00812
9.87500 0.01180
10.12500 0.01083
10.37500 0.01347
10.62500 0.01792
10.87500 0.02495
11.12500 0.01945
11.37500 0.01727
11.62500 0.01919
11.87500 0.02258
12.12500 0.01757
12.37500 0.01061
12.62500 0.04709
12.87500 0.03358
13.12500 0.03924
13.37500 0.02835
13.62500 0.05543
13.87500 0.03985
14.12500 0.05138
14.37500 0.04119
14.62500 0.02836
14.87500 0.03382
