0.450000 -0.940260
1.350000 -1.051490
2.250000 -1.050060
3.150000 -1.036920
4.050000 -1.071080
4.950000 -1.075000
5.850000 -1.089540
6.750000 -1.071270
7.650000 -1.032390
8.550000 -1.183010
9.450000 -1.206270
10.350000 -1.363040
11.250000 -0.658620
12.150000 -0.492930
13.050000 -0.862290
13.950000 -1.211740
14.850000 -1.573470
15.750000 -2.179220
16.650000 -2.909780
17.550000 2.999390
