0.05000 -1524.82964 -217.36517 618.04283 2349.69189 2623.84391 1776.15547
0.15000 -3696.18204 253.93519 219.00674 3397.62028 2687.01721 3954.69204
0.25000 -5151.19701 118.56119 34.05334 3150.07858 3005.19590 5947.02452
0.35000 -6815.06514 74.13201 -104.90512 3297.74758 3058.43684 7372.57344
0.45000 -7842.42773 9.19226 251.33776 3417.76379 3124.31386 8861.97556
0.55000 -8748.20151 57.84309 -640.75407 3485.87191 3180.30042 9638.98797
0.65000 -9274.30601 -2.06350 -26.54854 3508.72198 3261.38808 10141.88757
0.75000 -9797.49038 73.98519 -158.87180 3561.87975 3241.66951 10626.05057
0.85000 -10180.33184 127.82142 -82.03319 3466.49019 3241.29061 10634.21905
0.95000 -10405.51316 121.45006 46.98437 3382.56888 3234.17722 10621.32295
1.05000 -10569.16186 75.32912 -23.64774 3311.74417 3190.46706 10511.66830
1.15000 -10703.84319 83.03274 22.48202 3122.07753 3133.17456 10227.85285
1.25000 -10688.97024 80.17042 0.11077 3024.50201 3066.64155 9989.40176
1.35000 -10691.56365 80.81300 -84.91579 2833.49959 2998.39019 9603.41675
1.45000 -10623.69518 60.05620 39.69511 2731.84824 2922.21408 9324.49539
1.55000 -10583.78410 70.86020 6.50888 2616.83848 2833.37721 8976.73499
1.65000 -10577.63314 93.88556 45.53483 2463.15781 2744.27333 8609.98603
1.75000 -10456.97131 102.73517 133.30104 2368.73785 2673.76994 8333.42495
1.85000 -10446.90197 37.51845 44.72810 2181.56721 2600.16216 7871.48197
1.95000 -10247.59138 93.44949 -7.27993 2153.13178 2486.99427 7662.19195
2.05000 -10186.15116 117.04135 13.40647 2022.88666 2436.57968 7297.14755
2.15000 -10108.44727 74.58504 45.36474 1902.91076 2353.84288 6992.09567
2.25000 -9988.19121 92.60919 -24.62547 1870.95144 2260.62759 6752.76941
2.35000 -9820.23310 74.89416 166.81627 1795.59404 2168.44394 6516.99760
2.45000 -9722.20563 122.62722 53.86825 1715.73373 2116.68125 6213.50277
2.55000 -9578.85440 87.33458 137.47585 1646.04702 2022.33404 5988.46450
2.65000 -9442.10299 45.10793 72.17123 1517.00617 1962.46548 5769.50641
2.75000 -9312.65063 52.45968 162.49068 1434.05357 1912.39584 5534.18706
2.85000 -9158.53579 -1.70896 187.23669 1391.86820 1834.93675 5365.35396
2.95000 -9030.83233 23.27181 166.85699 1351.33292 1765.25056 5152.61082
3.05000 -8896.89299 52.46722 59.20648 1263.87593 1717.73568 4996.66592
3.15000 -8788.94899 27.45891 91.37859 1202.96241 1678.15761 4742.51274
3.25000 -8647.93388 36.43784 121.57794 1173.79735 1612.16104 4619.75078
3.35000 -8545.48200 58.72763 280.45035 1111.63469 1582.76956 4509.04978
3.45000 -8442.41813 34.71131 156.65086 1113.11451 1515.14716 4318.43916
3.55000 -8324.58406 56.22039 315.90415 1088.39287 1467.28262 4225.32425
3.65000 -8234.97610 86.97756 97.60327 1024.73473 1422.82881 4053.02549
3.75000 -8119.90291 60.44103 136.48595 1001.98714 1365.76439 3945.75669
3.85000 -8011.35438 46.75991 163.81135 1004.05481 1320.77154 3851.66956
3.95000 -7897.45686 14.51089 161.62685 927.71822 1276.24056 3707.27608
4.05000 -7775.09439 41.70433 126.35552 920.43088 1220.14634 3574.29665
4.15000 -7639.25359 -38.56924 117.93968 896.90242 1174.13128 3549.58728
4.25000 -7560.93653 9.00384 165.92295 870.33898 1148.80639 3386.68971
4.35000 -7461.66076 20.55598 169.80068 849.23328 1084.30867 3266.50509
4.45000 -7353.31671 -3.55221 59.45278 855.03421 1043.93455 3200.84798
4.55000 -7263.76350 23.37331 33.25447 798.81399 1005.00956 3053.74481
4.65000 -7163.95914 -5.44258 56.02863 791.21313 957.55033 2970.65550
4.75000 -7068.59800 1.13646 51.16016 790.08125 907.81045 2853.89950
4.85000 -6984.08606 -12.68279 -20.34068 773.98825 871.24387 2774.79820
4.95000 -6883.41385 -26.81169 -148.25154 741.14109 831.05964 2687.29029
5.05000 -6766.53770 -37.65182 -89.89061 731.87866 788.29737 2640.62277
5.15000 -6675.83794 -44.96266 -106.20995 681.77349 761.81364 2500.20030
5.25000 -6577.25368 -45.76864 -118.79197 682.96670 710.63584 2433.62373
5.35000 -6484.19033 -50.49927 -70.03765 641.05286 676.40308 2358.14265
5.45000 -6374.25022 -34.51380 -165.29652 609.24506 650.21205 2292.53817
5.55000 -6297.33064 -21.25679 -164.69931 585.29282 609.39509 2168.70239
5.65000 -6208.86670 -10.96219 -139.68860 568.13411 584.83918 2121.99847
5.75000 -6114.16607 -30.03387 -149.72665 538.44369 551.97354 2001.54746
5.85000 -6032.41498 -27.88601 -181.58704 524.84971 524.23006 1951.00513
5.95000 -5936.07092 -25.18799 -186.36630 483.92369 494.68639 1901.59927
6.05000 -5879.79097 -26.69199 -184.40837 456.47753 471.97362 1855.55406
6.15000 -5814.96241 -19.07269 -128.11275 432.89510 459.26266 1780.07516
6.25000 -5740.09390 -19.09644 -128.31821 414.69489 445.16723 1720.93291
6.35000 -5664.79598 -11.95873 -138.92177 396.33246 425.09176 1692.35193
6.45000 -5600.46988 -10.09051 -144.15250 362.90653 406.97584 1636.04528
6.55000 -5539.99952 -22.17507 -67.28201 350.81353 400.03562 1617.56963
6.65000 -5478.11332 -28.09942 -92.02869 326.19651 382.72687 1554.52884
6.75000 -5425.54149 -23.86347 -120.31845 308.03825 374.07894 1498.76396
6.85000 -5381.29073 -18.84793 -108.97143 296.64688 363.29296 1498.44224
6.95000 -5343.01152 -20.19176 -64.74807 285.08380 351.98487 1442.69370
7.05000 -5304.51664 -17.02191 -81.93062 271.48241 342.68776 1427.48324
7.15000 -5268.65303 -19.69485 -90.28706 273.09019 335.00682 1383.14795
7.25000 -5230.76110 -19.15002 -110.17010 260.84772 329.29070 1363.13317
7.35000 -5211.09890 -15.65141 -91.70179 257.99178 317.35508 1298.06714
7.45000 -5177.91070 -21.77581 -58.39519 264.63982 307.62045 1280.99329
7.55000 -5144.07306 -16.56890 -59.56494 254.46795 301.77255 1268.71463
7.65000 -5118.13852 -17.86307 -49.94447 254.19895 300.99703 1238.14797
7.75000 -5090.56930 -14.89643 -69.41271 254.90864 291.07396 1214.65112
7.85000 -5062.24455 -12.99892 -64.63777 257.85742 284.78747 1177.95354
7.95000 -5030.34722 -9.39163 -51.37146 262.28201 280.01244 1161.75915
8.05000 -4999.54620 -11.47093 -2.69507 261.18635 274.34313 1140.28067
8.15000 -4968.15595 2.93762 -40.24252 271.36327 270.32044 1096.32006
8.25000 -4937.30025 5.87137 -35.39214 262.61339 261.66524 1082.59561
8.35000 -4898.53294 8.64680 -70.88642 262.02467 261.48778 1059.87995
8.45000 -4873.33720 12.20671 -42.70571 252.66386 254.42471 1042.25851
8.55000 -4837.53656 11.62827 -29.05993 253.63889 253.01596 1021.53576
8.65000 -4805.72693 21.83757 -31.81096 248.58036 245.17808 995.55093
8.75000 -4773.83275 20.40715 -20.48169 240.07212 237.71080 979.39788
8.85000 -4743.94649 27.24579 -61.79065 236.35451 236.73450 960.26943
8.95000 -4718.63369 30.42052 -37.14934 230.13204 231.47573 942.27700
9.05000 -4687.07044 30.72897 -36.72049 231.15007 225.41855 910.97137
9.15000 -4660.08125 29.48730 -36.91631 235.05446 220.25122 903.22330
9.25000 -4631.93978 29.88212 -29.20078 230.17408 216.34906 886.47432
9.35000 -4600.60919 29.64859 -30.29391 224.99438 209.64632 866.01616
9.45000 -4573.24835 28.26393 -42.35182 226.51327 204.33768 850.07099
9.55000 -4546.12532 29.29521 -25.17776 230.67205 199.83961 834.83222
9.65000 -4510.63675 35.07451 -6.25660 226.25017 193.46055 811.11648
9.75000 -4478.97919 36.87982 -1.32152 226.81877 184.75007 806.93523
9.85000 -4446.21848 33.48628 -6.29601 228.22662 177.84939 761.59653
9.95000 -4410.09209 34.93880 3.90754 223.60068 173.49028 765.03713
10.05000 -4375.29325 42.53454 -7.18259 216.47381 172.62352 751.47067
10.15000 -4337.97323 35.62723 2.74701 215.91407 162.29318 735.61182
10.25000 -4302.38415 36.07056 -24.04227 210.78202 157.42366 713.51102
10.35000 -4270.68311 40.83444 -21.04498 203.62562 153.24798 699.53353
10.45000 -4229.91129 36.22372 -22.33995 196.89542 148.15997 672.50018
10.55000 -4205.79383 36.84812 11.30669 195.69401 143.36598 660.31056
10.65000 -4168.58457 40.40280 -1.25733 193.55300 137.96319 650.64772
10.75000 -4139.19517 34.10613 4.24440 193.77958 132.69224 645.92489
10.85000 -4113.67903 36.00258 -29.88517 189.87484 132.39943 633.81488
10.95000 -4073.68598 39.39444 19.03733 183.52009 125.32846 607.94808
11.05000 -4043.42643 34.60726 0.55315 185.46963 121.96548 600.89286
11.15000 -4008.94464 38.84785 16.21640 172.57937 119.67953 582.46614
11.25000 -3977.23368 34.21298 15.20639 168.55934 113.44106 572.87399
11.35000 -3949.89242 34.23847 -7.08057 163.40048 111.59899 555.45890
11.45000 -3912.74435 38.16713 21.93240 158.09538 106.24602 564.02785
11.55000 -3889.26621 32.97395 5.51236 157.46004 107.44359 533.92692
11.65000 -3862.16609 27.69650 13.68955 157.14750 100.66409 532.58139
11.75000 -3831.07991 34.86741 -7.10133 149.77717 97.98597 515.71349
11.85000 -3802.14664 31.10281 12.83217 148.15312 92.10948 504.41832
11.95000 -3772.26426 31.78166 17.15811 145.03222 90.70917 503.99768
12.05000 -3741.32672 28.65665 -29.67797 142.00054 89.17908 495.56263
12.15000 -3713.43483 30.35567 4.59268 140.81631 88.18821 487.08801
12.25000 -3685.16111 29.13824 12.94213 131.12681 86.72068 468.27508
12.35000 -3660.58649 27.85629 3.31470 128.08806 82.96380 459.53444
12.45000 -3634.98917 27.82979 -11.71991 129.21171 80.86763 453.07473
12.55000 -3606.88421 28.30792 8.42986 121.95956 77.61292 442.14005
12.65000 -3587.72203 25.46706 -12.04559 118.26791 81.11155 430.54655
12.75000 -3558.90960 25.27697 4.00273 118.98293 74.25400 423.29942
12.85000 -3533.23094 26.05381 -11.16675 114.67251 73.80895 421.21602
12.95000 -3505.09061 29.13041 11.85662 113.24239 72.10643 417.28367
13.05000 -3485.08249 28.06473 -12.39845 108.28157 70.82569 409.69075
13.15000 -3458.94415 28.52021 13.56602 105.22631 71.53982 399.38874
13.25000 -3440.19635 26.61500 -19.09905 114.57882 68.33627 396.08024
13.35000 -3414.59508 24.91329 5.51281 102.43971 67.14599 385.97857
13.45000 -3391.87809 26.24230 -1.03936 99.04240 66.89522 375.82766
13.55000 -3364.83433 25.63105 -19.99069 100.90789 64.71436 376.84645
13.65000 -3341.15090 26.23397 -6.38327 112.12771 65.15713 373.31658
13.75000 -3316.84541 24.45316 -7.84219 98.57936 62.23569 360.17827
13.85000 -3297.38507 23.31709 -6.06441 95.36769 62.16787 351.33723
13.95000 -3270.99460 26.85906 -7.74384 91.93781 60.36745 340.29370
14.05000 -3251.36825 27.43454 -12.55401 92.26251 60.53848 339.84555
14.15000 -3223.60935 24.96721 5.73667 96.07840 56.53750 337.07046
14.25000 -3202.83024 22.70081 -15.84587 94.11211 57.09828 331.41527
14.35000 -3177.37345 22.91528 -16.68063 90.01451 54.86136 318.63078
14.45000 -3153.07793 24.57851 -13.76419 85.66110 58.48481 324.08877
14.55000 -3136.61073 22.82262 -4.65567 84.68406 55.44589 311.65622
14.65000 -3113.89705 25.68170 -12.89310 81.40731 54.49084 310.43130
14.75000 -3093.93360 22.94446 -25.17280 89.77308 54.69548 305.05636
14.85000 -3072.60242 25.90324 -4.21061 80.53328 52.76308 309.57006
14.95000 -3054.33623 22.31259 2.50763 77.55823 52.82650 293.00916
15.05000 -3035.91423 21.97841 -19.35054 76.34497 53.42814 291.03350
15.15000 -3014.16924 23.28424 -8.76770 77.43004 52.06517 276.60906
15.25000 -2993.15553 22.32807 -9.24643 74.29791 50.60598 285.60000
15.35000 -2976.69486 21.60724 -19.38309 69.40668 47.70859 279.70035
15.45000 -2960.65275 23.66010 -1.01464 68.39416 48.63175 265.28871
15.55000 -2945.35516 19.56556 -0.29386 65.85119 48.40558 261.98600
15.65000 -2923.23302 20.40800 -16.25243 67.08017 48.81240 266.85983
15.75000 -2905.94426 19.29971 -12.63644 66.70696 50.71101 263.88476
15.85000 -2891.46836 21.70697 -2.86800 66.73633 50.52467 260.71740
15.95000 -2873.44855 18.42466 -14.51055 60.06647 47.29459 252.10457
16.05000 -2852.80607 20.89977 -2.78341 60.87721 46.68875 258.90954
16.15000 -2838.82680 20.15528 -1.73755 60.77223 47.04663 242.54898
16.25000 -2820.95235 21.74601 3.54095 58.76851 45.86681 242.60465
16.35000 -2804.57064 19.08169 0.71675 58.35272 42.86125 235.81910
16.45000 -2789.86617 18.52085 -2.01964 57.18073 42.91057 230.90918
16.55000 -2772.89777 19.34637 2.73999 56.79046 42.70657 226.52183
16.65000 -2756.31786 17.59596 -4.40377 54.02547 41.17487 218.56535
16.75000 -2743.62206 18.97233 5.38137 54.78660 46.04644 213.61170
16.85000 -2726.36177 15.56237 -2.75924 51.88508 39.41916 213.76882
16.95000 -2708.92563 15.17149 -9.15730 51.82326 41.35001 208.40567
17.05000 -2693.52086 17.75052 -3.17967 48.75968 41.36939 204.49176
17.15000 -2672.16592 16.28118 4.76398 49.25821 40.78713 197.62578
17.25000 -2660.88274 15.77155 9.13337 48.37232 39.36879 193.42155
17.35000 -2641.04548 15.08562 -9.28035 46.29455 39.70584 191.21612
17.45000 -2629.37795 16.32594 -3.17713 48.72558 36.97955 190.17981
17.55000 -2611.95395 14.14685 -13.46106 46.89323 38.90265 188.96444
17.65000 -2592.26162 15.72879 -15.68531 45.00162 38.09188 185.74818
17.75000 -2581.95731 16.93547 -15.38530 43.87417 39.28593 176.67270
17.85000 -2565.68059 16.98881 -12.49323 41.11488 38.98056 175.18491
17.95000 -2554.23248 12.55953 -16.00829 44.48263 38.93102 166.25046
18.05000 -2535.58675 13.77008 -15.60342 44.10537 38.61300 163.57073
18.15000 -2518.91289 12.79626 -18.03791 41.46378 40.29989 158.55816
18.25000 -2504.07117 11.89438 -21.10391 40.53082 36.19727 166.84399
18.35000 -2492.10406 13.11902 -18.91858 41.33990 34.29342 153.57136
18.45000 -2478.41578 12.30509 -26.19081 41.74198 39.82096 156.06549
18.55000 -2461.41493 10.61062 -16.43512 41.19487 36.71388 159.33318
18.65000 -2448.47783 12.27182 -26.08790 41.75806 36.68043 152.28464
18.75000 -2433.28989 13.71700 -26.29082 41.69372 36.40580 152.50344
18.85000 -2417.33906 13.03167 -25.74085 40.11187 35.81120 148.82738
18.95000 -2403.89854 10.00482 -22.50225 41.42963 37.45667 141.89530
19.05000 -2389.38236 12.69016 -27.70310 35.60240 33.21108 142.85023
19.15000 -2371.87522 14.29763 -26.30730 38.49551 32.02873 143.07780
19.25000 -2358.91576 13.24699 -12.74535 37.32828 34.18930 134.51347
19.35000 -2346.26612 10.61539 -21.47720 35.44479 36.47717 130.05717
19.45000 -2335.95150 14.75187 -20.45192 36.60026 41.96706 130.16660
19.55000 -2318.26123 11.15362 -28.21698 35.67189 33.85838 135.11399
19.65000 -2303.15489 12.86456 -24.97128 34.91262 32.44879 128.08874
19.75000 -2288.37961 10.64693 -21.58421 41.44552 34.92102 138.22080
19.85000 -2278.02860 9.19328 -14.90056 33.00908 38.87939 125.26061
19.95000 -2260.30136 10.28361 -10.58903 40.17773 34.88369 128.14756
