0.05000 1362.23849
0.15000 3002.04248
0.25000 4324.72324
0.35000 4909.15659
0.45000 5541.24484
0.55000 5990.21355
0.65000 6280.98067
0.75000 6288.44250
0.85000 6228.23466
0.95000 6167.50307
1.05000 6142.63433
1.15000 5930.60776
1.25000 5757.79711
1.35000 5601.73583
1.45000 5477.07811
1.55000 5262.89165
1.65000 5148.37929
1.75000 4988.06290
1.85000 4831.51329
1.95000 4653.41967
2.05000 4574.21616
2.15000 4367.61969
2.25000 4230.48439
2.35000 4094.26900
2.45000 3954.80959
2.55000 3812.40970
2.65000 3735.80614
2.75000 3591.94964
2.85000 3487.83345
2.95000 3319.85833
3.05000 3265.19141
3.15000 3129.21386
3.25000 3068.33766
3.35000 2959.56723
3.45000 2879.95442
3.55000 2795.83521
3.65000 2715.30894
3.75000 2636.21711
3.85000 2556.72315
3.95000 2494.28459
4.05000 2389.58069
4.15000 2319.53382
4.25000 2252.07285
4.35000 2207.67186
4.45000 2130.39806
4.55000 2064.10801
4.65000 2022.69551
4.75000 1945.77331
4.85000 1913.84250
4.95000 1852.90861
5.05000 1808.74921
5.15000 1758.87855
5.25000 1698.89694
5.35000 1678.63283
5.45000 1606.76326
5.55000 1581.61271
5.65000 1549.74218
5.75000 1487.85091
5.85000 1460.75115
5.95000 1406.05734
6.05000 1368.47907
6.15000 1359.63377
6.25000 1319.41334
6.35000 1295.02104
6.45000 1231.07172
6.55000 1210.39785
6.65000 1200.37499
6.75000 1155.44376
6.85000 1117.19108
6.95000 1093.17862
7.05000 1056.63420
7.15000 1039.20786
7.25000 1021.35142
7.35000 985.34545
7.45000 942.54795
7.55000 933.65395
7.65000 910.16338
7.75000 880.20262
7.85000 857.77902
7.95000 831.68276
8.05000 811.81337
8.15000 794.86116
8.25000 773.31070
8.35000 757.68099
8.45000 730.16229
8.55000 690.26039
8.65000 692.24520
8.75000 684.71383
8.85000 656.83612
8.95000 642.51364
9.05000 613.46396
9.15000 605.16582
9.25000 597.30353
9.35000 582.17710
9.45000 563.24258
9.55000 555.30370
9.65000 543.88521
9.75000 541.89669
9.85000 526.68380
9.95000 513.23775
10.05000 504.50857
10.15000 481.52324
10.25000 473.29993
10.35000 466.88970
10.45000 449.30595
10.55000 434.32397
10.65000 421.84594
10.75000 418.65736
10.85000 408.69846
10.95000 402.77987
11.05000 390.13324
11.15000 380.12734
11.25000 370.30487
11.35000 370.10184
11.45000 352.79732
11.55000 336.52009
11.65000 339.62996
11.75000 330.66000
11.85000 323.42759
11.95000 326.15390
12.05000 302.25051
12.15000 300.59709
12.25000 289.28545
12.35000 290.99920
12.45000 280.76537
12.55000 268.83928
12.65000 257.61990
12.75000 264.61118
12.85000 251.92992
12.95000 246.86819
13.05000 251.20521
13.15000 242.37598
13.25000 233.94801
13.35000 229.78733
13.45000 225.64540
13.55000 222.46458
13.65000 204.27135
13.75000 210.30504
13.85000 202.46004
13.95000 196.04980
14.05000 193.18382
14.15000 194.41316
14.25000 190.81571
14.35000 182.83952
14.45000 177.90829
14.55000 178.99136
14.65000 171.02342
14.75000 179.76695
14.85000 173.21449
14.95000 165.81819
15.05000 171.18331
15.15000 164.90414
15.25000 157.45986
15.35000 159.49288
15.45000 155.82373
15.55000 157.94778
15.65000 150.27448
15.75000 143.15515
15.85000 149.56174
15.95000 137.94190
16.05000 135.29629
16.15000 133.75045
16.25000 123.99097
16.35000 125.67888
16.45000 124.28882
16.55000 128.38720
16.65000 112.70305
16.75000 118.65599
16.85000 111.15301
16.95000 116.84830
17.05000 112.54480
17.15000 107.77707
17.25000 113.97092
17.35000 105.67140
17.45000 101.85349
17.55000 102.35525
17.65000 103.70429
17.75000 97.99423
17.85000 94.52701
17.95000 100.66239
18.05000 87.31834
18.15000 93.93772
18.25000 88.14915
18.35000 91.92795
18.45000 89.08026
18.55000 87.36640
18.65000 86.38134
18.75000 83.80517
18.85000 89.38995
18.95000 80.93729
19.05000 103.05677
19.15000 75.38314
19.25000 79.69518
19.35000 83.17619
19.45000 79.55499
19.55000 78.14302
19.65000 74.39753
19.75000 74.26769
19.85000 75.97269
19.95000 72.80642
