0.12500 0.01779
0.37500 0.03873
0.62500 0.11083
0.87500 0.16681
1.12500 0.23662
1.37500 0.29380
1.62500 0.35762
1.87500 0.38145
2.12500 0.42438
2.37500 0.44905
2.62500 0.47608
2.87500 0.50931
3.12500 0.53404
3.37500 0.56924
3.62500 0.59227
3.87500 0.61375
4.12500 0.63022
4.37500 0.61511
4.62500 0.61160
4.87500 0.60628
5.12500 0.57140
5.37500 0.54192
5.62500 0.52269
5.87500 0.49496
6.12500 0.46634
6.37500 0.42056
6.62500 0.37982
6.87500 0.35798
7.12500 0.33514
7.37500 0.32587
7.62500 0.26784
7.87500 0.23423
8.12500 0.20900
8.37500 0.18247
8.62500 0.12713
8.87500 0.10474
9.12500 0.09804
9.37500 0.04196
9.62500 0.04926
9.87500 0.01949
10.12500 0.02399
10.37500 0.03441
10.62500 0.05055
10.87500 0.05445
11.12500 0.07134
11.37500 0.05229
11.62500 0.05605
11.87500 0.07049
12.12500 0.07604
12.37500 0.07748
12.62500 0.08939
12.87500 0.12350
13.12500 0.11819
13.37500 0.15610
13.62500 0.12206
13.87500 0.08563
14.12500 0.13034
14.37500 0.12354
14.62500 0.10912
14.87500 0.10411
