0.450000 2.746390
1.350000 2.696950
2.250000 2.744450
3.150000 2.747620
4.050000 2.771200
4.950000 2.793550
5.850000 2.800890
6.750000 2.848770
7.650000 2.899410
8.550000 2.922700
9.450000 2.743610
10.350000 2.422550
11.250000 2.298360
12.150000 2.224480
13.050000 2.199600
13.950000 2.194780
14.850000 2.126430
15.750000 2.061860
16.650000 2.287620
17.550000 1.740170
