0.120000 1.677770
0.380000 0.642260
0.620000 -0.896450
0.880000 -0.841910
1.120000 -0.971120
1.380000 -0.810750
1.620000 -0.711070
1.880000 -0.753210
2.120000 -0.742450
2.380000 -1.164150
2.620000 -1.703540
2.880000 -1.889520
3.120000 -2.555890
3.380000 3.109230
3.620000 2.697650
3.880000 2.516720
4.120000 2.089580
4.380000 1.496480
4.620000 -0.700250
4.880000 -2.611670
5.120000 -1.917770
5.380000 -0.552980
5.620000 -0.186310
5.880000 -1.586830
6.120000 -2.145820
6.380000 -1.959830
6.620000 -2.866530
6.880000 -2.876530
7.120000 2.624700
7.380000 2.704700
7.620000 -3.044880
7.880000 1.951850
8.120000 2.109020
8.380000 2.163790
8.620000 -1.459210
8.880000 2.492770
9.120000 -1.405820
9.380000 -2.565850
9.620000 3.029520
9.880000 2.596490
10.120000 2.052640
10.380000 1.809140
10.620000 1.719240
10.880000 1.593320
11.120000 1.537170
11.380000 1.589400
11.620000 0.900080
11.880000 1.011880
12.120000 2.231710
12.380000 -1.163330
12.620000 0.117570
12.880000 -0.309450
13.120000 -0.606460
13.380000 -0.476750
13.620000 -0.721470
13.880000 -2.814700
14.120000 2.672190
14.380000 -2.939790
14.620000 2.979390
14.880000 2.493020
15.120000 2.029380
15.380000 2.494870
15.620000 1.726330
15.880000 2.385700
16.120000 0.200640
16.380000 0.718190
16.620000 0.911150
16.880000 0.697140
17.120000 0.166620
17.380000 0.700730
17.620000 0.908960
17.880000 0.149240
18.120000 -1.219600
18.380000 -0.268770
18.620000 -0.475260
18.880000 -1.371430
19.120000 -0.900960
19.380000 -1.674680
19.620000 -2.445290
19.880000 2.563670
