0.05000 1219.83409
0.15000 5094.00229
0.25000 4964.22657
0.35000 6724.31083
0.45000 6588.41620
0.55000 6731.04768
0.65000 7007.17582
0.75000 6784.12351
0.85000 6991.39770
0.95000 6480.92785
1.05000 6851.58787
1.15000 6531.73779
1.25000 6385.63344
1.35000 6084.08033
1.45000 5860.91114
1.55000 5699.44300
1.65000 5686.17868
1.75000 5316.02446
1.85000 5119.61305
1.95000 5152.83965
2.05000 4832.57518
2.15000 4640.88240
2.25000 4515.87506
2.35000 4431.69092
2.45000 4232.89651
2.55000 4141.75071
2.65000 4031.14983
2.75000 3910.04093
2.85000 3816.13513
2.95000 3648.63347
3.05000 3564.61317
3.15000 3558.86820
3.25000 3425.62780
3.35000 3245.32794
3.45000 3178.11294
3.55000 3092.70525
3.65000 2948.00067
3.75000 2903.03635
3.85000 2779.16122
3.95000 2795.08414
4.05000 2696.56958
4.15000 2689.41660
4.25000 2595.73039
4.35000 2511.90657
4.45000 2439.67181
4.55000 2423.56021
4.65000 2403.41454
4.75000 2304.23743
4.85000 2221.94103
4.95000 2150.01198
5.05000 2116.64250
5.15000 2112.50955
5.25000 2005.30955
5.35000 1943.85996
5.45000 1923.33852
5.55000 1859.67663
5.65000 1827.75837
5.75000 1755.99596
5.85000 1737.04882
5.95000 1700.91023
6.05000 1699.24261
6.15000 1709.40530
6.25000 1629.48017
6.35000 1540.94599
6.45000 1536.12344
6.55000 1492.73409
6.65000 1449.05331
6.75000 1391.17871
6.85000 1384.30557
6.95000 1380.59887
7.05000 1328.39685
7.15000 1316.89820
7.25000 1317.91513
7.35000 1532.68110
7.45000 1252.86678
7.55000 1283.36615
7.65000 1209.29923
7.75000 1149.95053
7.85000 1127.38116
7.95000 1121.50308
8.05000 1145.48402
8.15000 1081.16911
8.25000 1048.02686
8.35000 1034.74928
8.45000 999.72823
8.55000 944.08015
8.65000 977.60483
8.75000 930.58493
8.85000 913.46955
8.95000 912.92697
9.05000 904.25651
9.15000 878.30070
9.25000 838.81844
9.35000 813.82727
9.45000 817.78570
9.55000 805.28634
9.65000 794.18122
9.75000 780.23221
9.85000 774.58211
9.95000 751.65338
10.05000 745.36074
10.15000 734.23487
10.25000 702.25557
10.35000 687.14162
10.45000 722.68805
10.55000 637.59810
10.65000 659.89291
10.75000 648.98128
10.85000 590.98705
10.95000 579.47641
11.05000 557.43515
11.15000 577.11425
11.25000 569.41293
11.35000 578.43302
11.45000 518.89203
11.55000 516.88632
11.65000 517.55525
11.75000 529.23629
11.85000 472.64499
11.95000 483.00313
12.05000 473.55946
12.15000 469.89333
12.25000 480.82439
12.35000 438.32875
12.45000 452.52870
12.55000 404.54327
12.65000 433.16173
12.75000 433.09384
12.85000 416.92969
12.95000 434.47926
13.05000 405.64911
13.15000 368.50917
13.25000 387.91595
13.35000 385.09739
13.45000 352.73981
13.55000 367.56714
13.65000 351.43755
13.75000 354.25512
13.85000 350.75190
13.95000 373.76110
14.05000 333.29644
14.15000 326.52398
14.25000 321.08658
14.35000 302.55760
14.45000 287.97073
14.55000 307.61862
14.65000 289.57806
14.75000 298.80493
14.85000 321.25094
14.95000 324.39208
15.05000 425.21074
15.15000 262.18003
15.25000 271.61130
15.35000 263.26069
15.45000 263.39320
15.55000 247.08030
15.65000 233.74843
15.75000 244.55347
15.85000 243.09048
15.95000 756.51742
16.05000 233.88697
16.15000 231.51745
16.25000 224.88475
16.35000 223.37907
16.45000 224.02114
16.55000 268.64995
16.65000 221.66541
16.75000 219.95275
16.85000 207.94290
16.95000 212.48558
17.05000 215.69233
17.15000 207.78374
17.25000 199.60598
17.35000 199.96977
17.45000 209.02733
17.55000 202.94768
17.65000 177.63589
17.75000 171.07188
17.85000 178.42901
17.95000 187.21247
18.05000 162.35192
18.15000 183.41020
18.25000 175.10541
18.35000 180.10804
18.45000 187.21079
18.55000 165.64930
18.65000 156.48668
18.75000 155.77951
18.85000 150.90207
18.95000 156.88680
19.05000 145.21647
19.15000 147.56951
19.25000 142.53821
19.35000 137.06205
19.45000 130.36599
19.55000 134.26832
19.65000 129.25876
19.75000 140.94120
19.85000 129.15238
19.95000 128.03872
