0.12500 0.01153
0.37500 0.05623
0.62500 0.13457
0.87500 0.20291
1.12500 0.25870
1.37500 0.31129
1.62500 0.34604
1.87500 0.37208
2.12500 0.40335
2.37500 0.42358
2.62500 0.45356
2.87500 0.47230
3.12500 0.48867
3.37500 0.51092
3.62500 0.52589
3.87500 0.54433
4.12500 0.55445
4.37500 0.56056
4.62500 0.56984
4.87500 0.57623
5.12500 0.57961
5.37500 0.56998
5.62500 0.54342
5.87500 0.52237
6.12500 0.51982
6.37500 0.48456
6.62500 0.45274
6.87500 0.44067
7.12500 0.41872
7.37500 0.40201
7.62500 0.37833
7.87500 0.36446
8.12500 0.36932
8.37500 0.34880
8.62500 0.35881
8.87500 0.36194
9.12500 0.32982
9.37500 0.29652
9.62500 0.26515
9.87500 0.20917
10.12500 0.15598
10.37500 0.11761
10.62500 0.10305
10.87500 0.06913
11.12500 0.06486
11.37500 0.07191
11.62500 0.05772
11.87500 0.05461
12.12500 0.05545
12.37500 0.07027
12.62500 0.05672
12.87500 0.06677
13.12500 0.05189
13.37500 0.02827
13.62500 0.03158
13.87500 0.02047
14.12500 0.01879
14.37500 0.00156
14.62500 0.03547
14.87500 0.01840
