0.05000 1187.11916
0.15000 2568.34714
0.25000 3767.03357
0.35000 4850.68330
0.45000 5684.65151
0.55000 6149.53574
0.65000 6648.25412
0.75000 6757.15555
0.85000 6935.47193
0.95000 6904.19810
1.05000 6770.89763
1.15000 6570.95320
1.25000 6488.91351
1.35000 6261.07864
1.45000 6162.29295
1.55000 5792.27953
1.65000 5730.72754
1.75000 5529.49010
1.85000 5419.18180
1.95000 5180.70560
2.05000 5007.50872
2.15000 4847.65624
2.25000 4713.68901
2.35000 4564.09206
2.45000 4423.22979
2.55000 4298.74930
2.65000 4214.08989
2.75000 4088.49314
2.85000 3913.42596
2.95000 3802.90544
3.05000 3669.81907
3.15000 3571.12610
3.25000 3503.80758
3.35000 3401.19329
3.45000 3332.06819
3.55000 3251.19463
3.65000 3079.13603
3.75000 3008.45573
3.85000 2961.82715
3.95000 2872.81965
4.05000 2808.64853
4.15000 2704.23800
4.25000 2708.07756
4.35000 2566.30866
4.45000 2552.17399
4.55000 2494.41593
4.65000 2407.05458
4.75000 2376.63027
4.85000 2315.87054
4.95000 2260.98644
5.05000 2195.36047
5.15000 2121.04793
5.25000 2116.43234
5.35000 2037.65668
5.45000 2020.37889
5.55000 1977.42444
5.65000 1956.13707
5.75000 1857.56651
5.85000 1884.98275
5.95000 1809.52851
6.05000 1741.68273
6.15000 1691.78013
6.25000 1683.55800
6.35000 1595.24365
6.45000 1564.66408
6.55000 1557.74597
6.65000 1495.38993
6.75000 1457.19552
6.85000 1420.04112
6.95000 1395.78940
7.05000 1392.53594
7.15000 1350.49458
7.25000 1279.04226
7.35000 1263.17832
7.45000 1225.41131
7.55000 1221.27004
7.65000 1182.52920
7.75000 1158.88822
7.85000 1133.84381
7.95000 1107.29934
8.05000 1062.17387
8.15000 1048.78457
8.25000 1014.74348
8.35000 1004.79679
8.45000 979.47546
8.55000 970.96207
8.65000 936.77973
8.75000 928.06566
8.85000 903.94457
8.95000 874.92407
9.05000 880.88466
9.15000 854.82309
9.25000 838.34297
9.35000 840.07331
9.45000 810.66722
9.55000 779.22741
9.65000 770.64063
9.75000 771.98861
9.85000 747.82278
9.95000 726.70954
10.05000 712.37200
10.15000 693.20222
10.25000 695.00530
10.35000 691.68742
10.45000 663.05322
10.55000 660.17001
10.65000 643.61710
10.75000 628.80380
10.85000 604.92791
10.95000 603.48678
11.05000 579.15916
11.15000 571.73125
11.25000 557.48952
11.35000 540.77480
11.45000 535.04182
11.55000 540.99528
11.65000 510.62687
11.75000 521.14088
11.85000 496.36057
11.95000 493.93061
12.05000 484.87467
12.15000 472.21549
12.25000 459.84116
12.35000 463.39573
12.45000 448.48149
12.55000 438.34168
12.65000 415.78803
12.75000 413.18426
12.85000 411.90929
12.95000 397.50090
13.05000 395.22637
13.15000 394.58453
13.25000 375.35519
13.35000 374.12375
13.45000 353.03806
13.55000 346.57878
13.65000 356.66438
13.75000 342.88425
13.85000 327.41188
13.95000 327.50726
14.05000 318.72350
14.15000 315.68143
14.25000 307.88357
14.35000 299.22970
14.45000 297.00482
14.55000 296.64632
14.65000 286.84215
14.75000 286.40511
14.85000 287.08583
14.95000 273.52585
15.05000 276.40692
15.15000 255.65683
15.25000 256.67832
15.35000 252.17105
15.45000 248.15665
15.55000 244.99656
15.65000 243.74364
15.75000 226.04705
15.85000 230.45932
15.95000 242.55892
16.05000 226.09194
16.15000 228.26562
16.25000 221.80076
16.35000 217.61928
16.45000 218.77499
16.55000 207.66515
16.65000 209.97818
16.75000 204.51017
16.85000 197.45160
16.95000 204.12310
17.05000 191.82588
17.15000 189.22055
17.25000 190.03143
17.35000 180.40136
17.45000 178.25885
17.55000 180.77612
17.65000 175.24855
17.75000 175.16345
17.85000 170.07962
17.95000 172.73183
18.05000 165.64239
18.15000 159.34255
18.25000 163.49313
18.35000 160.98967
18.45000 149.55658
18.55000 147.07419
18.65000 152.18934
18.75000 153.69014
18.85000 147.89627
18.95000 146.29296
19.05000 138.38488
19.15000 138.14706
19.25000 135.83877
19.35000 132.67118
19.45000 133.10251
19.55000 129.73487
19.65000 133.41055
19.75000 125.99635
19.85000 134.02911
19.95000 119.89754
