0.12500 0.04017
0.37500 0.02710
0.62500 0.03840
0.87500 0.05413
1.12500 0.08854
1.37500 0.10617
1.62500 0.13174
1.87500 0.16066
2.12500 0.17991
2.37500 0.18333
2.62500 0.19557
2.87500 0.18485
3.12500 0.18609
3.37500 0.15828
3.62500 0.15748
3.87500 0.13972
4.12500 0.13691
4.37500 0.13352
4.62500 0.10818
4.87500 0.12164
5.12500 0.09121
5.37500 0.10332
5.62500 0.09457
5.87500 0.09287
6.12500 0.07893
6.37500 0.06846
6.62500 0.08467
6.87500 0.07687
7.12500 0.08277
7.37500 0.07014
7.62500 0.05347
7.87500 0.04001
8.12500 0.04518
8.37500 0.02522
8.62500 0.02919
8.87500 0.03540
9.12500 0.06565
9.37500 0.05363
9.62500 0.05870
9.87500 0.07009
10.12500 0.06778
10.37500 0.05271
10.62500 0.07486
10.87500 0.07822
11.12500 0.06280
11.37500 0.06027
11.62500 0.05246
11.87500 0.02819
12.12500 0.03792
12.37500 0.03400
12.62500 0.07224
12.87500 0.06835
13.12500 0.05290
13.37500 0.04255
13.62500 0.02979
13.87500 0.06873
14.12500 0.04463
14.37500 0.04811
14.62500 0.04706
14.87500 0.07734
