0.2 -0.06436 20.05103 2.4884 79.22429 76.2652 68.79444
0.6 -2.24041 38.36624 0.57781 75.60889 74.12108 66.90234
1.0 -1.00557 59.55104 0.6884 73.56088 72.77354 65.17197
1.4 -0.79654 77.41927 0.86543 70.78125 68.54887 62.53908
1.8 -1.12814 93.29625 1.73527 69.09709 63.78198 60.16013
2.2 -0.49095 107.10128 1.012 64.74902 60.82 57.57326
2.6 -0.00172 119.91438 1.74816 61.36426 56.93572 53.88739
3.0 0.38122 130.65567 1.35662 57.77068 52.78553 51.53102
3.4 1.08135 140.71991 2.52021 54.533 50.565 48.85153
3.8 0.24881 150.87777 1.13349 52.42516 47.6762 46.04797
4.2 0.25689 159.14049 1.51008 49.9284 44.00537 44.38909
4.6 -0.53773 165.58901 0.78666 47.67223 40.94681 41.87467
5.0 0.1571 170.98608 0.31754 45.56869 39.25043 40.29036
5.4 -0.13534 175.13134 0.57211 44.93829 38.13744 38.16701
5.8 0.15764 180.53391 -0.90998 42.88896 36.53074 36.7551
6.2 0.33116 184.54875 -1.51813 41.31939 34.86912 34.4987
6.6 -0.02578 187.75929 -2.03407 39.88685 32.4072 33.21012
7.0 0.75183 191.01816 -1.61582 38.47965 31.44303 31.89468
7.4 0.13691 193.5082 -1.68906 37.55254 30.86894 30.03042
7.8 0.61741 196.25558 -1.34842 35.80203 29.91474 29.2817
8.2 0.34895 198.11794 -1.1347 34.98137 28.50033 27.95971
8.6 -0.66232 200.0132 -1.37962 33.41939 26.52193 27.20632
9.0 -0.01222 201.63488 -0.2501 31.91144 25.46168 25.8396
9.4 0.26813 202.89809 -0.21848 31.32465 24.79332 24.54346
9.8 -0.12891 203.87843 0.47535 30.41522 23.56653 24.05701
10.2 -0.72429 204.6392 0.61353 29.79749 23.34 23.14948
10.6 0.11385 205.80963 1.11439 28.35156 22.22038 22.16521
11.0 0.38459 206.58745 0.91631 27.29009 21.83847 21.74447
11.4 -0.30113 207.43413 0.89389 27.42518 21.70315 20.60561
11.8 0.59943 208.69872 1.02065 26.30031 20.38632 20.40947
12.2 0.4316 209.06623 -0.45276 25.54054 19.52722 19.07035
12.6 0.67272 209.0285 -0.49104 24.03573 18.36792 18.25183
13.0 0.97022 209.03763 -1.01392 24.10511 18.32013 17.28924
13.4 -1.35573 208.70045 -1.1679 23.59218 17.0981 17.21163
13.8 -2.18344 209.61723 -1.26177 22.11022 16.8292 16.01892
14.2 -1.10578 209.55101 -2.22455 21.98072 15.96926 15.31888
14.6 -1.09138 209.41109 -2.37622 20.9739 15.44894 14.7165
15.0 -1.40497 210.37921 -2.61003 19.27156 15.02947 14.44559
15.4 -0.61984 210.35488 -2.34434 18.10506 14.5669 13.69564
15.8 -1.39935 210.45105 -2.48987 17.90278 13.70086 13.39705
16.2 -0.1566 210.14278 -2.73006 17.83211 12.96314 12.89571
16.6 -0.15521 210.06351 -2.50984 17.47126 13.51012 12.78547
17.0 0.07608 209.20864 -2.56408 16.83884 12.59118 12.57597
17.4 0.88329 209.68669 -2.77995 16.70095 12.77431 11.62945
17.8 -0.15068 210.56172 -1.53465 15.69622 12.16037 11.38699
18.2 0.68174 210.74026 -1.42631 14.75686 12.45275 11.0283
18.6 -0.6432 210.1447 -0.5766 15.323 12.27952 10.63353
19.0 0.80032 210.63716 -0.62494 14.73289 10.5416 10.4775
19.4 1.60157 210.02089 -0.69454 14.31629 10.55753 10.51941
19.8 -0.03479 209.64654 -1.02704 14.36775 10.10477 10.38271
