0.05000 -244.27775 -56.59085 3883.03027 449.10477 1993.53747 33.81079
0.15000 115.09415 -1296.76447 3968.04386 1369.36330 583.48012 46.60292
0.25000 -502.80515 231.82319 3904.02980 1430.63198 1466.81904 238.17519
0.35000 -1007.35176 487.89574 3790.31421 1453.35246 1347.78832 346.92760
0.45000 -720.60767 -168.40832 3865.91576 1475.52064 1480.97150 439.14252
0.55000 -1077.84028 145.58292 3744.08757 1491.94844 1580.08584 490.36056
0.65000 -1010.03475 -87.76979 3756.52919 1501.39012 1549.07604 463.25852
0.75000 -1003.43923 -8.82453 3638.66624 1567.51874 1679.92279 609.33696
0.85000 -1343.59920 38.41505 3547.72331 1353.72312 1763.49465 617.50303
0.95000 -1471.34250 -67.22360 3462.56102 1481.18024 1680.52677 775.21312
1.05000 -1602.79072 134.35401 3354.14424 1519.02772 1676.85720 788.49500
1.15000 -1780.82809 -3.47432 3256.23722 1435.47837 1711.48606 830.25396
1.25000 -2072.51715 42.06465 3019.74211 1446.91200 1696.58228 932.36385
1.35000 -2068.71206 100.94609 2828.43603 1587.58470 1776.37164 1027.06286
1.45000 -2222.32885 -48.71735 2576.23391 1634.00801 1767.60554 1151.13069
1.55000 -2221.43920 -64.89093 2411.35682 1539.69990 1786.92642 1283.01348
1.65000 -2512.98954 120.04723 2185.77918 1390.02862 1810.89675 1395.13459
1.75000 -2598.45232 -13.80785 2102.44942 1445.84353 1666.25342 1490.99945
1.85000 -2709.01762 -16.11313 1627.69543 1418.57433 1808.17055 1735.18553
1.95000 -2890.00609 -50.49053 1465.88352 1428.50189 1618.22497 1850.41633
2.05000 -2986.75898 -25.13409 1270.11492 1334.17324 1570.92758 1995.65763
2.15000 -3041.29577 -19.03829 1148.45863 1381.42011 1494.55531 2126.37350
2.25000 -3075.20567 63.97721 1007.74923 1289.18149 1408.01380 2224.77286
2.35000 -3113.66797 -47.35477 900.24425 1258.26460 1330.26191 2284.45893
2.45000 -3222.37816 -25.31066 820.03344 1224.36930 1257.49113 2257.18000
2.55000 -3267.74792 7.78969 815.77501 1192.08506 1186.63605 2240.72789
2.65000 -3292.62035 34.97797 701.17214 1151.91896 1111.42786 2291.42398
2.75000 -3344.76540 60.69964 561.36054 1120.69921 1079.97115 2290.00132
2.85000 -3312.08586 -23.09243 647.47160 1075.07486 1019.24270 2302.87322
2.95000 -3272.92883 -18.33241 539.92552 1125.44235 996.52375 2315.05233
3.05000 -3232.01430 12.07453 333.88480 1176.28451 971.65342 2416.56811
3.15000 -3299.52347 18.00677 491.28387 1100.93295 884.48986 2322.41763
3.25000 -3282.61489 5.82144 401.06907 1107.11766 870.08992 2345.58369
3.35000 -3306.91267 23.54376 343.08466 1055.99929 843.45114 2340.31591
3.45000 -3238.19685 3.84543 438.33170 1082.59841 780.44591 2350.34627
3.55000 -3251.08083 -33.64548 328.35905 1073.98210 755.32041 2333.89592
3.65000 -3244.61534 -1.15281 318.85800 1019.80664 740.11383 2342.26825
3.75000 -3217.48733 0.80296 250.79418 1038.05674 700.47730 2373.17018
3.85000 -3217.87688 0.31250 283.99552 1007.59318 692.32188 2332.61146
3.95000 -3205.00351 7.12184 171.68241 1005.94950 660.92301 2342.84827
4.05000 -3157.72549 -20.08623 213.79821 1033.62044 634.17621 2335.75433
4.15000 -3180.30157 -10.86413 224.79477 993.56836 612.31764 2278.79766
4.25000 -3137.84623 -15.66283 195.41155 991.32238 608.45563 2308.58484
4.35000 -3136.90152 4.81185 229.23118 973.91487 577.74092 2276.69766
4.45000 -3122.03586 16.17966 227.08841 961.68649 551.57203 2270.84648
4.55000 -3094.78546 1.71242 131.06412 948.28911 552.88343 2282.12910
4.65000 -3072.68972 12.27004 124.55258 961.87353 535.14161 2273.95725
4.75000 -3052.24796 -12.28266 119.48277 965.23427 523.54813 2275.06098
4.85000 -3066.91657 7.37008 83.52525 926.41845 502.97376 2240.55191
4.95000 -3055.90076 -7.66878 125.65088 910.44460 490.74665 2217.11932
5.05000 -3018.05626 7.34959 117.06567 910.94893 474.17447 2224.03828
5.15000 -3015.02673 -3.98894 160.70125 925.50368 459.01886 2195.56024
5.25000 -2989.68137 -12.94665 196.89041 907.98999 449.50949 2175.49865
5.35000 -2969.74595 -18.54408 33.70029 909.31051 448.58068 2225.96507
5.45000 -2956.05690 10.05503 49.56393 884.09432 432.95295 2210.56210
5.55000 -2951.27255 1.09561 48.54076 892.24444 423.51916 2182.15967
5.65000 -2929.80955 3.46932 36.24921 895.96824 415.67323 2176.59721
5.75000 -2914.43116 -5.05318 79.66386 859.09068 395.25720 2161.30836
5.85000 -2935.15286 6.47243 -13.21161 827.95790 400.14146 2119.63831
5.95000 -2872.49766 -3.11894 135.54913 872.20690 383.69912 2127.23908
6.05000 -2892.21133 21.48838 113.93644 839.53902 371.07563 2093.28033
6.15000 -2862.78369 -2.97860 -12.17572 863.08484 373.33455 2112.03922
6.25000 -2836.07850 -1.69339 -25.93725 864.81489 361.96845 2111.38485
6.35000 -2828.46178 0.35067 -15.38109 827.80369 350.65901 2098.47239
6.45000 -2832.58002 -7.32574 43.64757 829.83778 347.62032 2052.03342
6.55000 -2803.15596 -9.27819 2.04154 815.79577 335.69682 2069.23300
6.65000 -2769.79839 4.84703 50.88498 848.38884 325.31841 2057.12874
6.75000 -2767.68752 -2.70331 60.10331 805.90216 321.54560 2042.12386
6.85000 -2745.23803 1.25632 9.25936 823.56174 313.49793 2042.00456
6.95000 -2722.86585 -9.28415 -20.41483 815.01556 313.95778 2043.43001
7.05000 -2736.26898 0.22545 29.37136 813.58019 306.61196 1994.66026
7.15000 -2712.77688 -1.54812 -77.21290 816.70799 300.46289 2008.20622
7.25000 -2703.20083 3.53622 10.85899 775.22505 295.74728 1969.15248
7.35000 -2654.81208 -1.05281 25.82788 808.65198 289.58952 2000.68909
7.45000 -2691.45379 6.56431 70.76497 766.81720 278.71829 1929.83140
7.55000 -2646.76909 4.35675 66.27695 781.06900 272.80743 1951.85107
7.65000 -2683.74941 -6.70969 -5.12899 751.40726 274.03643 1885.65175
7.75000 -2628.87232 0.31339 -74.20852 773.25918 271.82326 1938.72455
7.85000 -2612.21147 -3.64198 23.24129 769.47859 261.96801 1916.33910
7.95000 -2619.28631 -2.75204 -25.62287 751.23525 258.30226 1891.80851
8.05000 -2573.96479 -2.09774 -58.85705 768.95362 262.50619 1918.35174
8.15000 -2577.74885 0.74175 -32.19915 744.26636 251.56748 1886.66572
8.25000 -2535.14240 2.03815 3.85844 764.47169 240.51945 1894.31764
8.35000 -2529.89796 -4.59965 -17.76969 753.31491 242.48895 1890.23321
8.45000 -2489.65135 -7.52259 20.53071 758.51180 237.25572 1895.85199
8.55000 -2522.15123 -10.96248 -14.52029 727.07849 231.91839 1847.34761
8.65000 -2535.16903 -1.73148 22.26262 721.68923 225.25367 1789.47026
8.75000 -2492.69916 -0.69243 -21.59877 728.70377 224.85212 1822.35900
8.85000 -2478.01202 6.59916 -63.12816 719.73004 219.73752 1818.54219
8.95000 -2458.31734 3.68565 -74.39699 721.91520 218.18043 1817.68027
9.05000 -2462.46851 2.87883 -62.15195 713.07611 219.35181 1783.35720
9.15000 -2450.81907 -3.51994 -58.60244 704.83393 209.27653 1773.11234
9.25000 -2418.70532 -4.97961 -20.67188 724.28502 204.50337 1770.12920
9.35000 -2411.74519 -2.71404 -8.66979 701.87313 202.26679 1774.99880
9.45000 -2388.14808 5.46632 -61.58840 707.85092 202.57587 1774.95688
9.55000 -2380.52448 1.21027 -48.45942 700.37654 196.01508 1757.04884
9.65000 -2390.00874 -0.41550 -65.45893 674.48059 192.58378 1731.96859
9.75000 -2356.63416 -3.92616 -45.55632 691.91338 190.93756 1738.58441
9.85000 -2334.28498 -0.87387 -9.01837 691.56195 188.38748 1737.48282
9.95000 -2331.56617 3.26828 -13.82242 685.63277 182.54366 1712.77520
10.05000 -2322.27996 4.23655 -19.31486 680.57374 182.92868 1705.94708
10.15000 -2312.56784 1.16363 -57.21366 687.23315 179.33760 1685.97182
10.25000 -2299.05316 1.68792 -17.89781 657.29987 177.15324 1682.45092
10.35000 -2277.57398 0.42265 -19.98359 678.98243 176.46862 1681.57769
10.45000 -2267.58653 -6.72936 -69.06892 661.13361 169.73670 1681.01182
10.55000 -2264.07994 2.57557 6.92632 648.49997 172.49682 1657.35264
10.65000 -2269.49713 -3.82666 -57.66432 654.23777 171.57021 1631.56541
10.75000 -2240.40162 -1.05383 -88.48215 655.95111 170.77667 1638.97523
10.85000 -2180.29969 1.68189 -75.22898 670.18005 167.06257 1690.12580
10.95000 -2203.15120 1.35968 -2.51505 643.33951 165.72862 1634.80440
11.05000 -2195.79209 0.17023 -25.75224 645.45864 151.99101 1623.42574
11.15000 -2186.67159 2.21227 -75.74170 623.07856 162.47563 1625.35772
11.25000 -2161.34040 0.23841 -71.86707 632.25625 152.47872 1626.57838
11.35000 -2181.98291 -0.70860 -63.55738 616.97906 152.75127 1572.09345
11.45000 -2148.99244 2.43218 -92.30021 631.17206 152.08508 1596.64279
11.55000 -2153.25063 6.61967 -93.20716 624.92478 146.57606 1569.19873
11.65000 -2129.85109 2.63962 -19.49952 630.13383 146.45474 1565.91616
11.75000 -2130.44777 2.09037 -20.76747 605.54115 144.83183 1550.93897
11.85000 -2116.58420 0.06471 26.21265 612.14568 143.73672 1539.29428
11.95000 -2084.40429 -4.94596 -8.86818 622.85137 139.97652 1557.60156
12.05000 -2098.61356 -2.11400 -64.85376 593.67814 141.53629 1524.66284
12.15000 -2088.44623 -1.91144 -77.62052 603.31686 137.47762 1523.92751
12.25000 -2070.16141 0.56636 -58.60456 604.59365 143.52383 1522.72085
12.35000 -2073.65380 0.45663 -38.71112 581.52954 130.98250 1497.63862
12.45000 -2033.53666 1.84335 -86.39112 600.22517 134.32083 1526.06106
12.55000 -2044.55645 3.86223 -52.60063 593.52222 134.09129 1488.57937
12.65000 -2036.92271 1.37018 -96.41968 590.34621 130.98824 1480.40312
12.75000 -2021.23362 0.33532 -54.05098 584.56574 128.28550 1482.02061
12.85000 -1994.48261 -1.87643 -67.72248 586.04358 134.36377 1499.02252
12.95000 -2020.17783 0.85342 -101.10462 566.91782 134.85510 1450.84728
13.05000 -1980.87995 -3.12005 -128.08273 583.39172 128.92532 1479.45915
13.15000 -1978.54263 -0.70531 -18.00485 568.46748 119.59104 1453.35219
13.25000 -1958.37055 -0.98248 -93.85072 570.51965 124.53114 1462.13091
13.35000 -1949.82378 0.90529 -45.24276 576.21832 123.99066 1450.16042
13.45000 -1927.87937 -0.37060 -41.06228 582.00102 116.95687 1457.84806
13.55000 -1931.18790 2.66338 -75.21371 556.74074 118.73077 1441.20870
13.65000 -1932.01576 -0.74801 -14.44982 556.07659 118.44431 1413.61987
13.75000 -1939.75562 4.75138 -84.50306 543.17298 117.22848 1389.22324
13.85000 -1920.05897 2.34959 -96.46559 543.98366 120.02184 1396.12364
13.95000 -1894.20176 1.38495 -62.45591 550.01244 120.61054 1409.87680
14.05000 -1885.34034 2.81994 -76.36267 547.16720 112.83570 1402.23547
14.15000 -1872.80545 -3.41081 -60.80435 550.53637 108.60126 1399.88338
14.25000 -1876.94678 -0.96930 -90.05142 538.77703 111.24806 1379.75185
14.35000 -1872.88854 0.49420 -27.85843 543.55884 106.18669 1357.65418
14.45000 -1858.93761 -2.45063 -41.28170 529.27736 107.71138 1362.12674
14.55000 -1847.54810 3.13166 -40.32720 539.04041 107.41026 1353.05186
14.65000 -1860.22962 0.79014 -50.61307 523.66925 104.19693 1323.45159
14.75000 -1826.85496 0.62961 -63.14329 524.40574 103.61698 1352.23249
14.85000 -1827.91854 -0.00171 -54.17197 521.24614 100.94522 1327.92974
14.95000 -1776.44403 1.49650 -3.80177 533.92929 99.66354 1365.58042
15.05000 -1805.06135 -0.23347 -42.27915 516.22242 93.24391 1327.80664
15.15000 -1799.01901 0.64873 -112.85174 512.51070 98.54697 1316.95039
15.25000 -1789.25696 -2.05948 -40.17328 509.13009 94.28634 1307.52475
15.35000 -1768.03772 0.15134 -58.91964 521.37215 96.51089 1319.14701
15.45000 -1773.94262 1.09225 -86.41777 511.70762 98.01972 1297.75686
15.55000 -1765.36713 -1.28232 -92.19527 501.80555 97.53673 1294.74621
15.65000 -1765.46373 1.80247 -31.34048 498.09135 94.26049 1270.36776
15.75000 -1732.17695 -1.03590 -0.29248 508.99146 91.94666 1296.04539
15.85000 -1735.90082 -2.47566 -80.94983 504.92979 90.69758 1277.18264
15.95000 -1740.09231 0.26436 -68.88234 490.10597 91.83740 1259.59966
16.05000 -1731.48035 2.35272 -92.07921 491.74880 89.96739 1251.19979
16.15000 -1718.38487 -0.90275 -88.26506 498.09950 89.86329 1254.87143
16.25000 -1700.61642 0.84319 -52.05394 503.98821 87.59979 1257.06921
16.35000 -1704.32601 1.67067 -33.26483 483.25257 85.54613 1234.02215
16.45000 -1683.67165 -1.23261 -20.75278 497.48322 84.50224 1243.89152
16.55000 -1679.81409 -3.25204 -43.24271 487.07653 83.59496 1235.31469
16.65000 -1666.79828 2.82518 -53.48956 489.04583 81.11746 1237.96023
16.75000 -1666.97726 -1.59101 2.75138 480.95556 79.35460 1221.46040
16.85000 -1659.38060 0.80258 -18.69168 480.27357 80.73236 1211.35581
16.95000 -1644.04042 -2.09763 -76.81817 470.68743 81.02677 1226.26554
17.05000 -1653.69862 -0.56349 -21.56104 459.90606 79.98298 1200.62473
17.15000 -1630.96894 0.91022 2.88251 464.77462 81.35790 1209.10746
17.25000 -1636.12243 -1.32026 -41.38625 457.43495 78.26942 1189.84724
17.35000 -1638.59360 -1.51368 -60.38391 461.74628 77.19921 1172.64048
17.45000 -1612.68425 2.56620 -27.12637 461.11295 76.39242 1187.36510
17.55000 -1617.74430 1.50146 -74.90390 466.94388 76.66984 1170.24449
17.65000 -1606.19111 3.19832 -49.63205 452.45367 78.34657 1169.21011
17.75000 -1595.31550 0.82464 -91.80141 458.50397 80.82766 1168.94236
17.85000 -1587.70272 -1.57473 -43.86739 460.29982 76.01076 1164.78787
17.95000 -1576.74724 0.25005 -66.57143 456.38418 72.05922 1162.80354
18.05000 -1561.75561 0.74087 -26.76062 449.34770 71.96780 1166.82293
18.15000 -1561.79919 0.27475 -55.51685 458.00206 69.32681 1152.22403
18.25000 -1562.51378 -1.99396 -64.70387 448.82882 75.50487 1140.43847
18.35000 -1541.85914 0.90456 -7.77588 453.74618 69.36557 1147.19844
18.45000 -1539.57261 0.33153 -42.56032 450.82898 73.64775 1135.29749
18.55000 -1522.69741 -2.97784 -84.46440 453.54131 79.00594 1146.52252
18.65000 -1529.73425 2.30479 -94.88203 443.44957 76.06020 1128.36134
18.75000 -1527.44098 -1.09446 -57.33065 444.25367 69.14332 1115.65958
18.85000 -1501.48932 2.37068 -46.01060 443.98132 70.01083 1132.18329
18.95000 -1506.93521 -1.00538 -54.27529 437.38730 69.76065 1113.09860
19.05000 -1515.61619 -0.24477 -56.90499 425.08675 71.51365 1095.47136
19.15000 -1486.03575 0.24476 -75.95618 447.22373 66.22321 1111.48423
19.25000 -1490.54996 0.15864 -25.41553 427.63177 68.02650 1093.60023
19.35000 -1471.87633 -0.45052 -32.55469 439.62958 62.33301 1102.14977
19.45000 -1473.66449 0.56393 12.05652 431.15351 63.85115 1084.83099
19.55000 -1474.58706 0.36321 -60.71498 417.63729 69.84523 1081.35340
19.65000 -1465.97232 -2.05673 -33.00104 415.24630 67.12732 1078.29378
19.75000 -1468.99779 1.08013 -59.86453 410.29023 57.92445 1064.08362
19.85000 -1456.09576 0.22614 -67.48481 421.44763 60.18646 1066.29088
19.95000 -1432.49666 0.33209 -29.89609 415.66644 62.60835 1081.80494
