0.05000 -2812.56053 -92.01243 780.36738 2636.73536 2492.10779 3550.53894
0.15000 -5252.95698 287.57119 622.70359 2890.90856 2541.26533 6650.02190
0.25000 -7595.11620 104.50172 153.64649 3269.52750 2634.04547 9298.48443
0.35000 -9508.58496 206.01168 4.48690 3600.02680 2805.11575 10993.30389
0.45000 -10621.14435 222.40773 199.35612 3892.38073 3020.14600 12123.33819
0.55000 -11491.80755 109.23043 8.39536 4027.11667 3184.32351 12671.17110
0.65000 -12079.81195 161.16275 61.25894 4022.05482 3276.85906 12986.55109
0.75000 -12468.25417 156.08247 152.43798 3902.52910 3277.38972 12887.57975
0.85000 -12665.56193 197.55978 -59.33008 3822.48860 3300.29416 12575.41899
0.95000 -12708.95194 219.35053 -33.04179 3703.28261 3276.94588 12098.28064
1.05000 -12750.47657 208.83948 -98.04425 3506.00129 3204.35806 11510.64744
1.15000 -12735.82179 174.71908 12.35787 3292.84873 3106.05339 11072.77437
1.25000 -12675.46242 178.45363 79.22307 3155.63642 3032.17769 10539.34336
1.35000 -12571.45312 219.19068 -147.61736 2923.69473 2951.89453 9980.70117
1.45000 -12353.25829 155.18499 47.22091 2790.80526 2833.64609 9526.63773
1.55000 -12198.17221 169.66459 5.05673 2556.84387 2741.96889 9001.22048
1.65000 -12047.26202 199.09355 -7.06052 2323.12961 2653.49650 8448.60023
1.75000 -11714.45186 133.29019 -53.06115 2262.62244 2553.31643 8207.52706
1.85000 -11578.33322 181.58913 72.14988 2066.31781 2435.75069 7684.98863
1.95000 -11375.96146 112.39995 140.20657 1953.45645 2344.66762 7317.48767
2.05000 -11172.18766 131.79167 97.42829 1832.12077 2254.64525 6978.10626
2.15000 -10909.20934 93.92942 16.99081 1745.07681 2155.84830 6731.88941
2.25000 -10734.86951 75.15361 174.34175 1638.81793 2042.32768 6449.81863
2.35000 -10586.50591 119.86426 25.51641 1584.65714 1967.73781 6160.95467
2.45000 -10427.66564 84.91643 -93.71233 1509.74894 1880.21176 5886.84184
2.55000 -10247.20604 118.33915 61.60847 1410.43930 1780.73081 5697.77025
2.65000 -10128.07770 167.15771 41.36537 1361.38251 1690.23021 5420.99600
2.75000 -9940.68198 135.08314 42.14895 1355.30351 1611.29887 5255.72541
2.85000 -9794.54996 132.23246 53.99502 1303.35748 1535.20929 5025.65203
2.95000 -9645.07829 81.17653 36.00919 1258.89309 1459.24338 4840.39001
3.05000 -9489.97087 60.29454 -19.24222 1245.07919 1381.33589 4691.16802
3.15000 -9369.97759 56.37101 -15.87735 1212.01379 1297.14311 4482.62779
3.25000 -9220.33051 44.94947 36.53476 1195.55722 1232.75934 4311.08649
3.35000 -9085.28230 80.86749 15.30278 1178.79735 1160.12486 4133.98670
3.45000 -8940.97216 55.30700 -71.36859 1150.26431 1083.07897 3998.30179
3.55000 -8792.74733 35.48662 10.01329 1115.65350 1021.66062 3821.52334
3.65000 -8631.05413 51.02274 -27.98008 1110.51239 948.99704 3729.12798
3.75000 -8491.90844 63.37352 -14.07747 1071.72926 893.02450 3548.92929
3.85000 -8313.84075 83.52348 25.45912 1049.18781 823.03438 3396.28368
3.95000 -8143.34793 84.23136 -9.79716 1015.47958 769.14269 3200.30827
4.05000 -8001.27433 85.92400 43.17960 995.31362 713.70839 3007.89418
4.15000 -7815.66906 68.22221 -21.39662 961.28980 662.68383 2886.66025
4.25000 -7631.34514 104.26092 8.70215 932.49280 602.73189 2782.35145
4.35000 -7453.51412 102.34279 -53.50271 885.11863 559.40329 2659.42036
4.45000 -7293.48973 114.68752 -56.81987 842.39369 507.23319 2503.37233
4.55000 -7142.32430 95.58690 -112.49296 782.60525 480.89597 2395.12303
4.65000 -6983.94368 121.32961 -162.53497 720.19361 431.59332 2264.11915
4.75000 -6843.56051 116.06597 -131.86901 680.27973 403.44914 2204.43562
4.85000 -6731.25503 112.55780 -86.60157 627.64200 373.92394 2056.92130
4.95000 -6592.19544 125.48646 -82.64044 568.77275 336.73482 1995.99486
5.05000 -6480.41278 133.07186 -79.09936 496.40753 311.17209 1896.46226
5.15000 -6381.55502 129.26125 -102.01614 444.20316 286.07819 1853.59687
5.25000 -6309.02133 113.27083 -104.55011 415.34093 276.07881 1775.44767
5.35000 -6227.12321 113.52443 -25.52149 395.25808 259.16702 1728.12498
5.45000 -6154.74855 110.01033 -49.28090 353.49000 245.39013 1675.57404
5.55000 -6093.92697 105.50128 -86.62281 331.02849 236.32546 1636.39412
5.65000 -6031.82042 100.91760 -67.21813 304.86073 224.53718 1593.59651
5.75000 -5985.52277 88.70126 -30.40431 285.37863 216.72238 1521.09748
5.85000 -5930.56418 81.00747 5.95810 272.88909 210.91953 1505.22099
5.95000 -5874.42037 78.18263 -51.10854 261.44613 204.67928 1456.01868
6.05000 -5821.90203 69.27201 -45.76791 238.81584 198.47624 1438.13459
6.15000 -5786.05496 67.49669 -53.81013 240.31952 192.34453 1380.49476
6.25000 -5748.17278 55.81719 -34.77796 226.92226 190.57125 1333.80558
6.35000 -5700.94307 50.99699 -57.99973 234.11939 185.99575 1331.98678
6.45000 -5661.17347 49.02983 -27.52007 243.02251 182.11087 1294.58987
6.55000 -5617.77917 47.78809 -54.32985 224.20957 176.71810 1253.77017
6.65000 -5565.56912 37.29131 6.42783 229.08280 176.32785 1230.39537
6.75000 -5519.84957 32.91714 -8.09719 197.91088 169.04644 1195.12247
6.85000 -5475.77022 28.28210 -25.04672 202.21891 170.25923 1166.58192
6.95000 -5441.75500 27.52963 4.50649 200.35980 167.43667 1139.67307
7.05000 -5398.48633 30.66139 -36.13548 203.35978 165.62741 1121.19098
7.15000 -5359.39431 32.08061 -22.61053 196.23919 162.98324 1100.14948
7.25000 -5312.45501 27.43672 -21.98798 186.40741 156.33637 1060.18404
7.35000 -5265.52389 24.88368 -3.50781 183.19266 155.40106 1020.66393
7.45000 -5218.32136 24.55422 -15.22550 171.37529 152.51224 1006.31531
7.55000 -5162.16903 27.86787 5.54787 176.85942 149.89314 982.86275
7.65000 -5105.12595 25.68110 2.11839 170.50213 146.45756 955.20011
7.75000 -5053.98501 29.29582 -8.91640 161.68948 141.51961 932.40396
7.85000 -5005.52752 26.77690 -2.11578 156.44685 140.48708 885.26320
7.95000 -4944.61748 32.15572 1.24229 163.36992 133.21755 882.80824
8.05000 -4899.94319 32.78228 21.76139 153.59669 133.13225 852.88588
8.15000 -4852.99951 29.76457 17.82250 147.73100 129.38847 842.92208
8.25000 -4802.33733 31.46897 20.99195 147.37292 127.09491 830.92605
8.35000 -4764.48998 30.79150 5.53232 135.73602 123.07656 803.38868
8.45000 -4719.94743 31.65760 24.33933 137.49117 121.51275 798.20054
8.55000 -4681.29341 33.53871 28.29815 133.18956 117.22339 774.87263
8.65000 -4640.18512 38.32651 8.97400 127.32141 112.61226 758.49743
8.75000 -4603.73664 32.97559 11.26520 127.87621 112.44864 751.92619
8.85000 -4570.05622 34.48276 27.51172 126.07719 110.09695 726.99522
8.95000 -4543.17786 30.46480 15.56748 128.24318 108.94424 709.38951
9.05000 -4510.20504 35.17222 22.62370 139.43709 104.76493 703.62569
9.15000 -4485.77075 33.10361 6.73970 125.90538 102.45862 676.44423
9.25000 -4459.06116 33.96393 6.28992 133.95074 98.80028 679.27420
9.35000 -4430.93778 30.87606 18.95286 124.15627 96.55979 660.24842
9.45000 -4394.82940 31.44091 -0.48568 128.40824 94.90662 651.57289
9.55000 -4366.42058 32.20988 9.73410 127.41623 89.90578 630.22793
9.65000 -4340.75989 33.95148 13.80293 128.07847 88.60809 609.97717
9.75000 -4311.31857 25.62667 -8.07081 125.54483 88.41123 608.66966
9.85000 -4280.27511 23.53296 3.19749 123.26650 87.99166 598.26723
9.95000 -4254.11352 26.95542 6.42970 120.61788 85.05206 574.37019
10.05000 -4220.42902 22.69208 5.16462 118.11379 81.60026 563.19367
10.15000 -4196.07199 22.97620 0.05038 117.32859 83.09982 550.73566
10.25000 -4173.47933 21.71199 26.51510 117.03537 78.92097 528.02442
10.35000 -4138.30785 23.23173 18.08134 117.96234 75.84868 508.18442
10.45000 -4099.73966 21.52981 -6.48996 110.50084 73.15314 502.87830
10.55000 -4064.42993 20.53379 9.00685 105.32252 73.51103 500.23238
10.65000 -4034.19024 15.90570 0.34795 107.13683 74.29021 484.07122
10.75000 -4003.74451 22.03005 7.42522 106.95365 72.07448 470.80165
10.85000 -3971.57607 22.82274 10.07991 104.57180 69.47497 459.02863
10.95000 -3944.44582 19.94885 -17.45568 103.41566 68.38485 449.25810
11.05000 -3909.82944 20.31766 -1.49082 98.03094 66.69679 446.70887
11.15000 -3884.69778 18.65400 -11.55545 95.13447 67.67351 429.51442
11.25000 -3852.10158 18.85213 -10.67743 90.64807 66.54666 414.01171
11.35000 -3821.87786 20.91074 -13.46223 85.93992 63.01486 410.45164
11.45000 -3790.85125 19.50076 3.79493 87.82585 63.73191 400.19857
11.55000 -3759.45626 19.81164 -18.22570 86.62588 62.62998 383.51859
11.65000 -3726.73082 21.32934 -20.26393 86.78867 61.08825 373.08452
11.75000 -3702.49469 19.19021 -10.16548 81.40462 62.40530 371.42887
11.85000 -3672.59987 23.34036 -14.51738 83.86512 58.67807 361.73788
11.95000 -3644.49672 17.39104 -19.97618 81.29596 58.27918 354.48466
12.05000 -3613.81784 20.20789 -9.43128 81.37443 58.96545 351.57716
12.15000 -3582.57324 19.50950 -18.62848 80.43254 56.35161 342.05712
12.25000 -3556.17246 17.63385 -8.53908 80.39540 56.66692 327.05457
12.35000 -3528.37755 23.32003 -14.74659 77.49528 58.70068 330.50682
12.45000 -3497.02745 19.45527 -33.84355 74.62198 56.57582 331.21311
12.55000 -3472.11255 17.65063 -17.04436 72.97126 53.70557 313.72483
12.65000 -3445.63209 17.09720 -3.92523 75.03304 55.52743 305.91237
12.75000 -3419.22443 17.19315 -7.94994 74.15812 54.70966 309.15363
12.85000 -3397.95621 18.02600 -2.70284 77.86465 57.80750 301.47369
12.95000 -3374.86760 16.36772 -8.95474 79.00241 54.33916 302.41677
13.05000 -3347.92956 18.08799 0.42460 74.57839 54.88178 283.70088
13.15000 -3324.28036 17.68998 -1.13528 73.74995 59.73574 284.33152
13.25000 -3303.80722 15.66058 18.33244 71.62099 57.77521 284.47459
13.35000 -3280.24428 17.14935 10.63286 70.97803 52.79931 277.61582
13.45000 -3257.65334 13.77674 -3.41713 66.78766 53.55903 269.84141
13.55000 -3234.86854 19.16518 14.24746 70.24835 53.78373 268.71154
13.65000 -3207.68356 14.96267 12.69293 65.89592 50.84963 256.56280
13.75000 -3189.30196 15.11379 2.82181 67.22563 51.73554 260.23775
13.85000 -3166.69222 14.51216 4.74507 62.55032 48.87673 252.28700
13.95000 -3151.65089 15.90393 8.08554 61.69179 51.70971 251.74772
14.05000 -3134.71598 13.71491 12.35988 60.69458 46.76101 238.46446
14.15000 -3108.48557 12.99998 20.28193 61.83217 47.96908 236.62583
14.25000 -3090.70784 17.65649 2.50087 64.35117 49.03406 232.37108
14.35000 -3070.99476 15.88681 6.63948 59.56044 45.24518 225.52024
14.45000 -3043.05683 16.65095 6.74662 64.43656 45.79364 225.51652
14.55000 -3026.00624 14.25608 12.55768 58.19376 46.35226 220.55389
14.65000 -3008.68524 14.30569 4.17325 52.91257 45.33495 208.82173
14.75000 -2986.35391 14.66592 14.76817 53.48813 42.25593 208.40892
14.85000 -2964.47159 15.39912 7.65950 54.67273 43.71927 204.68265
14.95000 -2945.79898 12.51247 6.25767 54.19898 44.79504 199.76598
15.05000 -2926.47494 16.75063 6.72170 55.11974 43.28063 194.03509
15.15000 -2906.65154 15.52146 4.69652 58.40756 43.26841 188.47737
15.25000 -2888.26223 12.70906 -1.73832 55.26183 43.13149 187.40724
15.35000 -2868.73978 14.06638 -4.26264 55.32178 42.18012 186.07475
15.45000 -2850.06741 11.06738 1.99631 52.67672 43.39452 164.88149
15.55000 -2827.13023 13.63480 -6.56495 54.01882 39.41723 179.10986
15.65000 -2811.59888 12.82483 -7.43867 53.40932 39.95408 176.42110
15.75000 -2791.34723 13.16052 -6.76739 53.15876 44.02296 157.60872
15.85000 -2769.59359 11.55038 -13.13692 53.56929 40.90507 169.97836
15.95000 -2756.13644 13.85735 -14.87325 51.07125 42.03496 171.48115
16.05000 -2739.73168 10.86380 -13.47982 54.08191 45.25907 157.39268
16.15000 -2720.71418 13.21550 -7.30760 54.63498 41.07898 148.97228
16.25000 -2699.68395 9.28785 -9.12123 52.78654 39.31330 159.11306
16.35000 -2678.49291 14.36781 -8.07257 51.28779 38.60103 146.27650
16.45000 -2665.69922 9.51999 -18.74382 47.62673 42.54503 149.39664
16.55000 -2642.50483 9.53678 -4.55930 48.19140 41.89006 156.76728
16.65000 -2629.33823 11.49638 -4.62820 46.68877 42.90781 150.19008
16.75000 -2605.23640 13.74518 -7.40667 48.92122 42.26842 138.08246
16.85000 -2595.18822 13.25056 -3.94679 47.19595 40.60041 141.71090
16.95000 -2582.38817 8.87807 -2.64073 46.73365 41.60497 135.54751
17.05000 -2564.59842 14.83871 10.82935 53.89978 42.49190 143.27416
17.15000 -2548.94679 10.75398 -7.33490 49.28095 41.06372 139.50436
17.25000 -2530.65489 11.07161 4.34174 45.22882 39.08576 132.42802
17.35000 -2512.77368 9.09229 0.19933 44.94040 34.97688 124.15292
17.45000 -2492.98435 8.65346 1.20092 46.68901 40.87724 124.77007
17.55000 -2478.06950 10.42352 10.66139 43.28430 40.37428 130.37929
17.65000 -2465.58304 7.98200 13.86024 44.23792 40.89339 124.69992
17.75000 -2451.81462 12.11087 2.00820 47.90639 42.25251 112.92298
17.85000 -2427.45365 6.35309 9.16689 43.24357 38.22364 114.24862
17.95000 -2418.76547 10.12348 20.02799 47.04671 40.99972 115.04843
18.05000 -2402.94163 8.60102 9.87519 42.40358 38.93483 122.50377
18.15000 -2389.73317 8.86547 0.39226 41.04130 39.90676 114.08188
18.25000 -2377.02699 6.92265 2.17044 41.33163 41.86421 106.82359
18.35000 -2366.56992 9.61288 0.66398 40.62627 36.96793 108.56972
18.45000 -2352.38689 6.85767 10.57204 38.96998 36.51860 105.50379
18.55000 -2336.66752 10.60772 8.62671 44.35935 42.99004 101.29122
18.65000 -2324.70568 8.49164 14.75585 41.38821 41.46850 97.79687
18.75000 -2312.21509 7.39831 5.21251 40.21421 39.86239 96.75958
18.85000 -2296.96581 6.94968 15.34058 42.85947 45.40741 99.68022
18.95000 -2284.45379 4.28848 -7.07081 40.78471 37.57902 90.85357
19.05000 -2270.21659 5.45512 5.02670 38.97193 32.36957 86.52516
19.15000 -2255.52629 5.99489 3.70154 42.96436 40.84440 89.85100
19.25000 -2245.56157 7.41599 9.47120 38.59961 32.89102 94.24018
19.35000 -2231.16048 3.90894 -8.49487 37.46236 31.99289 91.78744
19.45000 -2220.44830 0.12143 2.27824 40.28188 39.53388 84.49447
19.55000 -2204.98015 6.99568 -5.48671 48.48150 38.85869 86.75539
19.65000 -2196.70713 6.70372 -11.04824 36.45871 32.97076 84.16912
19.75000 -2185.39975 7.98751 9.04785 36.12204 39.12344 87.64654
19.85000 -2173.53864 12.19299 -0.98531 44.28093 43.86200 85.68127
19.95000 -2163.06643 4.69502 -0.48569 36.82632 35.22995 89.21803
