0.125 -0.001 0.000 0.001
0.375 0.001 -0.001 0.030
0.625 0.004 0.004 0.163
0.875 -0.009 -0.008 0.478
1.125 -0.016 -0.009 1.006
1.375 0.004 0.005 1.789
1.625 -0.027 0.009 2.777
1.875 -0.052 0.027 3.905
2.125 -0.050 0.031 5.156
2.375 -0.040 0.016 6.361
2.625 -0.028 0.040 7.624
2.875 -0.006 0.044 8.874
3.125 -0.025 0.068 10.511
3.375 -0.085 0.034 11.899
3.625 -0.082 0.031 13.358
3.875 -0.067 0.057 15.154
4.125 -0.117 -0.018 16.396
4.375 -0.082 0.003 17.542
4.625 -0.086 -0.038 18.998
4.875 -0.093 0.017 19.793
5.125 -0.055 -0.001 20.534
5.375 -0.089 -0.039 21.087
5.625 -0.100 -0.105 21.632
5.875 -0.138 -0.049 22.271
6.125 -0.053 -0.149 23.248
6.375 -0.087 -0.129 24.506
6.625 -0.003 -0.102 24.400
6.875 -0.039 -0.170 24.622
7.125 -0.031 -0.095 24.704
7.375 0.006 -0.086 24.772
7.625 0.013 -0.151 25.540
7.875 0.030 -0.078 26.886
8.125 0.019 -0.123 27.606
8.375 0.043 -0.154 27.474
8.625 0.053 -0.087 27.334
8.875 0.041 -0.140 26.025
9.125 0.023 -0.081 25.294
9.375 0.009 -0.060 25.996
9.625 0.088 -0.078 25.819
9.875 0.050 -0.032 26.558
10.125 0.057 -0.117 27.370
10.375 -0.003 -0.013 27.069
10.625 0.068 -0.018 26.879
10.875 0.059 -0.016 25.892
11.125 0.035 -0.008 24.555
11.375 -0.003 -0.053 23.039
11.625 0.016 0.009 21.279
11.875 0.030 -0.008 20.734
12.125 0.058 -0.014 19.183
12.375 0.019 0.020 17.248
12.625 0.035 -0.024 17.305
12.875 0.010 0.004 16.634
13.125 -0.010 -0.008 16.604
13.375 0.003 -0.008 17.063
13.625 0.010 0.008 17.803
13.875 0.014 0.010 18.466
14.125 0.001 0.002 18.590
14.375 0.004 -0.004 18.535
14.625 0.022 0.001 16.760
14.875 -0.028 0.005 16.149
