0.1875 1.9246 19.88696 -1.03671 92.40636 92.3822 80.21325
0.5625 -0.80499 39.42457 0.49233 91.03215 87.00495 76.45046
0.9375 0.76859 57.97601 -0.16365 87.52569 81.24125 73.35348
1.3125 -0.60043 71.81139 -0.25263 83.11192 74.87383 69.81814
1.6875 -0.1525 81.97154 -0.94074 78.579 70.57018 67.18608
2.0625 0.27839 94.31554 -0.47113 73.88071 68.55384 64.02838
2.4375 0.62431 107.24203 0.18023 69.65183 65.66308 61.19021
2.8125 -0.42676 119.05404 -0.73555 65.30215 62.60553 57.933
3.1875 0.60274 131.03378 -0.09765 61.51419 58.7635 54.52617
3.5625 0.03511 140.52227 -0.60324 57.7112 54.49375 52.0195
3.9375 0.28816 147.48157 -0.01928 54.72821 51.60607 48.92844
4.3125 0.40002 156.05532 0.37902 51.51857 47.91339 46.49393
4.6875 0.35535 162.99912 -0.078 49.65899 44.78251 44.5483
5.0625 0.33457 168.54734 -0.07055 48.02488 42.20083 42.97063
5.4375 0.17079 173.67491 -0.41841 45.9339 40.73478 40.39402
5.8125 0.64431 178.79864 0.18236 44.52875 38.80364 39.16727
6.1875 0.0595 182.82668 -0.26677 43.0281 36.83343 37.28102
6.5625 -0.68071 186.71983 -0.08486 41.58573 35.09659 35.51295
6.9375 -0.08836 189.89537 -0.54485 40.39432 33.23085 33.9518
7.3125 -0.13299 192.7577 -0.09677 39.14009 32.00654 32.34999
7.6875 0.72791 194.64355 0.32201 37.49161 30.99453 31.64068
8.0625 0.96644 197.48615 0.06701 36.28276 29.70224 30.07597
8.4375 0.46102 199.55979 0.26088 35.12832 29.35016 28.73248
8.8125 0.83863 201.37125 0.55253 34.09848 28.3885 27.43557
9.1875 0.04761 203.64609 0.52892 33.18011 27.44285 26.53932
9.5625 0.20049 205.2897 0.34766 31.43868 26.10749 25.82903
9.9375 -0.08541 206.32797 0.59961 30.78805 25.0885 24.78485
10.3125 -0.43192 207.96677 0.83612 29.3586 23.88229 23.68979
10.6875 -0.57188 209.34031 0.38119 28.69793 22.92884 23.02563
11.0625 -0.96765 210.40505 0.21644 27.68587 22.22473 22.03866
11.4375 -0.48435 211.61176 0.35104 26.71872 21.65423 21.16013
11.8125 -0.91961 212.24486 0.29722 26.41062 20.55023 20.55816
12.1875 -0.73078 213.59095 0.97206 25.39498 19.72876 19.85353
12.5625 -0.60946 213.7706 0.63476 24.59252 18.70691 19.23572
12.9375 -0.39574 213.81232 0.29344 24.4135 17.59668 18.59359
13.3125 -0.48445 213.52772 0.09335 24.05318 16.84432 18.08697
13.6875 -0.56304 213.06158 0.22845 23.33163 16.74564 17.83609
14.0625 -1.23094 213.05274 0.39093 22.57656 16.19132 16.75361
14.4375 -0.92673 212.93904 0.04631 22.23203 16.10686 16.43994
14.8125 -0.5812 212.90739 -0.23518 21.34967 16.00581 16.32152
15.1875 -1.2473 212.82534 -0.61658 21.21559 15.47594 15.87678
15.5625 -0.89138 213.3121 -0.40781 20.28889 15.36528 15.21463
15.9375 -1.62812 213.73379 -0.49405 19.65998 14.7826 14.51236
16.3125 -0.60502 213.59864 -0.60214 18.84399 14.57401 14.17943
16.6875 -0.77035 213.82694 -0.44634 18.39141 13.79955 13.68924
17.0625 -1.1767 213.4939 0.04592 18.06539 13.22041 13.13552
17.4375 -0.96136 213.44292 -0.06146 17.9436 13.11911 13.07759
17.8125 -0.86461 213.96447 -0.82823 16.95718 12.02054 12.47345
18.1875 -1.35726 213.4967 0.04346 16.53727 12.04207 11.90167
18.5625 -1.08323 213.28269 -0.18026 16.22016 12.12336 12.09063
18.9375 -0.85436 213.04227 0.09392 15.48513 11.7942 11.43522
19.3125 -1.39816 212.94976 -0.15724 15.47526 11.40723 11.24435
19.6875 -1.28782 212.88654 0.31475 15.30053 10.82861 10.59221
20.0625 -1.11958 212.8084 0.5285 15.09469 10.59813 10.65509
20.4375 -0.85091 212.62384 1.21374 14.77876 10.2347 10.16394
20.8125 -0.86567 212.29717 1.63177 14.2393 10.28905 9.86914
21.1875 -0.26807 212.19035 1.75209 14.0523 9.23095 9.70414
21.5625 0.03449 211.2041 1.75995 13.83146 9.30344 9.64974
21.9375 -0.25119 210.88299 0.99929 13.83771 8.72145 9.64237
22.3125 -0.80158 209.97494 0.47278 13.07727 9.70954 9.24075
22.6875 -1.05107 209.82849 0.31726 12.73622 9.23566 8.77846
23.0625 -1.01992 209.45811 0.33384 12.18058 9.03679 8.68133
23.4375 -0.39062 209.61967 0.19248 11.9664 8.95248 8.26847
23.8125 0.15696 210.22767 -0.08415 11.61436 8.51859 8.28357
24.1875 0.22216 209.71425 0.00865 11.36292 7.96362 7.57159
24.5625 1.37943 209.57348 -0.01124 10.98209 8.19926 7.64487
24.9375 0.96498 208.93243 0.01806 11.13235 7.96923 7.47731
25.3125 1.81342 208.1168 0.14988 11.2085 8.20587 7.66988
25.6875 0.7028 208.68373 -0.26265 10.21946 7.97359 7.18363
26.0625 0.86869 208.56429 -0.07479 10.07863 8.23509 6.98595
26.4375 2.0391 208.11529 -0.30284 10.3782 7.57925 6.72877
26.8125 0.70146 208.50215 -1.14558 9.44019 7.56575 6.61498
27.1875 0.93369 208.58075 -0.65901 10.21216 7.10726 6.72012
27.5625 1.09562 208.11134 -0.46058 9.00785 7.45804 6.38395
27.9375 1.1327 208.001 -0.52734 9.79744 6.28915 6.90269
28.3125 1.12867 207.96246 -0.51453 9.73062 6.3869 6.09518
28.6875 0.38304 207.4789 -0.53522 9.2118 6.76856 5.95855
29.0625 0.46962 206.9118 -0.21762 9.86424 5.962 5.96201
29.4375 0.17211 206.65941 0.51529 8.90428 6.28763 6.28004
29.8125 -0.53035 206.20308 0.48623 8.75581 5.80327 5.93826
