0.05000 -12957.56578 1129.38899 6791.69568 16868.95802 15667.28400 16457.32351
0.15000 -18265.37303 206.43091 2836.34982 12175.86384 12944.13076 19391.70438
0.25000 -23226.80711 5.60100 3125.40051 10266.53252 10784.93388 23138.81832
0.35000 -24654.77078 -85.88113 988.86598 9135.52135 8454.12527 23168.59617
0.45000 -23918.14241 153.20871 279.66869 8652.31879 6867.42826 22576.92525
0.55000 -22754.12218 16.72915 -1240.72630 7825.09387 5929.00756 21295.50011
0.65000 -21475.14562 110.32978 -713.87294 7151.76565 5235.36595 19391.47681
0.75000 -20357.76625 36.65052 -89.03530 6488.67946 4795.44637 18204.81538
0.85000 -19235.75714 81.94499 -314.63703 6009.78565 4448.70866 17113.87688
0.95000 -18502.66902 170.55161 160.22691 5513.71230 4186.90118 15806.16919
1.05000 -17635.14175 75.60500 -69.90503 5122.75245 3997.28449 14759.68521
1.15000 -16818.22278 95.75243 -570.92404 4841.84078 3864.01346 13871.52345
1.25000 -16164.11393 148.31046 28.99990 4370.49545 3679.64032 12928.77324
1.35000 -15593.27178 -23.82343 -573.39962 4217.40900 3503.59598 12142.00086
1.45000 -15069.11659 71.19946 -195.68064 3886.74224 3408.11588 11446.71048
1.55000 -14671.89045 117.65661 115.33327 3637.00843 3196.50553 10727.27858
1.65000 -14166.58129 43.91901 -295.37171 3411.46424 3160.93760 10331.56736
1.75000 -13686.15277 30.42048 -221.26587 3173.28796 3017.63111 9735.93327
1.85000 -13376.77837 48.72340 -298.43740 3032.32257 2887.21238 9322.21924
1.95000 -12974.91082 1.67265 -136.22856 2896.96387 2811.30880 8946.66443
2.05000 -12619.79352 69.80396 57.35600 2650.47881 2625.30783 8518.24699
2.15000 -12242.77707 25.68606 -234.99256 2604.59595 2643.44033 8155.52820
2.25000 -11985.94925 45.57162 235.16772 2505.28640 2489.10859 7765.00932
2.35000 -11672.49675 35.48880 -5.17730 2386.39829 2330.84600 7500.16352
2.45000 -11301.72832 -42.96575 132.78819 2239.00759 2306.95485 7251.43943
2.55000 -11050.01494 5.82356 -200.33507 2165.70842 2157.79686 7057.71148
2.65000 -10856.02802 14.79182 118.81738 2064.24455 2126.30429 6748.25502
2.75000 -10676.12355 35.55605 -165.61735 2033.00851 1989.94378 6447.81635
2.85000 -10386.33584 -70.24002 -182.13717 1945.28882 2013.99176 6349.98354
2.95000 -10178.00067 7.21443 -30.14678 1836.71773 1877.45980 6105.30137
3.05000 -9936.94583 -39.08370 -190.90119 1874.00273 1775.42002 5927.53563
3.15000 -9728.11677 64.41644 67.63281 1876.91874 1771.66828 5700.03215
3.25000 -9588.99387 -47.45882 -17.55291 1602.54301 1648.97163 5516.64537
3.35000 -9335.88065 -72.62720 -97.38894 1623.69626 1729.86976 5335.57198
3.45000 -9226.66784 64.34944 -319.02134 1578.26298 1667.24915 5166.63874
3.55000 -9023.53448 -3.88592 -66.19150 1426.09280 1488.06264 5101.37460
3.65000 -8871.00553 26.47255 -104.37165 1375.53902 1456.75117 4874.19055
3.75000 -8735.81552 56.55757 -283.21600 1299.59623 1435.17109 4648.51022
3.85000 -8598.28191 43.26384 -13.00934 1455.95857 1425.95885 4572.43033
3.95000 -8416.57798 22.44288 99.50068 1187.01713 1296.74384 4459.02117
4.05000 -8298.52208 -3.06019 -31.43133 1202.22195 1279.01193 4323.51167
4.15000 -8140.24624 33.92782 156.78105 1252.63263 1404.91268 4350.86057
4.25000 -8009.28204 -6.24217 -68.33227 1073.38316 1196.09856 4137.18249
4.35000 -7933.78072 -23.18592 -9.02476 1058.68042 1242.96008 3979.49738
4.45000 -7794.42583 -22.86400 6.12921 1006.91406 1116.39144 3948.76342
4.55000 -7601.27746 -9.67928 -234.58425 1004.62817 1280.55580 3867.89501
4.65000 -7549.43162 0.09013 -64.18196 950.71649 1081.20238 3735.08794
4.75000 -7385.93158 -28.08283 -101.11811 907.86290 1001.85547 3578.02470
4.85000 -7290.35660 47.42060 -68.12616 880.32540 994.57832 3514.28558
4.95000 -7184.02644 -39.41385 -59.55095 1139.15591 976.76415 3454.13993
5.05000 -7156.88724 17.07095 -156.85711 925.83568 1140.22290 3207.15955
5.15000 -7026.52589 -12.80522 -113.05965 1169.61434 995.57156 3148.35496
5.25000 -6971.61924 8.72427 -113.54011 791.88895 1067.18935 3041.49972
5.35000 -6869.44825 -36.19143 77.05876 695.85469 853.58716 2894.27821
5.45000 -6758.22762 6.13363 -44.42488 708.40679 881.02032 2797.57024
5.55000 -6633.57754 -14.66436 -121.04864 1056.63899 816.61797 2733.74298
5.65000 -6591.35247 -53.86616 -64.78274 635.34935 804.79730 2652.33601
5.75000 -6471.97222 -12.10291 -76.82611 546.37176 747.98209 2535.85683
5.85000 -6403.79865 -7.36448 15.48836 593.65485 754.23275 2520.73342
5.95000 -6353.44333 -17.07551 -119.36582 556.86150 817.49221 2338.43515
6.05000 -6271.92182 -7.50157 -49.47716 558.56237 755.09577 2260.21919
6.15000 -6189.33428 -9.84607 -44.50814 545.26513 680.07162 2208.68366
6.25000 -6134.40831 34.74805 55.48072 492.84773 699.80260 2114.12465
6.35000 -6088.68854 22.41125 117.12377 564.28167 887.08378 2136.55231
6.45000 -6022.84748 19.49811 -48.73857 508.99848 676.06801 1963.08728
6.55000 -5960.47116 -7.80607 100.59687 491.67214 709.05933 1854.45992
6.65000 -5906.60700 -3.13932 83.62070 424.11369 612.81029 1791.53369
6.75000 -5888.39767 -28.44027 71.11349 522.57668 755.53552 1705.73301
6.85000 -5827.79229 0.20424 176.53509 498.33065 755.32579 1712.34114
6.95000 -5792.26104 -5.91149 50.31635 444.83567 595.45956 1585.51561
7.05000 -5747.11772 -15.89524 105.08700 458.36291 666.81185 1572.48747
7.15000 -5702.34434 25.29360 103.17159 460.24018 579.34142 1557.74872
7.25000 -5706.37336 23.47786 95.85627 506.72181 666.71765 1505.31815
7.35000 -5657.44920 -11.28437 178.88608 530.94996 574.81804 1454.65586
7.45000 -5648.29099 10.16680 145.98440 504.29765 550.63873 1419.76417
7.55000 -5603.93971 21.40228 157.12905 718.64848 713.53986 1419.16598
7.65000 -5560.52471 26.11613 122.26405 497.37783 494.80776 1337.94183
7.75000 -5542.10363 13.38947 152.96607 525.41196 480.76564 1324.54135
7.85000 -5492.18715 -0.08373 138.74564 518.46693 496.29176 1267.41204
7.95000 -5459.50029 3.83093 195.61132 534.68073 517.06452 1279.14160
8.05000 -5404.54009 4.85881 143.02281 502.52199 416.15244 1220.67284
8.15000 -5368.52613 11.90939 95.72162 507.17277 403.95947 1193.33756
8.25000 -5329.12657 3.93627 58.67410 494.07809 379.65196 1159.90602
8.35000 -5251.61771 -2.80018 46.24553 516.00514 403.71429 1121.92060
8.45000 -5216.24784 6.65741 166.43268 461.14224 351.66609 1092.82131
8.55000 -5184.39337 13.61316 55.48653 507.65894 374.35728 1102.62055
8.65000 -5109.53819 -11.49148 96.14900 427.35889 380.00797 1057.63745
8.75000 -5097.08151 3.61493 82.95744 503.27671 334.07758 1087.81490
8.85000 -5012.98552 15.12558 135.48606 449.42346 319.89132 1008.51907
8.95000 -4960.03346 -4.89564 71.79626 538.63966 456.89370 994.37495
9.05000 -4927.35165 12.53716 96.68932 383.75722 316.22772 941.38216
9.15000 -4881.07562 19.17125 85.98183 412.49953 293.91412 892.27508
9.25000 -4812.88537 14.11242 69.98525 381.48338 272.23918 892.19258
9.35000 -4758.41563 -3.31168 123.41741 389.15209 309.79542 894.87630
9.45000 -4744.37670 -7.34231 87.48389 386.32319 475.64009 980.66371
9.55000 -4689.01911 3.86890 58.81377 376.38255 295.85682 837.95271
9.65000 -4637.06929 5.83983 70.62891 332.95745 224.45723 801.55732
9.75000 -4559.00036 23.60021 74.59541 577.09161 667.19260 836.00029
9.85000 -4553.41842 5.47904 117.52014 353.95722 257.39357 780.44800
9.95000 -4508.85348 5.99466 84.41585 316.08401 261.57859 782.75048
10.05000 -4464.14977 5.88019 82.37275 315.86413 205.42857 735.05521
10.15000 -4438.91605 0.93528 68.93815 289.12109 232.29218 728.24114
10.25000 -4399.32667 11.62877 103.84018 248.07408 204.75147 742.89867
10.35000 -4355.97553 -3.36998 68.15006 260.85665 369.75773 780.82212
10.45000 -4310.65502 -11.46902 107.31166 436.62014 343.62514 693.32172
10.55000 -4303.55258 8.61823 74.11201 244.47321 206.40463 696.14201
10.65000 -4259.26311 2.50268 86.91003 272.72203 214.04070 664.92435
10.75000 -4223.38574 13.45955 123.55654 424.04020 266.48562 851.46947
10.85000 -4201.24768 13.53602 93.40543 318.04885 214.97786 646.82532
10.95000 -4165.22511 1.67131 51.87209 235.95723 298.60840 613.19389
11.05000 -4141.65779 10.74335 50.14970 229.94346 245.80355 635.46080
11.15000 -4095.89370 6.61666 71.65187 261.59372 161.84668 609.03187
11.25000 -4032.05260 35.27415 68.72344 643.95533 915.03025 652.18005
11.35000 -4050.54797 15.06610 51.99536 735.72642 267.99396 791.59000
11.45000 -3984.04084 1.78229 60.33935 199.35888 148.91090 589.94830
11.55000 -3962.22440 9.30520 72.92933 222.62147 208.56441 652.89767
11.65000 -3934.83997 -2.96965 61.43419 262.04736 423.65934 670.99349
11.75000 -3900.63331 6.83138 72.44706 213.50752 231.38839 615.28595
11.85000 -3869.26975 10.76946 70.84837 183.27384 214.68497 548.67327
11.95000 -3857.00643 13.15114 62.18007 224.69988 171.99967 591.42145
12.05000 -3825.39618 11.93784 37.02351 181.63485 212.35961 520.25721
12.15000 -3800.80374 10.87298 82.17775 182.83759 216.25042 534.40277
12.25000 -3768.40039 12.67360 84.27449 234.62742 155.62782 504.14461
12.35000 -3728.22352 44.70267 35.76030 208.59865 1036.12993 578.26394
12.45000 -3707.53456 12.85878 81.87563 390.46038 377.75505 502.11772
12.55000 -3687.20979 9.15499 64.26380 252.55929 129.80781 488.54479
12.65000 -3679.87855 0.59820 76.70829 312.02690 164.81149 501.45029
12.75000 -3644.37228 -0.70900 66.56116 191.79764 134.25103 489.55520
12.85000 -3613.33086 5.65268 66.43990 206.40008 200.06695 460.09932
12.95000 -3592.29959 -0.98130 69.26924 131.64621 106.92150 440.17145
13.05000 -3563.76141 8.75217 79.56818 169.55669 120.01552 447.40196
13.15000 -3546.46406 2.84171 83.96621 126.03717 96.50721 433.18026
13.25000 -3521.90946 12.85863 54.88574 151.61226 147.75487 554.58238
13.35000 -3489.81069 -2.44732 84.86598 217.93168 123.95899 417.80082
13.45000 -3469.33556 -3.12485 84.44095 174.33760 316.19523 447.26836
13.55000 -3450.63202 10.53426 66.43431 197.49053 143.31903 457.22501
13.65000 -3415.40583 9.34603 80.37708 201.11001 186.55819 429.48943
13.75000 -3385.46494 6.92989 38.29648 322.86211 193.31675 417.86769
13.85000 -3376.78656 9.71708 76.19385 110.49269 97.05591 380.98522
13.95000 -3339.91811 12.22649 86.29979 132.08827 161.24547 417.82080
14.05000 -3310.85116 -3.10344 70.39603 194.29209 169.27478 369.40042
14.15000 -3291.18483 4.73116 80.04810 118.47107 105.73530 381.17004
14.25000 -3275.83790 -0.82133 74.66032 153.16553 123.90727 380.06341
14.35000 -3244.75455 9.35929 77.52826 174.54655 143.80304 359.48472
14.45000 -3225.38417 -7.35715 93.07405 134.04822 210.93500 390.11851
14.55000 -3205.06591 7.47735 88.73098 133.59952 91.56380 336.07748
14.65000 -3165.37270 -5.47929 66.35248 227.65762 112.41810 340.72866
14.75000 -3137.33706 11.36837 93.43956 209.35451 212.89957 325.36501
14.85000 -3141.15174 2.14848 83.90402 127.30514 113.97025 323.43360
14.95000 -3109.53873 6.68784 78.45160 99.48828 84.70237 328.45645
15.05000 -3099.50912 7.23625 72.80205 125.84521 113.29692 313.53542
15.15000 -3074.70879 9.51236 85.30170 111.39017 93.27131 325.10587
15.25000 -3052.88140 7.41476 73.16432 104.82071 79.81276 297.36172
15.35000 -3021.84752 5.54533 89.94412 103.35365 72.28163 278.38376
15.45000 -2999.66065 0.91331 88.28007 194.01183 102.12337 316.44155
15.55000 -2988.48394 9.94317 104.86657 108.20991 90.75497 302.28425
15.65000 -2964.07228 8.34591 98.16225 107.06378 103.74063 279.89197
15.75000 -2947.82771 4.71141 77.98201 91.20563 88.34993 288.20230
15.85000 -2931.12498 6.40709 80.90398 189.00637 125.52828 292.20895
15.95000 -2912.33674 1.99173 88.93822 127.26684 84.67465 284.56142
16.05000 -2896.68649 6.10721 97.23421 122.81107 181.09273 283.95891
16.15000 -2874.00345 7.12780 70.21470 76.19813 66.00888 264.02375
16.25000 -2848.00313 5.42801 93.46930 113.39400 89.34351 273.34739
16.35000 -2856.80519 13.50877 93.29966 223.36152 122.89647 285.03700
16.45000 -2810.04232 2.79109 101.69230 124.80410 72.20922 268.34881
16.55000 -2801.54278 6.80179 100.17433 79.21868 57.92312 250.41294
16.65000 -2778.73947 8.96759 102.79371 97.54833 68.50371 270.68014
16.75000 -2767.20616 7.60723 100.12253 152.37269 117.28151 269.85882
16.85000 -2740.90989 1.60794 75.40207 157.10763 107.71389 262.37698
16.95000 -2729.14041 10.42889 112.26752 133.19905 119.14174 274.35790
17.05000 -2733.14590 7.69580 61.12138 205.38066 80.25488 281.24598
17.15000 -2711.24222 30.05470 83.21821 199.68765 379.32593 288.93310
17.25000 -2686.66497 8.14170 88.69222 77.58562 55.14861 235.07247
17.35000 -2680.71995 -2.71288 100.17211 82.31058 169.50195 227.65718
17.45000 -2662.82927 1.53183 101.91665 105.80019 55.65713 278.32987
17.55000 -2639.96173 10.12436 99.52337 67.05557 66.17404 229.68914
17.65000 -2626.30173 2.65026 94.91078 75.98517 74.00787 227.69929
17.75000 -2598.56674 33.72326 79.20150 117.21958 265.34790 285.04358
17.85000 -2604.08509 11.51267 109.60585 87.77620 78.75854 215.95595
17.95000 -2582.94799 -0.02178 95.25048 95.03426 98.02083 227.09913
18.05000 -2569.59633 10.50721 106.90714 64.22476 54.32881 228.26518
18.15000 -2548.43944 11.19094 88.13979 83.90806 75.55679 218.42983
18.25000 -2539.34178 14.64998 98.34450 79.50426 78.60111 225.40033
18.35000 -2524.12867 6.27593 94.58694 107.37218 80.14538 202.24981
18.45000 -2515.58001 10.04258 108.55337 96.73578 72.29599 217.21119
18.55000 -2506.64937 1.46048 93.50964 73.03716 86.34780 187.66475
18.65000 -2478.33053 13.09697 92.80901 69.01326 48.69074 194.83951
18.75000 -2469.82949 6.12520 102.12417 55.64181 73.20831 213.44802
18.85000 -2458.06656 2.60339 73.51908 74.76288 66.98741 217.14139
18.95000 -2451.45292 0.31192 81.79557 109.21791 105.58990 206.42271
19.05000 -2419.22929 9.99559 89.12566 149.69431 71.07744 214.22431
19.15000 -2405.25253 10.00614 108.63116 93.12703 114.96621 182.90441
19.25000 -2397.11993 11.12370 74.94858 41.09899 48.62616 180.19748
19.35000 -2393.60959 16.79351 80.36574 73.47028 92.19053 169.15914
19.45000 -2367.63360 6.86735 102.51292 51.69348 60.33406 182.27189
19.55000 -2355.75597 6.61567 88.35706 46.33567 46.67965 174.31460
19.65000 -2338.83562 -9.79635 61.88090 68.58904 169.26367 198.22538
19.75000 -2326.66961 10.59737 93.20692 51.19097 57.92227 160.66325
19.85000 -2310.89950 8.62627 81.22785 46.18436 43.82295 172.86211
19.95000 -2300.58970 13.83510 69.88771 74.95011 59.80531 145.59410
