0.05000 -54.17704 -1817.99582 -176250.00642 0.00000 0.00000 0.00000
0.15000 -1201.52237 655.63382 666009.00617 1760.19116 1301.05532 1008004.67425
0.25000 -811.77822 342.79871 55084.37197 2409.72704 1620.97173 265116.50472
0.35000 344.39512 30.13005 -206790.03464 2376.17170 1567.62863 1355450.16851
0.45000 -167.49698 174.19688 7380.68790 2702.40985 1619.52728 1313864.87910
0.55000 -732.78933 38.60057 -60409.91436 2629.01968 1447.11572 1043142.44706
0.65000 -750.47984 -28.04627 35257.64328 2565.72058 1571.13530 898719.39238
0.75000 -757.12071 -114.98113 -153992.82981 2512.27175 1692.13025 1919101.23198
0.85000 -1174.87926 -83.40195 69644.26503 2284.25863 1674.69435 1392676.40932
0.95000 -1411.58335 -83.26037 58237.85633 2252.37632 1664.19281 977675.47971
1.05000 -1348.13877 12.57197 5228.14692 4235.54979 2851.63172 1063330.17825
1.15000 -1491.62014 36.92240 -39281.61095 2447.07957 2818.34387 1237824.05956
1.25000 -1911.30192 18.41615 -75991.71253 6078.81664 3704.88321 1615791.69704
1.35000 -2188.77792 -106.62461 3752.54031 1726.38082 1839.69814 1552029.33573
1.45000 -2488.74635 102.86715 -68543.65001 1962.46974 2124.53681 1570735.58216
1.55000 -2820.42731 -63.40416 26785.96007 1466.61337 1838.58488 1192744.90118
1.65000 -3102.20840 17.49455 -1183.62584 1427.89956 1728.47056 1363997.25796
1.75000 -3322.30947 25.98236 42489.65903 876.72368 1463.43252 1539831.12917
1.85000 -3497.43873 62.67326 33911.10229 709.65805 1548.66142 1765141.50697
1.95000 -3635.18750 -1.94630 -8851.36541 619.53714 1320.00448 1530510.13105
2.05000 -3813.85558 30.79615 26242.30953 2659.68734 3241.70146 1538977.50159
2.15000 -3875.22891 -28.45255 -25741.92687 486.12369 1170.96859 1998081.80813
2.25000 -3942.86204 20.14731 34139.80012 706.10986 1184.83658 1929209.96088
2.35000 -4051.88730 29.87139 -84777.17960 550.32438 1039.97239 1632971.56091
2.45000 -4062.86349 26.26478 -13645.56450 672.70912 995.11007 2077165.27569
2.55000 -4057.61995 5.41284 41911.82079 442.74573 950.79955 1756510.39521
2.65000 -4078.75211 29.00160 -65489.34147 387.15155 891.83324 2107987.47153
2.75000 -4091.67517 -24.12277 -9947.22631 447.43589 996.12838 2508954.31975
2.85000 -4115.53567 -19.67730 -12537.76334 449.64509 861.07648 2005584.22656
2.95000 -4134.48114 -18.40680 9708.93674 372.28766 926.44017 2110064.28473
3.05000 -4126.80082 12.22665 85726.58408 376.34409 738.78535 1981864.32476
3.15000 -4136.50144 20.90969 -4587.06367 449.00311 736.80372 2164641.12788
3.25000 -4120.94492 -33.41766 60479.60558 370.07293 699.21932 1976842.57024
3.35000 -4120.12955 -31.57490 34085.20893 330.07240 643.43683 2264284.05597
3.45000 -4109.66124 12.87807 14554.23762 396.47265 772.06723 2052114.84558
3.55000 -4107.46340 -21.86396 102853.78805 461.72388 874.32705 2057548.11038
3.65000 -4112.65537 -18.35972 -8345.05968 1462.55804 1125.78626 2120575.15222
3.75000 -4073.35108 11.33409 -23836.34641 343.73949 541.49682 2078913.31510
3.85000 -4056.98922 -3.40541 -115146.09633 437.00452 595.41079 2408109.31448
3.95000 -4054.47759 -17.62710 -31766.49177 707.24674 849.77635 2717841.89559
4.05000 -4033.11346 3.98645 9616.30516 348.50437 679.27339 2252386.84801
4.15000 -4010.49213 -6.21412 -3565.84395 430.45100 533.06426 2191875.93869
4.25000 -3996.17951 -20.26756 62728.61243 607.26865 677.61326 2217405.25453
4.35000 -3980.44257 9.63103 61580.07897 391.64495 478.61652 2327351.89089
4.45000 -3975.14471 4.28621 86893.38135 419.16765 492.50374 1908401.15167
4.55000 -3942.30180 -8.87235 16865.88416 502.50816 464.74972 2071174.58932
4.65000 -3917.20878 -7.78849 29149.61652 324.01531 425.45571 2261567.29294
4.75000 -3889.99202 -4.57303 8461.03433 298.66491 449.92759 1758118.06000
4.85000 -3873.56602 -3.99112 132771.30995 271.87714 391.63895 2465220.27472
4.95000 -3849.92168 0.89085 -104906.00072 438.43276 403.17576 2479850.28185
5.05000 -3843.05923 4.03855 82140.22235 298.99263 369.74134 2209139.77118
5.15000 -3822.61440 -9.47012 -75282.26543 283.70186 378.93563 2757872.88752
5.25000 -3799.71214 16.73518 15568.43125 933.07523 754.30813 2241624.10458
5.35000 -3772.43032 19.12157 46033.16070 446.64353 330.54823 2274614.03851
5.45000 -3752.02654 -1.59812 35689.02131 332.39957 376.03449 2206597.28516
5.55000 -3721.87276 -6.40591 22989.78656 814.67376 1405.07098 2551786.53813
5.65000 -3714.50899 3.94444 54763.55418 249.87531 380.03757 2378382.89670
5.75000 -3692.91490 -12.83620 5533.69572 263.02865 394.47310 1970797.22102
5.85000 -3671.02651 -3.27629 41560.13172 975.27775 400.40078 2352311.68383
5.95000 -3655.56471 9.37257 39957.07084 234.54975 288.15394 2323675.78790
6.05000 -3637.16703 3.90173 -25128.32141 286.73766 350.10507 2073678.39378
6.15000 -3622.08410 4.77259 -21975.70845 343.85828 379.29853 2195841.47231
6.25000 -3602.52786 -5.13784 31421.66289 836.16087 301.88545 2346042.72763
6.35000 -3570.86714 3.80814 20405.99893 286.24677 288.98256 2337556.13549
6.45000 -3560.83184 3.88666 -8706.73677 226.44045 273.99078 2186048.07697
6.55000 -3541.24340 -7.55509 20078.04874 207.47823 261.93193 2112193.34991
6.65000 -3524.19713 10.46203 -33437.04030 358.05957 399.95732 2032533.51954
6.75000 -3500.11099 -0.66569 89986.79458 354.63340 621.00188 2319512.32170
6.85000 -3494.48429 5.66878 -18143.01941 308.32879 291.95077 2217138.26985
6.95000 -3462.55877 -9.70405 -89444.21537 193.29594 235.10572 2007962.03280
7.05000 -3457.57627 9.20875 -23779.77314 233.44244 299.04006 2177401.88579
7.15000 -3424.96418 3.12201 75577.23689 511.91540 365.75307 2285937.96290
7.25000 -3418.77420 3.15976 -132097.47843 199.84504 244.01452 2325909.10547
7.35000 -3395.22568 -0.24142 51337.66972 208.16626 270.21278 2446725.46461
7.45000 -3379.02792 2.03550 -23902.17429 193.35519 221.51878 2246108.65987
7.55000 -3358.80610 -0.40217 -2225.85139 205.10224 232.20678 2125657.74850
7.65000 -3343.23667 1.07136 -14210.28275 246.99338 271.62653 2346330.07603
7.75000 -3334.03497 -7.25625 -44917.56135 227.53793 254.98151 2335047.26475
7.85000 -3310.38873 0.91757 -37837.81680 199.75986 213.65198 2419080.60207
7.95000 -3302.33552 2.62538 22326.16093 331.64100 253.49884 2323441.58353
8.05000 -3283.36979 4.53845 37321.75696 233.66168 236.76246 2337537.50414
8.15000 -3273.43695 1.23888 72859.63814 1104.53844 551.21523 2508802.56836
8.25000 -3245.57053 -5.01558 -35363.35499 2238.57739 1882.67669 2152421.93540
8.35000 -3234.31847 -3.89074 -36277.97427 225.05387 301.28425 2205305.36287
8.45000 -3215.14045 -0.85641 -14749.79779 183.24972 183.82652 2010515.75166
8.55000 -3194.49094 -1.14453 -37300.04916 195.51808 222.94974 2146703.67827
8.65000 -3183.21489 4.50012 -68373.64860 182.36651 216.89906 2317936.71598
8.75000 -3165.73061 -0.18759 2161.18652 225.80454 221.36736 2098390.39308
8.85000 -3142.39130 6.10523 -32859.58745 213.74617 213.57391 2433473.91200
8.95000 -3132.19734 1.63467 -47734.99386 183.08497 206.77212 2316882.88044
9.05000 -3111.26405 2.48179 -46139.60144 217.27494 215.14750 2271376.52010
9.15000 -3096.38844 1.05039 47862.04648 174.44620 182.85805 2185330.21660
9.25000 -3085.64479 4.42561 42379.39048 239.41543 239.35027 2326561.26549
9.35000 -3065.56057 -2.65470 3969.28874 199.75054 187.79825 2153600.76334
9.45000 -3047.70937 3.77037 2845.40178 171.17875 191.58846 2328365.82676
9.55000 -3031.21425 1.38737 3672.60673 166.88764 167.25948 2433131.72096
9.65000 -3020.96855 -0.45298 95834.02544 198.19699 263.46866 2216382.97515
9.75000 -2994.45842 -7.61956 -23397.18607 264.64402 208.92627 2285555.98590
9.85000 -2988.99525 0.32074 -17291.31121 488.38313 378.97905 2260221.90644
9.95000 -2965.65859 -2.85856 9429.90357 182.22207 171.74380 2006691.54934
10.05000 -2949.05164 6.04329 -85044.52534 269.31009 195.25100 2323122.59294
10.15000 -2943.33815 0.84680 -67904.11842 162.28021 172.29807 2209350.69365
10.25000 -2925.26876 -1.13753 -40893.63146 364.78083 296.27452 1955070.71044
10.35000 -2910.61640 -1.87848 71081.75429 163.63409 157.13874 2010307.26308
10.45000 -2895.10407 1.37283 -34510.10146 157.93690 139.72430 2172703.49582
10.55000 -2879.75995 -1.03246 -22555.87194 143.17388 143.32510 2083601.41477
10.65000 -2868.09853 -1.80841 -68805.88660 148.06403 154.61081 2021430.49135
10.75000 -2845.73037 -2.17630 -50043.97460 150.23212 135.62202 2151563.17163
10.85000 -2834.29248 -1.15037 24018.16102 154.48217 129.12858 1977444.85276
10.95000 -2815.79034 -1.03823 -73479.42213 186.27596 165.12597 2153399.63901
11.05000 -2809.63518 -1.10997 -45584.30109 223.71766 155.63858 1976862.75754
11.15000 -2789.84591 2.94028 14592.28984 220.90263 143.21355 2172055.50690
11.25000 -2779.94367 -0.24792 42698.32245 213.90668 178.39175 1978445.93965
11.35000 -2763.27876 0.74374 -6448.73172 156.16480 136.84883 2107138.99600
11.45000 -2747.95771 -0.30205 46757.68278 158.59315 128.27578 2096064.71979
11.55000 -2737.81659 3.48669 -14038.08742 151.31314 151.50099 1941160.58979
11.65000 -2724.64938 -2.18535 -80.65638 165.16339 129.74236 2216808.47887
11.75000 -2707.46932 -0.34369 -11404.42052 154.92956 138.65124 1972281.83113
11.85000 -2692.39337 -0.55734 43274.96253 149.15846 144.75882 2262847.94897
11.95000 -2678.84538 0.21827 1298.30000 130.03399 111.38008 2188265.67213
12.05000 -2669.21474 0.63561 2275.74352 121.78436 107.55301 1870278.43491
12.15000 -2652.38769 -1.56213 -9775.93826 166.61022 146.56876 2221838.67211
12.25000 -2636.21053 -0.97976 8381.32057 131.94335 110.27373 2124283.90931
12.35000 -2626.13939 -1.16453 29689.57324 135.56091 111.32857 2227369.87773
12.45000 -2614.70892 -0.95289 41695.33673 146.99916 178.93127 2044956.59859
12.55000 -2600.89224 -1.82802 34282.55194 165.82675 158.83912 2277724.85825
12.65000 -2588.31247 -0.25526 32970.45855 142.56489 120.82532 2194054.92645
12.75000 -2567.83391 -3.08060 25787.81989 134.37638 138.56872 1997929.66987
12.85000 -2558.58778 4.02849 -76025.96205 197.82617 168.59968 2263167.51397
12.95000 -2547.49857 0.67722 -31949.85399 134.11368 107.02343 2032201.59168
13.05000 -2533.75836 -5.03898 89451.37352 683.12626 3808.49877 2180085.67481
13.15000 -2524.65302 1.39283 -4082.41316 137.15012 165.75279 1983213.73700
13.25000 -2508.32260 2.37092 7352.03242 130.70037 135.48963 1914261.25900
13.35000 -2496.45789 -2.65694 11100.75979 119.50199 105.15329 1974487.93795
13.45000 -2487.35243 1.15871 471.39367 120.78147 109.61513 2123719.80048
13.55000 -2468.04561 1.14752 40114.21786 154.33975 108.79400 2263939.63340
13.65000 -2465.51723 3.28871 -22907.16596 122.19015 100.18728 1932357.92237
13.75000 -2448.75043 -1.09669 57091.08539 124.86690 116.79434 2199749.98220
13.85000 -2434.99874 -2.38594 -6502.47221 121.62932 96.67790 2054337.90384
13.95000 -2420.39114 0.35139 32028.02817 127.31024 97.39177 1860629.55833
14.05000 -2410.07051 -3.50658 40690.13637 289.89253 94.59222 2106548.97455
14.15000 -2396.59562 -2.59867 495.86334 131.90193 104.74796 1785452.57520
14.25000 -2389.96502 -0.87509 -117797.67495 119.50470 87.53342 2095401.56608
14.35000 -2377.05163 0.09055 39267.38895 155.21430 105.74820 1933354.97439
14.45000 -2364.70640 -0.86996 -12921.64186 115.46057 93.37928 1927327.42644
14.55000 -2353.15470 -1.30211 -18521.63627 107.00105 94.80908 2309954.97473
14.65000 -2340.82801 1.24697 70546.01176 125.90789 89.10215 2132076.01944
14.75000 -2325.42770 -0.67213 65006.72041 116.88345 97.98041 1986075.55491
14.85000 -2319.58029 -1.12826 -90788.20953 125.66517 109.42409 2091657.62841
14.95000 -2306.98158 1.21337 -39475.16011 135.18148 111.29769 1877364.34887
15.05000 -2297.61028 -1.00224 -79414.46145 104.30261 78.31591 2017543.78576
15.15000 -2284.16611 -1.71028 -35737.20099 200.06019 101.65894 2148701.23590
15.25000 -2275.22196 3.15036 -30344.27183 220.80263 177.47766 2078973.93774
15.35000 -2264.17654 2.51944 41728.27938 111.39260 107.84500 1981893.21573
15.45000 -2252.19901 -0.95618 -5106.21855 108.73011 151.50783 1800115.14599
15.55000 -2243.08512 0.80944 -53316.62362 123.99956 76.41774 2065655.38077
15.65000 -2233.01018 3.17386 -13741.27021 108.46519 83.32491 2034251.54837
15.75000 -2223.45740 -0.97025 -57110.00377 103.15949 76.15001 1837170.65854
15.85000 -2210.21196 -1.56032 86215.53855 126.64102 95.99694 2137794.11649
15.95000 -2200.77350 -1.41467 13292.89140 109.79075 87.89220 1891563.51262
16.05000 -2191.71310 0.30541 26970.59650 110.85280 94.75475 1869594.39755
16.15000 -2181.07008 -3.53915 -15627.24020 93.91072 82.25310 1893939.35408
16.25000 -2167.88465 -0.92413 21449.59855 91.36213 74.95787 1889929.51217
16.35000 -2165.14258 -1.33476 -48432.76519 102.08891 92.88426 1920821.39597
16.45000 -2152.83968 1.47589 -2836.94104 101.32199 86.17320 1871993.77150
16.55000 -2140.25254 0.10009 47550.48940 97.11452 79.81249 1861849.50395
16.65000 -2132.91971 1.38853 -672.32546 92.33650 78.33151 1966077.29931
16.75000 -2120.73982 -0.29608 -38084.72428 98.16410 175.96423 1973848.32757
16.85000 -2111.14405 -2.48334 -14877.23779 97.83360 74.36654 1859450.09349
16.95000 -2104.67671 -0.78644 -18440.51191 94.28788 71.19953 1870422.16839
17.05000 -2091.61047 1.40930 11648.04048 128.51406 74.46062 1939397.18725
17.15000 -2083.88856 0.13840 17849.46718 99.79421 68.21315 2025533.14390
17.25000 -2073.88861 -0.08884 -15495.00119 93.55413 70.02105 1940510.30131
17.35000 -2067.52050 0.77108 -48766.42971 86.59636 64.06309 1779254.34750
17.45000 -2058.78132 1.20729 26821.26340 88.14362 69.05148 1897463.65002
17.55000 -2045.18304 0.07476 -22987.84821 89.20227 84.85650 1812664.24440
17.65000 -2038.12070 1.58610 17326.44736 98.48885 76.96303 1874650.29320
17.75000 -2028.81205 -1.11284 22015.37054 122.00667 70.43110 1764388.70724
17.85000 -2020.80031 -1.18713 -10373.31495 95.55064 67.07692 1990550.96943
17.95000 -2011.56758 -0.57663 4644.83232 92.11654 82.51664 1735328.26922
18.05000 -2001.71012 -0.76488 -8686.66994 257.87173 482.09602 1720919.29611
18.15000 -1992.44106 0.83494 45782.02703 84.80175 62.01771 1797294.55517
18.25000 -1981.41617 -0.73080 -7007.89146 100.35068 84.29732 1898275.26730
18.35000 -1973.55118 1.05343 -61144.27961 84.63166 61.75008 1816782.58339
18.45000 -1962.78212 -0.64278 29624.19964 96.76337 75.56820 1900081.53142
18.55000 -1954.40494 0.76988 14247.38489 81.80085 61.39750 2154700.01328
18.65000 -1946.31210 1.51698 7666.06161 150.38887 91.59425 1810939.99728
18.75000 -1939.98468 0.19099 26738.42011 93.71597 65.85115 1764186.62207
18.85000 -1930.62907 0.82625 -8535.82661 89.98117 73.87786 1858865.09095
18.95000 -1922.18689 2.45564 18436.38882 89.84031 93.84145 1818955.73394
19.05000 -1912.07551 -0.41896 67341.60209 101.45385 69.15705 1803083.70311
19.15000 -1899.94232 -0.38974 63689.61798 81.05194 60.43502 2078977.55344
19.25000 -1898.07982 1.29292 44424.18582 119.05334 110.55362 1643006.05171
19.35000 -1884.76264 0.37896 -30647.28372 110.12861 76.87401 1649028.62395
19.45000 -1879.02003 0.93849 6823.46754 81.58656 78.68743 1895986.60477
19.55000 -1870.80061 0.97253 49223.53123 74.77242 53.54004 1857631.66471
19.65000 -1862.72765 -0.59414 90145.76974 92.03160 105.09112 1962842.42726
19.75000 -1853.75149 -0.18051 262.33103 101.51783 91.00439 1808908.29106
19.85000 -1846.53376 -0.31139 27020.37105 100.44701 66.46992 1723759.46022
19.95000 -1839.61622 -0.29075 16988.35877 110.29148 74.01181 1809897.21850
