0.125 -0.001 -0.001 0.002
0.375 0.004 -0.003 0.046
0.625 0.000 0.013 0.265
0.875 0.006 0.014 0.747
1.125 -0.033 0.011 1.421
1.375 -0.003 0.033 2.125
1.625 -0.033 0.076 2.970
1.875 -0.052 0.052 3.681
2.125 -0.087 0.037 4.238
2.375 -0.063 0.054 4.729
2.625 -0.040 0.100 5.174
2.875 -0.054 0.039 5.667
3.125 -0.012 0.017 6.028
3.375 -0.084 0.109 6.433
3.625 -0.052 0.103 6.687
3.875 -0.074 0.130 6.887
4.125 -0.058 0.060 7.187
4.375 -0.111 0.045 7.279
4.625 -0.056 0.137 7.547
4.875 -0.093 0.163 7.819
5.125 -0.090 0.194 7.900
5.375 -0.089 0.178 8.393
5.625 -0.064 0.194 9.054
5.875 -0.073 0.265 9.152
6.125 -0.083 0.200 9.949
6.375 -0.126 0.129 10.430
6.625 -0.119 0.194 11.315
6.875 -0.097 0.218 12.502
7.125 -0.158 0.267 14.448
7.375 0.014 0.357 15.631
7.625 -0.111 0.386 17.651
7.875 -0.157 0.418 19.248
8.125 -0.122 0.426 21.718
8.375 -0.126 0.430 22.659
8.625 -0.067 0.423 24.052
8.875 -0.100 0.482 24.907
9.125 -0.132 0.480 25.682
9.375 -0.155 0.424 25.705
9.625 -0.121 0.363 25.418
9.875 -0.119 0.368 24.963
10.125 -0.140 0.457 24.373
10.375 -0.100 0.420 24.585
10.625 -0.052 0.355 23.904
10.875 -0.091 0.458 23.657
11.125 -0.105 0.369 23.491
11.375 -0.097 0.424 22.827
11.625 -0.074 0.386 22.412
11.875 -0.070 0.380 21.811
12.125 -0.041 0.385 21.616
12.375 -0.045 0.387 21.426
12.625 -0.010 0.404 20.812
12.875 0.008 0.413 21.397
13.125 0.006 0.381 20.483
13.375 0.010 0.394 20.925
13.625 0.044 0.398 20.163
13.875 0.070 0.404 19.880
14.125 0.024 0.371 19.176
14.375 0.065 0.376 17.870
14.625 0.035 0.390 17.791
14.875 0.059 0.389 16.571
