0.05000 -5732.49775 -324.96551 3789.23437 5330.18511 6823.83825 6232.36328
0.15000 -5605.53589 485.29102 2566.57861 5966.03242 5398.24538 8559.99291
0.25000 -9211.77764 86.47285 2774.44324 6270.29090 5316.33029 12449.64592
0.35000 -11871.03462 151.32840 1726.37515 5707.62778 4619.03622 13620.40570
0.45000 -13045.44734 95.23127 688.36202 5525.60874 4614.55552 14403.91637
0.55000 -13149.55761 41.24505 270.74564 5205.69602 4454.84315 14441.23065
0.65000 -13286.95517 -18.31436 292.91321 4888.01507 4380.28297 14074.02499
0.75000 -13105.05190 4.36058 -160.34101 4610.43436 4180.82758 13347.66160
0.85000 -13178.00411 -12.83068 -75.89851 4374.81684 4040.28762 12485.20597
0.95000 -12833.58945 112.02355 -252.16188 4070.81455 3932.22703 12215.73691
1.05000 -12648.53702 30.70476 157.42722 3679.41881 3867.74468 11414.21129
1.15000 -12410.08398 181.00661 101.82643 3723.02239 3829.41633 10909.67291
1.25000 -12313.76412 69.55053 -403.07145 3441.89038 3705.72344 10421.74039
1.35000 -12157.47110 93.44249 -50.32153 3179.49074 3619.73434 9747.73914
1.45000 -11607.94563 69.21214 -195.19854 3126.18425 3410.19685 9507.18507
1.55000 -11479.74361 61.23603 -230.25037 2756.48238 3426.19563 8856.96315
1.65000 -11138.42573 117.02656 -217.97921 2721.57540 3382.88365 8668.92169
1.75000 -10848.13421 195.59789 -168.61642 2553.54944 3339.90278 8171.28259
1.85000 -10640.53964 122.43876 -239.09211 2332.68629 3241.20645 8015.70134
1.95000 -10479.57838 148.71182 -263.75955 2265.44625 3139.89719 7599.35036
2.05000 -10438.10873 74.28633 -103.78881 2126.41814 3336.71508 7324.83238
2.15000 -10204.89445 36.50890 -67.59400 1995.87675 3118.49745 6983.13431
2.25000 -9911.25725 -4.21236 -67.57975 1894.63768 3090.36345 6706.65072
2.35000 -9849.24507 3.54262 -197.23304 1678.98675 2970.73389 6323.36048
2.45000 -9705.25152 76.35366 -483.31600 1773.34280 2946.16383 6290.50525
2.55000 -9442.91864 96.22901 -18.20693 1578.53502 2869.35986 6084.37225
2.65000 -9292.54061 23.57040 -190.68056 1651.66787 2814.31311 5926.22010
2.75000 -9157.19952 68.07561 -66.82508 1592.57595 2768.57173 5758.19511
2.85000 -8977.37745 15.17649 183.29927 1401.61949 2667.96102 5537.63905
2.95000 -8823.51313 -53.58081 23.01712 1275.56140 2626.14467 5363.34439
3.05000 -8666.07387 -31.68188 -102.30250 1281.32099 2546.62663 5177.60807
3.15000 -8561.30404 2.12091 -60.89830 1164.52798 2588.54317 4962.98349
3.25000 -8477.17238 -33.57850 -120.06733 1221.02160 2483.46822 4964.26395
3.35000 -8319.14749 -41.39034 -20.74708 1096.09000 2378.93714 4758.69005
3.45000 -8194.28116 -25.49944 -90.09633 914.44785 2349.95358 4548.29396
3.55000 -8111.04015 -17.17524 -48.67736 933.06684 2336.27150 4446.92168
3.65000 -8001.24868 -6.64114 93.03341 1042.01891 2252.52582 4315.30733
3.75000 -7919.88938 -32.76874 -7.14604 879.05382 2206.68853 4135.60610
3.85000 -7847.02785 -94.99157 15.42206 795.07862 2154.29972 4126.60727
3.95000 -7795.59126 -42.83072 108.21026 784.83303 2059.57345 3924.03509
4.05000 -7774.90310 -52.50609 1.89965 789.14022 2105.07989 3859.16720
4.15000 -7723.75891 -69.10651 195.20534 824.97819 1954.64228 3786.98951
4.25000 -7683.38760 -2.00783 39.99103 837.82308 1933.15339 3642.51956
4.35000 -7647.74635 -6.96442 25.17569 887.13712 1801.81663 3522.26528
4.45000 -7553.55744 -62.57875 -28.69067 961.90592 1754.60813 3389.44184
4.55000 -7479.05325 36.38308 5.16077 1020.07985 1720.28729 3338.42247
4.65000 -7483.41046 -30.99570 47.75244 886.43814 1649.77952 3222.71053
4.75000 -7389.10992 32.74240 -55.70791 906.72392 1524.56082 3108.44947
4.85000 -7343.31601 -5.98130 149.50636 932.43152 1497.39619 3080.08866
4.95000 -7310.77593 10.59443 -4.61837 985.77091 1411.69578 2977.11615
5.05000 -7284.35117 30.68087 -33.72372 989.45473 1394.45296 2852.89558
5.15000 -7266.16343 -0.80395 84.09302 1051.53394 1360.09490 2809.77248
5.25000 -7223.13579 39.07806 124.05688 1054.97612 1237.16699 2649.13017
5.35000 -7186.00027 7.44090 23.88878 1060.06869 1161.58585 2616.93569
5.45000 -7103.62050 61.51172 -10.55312 1064.14392 1056.49262 2473.09148
5.55000 -6997.79952 67.85354 71.73787 1035.06291 993.92811 2383.19689
5.65000 -6965.84829 91.58040 61.55904 997.97006 962.91533 2344.70095
5.75000 -6933.80449 49.02663 -17.29050 983.73237 913.09223 2289.84610
5.85000 -6881.13709 50.22233 -67.61028 973.35600 987.82193 2193.52807
5.95000 -6795.41386 45.30413 57.81954 960.25728 797.16042 2056.08726
6.05000 -6750.62445 43.24567 37.16433 919.30128 760.61780 2021.87512
6.15000 -6678.48847 47.57680 22.90641 906.27786 752.17180 1939.27285
6.25000 -6639.12154 30.17995 -21.86657 996.54126 718.25021 1933.38255
6.35000 -6559.26736 25.15965 -10.02123 1014.70413 740.77390 1836.04302
6.45000 -6496.64618 30.59495 74.29398 836.77868 602.55270 1788.10518
6.55000 -6369.65455 44.48243 24.58408 753.01199 587.57064 1717.36736
6.65000 -6314.54044 21.50224 54.48647 737.20041 541.66024 1676.64211
6.75000 -6256.55778 31.98710 20.39906 705.94427 523.02527 1642.33106
6.85000 -6209.81911 25.77899 73.72000 727.32240 539.52488 1614.53183
6.95000 -6078.10061 26.88041 -4.72026 615.52478 464.52255 1477.35291
7.05000 -6017.31628 32.92232 21.47321 596.02106 464.84402 1482.17303
7.15000 -5939.46524 16.59708 26.18700 637.99481 532.94273 1469.74644
7.25000 -5899.98198 19.12236 19.46796 674.41790 594.99200 1447.49587
7.35000 -5849.03496 5.83692 33.80587 533.53722 803.14713 1368.59411
7.45000 -5781.53831 12.08637 21.30739 560.55684 403.87497 1317.14383
7.55000 -5735.88996 23.23100 -1.51511 459.58485 416.38655 1272.74946
7.65000 -5696.52273 14.19126 20.73023 496.96216 410.31357 1325.29099
7.75000 -5634.01501 12.58835 -0.43628 477.89029 349.23975 1221.48674
7.85000 -5572.22592 28.15513 -25.06649 465.64236 394.25214 1166.22977
7.95000 -5508.68421 18.52770 66.97518 459.84964 327.50487 1203.20997
8.05000 -5444.53296 0.84314 4.97580 429.23547 302.68709 1154.04189
8.15000 -5380.09479 3.74586 -20.37093 499.69282 418.09885 1138.78880
8.25000 -5345.15258 14.31249 8.26946 397.60539 514.76155 1102.61930
8.35000 -5281.91280 31.54395 -48.76275 675.65218 499.24727 1044.38099
8.45000 -5219.06522 17.23430 -19.71748 316.78084 270.41949 1059.54184
8.55000 -5202.96924 26.33628 3.38609 328.29117 252.36747 1026.48298
8.65000 -5137.15764 5.78688 56.71872 376.52991 345.71148 1000.04023
8.75000 -5110.98324 9.17306 3.08526 340.21690 278.12151 957.97778
8.85000 -5033.67778 3.22336 -43.62773 320.68483 299.51181 936.22979
8.95000 -4989.33569 14.53391 -9.59571 311.63822 228.00121 927.03132
9.05000 -4942.64318 11.15112 3.52284 373.24301 249.33437 907.82849
9.15000 -4898.36208 8.84807 6.97267 443.47606 297.22674 898.99316
9.25000 -4853.01515 17.42562 7.56831 261.41594 213.93692 880.90225
9.35000 -4820.29511 24.83941 -12.93127 577.33383 564.38799 1025.65623
9.45000 -4766.07928 14.83827 26.81493 307.32420 268.71201 819.38483
9.55000 -4713.21898 5.88136 -8.25909 259.57494 222.42914 815.25683
9.65000 -4679.84695 13.17812 -24.34574 249.60049 270.01423 863.27474
9.75000 -4646.76018 23.01759 39.19329 304.65628 215.63934 775.98970
9.85000 -4614.10149 19.17141 10.46685 307.21898 256.76936 826.94625
9.95000 -4572.33701 14.33091 -24.54983 309.25558 262.28902 767.08067
10.05000 -4516.08658 18.87938 -10.07766 264.60967 225.36694 745.86261
10.15000 -4467.65551 12.76973 46.49572 248.20421 259.76280 733.11338
10.25000 -4430.73934 14.83105 51.84848 228.05241 185.45457 709.35047
10.35000 -4399.34975 21.82351 21.73295 227.16729 171.45937 693.91066
10.45000 -4365.25816 7.73383 1.42605 281.65551 207.93817 694.98785
10.55000 -4329.16001 20.34773 -9.76671 265.67584 231.27298 686.36078
10.65000 -4272.16619 17.79871 -79.51422 391.97186 270.90715 711.41934
10.75000 -4251.63750 11.70244 25.36977 213.06591 188.12453 669.24749
10.85000 -4211.43286 14.16567 -26.43459 374.86757 423.84743 674.41985
10.95000 -4177.72074 18.04363 -1.97638 226.01210 193.09314 627.50274
11.05000 -4154.22270 8.69733 17.04778 255.62799 371.70753 638.16616
11.15000 -4109.54763 27.89344 53.76673 256.76953 226.64445 615.70684
11.25000 -4076.18206 21.95263 20.12623 204.89510 212.38416 621.79351
11.35000 -4061.27608 26.22713 -32.84367 189.82432 224.63212 602.76986
11.45000 -4034.55361 5.86856 34.56904 270.03951 191.95788 589.11705
11.55000 -3984.68531 15.06546 -0.05647 271.34633 153.28142 595.27615
11.65000 -3962.10599 15.41659 -17.38647 225.10063 150.63795 559.42124
11.75000 -3928.18604 19.53133 1.77214 241.82133 167.89117 552.90738
11.85000 -3915.52071 30.72237 -21.08005 281.63323 214.48350 586.30242
11.95000 -3879.37137 14.64213 -6.12497 183.24639 165.80395 551.31866
12.05000 -3858.21306 16.64376 -7.64033 231.10483 164.12287 512.25288
12.15000 -3831.94206 13.74615 12.87765 186.91023 145.93172 511.54088
12.25000 -3796.43314 18.07934 -32.03123 169.93095 109.16368 508.70128
12.35000 -3770.18278 4.53975 -3.57126 239.22799 217.09538 513.19898
12.45000 -3741.55832 24.85218 -7.49652 165.51485 148.53899 508.05798
12.55000 -3722.53921 -17.96081 -11.81306 238.81246 995.90971 670.32389
12.65000 -3677.84721 9.69628 -3.85731 220.95964 135.60349 481.40982
12.75000 -3664.35922 5.93072 -28.31946 173.02263 203.25802 473.26668
12.85000 -3640.74125 10.96302 -19.85485 228.77341 264.85302 497.23167
12.95000 -3620.67028 17.11428 13.70833 264.31071 142.93398 482.27996
13.05000 -3593.95822 10.86512 -9.43522 113.96328 160.31843 458.79786
13.15000 -3566.77110 10.79329 5.69683 144.09087 137.85208 463.00764
13.25000 -3539.28319 10.06184 -1.84018 124.01741 94.41655 399.34677
13.35000 -3524.24057 7.29264 -20.46459 146.46537 110.65750 411.15590
13.45000 -3496.00530 6.70801 -24.37433 180.33927 256.64302 441.60573
13.55000 -3475.39752 11.87996 -9.84558 119.39299 86.79420 388.08097
13.65000 -3437.61597 12.94131 -14.40558 148.72388 123.76323 393.91471
13.75000 -3420.83377 15.88248 5.20864 157.96159 354.14587 450.61032
13.85000 -3399.03691 -1.73907 -16.85951 133.26117 225.85684 390.86549
13.95000 -3385.39302 4.03582 1.19354 143.38297 141.34825 404.98554
14.05000 -3351.98474 6.79470 -7.79368 93.99967 97.60255 368.39386
14.15000 -3326.32447 15.75860 14.93462 134.88799 127.31913 358.37154
14.25000 -3293.14646 7.08785 -6.14502 192.79533 298.10751 348.99874
14.35000 -3275.76474 5.63266 -1.44941 100.17404 92.00449 332.04169
14.45000 -3251.12206 17.55080 -5.24215 147.36283 94.74469 325.14163
14.55000 -3225.13237 9.42410 -13.52450 111.65724 84.17956 368.76927
14.65000 -3196.34242 7.20940 -3.58514 136.28732 262.92234 310.99737
14.75000 -3172.68975 0.76014 17.99057 129.33881 111.98876 337.15880
14.85000 -3156.21796 13.47190 -12.86169 97.31502 96.96371 312.52612
14.95000 -3126.61412 1.89264 19.14778 110.74805 121.98467 296.18251
15.05000 -3098.90753 -5.09929 -17.06516 276.32293 277.77174 442.32670
15.15000 -3097.53790 17.68148 -5.84383 88.70722 73.38980 300.57796
15.25000 -3097.25783 -12.36146 0.73111 335.39547 459.10379 479.23319
15.35000 -3062.61400 6.74565 -9.02941 96.80661 79.56874 276.33970
15.45000 -3033.13547 9.56947 -0.06847 71.98706 71.55617 272.60124
15.55000 -3016.86040 6.70139 17.49179 84.29235 90.17206 276.66084
15.65000 -2988.25109 9.61095 5.14823 77.70916 70.71364 264.81851
15.75000 -2959.73293 1.74579 13.93509 307.66951 73.14825 262.66179
15.85000 -2959.45768 12.91500 -10.89253 130.91749 97.43604 324.69518
15.95000 -2920.86670 -1.19213 -8.41774 229.74186 75.47361 250.47776
16.05000 -2914.21024 9.29741 -10.97391 74.02997 94.57070 248.03785
16.15000 -2903.24905 4.87917 17.19438 96.65966 63.77683 238.20038
16.25000 -2883.50371 18.06802 24.39873 148.87627 152.06737 262.15240
16.35000 -2863.19207 12.64630 18.41071 115.95441 140.62945 240.01709
16.45000 -2852.16964 9.98030 17.66266 81.54757 102.92519 228.79228
16.55000 -2824.07598 4.06144 17.00973 108.08742 85.36697 247.98447
16.65000 -2806.58261 12.21113 -5.33991 56.06333 95.74780 237.34261
16.75000 -2787.16129 2.91131 7.62349 69.76532 95.33355 222.81043
16.85000 -2761.13476 12.75133 34.88580 233.38968 131.33493 229.69623
16.95000 -2753.12782 -1.29884 26.38974 91.87852 82.98800 230.28976
17.05000 -2735.12171 0.37009 11.86247 130.24349 106.71749 215.23542
17.15000 -2714.03586 1.80463 22.69409 65.01860 56.09189 214.44103
17.25000 -2695.19628 2.76182 49.58027 86.69998 80.94771 224.30045
17.35000 -2710.76488 -19.20402 5.68587 316.41015 252.32257 423.91965
17.45000 -2661.78379 8.01605 27.15680 88.11557 78.39976 207.52465
17.55000 -2654.02415 1.68345 40.11749 76.82573 78.51494 234.14214
17.65000 -2635.54212 1.08697 48.61227 67.55908 54.25286 197.69711
17.75000 -2621.55973 4.84182 34.34600 77.68595 83.25870 192.10597
17.85000 -2599.45235 9.49563 36.23501 43.09325 45.59852 177.47246
17.95000 -2582.20489 1.22920 24.92909 45.55759 55.00162 182.52848
18.05000 -2545.48808 0.52898 39.63379 453.83959 188.13561 275.72105
18.15000 -2547.02462 12.01736 10.30617 63.81139 60.84032 182.23470
18.25000 -2530.76558 5.19500 -7.61344 59.47092 58.34354 205.41515
18.35000 -2515.39454 8.85363 16.85565 66.24401 44.19760 196.92327
18.45000 -2501.46148 18.40255 12.99865 56.22374 61.62534 189.26974
18.55000 -2476.65130 2.49578 8.06112 62.22011 86.30205 199.79284
18.65000 -2468.68817 9.70592 -5.59918 58.54257 74.01739 199.27270
18.75000 -2452.62037 8.77754 18.80015 63.58898 39.62294 192.18837
18.85000 -2445.00954 11.18055 -9.59576 49.93202 54.05747 174.35141
18.95000 -2424.02034 11.46534 -10.49758 43.85606 46.95471 191.34402
19.05000 -2413.20129 -2.78313 7.33708 53.28866 61.50757 190.07000
19.15000 -2395.82006 -17.86208 8.83987 209.52174 466.94069 273.29636
19.25000 -2387.87563 3.56703 -51.42679 44.85590 36.22583 180.24113
19.35000 -2366.86912 11.94814 -14.70045 110.77338 104.57380 181.91677
19.45000 -2346.06187 9.41629 -6.17062 40.77091 42.55204 171.92056
19.55000 -2334.62187 8.47373 6.41343 46.20813 57.80981 171.77189
19.65000 -2324.97674 4.51409 -37.28436 58.74746 56.57428 167.63723
19.75000 -2315.72646 6.27832 3.28588 54.96505 48.30588 183.20904
19.85000 -2298.88260 9.00353 -3.06334 40.59270 35.05539 181.96491
19.95000 -2278.31008 -0.29181 2.91955 69.50410 72.35987 179.02367
