0.450000 -2.754690
1.350000 -2.794060
2.250000 -2.799270
3.150000 -2.790440
4.050000 -2.787760
4.950000 -2.747400
5.850000 -2.766540
6.750000 -2.755820
7.650000 -2.726840
8.550000 -2.718490
9.450000 -2.730360
10.350000 -2.807710
11.250000 -2.969420
12.150000 -3.077810
13.050000 2.839440
13.950000 2.905230
14.850000 2.959560
15.750000 3.059420
16.650000 2.314260
17.550000 2.174820
