0.120000 0.988500
0.380000 1.450570
0.620000 1.321960
0.880000 1.367060
1.120000 1.311050
1.380000 1.320860
1.620000 1.403720
1.880000 1.400230
2.120000 1.389800
2.380000 1.435020
2.620000 1.423730
2.880000 1.397670
3.120000 1.417760
3.380000 1.395710
3.620000 1.339630
3.880000 1.300160
4.120000 1.248730
4.380000 1.222100
4.620000 1.058400
4.880000 1.072330
5.120000 0.974720
5.380000 1.005510
5.620000 0.825510
5.880000 1.410280
6.120000 1.062860
6.380000 1.313540
6.620000 1.822200
6.880000 1.873950
7.120000 1.880680
7.380000 1.462230
7.620000 1.771440
7.880000 0.872690
8.120000 -2.061680
8.380000 2.583990
8.620000 -2.580370
8.880000 -2.896470
9.120000 -2.253240
9.380000 -2.261060
9.620000 -2.685870
9.880000 2.817850
10.120000 -2.499760
10.380000 2.911870
10.620000 -3.115730
10.880000 -2.854510
11.120000 -2.552710
11.380000 -1.308620
11.620000 -2.477230
11.880000 -1.813030
12.120000 -1.400170
12.380000 -1.560470
12.620000 -1.150400
12.880000 -0.590520
13.120000 -0.871310
13.380000 -1.116880
13.620000 -1.533180
13.880000 -1.060000
14.120000 -1.667440
14.380000 -2.147790
14.620000 -0.414410
14.880000 2.753300
15.120000 -2.742330
15.380000 -1.535110
15.620000 0.844510
15.880000 0.466600
16.120000 -0.624470
16.380000 -2.735620
16.620000 -0.803430
16.880000 2.632310
17.120000 -3.040000
17.380000 -0.229100
17.620000 -1.866230
17.880000 -1.316270
18.120000 -2.082890
18.380000 -2.126350
18.620000 -2.518400
18.880000 -2.403030
19.120000 -2.464450
19.380000 -2.679060
19.620000 -1.716200
19.880000 -2.558130
