0.05000 9090.29510
0.15000 8342.22623
0.25000 7609.53823
0.35000 6572.09112
0.45000 6183.20736
0.55000 6342.51959
0.65000 6414.16525
0.75000 6818.31094
0.85000 7016.62061
0.95000 7222.04751
1.05000 7354.90761
1.15000 7211.71545
1.25000 7217.41654
1.35000 7063.47974
1.45000 6873.88757
1.55000 6702.42385
1.65000 6526.72851
1.75000 6420.04437
1.85000 6111.10019
1.95000 6031.02715
2.05000 5801.47824
2.15000 5577.40351
2.25000 5456.63391
2.35000 5378.63828
2.45000 5143.63909
2.55000 5020.87396
2.65000 4902.73402
2.75000 4744.76661
2.85000 4601.31291
2.95000 4441.34707
3.05000 4412.58812
3.15000 4296.68647
3.25000 4205.00078
3.35000 4049.41474
3.45000 4012.79239
3.55000 3900.87143
3.65000 3768.62943
3.75000 3684.32979
3.85000 3650.30429
3.95000 3548.63410
4.05000 3429.82666
4.15000 3321.66659
4.25000 3273.97193
4.35000 3193.72778
4.45000 3068.59468
4.55000 2940.89779
4.65000 2899.77050
4.75000 2805.64764
4.85000 2706.60903
4.95000 2678.24033
5.05000 2627.13292
5.15000 2464.91673
5.25000 2428.44030
5.35000 2354.84490
5.45000 2234.28586
5.55000 2171.67422
5.65000 2103.31045
5.75000 2000.94853
5.85000 1956.31669
5.95000 1893.50559
6.05000 1879.15893
6.15000 1821.47664
6.25000 1755.60358
6.35000 1677.79606
6.45000 1616.37616
6.55000 1594.26259
6.65000 1542.93667
6.75000 1520.37012
6.85000 1465.38542
6.95000 1397.07344
7.05000 1379.87112
7.15000 1340.20116
7.25000 1328.46905
7.35000 1306.47425
7.45000 1244.76655
7.55000 1235.16512
7.65000 1217.57287
7.75000 1144.32157
7.85000 1108.43100
7.95000 1117.57270
8.05000 1068.15290
8.15000 1044.81910
8.25000 1028.93921
8.35000 1017.64785
8.45000 961.91741
8.55000 941.51512
8.65000 926.90938
8.75000 918.74831
8.85000 871.61987
8.95000 849.19681
9.05000 832.32571
9.15000 824.13802
9.25000 777.81865
9.35000 783.90576
9.45000 744.65667
9.55000 738.48008
9.65000 726.21086
9.75000 707.41300
9.85000 694.72852
9.95000 662.75480
10.05000 657.99047
10.15000 638.45820
10.25000 624.24155
10.35000 625.91301
10.45000 598.17256
10.55000 578.04515
10.65000 572.53913
10.75000 552.57128
10.85000 547.35212
10.95000 532.87163
11.05000 511.38265
11.15000 504.59499
11.25000 492.83809
11.35000 478.57008
11.45000 456.75694
11.55000 465.77138
11.65000 458.78980
11.75000 453.95774
11.85000 426.64935
11.95000 416.81206
12.05000 405.02633
12.15000 408.53865
12.25000 397.23552
12.35000 385.89668
12.45000 387.07887
12.55000 369.27789
12.65000 372.87771
12.75000 358.89448
12.85000 351.16215
12.95000 345.92517
13.05000 355.09870
13.15000 339.12830
13.25000 340.13572
13.35000 342.35009
13.45000 320.52386
13.55000 314.01028
13.65000 327.93514
13.75000 320.68076
13.85000 313.58991
13.95000 316.88461
14.05000 307.67985
14.15000 301.28282
14.25000 296.58526
14.35000 294.06095
14.45000 278.71557
14.55000 285.72600
14.65000 273.84514
14.75000 272.66596
14.85000 267.21292
14.95000 266.64190
15.05000 267.04027
15.15000 257.45934
15.25000 254.83221
15.35000 251.92596
15.45000 242.32032
15.55000 240.32086
15.65000 234.54876
15.75000 236.60290
15.85000 237.83078
15.95000 224.01377
16.05000 216.22367
16.15000 215.35270
16.25000 217.07338
16.35000 209.89931
16.45000 205.24875
16.55000 203.66030
16.65000 193.62070
16.75000 199.69113
16.85000 196.72364
16.95000 183.50517
17.05000 184.28401
17.15000 173.05069
17.25000 176.81419
17.35000 171.02360
17.45000 162.58140
17.55000 168.36672
17.65000 162.40096
17.75000 161.57186
17.85000 153.82975
17.95000 158.37898
18.05000 157.03474
18.15000 146.40052
18.25000 149.14012
18.35000 144.37825
18.45000 141.03181
18.55000 140.51376
18.65000 136.55660
18.75000 130.40614
18.85000 129.91191
18.95000 132.20048
19.05000 128.60329
19.15000 121.89131
19.25000 132.33057
19.35000 118.36978
19.45000 116.86392
19.55000 115.18753
19.65000 114.16909
19.75000 107.10215
19.85000 109.36208
19.95000 114.00246
