0.12500 0.00947
0.37500 0.03853
0.62500 0.05094
0.87500 0.06680
1.12500 0.11812
1.37500 0.14342
1.62500 0.17559
1.87500 0.18824
2.12500 0.21299
2.37500 0.22298
2.62500 0.20840
2.87500 0.23495
3.12500 0.23721
3.37500 0.21855
3.62500 0.21827
3.87500 0.19877
4.12500 0.17284
4.37500 0.14942
4.62500 0.13615
4.87500 0.09998
5.12500 0.08537
5.37500 0.07481
5.62500 0.04614
5.87500 0.05599
6.12500 0.04502
6.37500 0.04748
6.62500 0.04818
6.87500 0.05301
7.12500 0.03141
7.37500 0.04533
7.62500 0.03051
7.87500 0.03010
8.12500 0.03119
8.37500 0.02622
8.62500 0.01049
8.87500 0.01436
9.12500 0.02008
9.37500 0.01585
9.62500 0.02335
9.87500 0.01540
10.12500 0.02761
10.37500 0.02918
10.62500 0.02367
10.87500 0.03012
11.12500 0.03926
11.37500 0.01574
11.62500 0.03998
11.87500 0.02124
12.12500 0.01799
12.37500 0.01920
12.62500 0.03418
12.87500 0.03127
13.12500 0.03828
13.37500 0.02566
13.62500 0.04249
13.87500 0.05050
14.12500 0.02228
14.37500 0.02709
14.62500 0.02001
14.87500 0.01038
15.12500 0.03325
15.37500 0.04329
15.62500 0.04086
15.87500 0.02991
16.12500 0.03813
16.37500 0.03939
16.62500 0.04153
16.87500 0.01756
17.12500 0.05857
17.37500 0.02895
17.62500 0.05153
17.87500 0.04616
18.12500 0.07349
18.37500 0.05257
18.62500 0.05810
18.87500 0.04824
19.12500 0.02481
19.37500 0.06124
19.62500 0.04654
19.87500 0.02416
