0.05000 -2061.39193 -208.76713 273779.53619 1310.10473 1518.87864 2140780.99382
0.15000 -5053.50191 104.13528 -98197.30944 2250.37447 1823.14728 1287960.48937
0.25000 -7671.04518 36.29868 -41689.11217 2301.00655 2009.68821 1202418.52100
0.35000 -9368.19106 -2.15851 57695.13033 2582.83521 2321.77032 1236342.63513
0.45000 -10938.04827 -1.26656 -41717.71571 2385.51788 2552.60143 1202213.34331
0.55000 -12255.21048 -73.68584 -12927.62629 2353.61583 2648.31949 1168586.99859
0.65000 -13134.36650 -51.37966 -41917.71020 2324.14755 2712.27541 1210160.38358
0.75000 -13635.70622 24.02263 -31072.85324 2336.38252 2810.28064 1115839.09425
0.85000 -13979.53505 46.30971 -5996.94458 2244.35041 2865.58203 1148539.58324
0.95000 -14088.81314 -16.02051 -22312.47179 2142.84770 2877.19188 1047442.82491
1.05000 -14078.00980 34.61238 -8218.04782 2098.08290 2863.65343 1049119.94655
1.15000 -13964.32861 27.82070 -14259.20946 1942.11150 2930.06800 963059.35302
1.25000 -13922.52804 -26.73604 -2953.34689 1785.35094 2838.55781 940101.56913
1.35000 -13764.55530 -21.13901 -19975.21347 1620.08705 2846.50364 887139.02633
1.45000 -13598.77979 -47.37068 13902.45772 1493.84455 2802.40162 854404.75766
1.55000 -13445.10863 40.33106 15262.55174 1328.25882 2751.29021 816011.20218
1.65000 -13229.92330 -12.72413 -1780.15636 1182.58453 2719.66231 774316.56794
1.75000 -12974.38895 -5.96802 12990.34046 1030.11947 2653.86488 774803.78487
1.85000 -12753.29948 48.53519 1680.43289 946.83382 2590.25935 757125.81966
1.95000 -12534.97646 -8.41508 97.22569 871.95804 2517.09661 704766.15165
2.05000 -12326.52233 18.07714 4613.61775 786.62988 2482.94773 674603.16234
2.15000 -12097.69904 -62.03158 3703.64865 737.78769 2378.84975 654461.23800
2.25000 -11816.12625 -38.19774 5219.51819 718.46580 2339.83426 608068.63017
2.35000 -11563.66135 -1.84521 3168.31929 669.15541 2277.66476 580556.43683
2.45000 -11325.42316 -18.15582 3592.65031 636.23352 2203.47538 572740.82036
2.55000 -11118.44270 -6.06191 8318.78697 582.69381 2199.55426 552569.35224
2.65000 -10901.23093 -38.02926 2733.85253 567.84481 2129.98487 535512.83626
2.75000 -10681.31302 -35.23294 13417.05429 495.04229 2083.00018 494199.56692
2.85000 -10504.41486 16.23584 2621.51535 497.79515 2028.78083 464283.57127
2.95000 -10332.69013 1.91982 8489.92817 469.76178 1972.83702 505086.89584
3.05000 -10139.43461 -39.31769 5897.25180 461.22244 1931.73541 459571.32939
3.15000 -9971.99554 3.72099 2090.76032 419.32439 1881.37905 444204.19665
3.25000 -9785.53263 -28.92288 4026.93892 388.30261 1823.21804 428166.05798
3.35000 -9592.52049 -61.97449 7427.75129 380.95140 1769.86200 418879.19291
3.45000 -9396.07954 -70.35140 9648.63789 384.14945 1719.89182 374795.58420
3.55000 -9234.52126 -6.90277 -3536.65971 386.48556 1694.02881 409801.98300
3.65000 -9071.07278 -64.29669 -2255.74513 368.77121 1644.98825 343108.90605
3.75000 -8906.43947 -83.35478 2852.29222 405.63571 1589.71819 342250.28896
3.85000 -8753.97470 -41.63117 2586.93685 377.84890 1570.77353 323290.80704
3.95000 -8618.22579 -40.03807 284.92745 376.98356 1518.89656 308290.75419
4.05000 -8482.86520 -84.16155 2421.89919 377.15171 1497.18887 321751.53422
4.15000 -8347.18921 -68.09258 5711.84958 370.78929 1455.29740 298807.87176
4.25000 -8224.39659 -63.84366 1573.91856 382.80141 1421.28162 294141.90542
4.35000 -8104.79402 -51.45244 2694.49818 384.05917 1396.05799 261995.73774
4.45000 -8001.64652 -91.55162 9348.76233 413.87175 1361.12712 258086.48518
4.55000 -7910.00133 -119.68367 -311.50280 403.69000 1326.61023 268404.54331
4.65000 -7808.15252 -115.56776 660.45968 413.72885 1290.23147 258794.22184
4.75000 -7698.61003 -134.38165 -4848.80305 459.33221 1261.87115 247633.91190
4.85000 -7605.81391 -170.82290 -2727.78849 435.88016 1216.98623 232194.18452
4.95000 -7495.79536 -105.36628 1568.39299 475.53924 1183.51846 207257.11926
5.05000 -7433.06457 -132.15224 -721.23946 469.30774 1150.17281 217970.98888
5.15000 -7330.64875 -126.99495 -6668.70906 511.87191 1109.51157 201362.57182
5.25000 -7225.96937 -95.75977 776.90979 518.09509 1071.11221 192421.40330
5.35000 -7135.13139 -41.57062 -438.38710 536.49834 1038.66967 205424.62854
5.45000 -7061.41511 -80.35435 -7582.81335 533.70739 1009.45494 188679.16042
5.55000 -6984.89375 -50.95653 -7030.61288 569.61262 974.55680 171172.44589
5.65000 -6903.98273 -52.75234 -1338.67405 598.49473 947.08849 157705.36671
5.75000 -6821.15549 -11.25057 -4276.99875 632.13842 906.44020 146214.34576
5.85000 -6735.63957 0.03899 -4505.61601 634.61901 859.19387 145750.44676
5.95000 -6652.49871 30.81777 -6229.50941 645.63456 831.10987 138122.79421
6.05000 -6570.47046 41.74347 -4877.45453 633.78184 793.57876 146466.84103
6.15000 -6471.43992 30.40528 -4687.57276 659.14429 743.77134 133131.49405
6.25000 -6393.34608 28.85045 844.32964 661.94846 735.61050 120510.39401
6.35000 -6290.34530 39.70101 -4910.35239 661.57679 689.68630 139834.56979
6.45000 -6207.58375 44.24802 -2436.70762 666.77245 668.26516 115915.74294
6.55000 -6123.39244 38.43578 -668.30830 671.96210 630.01087 101167.64259
6.65000 -6049.70643 51.47608 -2300.04564 686.37586 601.69432 102952.82399
6.75000 -5955.58090 50.50833 -1472.52675 681.73312 568.61833 105610.64568
6.85000 -5869.91970 50.25264 672.84837 660.20520 548.93936 95018.73137
6.95000 -5757.74514 56.61706 -1719.26841 662.72211 528.33120 91511.61319
7.05000 -5718.03363 54.49620 -776.26170 635.41712 517.11911 80212.68137
7.15000 -5585.27353 65.05418 -599.12264 633.54156 484.12581 87581.75640
7.25000 -5517.43665 45.91721 -579.85497 587.61827 473.10880 72582.61174
7.35000 -5443.85115 65.23214 1221.36408 573.55954 466.18350 78484.46211
7.45000 -5361.46565 56.57455 1234.49808 560.11126 446.47682 73696.71395
7.55000 -5310.31503 72.35574 -1197.42803 517.86325 428.43145 65396.59666
7.65000 -5241.08502 64.18060 2557.19542 517.23657 405.32714 97753.34711
7.75000 -5185.01971 63.96833 1295.65946 487.64292 402.49247 64434.28530
7.85000 -5126.63149 72.94603 -1940.75116 471.92331 389.60125 69822.24074
7.95000 -5096.12329 63.86236 779.95404 457.58369 382.28076 51974.29563
8.05000 -5027.27929 63.50525 3495.61475 418.64740 377.13702 90876.99920
8.15000 -4988.71461 49.57097 729.02254 409.62483 367.21470 82976.62074
8.25000 -4970.91665 58.05266 664.11388 392.07632 367.49517 42598.43259
8.35000 -4931.92954 61.11490 1151.74474 373.99847 352.66422 44991.84153
8.45000 -4906.46985 57.80881 1436.55428 371.73223 336.60896 40508.87587
8.55000 -4864.93822 45.56725 -592.57133 362.83288 337.20872 40404.17487
8.65000 -4845.71147 52.08290 -46.27960 351.69661 326.74693 39452.63353
8.75000 -4827.44969 38.04339 1336.03538 349.47488 324.70832 35671.54981
8.85000 -4792.68429 41.36062 860.45862 328.84315 303.65354 56320.15864
8.95000 -4769.49505 33.73275 547.82660 342.59056 307.68724 38627.85418
9.05000 -4739.19529 30.99383 449.92885 329.63843 290.52204 31517.91172
9.15000 -4710.57073 33.91129 1227.66336 311.38816 286.93223 31825.47306
9.25000 -4687.99848 21.82852 720.78914 324.31046 292.18994 32119.59784
9.35000 -4656.94129 21.13778 606.20251 311.11598 283.74153 32912.10311
9.45000 -4624.94505 21.70253 887.67177 318.31336 264.33085 27796.51770
9.55000 -4603.05392 15.79263 711.01275 320.30011 261.53028 26665.02235
9.65000 -4565.59348 7.16818 144.93493 325.96543 280.16846 28955.93723
9.75000 -4527.48668 9.27052 1624.25482 322.11239 265.18121 28757.26678
9.85000 -4500.34615 0.15869 1081.54855 320.81530 258.59853 24300.26530
9.95000 -4455.46667 7.62545 449.54427 288.36284 236.11684 24243.96191
10.05000 -4420.24347 -2.58253 401.77915 275.41586 227.59604 22698.55721
10.15000 -4389.06518 -2.51700 1043.62649 270.15373 218.93915 21387.92162
10.25000 -4369.11555 1.75276 703.62943 289.60847 230.21184 19728.74751
10.35000 -4323.69698 -9.35114 -277.31430 251.04877 207.39856 21817.16069
10.45000 -4295.15024 -4.92049 627.91779 261.30841 207.20412 18589.10161
10.55000 -4263.96909 -7.84704 -25.83999 228.62696 196.59199 20978.59529
10.65000 -4228.92321 -5.79020 862.23417 240.69146 203.04584 19649.38600
10.75000 -4182.06440 -8.23441 684.82637 232.39254 206.38509 18617.54594
10.85000 -4159.42164 -5.42440 779.50341 219.20825 174.09774 17260.02574
10.95000 -4124.69867 -6.41802 323.61894 222.34477 197.06442 18030.66508
11.05000 -4106.28322 -7.60564 129.92566 218.48938 187.20032 16669.35111
11.15000 -4061.35492 -7.34678 2273.19670 196.53450 165.88423 105512.40654
11.25000 -4036.23626 -7.73223 772.65022 200.19439 180.39609 15452.43601
11.35000 -4004.47561 -9.50143 451.11292 197.52774 162.10994 13671.30670
11.45000 -3982.55015 -9.31216 -604.12724 186.89607 158.78021 17694.62416
11.55000 -3944.04678 -12.30645 486.36926 185.69062 138.88526 14280.78726
11.65000 -3908.95088 -12.57760 678.62612 175.51965 133.22573 16010.01404
11.75000 -3889.63108 -4.55152 243.05520 157.09662 153.26410 13549.05853
11.85000 -3864.21081 -11.39278 340.21866 197.25765 157.83815 16202.23297
11.95000 -3840.50149 -5.66163 887.89493 206.17323 184.67027 13930.85918
12.05000 -3809.84088 -5.75202 115.68709 175.54130 132.84985 12817.29698
12.15000 -3789.09264 -2.54330 -576.82772 155.65743 142.07754 38507.44679
12.25000 -3757.63393 -4.12371 265.71706 138.38801 127.03755 13066.87850
12.35000 -3729.66002 0.48122 654.80173 163.19225 131.31079 40609.88297
12.45000 -3707.72234 1.05131 -69.34090 146.91162 120.32751 11895.50811
12.55000 -3678.73469 3.83481 73.89328 160.77542 126.77519 11270.38090
12.65000 -3657.63965 1.65481 180.82405 152.38568 139.35252 9262.76086
12.75000 -3621.20706 7.91309 84.16435 174.89579 117.72313 11998.67951
12.85000 -3591.34153 10.68289 171.85075 149.60324 136.66180 10865.99124
12.95000 -3584.70946 5.11233 542.18290 143.98345 113.85259 9886.12269
13.05000 -3554.12187 7.28354 133.56272 136.90510 107.82480 9218.34299
13.15000 -3531.66954 12.45194 222.18503 165.71517 111.35041 10007.04595
13.25000 -3506.14788 10.99970 281.26407 164.50094 120.52355 9422.41909
13.35000 -3486.12002 10.57948 613.49989 114.12677 102.83530 10562.50518
13.45000 -3458.88933 12.99655 334.40495 147.36463 112.65971 10645.20673
13.55000 -3443.09921 10.92134 384.43106 150.35086 123.08547 9286.21167
13.65000 -3415.56663 12.48478 557.73359 112.73942 107.80408 9486.64581
13.75000 -3393.46162 11.64593 233.61050 134.28743 108.47321 8777.19578
13.85000 -3372.53650 11.74765 71.39748 118.92197 98.32505 8946.35577
13.95000 -3348.25065 11.42516 360.36303 139.80608 117.14030 8053.89944
14.05000 -3334.30016 6.72627 194.64621 142.19402 121.45191 8415.15955
14.15000 -3309.84870 10.09146 476.25813 113.37111 96.09195 17514.61529
14.25000 -3288.11712 12.93081 79.44767 99.67412 87.88539 6359.92856
14.35000 -3270.33467 13.45270 10.03186 109.43192 93.50752 7347.41461
14.45000 -3246.97097 12.00482 149.80837 112.94351 81.07890 8148.04564
14.55000 -3226.36776 10.38268 167.67457 139.10482 87.21004 6081.25791
14.65000 -3204.69285 11.98752 -118.66966 102.26548 79.52013 7587.71050
14.75000 -3183.65948 10.10357 185.17567 89.42700 83.71402 7229.60557
14.85000 -3163.23835 9.04748 255.50618 104.86720 77.07199 6618.99823
14.95000 -3143.21049 11.25394 -5.10991 87.29026 76.99097 6408.53772
15.05000 -3125.89827 8.36089 62.09517 92.94735 95.66085 6194.08708
15.15000 -3104.81012 6.39217 216.23046 88.75228 88.79162 5384.83194
15.25000 -3087.21481 6.88472 -90.26767 90.88446 84.45202 5666.84650
15.35000 -3058.99654 10.30186 -139.79757 96.42450 81.60855 5507.36966
15.45000 -3040.67156 9.75485 401.40944 107.39501 95.47558 5596.70385
15.55000 -3022.61301 8.12904 -77.47342 86.22260 80.02986 5537.32450
15.65000 -3007.53870 8.50024 154.53088 103.32801 90.92428 5445.83819
15.75000 -2981.94149 8.86226 -181.00212 89.64618 75.43075 5253.39434
15.85000 -2967.74302 4.76811 255.91328 80.27715 88.91548 5142.74727
15.95000 -2947.31698 8.12191 -111.99671 76.68730 64.71442 5688.16279
16.05000 -2922.57870 10.87407 -22.28613 82.55985 67.98079 6482.68713
16.15000 -2901.31911 12.70317 -311.16865 149.81820 107.05160 5914.54730
16.25000 -2888.58138 8.19400 -191.55695 77.99884 77.17070 5647.67975
16.35000 -2865.41793 8.74121 -52.69977 159.74166 73.42610 6156.42340
16.45000 -2850.41543 8.28291 276.13962 74.08040 57.96359 6023.51026
16.55000 -2831.94055 7.75707 247.30871 77.15716 69.76306 6241.65783
16.65000 -2811.63970 10.56888 -70.94751 74.24146 57.42821 4281.86600
16.75000 -2793.65757 9.94707 264.96513 80.21791 60.75076 6173.79995
16.85000 -2775.55199 11.27401 -110.77012 155.08572 85.36814 5342.69849
16.95000 -2764.21664 10.50519 -22.64558 74.52356 60.33246 4714.72823
17.05000 -2744.35318 11.64368 -36.93012 77.79288 69.95976 4645.16397
17.15000 -2724.86935 12.20507 -119.73404 92.42595 64.30417 5250.84688
17.25000 -2709.83896 8.30297 -40.89561 73.21518 68.23266 4431.30851
17.35000 -2694.12530 11.66233 -101.98242 80.44653 53.66920 5045.15975
17.45000 -2674.44634 10.13986 -28.98405 69.12148 62.36622 4296.74254
17.55000 -2659.05342 12.58046 277.77403 60.64173 52.06288 4614.94899
17.65000 -2639.03878 11.45379 143.91462 58.35595 44.30919 4597.44528
17.75000 -2619.75161 7.14479 78.41296 61.74594 88.26470 3819.94023
17.85000 -2604.71105 9.68989 99.98781 63.26648 50.28499 4104.37131
17.95000 -2592.93499 11.40936 21.59540 75.79234 63.12004 4815.84705
18.05000 -2577.18952 8.57468 46.81437 75.80723 61.40845 3384.31048
18.15000 -2565.94748 4.08139 69.87965 103.62227 136.32194 4307.07933
18.25000 -2547.39900 13.51067 27.84115 81.13894 45.87285 3423.38177
18.35000 -2533.83483 10.90867 60.72653 60.74027 60.46608 5020.00285
18.45000 -2523.95931 12.14473 71.13099 77.26157 55.99167 4049.77040
18.55000 -2510.08521 12.63910 -177.04727 57.02374 60.65446 3912.36961
18.65000 -2496.23927 11.54413 -66.89872 55.24646 45.53754 5017.13682
18.75000 -2480.37454 9.76395 54.53412 60.67821 42.07937 3488.36367
18.85000 -2465.20992 9.05421 -32.90681 45.75779 43.04978 4511.55369
18.95000 -2454.07099 8.57469 53.19580 49.29702 37.02747 2790.54350
19.05000 -2439.48582 10.53130 -27.86081 59.56270 43.49780 3159.67239
19.15000 -2426.63897 11.15890 98.46137 75.21893 77.46504 5647.47189
19.25000 -2415.59265 8.59015 -77.16735 52.32704 44.24204 3151.08746
19.35000 -2400.38714 7.38580 -23.45717 133.15738 47.87800 3448.74123
19.45000 -2390.99303 6.78759 -14.79630 54.04312 52.25612 3350.01479
19.55000 -2376.91874 8.25825 -8.91616 64.05500 70.28257 2604.70211
19.65000 -2369.30799 9.84468 149.17869 57.98323 38.88849 3360.37429
19.75000 -2353.58209 7.75135 85.75582 52.38700 42.43457 2984.85074
19.85000 -2342.61328 7.79483 132.42443 51.03674 46.07948 2679.00148
19.95000 -2328.26496 8.66953 -17.46325 42.28557 37.89652 2901.20228
