0.125 0.000 -0.000 -0.000
0.375 -0.000 0.000 -0.001
0.625 -0.001 -0.001 0.000
0.875 0.002 -0.004 0.001
1.125 0.001 0.000 0.003
1.375 -0.001 -0.007 -0.003
1.625 -0.011 -0.002 0.008
1.875 0.008 0.001 0.008
2.125 -0.005 -0.003 -0.006
2.375 -0.014 -0.011 -0.004
2.625 0.010 -0.006 0.010
2.875 0.004 0.000 0.028
3.125 -0.021 -0.003 0.005
3.375 -0.004 -0.019 -0.002
3.625 0.016 -0.020 0.021
3.875 -0.009 0.011 0.032
4.125 -0.006 -0.001 -0.014
4.375 0.013 0.022 0.047
4.625 0.021 -0.006 0.006
4.875 -0.000 -0.024 0.040
5.125 -0.011 -0.010 0.040
5.375 0.010 0.020 0.022
5.625 -0.039 0.043 0.007
5.875 0.017 0.004 0.020
6.125 0.017 0.014 0.048
6.375 -0.001 -0.010 0.042
6.625 -0.036 -0.021 0.032
6.875 -0.008 0.063 0.015
7.125 0.029 0.043 -0.004
7.375 0.051 0.037 0.055
7.625 -0.064 0.042 -0.030
7.875 -0.083 0.037 -0.061
8.125 -0.051 0.011 0.054
8.375 0.017 -0.027 0.046
8.625 0.058 0.072 0.044
8.875 0.044 0.050 -0.073
9.125 -0.016 -0.025 -0.017
9.375 -0.013 -0.034 -0.036
9.625 -0.004 0.023 0.008
9.875 0.077 -0.007 0.062
10.125 0.054 -0.002 -0.026
10.375 -0.011 0.005 0.067
10.625 0.070 -0.051 -0.049
10.875 -0.090 0.105 0.017
11.125 -0.000 -0.153 -0.031
11.375 0.044 0.036 -0.044
11.625 -0.042 0.039 -0.063
11.875 0.100 -0.034 0.065
12.125 -0.038 0.097 0.035
12.375 -0.073 0.006 0.022
12.625 -0.080 -0.041 -0.094
12.875 0.088 0.068 0.024
13.125 0.128 0.054 -0.027
13.375 -0.004 -0.012 0.000
13.625 -0.071 0.034 0.072
13.875 -0.019 -0.075 -0.009
14.125 0.086 -0.056 -0.047
14.375 -0.038 0.026 -0.076
14.625 0.095 0.003 0.057
14.875 0.166 -0.011 0.012
