0.05000 -641.26725 187.59612 120.24320 572.53585 601.49518 1309.48707
0.15000 -1849.84626 91.21027 -5.73662 1064.53046 757.22826 2978.98263
0.25000 -3425.86200 -40.84382 44.30502 1391.31451 884.88871 4173.89979
0.35000 -4352.94322 43.73567 498.54583 1544.52939 952.71726 5338.08717
0.45000 -4969.05673 32.40046 233.42986 1624.57063 1037.92067 6086.17764
0.55000 -5394.39096 42.21455 153.70210 1750.08106 1033.22974 6602.37554
0.65000 -5703.42136 18.54854 -130.39001 1801.46753 1110.66555 6905.96676
0.75000 -5992.10400 35.64262 158.79786 1877.87713 1189.27172 7051.77595
0.85000 -6243.61028 27.77095 -143.82974 1855.66018 1264.58913 7168.16458
0.95000 -6504.39279 28.54996 72.10903 1831.69701 1311.82609 7117.13804
1.05000 -6683.36870 26.39793 -37.11785 1790.07060 1350.97521 7032.02473
1.15000 -6827.83762 20.01524 148.37779 1741.81349 1383.53370 6886.46282
1.25000 -6964.72595 23.25056 133.36355 1693.88574 1418.37688 6747.99800
1.35000 -7082.05741 44.48959 -59.43644 1708.79747 1416.19195 6677.35394
1.45000 -7172.25294 23.50888 -18.62374 1632.16448 1438.61894 6477.50783
1.55000 -7256.98702 44.03546 14.17254 1563.80957 1456.87432 6284.76074
1.65000 -7255.37322 74.87488 23.83166 1514.56790 1494.51027 6158.53117
1.75000 -7336.10570 38.51266 40.16250 1382.93632 1482.94547 5928.61701
1.85000 -7319.02598 -1.36709 -2.58195 1371.17406 1465.76500 5836.81038
1.95000 -7301.96370 50.67639 -14.89880 1255.42684 1474.08741 5620.87636
2.05000 -7302.24716 24.31011 -105.52559 1193.94142 1460.43337 5435.60930
2.15000 -7292.12428 25.30750 -40.79761 1093.70336 1443.90953 5313.35741
2.25000 -7273.60608 62.73193 20.07574 1056.74796 1444.79249 5172.40169
2.35000 -7305.57793 60.76910 -41.05531 949.69109 1411.61510 5031.59688
2.45000 -7255.99106 49.23722 -90.32015 904.43104 1371.42108 4931.05125
2.55000 -7242.72670 43.48211 -9.66744 877.95371 1355.08956 4761.07469
2.65000 -7251.02094 45.74312 -49.84531 770.30250 1327.95331 4663.15806
2.75000 -7239.66161 66.69500 14.42158 775.46135 1284.02507 4524.84261
2.85000 -7279.88424 57.25198 -13.39000 730.91480 1264.98923 4374.99398
2.95000 -7294.36910 33.26690 20.16188 710.22823 1221.12607 4247.02403
3.05000 -7291.33183 35.47910 12.84057 715.35678 1176.38522 4178.35596
3.15000 -7277.17604 15.76274 -4.53316 693.68404 1120.29490 4055.49108
3.25000 -7258.40085 17.69364 -22.87079 704.44316 1081.06084 3985.03160
3.35000 -7247.58498 -2.49439 22.22113 718.11694 1028.40111 3862.32982
3.45000 -7267.89096 22.92192 18.52633 710.64143 968.77404 3770.75981
3.55000 -7234.80365 -2.49356 11.49586 697.97205 930.87516 3676.93785
3.65000 -7205.19879 1.24694 19.39233 701.69058 889.59044 3561.94969
3.75000 -7198.52774 -13.74993 -70.76484 709.41605 842.56665 3473.97393
3.85000 -7169.98766 -24.51804 18.83963 731.89384 784.93633 3402.16527
3.95000 -7131.65107 -5.94527 -10.13609 733.78885 747.11739 3293.81560
4.05000 -7129.06443 -16.55640 5.77215 751.00397 701.77203 3157.69440
4.15000 -7077.02516 -17.67787 -29.17263 734.28419 658.52680 3071.90743
4.25000 -7049.55935 -19.12874 -12.55979 712.63973 620.17725 2997.50917
4.35000 -6989.64822 -9.78261 20.97605 719.47107 576.01521 2907.07171
4.45000 -6934.49792 -16.69255 48.83887 695.01801 536.18887 2823.63963
4.55000 -6873.88287 -5.55985 -33.93659 664.51771 505.07755 2732.14860
4.65000 -6821.65537 -9.24071 -25.70816 622.85993 477.66758 2661.40334
4.75000 -6779.65333 -3.04528 -1.95176 614.23105 447.18483 2605.77026
4.85000 -6740.88017 3.13492 -25.30217 608.21400 419.49966 2514.25610
4.95000 -6683.94021 3.65503 -28.79384 577.03691 397.93470 2430.87716
5.05000 -6635.42209 4.59732 32.97835 561.02113 373.72746 2390.62560
5.15000 -6598.82069 5.42138 -9.50111 517.94201 355.92318 2307.79172
5.25000 -6533.59991 8.46273 6.14162 502.47391 334.16379 2261.24027
5.35000 -6490.79199 13.33970 -32.82100 484.57710 319.67480 2200.57680
5.45000 -6442.68068 11.59194 -24.51619 459.58674 301.52862 2157.42679
5.55000 -6405.92427 14.51975 -12.42302 439.86212 285.41938 2070.31150
5.65000 -6359.16303 13.38692 -23.37062 428.59534 268.11698 2065.62701
5.75000 -6303.39252 20.24290 -2.31198 406.80700 259.52753 2004.73045
5.85000 -6257.50360 14.59065 19.21013 377.08705 249.23788 1955.96403
5.95000 -6232.68499 15.63117 -5.06504 368.96804 234.82817 1893.79211
6.05000 -6171.83154 8.12500 -16.83870 360.45327 227.09464 1880.57293
6.15000 -6136.16592 14.77430 -15.37514 336.93176 219.33850 1819.99619
6.25000 -6089.12984 9.21439 -29.07941 342.62060 210.09404 1783.89996
6.35000 -6055.13433 17.55926 -33.15689 322.30252 208.01196 1749.46006
6.45000 -6026.64224 15.00803 -44.13196 334.64086 199.56403 1704.78305
6.55000 -5989.36094 10.60933 2.74919 311.67803 191.52168 1668.86403
6.65000 -5941.86632 10.24708 -25.64575 313.77465 181.85167 1615.31995
6.75000 -5892.68610 7.77864 -6.81729 293.47295 180.26776 1592.18316
6.85000 -5839.98315 10.74439 23.95805 282.91467 175.89979 1562.18021
6.95000 -5803.63009 7.19517 -19.97838 260.35293 172.27837 1502.33644
7.05000 -5758.03379 7.55451 24.72270 242.52211 167.96830 1461.35251
7.15000 -5716.66786 9.11409 19.22993 237.23072 163.19783 1439.70277
7.25000 -5671.82770 9.90666 -10.30047 231.60285 167.75699 1406.90902
7.35000 -5620.67476 7.99209 -12.93992 227.33960 160.60297 1391.43915
7.45000 -5576.80444 4.59789 18.32529 223.88726 153.39685 1344.89386
7.55000 -5527.88767 8.87491 -40.09709 219.73975 147.94753 1318.47586
7.65000 -5476.25189 7.43230 -16.47138 215.06079 151.84247 1304.24450
7.75000 -5437.39492 7.66547 -12.34947 200.60058 145.51975 1253.06511
7.85000 -5399.49905 6.79221 29.61668 196.14316 146.20624 1216.95702
7.95000 -5357.04232 7.39219 11.04894 195.28927 143.29224 1200.61302
8.05000 -5314.90270 6.96520 13.29571 204.55546 135.62144 1164.07635
8.15000 -5268.29176 7.13651 24.69643 192.49074 132.80372 1152.81678
8.25000 -5230.42570 4.69170 57.54914 185.02802 137.46174 1103.82279
8.35000 -5190.99845 7.95371 44.39098 184.11095 133.59084 1097.27564
8.45000 -5152.51059 5.51095 29.18837 192.31414 129.97548 1073.63953
8.55000 -5116.73978 7.61982 21.96322 168.21055 120.70996 1039.59737
8.65000 -5062.27953 8.42484 38.39392 167.47245 122.33771 1038.81261
8.75000 -5025.97551 7.37413 41.57144 163.85566 125.25515 1007.00904
8.85000 -4984.81950 4.51401 51.22310 163.34246 119.57397 983.94603
8.95000 -4945.65562 4.42583 31.62005 155.41300 119.86349 948.56242
9.05000 -4902.17792 2.65859 28.56010 157.29773 119.65892 947.20920
9.15000 -4866.26984 5.78610 28.07898 158.80776 113.89489 917.40896
9.25000 -4824.13295 4.24246 40.40152 160.36980 117.98341 903.61648
9.35000 -4781.94408 3.96566 45.30832 162.89545 110.22568 885.27427
9.45000 -4743.18112 2.11959 44.48603 159.76873 118.86213 870.82403
9.55000 -4711.32276 4.45696 51.26548 144.79850 113.74700 843.88829
9.65000 -4677.82110 4.51057 44.46888 143.26798 113.44029 825.25524
9.75000 -4634.35781 0.84009 25.60259 146.07857 105.56411 811.54283
9.85000 -4592.00340 4.14279 14.89228 142.74689 103.29263 806.09010
9.95000 -4558.90866 5.23883 39.79560 133.54456 104.56287 783.53368
10.05000 -4524.19099 2.85518 19.32745 130.17950 105.99826 764.74368
10.15000 -4488.17974 3.98315 -4.96572 123.17732 97.58432 744.07271
10.25000 -4450.67889 7.09222 11.49439 133.44802 97.38983 734.82496
10.35000 -4407.25446 6.92196 -21.62561 124.52925 97.34916 716.13583
10.45000 -4380.23562 4.23991 16.84187 124.35779 91.65536 696.59054
10.55000 -4338.28950 3.23026 -0.84680 130.97692 92.12112 693.03404
10.65000 -4304.05850 3.00897 -17.65847 124.91029 89.66414 674.08127
10.75000 -4269.12077 4.51647 0.63116 126.55267 93.65683 661.51533
10.85000 -4238.36038 4.59500 -3.17920 124.20925 91.54914 649.69153
10.95000 -4200.72246 1.19176 -30.79305 122.24396 95.98135 633.60577
11.05000 -4168.69232 2.65165 -24.10077 120.70947 87.93108 623.46958
11.15000 -4138.62320 3.81578 -49.54709 122.01267 86.43626 601.75505
11.25000 -4103.10910 5.16457 -25.23079 121.02099 87.74131 603.12686
11.35000 -4074.70212 5.23802 -38.62807 113.67890 78.30338 582.96761
11.45000 -4043.09704 5.46548 -28.66085 114.25465 84.97339 559.78110
11.55000 -4011.83310 6.51552 -29.98735 116.11117 89.26024 561.71763
11.65000 -3976.39242 5.12894 -25.54239 127.26621 84.93474 569.65454
11.75000 -3952.44226 0.65508 -22.48761 113.66128 86.10401 529.42641
11.85000 -3920.67387 4.00423 -20.78481 126.92979 76.53333 533.46284
11.95000 -3887.43592 2.58466 -32.16368 107.81997 88.86371 519.18546
12.05000 -3860.25488 2.98925 -2.74250 104.99854 76.59064 514.87796
12.15000 -3829.06827 3.33304 -9.74168 103.52043 76.06726 501.55013
12.25000 -3797.96319 3.32946 -3.50961 104.12884 79.92359 495.80868
12.35000 -3771.33879 3.47794 -26.54055 95.11166 72.40300 477.29891
12.45000 -3743.57670 3.29898 -19.95383 102.38897 84.34924 480.78485
12.55000 -3716.97457 4.08952 -22.47280 94.95529 74.11845 457.60332
12.65000 -3693.92566 1.03883 5.99599 92.49970 72.32799 461.19688
12.75000 -3660.76284 3.24774 -8.27691 92.76775 71.90123 450.85162
12.85000 -3636.89447 4.01920 -4.06773 91.59739 68.31526 435.01680
12.95000 -3608.31232 6.78145 -10.86678 85.48824 63.54508 433.17516
13.05000 -3580.02866 2.77173 -0.78922 81.91284 73.47877 426.47320
13.15000 -3557.23505 3.16817 5.76460 83.42829 74.78700 415.13700
13.25000 -3537.65353 5.55653 -5.48405 83.67028 67.93578 406.10113
13.35000 -3509.49239 5.82206 -5.07145 79.82850 66.43278 402.95412
13.45000 -3488.52784 4.23953 5.09392 83.68614 68.72591 388.79027
13.55000 -3461.85598 3.58219 -9.23110 78.10464 70.97892 387.62226
13.65000 -3436.09781 3.36941 3.44184 83.00694 66.14065 377.15081
13.75000 -3411.59784 2.61671 1.98133 78.67093 62.09027 370.67793
13.85000 -3389.41575 5.06264 11.91050 76.44206 62.20142 370.32952
13.95000 -3363.61702 2.86938 12.42767 75.26693 67.84132 366.69949
14.05000 -3342.48052 2.98756 3.75882 69.87033 58.87343 346.03166
14.15000 -3319.09404 2.11195 -7.51804 72.54200 58.44127 344.96270
14.25000 -3290.46891 2.20526 7.01486 68.96815 66.02517 345.15920
14.35000 -3269.06958 2.58533 -2.85005 75.80595 62.96374 328.19573
14.45000 -3247.63822 2.83139 -6.02233 68.75190 60.91131 321.47971
14.55000 -3226.01824 3.69654 -18.14820 66.77447 61.11921 317.71920
14.65000 -3209.55153 1.99903 15.80262 71.30472 60.88544 309.81991
14.75000 -3183.55226 3.80249 -2.13150 71.92690 63.45473 317.07944
14.85000 -3165.28739 4.21400 0.52659 72.11870 59.69311 295.36527
14.95000 -3141.64628 2.51623 -11.65839 67.77147 57.27481 296.17041
15.05000 -3119.05512 -1.24432 -5.94864 62.88461 56.79415 300.94503
15.15000 -3102.56619 2.66408 -3.06713 59.40081 48.53686 291.67182
15.25000 -3081.55533 1.06550 -2.66227 66.67783 64.94645 282.34421
15.35000 -3059.16789 2.27528 -4.25367 62.31807 52.65890 279.55843
15.45000 -3038.54112 1.97120 -8.71805 53.03229 54.58004 269.75461
15.55000 -3021.74258 3.38467 -1.11375 62.29294 54.04434 265.32818
15.65000 -3000.47068 0.96852 -19.63716 61.76270 63.02059 265.17387
15.75000 -2978.60735 1.49301 -8.89519 58.61872 57.54110 256.42999
15.85000 -2961.15732 0.39514 -9.05275 53.30789 54.74879 249.31611
15.95000 -2938.68092 2.73445 -5.32804 61.55937 44.11967 249.19685
16.05000 -2919.87926 3.41658 -10.83442 59.97487 52.20949 242.77504
16.15000 -2902.30523 2.31321 -10.23128 53.26448 50.72396 233.16835
16.25000 -2886.54032 0.64604 -35.58405 59.84451 57.00712 228.03906
16.35000 -2864.49013 1.10450 -3.26208 62.73871 48.79010 229.93714
16.45000 -2846.54585 2.30997 -4.26182 55.13585 45.89609 226.36915
16.55000 -2825.81299 3.97327 -10.40924 50.11204 52.03893 217.96314
16.65000 -2810.94145 1.17475 -14.71512 52.32387 60.16635 218.32596
16.75000 -2792.96583 3.85169 -19.64250 61.11089 54.49103 224.61820
16.85000 -2773.91583 -1.44594 -5.64905 62.94583 44.04523 209.19986
16.95000 -2758.04086 -0.86524 -17.30007 49.49988 53.45595 204.64349
17.05000 -2737.64586 2.34072 -12.63734 54.35631 41.29892 204.07948
17.15000 -2722.04203 1.64821 -10.23594 55.84283 62.30256 196.97162
17.25000 -2709.75280 0.87531 -9.24472 51.12820 43.77900 184.05605
17.35000 -2688.36822 2.22044 -11.31694 47.86548 53.17923 199.84433
17.45000 -2672.79208 0.29591 -7.98035 53.26880 54.52230 188.06606
17.55000 -2653.58345 4.11334 -15.87162 46.01158 46.57191 188.04730
17.65000 -2636.58940 0.73949 -7.54998 52.26838 55.13212 187.51636
17.75000 -2623.33346 0.84757 -1.93183 44.01206 46.98939 180.05817
17.85000 -2606.14514 0.65096 -3.60187 44.65076 46.91768 176.19128
17.95000 -2588.21484 0.72211 -3.45101 42.52846 40.07574 177.30821
18.05000 -2575.68389 -0.79386 -16.70050 56.60336 54.41703 174.87533
18.15000 -2557.74536 4.18748 -19.99254 44.39305 41.97365 171.68392
18.25000 -2538.48652 2.56502 3.84572 62.55611 61.39598 170.66938
18.35000 -2525.01376 3.63842 -1.82839 49.13458 46.05494 164.43871
18.45000 -2511.91772 3.44817 2.02123 47.55313 42.16738 165.77602
18.55000 -2497.62204 1.50357 1.83504 47.68743 51.28043 165.90724
18.65000 -2480.46166 3.95748 -4.83396 58.54053 42.39670 154.74173
18.75000 -2469.17666 2.60427 -1.84615 45.54675 56.55421 154.17137
18.85000 -2451.42836 2.52353 1.41736 55.62225 46.01185 163.74956
18.95000 -2438.05591 1.43573 -1.05529 45.49714 40.32393 153.28130
19.05000 -2431.36813 3.73567 2.91376 59.13872 54.30860 154.66278
19.15000 -2407.16407 1.72697 -6.84317 35.57123 44.38450 149.91829
19.25000 -2396.97992 4.04009 4.81799 51.16205 33.40392 147.78164
19.35000 -2379.34914 5.28288 7.90442 34.76493 42.04717 142.04074
19.45000 -2370.40557 2.77636 -0.08212 40.45811 41.27844 147.95737
19.55000 -2354.12696 2.65909 -6.39940 60.22561 30.83748 142.15536
19.65000 -2340.04355 1.83230 -2.54064 37.22797 43.01313 143.50568
19.75000 -2326.29988 5.34242 3.71069 37.65207 32.54122 129.78652
19.85000 -2314.36155 1.34608 1.63634 37.71432 27.27576 138.55243
19.95000 -2300.32170 2.28868 -0.41160 52.06024 29.34206 129.78976
