0.15 -1.48646 11.57511 1.79423 109.81005 108.66817 97.04116
0.45 -0.37303 29.04455 -0.23333 107.89553 105.31059 93.6515
0.75 1.01559 44.45358 0.42146 108.02206 100.13265 91.00577
1.05 0.13412 57.7634 0.08436 106.14298 95.77737 87.99165
1.35 0.09231 67.17608 -1.43391 104.77532 91.81396 86.05583
1.65 -1.82233 75.02402 0.32186 105.54381 90.30706 83.23983
1.95 -0.83476 81.93165 -0.15123 103.77659 86.41254 81.76348
2.25 -2.20013 89.84273 0.11671 103.68049 85.21825 79.23043
2.55 -0.7372 94.16933 0.17142 103.84322 82.22383 76.70109
2.85 0.6544 98.9977 0.28256 103.43857 79.1417 73.93435
3.15 0.35275 102.5667 -1.22864 101.83361 77.06805 70.94198
3.45 0.78659 104.40616 0.02371 99.74953 75.32695 68.84904
3.75 2.51186 110.53655 0.71415 99.31537 72.98082 65.51726
4.05 2.70681 113.19444 0.15784 95.45237 70.17804 63.03979
4.35 2.53862 115.08433 0.41866 91.34403 67.6754 60.62127
4.65 2.15947 118.76343 0.84147 86.79808 65.38398 58.51913
4.95 1.30598 121.61459 2.50563 83.03842 64.16464 55.63494
5.25 2.08518 126.12766 2.12912 80.2602 62.93597 53.44978
5.55 0.84527 132.17362 2.48618 77.64042 61.96032 50.8799
5.85 1.53904 139.17561 2.39935 73.6586 61.5184 48.37606
6.15 0.77679 144.89324 1.94416 70.11276 60.53963 46.21155
6.45 1.42674 150.8723 0.39347 66.15857 59.52124 43.45369
6.75 0.30337 157.24619 -0.18686 62.28534 56.73654 41.56135
7.05 -0.38242 164.04058 -1.30324 57.46628 53.99641 38.62019
7.35 0.65911 170.60092 -1.09201 53.35051 50.95204 36.83949
7.65 -0.32973 175.42458 -0.99975 48.78903 47.04441 35.78317
7.95 -0.23076 178.76304 -1.24772 45.58026 44.24517 34.31118
8.25 -0.44369 181.17644 -1.07592 42.89843 41.56894 32.96483
8.55 -0.28874 183.93699 -1.3601 39.73978 38.66453 31.23045
8.85 -1.01442 186.5975 -0.9318 38.23016 35.07022 29.79206
9.15 -1.23119 189.72543 -0.99593 36.23099 33.11639 28.66373
9.45 -1.6989 192.43856 -0.367 35.39451 30.26586 27.39482
9.75 -1.94555 194.41866 -1.07904 33.65218 28.7652 26.69148
10.05 -0.96295 196.2824 -0.7287 32.44854 27.34961 25.10514
10.35 -1.24499 197.32176 -0.41783 31.79015 26.29972 24.57596
10.65 -0.82878 198.42702 -0.47535 30.78877 25.0923 23.42027
10.95 0.01264 199.9013 0.0159 29.91119 23.84837 22.92051
11.25 -0.14222 200.77139 -0.23805 29.17716 23.02843 21.63705
11.55 1.0995 201.2318 0.13953 28.25287 22.71132 21.34487
11.85 0.88364 201.52537 0.10755 27.39508 21.84507 20.82086
12.15 0.96193 202.58187 0.12025 27.11269 21.6078 19.82929
12.45 1.37202 203.4054 0.25148 25.47568 21.08438 19.86268
12.75 1.63072 204.05928 0.16826 25.2336 20.82797 19.44834
13.05 0.83369 204.14837 -0.06664 25.05013 20.06751 18.49138
13.35 0.84448 204.73804 0.26184 24.42151 19.78555 18.31032
13.65 1.12993 205.43236 0.0592 23.90175 19.46136 17.76002
13.95 0.57532 205.21404 -0.45695 23.91237 18.90934 17.30685
14.25 -0.20221 205.69067 0.27678 22.77819 18.05286 17.08851
14.55 0.27437 206.35599 -0.04457 22.9783 17.55104 16.86522
14.85 0.20686 206.49735 0.18184 22.55961 17.11813 16.16859
15.15 0.16453 206.01057 0.07197 21.769 17.02407 16.10426
15.45 0.04882 207.06782 0.54842 21.38547 16.63415 15.90644
15.75 0.38962 207.49128 0.1161 21.0337 16.48476 15.52203
16.05 1.50057 207.72319 0.03974 21.30532 16.49376 15.41205
16.35 1.26452 208.32826 0.07183 20.72236 15.3422 14.9969
16.65 1.06183 208.70825 -0.30379 19.83547 15.08152 15.05362
16.95 1.71725 208.34493 0.05054 19.98607 14.65329 14.83684
17.25 1.89223 208.80889 -0.22382 20.2874 13.96235 14.56897
17.55 1.5021 207.82199 -0.05155 20.15695 13.47084 14.66892
17.85 2.25405 208.14139 -0.46314 19.54304 12.61606 14.16798
18.15 1.74244 207.0037 0.08579 19.54598 12.13742 14.27354
18.45 1.23264 206.56616 0.13933 18.97094 12.47227 14.04222
18.75 1.0277 206.21137 -0.10686 18.55205 12.19416 13.68398
19.05 1.12234 205.47919 -0.02751 17.92927 12.56267 13.12767
19.35 0.89106 205.57029 0.33163 17.79844 13.07356 12.64294
19.65 0.79793 205.30123 0.12771 17.48829 13.45283 12.20103
19.95 0.60303 204.80039 0.05725 16.86311 13.65565 11.95445
20.25 0.511 206.04851 0.29152 16.86318 13.65454 11.4483
20.55 0.34626 205.74294 0.3463 17.15341 13.61425 11.64157
20.85 -0.5921 205.41643 0.14738 16.65176 13.05234 11.09795
21.15 -0.39285 204.86114 0.63363 16.72282 12.73484 10.58127
21.45 -0.86286 205.34435 0.53847 17.55457 12.51823 10.2964
21.75 -0.85142 205.65314 0.07992 17.42837 11.99814 9.9159
22.05 -0.82985 205.15376 0.35869 17.18655 12.48463 9.63616
22.35 -0.78762 205.76595 0.39361 17.33924 11.03681 9.69898
22.65 -0.66806 205.66448 0.97052 16.61763 11.19075 8.7751
22.95 -0.33028 205.13331 0.14438 16.77824 10.45532 8.81594
23.25 -0.29351 205.12025 0.02917 16.90543 9.88591 8.64751
23.55 -0.54713 204.38434 0.28458 15.84954 9.68623 8.5241
23.85 1.12129 203.45169 -0.04516 16.02018 9.47878 8.23535
24.15 0.02795 203.47276 -0.59164 14.86958 9.70123 8.56792
24.45 -0.16071 203.00457 -0.50243 14.42166 9.86965 8.03572
24.75 -0.01929 202.85725 -0.52911 14.86091 10.20336 8.2709
25.05 -0.6771 203.2745 -0.95069 13.06373 9.68641 7.93014
25.35 0.50506 202.97236 -0.70819 12.0066 9.70645 7.61807
25.65 0.0277 203.32233 -0.162 12.36525 9.9092 7.77735
25.95 0.6915 203.06089 -0.58161 12.14459 10.34849 7.69085
26.25 1.18698 203.71796 -0.31561 11.31207 10.13822 7.30385
26.55 -0.623 204.0312 -1.10204 11.00163 9.39278 7.22498
26.85 0.46449 204.00979 -0.27281 11.52643 8.82789 7.04607
27.15 -0.27977 203.37374 0.34663 11.71961 9.02403 7.33335
27.45 0.4541 202.60002 0.29333 10.40775 9.08772 6.74989
27.75 0.1182 203.56552 -0.66136 10.44782 7.2629 6.47122
28.05 0.21497 202.13376 -0.1856 10.50508 7.56644 6.5032
28.35 -0.97994 202.71138 -0.74241 10.77235 7.0305 6.75411
28.65 -0.42438 202.16476 -1.12809 10.79578 8.13027 6.4484
28.95 0.31076 201.40753 -0.61405 10.18356 8.2114 6.25427
29.25 0.90636 203.04115 -1.14091 8.78372 7.04624 6.57643
29.55 0.18973 202.84496 -0.72429 9.24303 7.17524 6.05742
29.85 1.17666 201.88264 -0.65841 9.58135 7.62678 5.58278
