0.120000 2.148610
0.380000 1.581680
0.620000 1.739260
0.880000 1.206360
1.120000 1.253950
1.380000 1.325790
1.620000 1.311660
1.880000 1.360310
2.120000 1.325780
2.380000 1.307810
2.620000 1.259680
2.880000 1.366640
3.120000 1.382310
3.380000 1.394090
3.620000 1.460380
3.880000 1.474050
4.120000 1.530120
4.380000 1.533320
4.620000 1.509960
4.880000 1.514000
5.120000 1.621200
5.380000 1.490520
5.620000 1.618430
5.880000 1.544530
6.120000 1.475020
6.380000 1.386270
6.620000 1.336510
6.880000 1.589070
7.120000 1.787700
7.380000 1.491990
7.620000 1.779920
7.880000 2.626890
8.120000 2.665170
8.380000 2.785630
8.620000 1.986390
8.880000 1.483980
9.120000 1.546470
9.380000 0.841130
9.620000 1.167190
9.880000 -0.420140
10.120000 -1.023470
10.380000 0.033810
10.620000 -0.763480
10.880000 -0.801680
11.120000 -1.627870
11.380000 -0.213600
11.620000 -1.183870
11.880000 -0.635880
12.120000 -1.188680
12.380000 -1.565280
12.620000 -1.917330
12.880000 -0.674770
13.120000 -1.509030
13.380000 -2.834830
13.620000 -1.824480
13.880000 -1.645870
14.120000 -1.430540
14.380000 -2.005320
14.620000 -1.455560
14.880000 -2.411310
