0.12500 0.01243
0.37500 0.03740
0.62500 0.07282
0.87500 0.11074
1.12500 0.14701
1.37500 0.17735
1.62500 0.21859
1.87500 0.26537
2.12500 0.28665
2.37500 0.30697
2.62500 0.32937
2.87500 0.33278
3.12500 0.29449
3.37500 0.25006
3.62500 0.20689
3.87500 0.16363
4.12500 0.13212
4.37500 0.09928
4.62500 0.07067
4.87500 0.06290
5.12500 0.07058
5.37500 0.07122
5.62500 0.06070
5.87500 0.06172
6.12500 0.04009
6.37500 0.03456
6.62500 0.02205
6.87500 0.04044
7.12500 0.04496
7.37500 0.04353
7.62500 0.03793
7.87500 0.03568
8.12500 0.01202
8.37500 0.01278
8.62500 0.03077
8.87500 0.03161
9.12500 0.05570
9.37500 0.04611
9.62500 0.02765
9.87500 0.01870
10.12500 0.03654
10.37500 0.00454
10.62500 0.00514
10.87500 0.02407
11.12500 0.00491
11.37500 0.01360
11.62500 0.01706
11.87500 0.01030
12.12500 0.01381
12.37500 0.02261
12.62500 0.04316
12.87500 0.05739
13.12500 0.04220
13.37500 0.04481
13.62500 0.05334
13.87500 0.02888
14.12500 0.03010
14.37500 0.04464
14.62500 0.01216
14.87500 0.02695
