0.12500 0.02772
0.37500 0.00534
0.62500 0.01547
0.87500 0.01067
1.12500 0.01409
1.37500 0.01870
1.62500 0.02016
1.87500 0.00722
2.12500 0.01148
2.37500 0.00899
2.62500 0.01620
2.87500 0.01419
3.12500 0.02316
3.37500 0.01863
3.62500 0.02486
3.87500 0.02359
4.12500 0.02873
4.37500 0.01882
4.62500 0.01956
4.87500 0.02155
5.12500 0.02247
5.37500 0.02291
5.62500 0.01460
5.87500 0.02385
6.12500 0.01464
6.37500 0.01989
6.62500 0.01888
6.87500 0.00775
7.12500 0.00679
7.37500 0.01673
7.62500 0.01674
7.87500 0.00344
8.12500 0.00808
8.37500 0.00481
8.62500 0.01496
8.87500 0.01405
9.12500 0.00841
9.37500 0.00782
9.62500 0.02003
9.87500 0.01071
10.12500 0.00893
10.37500 0.01712
10.62500 0.02077
10.87500 0.01741
11.12500 0.01209
11.37500 0.01664
11.62500 0.02871
11.87500 0.01518
12.12500 0.01585
12.37500 0.01418
12.62500 0.00838
12.87500 0.01759
13.12500 0.00959
13.37500 0.00581
13.62500 0.00992
13.87500 0.01462
14.12500 0.01889
14.37500 0.00198
14.62500 0.02439
14.87500 0.00660
