0.1875 -1.41479 19.56505 -2.17323 118.92729 117.70343 104.94108
0.5625 -0.33806 43.12914 -1.07805 110.50551 102.53684 93.15935
0.9375 -0.61602 60.24819 0.08633 102.81443 90.36656 81.73138
1.3125 0.1149 74.09859 0.96805 95.77777 82.08315 75.16866
1.6875 -1.21823 85.70267 1.35186 88.86243 76.38539 69.89614
2.0625 0.14001 95.25739 -0.12314 81.7407 73.25617 65.53666
2.4375 -0.69503 108.65882 0.11566 75.90079 70.05061 61.74974
2.8125 0.26881 124.64386 0.48724 69.23651 65.97221 57.72709
3.1875 1.14022 137.75259 0.97857 63.7804 61.72381 53.05155
3.5625 1.52206 151.63016 0.63218 58.71635 56.08716 48.36033
3.9375 0.23012 161.38177 0.4788 53.97193 50.25227 44.46385
4.3125 -0.45089 167.90541 -0.44569 50.74118 44.37025 41.45323
4.6875 -1.05364 172.86612 0.64046 48.01297 41.30728 38.94678
5.0625 -0.21241 177.20579 0.79224 45.38727 38.05936 36.40885
5.4375 -0.97936 180.65859 -0.06741 42.95805 36.18301 33.87523
5.8125 0.50656 184.08985 -0.11281 41.87121 34.50876 32.66367
6.1875 -0.0178 187.5281 -0.12473 40.54867 32.91431 31.14879
6.5625 0.09938 190.21588 -0.51881 38.9301 31.74219 30.14802
6.9375 0.56114 192.9594 0.4679 37.16231 31.00711 28.5464
7.3125 1.68882 194.54034 0.00282 36.15288 30.04241 27.66779
7.6875 0.70544 197.89626 0.03518 34.57322 28.61695 26.08975
8.0625 0.68508 198.94177 0.04572 33.50843 27.59809 25.1905
8.4375 -0.44273 200.82527 0.16755 32.26797 26.37793 24.10669
8.8125 1.01719 202.76295 0.30686 31.56019 24.65389 23.2808
9.1875 1.11137 204.66195 -1.08863 30.46738 23.72003 22.90753
9.5625 -0.5978 204.13094 -0.85765 29.38231 22.47547 22.38933
9.9375 -0.09534 205.24126 -1.01359 28.8603 21.33818 21.02858
10.3125 -1.21686 205.22248 -2.40826 28.16136 20.05887 21.0431
10.6875 -1.30966 204.4101 -1.92212 27.71667 20.03382 20.14452
11.0625 -2.43693 204.12379 -0.75586 26.14242 18.78319 19.77942
11.4375 -3.3106 204.17811 -0.6041 25.37651 18.35423 19.01441
11.8125 -2.70352 204.51768 -0.26252 25.08461 17.94282 18.4696
12.1875 -1.19213 204.59131 0.51147 23.48001 16.82947 18.0762
12.5625 -1.06221 204.59128 1.94599 22.52882 17.00079 17.45944
12.9375 -1.05755 204.36443 0.94213 21.28208 16.71953 16.38676
13.3125 -1.32847 204.57716 1.47683 20.85141 15.83677 16.40009
13.6875 -2.22515 204.25318 0.04309 20.23582 15.59639 16.50071
14.0625 -0.71917 204.88868 -0.16451 18.9569 15.75077 15.31223
14.4375 -1.34755 205.61077 -0.59961 19.61152 15.23388 14.93064
14.8125 -0.68594 205.93987 -0.47595 18.84281 14.64157 14.31114
15.1875 0.10961 206.10872 -1.2581 18.57662 14.33873 14.17538
15.5625 -0.11726 205.97277 -0.01632 18.65566 13.50386 14.27488
15.9375 1.84772 206.35002 -0.48128 17.63207 12.9939 13.18387
16.3125 -0.79898 205.22988 -1.46956 17.46493 13.4142 13.71669
16.6875 1.12092 204.76307 -2.35095 17.10214 12.188 13.62965
17.0625 0.31082 204.78683 -2.33651 15.88597 12.22514 13.22951
17.4375 1.27847 204.88151 -2.61602 15.99339 12.8411 13.57129
17.8125 0.76734 206.24827 -2.96227 15.52998 12.27451 13.02554
18.1875 0.57697 206.54692 -2.62932 14.99159 11.17835 13.2585
18.5625 1.26884 207.33941 -2.99361 14.98746 11.47815 12.17861
18.9375 -0.13639 207.32779 -3.86071 14.40271 10.03141 11.88868
19.3125 -0.5486 206.60147 -2.68984 14.65909 10.17249 11.97345
19.6875 -1.46814 205.00458 -4.21298 13.3249 10.03208 12.03967
20.0625 -1.65136 206.74871 -2.59512 12.98883 9.51371 11.28447
20.4375 -0.45849 203.4924 -1.97895 12.89802 9.43221 10.43407
20.8125 -2.9833 206.81855 -0.21543 11.29385 10.94763 9.87033
21.1875 -4.03876 206.58858 -0.93965 11.03242 7.83603 8.99425
21.5625 -2.02418 206.94837 0.45712 11.23979 6.55192 8.50784
21.9375 -1.89891 206.70269 0.45209 9.69542 8.0209 8.68645
22.3125 -1.12524 206.37894 0.44794 11.64124 9.18719 8.05722
22.6875 -0.40007 205.46611 1.07245 11.5547 6.89565 8.21207
23.0625 0.90264 204.19414 1.4929 10.98834 7.00685 8.4829
23.4375 0.44366 204.93705 2.24547 11.3325 7.13705 7.04033
23.8125 -1.04449 204.25375 2.45813 9.82512 7.82355 9.06177
24.1875 -0.30848 203.41479 3.17066 10.90645 6.8346 6.94492
24.5625 -0.75267 202.85781 3.27222 10.94435 7.19136 6.84436
24.9375 1.22561 203.22972 3.92542 9.70564 7.49387 6.35223
25.3125 0.89072 203.44817 4.08612 10.5411 7.97728 6.51137
25.6875 -1.71766 203.4898 4.6021 10.94566 5.63954 5.57012
26.0625 -0.415 202.83451 3.09481 11.113 6.80824 7.59935
26.4375 1.51794 202.72521 0.76444 9.96908 7.70296 7.50564
26.8125 1.88689 203.95922 2.0211 7.79456 5.0656 6.4651
27.1875 -0.3867 203.43247 -0.07694 10.50209 4.43077 5.12152
27.5625 0.96719 202.7161 1.48912 8.47569 4.81228 5.4208
27.9375 -4.13366 201.03949 -0.74771 7.95301 6.81167 6.9019
28.3125 1.86383 201.97568 -0.95186 6.47414 7.3967 4.80943
28.6875 0.2415 201.84254 -3.55847 11.55065 6.52596 5.40667
29.0625 5.76098 197.81186 0.20721 8.30705 8.08623 5.72534
29.4375 -0.78261 202.3008 -3.33242 8.48964 4.96533 5.25194
29.8125 -4.06979 200.9826 2.84197 6.65332 5.58826 5.07499
