0.12500 0.01389
0.37500 0.05120
0.62500 0.12536
0.87500 0.21102
1.12500 0.28754
1.37500 0.35684
1.62500 0.40599
1.87500 0.45029
2.12500 0.48442
2.37500 0.52601
2.62500 0.55325
2.87500 0.57711
3.12500 0.59260
3.37500 0.61907
3.62500 0.62849
3.87500 0.64305
4.12500 0.63956
4.37500 0.65440
4.62500 0.63597
4.87500 0.62325
5.12500 0.60438
5.37500 0.56450
5.62500 0.55266
5.87500 0.51300
6.12500 0.49241
6.37500 0.47192
6.62500 0.44817
6.87500 0.43784
7.12500 0.43021
7.37500 0.41923
7.62500 0.41339
7.87500 0.42832
8.12500 0.42126
8.37500 0.39925
8.62500 0.37471
8.87500 0.34976
9.12500 0.30857
9.37500 0.27102
9.62500 0.21429
9.87500 0.17143
10.12500 0.14563
10.37500 0.12095
10.62500 0.09736
10.87500 0.07764
11.12500 0.06260
11.37500 0.05891
11.62500 0.06774
11.87500 0.07662
12.12500 0.05756
12.37500 0.06925
12.62500 0.07750
12.87500 0.05146
13.12500 0.05030
13.37500 0.02961
13.62500 0.01870
13.87500 0.01965
14.12500 0.04347
14.37500 0.01634
14.62500 0.03287
14.87500 0.04344
