0.05000 1315.29809
0.15000 1902.87789
0.25000 2802.83608
0.35000 3536.74824
0.45000 4241.23988
0.55000 4905.06394
0.65000 5085.00742
0.75000 5541.99006
0.85000 5723.42555
0.95000 5742.13670
1.05000 5783.59982
1.15000 5779.50560
1.25000 5705.17397
1.35000 5687.67785
1.45000 5573.48171
1.55000 5377.93926
1.65000 5402.19863
1.75000 5155.70109
1.85000 5036.53353
1.95000 4974.13170
2.05000 4763.19701
2.15000 4713.71797
2.25000 4555.38518
2.35000 4482.25485
2.45000 4373.99566
2.55000 4267.78775
2.65000 4178.20471
2.75000 4124.75517
2.85000 3966.10554
2.95000 3866.61451
3.05000 3777.41721
3.15000 3643.55323
3.25000 3549.26300
3.35000 3516.83021
3.45000 3429.30297
3.55000 3339.84297
3.65000 3271.75789
3.75000 3180.16476
3.85000 3119.48435
3.95000 3045.09041
4.05000 2952.56937
4.15000 2932.21321
4.25000 2800.83842
4.35000 2778.64031
4.45000 2673.63186
4.55000 2654.55298
4.65000 2549.48201
4.75000 2477.74396
4.85000 2420.00271
4.95000 2358.78288
5.05000 2280.93331
5.15000 2260.09834
5.25000 2169.17547
5.35000 2155.38840
5.45000 2086.97362
5.55000 2039.16681
5.65000 1973.14431
5.75000 1914.55677
5.85000 1877.06265
5.95000 1806.96852
6.05000 1783.74043
6.15000 1727.64863
6.25000 1693.87560
6.35000 1648.65661
6.45000 1630.23363
6.55000 1557.22557
6.65000 1529.04417
6.75000 1484.64575
6.85000 1444.39900
6.95000 1429.07621
7.05000 1395.25372
7.15000 1374.88724
7.25000 1316.71375
7.35000 1289.29382
7.45000 1268.78080
7.55000 1222.07476
7.65000 1193.70032
7.75000 1164.92173
7.85000 1133.90265
7.95000 1100.90870
8.05000 1069.25233
8.15000 1064.02883
8.25000 1046.07294
8.35000 1009.92938
8.45000 976.99919
8.55000 974.84958
8.65000 946.63746
8.75000 924.55158
8.85000 897.16745
8.95000 890.29957
9.05000 866.62287
9.15000 843.87079
9.25000 826.27585
9.35000 796.91086
9.45000 781.91687
9.55000 775.82920
9.65000 756.98752
9.75000 725.79587
9.85000 721.51887
9.95000 707.01349
10.05000 694.38279
10.15000 677.92379
10.25000 652.42075
10.35000 651.41389
10.45000 625.73242
10.55000 621.51168
10.65000 611.71038
10.75000 591.87079
10.85000 580.77204
10.95000 578.74541
11.05000 551.70796
11.15000 534.79424
11.25000 532.77827
11.35000 533.82934
11.45000 513.40067
11.55000 508.94502
11.65000 491.04993
11.75000 483.98801
11.85000 474.62773
11.95000 464.64742
12.05000 465.79461
12.15000 445.02266
12.25000 435.26912
12.35000 438.24720
12.45000 425.32158
12.55000 414.74554
12.65000 409.18605
12.75000 394.81897
12.85000 397.98471
12.95000 386.45659
13.05000 384.26349
13.15000 376.54925
13.25000 364.54324
13.35000 358.00843
13.45000 355.45558
13.55000 353.09121
13.65000 353.47606
13.75000 339.60832
13.85000 333.79961
13.95000 329.21013
14.05000 314.37022
14.15000 315.17211
14.25000 303.91007
14.35000 303.14437
14.45000 305.20311
14.55000 295.41312
14.65000 289.60529
14.75000 287.31009
14.85000 280.23593
14.95000 270.06904
15.05000 272.63107
15.15000 269.74141
15.25000 250.54839
15.35000 254.65479
15.45000 257.86914
15.55000 249.30235
15.65000 237.26746
15.75000 232.63638
15.85000 234.59672
15.95000 223.82295
16.05000 228.03597
16.15000 224.43527
16.25000 206.58084
16.35000 211.06712
16.45000 204.83032
16.55000 200.20714
16.65000 194.50609
16.75000 192.00985
16.85000 198.65282
16.95000 181.59540
17.05000 186.71130
17.15000 182.09049
17.25000 179.19513
17.35000 174.90004
17.45000 170.59078
17.55000 172.69742
17.65000 162.01703
17.75000 162.16689
17.85000 161.94824
17.95000 160.36543
18.05000 153.83409
18.15000 155.36314
18.25000 151.22381
18.35000 149.10947
18.45000 149.26669
18.55000 151.77346
18.65000 149.58171
18.75000 139.56690
18.85000 140.04946
18.95000 132.63015
19.05000 139.50030
19.15000 131.50186
19.25000 134.61832
19.35000 128.58030
19.45000 125.95692
19.55000 127.35821
19.65000 126.55494
19.75000 122.06202
19.85000 117.08005
19.95000 119.70378
