0.12500 0.02112
0.37500 0.01361
0.62500 0.01264
0.87500 0.03662
1.12500 0.04591
1.37500 0.04835
1.62500 0.06727
1.87500 0.05631
2.12500 0.05458
2.37500 0.05294
2.62500 0.05220
2.87500 0.03238
3.12500 0.02385
3.37500 0.01756
3.62500 0.00781
3.87500 0.03915
4.12500 0.03803
4.37500 0.01963
4.62500 0.02086
4.87500 0.02228
5.12500 0.02075
5.37500 0.01410
5.62500 0.02929
5.87500 0.01985
6.12500 0.02454
6.37500 0.02874
6.62500 0.01581
6.87500 0.01611
7.12500 0.01005
7.37500 0.00794
7.62500 0.01801
7.87500 0.02870
8.12500 0.01699
8.37500 0.02134
8.62500 0.02287
8.87500 0.02955
9.12500 0.01773
9.37500 0.02924
9.62500 0.01802
9.87500 0.02051
10.12500 0.01614
10.37500 0.01981
10.62500 0.03631
10.87500 0.02357
11.12500 0.02610
11.37500 0.02191
11.62500 0.02141
11.87500 0.01112
12.12500 0.01121
12.37500 0.00924
12.62500 0.01280
12.87500 0.00156
13.12500 0.02086
13.37500 0.02009
13.62500 0.02187
13.87500 0.02495
14.12500 0.01106
14.37500 0.00217
14.62500 0.03376
14.87500 0.02607
