0.12500 0.01108
0.37500 0.02104
0.62500 0.03385
0.87500 0.05802
1.12500 0.09106
1.37500 0.11089
1.62500 0.14295
1.87500 0.18041
2.12500 0.21001
2.37500 0.23015
2.62500 0.25158
2.87500 0.26246
3.12500 0.26259
3.37500 0.25510
3.62500 0.24967
3.87500 0.23732
4.12500 0.22550
4.37500 0.21491
4.62500 0.19420
4.87500 0.17444
5.12500 0.16055
5.37500 0.14023
5.62500 0.11169
5.87500 0.08634
6.12500 0.07347
6.37500 0.03828
6.62500 0.02557
6.87500 0.02844
7.12500 0.02214
7.37500 0.03208
7.62500 0.02722
7.87500 0.05350
8.12500 0.04834
8.37500 0.04180
8.62500 0.04717
8.87500 0.05275
9.12500 0.05639
9.37500 0.05491
9.62500 0.03997
9.87500 0.03688
10.12500 0.03041
10.37500 0.03321
10.62500 0.03974
10.87500 0.05070
11.12500 0.06085
11.37500 0.04427
11.62500 0.04323
11.87500 0.03194
12.12500 0.05145
12.37500 0.05724
12.62500 0.04024
12.87500 0.05545
13.12500 0.05595
13.37500 0.02849
13.62500 0.01699
13.87500 0.02435
14.12500 0.03128
14.37500 0.03005
14.62500 0.03798
14.87500 0.02618
