0.05000 -363.54388 -2013.41972 4286.38495 0.00000 0.00000 0.00000
0.15000 20.44289 77.75829 4033.35674 1729.06898 1316.94037 163.55719
0.25000 -500.75568 655.31413 3941.42285 1653.28919 1443.99601 265.77394
0.35000 -760.89873 -182.91851 4017.45555 1264.66449 1598.23577 270.93973
0.45000 -790.12581 127.77042 3933.27185 1562.37914 1489.81172 427.86654
0.55000 -1035.92101 83.53890 3856.18175 1506.06972 1647.67808 499.84346
0.65000 -1076.31947 -140.63296 3736.47096 1571.98939 1703.00670 607.66772
0.75000 -1479.69199 50.34703 3650.78542 1401.33093 1669.78723 641.52538
0.85000 -1593.87453 23.82596 3492.05324 1576.70068 1699.68628 719.31415
0.95000 -1794.96296 0.07030 3361.85553 1487.02600 1736.13409 820.86288
1.05000 -2040.06950 27.65430 3130.75336 1488.62130 1835.78784 923.99265
1.15000 -2069.00068 -31.19259 2896.01590 1648.19437 1885.10308 1037.90625
1.25000 -2173.85162 149.79123 2544.60639 1766.11491 1935.77900 1226.64371
1.35000 -2401.89520 -10.31532 2327.81531 1529.88967 1851.66850 1398.77777
1.45000 -2719.15215 16.18300 1781.30692 1497.09972 1873.97190 1710.66723
1.55000 -2788.63011 -17.60200 1586.40841 1455.90652 1721.67958 2022.23378
1.65000 -3019.23839 -0.32980 1274.12952 1318.58434 1655.06880 2090.35853
1.75000 -3153.04109 18.96536 1194.37749 1218.43988 1543.46958 2113.35024
1.85000 -3150.93413 -25.60057 1179.27303 1295.92654 1375.72305 2208.71920
1.95000 -3265.12213 47.25181 927.03292 1167.67523 1322.82333 2280.19614
2.05000 -3264.99269 18.86412 785.67699 1215.19522 1274.89402 2325.59721
2.15000 -3246.17290 -16.84784 843.51622 1234.53339 1156.37277 2375.65468
2.25000 -3243.22614 22.53683 682.02860 1197.86231 1125.96258 2406.41041
2.35000 -3306.89371 -21.99731 683.23459 1119.83020 1065.19950 2371.00269
2.45000 -3310.66541 31.38792 605.75244 1134.11968 1025.30191 2391.34850
2.55000 -3372.13104 11.85790 555.86332 1084.89881 957.91896 2349.51193
2.65000 -3329.19068 13.72112 515.63884 1117.91911 922.78335 2413.21336
2.75000 -3347.85196 -1.38438 473.49706 1093.01024 865.01003 2425.01196
2.85000 -3335.26897 29.30411 541.48924 1112.11574 828.12967 2380.31558
2.95000 -3371.04207 -10.75884 336.03929 1092.14056 795.86516 2386.35530
3.05000 -3278.86253 -13.43795 356.99565 1111.17711 785.98453 2458.39179
3.15000 -3247.57234 -1.47487 321.59118 1042.31803 760.75489 2465.55214
3.25000 -3300.35901 -25.07461 321.39318 1004.88536 709.94364 2384.50793
3.35000 -3270.73319 9.03278 149.32801 1038.08924 710.51464 2406.13334
3.45000 -3261.21601 -3.44983 291.30541 1055.49045 661.94919 2375.29995
3.55000 -3264.28244 -0.40106 182.78002 999.98274 644.04675 2391.20771
3.65000 -3243.65696 9.27029 149.66691 998.69667 626.73714 2398.78517
3.75000 -3176.55116 33.25311 281.52876 1015.24413 589.44698 2429.10268
3.85000 -3202.90410 11.95006 197.78376 994.57783 582.62049 2369.88665
3.95000 -3196.28027 0.09692 264.69882 969.04339 562.59145 2309.29478
4.05000 -3193.27008 -14.01106 204.99472 980.25126 540.86866 2297.42878
4.15000 -3151.86127 6.49087 105.74217 948.58123 530.52333 2356.98432
4.25000 -3140.58501 -24.04401 167.70765 972.43093 505.24963 2302.03381
4.35000 -3130.98243 5.20236 131.67490 947.90228 489.60903 2310.15204
4.45000 -3115.67276 10.24798 146.76004 933.65853 487.64062 2287.63085
4.55000 -3065.62691 4.91335 160.36760 955.60140 460.85066 2303.98964
4.65000 -3077.64470 -1.67698 144.02567 919.54314 450.55774 2263.55505
4.75000 -3080.83530 -1.97768 103.75506 924.34239 447.56130 2227.15926
4.85000 -3037.81019 -4.38068 171.40733 932.74039 424.73756 2238.49003
4.95000 -3030.68543 -8.37754 34.59658 924.67682 420.82883 2229.56950
5.05000 -2996.08096 -3.98542 25.77653 910.16259 415.46680 2240.17559
5.15000 -2950.52334 -2.17537 46.98148 921.39502 403.90117 2264.06133
5.25000 -3012.00824 7.26645 137.56980 862.06775 389.64845 2145.12031
5.35000 -2987.87768 2.23665 86.88049 864.08958 377.63774 2142.11269
5.45000 -2963.22774 -8.95837 53.89281 868.74070 372.90241 2155.32614
5.55000 -2928.06501 7.01795 51.90180 882.90500 361.80145 2166.48983
5.65000 -2909.83246 -6.24591 18.68177 875.04755 351.40993 2161.59672
5.75000 -2895.72203 -16.47874 31.51457 847.41880 345.79030 2156.87835
5.85000 -2897.49383 -2.21230 9.30400 864.61828 337.31191 2112.32126
5.95000 -2872.68797 -4.33651 80.54952 855.97945 330.59351 2106.83224
6.05000 -2875.54721 3.09807 23.54685 816.09944 324.58958 2094.25063
6.15000 -2840.64661 2.59813 52.60553 842.00148 315.95990 2098.51098
6.25000 -2813.18883 1.71031 -7.63057 846.71298 305.93763 2100.29801
6.35000 -2792.76984 14.77502 96.86988 849.48764 305.89785 2084.17735
6.45000 -2817.94143 -0.91363 -12.34639 814.14486 293.30056 2048.82468
6.55000 -2786.91683 1.26748 12.44947 821.88949 295.28173 2048.44248
6.65000 -2797.01858 6.09419 32.69379 802.98561 282.23986 2019.39024
6.75000 -2743.30955 -0.76050 -18.20810 813.77262 283.50781 2055.83394
6.85000 -2747.82727 8.05533 53.78470 809.34331 273.24344 2014.35208
6.95000 -2745.14280 -0.44605 17.47175 794.45221 269.93995 1995.23414
7.05000 -2738.00999 -3.67412 -57.99729 811.46836 263.97929 1978.16981
7.15000 -2707.11576 -3.58505 -34.49515 799.98236 259.35969 1985.99754
7.25000 -2690.42880 6.59647 -29.48925 790.67332 255.14316 1983.13287
7.35000 -2673.28082 -2.81973 -78.62150 794.34907 250.79474 1975.32963
7.45000 -2684.10877 8.73449 20.42184 765.65573 247.74023 1938.08364
7.55000 -2634.29620 3.90140 -59.37298 781.21979 240.96997 1971.92132
7.65000 -2625.69403 -3.34839 94.51901 792.66279 236.93003 1926.03399
7.75000 -2623.22178 5.12696 -29.67450 771.71429 229.72246 1925.89204
7.85000 -2616.29867 -5.35374 -49.59652 768.66749 232.03859 1904.35509
7.95000 -2584.76951 5.38109 13.68957 740.46788 225.73565 1927.30901
8.05000 -2582.85900 -7.37291 -38.30070 749.30922 219.66986 1905.87039
8.15000 -2563.99508 -1.29715 -25.63286 754.27561 216.70267 1896.80491
8.25000 -2565.51235 2.55121 -53.60279 740.93287 212.77927 1867.67519
8.35000 -2542.90629 -0.51499 -41.02506 737.82138 213.08813 1876.07894
8.45000 -2535.41438 -2.76690 -86.32170 744.73983 208.12593 1863.73625
8.55000 -2504.38410 -3.95637 -38.86912 747.05936 201.49666 1866.60386
8.65000 -2496.04023 3.85287 -5.97396 735.57296 198.06413 1851.29915
8.75000 -2477.94736 3.54373 -0.79387 718.45980 195.02529 1847.91981
8.85000 -2489.85085 -1.68803 -78.41520 710.00669 190.61121 1811.59911
8.95000 -2469.89570 0.27952 -64.50998 714.83951 190.91516 1813.69681
9.05000 -2461.98678 -4.96590 -67.51021 704.55232 189.41004 1800.65043
9.15000 -2441.26336 1.21670 42.72267 716.80767 179.80284 1781.83073
9.25000 -2421.20306 -0.04428 -54.59787 717.62122 181.15235 1794.21164
9.35000 -2415.64720 2.93553 -97.70591 694.82052 179.41509 1787.41669
9.45000 -2424.10531 -3.60314 -41.64933 686.62221 180.46222 1745.38455
9.55000 -2381.41113 1.27129 -26.95856 690.56769 172.30515 1773.47522
9.65000 -2376.29061 1.39217 3.62686 697.14970 168.34907 1741.49365
9.75000 -2342.77410 -5.55419 -86.51950 697.08375 169.28159 1763.92453
9.85000 -2355.03405 -6.08543 -45.56401 674.84657 164.25997 1730.42755
9.95000 -2331.73051 -2.10343 -30.22364 676.56328 162.46679 1724.78921
10.05000 -2343.69789 2.86269 -67.38217 677.62978 158.50405 1687.89821
10.15000 -2303.74801 -4.18774 -45.07207 665.39328 159.93286 1716.77065
10.25000 -2314.53594 3.19865 -31.38699 644.51793 156.25642 1686.24853
10.35000 -2293.62950 7.02518 -58.34490 657.51130 151.41936 1682.12907
10.45000 -2240.58841 2.69050 25.57637 678.49086 151.21817 1707.74858
10.55000 -2262.96199 5.79513 -106.43433 661.39933 147.57333 1669.20025
10.65000 -2250.52331 2.43346 -23.28772 651.62251 147.30106 1656.96453
10.75000 -2254.86737 -2.38859 -3.45047 632.25504 145.76441 1637.79525
10.85000 -2235.18111 -1.16430 -66.16347 643.11464 143.62652 1635.32001
10.95000 -2234.71278 -0.01922 -27.80581 626.93105 140.56897 1610.26479
11.05000 -2197.67386 -6.51305 -29.76575 650.73391 138.97743 1633.64183
11.15000 -2189.06218 -7.84962 -94.73886 633.48578 135.81350 1628.96357
11.25000 -2172.50435 -4.45126 -52.46787 652.25594 135.16109 1615.36253
11.35000 -2187.60576 -3.97530 -28.81893 630.13903 133.49281 1579.34876
11.45000 -2163.43612 -2.23279 -69.96416 631.02103 132.87888 1591.21323
11.55000 -2129.78654 -3.15435 -61.96339 630.90054 131.14365 1604.21509
11.65000 -2146.03070 -1.51814 -57.79177 611.13261 129.51684 1570.79175
11.75000 -2128.00988 5.11989 -42.74951 614.60574 124.86711 1570.62844
11.85000 -2122.22817 -2.56516 -44.82427 620.62920 125.78983 1550.59159
11.95000 -2102.04466 6.42964 -57.87301 612.08199 122.53576 1561.70077
12.05000 -2078.40084 -0.19257 -21.14670 611.42191 123.03464 1565.61657
12.15000 -2097.56029 -1.70690 -56.74421 592.93740 120.97856 1527.17775
12.25000 -2054.75560 -0.03223 -39.38271 612.86580 121.83193 1553.22454
12.35000 -2058.82451 1.88611 -31.48244 608.75535 118.75934 1530.54422
12.45000 -2055.47589 1.38386 -103.73030 582.68323 115.61983 1523.59426
12.55000 -2039.06959 -0.68649 -50.44997 590.47697 115.28867 1520.83079
12.65000 -2043.83051 -1.23712 -78.43409 577.58190 112.63334 1495.41979
12.75000 -2016.15158 1.56027 -61.11558 594.92381 115.16306 1507.30003
12.85000 -2026.29131 -2.09181 -27.77829 573.46088 111.28868 1472.23002
12.95000 -2015.51263 0.48196 -60.04082 566.42521 108.32990 1469.29048
13.05000 -2011.18445 1.15711 -16.89022 570.09611 109.28445 1448.50111
13.15000 -1990.42774 -1.17737 -44.23672 568.15405 106.47471 1462.03016
13.25000 -1989.04766 1.03484 -90.31695 561.47503 108.06657 1439.78154
13.35000 -1970.11937 2.09421 -65.67034 564.94658 103.97907 1443.27488
13.45000 -1958.50594 -4.25217 -6.22042 561.85581 102.87794 1434.46586
13.55000 -1940.11774 4.76674 -89.96915 563.71911 103.04909 1443.77027
13.65000 -1946.95166 -3.57328 -26.93670 553.50330 101.71885 1409.83880
13.75000 -1931.04980 -4.10184 -85.70420 550.19862 100.99904 1419.79177
13.85000 -1925.63893 0.22131 -5.53545 556.13360 99.15540 1396.90291
13.95000 -1900.61330 0.39639 -53.00181 547.55017 98.35843 1420.31619
14.05000 -1889.65393 -3.21526 -26.23424 558.81729 99.01867 1408.93404
14.15000 -1878.70043 0.56066 -22.87691 541.79347 94.72302 1401.45863
14.25000 -1883.49239 -0.98019 -42.00440 527.67160 95.58423 1383.58050
14.35000 -1859.27596 0.06569 -58.85649 544.23229 93.93718 1393.38121
14.45000 -1876.39799 0.81069 -41.21044 526.09802 93.36459 1355.89874
14.55000 -1836.78470 -1.40910 -36.20229 548.52514 92.57026 1382.61527
14.65000 -1869.68719 1.13376 0.28222 520.91796 89.06381 1324.24822
14.75000 -1836.08614 -0.84513 -62.05386 524.32576 91.02223 1353.47066
14.85000 -1832.49410 -2.22583 -69.84344 527.06860 88.72812 1339.25263
14.95000 -1831.89922 2.41508 -34.66165 521.88485 86.23420 1320.19611
15.05000 -1804.10636 -0.48489 -98.38905 530.90994 86.59542 1338.84772
15.15000 -1811.80259 0.70681 -40.92118 510.24224 87.60474 1313.46715
15.25000 -1806.18210 -0.87111 -1.75549 508.93494 86.76376 1297.04346
15.35000 -1794.05716 0.23913 -65.39485 507.88427 86.76836 1306.38682
15.45000 -1760.03490 -0.39453 -61.07325 520.57226 85.14608 1322.57664
15.55000 -1758.17493 1.52144 11.60505 511.24871 82.33497 1309.39752
15.65000 -1776.29932 -2.45702 -87.88424 498.28224 82.92610 1277.36506
15.75000 -1756.07257 0.73085 -22.97909 495.74365 80.71382 1285.31117
15.85000 -1746.80529 0.35382 -93.11211 496.49862 79.59899 1283.26952
15.95000 -1747.17404 1.11350 -34.33613 486.25842 80.01781 1265.54839
16.05000 -1732.50429 -1.53403 -99.88040 493.61117 77.55883 1267.11139
16.15000 -1725.36333 1.32903 -60.04190 488.96524 79.05263 1256.75429
16.25000 -1711.77825 0.63868 -80.48800 495.23557 78.17966 1257.97450
16.35000 -1700.99511 0.31254 -1.47964 499.41561 77.06800 1250.99281
16.45000 -1689.92396 -1.47482 -22.91927 490.50018 77.62575 1251.06685
16.55000 -1692.49185 0.92641 -49.20993 482.17340 78.03258 1235.29138
16.65000 -1665.35752 -1.68405 -93.19457 496.46462 72.99013 1250.90552
16.75000 -1672.65954 -1.48670 -48.38886 484.13280 73.04085 1225.77307
16.85000 -1665.19470 -0.23437 -69.69130 482.39167 73.51203 1221.02557
16.95000 -1645.48877 0.08447 -35.31210 479.57460 72.54524 1226.68900
17.05000 -1637.50601 2.75766 -24.76045 472.04412 70.95492 1223.96140
17.15000 -1631.44679 -0.50536 -17.04610 481.07787 72.01692 1210.06515
17.25000 -1626.26890 0.25196 -50.13080 475.90567 70.86067 1208.11689
17.35000 -1626.27053 -0.37570 -28.20916 466.14509 71.50582 1193.10584
17.45000 -1616.61630 0.17908 -53.43021 468.96519 68.94005 1193.10998
17.55000 -1611.62863 0.92779 -27.28228 454.07124 69.52998 1187.19935
17.65000 -1597.31464 -0.88883 -58.72128 470.73370 67.31007 1185.26746
17.75000 -1609.27038 0.53984 -60.92088 447.25352 66.59747 1160.24624
17.85000 -1574.16880 -0.75197 -43.13973 469.38735 66.94495 1184.18356
17.95000 -1583.63572 2.45097 -28.19599 447.54809 66.25578 1165.07780
18.05000 -1579.16057 0.43850 -60.00568 439.28872 65.13131 1160.65522
18.15000 -1577.86144 -0.01252 -12.84637 439.58533 66.08429 1143.96100
18.25000 -1573.94908 -0.43221 -45.02263 443.13324 65.08471 1133.75458
18.35000 -1560.94847 -1.29728 -63.31462 444.23601 63.63380 1135.17890
18.45000 -1541.91551 3.98445 -43.25091 442.11255 63.01452 1145.38022
18.55000 -1526.49281 -1.59503 -81.49560 440.93679 63.04310 1156.85145
18.65000 -1533.04517 0.33567 -68.50700 437.79081 61.65259 1129.53669
18.75000 -1526.63617 1.29918 -22.06243 443.18837 62.42288 1120.31443
18.85000 -1522.55997 0.33056 -43.49305 440.61565 59.65445 1113.96325
18.95000 -1522.74216 0.71822 -63.45968 428.64906 60.38810 1107.06946
19.05000 -1511.13214 -1.06610 -32.52710 427.49705 59.32129 1104.83449
19.15000 -1491.66923 0.72648 -44.68462 432.01588 59.76798 1117.46808
19.25000 -1497.06661 -2.17687 -47.95330 423.27037 56.75554 1102.17636
19.35000 -1496.91878 -0.50183 -33.67211 421.97591 58.84503 1084.89625
19.45000 -1483.85020 0.09369 -13.36762 429.08228 57.55980 1080.69377
19.55000 -1463.80302 -0.49340 -24.89579 431.19884 56.45556 1095.39818
19.65000 -1461.54398 -1.10002 -66.13774 421.52354 56.71131 1093.23773
19.75000 -1447.42415 -0.88381 -9.73843 422.55329 55.02587 1092.95807
19.85000 -1461.62964 0.26301 -23.80187 421.23359 55.82889 1061.35523
19.95000 -1457.92158 -0.04410 -38.02945 412.63949 54.90810 1056.15848
