0.125 0.000 -0.001 0.001
0.375 -0.003 0.005 0.036
0.625 -0.005 -0.003 0.182
0.875 0.007 0.008 0.520
1.125 -0.000 0.013 1.083
1.375 -0.058 0.028 1.894
1.625 -0.021 0.062 2.862
1.875 -0.069 0.042 3.972
2.125 -0.067 0.110 5.190
2.375 -0.081 0.107 6.506
2.625 -0.127 0.075 7.844
2.875 -0.178 0.145 9.427
3.125 -0.127 0.164 10.554
3.375 -0.182 0.209 11.960
3.625 -0.207 0.227 13.484
3.875 -0.198 0.253 14.798
4.125 -0.215 0.289 15.640
4.375 -0.227 0.264 16.935
4.625 -0.300 0.282 17.985
4.875 -0.285 0.357 19.145
5.125 -0.304 0.387 20.255
5.375 -0.262 0.411 21.606
5.625 -0.348 0.402 22.466
5.875 -0.389 0.427 23.614
6.125 -0.364 0.399 24.499
6.375 -0.394 0.402 25.253
6.625 -0.343 0.363 25.333
6.875 -0.371 0.349 26.191
7.125 -0.389 0.427 26.143
7.375 -0.370 0.451 26.497
7.625 -0.365 0.410 26.351
7.875 -0.404 0.473 26.611
8.125 -0.368 0.427 26.025
8.375 -0.307 0.436 26.436
8.625 -0.316 0.392 25.935
8.875 -0.367 0.428 26.010
9.125 -0.344 0.388 25.434
9.375 -0.343 0.432 24.991
9.625 -0.392 0.394 24.727
9.875 -0.393 0.387 24.854
10.125 -0.352 0.354 23.949
10.375 -0.345 0.353 23.927
10.625 -0.383 0.358 23.837
10.875 -0.366 0.321 23.080
11.125 -0.338 0.342 22.420
11.375 -0.293 0.293 22.400
11.625 -0.314 0.286 21.972
11.875 -0.327 0.239 21.264
12.125 -0.269 0.242 20.639
12.375 -0.267 0.257 20.369
12.625 -0.252 0.235 19.837
12.875 -0.249 0.192 18.521
13.125 -0.202 0.230 17.688
13.375 -0.204 0.196 16.887
13.625 -0.231 0.226 16.560
13.875 -0.181 0.215 16.188
14.125 -0.178 0.197 15.926
14.375 -0.175 0.215 15.365
14.625 -0.189 0.140 14.522
14.875 -0.180 0.157 14.250
