0.05000 1610.67468
0.15000 3231.89038
0.25000 4675.53612
0.35000 5773.73346
0.45000 6427.89670
0.55000 6859.17589
0.65000 7198.52771
0.75000 7373.14830
0.85000 7324.66693
0.95000 7271.50812
1.05000 7044.41740
1.15000 6889.83619
1.25000 6634.15787
1.35000 6464.16503
1.45000 6184.33622
1.55000 5976.42273
1.65000 5831.49434
1.75000 5581.49853
1.85000 5374.80708
1.95000 5257.59168
2.05000 5078.19848
2.15000 4933.53706
2.25000 4752.54666
2.35000 4615.29370
2.45000 4425.97102
2.55000 4271.41439
2.65000 4210.05812
2.75000 4050.50671
2.85000 3894.08782
2.95000 3817.65848
3.05000 3740.75072
3.15000 3551.69600
3.25000 3549.76845
3.35000 3401.04644
3.45000 3333.04473
3.55000 3180.12579
3.65000 3081.80093
3.75000 3071.53018
3.85000 2941.48738
3.95000 2873.80904
4.05000 2752.14856
4.15000 2669.79474
4.25000 2617.35066
4.35000 2535.52509
4.45000 2486.97493
4.55000 2393.82417
4.65000 2311.06397
4.75000 2221.97935
4.85000 2174.24472
4.95000 2119.64772
5.05000 2063.08904
5.15000 1999.28005
5.25000 1937.63582
5.35000 1871.13097
5.45000 1824.35999
5.55000 1753.22799
5.65000 1690.05525
5.75000 1644.52826
5.85000 1627.09227
5.95000 1559.22762
6.05000 1508.85505
6.15000 1446.70608
6.25000 1423.74708
6.35000 1382.34745
6.45000 1362.88377
6.55000 1287.57054
6.65000 1256.15628
6.75000 1247.18610
6.85000 1195.86090
6.95000 1162.21049
7.05000 1149.68497
7.15000 1083.73830
7.25000 1062.49147
7.35000 1047.50067
7.45000 1029.95815
7.55000 998.71619
7.65000 975.32959
7.75000 963.88759
7.85000 930.89699
7.95000 905.91357
8.05000 885.92393
8.15000 843.44061
8.25000 841.03610
8.35000 820.52113
8.45000 792.34001
8.55000 765.84574
8.65000 747.02406
8.75000 739.11357
8.85000 714.20034
8.95000 709.53429
9.05000 680.51378
9.15000 658.43674
9.25000 650.28402
9.35000 616.30876
9.45000 607.34764
9.55000 585.30642
9.65000 592.86464
9.75000 567.12989
9.85000 563.79109
9.95000 552.88436
10.05000 523.87303
10.15000 529.42239
10.25000 517.01339
10.35000 499.88966
10.45000 489.62434
10.55000 486.96890
10.65000 459.82744
10.75000 458.87381
10.85000 439.61952
10.95000 443.12902
11.05000 436.66606
11.15000 421.16001
11.25000 410.48909
11.35000 408.05104
11.45000 397.55341
11.55000 393.92405
11.65000 389.47030
11.75000 378.96094
11.85000 370.63411
11.95000 365.77573
12.05000 361.62455
12.15000 356.77685
12.25000 348.59614
12.35000 346.44358
12.45000 333.72730
12.55000 335.17921
12.65000 325.16968
12.75000 314.76809
12.85000 300.45752
12.95000 299.12251
13.05000 307.83391
13.15000 292.43145
13.25000 281.79883
13.35000 279.72118
13.45000 269.81437
13.55000 275.64386
13.65000 264.76745
13.75000 249.80731
13.85000 251.41418
13.95000 240.45186
14.05000 237.86408
14.15000 233.64449
14.25000 226.14748
14.35000 230.15646
14.45000 222.71406
14.55000 212.09955
14.65000 213.58101
14.75000 211.48399
14.85000 203.01316
14.95000 206.92377
15.05000 198.63703
15.15000 188.98743
15.25000 187.19057
15.35000 190.89840
15.45000 179.36307
15.55000 173.83016
15.65000 171.53253
15.75000 175.62978
15.85000 166.88458
15.95000 163.30456
16.05000 153.80735
16.15000 157.04819
16.25000 149.47599
16.35000 152.56199
16.45000 147.57697
16.55000 141.57279
16.65000 146.54341
16.75000 130.84585
16.85000 142.35070
16.95000 134.24158
17.05000 133.58663
17.15000 122.66299
17.25000 127.96081
17.35000 123.36220
17.45000 125.90223
17.55000 119.89552
17.65000 120.01965
17.75000 113.24411
17.85000 114.46096
17.95000 111.96963
18.05000 102.78881
18.15000 102.84277
18.25000 110.35094
18.35000 103.67271
18.45000 103.70501
18.55000 102.11726
18.65000 100.62665
18.75000 94.41964
18.85000 98.32191
18.95000 97.53313
19.05000 96.02904
19.15000 91.65167
19.25000 93.06441
19.35000 90.93991
19.45000 96.79716
19.55000 87.45839
19.65000 87.85575
19.75000 91.78228
19.85000 95.92221
19.95000 87.14222
