0.05000 -3500.62643 188.56552 -152575.79937 2879.11844 2690.20644 1407334.50443
0.15000 -5765.55181 -30.71482 -31759.91655 3437.86034 2673.14828 958678.54975
0.25000 -8613.78170 245.41031 -13344.05622 3097.76821 3030.26969 790439.11986
0.35000 -11095.61907 31.28220 -4196.74969 2965.29540 3084.71878 823995.27936
0.45000 -12554.06699 75.09216 -4396.24908 3266.56031 3278.14194 737583.56941
0.55000 -13188.64364 133.53632 6799.03447 3253.23243 3556.56017 738159.86790
0.65000 -13671.51098 119.30698 -12062.15478 3105.08538 3691.16173 754110.93166
0.75000 -14007.12306 64.83582 -1159.51922 3042.00525 3834.50562 639317.77447
0.85000 -14030.79281 -16.07463 7219.08620 2855.53393 3903.24813 626590.40766
0.95000 -13652.82324 60.07108 -977.50047 2606.31393 4012.64921 583402.42626
1.05000 -13479.13699 63.02861 -7638.50312 2419.76978 4025.42353 586215.80809
1.15000 -13222.50137 65.47849 2127.88364 2225.21798 4071.16652 501402.04325
1.25000 -13006.28762 22.52705 9695.89363 2007.58030 4087.47779 500459.06031
1.35000 -12764.03588 56.44087 7917.72104 1804.88073 4008.71083 474605.88889
1.45000 -12566.96247 -6.10332 14294.44459 1568.19808 3999.37566 452201.22247
1.55000 -12297.74686 32.46317 10607.54048 1389.22105 3954.81878 428666.95674
1.65000 -12086.19732 54.30559 19787.29356 1161.24161 3830.59835 414927.95798
1.75000 -11909.15942 1.82065 17877.37346 967.72538 3742.12901 372121.98111
1.85000 -11652.81485 -112.35758 11116.76436 941.57828 3649.62447 348826.55104
1.95000 -11424.17078 -70.79948 11465.22805 846.38599 3572.02654 334881.79860
2.05000 -11253.20550 -208.11218 17351.76508 726.12553 3444.13721 302742.96841
2.15000 -11081.39584 -241.06624 8962.05225 678.55147 3342.60103 292686.64719
2.25000 -10947.58216 -308.06634 8909.94885 623.10114 3246.65697 292193.78359
2.35000 -10849.98343 -409.02548 9212.14455 614.78987 3113.03599 257592.63213
2.45000 -10665.95488 -480.29639 7245.67704 636.04907 2965.56692 269282.54367
2.55000 -10475.82594 -480.19371 15116.45059 692.15565 2846.48108 236305.77868
2.65000 -10324.18135 -487.44451 10695.40131 805.98199 2752.10648 229721.50217
2.75000 -10153.14206 -468.43805 11295.41663 872.79239 2622.27358 225444.82642
2.85000 -9964.51610 -461.32553 8975.95461 928.20625 2480.25921 221540.88361
2.95000 -9700.75391 -330.28118 7276.46589 995.10975 2378.30457 197886.03344
3.05000 -9480.51233 -271.59691 7174.29017 1001.91746 2311.95009 192667.99984
3.15000 -9251.07767 -172.26686 11135.86820 1031.11252 2211.97499 183568.68609
3.25000 -9072.22984 -165.39998 5352.68125 1068.10004 2132.57272 185453.18912
3.35000 -8893.45923 -52.56670 4707.96145 1084.50062 2026.41392 183760.70753
3.45000 -8681.05915 34.55236 8185.00166 1078.84179 1927.58113 164369.02519
3.55000 -8528.00874 77.13479 5161.01896 1034.25048 1853.47336 153886.21495
3.65000 -8411.92286 61.43117 6591.65235 1048.71746 1782.18829 146231.37507
3.75000 -8289.21400 80.77489 7181.09088 1044.75616 1709.15402 152013.16370
3.85000 -8238.99430 58.36959 4082.78191 1061.04156 1635.75969 137345.28869
3.95000 -8145.79376 85.27855 5782.43211 1055.49460 1555.67822 130608.44783
4.05000 -8042.55971 96.34682 3731.12348 1054.28288 1477.86365 119535.35895
4.15000 -7960.54488 107.35618 4484.49228 1070.09247 1417.75747 121626.73783
4.25000 -7873.58200 123.40482 2779.72529 1077.38215 1357.80614 103868.25060
4.35000 -7812.10221 127.08722 1025.81549 1088.64166 1281.31314 105676.36795
4.45000 -7754.99976 122.22452 2825.81871 1088.11279 1213.83100 110157.19914
4.55000 -7681.39593 132.68955 3578.59019 1088.85848 1130.34705 100655.93929
4.65000 -7584.48001 114.28022 2180.28251 1100.59068 1057.36259 90099.20750
4.75000 -7490.07088 108.07602 121.63562 1069.91301 1011.07380 89900.51199
4.85000 -7396.51649 128.34949 1416.12507 1052.33662 944.04749 85171.79651
4.95000 -7271.32935 106.04649 938.77244 1026.76999 880.50753 82025.73059
5.05000 -7129.59279 110.98073 547.25082 986.47232 842.16331 72273.86406
5.15000 -7029.64008 118.51290 119.88173 953.21864 775.07412 64746.28001
5.25000 -6923.47064 117.87149 387.73002 925.12500 728.58022 62936.81894
5.35000 -6809.73561 111.67004 759.66383 895.95070 699.99698 66222.89434
5.45000 -6738.26352 93.55257 -640.47228 844.78664 654.70760 58227.99074
5.55000 -6626.84789 109.25524 2527.26989 823.09959 612.26277 57968.15743
5.65000 -6557.85463 98.83951 -998.29709 777.11450 575.44981 62515.94338
5.75000 -6462.24923 98.97260 -69.43188 746.83581 543.58528 55240.02964
5.85000 -6398.44786 97.65453 -85.76751 711.57320 522.70012 48924.77722
5.95000 -6298.04623 101.34953 -135.22280 672.90037 500.95285 49314.24682
6.05000 -6247.02494 79.53938 -1313.75741 662.25016 480.45501 47595.65096
6.15000 -6186.28046 93.15825 -292.60247 623.18655 448.14789 46040.26824
6.25000 -6137.61555 79.44021 -161.52040 607.89113 429.19617 39259.51743
6.35000 -6086.76642 59.72356 -275.43454 590.49711 411.67262 40768.12267
6.45000 -6033.61981 67.06320 254.13247 573.92872 377.06538 36266.91688
6.55000 -5967.59446 58.94169 -318.88484 558.13697 368.43840 37770.22736
6.65000 -5910.30203 54.97165 -202.78288 538.51857 363.86564 48375.97400
6.75000 -5858.83033 45.58087 -236.91877 528.58222 345.02248 31876.50507
6.85000 -5817.34621 46.19455 -172.64817 501.38377 315.63235 32902.73509
6.95000 -5747.26131 42.04534 672.32779 471.14058 314.53961 29251.53148
7.05000 -5696.41454 27.47541 -703.48458 439.42434 298.49925 37196.46615
7.15000 -5650.15977 15.00503 -135.86936 436.89634 296.83960 35511.06299
7.25000 -5599.43584 30.14195 -625.34102 395.40039 287.44647 28945.61422
7.35000 -5550.01407 21.77350 -1021.14661 382.26384 276.59255 26410.03988
7.45000 -5507.95217 15.34552 5.22894 360.13009 263.08232 25494.04062
7.55000 -5470.69899 11.97045 -907.07283 303.94937 284.30144 25251.46441
7.65000 -5428.69019 11.69457 206.77387 298.44562 253.01816 25563.98054
7.75000 -5382.74571 6.86358 -57.25746 299.82998 250.93339 22281.93016
7.85000 -5329.00832 6.54861 95.02437 274.72121 250.47119 19990.87716
7.95000 -5290.68071 5.46305 -4.68932 243.85924 229.02985 21285.12830
8.05000 -5252.12991 2.72171 45.73778 268.11438 236.33534 20771.89724
8.15000 -5211.63833 -2.22947 521.45637 221.96218 209.91968 19492.39180
8.25000 -5167.03353 2.46569 -99.92077 241.46058 218.41664 23496.95105
8.35000 -5126.56161 4.01130 249.84725 229.60581 214.96817 20307.89177
8.45000 -5078.83494 1.25032 290.92661 239.21472 203.95361 17003.38990
8.55000 -5038.61642 1.63666 395.89195 240.68307 210.75875 18720.59187
8.65000 -4990.16280 6.04282 366.04333 221.22323 184.39528 16355.66118
8.75000 -4943.81443 6.43651 -101.96667 214.91794 199.05273 15984.11718
8.85000 -4898.15614 5.66582 430.74562 194.16619 168.72786 18988.83004
8.95000 -4852.48046 5.51064 484.68604 194.46777 182.79471 15272.03055
9.05000 -4818.90076 6.60905 9.53784 190.17252 167.51440 18346.57417
9.15000 -4772.87307 10.09319 195.73910 198.85574 171.55213 14476.90501
9.25000 -4736.63546 8.06616 100.84287 185.16077 176.10734 15179.39111
9.35000 -4691.84158 12.44911 -250.13125 195.69967 161.26711 16188.72813
9.45000 -4646.73010 12.77434 306.94238 216.95156 188.23320 12323.96195
9.55000 -4609.57581 11.95259 355.85684 197.07110 166.38862 13559.75137
9.65000 -4576.87341 12.70740 51.48396 198.41434 160.64389 15087.53975
9.75000 -4540.37362 12.19828 -297.17090 217.06169 164.66942 13091.11420
9.85000 -4502.04014 16.32182 220.43415 169.45168 155.65637 14082.45231
9.95000 -4470.09418 13.77379 81.41565 170.06033 163.69150 12309.80713
10.05000 -4426.57864 15.59229 -239.49800 186.75658 166.33083 14320.09065
10.15000 -4391.53284 11.34560 1114.48009 159.31950 141.04000 46430.55599
10.25000 -4356.46462 14.12326 97.05507 161.74700 136.21444 13458.43565
10.35000 -4327.22762 12.64591 -36.59302 192.04236 151.87046 8697.56479
10.45000 -4282.23213 12.71482 -255.43305 200.21584 126.93324 12014.70127
10.55000 -4252.44860 16.74191 203.11085 175.53729 143.15622 11695.69988
10.65000 -4208.80762 13.04516 -49.58148 185.90945 158.58033 9738.68313
10.75000 -4173.52779 14.11625 -180.52630 187.41683 130.73034 10676.01182
10.85000 -4142.68595 13.83018 85.05078 154.56183 161.91796 10813.39573
10.95000 -4109.87471 13.85274 115.88808 179.32732 160.59231 9745.94724
11.05000 -4073.90385 11.46546 483.21945 155.83052 139.30567 9408.05444
11.15000 -4044.18089 12.60454 203.01303 168.53617 161.71383 12606.31429
11.25000 -4010.47094 11.31948 -246.75933 167.51311 137.86371 7929.55677
11.35000 -3973.23229 7.01894 199.23719 187.22481 179.99876 7080.54530
11.45000 -3945.57276 13.18534 -106.03315 193.06345 182.15751 8096.83522
11.55000 -3918.95241 11.14515 -12.19700 125.77093 118.35789 9345.64547
11.65000 -3887.86460 9.93202 -27.76567 158.03083 133.86302 8514.28650
11.75000 -3848.82353 12.68838 -419.93766 138.53516 140.46010 8558.59860
11.85000 -3820.17547 12.33875 -45.87867 162.64125 126.04383 7376.62334
11.95000 -3794.27037 13.68715 263.32615 151.21879 126.34107 7470.85755
12.05000 -3758.34769 14.96518 -97.74527 158.19201 110.46845 7592.97944
12.15000 -3727.65904 15.17638 -27.26007 135.44852 103.96390 8194.77838
12.25000 -3704.19402 15.94787 37.02717 105.36851 94.75852 7603.61557
12.35000 -3680.28926 14.83592 -138.61422 125.87627 140.58455 8185.24945
12.45000 -3652.93768 16.63539 -147.24407 120.55835 86.38687 8766.84131
12.55000 -3623.91277 16.71091 31.29263 115.05301 84.53378 6505.58425
12.65000 -3596.71351 22.31928 98.72145 120.71024 135.62165 6785.89231
12.75000 -3578.65981 19.29577 55.62938 153.34870 134.07304 6773.84846
12.85000 -3551.01897 15.70645 -334.15306 135.16214 107.44811 6215.29063
12.95000 -3527.59564 19.38033 -135.45563 98.27975 73.38009 5862.35055
13.05000 -3493.37198 18.61554 -35.64508 95.97744 83.73377 7234.42092
13.15000 -3476.01158 19.34192 -160.23644 102.48812 81.50140 5475.66623
13.25000 -3452.26839 14.82760 -383.87276 88.12443 80.89595 5425.08819
13.35000 -3430.11055 17.98361 -210.87375 91.17618 86.62726 5279.50347
13.45000 -3404.59674 15.03916 -154.84935 107.76087 132.89182 6382.56779
13.55000 -3383.44365 18.55733 -36.33518 126.71683 123.87994 4890.92007
13.65000 -3363.57646 15.75899 -76.54864 87.66115 78.19959 5014.74799
13.75000 -3335.69048 17.76816 -43.17409 85.67226 73.04559 5306.28534
13.85000 -3311.54634 15.81209 -190.27381 100.26655 81.26596 5287.51865
13.95000 -3290.05236 16.10836 -155.28425 85.01362 78.01526 4638.25682
14.05000 -3265.02589 17.94693 -36.59876 133.41403 72.69994 5521.96729
14.15000 -3243.43611 15.52987 -68.25619 84.47347 86.97109 4514.36517
14.25000 -3221.06657 14.45759 -179.84781 91.51958 77.01953 4491.92292
14.35000 -3196.48491 15.73792 -106.43280 88.57162 71.89319 4570.65272
14.45000 -3173.52701 16.47332 -70.14696 71.69445 57.61352 4594.03872
14.55000 -3146.28444 10.34547 -233.45224 82.50744 74.92681 4762.42488
14.65000 -3132.08565 14.13454 -29.27534 67.30941 61.12166 4158.41407
14.75000 -3103.04389 12.70980 -177.52487 95.73961 94.11331 3528.85428
14.85000 -3080.89930 15.46767 83.16778 71.48433 80.41021 4645.13640
14.95000 -3063.05057 9.39021 -142.61473 71.33059 64.80926 8824.97702
15.05000 -3044.44466 12.05343 -72.90302 62.28957 76.25003 4165.64082
15.15000 -3024.97740 11.56247 -0.87009 64.19032 66.12705 3112.90334
15.25000 -3003.49431 16.69954 232.64409 66.44527 84.61793 3209.45023
15.35000 -2983.45407 15.31468 -37.23109 74.08038 70.37227 3166.54367
15.45000 -2962.51190 14.05551 -27.75029 54.87049 58.10147 3272.76657
15.55000 -2940.59349 10.57287 130.86691 64.67902 58.34565 3371.94453
15.65000 -2919.74743 10.50755 165.17217 55.45703 69.91378 4575.19208
15.75000 -2901.58171 11.22429 -33.18372 76.55083 66.45018 2774.21799
15.85000 -2879.15536 12.28576 18.18131 51.08378 52.99780 2611.90037
15.95000 -2859.48480 11.35714 196.75919 64.81512 58.40446 3239.79497
16.05000 -2841.60354 14.41223 120.87914 75.42787 75.69376 3535.75917
16.15000 -2825.04947 11.73634 46.44557 77.10249 61.84071 2341.79007
16.25000 -2804.91488 9.72405 17.06655 64.04921 55.21664 2064.54849
16.35000 -2781.73947 15.41868 63.48308 134.27669 92.66886 2266.24700
16.45000 -2773.25539 7.68862 -3.00208 75.39131 77.55712 2146.75008
16.55000 -2755.92928 13.71203 41.22506 63.54786 61.50121 2369.88797
16.65000 -2735.70290 8.24252 154.14384 59.70090 70.55282 1717.01930
16.75000 -2722.43443 13.38431 78.90676 61.03008 55.04974 2147.27165
16.85000 -2704.90957 6.37411 -243.09134 71.97043 83.21161 2574.88683
16.95000 -2685.67813 13.82834 55.80266 69.23113 81.65245 1725.88621
17.05000 -2666.15048 12.17443 108.45480 67.77454 55.71166 1964.72702
17.15000 -2647.61064 8.17053 271.55381 102.64002 81.80342 2916.14369
17.25000 -2634.83977 10.80829 108.30628 56.91459 58.67596 2030.37279
17.35000 -2619.90320 12.51877 70.53936 41.44109 42.34818 1782.85814
17.45000 -2600.64464 8.96964 -56.14778 82.97673 74.61735 2362.76364
17.55000 -2586.92421 8.72720 27.50160 54.44103 41.77386 1599.84714
17.65000 -2572.78254 11.60917 82.82450 100.26522 60.47817 1630.70892
17.75000 -2555.79540 10.58872 -43.30606 55.37786 42.70435 2223.13266
17.85000 -2540.54964 12.31970 22.50698 37.27795 46.73335 1529.81323
17.95000 -2524.97471 11.18391 123.26945 48.82224 47.40288 2790.60647
18.05000 -2509.40471 8.41275 17.61933 54.54587 49.86193 1490.19962
18.15000 -2488.78326 8.11879 2.26358 64.38813 50.53147 2480.84810
18.25000 -2479.08946 10.97261 85.93668 45.66576 43.81011 1079.54553
18.35000 -2462.35745 7.66752 2.31873 32.93478 42.61777 1613.71354
18.45000 -2443.13684 10.33786 54.04024 72.42888 41.45322 1103.59817
18.55000 -2430.37610 5.17171 -73.92721 61.57846 73.35484 1016.41402
18.65000 -2416.17793 11.09745 94.06997 48.28554 50.56166 1461.60313
18.75000 -2405.30663 10.41718 -201.57554 40.27174 63.43341 1448.71510
18.85000 -2387.50111 6.61909 117.40357 40.80559 39.87039 3173.60780
18.95000 -2375.10687 6.21367 3.38961 41.66694 34.91706 1338.65691
19.05000 -2360.88491 8.41613 50.29163 45.67935 40.42700 1546.54814
19.15000 -2335.94404 11.28749 20.78331 256.89756 88.84154 1161.98857
19.25000 -2337.78867 9.49317 53.08304 46.41369 48.58127 1475.24640
19.35000 -2316.77750 5.83953 -101.35218 32.55083 28.11573 1030.81610
19.45000 -2305.82929 11.53752 -70.33780 45.33294 49.33842 1036.45944
19.55000 -2296.12793 3.95984 4.00828 59.86927 68.01220 1240.06993
19.65000 -2270.05646 7.65637 -76.53870 102.63072 33.58839 1400.40270
19.75000 -2264.16813 11.36707 -39.40238 115.93517 82.44896 973.90348
19.85000 -2252.89586 5.32773 51.14011 42.96135 48.79876 1418.83371
19.95000 -2241.81714 4.58688 -128.84941 54.39605 103.74692 1222.67704
