0.05000 1648.13366
0.15000 2367.15026
0.25000 3293.00446
0.35000 4332.45430
0.45000 4644.25155
0.55000 4898.14440
0.65000 5416.00729
0.75000 5433.09936
0.85000 5575.58862
0.95000 5496.98983
1.05000 5447.35543
1.15000 5396.81099
1.25000 5383.24437
1.35000 5236.28868
1.45000 5109.76506
1.55000 5021.47226
1.65000 4831.97630
1.75000 4816.99404
1.85000 4624.50343
1.95000 4513.18893
2.05000 4407.99557
2.15000 4264.15700
2.25000 4183.41161
2.35000 4103.36744
2.45000 3961.34299
2.55000 3814.57804
2.65000 3778.88235
2.75000 3658.94506
2.85000 3540.71304
2.95000 3456.41575
3.05000 3379.56670
3.15000 3297.75580
3.25000 3227.41871
3.35000 3135.32417
3.45000 3063.59942
3.55000 2954.71004
3.65000 2891.79684
3.75000 2793.86421
3.85000 2750.58416
3.95000 2691.18480
4.05000 2600.28888
4.15000 2525.17743
4.25000 2474.44454
4.35000 2391.36518
4.45000 2362.51326
4.55000 2248.48310
4.65000 2245.98896
4.75000 2187.92632
4.85000 2125.71222
4.95000 2073.09462
5.05000 2002.79263
5.15000 1969.79733
5.25000 1886.81957
5.35000 1875.63279
5.45000 1842.56784
5.55000 1757.72612
5.65000 1752.99074
5.75000 1711.98994
5.85000 1684.17450
5.95000 1648.56018
6.05000 1586.91449
6.15000 1537.92466
6.25000 1521.72718
6.35000 1493.98098
6.45000 1453.96686
6.55000 1427.57033
6.65000 1388.43192
6.75000 1346.28331
6.85000 1321.42744
6.95000 1307.00997
7.05000 1267.60998
7.15000 1225.84066
7.25000 1204.57740
7.35000 1183.43951
7.45000 1164.96367
7.55000 1134.24603
7.65000 1096.49384
7.75000 1080.18995
7.85000 1058.11318
7.95000 1022.88678
8.05000 1013.86147
8.15000 1009.41439
8.25000 958.08274
8.35000 961.35383
8.45000 921.53513
8.55000 907.42250
8.65000 885.61531
8.75000 858.07291
8.85000 842.20757
8.95000 838.02751
9.05000 822.38739
9.15000 790.24143
9.25000 776.36052
9.35000 760.61197
9.45000 737.62754
9.55000 739.96709
9.65000 703.47130
9.75000 687.33632
9.85000 685.25769
9.95000 656.79515
10.05000 665.46081
10.15000 629.37202
10.25000 614.96807
10.35000 598.24810
10.45000 592.68140
10.55000 584.01078
10.65000 578.31506
10.75000 559.51494
10.85000 548.80030
10.95000 523.05177
11.05000 515.24920
11.15000 506.77674
11.25000 504.91783
11.35000 487.97876
11.45000 483.79872
11.55000 482.09457
11.65000 458.08469
11.75000 446.72980
11.85000 437.80203
11.95000 434.04379
12.05000 427.75782
12.15000 407.73578
12.25000 406.76452
12.35000 395.99194
12.45000 387.19394
12.55000 373.09292
12.65000 372.57540
12.75000 359.11637
12.85000 353.68520
12.95000 340.46868
13.05000 326.34812
13.15000 336.07631
13.25000 323.66521
13.35000 314.20549
13.45000 305.55769
13.55000 315.48234
13.65000 303.35613
13.75000 297.07320
13.85000 295.64798
13.95000 299.92168
14.05000 279.64356
14.15000 271.52495
14.25000 267.93786
14.35000 273.89441
14.45000 261.40843
14.55000 256.84839
14.65000 253.81157
14.75000 253.27661
14.85000 251.24910
14.95000 247.88180
15.05000 226.91812
15.15000 234.90371
15.25000 231.03653
15.35000 222.17385
15.45000 219.65450
15.55000 215.84973
15.65000 207.97484
15.75000 205.32978
15.85000 200.46969
15.95000 192.61448
16.05000 189.58795
16.15000 184.47463
16.25000 191.31593
16.35000 187.76886
16.45000 175.12760
16.55000 181.59692
16.65000 170.89589
16.75000 170.60040
16.85000 164.54276
16.95000 168.50630
17.05000 171.61620
17.15000 158.59961
17.25000 159.15517
17.35000 163.68811
17.45000 150.83631
17.55000 154.29462
17.65000 151.76315
17.75000 143.99797
17.85000 142.88661
17.95000 145.08966
18.05000 139.12917
18.15000 145.58418
18.25000 138.45987
18.35000 133.13664
18.45000 132.32781
18.55000 136.65780
18.65000 131.27541
18.75000 125.31757
18.85000 122.28667
18.95000 124.00530
19.05000 126.33194
19.15000 114.43690
19.25000 120.71522
19.35000 106.60485
19.45000 112.30599
19.55000 105.87646
19.65000 108.26010
19.75000 98.44815
19.85000 105.65986
19.95000 98.51845
