0.2 0.75854 21.51345 -0.3388 99.19989 96.77922 90.76265
0.6 -1.14553 44.21012 -0.67765 97.01178 88.44012 84.55508
1.0 0.6385 60.8637 0.74293 93.71252 80.93882 78.13319
1.4 -0.82435 73.43073 3.01481 91.47221 76.1219 73.77204
1.8 -1.50948 82.54682 2.66864 88.97056 70.48103 69.4641
2.2 -2.77512 94.95794 -8.40941 86.03897 66.86618 65.01107
2.6 -1.71968 104.29657 -10.68886 78.95332 63.91784 59.87462
3.0 -1.8008 114.78845 -6.56307 70.42431 63.18018 55.54403
3.4 -2.47432 125.40122 -0.81709 61.82829 58.69297 50.29293
3.8 -3.73188 134.34606 2.77302 54.45622 54.02368 45.82545
4.2 -4.55815 145.95303 4.43891 49.61031 49.62206 42.53491
4.6 -3.61967 158.07566 4.29872 45.81922 44.98679 39.70773
5.0 -1.59374 169.13746 2.63502 42.61592 39.24524 36.18076
5.4 -0.43325 174.82083 2.60362 40.42739 35.1861 33.65337
5.8 -0.7635 178.04987 1.75087 38.24982 32.05326 30.79547
6.2 -1.28396 179.58545 0.68951 36.29294 30.27342 28.97173
6.6 -1.79095 180.80508 -0.17417 34.52852 29.26036 27.35091
7.0 -2.62009 184.12004 -1.01205 32.82102 28.42902 25.89904
7.4 -1.38833 187.52849 -1.29022 31.33562 27.45078 24.62615
7.8 -0.69997 190.95056 -1.10427 30.44156 24.66319 23.0178
8.2 0.5573 192.96682 -0.38965 29.22045 22.39108 21.85187
8.6 2.02262 194.37089 0.13943 28.13523 21.35927 20.52899
9.0 1.94717 195.22103 0.18616 27.1189 21.75044 19.81182
9.4 1.73347 196.90223 0.48129 25.38621 21.57857 18.90059
9.8 0.86112 199.49004 0.5719 24.27888 20.87794 18.44598
10.2 0.76228 201.65708 0.54529 23.34715 19.60429 17.80473
10.6 0.60466 203.6394 0.46348 22.15959 17.6401 17.59335
11.0 0.04807 203.99372 0.50063 21.46616 16.15669 16.91987
11.4 0.22946 204.02897 0.53789 21.2117 14.92019 16.29589
11.8 0.65854 203.54784 0.21757 20.53217 14.22583 15.7378
12.2 -0.1863 202.90667 0.44936 20.25212 13.80794 15.16972
12.6 -0.40906 202.93849 0.52498 19.16722 13.83548 14.38663
13.0 -0.82137 202.72843 0.72053 18.78274 13.87598 13.80551
13.4 -1.182 203.18762 1.30669 17.64779 13.60563 13.06575
13.8 -0.62569 203.85693 1.59144 16.75603 13.54111 11.93607
14.2 -1.08622 204.33152 1.64583 15.66382 13.11183 11.71983
14.6 -1.00931 205.33283 1.01754 14.68183 12.2244 11.01826
15.0 -0.86929 205.73168 1.4015 14.41915 11.68262 10.56269
15.4 -0.28862 206.3062 1.13167 13.8902 11.22332 9.94902
15.8 0.02143 206.92781 0.88199 14.06456 10.51287 9.49964
16.2 1.0044 207.35398 1.10865 13.83267 10.07449 9.52307
16.6 1.22861 206.42443 0.93506 14.43277 9.72178 9.16389
17.0 1.06237 205.93751 1.32422 13.49672 9.08734 8.8454
17.4 0.74081 205.71367 1.54128 12.80016 9.16789 8.53048
17.8 0.01947 205.65422 0.68174 12.47768 9.09254 8.20405
18.2 0.54212 206.31293 -0.08708 12.08216 8.59779 7.92108
18.6 0.40811 206.75631 0.6309 11.45987 8.44481 7.30407
19.0 1.29969 206.46188 0.14784 10.72169 7.7587 7.32036
19.4 1.38204 205.48116 0.39684 10.51438 7.29737 7.12627
19.8 0.6296 205.72051 0.25812 10.58353 7.3035 6.60868
