0.125 0.000 0.000 0.000
0.375 0.000 0.000 0.000
0.625 -0.001 0.000 0.000
0.875 -0.000 0.000 -0.000
1.125 -0.000 0.001 -0.001
1.375 -0.000 0.000 -0.004
1.625 0.001 0.002 -0.001
1.875 -0.001 0.003 -0.000
2.125 -0.009 0.004 -0.006
2.375 0.000 0.000 0.003
2.625 -0.014 -0.019 0.003
2.875 -0.007 0.008 0.017
3.125 -0.002 -0.016 0.009
3.375 -0.000 -0.004 -0.002
3.625 -0.003 -0.003 -0.003
3.875 -0.020 0.008 0.012
4.125 0.010 0.016 0.016
4.375 -0.016 -0.009 0.017
4.625 -0.007 -0.023 0.010
4.875 0.003 0.001 0.014
5.125 0.008 -0.020 0.005
5.375 0.000 0.030 0.016
5.625 -0.005 0.028 0.004
5.875 0.010 -0.015 0.031
6.125 0.002 -0.013 0.037
6.375 -0.020 0.001 0.005
6.625 0.005 0.009 0.044
6.875 0.008 -0.003 0.036
7.125 -0.008 -0.036 0.013
7.375 0.007 -0.016 0.036
7.625 -0.012 -0.031 0.073
7.875 -0.004 0.010 0.034
8.125 -0.033 0.017 0.053
8.375 0.003 0.031 0.029
8.625 -0.035 -0.050 0.057
8.875 0.001 0.027 0.056
9.125 0.040 0.002 0.025
9.375 -0.001 -0.046 0.052
9.625 0.029 0.010 0.046
9.875 0.019 -0.001 0.026
10.125 0.019 -0.012 0.051
10.375 -0.033 0.013 0.088
10.625 0.033 0.049 0.083
10.875 0.043 0.018 0.025
11.125 0.016 -0.025 0.076
11.375 -0.029 0.018 0.021
11.625 -0.024 -0.021 0.084
11.875 0.011 0.002 0.060
12.125 -0.025 0.013 0.050
12.375 0.045 0.051 0.033
12.625 0.017 -0.039 0.058
12.875 -0.010 -0.005 0.067
13.125 0.050 -0.001 0.079
13.375 -0.015 0.069 0.084
13.625 0.017 -0.079 0.086
13.875 -0.016 -0.008 0.071
14.125 -0.014 -0.067 0.084
14.375 0.032 0.006 0.084
14.625 -0.009 -0.025 -0.006
14.875 -0.033 -0.002 0.008
