0.12500 0.02437
0.37500 0.02770
0.62500 0.01388
0.87500 0.01327
1.12500 0.01053
1.37500 0.00479
1.62500 0.01593
1.87500 0.01048
2.12500 0.02388
2.37500 0.00366
2.62500 0.02549
2.87500 0.03032
3.12500 0.00984
3.37500 0.01118
3.62500 0.01408
3.87500 0.00258
4.12500 0.02706
4.37500 0.01522
4.62500 0.00157
4.87500 0.00972
5.12500 0.01075
5.37500 0.01506
5.62500 0.00859
5.87500 0.01913
6.12500 0.03665
6.37500 0.02467
6.62500 0.01372
6.87500 0.03159
7.12500 0.00971
7.37500 0.02849
7.62500 0.01943
7.87500 0.02238
8.12500 0.01677
8.37500 0.02450
8.62500 0.00582
8.87500 0.01256
9.12500 0.01209
9.37500 0.03339
9.62500 0.02910
9.87500 0.01342
10.12500 0.03986
10.37500 0.01328
10.62500 0.03448
10.87500 0.02938
11.12500 0.01670
11.37500 0.04517
11.62500 0.03508
11.87500 0.01618
12.12500 0.01025
12.37500 0.04417
12.62500 0.03346
12.87500 0.07385
13.12500 0.03907
13.37500 0.03315
13.62500 0.05090
13.87500 0.02288
14.12500 0.03477
14.37500 0.02617
14.62500 0.04286
14.87500 0.03574
15.12500 0.08048
15.37500 0.08693
15.62500 0.06264
15.87500 0.03953
16.12500 0.03316
16.37500 0.05037
16.62500 0.05788
16.87500 0.06822
17.12500 0.05665
17.37500 0.05113
17.62500 0.03918
17.87500 0.00945
18.12500 0.04346
18.37500 0.05523
18.62500 0.05988
18.87500 0.08719
19.12500 0.09330
19.37500 0.08774
19.62500 0.00636
19.87500 0.05680
