0.05000 -1099.76327 125.22529 -994.38590 921.45543 1118.85815 1318.59016
0.15000 -2576.51897 -205.11714 16.80057 1963.18203 2529.96624 3685.96433
0.25000 -4254.64328 -133.66627 -40.28747 2841.04783 2569.16275 5082.69239
0.35000 -4698.09574 7.71802 309.92365 2029.38054 1779.52947 5136.13161
0.45000 -4878.13787 -15.63933 15.79758 1939.11455 1384.22246 5731.35281
0.55000 -5144.17218 20.19940 8.18064 1974.97821 1302.11410 5974.79316
0.65000 -5420.61972 17.23662 160.53264 1978.58857 1523.08255 6154.30220
0.75000 -5597.89441 19.39542 130.18879 1772.61426 1062.65749 6369.92708
0.85000 -5812.73956 8.44503 137.46588 1619.48600 939.29322 6326.90996
0.95000 -5933.72664 6.07112 -64.86088 1632.52903 901.61910 6383.67386
1.05000 -6074.65358 9.84101 -51.06605 1538.47199 889.72133 6373.06113
1.15000 -6158.37417 1.53858 135.78854 1599.04801 939.07807 6292.30192
1.25000 -6276.85797 -2.60565 -44.33289 1563.57804 859.13151 6211.26839
1.35000 -6344.18851 20.88541 166.83803 1516.80763 773.90854 6101.05613
1.45000 -6429.23851 21.62832 -64.66281 1459.09930 855.65126 6025.05898
1.55000 -6541.14000 19.89349 71.31483 1373.53750 868.01339 5846.93056
1.65000 -6645.79033 12.53431 52.40655 1327.17543 758.74992 5655.35342
1.75000 -6732.23896 10.46213 -93.54292 1304.77783 694.46624 5580.09193
1.85000 -6799.93568 16.33576 49.69938 1325.29279 819.83449 5402.59240
1.95000 -6915.81728 19.97537 22.86413 1220.74470 729.43238 5293.94569
2.05000 -6940.59029 20.33457 -41.61936 1204.08976 670.16905 5103.64012
2.15000 -6979.32333 28.14082 -147.06112 1068.51997 539.12296 4987.35596
2.25000 -7013.88484 9.55469 30.08926 1076.36951 725.09328 4868.57657
2.35000 -7016.40498 7.73445 74.11749 1028.40966 644.19299 4739.86521
2.45000 -7050.09230 16.32109 23.57349 995.48456 571.55372 4600.42367
2.55000 -7069.45944 7.83048 -9.25870 956.34558 587.00543 4485.63829
2.65000 -7079.63234 14.84831 -31.18586 877.81488 599.87176 4346.65992
2.75000 -7051.42817 16.61129 -43.57407 893.59086 530.17814 4316.66299
2.85000 -7087.20236 18.77324 64.49936 853.94109 582.05259 4121.10720
2.95000 -7071.20947 19.29555 32.03110 822.91415 550.59757 4055.40042
3.05000 -7039.06096 7.51511 -8.25623 781.38352 465.74326 3967.61351
3.15000 -7081.76805 10.41368 -31.88793 753.49436 467.86836 3803.80631
3.25000 -7042.67414 21.09380 -53.78197 758.72892 530.92035 3763.09128
3.35000 -7006.25802 17.91484 -5.35103 727.65304 465.21522 3700.26948
3.45000 -6997.33728 17.70119 18.70726 754.24093 443.17697 3575.37752
3.55000 -6992.11047 9.41425 -17.92063 750.55451 506.36351 3435.17406
3.65000 -6953.65012 13.34321 -17.27929 659.50613 480.12288 3404.31496
3.75000 -6911.62493 11.80539 2.08878 661.60595 469.43897 3355.29036
3.85000 -6899.02711 13.74963 17.30997 640.05134 452.90354 3225.02302
3.95000 -6884.18539 12.16176 8.53793 601.92188 440.49177 3158.76148
4.05000 -6863.87160 12.63398 102.25113 648.95348 454.64232 3068.11136
4.15000 -6832.35574 15.57286 -12.37462 583.90515 441.67263 2973.24429
4.25000 -6793.33710 16.18904 38.99642 600.10335 541.23952 2927.99264
4.35000 -6769.17614 7.21618 -14.83285 554.93043 514.22354 2885.49759
4.45000 -6730.25168 9.61802 -5.11910 524.91036 391.58822 2795.46567
4.55000 -6685.52725 9.92951 71.48634 517.44178 392.28381 2736.04037
4.65000 -6656.74146 10.73902 19.34843 499.85352 377.61918 2661.02126
4.75000 -6613.73045 15.29133 19.80168 483.19762 362.43758 2592.19938
4.85000 -6577.79987 8.90098 79.42797 619.80349 377.45985 2554.55602
4.95000 -6538.50197 14.82776 20.71604 531.31381 385.25761 2477.75496
5.05000 -6490.68177 22.81921 17.55196 506.42424 470.99081 2450.54158
5.15000 -6449.28850 16.06643 40.60143 474.74530 391.66140 2369.46951
5.25000 -6408.03333 8.50967 18.85255 455.19429 329.60622 2317.42045
5.35000 -6361.25382 9.49246 0.13767 474.79991 392.43107 2277.59664
5.45000 -6329.61813 20.32239 102.49180 493.34952 330.23341 2217.62200
5.55000 -6285.26414 1.46237 118.96450 423.03922 398.25403 2197.23883
5.65000 -6245.02247 6.99248 14.19190 455.90967 363.29751 2118.31423
5.75000 -6209.43083 6.32424 14.17688 392.28365 320.32874 2064.48716
5.85000 -6164.22074 8.93438 60.90134 383.12114 335.56731 2013.82347
5.95000 -6120.21227 1.26172 -37.15547 470.35470 310.39984 1988.56951
6.05000 -6073.69109 9.62272 70.92525 369.27239 378.18506 1920.92585
6.15000 -6022.64744 9.17533 -0.83316 407.01108 403.92618 1910.08258
6.25000 -5989.90176 9.77699 5.13700 367.37217 357.60122 1848.52750
6.35000 -5934.84865 3.12254 27.86018 374.69533 297.70190 1822.39669
6.45000 -5891.52738 5.10748 11.06800 381.22597 296.70335 1790.45499
6.55000 -5849.58212 7.94544 -26.85262 362.82412 306.99040 1722.14508
6.65000 -5796.67491 11.13141 1.85765 363.31034 283.66762 1702.77287
6.75000 -5774.15886 7.58391 17.04348 321.99004 329.38681 1679.62347
6.85000 -5733.42011 6.05540 22.55485 367.00051 412.21796 1645.17324
6.95000 -5698.31451 9.55238 44.55688 346.26133 284.65064 1609.26769
7.05000 -5659.14204 8.47487 4.91627 313.08696 275.01961 1542.32956
7.15000 -5620.02870 7.47465 5.94093 309.39980 277.61541 1532.23216
7.25000 -5590.54601 4.01620 -25.27101 291.03074 238.66249 1493.16933
7.35000 -5552.48804 2.44161 -8.24777 321.94104 332.62375 1489.94042
7.45000 -5523.67100 0.62301 -28.76415 338.80229 343.37029 1430.10215
7.55000 -5481.87531 5.41246 -5.43647 416.82896 260.80737 1405.98890
7.65000 -5457.33581 9.21263 -32.45537 321.19247 276.37744 1384.55212
7.75000 -5422.50107 7.52642 -32.93031 289.34449 378.62694 1359.10380
7.85000 -5395.43432 5.54871 -13.99459 300.83904 244.40311 1321.82184
7.95000 -5373.04449 7.20450 6.46869 410.02439 273.11817 1313.48476
8.05000 -5324.54579 10.48864 -37.80035 323.30861 249.05229 1282.33108
8.15000 -5288.78852 6.18696 -40.72876 268.05813 201.73435 1247.68414
8.25000 -5262.34703 0.04020 -29.76298 261.34875 367.33913 1209.28744
8.35000 -5213.19940 4.27605 -23.28622 258.01341 251.65851 1195.98058
8.45000 -5166.51176 3.98024 8.05672 252.14627 223.67731 1228.21662
8.55000 -5129.88826 1.11097 -13.09421 276.99634 226.69663 1154.30095
8.65000 -5094.44269 6.00566 -37.67577 256.13338 212.44284 1115.61880
8.75000 -5047.57334 8.99033 -40.55847 286.59403 209.27856 1099.09919
8.85000 -5013.65357 4.81569 -16.80352 271.89236 246.45464 1078.67280
8.95000 -4970.19205 4.10293 -8.93054 229.24072 192.72079 1051.00365
9.05000 -4931.07501 3.92557 -31.19178 242.73413 198.09747 1020.07819
9.15000 -4888.83113 11.29366 -6.78472 299.10896 356.26556 1009.91796
9.25000 -4857.96205 6.42555 -17.60547 220.86567 230.16302 983.44743
9.35000 -4816.24646 4.15080 -19.18251 218.13190 225.15477 970.85269
9.45000 -4783.67413 7.97510 -4.60637 330.74091 272.22381 952.07539
9.55000 -4756.93813 6.89158 -8.88306 261.22435 228.26736 943.31629
9.65000 -4723.76611 0.22962 13.57522 249.58469 190.98732 913.48437
9.75000 -4692.99611 6.61330 -28.31949 218.61669 159.96328 863.56248
9.85000 -4664.21948 4.20469 -6.24940 185.35720 180.43525 859.09617
9.95000 -4632.23729 2.40912 -18.82816 268.95240 242.85152 859.06915
10.05000 -4592.06124 9.18136 -38.75568 487.84051 350.12374 854.57347
10.15000 -4556.23657 5.59255 -25.75792 246.00290 261.78226 832.21339
10.25000 -4532.94182 2.98707 -17.26576 166.57045 158.95512 787.18139
10.35000 -4493.96409 8.87220 -16.29945 175.13828 140.05658 783.31364
10.45000 -4466.16158 0.57321 -18.62957 181.05012 183.11804 784.11537
10.55000 -4430.23294 -0.35775 1.41999 270.56724 163.65690 778.56343
10.65000 -4392.24644 1.33351 -15.43775 179.14657 136.77614 727.69333
10.75000 -4350.80122 1.75613 -13.82020 141.26176 113.15994 715.98953
10.85000 -4314.51185 2.17363 7.46071 140.68656 135.78107 698.50345
10.95000 -4279.63282 3.51470 -14.33103 167.17356 110.53396 714.39967
11.05000 -4239.05946 4.08748 -5.46210 183.07137 141.45249 705.73357
11.15000 -4191.08153 1.72123 -25.15342 288.71108 207.11281 704.42075
11.25000 -4158.87074 4.22288 -15.62630 138.38446 150.78109 635.30404
11.35000 -4124.95799 3.89288 -39.70867 133.30929 118.50112 623.25510
11.45000 -4085.06905 5.99006 -2.58643 164.56958 132.71219 610.40650
11.55000 -4053.82551 4.85789 -18.11600 265.29988 119.95987 609.28540
11.65000 -4009.81911 2.42300 -44.14134 162.03151 156.82341 600.00763
11.75000 -3978.48548 5.48121 10.40533 141.83694 127.29338 579.89774
11.85000 -3949.29926 3.20194 -22.33014 158.74543 146.55048 554.63927
11.95000 -3916.70107 2.73414 -11.43574 182.16887 115.54115 550.60807
12.05000 -3886.67084 4.89076 -26.05743 224.30818 173.89300 536.26695
12.15000 -3859.99637 4.34883 -25.31993 119.86850 133.19731 540.97428
12.25000 -3832.97687 3.02860 -10.91728 109.58339 110.44447 519.16862
12.35000 -3805.35074 4.30010 -30.24900 152.83647 193.69928 515.00592
12.45000 -3786.80370 6.47357 -15.54123 181.54690 242.87456 583.69790
12.55000 -3762.08663 0.41338 -3.01330 156.33583 136.97324 514.80789
12.65000 -3738.76085 5.04046 -13.90259 114.99087 134.91126 500.31574
12.75000 -3713.40335 5.75404 -15.61513 126.18131 166.34293 486.93800
12.85000 -3696.17000 3.54604 -5.47964 104.05020 157.67713 476.65909
12.95000 -3674.12099 -1.33627 -23.72645 147.89317 125.67971 468.68682
13.05000 -3648.77896 3.53913 -8.54432 196.55400 144.01372 461.45665
13.15000 -3623.53211 10.52127 -10.60434 258.90543 323.43269 568.27621
13.25000 -3602.82440 1.11708 -8.34224 105.96331 98.51461 429.48951
13.35000 -3590.30681 -2.08721 -7.97676 250.98463 353.55687 476.24288
13.45000 -3559.89365 2.65528 -5.49310 129.85779 131.77814 460.38388
13.55000 -3538.35080 2.89682 -8.52231 143.52378 100.77328 421.22326
13.65000 -3515.79807 6.38704 11.19541 137.92530 182.36941 443.30485
13.75000 -3490.97613 10.58713 -5.98279 239.73581 460.30129 423.90886
13.85000 -3468.60965 5.64902 -10.48201 105.04522 116.85849 405.58960
13.95000 -3449.10853 1.11882 -11.89700 93.35034 125.84718 397.32731
14.05000 -3417.18991 2.77174 -13.59564 164.51331 137.07295 395.44100
14.15000 -3397.67039 6.23928 -26.22026 167.72870 148.57306 419.84136
14.25000 -3370.00485 4.98218 -29.57876 123.71370 153.20337 422.61421
14.35000 -3352.35846 3.01946 -14.06407 106.26651 84.83021 381.47065
14.45000 -3327.45292 2.38653 -40.01387 163.14507 103.93268 364.57376
14.55000 -3301.68902 -0.74662 -29.24865 121.05688 97.88657 360.05594
14.65000 -3276.63271 1.54294 -16.95917 105.00804 82.49664 344.83855
14.75000 -3251.99196 -1.35570 -26.92980 108.75783 159.79251 354.49699
14.85000 -3226.76587 4.26986 -59.32717 68.32597 61.45070 324.51233
14.95000 -3204.51043 2.64754 -52.81181 87.73573 59.69413 346.77828
15.05000 -3178.89156 3.40936 -25.45619 68.24636 67.02724 313.35763
15.15000 -3152.22324 0.00003 -31.53016 81.51773 78.29611 313.17122
15.25000 -3133.96329 4.09921 -58.36290 69.09842 114.24317 375.19745
15.35000 -3104.91914 14.93352 -49.27197 89.69878 423.78475 299.63600
15.45000 -3088.61021 0.71678 -45.45541 97.88870 72.64596 288.24984
15.55000 -3058.71993 1.49826 -45.87813 122.31685 97.95958 286.43488
15.65000 -3042.57845 1.06009 -56.91156 101.89751 67.33316 278.06061
15.75000 -3019.78941 4.79376 -48.07781 126.06124 98.05542 273.04194
15.85000 -3001.05131 2.78729 -46.03651 57.70392 61.73810 264.41807
15.95000 -2978.32354 -1.15674 -50.36727 104.81514 183.31966 273.50067
16.05000 -2954.26883 -0.39548 -50.45408 71.44687 61.89678 258.16964
16.15000 -2941.17472 2.60885 -43.34935 112.91093 84.21786 251.18586
16.25000 -2921.32511 -0.20486 -42.18443 59.11219 68.62483 249.24578
16.35000 -2907.38403 3.13968 -48.97861 138.05003 89.16308 253.65719
16.45000 -2884.43350 0.58004 -29.80971 117.95080 53.46708 270.25799
16.55000 -2866.27625 0.89940 -46.75836 65.42820 56.82746 238.05440
16.65000 -2849.34616 3.01904 -39.87223 62.99607 64.14192 233.25086
16.75000 -2835.06687 1.14162 -35.02013 137.36459 108.12763 232.02374
16.85000 -2816.73364 -3.67154 -35.53162 98.33124 118.71269 224.59366
16.95000 -2801.38724 2.94799 -29.96416 76.13211 82.59858 235.46936
17.05000 -2785.73669 2.54906 -20.40502 52.26391 50.76935 212.12165
17.15000 -2773.46048 5.25008 -32.46088 125.68195 67.39212 212.72588
17.25000 -2753.42080 1.19306 -25.74115 109.93829 68.22588 205.50699
17.35000 -2719.95480 11.48330 -29.11783 385.58546 293.53870 225.20107
17.45000 -2722.38571 1.50382 -15.85461 151.68282 235.01586 198.99185
17.55000 -2702.09066 -0.71974 -27.24799 101.49986 79.82175 203.06948
17.65000 -2676.86419 4.64816 -16.45523 161.94311 105.67337 205.91423
17.75000 -2662.99009 1.36909 -23.06500 106.20429 63.20022 193.82421
17.85000 -2646.12283 -1.02258 -6.84242 70.61611 50.54401 203.47420
17.95000 -2631.10115 0.06016 -17.14123 52.97919 74.62113 188.65944
18.05000 -2616.16443 0.24584 -20.59627 48.89826 57.20070 187.49875
18.15000 -2598.37392 -4.07673 -18.71554 67.24229 77.28102 182.78879
18.25000 -2582.05199 -0.23565 -18.82859 37.94948 41.43826 180.30770
18.35000 -2563.49567 2.42334 -15.78852 56.20985 40.92667 177.30706
18.45000 -2545.40362 0.05124 -3.92906 51.09838 40.68766 175.26794
18.55000 -2534.59486 0.68892 4.23377 76.83858 49.20402 396.91170
18.65000 -2519.01650 1.32824 -11.68466 41.88186 45.84187 172.92978
18.75000 -2503.30558 1.19778 -26.31978 50.28787 52.77674 170.21518
18.85000 -2486.06024 -1.65689 -16.73355 73.01411 112.33517 168.45271
18.95000 -2471.06643 1.49672 -28.48582 45.45632 38.80873 157.32086
19.05000 -2457.96996 0.79023 -33.34779 196.70686 62.30844 166.25029
19.15000 -2441.94598 -11.49877 -15.86172 138.51926 431.37231 443.51568
19.25000 -2429.87378 2.44117 -33.58004 77.83948 36.92043 167.34633
19.35000 -2419.05796 6.01765 -13.45691 74.44158 125.34400 337.54178
19.45000 -2404.14382 -2.08875 -30.77874 58.38554 101.93982 160.05677
19.55000 -2391.61851 -1.61175 -21.61972 73.34019 46.66809 156.04055
19.65000 -2377.11271 2.71668 -28.90662 81.88109 53.45581 155.34260
19.75000 -2371.41604 1.22851 -27.46925 84.04230 47.95724 147.44375
19.85000 -2353.73787 0.26005 -32.29056 128.99142 53.90644 184.37998
19.95000 -2344.09437 1.66796 -28.40444 63.37067 46.83893 151.86691
