0.05000 836.82407
0.15000 1345.52025
0.25000 1951.91632
0.35000 2581.92289
0.45000 3190.84083
0.55000 3530.11761
0.65000 3755.84578
0.75000 4126.87344
0.85000 4288.08612
0.95000 4377.32163
1.05000 4493.53185
1.15000 4587.56575
1.25000 4501.85757
1.35000 4524.30928
1.45000 4534.87464
1.55000 4393.57549
1.65000 4381.08329
1.75000 4357.23438
1.85000 4275.20578
1.95000 4198.84883
2.05000 4156.99810
2.15000 4025.00370
2.25000 3959.49453
2.35000 3892.72183
2.45000 3760.64870
2.55000 3799.57357
2.65000 3651.87076
2.75000 3602.30560
2.85000 3516.89547
2.95000 3430.81479
3.05000 3294.49856
3.15000 3314.52320
3.25000 3167.11098
3.35000 3148.82319
3.45000 3051.14655
3.55000 2995.78770
3.65000 2926.11371
3.75000 2840.30016
3.85000 2781.97339
3.95000 2747.33092
4.05000 2649.70663
4.15000 2597.86963
4.25000 2548.24815
4.35000 2470.88307
4.45000 2406.78406
4.55000 2344.39472
4.65000 2303.23295
4.75000 2240.30138
4.85000 2216.10380
4.95000 2146.87576
5.05000 2092.04208
5.15000 2049.38162
5.25000 2000.59488
5.35000 1961.79552
5.45000 1898.01884
5.55000 1886.01164
5.65000 1841.18935
5.75000 1816.68155
5.85000 1726.46444
5.95000 1701.92658
6.05000 1677.72660
6.15000 1644.41732
6.25000 1583.47898
6.35000 1572.74020
6.45000 1527.73263
6.55000 1496.61494
6.65000 1465.83810
6.75000 1435.49980
6.85000 1391.85946
6.95000 1369.19876
7.05000 1329.52118
7.15000 1315.62979
7.25000 1284.62784
7.35000 1249.15528
7.45000 1217.67680
7.55000 1194.07961
7.65000 1146.57714
7.75000 1139.46262
7.85000 1109.77594
7.95000 1098.34900
8.05000 1074.99880
8.15000 1044.44787
8.25000 1038.21860
8.35000 1017.75234
8.45000 993.04210
8.55000 972.31444
8.65000 938.98548
8.75000 909.97056
8.85000 894.38869
8.95000 893.90542
9.05000 867.91768
9.15000 851.41328
9.25000 829.63959
9.35000 817.83323
9.45000 806.11951
9.55000 771.40161
9.65000 776.34666
9.75000 742.37340
9.85000 742.74960
9.95000 728.66270
10.05000 705.60369
10.15000 696.95619
10.25000 669.15809
10.35000 672.04828
10.45000 652.26434
10.55000 630.49220
10.65000 622.14549
10.75000 616.10667
10.85000 602.37040
10.95000 580.73819
11.05000 571.14365
11.15000 561.24954
11.25000 546.52917
11.35000 532.73112
11.45000 530.88554
11.55000 518.00064
11.65000 501.63783
11.75000 490.79269
11.85000 475.99743
11.95000 476.82965
12.05000 468.68858
12.15000 470.76904
12.25000 449.27715
12.35000 443.52539
12.45000 430.04810
12.55000 427.77967
12.65000 408.55991
12.75000 400.68477
12.85000 404.17045
12.95000 382.40242
13.05000 386.38449
13.15000 382.27940
13.25000 368.02018
13.35000 360.81708
13.45000 351.03550
13.55000 343.64628
13.65000 340.29388
13.75000 334.42159
13.85000 332.28373
13.95000 331.37922
14.05000 320.75889
14.15000 316.11446
14.25000 296.69201
14.35000 294.52759
14.45000 295.99817
14.55000 291.36855
14.65000 284.78983
14.75000 272.03883
14.85000 276.16354
14.95000 265.08573
15.05000 261.62719
15.15000 259.20099
15.25000 263.42746
15.35000 252.02431
15.45000 239.87736
15.55000 230.70112
15.65000 233.33033
15.75000 226.33968
15.85000 228.81640
15.95000 221.27992
16.05000 215.47858
16.15000 213.76446
16.25000 207.35425
16.35000 204.40252
16.45000 202.17954
16.55000 199.52467
16.65000 188.68452
16.75000 191.65618
16.85000 186.42886
16.95000 187.91691
17.05000 174.22723
17.15000 168.34568
17.25000 174.04914
17.35000 167.74568
17.45000 172.29113
17.55000 154.62451
17.65000 165.49149
17.75000 155.53869
17.85000 162.52715
17.95000 153.04845
18.05000 154.76784
18.15000 152.55477
18.25000 147.04311
18.35000 150.08649
18.45000 140.50472
18.55000 140.21582
18.65000 143.92834
18.75000 138.77859
18.85000 137.84615
18.95000 131.11764
19.05000 138.39512
19.15000 128.32772
19.25000 129.94058
19.35000 125.00844
19.45000 117.81856
19.55000 113.18125
19.65000 126.83215
19.75000 116.14638
19.85000 118.16865
19.95000 110.33731
