0.05000 -6433.01651 -1098.82869 369.78474 14941.31384 18462.74641 12609.20575
0.15000 -15119.25454 -377.72664 -1341.81015 11302.32560 13880.58976 17209.32562
0.25000 -17867.99198 -373.19195 -100.47175 7678.43715 9412.07082 17729.36057
0.35000 -17238.29046 80.75512 221.74710 6734.99975 6232.11162 16684.10505
0.45000 -16624.98915 -115.77687 -31.51466 5567.52717 4542.44295 15164.96714
0.55000 -15199.23709 102.62594 168.35560 5091.25487 3492.98518 13937.37757
0.65000 -14347.04698 24.35749 262.44929 4654.63015 2912.71628 12894.29551
0.75000 -13653.45776 65.08328 93.84346 4246.24002 2645.49917 12040.57929
0.85000 -12907.39674 94.66665 155.89681 3732.10541 2254.26710 11385.07183
0.95000 -12356.45949 63.97197 102.55716 3435.75718 2097.64038 10616.19273
1.05000 -11786.46481 21.48954 93.55710 3288.02729 1933.82538 10089.50873
1.15000 -11554.10273 53.42334 8.59284 2981.46345 1885.34752 9339.02678
1.25000 -11054.38456 55.82785 -75.45260 2787.90073 1818.92755 9019.27309
1.35000 -10755.37769 35.86534 -52.25111 2578.53514 1689.83190 8438.14955
1.45000 -10455.10181 18.00554 -26.37156 2404.65969 1637.68393 7959.02482
1.55000 -10152.63365 54.57302 45.69009 2247.41725 1580.69307 7627.63306
1.65000 -9855.86226 -12.43826 -50.76233 2140.36725 1556.39530 7384.12731
1.75000 -9661.35072 43.62447 -40.20586 1997.58593 1479.79680 7045.13707
1.85000 -9404.21225 48.35739 -20.46223 1931.21667 1413.57276 6779.74268
1.95000 -9181.10283 36.89214 -65.37622 1822.93444 1385.80435 6479.13551
2.05000 -9009.35522 39.11049 -61.43551 1647.99347 1364.18764 6183.70319
2.15000 -8781.10572 7.37845 38.42122 1575.20157 1338.48262 6017.49983
2.25000 -8619.52104 18.07876 129.89150 1435.16082 1248.07672 5757.57451
2.35000 -8467.69856 46.75438 25.74250 1329.53654 1252.06874 5573.83323
2.45000 -8273.72405 59.08916 130.09711 1360.63838 1193.81623 5439.54199
2.55000 -8150.46490 48.55068 -36.19632 1184.92861 1183.81703 5268.23309
2.65000 -8016.98085 6.47024 46.09670 1147.73613 1142.95574 5068.14498
2.75000 -7866.94356 1.19620 -28.73563 1144.17081 1207.27496 4926.30923
2.85000 -7757.93267 36.01091 13.24173 975.25068 1083.82070 4720.42049
2.95000 -7639.03012 17.13884 -12.30925 935.79694 1047.28667 4529.96478
3.05000 -7531.05102 24.69602 22.49679 865.30576 1065.92073 4446.90447
3.15000 -7440.56527 2.06904 -11.06480 834.29245 1003.59694 4258.65559
3.25000 -7354.18778 25.15127 69.55193 818.89584 1012.23000 4161.34306
3.35000 -7273.65477 1.69484 -40.04508 807.95997 962.46331 3991.36966
3.45000 -7175.60144 -6.61945 20.87415 729.11314 932.67199 3874.99054
3.55000 -7094.50178 16.81665 -88.39575 708.46204 916.24738 3716.12660
3.65000 -7044.39599 15.16781 -18.94881 759.19900 913.40999 3613.18646
3.75000 -6961.15338 39.67670 65.26024 680.00947 894.20844 3503.49929
3.85000 -6899.86777 13.51756 43.90021 661.97559 814.80798 3379.68375
3.95000 -6842.76421 -4.75175 -77.42319 638.09586 811.47659 3305.60974
4.05000 -6792.77912 12.66946 -38.46368 608.47814 817.82069 3234.79441
4.15000 -6757.04008 8.96690 10.54326 663.31613 758.17080 3106.39541
4.25000 -6692.38945 13.51636 -2.03831 647.01037 731.87443 3071.36887
4.35000 -6652.13704 3.62905 13.60635 622.20009 731.50429 2987.69962
4.45000 -6624.37853 17.06945 -22.22119 644.63188 767.03542 2914.16789
4.55000 -6571.98548 -3.82414 7.90526 635.61226 702.17330 2827.43804
4.65000 -6535.58817 4.60226 -5.47273 578.95703 610.98516 2764.63190
4.75000 -6481.89204 12.84046 -41.96740 622.96749 704.59263 2711.43314
4.85000 -6449.41597 -0.18704 6.82732 611.86882 640.91763 2642.60166
4.95000 -6406.67736 4.30909 27.13766 647.82069 584.82494 2581.99854
5.05000 -6372.35981 11.18197 -35.87198 593.12969 564.06174 2539.33431
5.15000 -6322.86276 0.93145 -41.29694 570.24122 513.29552 2469.04270
5.25000 -6288.22450 10.12665 -25.76974 526.57092 522.25977 2390.77005
5.35000 -6255.95476 6.76477 -1.57076 597.19086 523.44788 2355.30850
5.45000 -6207.48182 4.46911 3.30598 628.40211 531.68018 2324.15058
5.55000 -6192.23623 0.86482 -10.32750 506.61945 532.43421 2253.60808
5.65000 -6181.20445 17.51049 -8.77180 508.77542 454.72756 2170.19477
5.75000 -6133.35552 0.45793 -38.07628 468.46199 428.59031 2175.55391
5.85000 -6101.84236 -0.28559 5.23384 482.81235 470.94235 2122.64205
5.95000 -6091.00026 11.58630 20.50983 466.52665 390.02704 2082.96069
6.05000 -6052.69007 3.66694 -9.69590 488.70274 471.12382 2067.71128
6.15000 -6038.90490 9.74271 -41.94447 506.49812 415.19860 1989.25527
6.25000 -6018.37908 7.70186 -25.11072 468.49687 392.62147 1964.78892
6.35000 -5995.83644 7.78435 -17.43074 452.99287 473.55749 1919.16268
6.45000 -5965.73480 0.26509 -26.64431 424.81866 349.86659 1880.28814
6.55000 -5942.16522 8.44724 10.54470 489.04392 394.68721 1841.59191
6.65000 -5923.57392 12.45324 -14.68695 406.92116 354.31554 1789.07010
6.75000 -5896.17335 2.63477 -31.81996 385.21369 405.77210 1756.06023
6.85000 -5865.12233 13.51842 -12.33025 392.51650 319.59769 1724.59209
6.95000 -5839.72122 3.86227 -20.48210 482.32733 427.31620 1689.35292
7.05000 -5807.80276 12.55005 -26.16403 390.69402 271.81357 1658.38810
7.15000 -5781.96995 13.09896 -0.12103 417.26255 325.81846 1631.85841
7.25000 -5763.39825 9.80001 -2.96647 341.08327 332.11589 1556.91957
7.35000 -5730.06842 5.23496 37.87870 521.80464 330.39040 1559.90082
7.45000 -5697.37390 3.97207 -7.89587 361.58135 318.86557 1514.59900
7.55000 -5656.54408 7.75685 -20.79031 338.16536 263.61353 1476.32920
7.65000 -5632.02542 6.94779 -16.98414 330.77856 311.18718 1428.89061
7.75000 -5587.32698 0.19694 -1.06663 358.50473 353.15749 1437.12930
7.85000 -5547.90989 6.36030 14.18903 326.84249 258.12636 1390.05347
7.95000 -5526.81031 4.53038 -5.20975 314.78554 250.81470 1340.27151
8.05000 -5482.03853 10.44859 26.17793 333.10381 234.17177 1312.52836
8.15000 -5449.23191 8.13422 -21.03124 336.21252 272.15530 1293.66396
8.25000 -5422.98436 9.82265 -7.94381 285.01367 257.75811 1258.09722
8.35000 -5389.95127 6.17175 -8.70452 324.71294 257.30012 1225.43787
8.45000 -5347.90203 10.48165 -0.88488 281.58889 226.67632 1195.78873
8.55000 -5287.17786 14.45170 -1.81957 546.18881 374.16963 1181.66928
8.65000 -5254.47992 4.84517 32.98136 344.22853 258.16272 1155.90435
8.75000 -5211.93902 5.67221 28.40455 284.21330 265.92715 1103.83720
8.85000 -5172.21035 6.06004 3.49090 296.52286 237.13460 1101.82525
8.95000 -5123.22700 6.44675 21.49934 324.23042 200.98412 1084.13433
9.05000 -5076.61684 3.81417 -17.81102 347.13326 236.42359 1051.76409
9.15000 -5031.15728 7.51228 -3.45475 288.74241 211.01949 1036.66581
9.25000 -4996.43886 4.23853 26.21233 236.87157 183.80585 980.54658
9.35000 -4961.00961 6.42038 -13.85691 223.33942 191.60559 960.14115
9.45000 -4921.29603 13.92822 1.28862 205.31076 178.14730 928.92112
9.55000 -4874.84390 5.75782 15.67899 204.86364 152.34703 931.37920
9.65000 -4828.11721 11.20206 -11.05516 293.76763 283.75024 913.80265
9.75000 -4796.41416 6.25510 -21.33005 238.21505 194.67626 923.60271
9.85000 -4749.34327 4.80852 -29.35937 224.59908 217.82068 889.54115
9.95000 -4709.42868 3.02511 -22.00603 319.46778 285.34645 869.59917
10.05000 -4678.32986 -11.63370 -7.10109 363.98391 568.92701 857.05038
10.15000 -4640.08300 4.82723 4.03144 195.55318 152.68970 814.67008
10.25000 -4594.25144 5.78915 -1.18648 241.84144 148.79675 822.19684
10.35000 -4560.57536 3.07464 6.71772 175.38872 178.94365 783.46671
10.45000 -4518.28392 0.80532 -15.62079 189.41436 149.43079 771.40755
10.55000 -4476.14438 7.33124 9.96197 301.28431 238.76973 779.12972
10.65000 -4442.59715 -0.48296 2.00091 200.07914 187.10656 721.96507
10.75000 -4400.19025 7.56002 -6.48351 174.31788 149.11847 718.94630
10.85000 -4365.56465 8.52378 9.97300 192.94710 191.92369 679.33513
10.95000 -4325.98058 3.43195 -5.05254 179.87937 179.88032 680.58502
11.05000 -4290.65948 3.86540 9.73698 247.49500 198.12994 671.80957
11.15000 -4255.23005 2.27492 -7.29154 159.79840 127.26164 658.39145
11.25000 -4218.92802 8.14601 26.77940 130.25710 102.79654 637.73998
11.35000 -4175.48348 2.10457 20.43079 143.81841 98.78538 632.27676
11.45000 -4144.73670 5.95674 -2.76756 152.40744 154.25541 614.39537
11.55000 -4115.04587 2.64031 -0.14179 183.39952 169.84420 626.82477
11.65000 -4086.53957 3.31116 9.62154 320.30207 181.80665 593.39078
11.75000 -4044.45152 5.77486 4.80919 149.60047 140.39736 576.00989
11.85000 -4015.71411 6.34066 12.49499 144.86624 164.29016 580.91155
11.95000 -3981.87670 4.74068 5.83043 152.10517 132.69377 570.05068
12.05000 -3954.04365 0.11829 -17.71937 316.73087 217.33871 577.03713
12.15000 -3916.08586 -1.52687 8.39685 146.14054 135.88870 550.96495
12.25000 -3888.71283 7.49385 4.65178 193.49213 125.76598 546.64515
12.35000 -3857.78533 1.77558 -5.87916 128.78722 111.46814 524.50753
12.45000 -3837.78307 5.08853 3.77353 168.59487 144.78889 514.93794
12.55000 -3804.01266 0.81456 9.00824 154.38767 208.23067 558.55721
12.65000 -3777.36945 0.61406 0.01732 135.14506 299.09875 496.16153
12.75000 -3745.47047 2.08880 -2.61136 127.20222 102.38406 504.66607
12.85000 -3726.02628 4.40882 -15.80450 150.73725 124.54880 485.58656
12.95000 -3696.53000 4.20753 7.39528 113.10723 102.88712 463.90621
13.05000 -3666.65156 0.07636 3.14610 114.64338 104.33202 475.67588
13.15000 -3644.24869 3.09411 6.75303 115.10053 88.45682 441.93665
13.25000 -3623.46275 8.13624 -20.75108 150.21875 218.18407 448.33585
13.35000 -3591.23486 0.56795 -13.94599 119.56309 109.28531 460.06473
13.45000 -3575.43427 6.76634 -10.46956 280.01265 134.85298 439.54324
13.55000 -3545.58414 0.60628 -21.39572 147.93408 163.61055 427.44983
13.65000 -3518.29459 3.50400 -1.57128 110.40454 119.53996 422.09439
13.75000 -3493.43819 0.90832 -18.12435 103.55374 134.13930 408.33956
13.85000 -3469.09348 1.58729 4.57590 111.60195 109.64260 402.62970
13.95000 -3446.32296 2.94478 -0.94378 123.39008 98.35378 425.85097
14.05000 -3420.41167 4.09014 -15.76091 90.63702 71.21128 387.06534
14.15000 -3395.30492 3.98639 -7.12143 113.92478 116.14936 391.40607
14.25000 -3373.86535 2.48598 -9.79177 94.00055 74.76206 374.16781
14.35000 -3350.25813 0.91064 -12.55536 114.24021 84.40376 369.43559
14.45000 -3323.74995 5.30128 -14.10043 156.57895 122.96081 363.50803
14.55000 -3301.16522 4.96735 -0.02278 207.17305 72.62858 360.64792
14.65000 -3280.18643 2.84142 -2.55220 85.89561 76.08767 354.82592
14.75000 -3254.70370 6.09836 -17.24443 134.24665 143.10843 345.23530
14.85000 -3232.75933 1.32244 -17.52184 77.36964 79.45794 343.52958
14.95000 -3217.83973 4.33386 -7.89184 157.92194 85.02400 335.45085
15.05000 -3190.74323 1.11864 -14.12302 128.83394 113.51398 332.16406
15.15000 -3169.64172 2.36803 -14.55590 83.14975 62.57132 321.74843
15.25000 -3149.84580 2.06799 -10.95966 158.62845 85.21984 326.82752
15.35000 -3126.88157 4.52393 -1.89689 78.92480 95.05206 305.10899
15.45000 -3104.68338 4.64922 -0.08373 172.66253 248.33320 336.88825
15.55000 -3085.73664 1.59212 -2.55595 59.88140 53.66076 296.94957
15.65000 -3067.75263 5.62030 -18.97494 94.66154 66.29044 285.61757
15.75000 -3050.76268 -0.02711 -14.81733 105.26185 76.90334 290.36664
15.85000 -3027.42934 6.21332 -5.36458 100.41346 150.54664 314.08737
15.95000 -3008.38621 -0.17662 -18.91761 109.87013 68.84832 304.16360
16.05000 -2986.49586 5.13712 -15.50828 72.18196 97.60291 293.00832
16.15000 -2974.97408 -4.24648 -11.76603 170.43310 155.35404 273.71341
16.25000 -2950.27920 2.19623 -7.43859 99.86236 75.00516 267.19065
16.35000 -2931.14747 -0.77462 -8.36783 75.86271 84.83602 290.61356
16.45000 -2905.88434 3.35136 -1.88427 274.34570 77.15011 264.38238
16.55000 -2891.35392 2.59638 -2.28506 114.74412 108.29378 264.23908
16.65000 -2878.79073 -1.02379 -0.37283 109.76695 93.84296 253.25133
16.75000 -2853.56812 5.44805 -0.85469 117.72584 85.02662 276.74505
16.85000 -2842.44926 -0.51374 -13.54345 59.61348 62.44647 244.34137
16.95000 -2828.09187 -0.07551 -13.37355 75.88264 62.99749 238.97100
17.05000 -2809.62765 0.02643 6.67241 66.76514 78.21873 232.07002
17.15000 -2792.28136 0.49690 -8.45707 83.86717 82.58664 273.70420
17.25000 -2768.87724 2.98255 -0.74800 81.58912 141.55733 229.52843
17.35000 -2754.75011 1.46157 6.36545 81.89511 97.16385 235.19236
17.45000 -2735.20171 -1.17581 6.95075 85.59050 98.49564 271.30213
17.55000 -2716.28907 1.56455 7.21988 90.77207 76.64307 237.14186
17.65000 -2705.10354 1.03648 -1.35768 91.01182 88.30625 228.84185
17.75000 -2692.93362 7.53513 17.52800 189.58537 216.15796 664.77678
17.85000 -2665.49194 -0.76487 7.52496 68.45660 47.49573 204.71798
17.95000 -2654.99992 0.89847 -7.44613 72.18854 105.11843 217.26684
18.05000 -2638.54067 2.49234 -2.24976 98.64611 62.37955 213.94201
18.15000 -2619.05650 -0.90862 10.51116 64.12552 68.14943 197.83210
18.25000 -2606.75284 0.99945 -1.00170 56.26599 69.92704 219.72560
18.35000 -2587.80121 3.04116 4.34370 62.54306 45.72119 191.47422
18.45000 -2570.92732 -2.48888 -15.50544 66.68422 57.28503 192.07802
18.55000 -2556.95504 1.19586 -6.65229 62.17886 49.12925 183.51011
18.65000 -2543.09146 1.87910 -2.71949 54.82844 34.88481 181.64105
18.75000 -2526.37477 1.36839 -2.69498 49.28709 41.87422 171.42943
18.85000 -2511.31931 0.52710 4.97738 55.39365 58.98488 183.13289
18.95000 -2497.48623 -6.73433 7.62568 70.78216 217.54852 279.91173
19.05000 -2482.00828 1.53559 -2.77913 47.37657 42.39562 177.09588
19.15000 -2470.53098 -0.67961 5.60975 80.81160 50.39746 164.99923
19.25000 -2455.29698 -1.97575 -1.52335 81.28618 99.54939 184.77850
19.35000 -2437.00747 0.24923 -5.15759 51.72719 32.99531 153.47060
19.45000 -2421.04582 -2.36531 -4.98585 56.87574 71.74954 159.12579
19.55000 -2412.12374 -0.03921 -1.03338 37.42432 34.30093 153.46266
19.65000 -2396.06481 1.70218 -11.22881 83.75924 253.84756 195.90600
19.75000 -2383.37303 -1.03938 -2.23475 42.53606 42.52971 152.68586
19.85000 -2367.92733 2.55232 -0.45709 142.54781 256.59795 162.43130
19.95000 -2359.72979 1.49744 -3.90351 136.69484 64.03693 160.43919
