0.120000 -2.327790
0.380000 3.106700
0.620000 -3.076850
0.880000 -3.135240
1.120000 3.113130
1.380000 3.113920
1.620000 3.097960
1.880000 3.065970
2.120000 3.073520
2.380000 3.100100
2.620000 3.094770
2.880000 3.094760
3.120000 3.073760
3.380000 3.096770
3.620000 3.088270
3.880000 3.093810
4.120000 3.114940
4.380000 3.091750
4.620000 3.103770
4.880000 3.091210
5.120000 3.093970
5.380000 3.107230
5.620000 3.102970
5.880000 3.089980
6.120000 3.113630
6.380000 3.119240
6.620000 -3.140070
6.880000 -3.131780
7.120000 -3.129330
7.380000 3.137530
7.620000 -3.113240
7.880000 -3.098580
8.120000 -3.115010
8.380000 -3.091190
8.620000 -3.062660
8.880000 -3.036980
9.120000 -3.042420
9.380000 -3.054710
9.620000 -3.029230
9.880000 -3.044890
10.120000 -3.015170
10.380000 -3.032170
10.620000 -3.104580
10.880000 -3.078270
11.120000 -3.139960
11.380000 3.046900
11.620000 3.079640
11.880000 3.038950
12.120000 3.104010
12.380000 2.930490
12.620000 3.032270
12.880000 2.926950
13.120000 2.764020
13.380000 2.618390
13.620000 2.586530
13.880000 2.403310
14.120000 2.277830
14.380000 2.198520
14.620000 2.157530
14.880000 2.309730
