0.05000 -1255.97080 111.23548 -513.42925 1581.93205 1299.56229 907.76508
0.15000 -1702.33195 -0.73774 8.13185 1322.01861 1332.57830 2021.63447
0.25000 -2639.29742 44.64539 -312.24043 1241.26426 1144.20145 3154.74108
0.35000 -3271.95201 140.84920 -98.16779 1223.42249 1058.88351 4221.68142
0.45000 -3968.80894 137.30538 101.47473 1176.52089 894.37038 4867.24209
0.55000 -4472.30928 144.08128 108.03445 1207.22719 745.39156 5225.38351
0.65000 -4730.56514 120.19636 162.58948 1319.49733 618.15876 5662.84782
0.75000 -4969.07873 120.41495 -133.35546 1317.37541 528.95634 5851.80640
0.85000 -5180.92922 106.31476 38.70878 1315.86127 474.09751 5959.99369
0.95000 -5399.04074 127.72217 -122.27188 1270.67003 429.71964 5979.53379
1.05000 -5549.62961 107.10210 60.93285 1283.54344 397.78622 6045.47890
1.15000 -5731.96157 100.18978 87.41486 1248.25584 386.44018 6001.18120
1.25000 -5897.30653 109.76232 120.96851 1208.01221 379.98802 5970.26220
1.35000 -6062.47407 112.47823 -22.97845 1224.61021 373.94495 5878.60940
1.45000 -6191.50777 111.70367 -96.14198 1218.85241 372.21661 5805.93201
1.55000 -6259.80520 116.05679 -88.28378 1209.75391 364.94604 5794.32087
1.65000 -6427.32680 105.64499 -51.64321 1105.99209 362.13322 5523.53498
1.75000 -6517.69887 111.79827 16.73518 1098.58767 357.04294 5439.78270
1.85000 -6597.25387 112.38354 -73.22278 1050.84641 357.17076 5314.66130
1.95000 -6632.90965 110.80966 -76.33488 1009.96584 355.08144 5195.32839
2.05000 -6671.31243 116.31940 -129.24468 937.30703 365.87187 5027.15925
2.15000 -6699.05613 114.05765 -27.98233 925.80187 368.17348 4917.84744
2.25000 -6770.97450 127.98477 -76.94688 901.69382 374.69530 4735.52577
2.35000 -6809.67695 122.36423 3.47453 846.84337 374.90344 4667.57559
2.45000 -6849.98568 127.45088 -24.70979 818.32964 367.24238 4543.73943
2.55000 -6874.40680 133.61593 -34.73742 796.24462 361.39519 4456.80378
2.65000 -6923.22946 134.86956 87.64919 755.66032 355.39661 4305.36341
2.75000 -6939.13675 130.77973 -35.17574 739.32139 347.11200 4222.64474
2.85000 -6956.95621 126.30588 -35.27590 715.92914 344.58256 4143.50763
2.95000 -6970.99347 128.63266 -68.88300 675.04256 337.12375 4017.09594
3.05000 -6970.64707 124.89758 -53.99415 646.85869 332.63023 3873.31839
3.15000 -6946.75990 127.15554 4.32098 609.59409 321.41470 3809.08273
3.25000 -6930.35176 114.71561 -19.17480 575.75426 314.04343 3687.56492
3.35000 -6905.32442 122.25228 31.55680 556.28192 308.64079 3618.10929
3.45000 -6899.57921 110.90667 64.30334 530.94715 301.66801 3507.91263
3.55000 -6876.92021 114.00858 28.17539 538.05359 291.06162 3416.03818
3.65000 -6848.20274 104.73003 19.42635 520.02193 280.47125 3330.97898
3.75000 -6823.57098 104.12406 70.32386 503.38191 273.18905 3267.11852
3.85000 -6806.88963 103.82746 15.30472 472.08743 262.70484 3188.85412
3.95000 -6775.55582 103.79080 78.32238 472.59927 252.72278 3135.56511
4.05000 -6758.99580 96.78657 92.73858 462.96829 245.65944 3036.06788
4.15000 -6734.23012 99.00866 -11.27887 430.99166 239.01695 2956.50302
4.25000 -6709.61027 95.20862 35.83062 424.61733 228.98668 2904.30844
4.35000 -6682.09486 92.14220 91.45304 419.68180 221.42251 2824.80323
4.45000 -6653.96895 90.44469 38.17249 410.82142 210.25512 2776.74489
4.55000 -6619.41859 89.05886 9.73909 411.59251 203.60217 2709.22901
4.65000 -6595.70163 95.85875 29.28438 390.11771 193.67979 2608.83145
4.75000 -6547.69154 85.48056 71.86537 390.35588 188.41772 2565.98506
4.85000 -6520.11427 85.67104 -27.35432 377.97430 179.45091 2503.02738
4.95000 -6485.82187 81.34082 58.92598 370.15239 168.31119 2459.19592
5.05000 -6444.56019 88.30758 4.35656 355.39855 165.10550 2398.60777
5.15000 -6400.79070 83.79499 40.77079 348.55521 158.03221 2343.36972
5.25000 -6354.77701 80.30308 -27.72620 352.09500 149.75869 2296.45077
5.35000 -6313.85840 77.71584 -35.14861 327.35791 143.59516 2248.11219
5.45000 -6276.33671 78.50737 10.75773 333.93380 139.67022 2198.37563
5.55000 -6236.05867 76.22659 -5.22721 326.94575 133.22355 2150.37794
5.65000 -6209.86299 72.55001 -12.20676 304.22731 128.92532 2069.62417
5.75000 -6163.64496 70.63131 -36.13111 308.31460 119.87797 2062.49051
5.85000 -6125.27870 71.86559 15.11296 306.43365 114.66042 2007.86872
5.95000 -6086.70182 70.49015 -22.88569 304.04374 109.56259 1944.37777
6.05000 -6033.69881 68.55889 -34.30756 279.05808 102.58589 1904.75808
6.15000 -5980.04306 68.22240 -22.62780 264.34041 99.52044 1880.74092
6.25000 -5946.65865 64.22395 -2.31592 252.31239 95.50178 1829.71598
6.35000 -5914.17827 65.79259 -42.67487 228.40547 92.29564 1765.14404
6.45000 -5869.15231 65.47835 12.38415 228.12840 91.42734 1745.49573
6.55000 -5836.69851 63.67603 -22.04617 229.20986 87.50276 1702.44657
6.65000 -5794.99025 62.17554 -31.48995 223.29388 85.27427 1667.29020
6.75000 -5757.27518 60.38411 -15.24152 219.61407 84.38397 1629.05594
6.85000 -5719.32007 61.11883 -3.25717 212.81074 80.27481 1615.20569
6.95000 -5679.91093 61.91129 -16.26170 224.41560 78.68490 1564.19361
7.05000 -5641.89409 58.37821 -15.88157 205.28663 75.99626 1548.83540
7.15000 -5605.18336 58.48694 -26.35504 201.41038 71.77391 1504.52720
7.25000 -5559.40884 56.69991 -16.44589 222.40587 69.91906 1467.36417
7.35000 -5526.11648 55.63334 17.22791 192.91207 68.99656 1427.66521
7.45000 -5483.49053 55.96157 9.87290 179.36661 68.18598 1400.61149
7.55000 -5447.45525 53.73096 -3.13410 195.81745 67.59396 1365.29421
7.65000 -5408.55052 52.81603 -57.01352 186.62231 65.61877 1355.29644
7.75000 -5375.87664 52.90455 -33.33761 173.30588 65.32375 1321.42910
7.85000 -5330.20224 52.72913 -0.79001 170.18150 66.23388 1301.85724
7.95000 -5291.08872 50.29886 4.21308 178.86931 67.57197 1267.49096
8.05000 -5268.75402 50.06015 -6.69059 154.48223 70.20637 1214.43949
8.15000 -5228.54514 49.91795 -13.54630 173.42656 68.36816 1220.32325
8.25000 -5199.12966 48.21247 -2.92510 153.12160 66.36338 1179.62077
8.35000 -5158.83822 48.23201 12.16848 165.66215 65.21166 1175.22339
8.45000 -5125.60691 47.02809 2.21042 159.56820 63.88732 1144.81912
8.55000 -5091.60937 46.85771 22.27271 153.30363 63.15248 1126.51780
8.65000 -5051.19140 44.65160 5.24495 159.09975 59.72835 1102.25537
8.75000 -5010.63294 44.62892 -3.73888 154.15786 59.95599 1080.24617
8.85000 -4971.18812 43.34506 -36.65870 146.22534 58.83603 1050.83854
8.95000 -4932.16513 44.83921 -16.90815 134.25042 57.36673 1029.48504
9.05000 -4893.77323 43.55652 -22.10345 135.04274 56.86114 998.88471
9.15000 -4855.21903 42.61566 -28.83721 129.92088 54.30655 987.20032
9.25000 -4817.81414 41.43473 11.65733 128.96923 53.79110 970.38756
9.35000 -4781.38347 38.65901 -15.82529 125.38799 52.94321 946.92138
9.45000 -4741.91218 40.06282 8.77203 121.48427 53.20032 935.65829
9.55000 -4699.56835 38.20382 -11.79820 121.31454 52.03587 928.66179
9.65000 -4661.25621 38.35166 -17.85117 115.75507 52.10409 898.64812
9.75000 -4628.97076 37.65089 17.71204 106.21912 50.97748 864.54761
9.85000 -4587.68900 38.37093 11.43905 108.10134 51.16324 870.98124
9.95000 -4558.14216 38.46294 29.16020 105.96593 51.12274 826.26853
10.05000 -4524.86350 36.21591 18.56150 121.17622 49.04373 827.93843
10.15000 -4495.37894 35.72528 6.72061 104.08924 48.42906 802.31587
10.25000 -4466.03668 35.59474 6.76572 96.69514 46.72447 767.92918
10.35000 -4431.19111 34.71747 11.75484 103.67263 47.39943 765.52165
10.45000 -4394.09933 33.93247 24.65929 97.54446 45.82719 749.65431
10.55000 -4361.93674 34.74972 24.82308 90.71644 45.63411 729.82192
10.65000 -4325.40724 32.44940 40.33710 85.29805 46.03147 727.58619
10.75000 -4292.96212 32.88742 36.88125 92.89752 45.06653 717.64915
10.85000 -4268.23702 31.45319 27.73400 83.17282 44.87622 678.05007
10.95000 -4232.83000 32.59024 23.98507 87.98398 43.59832 690.53063
11.05000 -4206.67723 31.41123 30.21230 83.89775 43.11706 662.30810
11.15000 -4174.36419 30.93561 25.60105 83.35518 42.01631 654.62576
11.25000 -4143.95221 29.28832 16.93559 79.17896 43.63458 643.21779
11.35000 -4113.40839 29.01530 28.95132 78.49091 41.93408 631.72065
11.45000 -4084.56687 29.36397 33.65808 74.30065 42.41135 615.95692
11.55000 -4056.82579 29.62298 25.10823 68.04988 41.65844 593.48000
11.65000 -4030.12322 27.43924 21.76092 68.65002 41.47193 587.29950
11.75000 -4002.00850 28.20529 36.37676 73.08074 40.91683 580.02002
11.85000 -3974.54306 26.44643 1.63156 68.95390 40.60585 567.73050
11.95000 -3947.20424 27.49151 24.97158 70.73181 40.05197 557.82706
12.05000 -3916.99038 25.45387 17.88343 70.07444 40.31450 541.51113
12.15000 -3885.84742 25.43025 29.40361 67.14597 38.87863 540.19442
12.25000 -3861.67582 24.00542 31.88144 67.44896 39.44372 513.96062
12.35000 -3831.79486 25.53780 26.59571 67.06557 39.10671 516.88025
12.45000 -3805.99259 24.41177 34.38028 70.16812 38.59039 507.47925
12.55000 -3776.87058 24.91387 11.07824 67.41819 39.63598 500.30561
12.65000 -3755.44004 23.46546 15.62134 62.62407 38.61701 477.27815
12.75000 -3722.87840 23.89107 0.40514 66.82669 38.02318 484.89452
12.85000 -3699.55531 22.23247 1.85501 64.66191 39.11700 467.64985
12.95000 -3675.13873 21.75263 26.57197 62.91113 36.75859 445.29290
13.05000 -3648.18874 21.89680 -15.05740 62.63348 37.87333 441.38300
13.15000 -3618.93628 21.58549 8.22096 65.60577 36.34190 446.39834
13.25000 -3594.95340 22.89471 -14.88791 62.62347 36.37189 420.92996
13.35000 -3566.17054 21.65611 -2.40268 61.20768 36.64508 418.55315
13.45000 -3539.15102 20.94692 -18.60011 57.70092 37.86028 408.28312
13.55000 -3519.38292 20.55799 -8.06868 57.10374 36.55464 400.02698
13.65000 -3491.40536 20.32653 -12.58174 58.89692 36.64192 401.84896
13.75000 -3467.95503 19.97672 -21.46678 55.20783 35.35155 394.35883
13.85000 -3445.37437 21.05645 -19.75493 52.01074 35.16122 375.50446
13.95000 -3421.88806 19.24060 -16.04925 52.80946 35.03721 372.13643
14.05000 -3396.04215 19.24177 -16.81483 48.95734 35.60256 362.11566
14.15000 -3372.71229 19.27549 -23.19949 51.03588 34.23610 364.20633
14.25000 -3347.81316 20.36452 -1.68875 49.71390 34.81697 357.57607
14.35000 -3323.18930 18.25187 -13.91058 49.80919 33.73802 346.01633
14.45000 -3297.99984 17.36841 -18.41454 47.04805 32.18302 340.91120
14.55000 -3275.83244 19.99612 -14.16549 46.43750 31.51907 331.81809
14.65000 -3252.95121 16.78247 -13.60379 45.33541 31.00769 328.09972
14.75000 -3229.64648 18.88076 -22.06534 45.04702 31.22877 320.41741
14.85000 -3205.24064 18.04813 -22.11509 43.95177 30.58640 322.59764
14.95000 -3186.40162 19.45700 -11.04060 42.68616 31.28624 304.65830
15.05000 -3163.43348 17.71395 2.19890 43.74220 30.40872 313.90403
15.15000 -3140.91247 17.00383 1.30665 41.91202 28.42302 306.37501
15.25000 -3122.30224 16.45167 -23.98125 41.42348 30.09726 295.88796
15.35000 -3099.28088 16.94537 -30.62755 40.76359 29.25896 296.72626
15.45000 -3080.47898 16.77948 -5.52113 38.72522 28.76287 286.21253
15.55000 -3060.38540 15.70686 -13.98942 38.97044 28.35264 283.44051
15.65000 -3039.49911 15.35915 9.83097 38.20824 28.92689 278.37225
15.75000 -3020.43428 16.98023 -4.86487 37.61173 28.57844 274.39937
15.85000 -2999.40092 14.95971 -0.08430 37.10449 29.25839 271.86719
15.95000 -2981.63166 15.63733 -6.58229 36.73071 28.64990 261.26196
16.05000 -2961.55036 15.53657 -9.97162 38.12104 27.94839 258.36843
16.15000 -2941.76659 14.60428 -5.38598 37.26072 26.41920 250.96260
16.25000 -2922.65373 15.61352 -7.85652 37.17136 26.39901 245.12053
16.35000 -2901.11080 12.39353 -24.10057 35.83245 27.24339 250.05659
16.45000 -2884.65741 14.87439 -7.04901 36.78334 27.00419 244.81648
16.55000 -2865.29269 15.83237 -2.31248 35.28600 26.20975 237.15263
16.65000 -2846.90906 15.30829 4.97104 34.53702 26.04805 229.56893
16.75000 -2826.97400 15.22056 -4.55527 35.57027 26.40028 231.94470
16.85000 -2810.34329 15.06211 12.98120 35.89234 25.08084 225.94288
16.95000 -2792.11101 14.59773 -5.40124 36.64712 24.63158 217.59712
17.05000 -2774.09887 13.32045 0.60058 35.74939 24.92794 217.21249
17.15000 -2756.05950 12.53497 1.06158 33.06924 24.89472 215.01894
17.25000 -2738.58666 12.87844 2.75105 33.81119 25.12005 207.42580
17.35000 -2722.34218 13.09264 2.81768 33.67004 24.64585 205.57599
17.45000 -2705.35255 12.28137 -4.91535 31.14781 24.07672 204.03797
17.55000 -2686.39845 11.64576 1.83129 33.50967 23.61458 213.88083
17.65000 -2669.00664 14.01204 -12.22849 32.90949 23.79882 198.47871
17.75000 -2654.97797 12.91563 8.92554 31.74170 22.81042 192.15894
17.85000 -2636.27002 11.91802 5.01758 31.54662 24.36903 190.70686
17.95000 -2621.69987 12.48559 -1.30772 31.48064 22.82507 195.20683
18.05000 -2603.46019 13.20600 8.99121 32.30109 22.25493 187.97087
18.15000 -2586.36347 12.53504 9.37028 30.71920 23.61275 186.20939
18.25000 -2573.64786 11.45295 7.95140 28.37175 21.36556 174.56266
18.35000 -2557.76608 12.69238 -5.10507 29.99871 22.63357 177.39930
18.45000 -2542.02506 12.22951 -5.90434 29.10480 22.99221 177.78114
18.55000 -2527.56529 9.52106 -2.31764 29.08897 22.80710 174.03876
18.65000 -2512.99426 10.96112 2.88322 27.58301 21.26340 167.05192
18.75000 -2500.29261 11.22672 4.61061 26.84080 23.11549 165.20744
18.85000 -2485.29260 11.80085 6.43111 28.18241 21.66033 165.13530
18.95000 -2470.06404 11.79045 -8.05645 27.37157 22.81402 163.97929
19.05000 -2457.15065 10.90444 -2.80788 25.71216 21.68010 156.14764
19.15000 -2443.00874 11.86662 4.29824 25.03813 20.96802 153.45001
19.25000 -2427.94539 9.33388 -4.58561 26.22858 22.03726 156.81160
19.35000 -2414.91155 10.84327 0.18256 26.39601 22.81174 154.04578
19.45000 -2402.42316 9.92612 -8.26893 24.82018 21.24006 153.56986
19.55000 -2389.87779 9.38129 -2.59723 25.15435 20.69473 142.00804
19.65000 -2375.42135 8.85198 -5.35806 26.48140 21.20275 149.94063
19.75000 -2363.51939 9.79824 -1.22226 26.11371 21.98985 142.91153
19.85000 -2350.78777 9.68586 -5.07052 26.43843 21.80746 143.31829
19.95000 -2334.93158 8.25329 -1.03178 24.31663 20.55147 142.76137
