0.1 45.7338
0.2 30.95966
0.3 22.3584
0.4 18.59079
0.5 18.31757
0.6 20.19953
0.7 22.35683
0.8 21.98406
0.9 22.55461
1.0 15.9467
1.1 14.06791
1.2 11.68113
1.3 15.67766
1.4 16.0987
1.5 19.72395
1.6 27.8481
1.7 33.52078
1.8 36.87519
1.9 34.67132
2.0 26.61666
2.1 22.04541
2.2 16.91049
2.3 16.14784
2.4 20.20609
2.5 21.28074
2.6 26.19615
2.7 33.2756
2.8 37.41839
2.9 36.0429
3.0 28.88409
3.1 22.57596
3.2 25.63118
3.3 26.27016
3.4 27.70194
3.5 21.4211
3.6 22.68167
3.7 23.14293
3.8 19.73761
3.9 15.52987
4.0 11.07588
4.1 9.80266
4.2 12.09356
4.3 10.59737
4.4 9.9207
4.5 11.14448
4.6 15.80596
4.7 22.10908
4.8 24.8678
4.9 30.36123
5.0 33.37143
5.1 37.40687
5.2 35.70969
5.3 31.86019
5.4 34.16637
5.5 33.80998
5.6 34.24907
5.7 32.40481
5.8 32.70371
5.9 30.0829
6.0 28.22322
6.1 29.44173
6.2 27.60256
6.3 30.42205
6.4 33.35463
6.5 28.84118
6.6 28.52859
6.7 22.84039
6.8 24.44639
6.9 23.1447
7.0 24.72138
7.1 27.9205
7.2 31.96812
7.3 36.9486
7.4 36.34478
7.5 34.28501
7.6 35.11531
7.7 33.09322
7.8 35.36711
7.9 37.05627
8.0 33.81953
8.1 32.37973
8.2 30.56483
8.3 29.45628
8.4 27.67615
8.5 28.69931
8.6 30.40253
8.7 32.12585
8.8 34.59418
8.9 35.81134
9.0 34.65429
9.1 34.30446
9.2 34.02651
9.3 33.76471
9.4 31.69853
9.5 31.97814
9.6 31.9141
9.7 31.80105
9.8 31.57988
9.9 31.50175
10.0 31.38053
10.1 30.68278
10.2 29.94279
10.3 29.38462
10.4 28.52254
10.5 27.94218
10.6 27.57008
10.7 26.99001
10.8 26.91865
10.9 26.78146
11.0 26.67949
11.1 26.65451
11.2 26.52019
11.3 26.60311
11.4 26.49937
11.5 26.18684
11.6 25.78919
11.7 25.46414
11.8 25.30396
11.9 25.40092
12.0 25.84731
