0.1 0.98445
0.2 6.97798
0.3 12.25803
0.4 16.91147
0.5 21.02519
0.6 24.68606
0.7 29.95621
0.8 34.32785
0.9 28.23168
1.0 31.42163
1.1 32.25755
1.2 29.23893
1.3 28.84369
1.4 27.38973
1.5 33.79501
1.6 31.82429
1.7 35.18433
1.8 32.47236
1.9 22.90201
2.0 23.13899
2.1 22.6119
2.2 22.66158
2.3 23.31467
2.4 23.56317
2.5 26.60446
2.6 27.56535
2.7 31.30779
2.8 28.68048
2.9 23.41246
3.0 20.92939
3.1 19.71041
3.2 21.13059
3.3 19.80582
3.4 20.89663
3.5 25.78249
3.6 33.83547
3.7 36.95083
3.8 38.10662
3.9 36.29381
4.0 36.51406
4.1 34.37536
4.2 35.64363
4.3 33.67728
4.4 34.95014
4.5 36.36371
4.6 36.19497
4.7 34.20466
4.8 34.01869
4.9 34.80348
5.0 37.10847
5.1 34.79883
5.2 34.42635
5.3 34.47782
5.4 34.62294
5.5 35.15163
5.6 33.71086
5.7 33.42291
5.8 33.5857
5.9 34.13772
6.0 34.62218
6.1 33.04581
6.2 32.33105
6.3 32.14099
6.4 31.32531
6.5 30.38145
6.6 29.61334
6.7 28.9257
6.8 28.31037
6.9 27.77569
7.0 27.28063
7.1 26.96389
7.2 26.81368
7.3 27.15272
7.4 26.84727
7.5 26.76579
7.6 26.48678
7.7 26.09049
7.8 25.648
7.9 25.45015
8.0 25.14601
8.1 24.70809
8.2 24.08115
8.3 24.10171
8.4 24.09282
8.5 24.05253
8.6 23.52909
8.7 23.31801
8.8 23.51787
8.9 23.40479
9.0 22.88374
9.1 22.65414
9.2 22.62039
9.3 22.60132
9.4 22.37066
9.5 22.00744
9.6 21.75793
9.7 21.71079
9.8 21.38996
9.9 20.93137
10.0 20.86845
10.1 21.07944
10.2 20.98765
10.3 20.75646
10.4 20.68842
10.5 20.51347
10.6 20.43188
10.7 20.24608
10.8 19.75092
10.9 19.61507
11.0 19.65969
11.1 19.63045
11.2 19.56545
11.3 19.41873
11.4 19.41491
11.5 19.24278
11.6 19.08642
11.7 18.93884
11.8 18.81477
11.9 18.72896
12.0 18.69614
