0.12500 0.02798
0.37500 0.03320
0.62500 0.09510
0.87500 0.16543
1.12500 0.21778
1.37500 0.24893
1.62500 0.28073
1.87500 0.32039
2.12500 0.34918
2.37500 0.39124
2.62500 0.41539
2.87500 0.43577
3.12500 0.45289
3.37500 0.47366
3.62500 0.47411
3.87500 0.45350
4.12500 0.45724
4.37500 0.41540
4.62500 0.35647
4.87500 0.30417
5.12500 0.26672
5.37500 0.24379
5.62500 0.24450
5.87500 0.22951
6.12500 0.23991
6.37500 0.21706
6.62500 0.19275
6.87500 0.17976
7.12500 0.15984
7.37500 0.12963
7.62500 0.13319
7.87500 0.12350
8.12500 0.10041
8.37500 0.13068
8.62500 0.08767
8.87500 0.06088
9.12500 0.07080
9.37500 0.02909
9.62500 0.02482
9.87500 0.03877
10.12500 0.01493
10.37500 0.03356
10.62500 0.04095
10.87500 0.03522
11.12500 0.01054
11.37500 0.03912
11.62500 0.05181
11.87500 0.07133
12.12500 0.08525
12.37500 0.08141
12.62500 0.09724
12.87500 0.10009
13.12500 0.11767
13.37500 0.12440
13.62500 0.12956
13.87500 0.12401
14.12500 0.12532
14.37500 0.11062
14.62500 0.13816
14.87500 0.11613
15.12500 0.13042
15.37500 0.11781
15.62500 0.16521
15.87500 0.11207
16.12500 0.15605
16.37500 0.10030
16.62500 0.11753
16.87500 0.09738
17.12500 0.08439
17.37500 0.09856
17.62500 0.09084
17.87500 0.12042
18.12500 0.10142
18.37500 0.10064
18.62500 0.06900
18.87500 0.13912
19.12500 0.09414
19.37500 0.06941
19.62500 0.07770
19.87500 0.04527
