0.05000 -15882.15555 -355.87576 -2530.02563 17565.26127 26232.11275 19214.01750
0.15000 -28441.34712 -363.13118 -1727.32751 14653.95842 16659.61876 24434.68766
0.25000 -34319.06106 -353.70381 -802.11662 14141.63742 12624.65837 28218.98397
0.35000 -33889.69214 208.19701 -427.12250 10978.51623 8300.11771 27115.95736
0.45000 -31994.67020 217.16468 464.38056 10015.70014 6528.85462 26824.60570
0.55000 -29637.80034 212.29091 752.43576 9514.76060 5291.89270 25173.84472
0.65000 -27197.64550 -2.52197 -260.34159 8336.96237 4378.13038 23330.62124
0.75000 -25578.24490 -12.42649 422.62057 7756.42131 3949.40014 21345.63230
0.85000 -24032.23801 41.02647 214.17575 6933.31220 3402.22149 19564.32109
0.95000 -22281.34778 66.74469 -180.80174 6711.39078 3331.06500 18533.56232
1.05000 -21314.41240 66.11975 -76.56547 6038.16452 3184.34425 17013.69819
1.15000 -20186.86693 84.37470 68.76318 5642.93067 2979.87140 15917.90042
1.25000 -19309.99297 109.87729 -177.48311 5240.18463 2869.81221 14791.18785
1.35000 -18359.30559 79.78203 64.57312 4951.45798 2638.48771 14158.48917
1.45000 -17658.34820 -16.41142 5.34001 4553.60102 2793.79802 13085.95138
1.55000 -16943.86032 88.22512 -67.35161 4305.97713 2523.24827 12328.53546
1.65000 -16256.45202 128.69931 34.17340 3869.29285 2392.88992 11587.11230
1.75000 -15628.76206 60.66548 -148.62358 3686.10457 2427.59600 10945.46829
1.85000 -15127.81619 72.92483 145.85427 3527.39562 2256.16393 10360.77066
1.95000 -14787.67760 51.74213 -345.01355 3282.99704 2268.33333 9716.76154
2.05000 -14248.08309 56.86536 -240.76396 3127.33797 2123.90680 9333.26301
2.15000 -13815.93892 -8.80348 154.22423 2986.76131 2092.12962 8912.33818
2.25000 -13425.42716 90.88493 19.91047 2787.08513 2137.75930 8580.28666
2.35000 -12912.65568 74.28628 -183.72210 2734.46639 1902.56651 8354.92698
2.45000 -12641.75448 -53.38452 -148.43352 2581.97410 1923.41743 7854.34491
2.55000 -12216.77590 9.10772 -34.02640 2728.68420 1848.02226 7684.50072
2.65000 -11956.62545 100.05607 0.79984 2348.87594 1859.45121 7258.74995
2.75000 -11688.66064 53.58250 -142.03394 2235.38566 1759.37631 6975.08801
2.85000 -11311.55969 14.85192 26.34906 2259.10189 1619.50036 6751.90734
2.95000 -11090.42721 44.01256 51.30077 2110.16201 1695.55366 6386.56264
3.05000 -10799.70726 49.28650 -94.93250 2109.83778 1695.92001 6332.11505
3.15000 -10645.85202 10.83491 -65.68911 1906.55854 1705.52253 5909.51075
3.25000 -10350.77498 16.69571 -120.80962 1951.19018 1629.52083 5876.03462
3.35000 -10164.54740 30.46418 141.25197 1733.89932 1553.12438 5639.94326
3.45000 -9966.34007 22.88533 -183.71727 1613.00828 1487.72713 5415.05333
3.55000 -9716.69330 30.72833 19.04767 1614.41555 1440.22202 5357.38532
3.65000 -9573.41823 44.19183 117.69915 1599.91327 1410.82324 5135.91431
3.75000 -9368.16947 -21.03361 150.68821 1620.72157 1342.93610 4986.79520
3.85000 -9197.55013 10.78159 55.44971 1374.87230 1281.85934 4871.95542
3.95000 -9039.49155 0.55447 1.38248 1434.83908 1311.44544 4699.10441
4.05000 -8873.10837 1.23606 109.73716 1377.46663 1355.84082 4633.27735
4.15000 -8744.51193 13.23494 72.91983 1334.00882 1234.72980 4452.69351
4.25000 -8591.47156 -5.52822 126.85431 1180.60368 1257.01650 4321.85614
4.35000 -8408.02193 59.36001 -73.01731 1194.03909 1211.99003 4273.34855
4.45000 -8279.31145 10.60889 -119.70398 1052.90859 1110.35101 4107.16383
4.55000 -8175.02008 0.06915 87.49527 1085.76235 1337.89152 4014.54447
4.65000 -8055.42406 -27.27395 -17.58115 1123.69733 1080.95059 3822.09843
4.75000 -7919.90861 -11.37882 -118.56422 986.97512 1084.50389 3791.37318
4.85000 -7834.53059 32.73060 114.10368 933.21995 1034.70693 3704.07560
4.95000 -7730.46917 27.66990 73.16032 906.13363 1027.32862 3645.12549
5.05000 -7628.79371 21.83396 -12.93885 872.97863 1056.66071 3541.19997
5.15000 -7484.90278 7.09770 120.34719 885.97901 946.68969 3488.40570
5.25000 -7430.42038 -29.14129 106.58335 829.03666 959.66159 3332.69747
5.35000 -7341.37986 -10.69282 91.94671 741.57756 943.23545 3240.79927
5.45000 -7248.69347 -15.01034 48.87620 738.91188 900.97648 3142.87114
5.55000 -7162.18472 -25.92392 78.50543 734.65933 923.57446 3040.87477
5.65000 -7034.40958 -31.02992 17.61020 688.24573 861.88970 3056.83554
5.75000 -6969.12792 -11.09145 54.64848 694.11616 853.75698 2884.19624
5.85000 -6866.56953 -3.49019 18.10186 649.74746 836.64035 2783.66811
5.95000 -6814.66091 -32.86504 66.08748 686.29688 933.93648 2785.86268
6.05000 -6719.86357 -5.70763 14.86550 598.54535 820.58354 2653.98616
6.15000 -6643.51776 -15.07718 -62.91969 612.66797 734.23401 2538.14090
6.25000 -6582.49003 3.29218 88.43525 560.35548 800.50193 2446.23416
6.35000 -6510.53068 -24.56269 -33.17748 675.93835 805.27280 2399.53270
6.45000 -6442.08069 -5.32206 10.74624 778.35517 802.29588 2308.32343
6.55000 -6359.04291 -19.07090 121.28338 620.59035 812.57236 2145.72013
6.65000 -6278.66088 -22.30178 38.19466 549.61143 813.21733 2154.24060
6.75000 -6213.57672 -34.60620 41.74213 437.74345 627.60193 1998.82227
6.85000 -6150.61891 -14.94615 132.33218 474.14429 693.89669 2011.55677
6.95000 -6124.00606 -24.23506 15.87015 513.33601 632.37469 1899.97331
7.05000 -6071.55284 -10.28904 -20.22774 498.45093 600.70156 1881.40764
7.15000 -5990.09234 -31.13484 9.01948 459.16308 585.58384 1797.95161
7.25000 -5930.06318 -10.68340 30.04595 468.13432 568.05646 1745.63720
7.35000 -5881.23122 -27.62249 -12.77483 467.74004 597.01229 1630.80263
7.45000 -5837.01395 -17.93635 -20.86235 557.17676 900.72523 1607.89870
7.55000 -5800.79373 -1.54943 41.62940 429.47880 551.58813 1588.91404
7.65000 -5774.31100 -9.87912 43.60570 779.08757 675.63288 1564.38133
7.75000 -5710.55202 -26.24545 6.17281 467.11633 501.01986 1401.26641
7.85000 -5671.42674 -13.58774 -43.08963 605.32793 634.63528 1440.59355
7.95000 -5640.67349 -18.37338 71.70584 503.26300 501.45622 1344.10408
8.05000 -5601.33600 -9.16963 12.55609 461.23996 441.43364 1264.86082
8.15000 -5529.29145 -11.76935 -25.65826 674.74740 613.56953 1265.73767
8.25000 -5498.86158 -7.62835 -2.45385 499.86093 570.72450 1313.37170
8.35000 -5473.63622 -23.42130 -44.52447 486.36300 424.26471 1163.04074
8.45000 -5404.56038 4.65946 8.94291 470.37743 420.28802 1199.27473
8.55000 -5342.60756 -0.10979 32.66276 575.98945 400.22672 1148.96285
8.65000 -5302.61547 -3.72291 3.97555 524.69153 471.86361 1103.89968
8.75000 -5263.31574 15.00830 54.32170 587.68776 507.80610 1095.77426
8.85000 -5217.89091 -5.04496 -3.13541 466.85164 334.21220 1028.88742
8.95000 -5144.02457 6.87549 33.33346 504.83183 317.43617 1009.86770
9.05000 -5095.75611 13.09769 7.14012 417.74084 348.74707 948.86491
9.15000 -5027.58411 -1.98178 2.08049 424.96114 340.20323 971.87123
9.25000 -4991.59883 5.19255 43.80028 406.74211 336.19100 929.65674
9.35000 -4953.88294 17.17475 -21.85883 366.93312 318.49694 976.44668
9.45000 -4887.13101 6.87682 7.07725 372.98542 287.38022 914.99227
9.55000 -4848.45012 -1.26805 -11.26330 341.22601 400.98761 899.68099
9.65000 -4801.23702 9.68675 -25.03532 393.74511 329.22511 868.73251
9.75000 -4734.61166 8.43766 -29.70240 371.55373 565.48199 839.31918
9.85000 -4712.47249 17.97245 -12.03101 401.42394 362.73227 831.33891
9.95000 -4685.53552 3.47633 27.61797 311.81363 248.08023 794.93072
10.05000 -4616.85958 19.50949 -16.07133 438.45677 261.49829 773.56949
10.15000 -4574.41216 12.84776 -31.69761 281.15656 268.47020 750.87766
10.25000 -4549.18090 8.37155 -19.03177 560.80261 516.03768 878.85156
10.35000 -4503.17950 16.51855 -76.50965 259.81535 227.57561 708.26126
10.45000 -4450.15637 18.32877 -44.90260 280.97137 256.65980 1203.34097
10.55000 -4423.36094 11.34999 -14.34813 247.80904 199.20186 698.44801
10.65000 -4371.91835 19.19749 23.61207 351.90793 256.78813 886.69490
10.75000 -4352.36534 20.68620 -44.78509 269.01293 635.56179 749.46023
10.85000 -4305.87778 23.46572 -38.63201 372.35034 666.70154 740.61689
10.95000 -4264.99711 -5.14677 -35.02321 318.82275 220.01810 701.19505
11.05000 -4232.92926 14.56247 10.64827 212.74121 193.45373 618.83937
11.15000 -4194.06827 24.83002 5.53428 333.33755 344.92584 655.54242
11.25000 -4149.65425 4.80566 -21.92292 209.85296 162.66498 626.09057
11.35000 -4120.61700 6.51195 -18.26152 228.17840 205.48601 615.38710
11.45000 -4076.19858 12.06698 -39.23064 202.45645 190.01148 557.14727
11.55000 -4047.12787 -1.17293 -5.94358 195.90267 293.73878 582.05252
11.65000 -4005.08591 3.42583 3.64755 374.41172 210.12918 598.11459
11.75000 -3983.18695 1.84561 12.98932 254.96316 196.99463 565.28360
11.85000 -3957.60131 7.12008 -19.03132 475.15310 270.58902 567.48699
11.95000 -3910.56313 15.70607 4.60741 169.08990 191.48244 527.11765
12.05000 -3886.32658 1.05774 -26.02871 157.17230 126.51817 545.69958
12.15000 -3857.28635 7.24852 38.97241 166.99832 185.02411 549.19840
12.25000 -3827.11459 -9.44358 26.59586 192.40920 158.35356 529.73953
12.35000 -3805.04287 8.11050 1.08213 173.42718 148.00505 488.47238
12.45000 -3771.92195 4.74394 -6.68577 217.30891 175.06766 492.84848
12.55000 -3742.29650 -5.84997 -14.57694 139.73955 134.40738 487.57337
12.65000 -3706.50311 10.13328 -2.90364 157.50407 109.92864 502.61180
12.75000 -3681.45333 -3.82366 -0.32587 168.10204 174.41086 479.40527
12.85000 -3655.70399 -0.27248 15.11335 178.72218 113.04869 471.14344
12.95000 -3628.15603 -16.20571 -23.40594 198.35373 389.86244 578.68839
13.05000 -3614.96688 -1.25577 -5.76394 170.77361 144.82537 455.23001
13.15000 -3572.44408 4.00492 3.94082 218.21447 192.87444 446.49568
13.25000 -3555.57977 -3.11943 18.72144 143.90624 104.28439 427.86903
13.35000 -3525.49933 2.31137 12.38269 131.80850 125.60805 407.42313
13.45000 -3505.89329 6.54217 10.84446 151.81999 134.11966 427.19977
13.55000 -3479.74286 20.85847 -16.54430 206.74950 264.17737 602.19864
13.65000 -3446.13040 -5.48719 3.95480 271.07685 135.41448 437.08417
13.75000 -3417.70535 7.91117 -13.03345 193.37376 122.39183 421.09743
13.85000 -3397.36033 0.48320 14.91230 110.77531 229.09590 466.90187
13.95000 -3368.53723 -0.90439 14.06594 140.88443 122.45020 399.38081
14.05000 -3344.40900 2.03682 51.15823 200.86668 241.38909 461.30399
14.15000 -3325.51721 15.66084 11.96073 150.07604 106.51097 376.50730
14.25000 -3305.52575 4.61893 5.61293 263.66020 103.78228 399.79569
14.35000 -3282.34647 -10.20655 34.27219 191.94475 188.46266 395.07389
14.45000 -3259.26990 3.97872 7.03623 125.17742 104.83465 410.34777
14.55000 -3237.30323 -1.95738 5.85957 184.14828 203.05054 419.56694
14.65000 -3220.19850 7.58078 -0.72375 158.79683 112.53982 368.06919
14.75000 -3190.34345 5.66838 12.17452 109.14666 136.97452 421.73251
14.85000 -3169.48570 1.38225 47.64866 215.63708 264.37800 593.95028
14.95000 -3145.32230 3.13027 20.19044 123.14338 105.89620 337.15003
15.05000 -3127.29239 8.52341 27.63128 120.62854 169.16600 331.77377
15.15000 -3101.82317 8.82029 21.08625 120.19638 115.63045 330.69090
15.25000 -3086.34814 2.95590 28.65367 96.49786 135.55769 347.59279
15.35000 -3061.93451 1.24236 5.36900 153.53664 173.94740 374.32301
15.45000 -3039.69484 7.79807 9.36586 95.71781 91.03986 317.67554
15.55000 -3019.56631 23.97530 31.66847 104.59071 311.35457 311.91220
15.65000 -2996.56140 8.93105 -1.32296 109.59301 101.31874 316.26808
15.75000 -2976.64999 1.68492 9.92766 83.80310 63.93859 297.76230
15.85000 -2955.72074 9.47155 0.68829 92.12530 87.44089 324.35463
15.95000 -2949.49542 2.85902 -11.82934 170.61800 110.52073 314.54387
16.05000 -2927.56702 4.01372 -6.31816 84.10121 74.72767 281.94046
16.15000 -2901.57168 3.65220 45.86348 89.91104 66.48142 296.19484
16.25000 -2883.84658 -3.95596 -1.66734 99.92439 93.59593 286.68265
16.35000 -2873.67166 -0.39118 -5.50564 120.37896 128.68575 299.42046
16.45000 -2847.35000 9.76679 16.76399 83.95953 61.50452 290.71486
16.55000 -2826.64134 10.68310 5.06883 102.02762 65.18519 281.01887
16.65000 -2820.87836 7.09063 18.71803 139.23704 116.33589 281.18233
16.75000 -2797.57236 -0.39041 -7.23172 90.28442 86.51568 260.35451
16.85000 -2776.13445 7.51614 -5.77466 96.08756 171.29126 277.94334
16.95000 -2754.12457 4.66982 -37.01171 147.86734 76.65554 290.13981
17.05000 -2743.24564 6.01876 -21.63061 68.97306 58.94860 249.23901
17.15000 -2729.12647 5.68777 22.99949 92.10142 72.33068 272.11880
17.25000 -2708.09946 24.22873 24.61360 96.75491 181.92644 267.07364
17.35000 -2689.51840 9.68429 -6.98902 69.52015 52.97211 266.34575
17.45000 -2675.00627 7.20166 7.29222 92.42031 80.08268 273.30000
17.55000 -2661.71631 9.95079 -5.13310 94.33378 60.22101 250.98084
17.65000 -2649.72677 12.21169 6.49415 165.23381 85.30888 273.46853
17.75000 -2635.77362 0.96308 -22.88116 123.05522 102.26567 244.45371
17.85000 -2604.15534 4.82833 -6.84273 67.10153 54.21598 255.04549
17.95000 -2590.40402 8.26956 7.47751 117.53317 65.03587 233.11289
18.05000 -2576.91035 11.07602 -31.30631 95.03436 49.36317 231.69606
18.15000 -2567.43603 3.76822 -14.55254 67.65983 50.53136 229.89665
18.25000 -2566.34103 6.49906 -35.70877 176.34184 68.35438 301.31721
18.35000 -2541.82380 3.17264 -14.74831 86.80186 86.99574 239.11770
18.45000 -2528.88979 7.21664 -27.79922 74.97024 68.14621 231.00031
18.55000 -2509.88953 0.68919 -15.19691 99.59352 57.03818 250.04549
18.65000 -2498.24721 6.61602 -6.68950 146.09052 42.85214 234.32512
18.75000 -2502.28685 -3.87935 11.02501 188.65501 150.62872 351.87665
18.85000 -2474.65443 4.60145 -33.80136 102.74319 71.80666 224.29634
18.95000 -2468.15689 -1.72781 -10.90217 365.17012 387.42880 329.90272
19.05000 -2451.08876 5.59341 9.64304 81.36981 67.05457 204.81815
19.15000 -2441.53402 -5.81802 -18.14812 49.11940 54.43641 199.01168
19.25000 -2421.02041 2.56755 -8.68165 70.92127 71.77386 240.89472
19.35000 -2406.89303 -2.54193 -6.04128 71.46189 65.60124 207.61578
19.45000 -2399.04004 3.78797 -12.12611 56.90779 52.20379 190.93485
19.55000 -2383.39677 -0.46817 -5.13621 58.70457 74.09134 201.11279
19.65000 -2375.68110 6.18831 -28.79702 57.69840 50.78411 202.63793
19.75000 -2356.65788 4.89311 -3.83343 86.38529 62.74159 204.44959
19.85000 -2317.27637 -7.26960 -43.27682 304.73158 178.81022 411.04248
19.95000 -2334.46171 2.64250 -24.01979 44.46256 46.77897 183.06790
