0.12500 0.01378
0.37500 0.03448
0.62500 0.06517
0.87500 0.11217
1.12500 0.17369
1.37500 0.22531
1.62500 0.25451
1.87500 0.27957
2.12500 0.30852
2.37500 0.32799
2.62500 0.32825
2.87500 0.34056
3.12500 0.35250
3.37500 0.34950
3.62500 0.35896
3.87500 0.34421
4.12500 0.33498
4.37500 0.31510
4.62500 0.30385
4.87500 0.30596
5.12500 0.28077
5.37500 0.27827
5.62500 0.24628
5.87500 0.22003
6.12500 0.21228
6.37500 0.18436
6.62500 0.18044
6.87500 0.15166
7.12500 0.10752
7.37500 0.09510
7.62500 0.08996
7.87500 0.07357
8.12500 0.06220
8.37500 0.06807
8.62500 0.04601
8.87500 0.05426
9.12500 0.06493
9.37500 0.05787
9.62500 0.06638
9.87500 0.06659
10.12500 0.09176
10.37500 0.08198
10.62500 0.10168
10.87500 0.10628
11.12500 0.10601
11.37500 0.10794
11.62500 0.10394
11.87500 0.08933
12.12500 0.06926
12.37500 0.06545
12.62500 0.07292
12.87500 0.06497
13.12500 0.08493
13.37500 0.09809
13.62500 0.10501
13.87500 0.11364
14.12500 0.13659
14.37500 0.12951
14.62500 0.10360
14.87500 0.10572
