0.12500 0.02939
0.37500 0.03280
0.62500 0.09423
0.87500 0.13392
1.12500 0.17909
1.37500 0.22188
1.62500 0.27745
1.87500 0.32999
2.12500 0.36924
2.37500 0.40590
2.62500 0.42514
2.87500 0.46407
3.12500 0.48817
3.37500 0.50158
3.62500 0.49335
3.87500 0.49787
4.12500 0.48791
4.37500 0.47771
4.62500 0.46009
4.87500 0.44245
5.12500 0.43482
5.37500 0.40936
5.62500 0.38299
5.87500 0.36895
6.12500 0.33986
6.37500 0.32114
6.62500 0.29869
6.87500 0.28772
7.12500 0.26114
7.37500 0.22691
7.62500 0.19112
7.87500 0.17534
8.12500 0.13881
8.37500 0.11663
8.62500 0.09693
8.87500 0.09363
9.12500 0.08045
9.37500 0.07962
9.62500 0.07718
9.87500 0.07309
10.12500 0.07347
10.37500 0.08900
10.62500 0.10006
10.87500 0.10292
11.12500 0.12262
11.37500 0.10891
11.62500 0.11381
11.87500 0.11832
12.12500 0.08410
12.37500 0.10842
12.62500 0.06402
12.87500 0.05195
13.12500 0.03528
13.37500 0.03780
13.62500 0.05553
13.87500 0.03627
14.12500 0.07957
14.37500 0.08304
14.62500 0.11302
14.87500 0.11474
