0.15 -1.2705 28.42978 3.23721 120.99409 119.07376 99.3949
0.45 -1.45355 53.89227 1.90425 120.99577 110.82344 95.95045
0.75 -1.35506 71.69937 1.39734 116.79209 100.12554 89.62021
1.05 -1.64535 87.45667 -0.4322 109.4815 92.01568 83.48299
1.35 -3.17327 105.46318 0.72332 100.81938 87.81136 78.68811
1.65 -1.08595 124.86102 1.36305 91.26448 83.86665 74.83488
1.95 -1.41362 138.28494 0.42297 83.8126 77.81989 71.25631
2.25 -1.8174 148.48911 -0.12022 77.48588 72.30951 66.89095
2.55 -0.96609 157.46914 -0.0197 73.79097 67.99396 63.47446
2.85 -0.73601 162.96313 0.07007 71.95618 65.0381 59.20584
3.15 -0.26755 166.30492 -0.30854 68.89076 61.90874 55.58126
3.45 -0.19546 169.64255 0.19013 68.30261 59.81175 52.76892
3.75 -0.372 172.29756 -0.61166 66.13764 57.31695 49.96694
4.05 0.42298 175.60347 -0.78879 63.471 52.82906 46.8363
4.35 1.51526 178.27345 -0.59361 61.27796 51.15977 45.22846
4.65 0.59374 180.14557 -0.14281 58.94494 49.09729 43.45682
4.95 0.26489 182.60109 -0.4267 56.12188 46.82349 41.5642
5.25 1.88884 184.5709 -0.23795 54.73546 45.14898 40.10315
5.55 0.72563 187.37162 -0.78425 52.91942 43.14723 39.30429
5.85 1.64482 189.54525 -0.70952 51.21961 41.90979 37.99347
6.15 1.22726 190.50135 -0.70347 49.77773 40.35673 36.72708
6.45 0.18355 191.89952 -0.71514 48.55307 38.77377 35.98523
6.75 1.19247 191.51038 -0.1448 47.34306 37.75748 34.57342
7.05 0.96318 192.49301 -0.47192 46.2733 36.99638 33.14823
7.35 1.61287 194.38088 -0.17078 44.61421 36.10433 31.83769
7.65 2.35136 195.35895 -0.09882 43.13086 35.75944 31.18393
7.95 2.00203 197.4897 -0.48217 41.87873 34.51575 30.18524
8.25 1.30226 198.47789 -0.44711 41.17963 34.18845 29.66436
8.55 1.02261 200.3045 -0.29918 40.03864 33.08658 28.86243
8.85 0.32611 202.4523 -0.19223 38.51922 31.31166 27.83557
9.15 -0.0507 202.54783 0.29044 37.99385 29.77282 27.01201
9.45 0.95814 202.51625 -0.01519 37.51529 28.16639 26.67854
9.75 -0.05279 203.20913 0.52552 36.65872 26.82661 25.81732
10.05 1.04265 203.13883 0.52761 35.77988 26.30853 24.88115
10.35 1.01746 203.56769 0.81932 34.81074 26.41249 23.97624
10.65 1.34042 204.72689 0.64765 34.09377 26.45745 23.45282
10.95 1.05907 205.33456 0.74357 32.71673 25.89937 22.6825
11.25 0.47533 205.3498 0.94918 31.99217 25.34599 21.92142
11.55 -0.28578 205.72473 0.85813 31.19831 23.99241 21.04138
11.85 -1.60353 205.34505 0.88324 30.866 22.92077 20.72891
12.15 -2.07204 205.5089 0.45837 29.4986 21.82976 20.06967
12.45 -2.68494 205.21914 0.11781 29.09775 21.08289 19.18352
12.75 -3.48392 205.55689 -0.01451 28.02892 20.80965 19.06057
13.05 -4.61484 205.10791 -0.80857 26.7706 19.91746 18.63876
13.35 -4.13747 205.77509 -0.20234 25.94671 19.23412 17.64222
13.65 -4.48701 206.91278 -0.86464 24.9914 18.72148 17.26004
13.95 -4.31542 207.30142 -1.25799 23.56876 17.96562 16.91945
14.25 -2.9077 207.62695 -1.40109 23.19738 16.88907 16.0595
14.55 -2.46822 207.02903 -1.29631 22.73392 16.02727 15.85765
14.85 -2.02978 206.44657 -1.0333 22.11251 14.92757 15.16514
15.15 -3.00958 205.70549 -1.57181 21.63511 14.45011 14.52667
15.45 -2.77949 205.16334 -1.13794 21.13212 13.54062 14.46255
15.75 -3.9298 204.26088 -0.996 19.89703 13.66833 14.44231
16.05 -3.71964 203.7504 -0.94696 19.47139 14.04252 14.02955
16.35 -3.0573 203.71705 -1.15682 19.23517 14.04085 13.09813
16.65 -2.27006 204.00723 -1.57693 18.61591 14.26744 13.33781
16.95 -1.31489 204.75601 -1.29994 17.47143 14.11152 13.03875
17.25 -0.15765 205.02646 -1.5911 17.69972 14.02676 12.59212
17.55 1.12026 205.79355 -2.29152 16.79839 13.12468 12.46878
17.85 3.34707 206.19287 -1.57382 16.63632 13.61296 11.9274
18.15 5.05923 207.14933 -0.80371 15.85308 13.38073 11.78705
18.45 5.49503 208.03933 -0.8818 14.93443 13.19789 11.4344
18.75 6.84508 208.64388 -0.2821 14.74795 13.2575 10.9373
19.05 7.16431 209.19937 -0.14468 14.21991 12.88272 10.67073
19.35 7.0147 209.69106 -0.06583 14.5446 12.93436 10.43371
19.65 5.74736 208.83226 -0.17509 14.56058 12.87085 9.94432
19.95 4.47262 209.4561 -0.34928 14.48852 12.74545 10.17956
20.25 2.58606 209.53682 -0.8223 14.33644 12.49522 9.7784
20.55 -0.37074 209.7863 -1.38759 14.79148 12.79666 9.61183
20.85 -2.03881 210.06462 -2.22892 14.24029 11.93039 9.03995
21.15 -4.78623 210.99527 -2.31599 12.96785 10.11738 8.90116
21.45 -7.72617 211.18861 -2.03059 12.50988 9.60746 8.72995
21.75 -9.02855 211.37428 -2.45407 10.49647 6.88903 7.94611
22.05 -9.24989 210.63091 -2.23653 10.5387 6.20719 8.3147
22.35 -9.95872 209.57269 -1.92983 10.13923 5.46619 7.98738
22.65 -10.02598 208.99581 -1.61391 9.89743 5.50131 8.11099
22.95 -10.23216 207.18008 -2.12638 9.89938 6.08743 8.05646
23.25 -10.52782 206.59193 -1.67861 10.1865 4.9843 7.69737
23.55 -10.72641 205.86707 -0.9858 10.57254 4.85198 7.67802
23.85 -9.65058 204.94366 -1.05865 10.79231 4.7678 7.34806
24.15 -8.79219 204.12352 -0.32597 10.99196 4.62885 6.89703
24.45 -8.22078 203.08321 0.16108 10.80401 5.05822 7.65808
24.75 -8.32906 202.55567 0.38851 10.63048 4.72515 7.05823
25.05 -7.83217 201.73845 0.69221 10.27256 4.64451 6.71287
25.35 -7.84746 200.78232 0.29705 10.91574 4.71361 6.90559
25.65 -7.26463 200.62867 0.87857 9.74688 4.22778 6.57632
25.95 -6.07178 199.70958 0.85128 9.63107 4.69934 6.83558
26.25 -6.78435 198.99546 0.70591 9.32386 4.7968 6.46796
26.55 -5.31508 198.33442 1.10831 9.39664 5.23271 6.41239
26.85 -4.24564 198.31301 1.4455 8.68894 4.96358 5.80355
27.15 -3.74687 197.51808 0.88461 8.12165 5.16597 5.88746
27.45 -2.47592 196.40033 1.38477 8.31907 5.20148 6.44385
27.75 -2.31756 196.08874 1.36886 8.10784 5.29828 6.5725
28.05 -0.71949 196.08017 1.97183 8.09452 5.81241 6.17997
28.35 0.84482 195.78125 1.25726 7.23442 5.80192 5.78859
28.65 1.45533 195.33469 1.66775 8.45249 6.10035 5.99087
28.95 3.87951 195.53372 2.22638 7.39682 5.89305 5.47362
29.25 6.16945 195.93039 1.44811 7.61699 6.6629 5.35132
29.55 6.93282 195.58562 1.55071 7.13831 6.89683 5.16068
29.85 9.28049 196.4433 1.41879 7.80175 7.33163 6.13367
