0.12500 0.00663
0.37500 0.01344
0.62500 0.04318
0.87500 0.07675
1.12500 0.09612
1.37500 0.13595
1.62500 0.17861
1.87500 0.21234
2.12500 0.25471
2.37500 0.29640
2.62500 0.31174
2.87500 0.30560
3.12500 0.29498
3.37500 0.27737
3.62500 0.25690
3.87500 0.26288
4.12500 0.26777
4.37500 0.24899
4.62500 0.22784
4.87500 0.20220
5.12500 0.17336
5.37500 0.13861
5.62500 0.11858
5.87500 0.10426
6.12500 0.08860
6.37500 0.07318
6.62500 0.06338
6.87500 0.04082
7.12500 0.02965
7.37500 0.02187
7.62500 0.02777
7.87500 0.01703
8.12500 0.01595
8.37500 0.02223
8.62500 0.02096
8.87500 0.00737
9.12500 0.01346
9.37500 0.00733
9.62500 0.03370
9.87500 0.03907
10.12500 0.04920
10.37500 0.04899
10.62500 0.05908
10.87500 0.04389
11.12500 0.05890
11.37500 0.04843
11.62500 0.06696
11.87500 0.03801
12.12500 0.04135
12.37500 0.03503
12.62500 0.03875
12.87500 0.03142
13.12500 0.01047
13.37500 0.01252
13.62500 0.01510
13.87500 0.00439
14.12500 0.00634
14.37500 0.01148
14.62500 0.00726
14.87500 0.01922
15.12500 0.01994
15.37500 0.01018
15.62500 0.01192
15.87500 0.00763
16.12500 0.00997
16.37500 0.03587
16.62500 0.02685
16.87500 0.04409
17.12500 0.03618
17.37500 0.00671
17.62500 0.02183
17.87500 0.03523
18.12500 0.04097
18.37500 0.01763
18.62500 0.04051
18.87500 0.03044
19.12500 0.04509
19.37500 0.04032
19.62500 0.01955
19.87500 0.01341
