0.05000 -2100.04221 -31.88325 -149657.96660 1131.98145 1130.04168 495610.70697
0.15000 -3877.13502 97.47431 -65691.25973 1258.42066 866.06997 390637.94995
0.25000 -5347.72198 30.01603 -21289.27162 1056.35065 720.49453 399324.09604
0.35000 -6259.46099 71.25018 1137.18328 1124.22983 621.98939 390935.56967
0.45000 -6826.41237 57.89383 -12820.56299 1260.78250 569.10183 311137.80746
0.55000 -7259.49877 86.76366 -1986.79032 1304.32000 531.37673 370836.50528
0.65000 -7619.58548 86.86778 3034.43942 1383.18574 489.10747 293015.30171
0.75000 -7875.90096 94.40896 1938.67115 1414.44832 430.51691 315876.43758
0.85000 -8137.99225 99.94404 320.53534 1403.12083 402.03380 281440.82436
0.95000 -8249.67612 93.71186 688.16325 1335.62392 379.10452 313496.04678
1.05000 -8411.73672 92.28949 -200.21429 1320.96979 358.23873 254853.23755
1.15000 -8477.92760 98.65741 1904.50468 1270.82779 329.56469 250303.08736
1.25000 -8508.77233 90.66864 5056.01611 1199.94209 314.58757 239814.08243
1.35000 -8538.24720 94.55982 -756.21688 1127.55050 307.25260 239534.57458
1.45000 -8537.91851 99.14614 1084.95313 1047.82962 300.86471 220307.86181
1.55000 -8583.12565 97.25323 -3017.68882 961.42663 286.20312 209767.81316
1.65000 -8581.44488 95.87029 -1079.95165 882.80257 274.63454 210101.21950
1.75000 -8546.75185 97.57637 -4260.61239 795.27706 262.72120 183120.34196
1.85000 -8531.03946 92.24998 -3805.66101 742.11962 243.10651 192361.55038
1.95000 -8506.60388 89.21303 1629.74677 682.82571 232.63424 189747.76329
2.05000 -8491.71883 92.68094 -2397.75357 617.21333 217.07104 181328.16838
2.15000 -8452.06137 88.11610 -3720.22766 550.47202 211.19790 163934.92313
2.25000 -8419.40677 91.83648 1236.74097 501.83521 198.52319 161846.28985
2.35000 -8365.62589 86.91461 -1120.13592 465.79226 187.63135 156530.27553
2.45000 -8315.12185 89.71655 -62.88996 428.66311 181.44515 155503.97549
2.55000 -8248.04020 85.10478 -1985.00084 400.25931 178.91800 142317.82488
2.65000 -8193.15837 84.27208 -1378.87492 372.57862 172.06921 145190.16064
2.75000 -8148.00864 80.97438 1374.16744 337.60440 166.14973 137695.08189
2.85000 -8110.18253 80.13753 -848.64895 318.45869 161.50307 123261.79481
2.95000 -8050.77326 77.84628 -711.73181 296.41320 160.51723 121476.13536
3.05000 -8003.82615 75.84825 372.47419 268.56523 152.88401 117826.37958
3.15000 -7950.61911 79.64602 -1894.30752 239.85536 149.25690 123239.93314
3.25000 -7901.41928 77.18773 -407.48722 224.55950 143.73337 106844.61556
3.35000 -7854.20925 76.78966 2178.47687 207.40625 140.48830 110473.63257
3.45000 -7799.16656 78.20869 -2036.75572 197.72077 137.36614 100318.53589
3.55000 -7745.61317 76.29790 -708.65233 191.76111 136.03949 96230.12552
3.65000 -7687.85242 75.17624 1637.22639 190.62883 133.14577 99883.00764
3.75000 -7626.67324 74.77830 -2367.07746 181.39431 131.46178 96401.01244
3.85000 -7572.33191 75.62958 938.73443 173.41658 130.96454 84860.89663
3.95000 -7522.89796 70.72725 -204.12939 158.17949 133.87943 76571.11485
4.05000 -7479.35850 71.04404 -764.05964 146.00580 128.93983 90053.86027
4.15000 -7440.36875 71.05173 615.32844 141.05548 127.15858 75696.77797
4.25000 -7395.74099 69.29879 1198.29467 136.75464 124.34448 78947.53330
4.35000 -7350.88764 66.24049 1247.16397 133.70838 120.64582 73748.71500
4.45000 -7297.16697 69.82791 2774.24427 131.24695 117.83625 68851.82943
4.55000 -7246.09805 66.02369 108.61093 138.45750 116.03672 73742.75391
4.65000 -7189.46427 62.54705 279.35220 142.41202 111.30643 68137.08801
4.75000 -7131.35006 63.42646 170.31641 146.16665 110.62362 65121.39721
4.85000 -7068.26033 60.91867 -195.52953 134.04403 105.47866 59495.48801
4.95000 -7004.15768 59.46136 1468.29019 125.04179 104.71046 62273.03814
5.05000 -6947.03041 57.69929 701.16581 119.07343 102.73340 60692.44024
5.15000 -6890.26947 56.56209 186.66474 112.93288 101.54634 61322.90702
5.25000 -6829.29810 54.90655 -608.90565 105.75720 100.74462 66081.84377
5.35000 -6759.48787 54.30347 -497.00288 106.62432 97.09317 51841.56252
5.45000 -6689.27491 52.71701 -483.43398 100.23236 94.93138 49017.42832
5.55000 -6623.13967 53.38664 510.76564 96.55243 93.71197 45932.43786
5.65000 -6564.02056 50.60803 849.70667 101.31848 91.61704 46510.33677
5.75000 -6506.27723 50.10881 255.34923 103.38299 90.62011 47295.36175
5.85000 -6449.72365 48.24072 459.30561 105.44601 90.71950 38958.25937
5.95000 -6392.91748 47.52701 -59.17854 106.26998 91.62177 43863.72874
6.05000 -6334.98123 48.39611 1312.00554 104.06975 87.74716 64694.82189
6.15000 -6275.69286 44.17288 821.86529 101.76242 86.16244 38645.20477
6.25000 -6223.41062 45.33929 973.63087 100.59355 86.07628 48675.78584
6.35000 -6174.26820 43.37765 2101.25529 97.25718 83.26721 63604.84811
6.45000 -6126.23242 43.74304 300.44118 91.41228 83.43295 34058.13765
6.55000 -6078.98258 40.17850 -776.12204 89.28881 83.47430 41487.53620
6.65000 -6034.72260 42.99826 -798.56531 90.35552 83.93124 33721.64651
6.75000 -5989.62055 37.99931 268.25991 88.47698 79.30438 42180.91839
6.85000 -5940.36270 38.15437 -180.47001 87.15647 78.68337 31246.38813
6.95000 -5890.78180 38.38197 239.10137 84.30727 76.36080 30324.48395
7.05000 -5836.38204 37.35043 107.88955 85.53210 73.81706 30607.18925
7.15000 -5783.97018 38.42369 -923.35389 84.82169 75.23548 30850.46717
7.25000 -5732.49083 37.09864 -295.44590 82.59602 73.46791 39684.62658
7.35000 -5679.69187 37.22402 428.43821 80.65091 73.12553 30501.51052
7.45000 -5626.97352 36.09311 315.53611 77.82523 72.06896 25616.24599
7.55000 -5576.74459 35.84496 276.97831 74.59093 71.23876 29144.00904
7.65000 -5530.81308 32.22404 -65.71579 74.52738 69.86489 24357.62823
7.75000 -5483.00550 35.25189 -359.07725 75.27516 68.48863 25177.18226
7.85000 -5438.17516 34.17951 -102.15668 73.66633 67.10133 22135.89929
7.95000 -5395.92108 33.79565 -516.94077 75.73597 65.79689 28294.88350
8.05000 -5350.19148 32.51424 -58.03086 78.36302 63.45154 23988.71021
8.15000 -5307.86010 32.47965 -476.29409 79.37490 63.29597 35564.89731
8.25000 -5265.61211 30.95916 -590.95592 78.35862 63.54406 23099.61657
8.35000 -5224.51733 30.43116 53.96791 79.47202 62.99177 20442.68974
8.45000 -5179.54229 29.14546 -221.87002 77.01020 62.09760 18850.04721
8.55000 -5134.20368 29.29656 261.94299 76.12495 60.00559 50165.05663
8.65000 -5089.02287 29.44443 658.21254 72.93774 60.41129 20482.93547
8.75000 -5044.61815 26.88542 -551.75431 72.07239 58.71473 19703.22502
8.85000 -4999.46759 25.33046 -167.66610 70.69679 57.39071 17355.84370
8.95000 -4953.94003 25.75429 -117.88704 69.53605 57.32816 17278.14558
9.05000 -4913.74812 25.89617 -484.45533 67.90001 55.90668 16611.06791
9.15000 -4874.86256 25.56558 191.76283 66.00491 57.60653 18446.88485
9.25000 -4835.18580 25.02367 60.84834 64.15988 55.18790 13352.25047
9.35000 -4793.70513 25.19794 -260.35789 63.46443 53.75091 15366.52583
9.45000 -4748.90166 23.22501 1097.85001 62.37736 54.23278 73747.63048
9.55000 -4711.53106 23.25217 -174.84087 59.05490 54.31318 12332.06913
9.65000 -4673.21029 23.93535 189.79194 59.46832 54.08632 12424.27996
9.75000 -4638.17664 24.04301 -601.06973 61.46870 53.24024 21873.21788
9.85000 -4604.98135 23.41912 -14.67408 59.28338 53.12548 12133.04498
9.95000 -4575.76932 21.09515 270.23099 61.28591 52.81233 11344.63128
10.05000 -4548.20201 22.99030 394.50132 63.57816 51.20408 10228.04171
10.15000 -4516.32984 21.52353 -108.25613 63.68588 49.78873 10616.01504
10.25000 -4484.51526 23.08892 80.25256 61.05577 47.70884 10358.76554
10.35000 -4450.92461 21.11961 56.72776 61.19767 46.84465 10657.86073
10.45000 -4417.05543 21.73180 39.56242 59.40024 46.86507 9950.31358
10.55000 -4385.62921 20.11562 -106.00025 59.72539 46.08205 9679.16489
10.65000 -4352.04726 19.88633 -50.45757 60.43725 45.23188 9184.73541
10.75000 -4316.11322 19.67566 -253.11269 58.60948 44.62696 9127.16294
10.85000 -4281.15365 20.70117 242.10901 55.81049 45.23041 9784.86394
10.95000 -4244.42232 18.60971 135.54829 55.28180 43.76592 9191.90200
11.05000 -4209.17290 18.28980 -7.79807 56.71393 44.56276 8607.62572
11.15000 -4171.90283 19.36941 187.06265 56.13167 43.21741 9631.28977
11.25000 -4135.75188 19.37731 -46.49149 54.07077 43.94796 9055.71367
11.35000 -4096.94360 19.95759 -156.59841 51.55594 41.86533 7876.68910
11.45000 -4056.61840 18.74556 1911.75756 53.39898 40.39898 86314.90117
11.55000 -4019.69354 17.47967 -109.53480 49.95506 39.99342 6337.69994
11.65000 -3979.60134 15.56013 -172.20856 47.80219 40.43035 7173.36964
11.75000 -3942.09629 17.52489 -103.44724 46.26872 38.34566 6915.24099
11.85000 -3905.73450 15.60981 25.00055 44.42631 38.57231 7446.05220
11.95000 -3870.94271 15.31610 64.35710 44.39657 38.45460 6547.80492
12.05000 -3836.96965 15.11940 -150.85140 43.60686 38.38837 7974.12141
12.15000 -3801.30468 16.32290 -128.96596 42.41959 37.81183 7191.26428
12.25000 -3771.22345 14.50117 -29.29814 41.17010 38.02105 6163.16120
12.35000 -3741.94266 15.61523 192.18717 40.79847 39.82034 7012.85153
12.45000 -3714.55203 16.17822 -119.35648 39.04992 38.63336 5821.30267
12.55000 -3687.70858 16.38280 54.09559 40.07894 37.54716 5961.00638
12.65000 -3661.16547 14.11454 193.71519 39.77075 38.37508 5652.31041
12.75000 -3636.11420 14.28960 54.75734 39.74157 38.83146 4146.83357
12.85000 -3611.89184 14.67687 68.48485 41.42359 37.23625 5349.72774
12.95000 -3589.03309 13.42620 114.65339 42.20661 37.05056 5126.39586
13.05000 -3564.79169 13.21402 -82.23485 41.30349 36.75050 5668.32414
13.15000 -3545.20177 13.05712 -94.86681 40.68969 35.83314 4196.15375
13.25000 -3523.89136 13.60260 -1.09287 42.08442 35.72495 4313.84930
13.35000 -3505.42902 12.31294 112.82712 42.43588 35.60332 3688.98131
13.45000 -3482.80130 12.45449 62.22320 42.43971 33.87893 3644.20477
13.55000 -3459.98004 12.63379 -47.63602 44.23324 34.32729 4613.90441
13.65000 -3434.31247 12.58363 13.45673 39.19743 32.02674 4923.90515
13.75000 -3411.08338 13.48540 -15.10839 40.47823 32.76413 4285.31353
13.85000 -3389.13427 13.02324 -82.02451 36.94302 32.67478 3897.15207
13.95000 -3367.98449 12.23906 -17.51729 36.91741 32.57478 3732.75592
14.05000 -3346.42362 12.02149 69.79249 37.00943 31.36374 3917.40681
14.15000 -3324.36705 12.05272 137.70176 39.73818 30.69831 3276.91382
14.25000 -3301.02069 12.02134 49.64216 39.91142 31.02997 3465.16403
14.35000 -3276.49517 11.49421 -110.97646 38.03065 30.14256 4046.59368
14.45000 -3252.21909 11.94671 71.58729 38.58266 32.16201 3870.53932
14.55000 -3228.21998 10.40793 -20.10848 37.13174 29.89585 4331.62227
14.65000 -3204.42246 12.36894 -82.77288 35.20705 31.90434 3497.76210
14.75000 -3178.36623 10.17396 15.84210 34.76507 30.40212 3064.11689
14.85000 -3154.66951 11.87738 211.02647 35.75276 30.00718 3145.82543
14.95000 -3130.35880 10.38773 54.34851 32.52170 30.53979 2861.64045
15.05000 -3109.29273 11.80073 -16.56132 32.92792 29.69853 3280.01952
15.15000 -3083.36606 9.52363 4.63974 32.48450 29.22288 2734.43482
15.25000 -3060.78800 9.74808 -38.52826 33.65240 29.68350 3562.13050
15.35000 -3036.89401 10.94325 -33.80517 34.25131 29.04462 3087.62327
15.45000 -3015.37858 9.75627 -94.00701 32.84663 27.88647 2713.73605
15.55000 -2992.28637 8.85247 128.11478 32.85088 28.29420 5473.80865
15.65000 -2968.31117 9.43559 171.25236 30.68721 27.72394 1955.06070
15.75000 -2945.78918 8.44281 102.63568 30.61188 28.70283 3749.63626
15.85000 -2924.24246 7.22594 64.92582 31.25266 28.69883 2271.93134
15.95000 -2902.86723 10.49642 -9.02134 30.54266 28.02638 2810.37254
16.05000 -2882.71549 10.47450 118.30266 30.46338 27.73883 3786.46661
16.15000 -2861.22699 9.76188 237.67554 28.06569 28.13079 3126.37556
16.25000 -2841.36610 9.28349 -10.54106 28.75760 27.88884 2361.49708
16.35000 -2825.22171 9.15453 26.79590 28.74509 29.72764 1750.46902
16.45000 -2805.58881 8.38427 33.81153 28.42765 28.37513 1806.73714
16.55000 -2787.37889 7.43092 57.30353 27.35675 26.95399 1762.03678
16.65000 -2767.21751 8.30557 -20.70215 26.17282 27.24759 1568.02163
16.75000 -2750.18855 7.32788 14.76085 26.02074 27.40015 1744.68649
16.85000 -2732.15274 6.28509 -21.32374 26.51460 25.66600 1635.59466
16.95000 -2714.73468 8.76379 -17.41204 26.58357 24.99462 1428.85969
17.05000 -2700.76484 7.85827 89.31011 27.46141 24.65552 2296.34651
17.15000 -2682.18430 7.12695 10.15423 24.20297 24.44595 1466.04331
17.25000 -2664.95844 7.57687 -27.51369 25.00126 25.49170 1593.49135
17.35000 -2648.82637 7.34065 110.20058 25.65082 26.80208 1767.01007
17.45000 -2633.15495 8.12437 36.32204 24.75293 22.91528 1174.22126
17.55000 -2616.98801 7.18949 -15.80032 25.22582 25.58711 2260.93060
17.65000 -2601.24223 6.65086 -9.20067 27.00352 25.22182 1291.89701
17.75000 -2584.39982 7.98825 31.76166 25.72952 24.80780 1739.96684
17.85000 -2566.53999 5.96947 -114.96725 25.08517 25.89964 1550.27073
17.95000 -2553.43179 7.93683 -6.97900 24.45401 25.42233 1110.47208
18.05000 -2537.49362 7.44065 -45.07607 26.48050 24.27196 1466.92667
18.15000 -2520.57608 7.43571 -26.13241 27.74329 25.02860 3128.59555
18.25000 -2503.88283 6.84191 25.63533 25.92556 24.52391 1193.19749
18.35000 -2490.94620 6.99134 -79.43714 23.46927 25.47238 1468.08873
18.45000 -2473.69634 7.56687 18.01980 24.15505 23.59226 1339.04689
18.55000 -2460.55992 7.22112 95.99662 23.14461 25.11802 1698.26354
18.65000 -2444.79297 5.29600 52.77857 22.24638 23.48215 919.54764
18.75000 -2431.64495 5.45652 -148.63411 25.05783 23.56814 1397.98009
18.85000 -2419.16970 4.41398 57.15141 22.70225 23.60952 1034.07109
18.95000 -2402.33481 6.15566 -68.80348 23.97941 23.52292 1459.56481
19.05000 -2389.91857 6.42446 -62.57737 23.88776 23.70138 1118.20737
19.15000 -2377.43886 6.41021 -66.00472 25.69620 23.80795 1052.52048
19.25000 -2363.49895 8.14000 -56.38780 23.78068 23.96242 1317.18300
19.35000 -2346.93371 11.39547 -69.91103 24.79096 24.09043 1441.97991
19.45000 -2333.25883 13.07219 -66.20497 23.89536 24.74948 1284.39123
19.55000 -2320.61522 14.08508 26.22475 21.40867 22.26933 1279.22142
19.65000 -2307.00664 22.37888 38.84376 20.81530 23.00043 925.10355
19.75000 -2296.16715 22.44948 -67.48204 21.49686 22.98041 965.18871
19.85000 -2284.85327 22.59931 -80.46402 19.84978 20.85925 1057.69928
19.95000 -2272.37133 24.50156 71.72972 20.60408 22.19825 1023.45737
