0.12500 0.03909
0.37500 0.00571
0.62500 0.01332
0.87500 0.01625
1.12500 0.02762
1.37500 0.02911
1.62500 0.03335
1.87500 0.02002
2.12500 0.02569
2.37500 0.02502
2.62500 0.03546
2.87500 0.01450
3.12500 0.00604
3.37500 0.00896
3.62500 0.00824
3.87500 0.02934
4.12500 0.02831
4.37500 0.03432
4.62500 0.02431
4.87500 0.03715
5.12500 0.01399
5.37500 0.01855
5.62500 0.01632
5.87500 0.01809
6.12500 0.03056
6.37500 0.01170
6.62500 0.01429
6.87500 0.00599
7.12500 0.02632
7.37500 0.01016
7.62500 0.01131
7.87500 0.02183
8.12500 0.00737
8.37500 0.01395
8.62500 0.02715
8.87500 0.02049
9.12500 0.01874
9.37500 0.03027
9.62500 0.01141
9.87500 0.02047
10.12500 0.02279
10.37500 0.00483
10.62500 0.01385
10.87500 0.02542
11.12500 0.00111
11.37500 0.01262
11.62500 0.03260
11.87500 0.04579
12.12500 0.00606
12.37500 0.03218
12.62500 0.02672
12.87500 0.02685
13.12500 0.03893
13.37500 0.03680
13.62500 0.03390
13.87500 0.02223
14.12500 0.02459
14.37500 0.01188
14.62500 0.01048
14.87500 0.01291
