0.05000 3512.42681
0.15000 5604.62405
0.25000 8218.33467
0.35000 10042.42763
0.45000 11382.78655
0.55000 11985.81917
0.65000 12307.11267
0.75000 12324.61577
0.85000 11992.33195
0.95000 11557.28964
1.05000 11107.76859
1.15000 10538.46580
1.25000 10098.80142
1.35000 9525.95383
1.45000 9105.11518
1.55000 8532.50501
1.65000 8047.61758
1.75000 7720.70009
1.85000 7316.64927
1.95000 6972.72914
2.05000 6656.20144
2.15000 6415.03584
2.25000 6071.06290
2.35000 5755.22299
2.45000 5557.65400
2.55000 5237.71066
2.65000 5021.72851
2.75000 4908.46719
2.85000 4685.04891
2.95000 4482.17034
3.05000 4359.37371
3.15000 4199.51737
3.25000 4076.36433
3.35000 3925.52635
3.45000 3799.13415
3.55000 3605.91627
3.65000 3526.33153
3.75000 3415.07977
3.85000 3319.16217
3.95000 3165.63184
4.05000 3142.35352
4.15000 3001.33321
4.25000 2897.49205
4.35000 2874.03662
4.45000 2725.37545
4.55000 2678.71424
4.65000 2560.07912
4.75000 2431.62908
4.85000 2386.46026
4.95000 2284.82507
5.05000 2146.60848
5.15000 2111.25992
5.25000 2015.73544
5.35000 1949.36200
5.45000 1858.02514
5.55000 1798.12062
5.65000 1735.99225
5.75000 1695.14626
5.85000 1631.56588
5.95000 1540.64767
6.05000 1491.85260
6.15000 1441.43869
6.25000 1390.85616
6.35000 1353.70465
6.45000 1307.32187
6.55000 1270.52327
6.65000 1223.61458
6.75000 1173.27440
6.85000 1150.19121
6.95000 1097.88850
7.05000 1064.64206
7.15000 1043.16320
7.25000 1011.26459
7.35000 978.42196
7.45000 941.52042
7.55000 906.98097
7.65000 890.45433
7.75000 862.69627
7.85000 840.24544
7.95000 818.16142
8.05000 774.11920
8.15000 751.93244
8.25000 727.63315
8.35000 709.29683
8.45000 679.38816
8.55000 658.82343
8.65000 639.54217
8.75000 628.64493
8.85000 608.89709
8.95000 599.45911
9.05000 572.80640
9.15000 563.76033
9.25000 556.26839
9.35000 554.82436
9.45000 534.15667
9.55000 520.11759
9.65000 518.00086
9.75000 507.02241
9.85000 488.64260
9.95000 488.17800
10.05000 483.15108
10.15000 472.01173
10.25000 463.28988
10.35000 442.70909
10.45000 453.22100
10.55000 437.26979
10.65000 427.52304
10.75000 421.99912
10.85000 416.25752
10.95000 405.25937
11.05000 392.56282
11.15000 380.87663
11.25000 375.41457
11.35000 367.54050
11.45000 361.41664
11.55000 358.52246
11.65000 351.26438
11.75000 351.91228
11.85000 328.89584
11.95000 329.01132
12.05000 322.90629
12.15000 309.61879
12.25000 296.09539
12.35000 295.16250
12.45000 288.92189
12.55000 285.42385
12.65000 273.56045
12.75000 259.97925
12.85000 263.51379
12.95000 255.57142
13.05000 245.53561
13.15000 243.28041
13.25000 239.06013
13.35000 240.87601
13.45000 227.23504
13.55000 231.13501
13.65000 220.42583
13.75000 201.96840
13.85000 210.52129
13.95000 206.45593
14.05000 195.39266
14.15000 185.34540
14.25000 192.25418
14.35000 196.93844
14.45000 183.53689
14.55000 168.30880
14.65000 176.37115
14.75000 171.75498
14.85000 165.26353
14.95000 168.06434
15.05000 153.46319
15.15000 157.72008
15.25000 155.35279
15.35000 160.56573
15.45000 157.88607
15.55000 153.43681
15.65000 151.58163
15.75000 147.13513
15.85000 154.88104
15.95000 147.65652
16.05000 144.67181
16.15000 149.76227
16.25000 138.70653
16.35000 140.16444
16.45000 135.94671
16.55000 139.26594
16.65000 134.29228
16.75000 129.98348
16.85000 120.94767
16.95000 131.32911
17.05000 123.36273
17.15000 132.41882
17.25000 123.30643
17.35000 129.08255
17.45000 128.97788
17.55000 120.27593
17.65000 124.81089
17.75000 119.82450
17.85000 110.08909
17.95000 119.67909
18.05000 111.15830
18.15000 116.77238
18.25000 113.23125
18.35000 109.99773
18.45000 107.21292
18.55000 106.14925
18.65000 104.39111
18.75000 100.91409
18.85000 96.00365
18.95000 103.66992
19.05000 106.16222
19.15000 108.62297
19.25000 95.60566
19.35000 106.37554
19.45000 86.62137
19.55000 90.77994
19.65000 95.61656
19.75000 90.86852
19.85000 88.73007
19.95000 86.70778
