0.120000 -1.248190
0.380000 -0.482620
0.620000 -0.569670
0.880000 -0.549700
1.120000 -0.615610
1.380000 -0.635290
1.620000 -0.694640
1.880000 -0.679960
2.120000 -0.659280
2.380000 -0.653910
2.620000 -0.628850
2.880000 -0.649090
3.120000 -0.614720
3.380000 -0.622930
3.620000 -0.618940
3.880000 -0.571240
4.120000 -0.526020
4.380000 -0.483740
4.620000 -0.414340
4.880000 -0.374450
5.120000 -0.380570
5.380000 -0.398130
5.620000 -0.431180
5.880000 -0.630380
6.120000 -0.708840
6.380000 -0.785810
6.620000 -0.829390
6.880000 -0.818270
7.120000 -0.960380
7.380000 -0.841310
7.620000 -0.831380
7.880000 -0.930930
8.120000 -1.087110
8.380000 -1.353510
8.620000 -1.408790
8.880000 -1.495980
9.120000 -1.518960
9.380000 -1.661910
9.620000 -2.178830
9.880000 -1.895150
10.120000 -2.301990
10.380000 -1.886590
10.620000 -1.937480
10.880000 -1.753080
11.120000 -1.266640
11.380000 -1.305680
11.620000 -1.277210
11.880000 -1.526400
12.120000 -1.802390
12.380000 -1.845420
12.620000 -1.857270
12.880000 -2.170990
13.120000 -2.202490
13.380000 -2.308720
13.620000 -2.694460
13.880000 -2.539870
14.120000 -2.676620
14.380000 -3.057260
14.620000 -2.836520
14.880000 -2.877420
