0.05000 2323.47579
0.15000 3783.33900
0.25000 4815.04678
0.35000 5576.55558
0.45000 5943.03091
0.55000 6257.78292
0.65000 6380.04135
0.75000 6432.70945
0.85000 6322.52286
0.95000 6260.38495
1.05000 6081.07407
1.15000 5994.25217
1.25000 5824.67533
1.35000 5675.09352
1.45000 5553.75313
1.55000 5394.02068
1.65000 5196.95516
1.75000 5044.50469
1.85000 4910.48387
1.95000 4728.01620
2.05000 4567.53925
2.15000 4481.19594
2.25000 4363.90879
2.35000 4199.06929
2.45000 4108.91595
2.55000 3923.80084
2.65000 3833.57727
2.75000 3725.81577
2.85000 3628.25873
2.95000 3534.15164
3.05000 3415.07413
3.15000 3337.29107
3.25000 3282.35636
3.35000 3189.09262
3.45000 3090.09856
3.55000 3011.48618
3.65000 2932.37757
3.75000 2906.60898
3.85000 2805.49689
3.95000 2725.14508
4.05000 2635.49469
4.15000 2616.38069
4.25000 2534.95076
4.35000 2463.42883
4.45000 2428.61059
4.55000 2338.42658
4.65000 2271.95848
4.75000 2216.39013
4.85000 2171.96583
4.95000 2128.06156
5.05000 2080.16702
5.15000 2045.93192
5.25000 1980.16659
5.35000 1934.72435
5.45000 1895.76728
5.55000 1850.04703
5.65000 1825.19277
5.75000 1765.73299
5.85000 1751.68256
5.95000 1715.89103
6.05000 1664.62806
6.15000 1617.84401
6.25000 1603.70236
6.35000 1565.75736
6.45000 1522.96027
6.55000 1490.61410
6.65000 1450.70592
6.75000 1421.71284
6.85000 1392.01058
6.95000 1356.26734
7.05000 1328.99052
7.15000 1311.23501
7.25000 1274.38290
7.35000 1248.38263
7.45000 1211.31999
7.55000 1179.54024
7.65000 1160.93160
7.75000 1122.78630
7.85000 1105.58571
7.95000 1087.55597
8.05000 1070.02959
8.15000 1049.27532
8.25000 1013.08128
8.35000 1000.97687
8.45000 966.00477
8.55000 957.70572
8.65000 930.42873
8.75000 907.14383
8.85000 886.10632
8.95000 878.56319
9.05000 844.06512
9.15000 827.76754
9.25000 806.24783
9.35000 785.97523
9.45000 780.23760
9.55000 762.16827
9.65000 745.34869
9.75000 736.78070
9.85000 712.25501
9.95000 698.01174
10.05000 678.64256
10.15000 672.03522
10.25000 656.87973
10.35000 642.31656
10.45000 629.44676
10.55000 622.22302
10.65000 598.49658
10.75000 592.73725
10.85000 575.00345
10.95000 568.36191
11.05000 549.68365
11.15000 546.17654
11.25000 547.39190
11.35000 522.79550
11.45000 514.64878
11.55000 502.36507
11.65000 493.58826
11.75000 482.48252
11.85000 468.17897
11.95000 467.43028
12.05000 457.67220
12.15000 443.50119
12.25000 435.43350
12.35000 428.93373
12.45000 425.27421
12.55000 410.68481
12.65000 404.88699
12.75000 392.36335
12.85000 385.91099
12.95000 380.92761
13.05000 370.21997
13.15000 366.69231
13.25000 374.12354
13.35000 356.51318
13.45000 345.03332
13.55000 346.74436
13.65000 333.17160
13.75000 328.14690
13.85000 326.45569
13.95000 316.84377
14.05000 311.47157
14.15000 300.80866
14.25000 306.31751
14.35000 299.98143
14.45000 292.63108
14.55000 281.31802
14.65000 277.23781
14.75000 273.54918
14.85000 269.35689
14.95000 266.51043
15.05000 259.45000
15.15000 256.62889
15.25000 257.91177
15.35000 249.40381
15.45000 233.38947
15.55000 232.44239
15.65000 232.33352
15.75000 223.88395
15.85000 223.86814
15.95000 223.13675
16.05000 211.16194
16.15000 216.54907
16.25000 209.20217
16.35000 206.26711
16.45000 199.10658
16.55000 200.21572
16.65000 191.48005
16.75000 191.37687
16.85000 187.92735
16.95000 183.68368
17.05000 182.19215
17.15000 199.01876
17.25000 173.54717
17.35000 175.70952
17.45000 166.80019
17.55000 166.27964
17.65000 163.07540
17.75000 161.34152
17.85000 158.76475
17.95000 158.84956
18.05000 151.60658
18.15000 151.66977
18.25000 152.40844
18.35000 145.64160
18.45000 143.48380
18.55000 140.14043
18.65000 136.93049
18.75000 134.43411
18.85000 134.63704
18.95000 135.69050
19.05000 130.98141
19.15000 125.44016
19.25000 128.96767
19.35000 121.07096
19.45000 121.49397
19.55000 116.80174
19.65000 119.88651
19.75000 112.68789
19.85000 113.27563
19.95000 108.66569
