0.12500 0.04326
0.37500 0.04711
0.62500 0.06522
0.87500 0.11039
1.12500 0.14986
1.37500 0.21382
1.62500 0.26130
1.87500 0.29003
2.12500 0.33705
2.37500 0.36573
2.62500 0.39499
2.87500 0.42430
3.12500 0.44827
3.37500 0.48583
3.62500 0.49072
3.87500 0.50951
4.12500 0.53183
4.37500 0.55681
4.62500 0.56690
4.87500 0.59620
5.12500 0.61006
5.37500 0.61515
5.62500 0.63233
5.87500 0.63695
6.12500 0.63952
6.37500 0.64687
6.62500 0.64235
6.87500 0.64499
7.12500 0.62118
7.37500 0.60096
7.62500 0.56420
7.87500 0.56969
8.12500 0.54483
8.37500 0.47052
8.62500 0.51012
8.87500 0.46966
9.12500 0.41856
9.37500 0.40591
9.62500 0.37758
9.87500 0.38599
10.12500 0.35247
10.37500 0.34622
10.62500 0.30270
10.87500 0.28096
11.12500 0.26781
11.37500 0.22838
11.62500 0.23363
11.87500 0.17116
12.12500 0.13247
12.37500 0.10753
12.62500 0.05406
12.87500 0.04371
13.12500 0.03132
13.37500 0.03499
13.62500 0.02288
13.87500 0.02685
14.12500 0.01872
14.37500 0.04017
14.62500 0.01231
14.87500 0.02594
15.12500 0.03275
15.37500 0.02410
15.62500 0.06596
15.87500 0.08208
16.12500 0.02914
16.37500 0.03157
16.62500 0.05739
16.87500 0.10142
17.12500 0.02263
17.37500 0.06803
17.62500 0.05634
17.87500 0.05865
18.12500 0.02536
18.37500 0.05987
18.62500 0.11604
18.87500 0.08172
19.12500 0.12300
19.37500 0.09852
19.62500 0.08250
19.87500 0.04103
