0.120000 -1.499230
0.380000 1.651410
0.620000 0.389020
0.880000 -0.146910
1.120000 0.447170
1.380000 0.414080
1.620000 0.394500
1.880000 0.357770
2.120000 0.247020
2.380000 0.268230
2.620000 0.339360
2.880000 0.255650
3.120000 0.233730
3.380000 0.272480
3.620000 0.261980
3.880000 0.236690
4.120000 0.262130
4.380000 0.308370
4.620000 0.202630
4.880000 0.151250
5.120000 0.168340
5.380000 0.100130
5.620000 0.039250
5.880000 -0.028890
6.120000 -0.109990
6.380000 -0.111340
6.620000 -0.116710
6.880000 -0.340050
7.120000 -0.392100
7.380000 -0.341780
7.620000 -0.533700
7.880000 -0.574060
8.120000 -0.645070
8.380000 -0.579950
8.620000 -0.692630
8.880000 -0.459090
9.120000 -0.550000
9.380000 -0.573610
9.620000 -0.359730
9.880000 -0.664030
10.120000 -0.628590
10.380000 -0.567280
10.620000 -0.475430
10.880000 -0.759580
11.120000 -0.802870
11.380000 -1.167850
11.620000 -1.220260
11.880000 -1.988260
12.120000 -2.219870
12.380000 -2.413690
12.620000 -2.914370
12.880000 -2.956940
13.120000 2.770890
13.380000 2.805310
13.620000 -2.971220
13.880000 -3.003580
14.120000 -2.547890
14.380000 -2.627760
14.620000 -2.688390
14.880000 -2.690030
