0.12500 0.03192
0.37500 0.02251
0.62500 0.04674
0.87500 0.05576
1.12500 0.08225
1.37500 0.10937
1.62500 0.13962
1.87500 0.16341
2.12500 0.20315
2.37500 0.20805
2.62500 0.21437
2.87500 0.18974
3.12500 0.16662
3.37500 0.15797
3.62500 0.14560
3.87500 0.12559
4.12500 0.10566
4.37500 0.09113
4.62500 0.07396
4.87500 0.06278
5.12500 0.04393
5.37500 0.04789
5.62500 0.03877
5.87500 0.03885
6.12500 0.04491
6.37500 0.06392
6.62500 0.07705
6.87500 0.08821
7.12500 0.09040
7.37500 0.09266
7.62500 0.09269
7.87500 0.09671
8.12500 0.08478
8.37500 0.08499
8.62500 0.07397
8.87500 0.06446
9.12500 0.04507
9.37500 0.04084
9.62500 0.02685
9.87500 0.02345
10.12500 0.02165
10.37500 0.01937
10.62500 0.02192
10.87500 0.02535
11.12500 0.02859
11.37500 0.01225
11.62500 0.02749
11.87500 0.02011
12.12500 0.01000
12.37500 0.01374
12.62500 0.01412
12.87500 0.01655
13.12500 0.01261
13.37500 0.03686
13.62500 0.06451
13.87500 0.04520
14.12500 0.06351
14.37500 0.07307
14.62500 0.06966
14.87500 0.08482
