0.120000 2.862430
0.380000 3.101880
0.620000 -1.171070
0.880000 -1.284640
1.120000 -1.468040
1.380000 -1.436820
1.620000 -1.226300
1.880000 -1.261600
2.120000 -1.301250
2.380000 -1.337720
2.620000 -1.305530
2.880000 -1.253650
3.120000 -1.317040
3.380000 -1.655040
3.620000 -1.452830
3.880000 -1.415720
4.120000 -1.479780
4.380000 -1.489460
4.620000 -1.548900
4.880000 -1.689960
5.120000 -1.550100
5.380000 -1.779280
5.620000 -1.674040
5.880000 -1.732210
6.120000 -1.689550
6.380000 -1.684850
6.620000 -1.583850
6.880000 -1.745460
7.120000 -1.816300
7.380000 -1.558090
7.620000 -1.860650
7.880000 -1.915560
8.120000 -1.575410
8.380000 -1.964190
8.620000 -1.758360
8.880000 -1.834340
9.120000 -1.866320
9.380000 -1.935630
9.620000 -1.627980
9.880000 -2.504310
10.120000 -2.336920
10.380000 -2.473370
10.620000 2.459870
10.880000 -2.999500
11.120000 2.979570
11.380000 2.762070
11.620000 2.613950
11.880000 3.054390
12.120000 1.875850
12.380000 1.981980
12.620000 2.420220
12.880000 2.152330
13.120000 1.803610
13.380000 2.241620
13.620000 1.981860
13.880000 1.392000
14.120000 1.693940
14.380000 2.062210
14.620000 1.569050
14.880000 1.153780
