0.120000 0.079090
0.380000 -0.148420
0.620000 -0.052130
0.880000 -0.053720
1.120000 -0.058250
1.380000 -0.049330
1.620000 -0.073290
1.880000 -0.046730
2.120000 -0.041780
2.380000 -0.052260
2.620000 -0.039710
2.880000 -0.014210
3.120000 -0.037440
3.380000 -0.040430
3.620000 -0.039560
3.880000 -0.003090
4.120000 -0.037330
4.380000 -0.022410
4.620000 -0.012830
4.880000 -0.037140
5.120000 -0.037130
5.380000 -0.024250
5.620000 -0.026960
5.880000 -0.016790
6.120000 -0.020130
6.380000 0.001700
6.620000 -0.020560
6.880000 -0.006910
7.120000 0.009920
7.380000 0.014220
7.620000 0.041390
7.880000 0.024750
8.120000 0.034240
8.380000 0.052580
8.620000 0.055440
8.880000 0.093000
9.120000 0.093040
9.380000 0.103820
9.620000 0.086200
9.880000 0.135370
10.120000 0.107480
10.380000 0.170410
10.620000 0.192230
10.880000 0.189700
11.120000 0.201130
11.380000 0.218750
11.620000 0.149000
11.880000 0.173000
12.120000 0.106710
12.380000 0.086580
12.620000 0.086190
12.880000 -0.024660
13.120000 -0.265840
13.380000 -0.125490
13.620000 0.017550
13.880000 -0.319370
14.120000 -0.379710
14.380000 -0.461620
14.620000 -0.047990
14.880000 -0.597540
