0.1875 -0.01141 15.40191 -4.03265 135.74633 135.72646 123.76152
0.5625 -1.26898 36.717 -1.47253 129.55307 121.11349 108.45161
0.9375 0.07013 56.87044 -1.48589 122.28667 106.66195 96.55158
1.3125 -1.14004 68.49682 -1.66877 117.19894 97.21999 86.64237
1.6875 -1.05312 78.93257 0.32179 111.97256 90.01602 80.35285
2.0625 -0.91269 86.14351 -0.40337 106.00036 86.13057 74.39986
2.4375 0.82216 94.8046 1.27381 100.92331 82.13233 70.64092
2.8125 1.3066 100.0204 -0.21363 95.60819 79.86387 66.71085
3.1875 1.15 109.1325 -0.98066 90.97674 78.09884 63.76937
3.5625 -0.79065 116.31296 0.20589 85.75158 74.6241 60.80815
3.9375 -0.15677 126.73185 0.29369 80.05026 71.95065 58.37998
4.3125 0.35748 136.49157 0.48401 72.80452 69.15473 54.56045
4.6875 0.93233 148.04715 0.08832 66.97302 64.10388 52.58525
5.0625 -1.39484 156.03659 1.55125 60.99522 60.485 48.31007
5.4375 -1.13002 165.73836 0.95839 56.53839 55.00471 45.01693
5.8125 -0.70395 174.00148 0.74523 52.08802 50.20793 40.36311
6.1875 0.27325 180.02558 0.48354 48.63475 44.68312 36.87397
6.5625 -0.34251 183.39807 0.8111 45.59138 40.53073 34.53116
6.9375 0.09688 187.07952 0.02176 42.67504 36.71743 32.47827
7.3125 0.92071 189.83548 -0.9258 40.18604 34.38566 31.22905
7.6875 1.10058 192.31529 -0.23016 39.18408 33.80561 30.03584
8.0625 -0.16505 194.2048 -0.14321 38.47642 33.73669 27.70938
8.4375 1.33368 197.51893 0.91574 36.62889 31.40491 26.72597
8.8125 -0.87777 199.21189 1.23589 35.49632 28.81104 26.04325
9.1875 0.3928 200.49877 0.83653 34.24802 27.08358 24.69079
9.5625 -0.58385 200.69536 -0.23746 33.66785 25.5117 24.3114
9.9375 0.12507 201.28561 -0.80467 32.46988 24.70936 23.60752
10.3125 -1.77411 201.28434 0.44766 31.85851 23.33744 22.85673
10.6875 -1.00172 201.06587 0.39349 31.28123 23.53433 22.22983
11.0625 -1.57209 201.22101 -0.02637 29.49463 23.16628 21.26865
11.4375 0.03712 202.25404 0.40285 29.01115 21.36983 20.99441
11.8125 0.0999 203.83171 0.14697 28.11799 22.06713 20.10484
12.1875 -1.23697 203.32967 0.704 28.03714 21.55858 20.63515
12.5625 -1.05352 205.53873 1.73135 25.61538 20.72724 18.61455
12.9375 -0.72926 205.62749 2.86783 25.84061 20.98271 18.7651
13.3125 -0.19081 208.06342 2.29568 24.93082 20.12678 17.89048
13.6875 -1.94013 207.08992 3.21473 24.90667 20.18496 17.71356
14.0625 -0.02046 208.12306 2.95686 23.4955 18.60764 16.73648
14.4375 0.24897 208.19046 3.81884 23.64491 17.04316 17.14849
14.8125 -0.63264 208.55815 2.22127 24.12123 15.7976 16.53073
15.1875 1.23773 207.28676 3.1179 23.02621 15.91176 16.76911
15.5625 0.99611 205.04754 2.94089 22.82271 13.74902 16.55699
15.9375 0.20589 205.66952 2.31757 22.73379 13.56331 15.58519
16.3125 -0.0919 203.39386 2.84052 22.86471 14.37475 15.10611
16.6875 0.82069 202.47437 2.03989 20.66302 14.56007 14.69401
17.0625 -0.4062 203.70085 1.69916 20.33576 15.50614 13.68555
17.4375 0.76894 202.50349 1.49176 20.2614 14.88896 13.56457
17.8125 0.19337 201.28669 -0.05732 19.37976 15.08272 15.02817
18.1875 -0.07248 202.70118 0.91121 18.1522 14.57207 13.60728
18.5625 -0.94173 202.69514 -0.20339 18.50912 14.49088 14.54207
18.9375 -1.26347 204.48381 -0.43878 16.53477 13.23808 14.2769
19.3125 0.14289 204.98457 0.1882 17.08435 12.31682 15.10114
19.6875 -0.61863 205.87998 -0.40481 14.8226 12.50873 16.70204
20.0625 -1.51156 205.21455 2.2901 15.88221 12.30265 15.05488
20.4375 -1.34183 205.74902 -0.03237 15.91567 11.8299 15.53031
20.8125 -0.29689 204.38414 1.89112 15.68006 10.17781 15.65063
21.1875 -0.47392 204.57492 1.24123 14.66578 11.81299 13.95289
21.5625 -0.69568 204.89379 3.37562 15.21725 11.04608 13.47302
21.9375 1.82169 204.59695 4.2215 15.71775 10.99541 13.4025
22.3125 0.36144 205.7522 1.93352 14.33164 10.20846 11.53056
22.6875 0.66478 207.10101 2.82872 12.93706 8.51646 12.77966
23.0625 1.17746 204.48445 2.16695 16.01016 8.80133 11.607
23.4375 2.47663 204.12802 0.09489 12.47339 9.67615 10.37707
23.8125 0.81211 203.17741 1.31086 12.40898 9.83738 9.84123
24.1875 -1.11832 204.92852 -0.50112 12.46035 10.19362 10.96878
24.5625 2.38997 206.28529 0.5522 12.30442 9.86803 10.29857
24.9375 -0.37099 205.0715 1.85513 15.13182 8.06545 9.37618
25.3125 -0.00103 202.09633 2.40586 10.31626 9.82929 8.68512
25.6875 1.78013 199.18588 -1.30917 14.01833 10.09857 9.29042
26.0625 -6.94726 203.54699 -0.4358 13.06594 8.49175 8.86136
26.4375 2.30664 203.06404 -0.69395 11.57988 6.13767 9.79495
26.8125 2.92566 203.76783 0.67544 11.11241 8.97263 8.08408
27.1875 -2.05735 201.89091 -0.61519 9.81758 8.90313 9.10582
27.5625 6.67475 203.12694 3.24229 10.11406 3.02789 5.11819
27.9375 -2.51375 202.02468 0.91222 9.47465 8.46212 5.83109
28.3125 1.02738 200.62378 -0.2354 9.06717 5.67966 7.13961
28.6875 -1.68347 202.13725 -0.27187 15.21126 6.74061 5.80616
29.0625 -5.66558 200.59709 -0.56038 10.49242 6.62987 7.62013
29.4375 -0.92122 197.18176 1.31999 11.22799 6.90013 7.00979
29.8125 -0.1981 202.93948 1.96041 7.1578 6.88222 5.05002
