0.120000 3.116250
0.380000 2.938410
0.620000 2.889610
0.880000 2.950630
1.120000 2.962720
1.380000 2.898940
1.620000 2.876860
1.880000 2.882140
2.120000 2.915870
2.380000 2.964450
2.620000 2.919660
2.880000 2.817510
3.120000 2.644710
3.380000 2.534940
3.620000 2.402620
3.880000 2.337150
4.120000 2.313480
4.380000 2.173860
4.620000 1.873180
4.880000 1.265230
5.120000 0.848950
5.380000 0.755920
5.620000 0.575740
5.880000 0.438490
6.120000 0.273330
6.380000 0.252500
6.620000 0.150710
6.880000 2.869700
7.120000 2.830520
7.380000 2.869720
7.620000 2.758240
7.880000 2.728390
8.120000 2.590080
8.380000 2.567120
8.620000 2.372770
8.880000 2.389420
9.120000 2.108140
9.380000 1.985060
9.620000 1.863250
9.880000 1.956930
10.120000 1.995000
10.380000 1.911670
10.620000 2.315570
10.880000 1.855530
11.120000 1.879790
11.380000 1.891250
11.620000 1.527810
11.880000 1.118830
12.120000 0.869080
12.380000 0.338210
12.620000 0.177720
12.880000 -0.186140
13.120000 -0.076920
13.380000 -0.247500
13.620000 -0.362620
13.880000 -0.100250
14.120000 -0.327780
14.380000 -0.454780
14.620000 -0.524990
14.880000 -0.569330
