0.05000 -16447.57892 3099.91618 -333883.54102 17987.99465 27715.73189 2062325.81246
0.15000 -31563.69050 -746.14486 -142112.63742 13585.36941 21912.36376 1774492.56691
0.25000 -38268.01557 740.75584 -179957.47986 9396.41745 17418.65872 1675347.61422
0.35000 -39520.75282 176.99993 98409.21693 6723.37101 11384.36829 1335402.42672
0.45000 -35337.84869 249.18840 -70410.76793 5515.64196 8178.89564 1251531.58925
0.55000 -32283.73902 -18.06357 28725.63221 4218.39863 6428.62902 1053920.59553
0.65000 -29285.82486 -137.67397 -8643.70572 3457.39724 5179.84553 1045289.85131
0.75000 -26553.49742 47.39206 -1406.17194 3290.75404 4120.00862 849690.99869
0.85000 -24677.15611 87.80718 1473.21223 2855.87191 3555.95273 893482.03496
0.95000 -22935.48806 -20.42912 14373.91723 2594.71629 3067.88555 778652.42736
1.05000 -21272.02657 65.81311 -3199.56613 2073.74854 2556.42337 706491.85577
1.15000 -19826.55979 45.02727 21775.47881 1999.11060 2569.14457 585642.62979
1.25000 -18682.36801 7.57680 8501.98547 1918.51081 2530.70195 613105.65398
1.35000 -17531.29137 107.40760 5390.52658 1908.09513 2083.71989 585970.70159
1.45000 -16560.66054 -60.62974 14020.31603 1733.69376 2156.66012 502549.83357
1.55000 -15752.50813 -10.49867 -13074.05380 1522.83002 2107.42558 506431.70515
1.65000 -14954.79627 -9.59285 -5416.23445 1285.17286 1760.63409 499077.31893
1.75000 -14267.99170 37.38493 9889.82324 1589.19656 2131.06149 437901.31446
1.85000 -13689.89549 -10.04365 -16469.83463 1248.63033 2064.44617 420572.31081
1.95000 -13133.53167 4.07365 2693.51518 1186.42287 1483.22643 415616.43590
2.05000 -12643.91828 -7.93445 4129.57228 1289.76528 1453.16063 400993.40360
2.15000 -12201.78204 -32.26623 2911.63817 1098.20162 1722.12539 388133.45375
2.25000 -11742.99300 53.16085 -13057.46150 1214.90856 1828.91657 336251.70202
2.35000 -11408.89382 -11.60346 -3927.99681 1057.73948 1211.87814 363421.37653
2.45000 -11073.91694 6.50288 14587.22565 930.48842 1231.90463 363216.27838
2.55000 -10780.21115 -71.00319 -1979.29491 1141.39024 1530.11585 378939.36900
2.65000 -10439.35539 31.75466 2284.96399 1010.19417 1122.62040 330057.07214
2.75000 -10245.41729 34.53255 6103.98432 807.69352 1116.23940 294131.69678
2.85000 -9968.51439 -15.52510 -3017.55439 923.94957 1084.19972 287657.38051
2.95000 -9752.49939 -22.41631 -487.61115 950.90994 1053.93025 280148.43944
3.05000 -9534.22945 11.32977 -9253.25142 916.42948 1079.32388 284752.83988
3.15000 -9315.54003 0.94545 -3410.04471 1340.50132 1044.60070 265894.61757
3.25000 -9251.41299 9.24298 -6688.84918 1043.97143 997.91488 270634.45913
3.35000 -9055.53331 24.41921 -2171.43770 809.86073 992.00704 244051.92489
3.45000 -8866.24134 -45.25223 -5005.23073 736.25415 856.02076 218700.12327
3.55000 -8733.10225 -16.24946 854.11610 1093.32082 1050.26038 193005.69606
3.65000 -8627.64545 -5.78591 -3424.58026 916.84603 906.45471 237211.69179
3.75000 -8527.92109 -42.97197 2137.77705 792.79529 860.52062 211682.75585
3.85000 -8377.78856 -15.44620 10656.81597 666.71153 747.57562 228805.98178
3.95000 -8284.39066 38.84548 -883.96022 1083.93109 1185.82592 193310.06626
4.05000 -8169.85310 -9.24318 4999.20461 971.46981 792.10758 180992.91668
4.15000 -8048.81783 12.57358 -140.88024 888.16666 704.00376 161086.35547
4.25000 -7941.53975 -1.03670 3556.08690 1328.00234 1385.76522 149492.05382
4.35000 -7920.33467 -12.99898 3799.95742 794.28702 880.75752 145077.05394
4.45000 -7866.55804 16.74955 3665.84520 854.37150 908.19066 154983.05791
4.55000 -7810.20965 -3.30687 -2245.87603 884.28770 857.03584 147101.45970
4.65000 -7728.19189 2.50911 4219.44284 701.94625 893.85746 129771.23216
4.75000 -7677.45757 19.75012 2529.15333 737.68460 641.83766 160855.78049
4.85000 -7615.91705 43.36369 -1377.19309 1243.43555 1442.75701 114804.11706
4.95000 -7562.66797 12.15348 1812.94238 687.00614 537.91376 123483.90387
5.05000 -7484.38562 35.72638 1421.38677 608.32924 580.71358 124255.89210
5.15000 -7451.26770 36.10898 -3027.99036 594.84304 635.88843 117290.03283
5.25000 -7394.48809 16.96584 2386.47604 580.68778 594.18903 104161.78202
5.35000 -7341.58481 32.40963 -87.10283 575.91070 520.04386 94122.45175
5.45000 -7312.97382 16.27050 -2594.19016 929.36371 941.93681 92380.60576
5.55000 -7271.02973 8.39026 -327.06907 564.60759 707.95712 86415.96628
5.65000 -7223.81239 16.34631 -2030.84010 516.27400 490.59870 83224.18164
5.75000 -7127.41799 5.66451 -423.67449 608.69958 536.01452 79333.39310
5.85000 -7070.87235 17.92676 -931.65479 579.13344 447.90639 79682.48412
5.95000 -6997.18290 14.16686 -162.00446 607.33514 497.15692 84285.87460
6.05000 -6906.62834 0.47839 1158.59354 676.94332 1138.61471 70449.50284
6.15000 -6865.28947 11.27649 -3783.00878 454.84056 478.89644 86919.20733
6.25000 -6807.26171 11.77428 -880.91635 465.10490 415.85982 75003.79639
6.35000 -6793.19388 7.86713 -626.64081 527.26417 481.96948 73750.19072
6.45000 -6719.22532 29.88894 1738.03905 595.65628 532.86512 76310.72271
6.55000 -6646.77380 17.14565 -1432.63912 564.00275 588.05058 66983.80696
6.65000 -6594.28238 2.04820 -2132.44705 510.40090 485.04068 57506.22169
6.75000 -6552.36940 11.99324 -142.93923 749.55061 725.78331 56155.52771
6.85000 -6501.64487 -14.66769 -523.71035 766.40291 842.21880 54933.71008
6.95000 -6429.17024 16.49191 -1419.59560 557.11359 435.96114 48153.48194
7.05000 -6368.76695 28.81970 -1701.23684 744.75849 1065.99240 53326.01930
7.15000 -6292.89545 -0.67936 -2415.92018 416.95329 429.62481 53975.61331
7.25000 -6245.99941 12.29714 -1404.83689 414.35724 310.03893 60314.00729
7.35000 -6183.17695 21.14667 -2613.54418 578.55024 644.30801 54960.41738
7.45000 -6125.95458 5.28722 928.59703 424.51549 510.63482 43252.64681
7.55000 -6036.47015 -16.09812 -90.11803 684.75480 619.50789 52018.09674
7.65000 -5995.66429 11.94722 -472.48689 425.36211 457.17324 40469.64935
7.75000 -5943.96482 8.66726 -241.94324 274.42569 352.22239 42820.38698
7.85000 -5908.10474 26.14873 776.80316 296.54607 287.41195 42334.11262
7.95000 -5824.65696 20.92404 -257.81351 403.66625 521.06788 43758.56546
8.05000 -5772.35966 -5.90538 -52.13834 265.16631 268.64343 48770.93011
8.15000 -5706.65409 35.37209 3.15509 772.24720 1468.55199 39254.41137
8.25000 -5690.16714 -15.41166 736.49615 366.24692 457.90033 45146.91614
8.35000 -5631.19040 -2.70183 328.59783 451.35676 495.06887 32433.33333
8.45000 -5559.48178 7.20488 -58.16000 364.30673 494.62633 35705.70957
8.55000 -5491.49689 0.06496 459.95863 645.04606 325.50812 35123.65352
8.65000 -5445.83827 -5.54413 846.44167 379.23352 258.87764 31478.34813
8.75000 -5403.12247 12.59377 -1466.37201 217.14089 211.03011 30161.82506
8.85000 -5344.49126 8.15279 -858.91189 448.23807 264.22522 34317.90680
8.95000 -5295.41989 5.56594 -127.80671 258.85238 305.53214 26764.83736
9.05000 -5230.73799 14.78272 736.86272 246.39932 233.38457 29081.41857
9.15000 -5190.31832 3.58006 1047.46138 211.33516 193.18126 30462.16687
9.25000 -5124.11434 5.58463 -337.31867 420.54857 422.05569 25100.79327
9.35000 -5078.61554 1.62912 2346.77227 180.00668 169.17174 23368.14061
9.45000 -5048.09454 4.01651 633.02912 266.27134 176.12752 27783.90125
9.55000 -4990.84755 7.51999 -11.58993 274.69219 236.20249 24795.31942
9.65000 -4951.12353 -4.32657 -567.80434 198.53363 195.80523 49565.94997
9.75000 -4904.70453 8.20427 856.68175 296.66668 212.57137 21511.17425
9.85000 -4840.16372 -4.39542 310.68309 261.40515 287.86346 22871.40697
9.95000 -4826.59196 -11.60360 25.41300 337.21156 309.40013 21665.94129
10.05000 -4775.95749 9.86441 1392.61944 244.29669 281.76086 22846.75230
10.15000 -4729.45153 -0.22537 773.47512 177.78466 173.68208 23696.67216
10.25000 -4693.51863 -0.51974 1268.11976 251.92609 189.29060 21857.23909
10.35000 -4645.61703 -0.17687 -525.06048 171.95031 127.00254 22183.45496
10.45000 -4607.41430 4.36559 738.25212 380.97147 207.97795 23584.06631
10.55000 -4559.79870 1.11038 607.16995 160.84072 183.34948 19131.80942
10.65000 -4527.12457 2.55468 -11.03320 195.82395 159.80526 15785.64768
10.75000 -4494.06503 1.98949 -1152.39293 157.33523 174.83708 23678.77309
10.85000 -4444.71658 2.61599 41.00183 166.55782 161.04887 20969.96286
10.95000 -4418.74913 5.55201 94.42666 189.79795 133.02684 16481.69696
11.05000 -4367.35910 8.66141 -876.02789 167.93759 144.79564 16349.11862
11.15000 -4282.54862 -12.86358 -1416.30166 1403.22226 318.60978 17714.57116
11.25000 -4291.63125 1.12778 -501.40857 128.42876 141.62565 14565.03510
11.35000 -4243.22852 7.79552 766.05073 491.34570 261.97425 12826.88943
11.45000 -4217.42847 2.63360 137.60506 190.75682 170.70198 17762.69619
11.55000 -4185.32379 3.59468 1293.83218 185.74128 135.54905 19563.19257
11.65000 -4161.30619 4.83291 788.79630 182.96764 291.99778 16629.18041
11.75000 -4124.12701 3.72973 119.05474 159.82942 170.06097 13269.27245
11.85000 -4095.08564 3.44904 -223.19498 129.24420 116.58295 13454.85510
11.95000 -4047.18685 -0.79221 368.18989 156.36444 126.46158 20150.52693
12.05000 -4024.02115 -4.02944 688.52649 171.76312 183.87410 16521.92805
12.15000 -3995.74524 5.32056 -764.54337 336.46131 113.34361 14519.32116
12.25000 -3967.15633 -87.17022 -355.63642 420.15656 2122.05440 12309.30531
12.35000 -3939.50658 -5.79488 290.39699 173.73039 199.49918 12029.79602
12.45000 -3904.38532 -1.44145 661.00572 145.58617 151.89621 10637.76613
12.55000 -3879.19605 -1.18496 38.97808 161.46259 234.25243 12056.34850
12.65000 -3858.19727 -3.64078 545.82423 268.91845 171.79222 11836.53816
12.75000 -3823.91019 1.86683 116.73813 166.45050 114.97428 15475.14077
12.85000 -3796.98222 -29.16841 -438.69339 207.81978 412.04560 15880.20057
12.95000 -3778.85173 -6.58238 -435.98434 208.34438 316.78981 8835.38602
13.05000 -3742.46280 -1.86593 85.21003 141.63629 189.45569 12593.58472
13.15000 -3721.75231 8.71071 113.25623 234.88157 147.91866 9920.09735
13.25000 -3700.08525 0.39028 -1284.45955 141.29177 145.46460 13864.79529
13.35000 -3661.19762 2.11097 182.36383 289.88626 127.75091 13209.64461
13.45000 -3636.94154 -5.23696 -266.65800 198.02082 278.23313 9023.70929
13.55000 -3605.07697 4.97740 123.83561 107.42016 115.83901 10844.19009
13.65000 -3572.59063 21.70730 90.59944 448.05597 460.55450 10384.10075
13.75000 -3564.21017 -6.87734 304.50229 137.54870 148.20707 10259.45878
13.85000 -3529.10351 1.00183 191.47970 184.68326 135.84951 9311.01321
13.95000 -3520.08486 1.86754 499.84289 109.38901 119.38806 9048.23183
14.05000 -3489.83764 33.25916 -314.55909 124.64616 646.41895 12218.36568
14.15000 -3457.16345 -0.88899 135.91645 108.23562 178.63577 10115.18910
14.25000 -3433.29774 -4.69621 181.69208 96.29894 131.01121 8807.98626
14.35000 -3396.86453 -10.99996 -30.75812 232.15142 248.31189 7773.41033
14.45000 -3385.82364 4.12089 -88.08647 117.68124 76.34245 6948.70971
14.55000 -3367.26986 7.39977 -300.49006 129.35792 107.62536 9253.42482
14.65000 -3327.55067 6.21937 -458.01122 206.81732 214.93238 8360.27251
14.75000 -3344.20963 8.07939 466.04639 550.96617 156.95044 9331.14529
14.85000 -3300.24562 -8.73421 399.43561 88.13796 118.50865 8287.09623
14.95000 -3273.95475 3.88245 -338.64209 71.46859 66.53046 9557.97362
15.05000 -3261.73091 0.56350 -683.29370 170.64502 187.13988 8477.58298
15.15000 -3243.81676 -2.03758 -101.08831 127.15235 199.98359 5671.54560
15.25000 -3220.21603 -7.10536 306.29787 346.21943 288.14604 6045.30469
15.35000 -3194.90276 5.82165 538.15266 85.66795 60.74720 8834.07471
15.45000 -3170.99739 0.81606 321.26863 209.10965 408.25594 5558.13675
15.55000 -3149.38282 -1.10363 171.44359 103.05350 89.97598 5360.35576
15.65000 -3124.64502 -1.00445 -81.20435 108.83996 69.87650 7127.62992
15.75000 -3109.54515 -2.29812 -501.21735 72.63572 71.21243 5672.67145
15.85000 -3086.16630 -3.79404 1.94688 90.25017 98.93095 5998.68741
15.95000 -3064.32010 10.61231 185.77242 72.48496 77.55383 6696.40109
16.05000 -3049.61541 -5.01223 172.86604 83.65441 152.18763 5346.13269
16.15000 -3014.52973 -1.47223 635.67371 123.60404 77.34613 7624.70571
16.25000 -3007.09724 -3.20810 141.87085 73.92717 73.17685 9680.85745
16.35000 -2906.05930 -7.25954 52.82440 1656.96670 425.05365 4005.96857
16.45000 -2957.40651 2.84454 113.77208 82.19236 123.74775 7138.08343
16.55000 -2946.40293 -3.08433 -475.18193 78.70900 86.92034 4984.72858
16.65000 -2926.33356 10.85353 458.64514 91.48774 161.07200 7082.33051
16.75000 -2903.73982 3.84610 676.47375 77.37081 86.52103 6534.17154
16.85000 -2889.90722 -15.03577 -74.02571 110.84282 307.73385 5826.36603
16.95000 -2871.70676 4.16603 278.89606 60.79780 68.34056 7891.88944
17.05000 -2860.98201 -1.12918 441.45945 120.65643 92.05751 8713.63199
17.15000 -2835.88828 -3.33256 -8.76939 205.71695 290.87404 5436.96787
17.25000 -2818.15484 -3.65776 249.42626 78.55862 62.84249 4712.08647
17.35000 -2800.02167 -2.89250 508.84665 161.95064 122.44225 5238.64750
17.45000 -2782.91927 -2.15349 -97.46549 64.32165 59.09490 5155.00366
17.55000 -2770.63192 -4.23345 157.06887 261.40200 403.23372 4316.20903
17.65000 -2741.73891 -3.80857 235.58160 109.43761 214.98264 5472.13095
17.75000 -2727.22368 1.43258 134.06661 50.93039 48.30711 6402.76734
17.85000 -2706.20965 3.45543 -44.59838 71.71013 101.50997 4782.03977
17.95000 -2692.49685 7.31108 -26.27054 93.27239 72.91515 5097.53741
18.05000 -2675.18129 0.91071 540.12043 77.59872 61.01371 5326.90740
18.15000 -2626.12460 -8.35823 -46.42070 559.98426 163.74641 4683.68812
18.25000 -2635.52420 4.95430 581.44756 112.07548 93.96269 6809.94623
18.35000 -2627.38690 13.26009 173.76995 138.19284 91.34674 5159.84864
18.45000 -2606.46397 4.99606 432.06941 72.44594 107.53016 5202.40340
18.55000 -2592.97440 0.99892 266.70317 48.98083 52.49217 3886.63071
18.65000 -2578.66472 -4.62364 220.70384 57.58230 62.03143 5010.75502
18.75000 -2560.52800 0.20878 -23.23454 48.67631 68.23213 4880.95761
18.85000 -2547.68967 0.71019 -511.80625 56.92481 58.74216 4114.11160
18.95000 -2528.79254 3.95257 -35.62971 72.75476 54.89145 4466.02947
19.05000 -2522.19907 -2.03103 83.59546 65.25120 37.95408 4828.23060
19.15000 -2507.97274 8.91321 -145.03745 97.95951 80.17089 3759.98134
19.25000 -2489.73829 0.91221 -590.74908 42.94116 53.41835 6462.21146
19.35000 -2474.94549 5.81370 -158.98451 49.43396 38.47289 6200.60325
19.45000 -2451.11470 0.92103 -0.53255 74.74095 49.70428 3627.15647
19.55000 -2615.63377 -147.15329 185.63505 2616.95181 2223.32570 4564.54027
19.65000 -2417.26274 7.93271 416.52802 75.22724 61.38250 5696.81956
19.75000 -2410.83111 1.39737 236.61103 41.83779 62.44522 3293.08985
19.85000 -2381.89069 11.37003 -224.05109 216.63290 93.64545 2863.44182
19.95000 -2382.06354 -1.61837 -474.78105 116.18868 109.96255 3962.41092
