0.2 0.81521 19.87069 1.33205 91.65531 92.45188 71.88779
0.6 0.80966 45.50494 1.32823 93.0632 88.21489 69.36335
1.0 -0.02361 68.46263 0.70053 92.87191 82.71591 65.31741
1.4 0.18588 82.72293 0.85879 92.89798 78.57427 61.9551
1.8 0.58448 91.3675 0.75385 92.31924 74.0626 58.71967
2.2 0.32084 99.38334 0.50219 91.31886 69.13284 55.4469
2.6 -0.201 105.86404 0.30823 87.99085 65.58126 52.77163
3.0 -0.99044 112.05309 0.95437 83.79545 63.20439 50.03501
3.4 -0.6177 120.98305 0.17839 78.51318 59.53194 47.44284
3.8 -0.87239 129.67585 -0.06066 72.39478 56.7216 45.52122
4.2 -0.37333 139.06209 -0.57058 65.96252 54.07749 43.49582
4.6 -0.53044 149.15966 -0.21838 59.72883 50.61388 40.87599
5.0 0.35918 158.15915 -0.60413 54.17164 47.76114 38.59948
5.4 1.80554 166.55488 -0.41789 48.39087 43.63275 36.48269
5.8 1.75735 173.96175 -0.61324 43.8489 39.90726 33.67674
6.2 1.9377 180.62432 -0.28377 39.81855 36.17133 31.69913
6.6 1.06941 186.88658 -0.27589 36.98552 32.32169 29.37207
7.0 0.7078 191.06998 0.10881 35.40123 29.32562 27.89934
7.4 0.59349 194.67342 -0.02619 33.1146 27.50817 26.45847
7.8 0.29271 197.32883 -0.06768 31.477 24.74439 25.17833
8.2 -0.11156 198.96352 -0.01715 29.90018 23.45228 23.772
8.6 -0.56554 200.12067 0.05063 28.2574 22.17832 22.33777
9.0 -0.29625 201.14667 -0.05751 27.39571 20.78055 21.28174
9.4 -0.41526 202.13163 -0.46104 25.71692 20.07377 20.69315
9.8 -0.70646 203.21857 -0.95411 24.53757 19.46874 19.33464
10.2 -1.14216 204.04084 -0.97662 23.73915 18.94443 18.81438
10.6 -0.57977 205.5597 -1.00959 22.70096 18.25636 17.92534
11.0 -0.75774 206.45164 -1.10029 22.06075 17.11094 17.27844
11.4 -0.69278 207.69731 -1.18045 21.34341 16.39295 16.83308
11.8 -0.95151 207.5446 -0.84162 21.07902 14.87209 16.33005
12.2 -0.36104 207.65529 -0.6279 20.80373 14.03065 15.89735
12.6 -0.69163 207.06264 -0.0992 19.96518 13.42859 15.53877
13.0 -0.4478 206.47907 -0.12626 19.41178 13.1811 15.07995
13.4 -0.4957 205.82933 -0.10017 18.60982 13.18474 14.1617
13.8 -0.11087 205.44054 -0.55942 17.81017 13.14969 13.75814
14.2 -0.0822 205.517 -0.73862 17.06466 13.35371 13.37456
14.6 0.14949 205.90371 -0.73509 16.22077 13.34879 12.78494
15.0 0.56281 206.82536 0.22778 15.46745 12.60593 12.09324
15.4 0.84379 207.3905 0.20665 14.84474 12.26501 11.76583
15.8 1.05069 208.03753 0.35067 14.42123 11.35749 11.00528
16.2 1.39497 207.93782 0.34883 13.89767 11.05996 10.5254
16.6 0.33489 207.82544 0.46644 13.89881 10.79481 10.46971
17.0 0.73305 208.47884 -0.06977 13.1731 10.7011 9.84947
17.4 0.38142 208.60723 -0.61056 12.71483 9.43665 9.2087
17.8 0.69589 208.48499 -0.82406 12.57474 9.72234 9.24582
18.2 0.84824 208.53064 -0.74682 12.43181 8.87446 8.91556
18.6 -0.28892 207.99121 -0.25576 12.5818 8.95141 8.90017
19.0 -0.06485 208.47795 -0.20711 11.37414 8.27077 8.61702
19.4 0.16443 207.59929 0.91541 12.18324 8.06581 8.61347
19.8 -0.2726 206.96469 0.61001 11.70223 8.11 8.17519
