0.05000 -1299.52619 46.00591 -414.11403 830.82302 573.53957 1849.00987
0.15000 -2653.23175 35.09047 -311.18009 1172.89083 631.00280 3287.64003
0.25000 -3570.36511 0.90832 -353.84886 1338.85917 820.14377 4899.30108
0.35000 -4393.24251 94.17667 -256.20857 1492.11198 1031.27064 5829.99318
0.45000 -4996.30903 20.64645 -89.22523 1679.00268 1165.45837 6509.74466
0.55000 -5469.66845 73.98891 -104.93033 1762.76874 1289.70051 6969.26928
0.65000 -5938.12161 32.75537 0.71817 1857.73156 1375.53798 7186.76951
0.75000 -6259.55313 45.30915 -30.25083 1929.46915 1450.78874 7431.40613
0.85000 -6576.89406 53.85518 320.28415 1846.18581 1540.16015 7363.57995
0.95000 -6794.80647 51.75297 58.32981 1845.84789 1598.08285 7360.99720
1.05000 -7037.50013 49.97722 -15.53901 1838.94283 1630.66146 7234.10083
1.15000 -7239.03423 97.83791 48.83088 1805.73696 1691.50051 7036.56065
1.25000 -7456.02266 99.72440 -64.45698 1744.51030 1749.67731 6810.22386
1.35000 -7574.39535 39.34125 136.03000 1695.76619 1762.87406 6667.42868
1.45000 -7656.62686 95.81798 -44.32216 1603.40834 1780.32927 6527.45103
1.55000 -7703.64550 91.38782 145.70876 1546.97588 1804.77730 6360.88709
1.65000 -7784.62346 76.65366 106.11384 1420.65947 1810.01822 6071.96937
1.75000 -7770.41653 53.02743 -94.34742 1303.92490 1800.79877 5971.51472
1.85000 -7795.40275 58.44737 36.47956 1174.03107 1784.50856 5737.82807
1.95000 -7805.23931 42.05052 48.07498 1105.27596 1749.32117 5575.08223
2.05000 -7796.76022 60.27371 23.48096 1034.72838 1741.25989 5390.12471
2.15000 -7789.58425 30.04890 35.82950 939.57127 1697.98354 5214.53030
2.25000 -7759.12459 63.86003 -82.64092 856.59012 1650.93566 5094.75719
2.35000 -7745.15230 70.99031 -44.22238 803.49600 1616.72426 4938.25062
2.45000 -7721.71647 60.86211 -92.78274 735.22090 1551.55808 4791.56213
2.55000 -7687.07427 46.65435 -31.82942 697.45390 1509.49822 4654.23083
2.65000 -7642.33350 3.91833 -8.99613 670.29153 1458.58576 4482.01513
2.75000 -7589.72397 37.90638 -1.05529 659.33598 1402.45457 4379.02418
2.85000 -7557.07005 21.36234 -57.90089 622.86778 1344.24410 4280.80107
2.95000 -7524.09645 15.33515 -22.66619 632.98495 1301.51187 4181.07927
3.05000 -7517.22461 31.09353 -61.09222 618.72792 1236.65630 3991.74332
3.15000 -7509.00792 24.40143 -37.13489 625.58226 1185.30914 3918.25071
3.25000 -7512.37623 26.32916 -19.96925 664.97610 1124.72877 3783.07738
3.35000 -7499.98033 13.84552 -12.37125 708.54504 1059.49511 3703.22928
3.45000 -7505.84630 5.46681 -28.86937 731.89643 998.90196 3529.59180
3.55000 -7479.18628 -6.22054 -24.47428 762.49864 933.33113 3430.10868
3.65000 -7433.38289 27.83486 -26.04728 771.77875 866.27930 3320.82541
3.75000 -7393.34439 26.05042 14.71624 791.45297 802.55350 3233.22983
3.85000 -7388.23219 30.47849 -47.63409 783.91817 745.58205 3089.43432
3.95000 -7340.84592 31.04174 -11.14415 788.23018 681.77100 3026.04928
4.05000 -7309.27715 27.89085 0.28815 780.58242 629.67752 2907.25070
4.15000 -7262.16149 39.54833 -12.77869 747.62990 584.36955 2804.98681
4.25000 -7217.12997 39.58739 -28.45341 738.35902 535.37169 2725.17633
4.35000 -7159.53136 42.02842 -100.50797 685.80081 495.80909 2634.73809
4.45000 -7117.62735 44.56679 7.59322 651.26064 458.39756 2548.24701
4.55000 -7063.58351 41.92938 -70.54556 616.51970 427.89046 2489.18237
4.65000 -7012.21789 42.33665 5.84798 565.12092 398.66379 2405.36756
4.75000 -6947.92176 48.21793 -14.00164 524.63745 371.75208 2321.17967
4.85000 -6897.80427 43.67264 -45.55087 489.96368 349.50015 2262.19727
4.95000 -6833.45017 46.09820 4.05158 468.30228 326.76351 2202.60527
5.05000 -6778.71705 44.59235 -18.94193 435.90121 305.62397 2139.99251
5.15000 -6727.67434 49.74820 12.22810 404.42932 288.53881 2077.27832
5.25000 -6662.63256 40.93186 1.48247 389.42666 274.48597 2032.31951
5.35000 -6592.30156 43.00881 15.60394 368.18765 263.57092 1993.53948
5.45000 -6545.84602 44.38959 -19.01336 349.69573 250.72180 1919.65578
5.55000 -6487.82419 40.00954 19.11971 335.73164 239.44803 1870.72996
5.65000 -6443.07637 41.73685 53.07110 322.92340 227.80076 1835.19931
5.75000 -6404.81819 42.11747 11.19907 309.76578 220.13825 1778.28567
5.85000 -6367.74485 33.57842 69.27373 286.26240 212.09429 1716.84349
5.95000 -6315.77516 34.01816 41.37669 296.52579 201.39817 1701.00879
6.05000 -6273.52882 31.99554 26.13054 276.12783 194.28239 1623.01633
6.15000 -6218.46650 30.76890 46.94261 263.22786 187.87810 1593.84987
6.25000 -6155.46234 29.17168 9.46607 268.70016 176.35093 1571.69709
6.35000 -6103.41039 29.68547 25.18860 246.34162 174.85046 1509.13239
6.45000 -6050.21888 28.15280 28.67205 240.17568 167.92517 1475.18186
6.55000 -6001.03202 29.31558 35.52814 228.43993 162.41433 1423.76381
6.65000 -5960.17430 27.32792 24.05889 216.07648 157.99010 1386.10899
6.75000 -5908.43259 29.34429 52.16489 207.25293 154.13125 1345.69212
6.85000 -5856.44981 27.11417 35.69664 206.65039 148.90998 1306.35719
6.95000 -5805.23271 28.39714 18.38528 199.72097 146.23478 1276.06760
7.05000 -5751.97159 25.04434 5.87929 204.30120 141.43452 1248.49603
7.15000 -5701.22632 27.17729 -26.80016 193.21451 134.81744 1225.63451
7.25000 -5661.97977 23.45347 -6.93447 184.55647 133.87930 1170.33062
7.35000 -5612.50477 23.08219 -4.95295 184.91142 133.00694 1155.82889
7.45000 -5566.98819 21.19975 -13.80880 176.39993 126.48505 1127.94853
7.55000 -5524.88812 18.80198 2.78072 174.38350 123.66997 1094.69343
7.65000 -5476.24800 20.39110 -17.44811 177.78224 120.72289 1072.09027
7.75000 -5432.21154 22.23915 1.93805 172.57287 114.66687 1030.01922
7.85000 -5384.73990 18.17335 -22.83956 195.13867 111.42004 1008.83070
7.95000 -5338.71305 22.05452 -10.41822 167.08732 111.00368 981.73688
8.05000 -5290.35268 20.03399 -9.54474 171.42716 106.88105 945.74899
8.15000 -5237.32518 17.01233 -28.57564 167.71601 104.11569 933.01036
8.25000 -5183.89916 20.64727 -58.38645 173.26483 99.59878 909.86370
8.35000 -5143.51131 18.87165 -37.18110 166.24659 99.25237 877.59690
8.45000 -5097.00141 17.91451 -32.79329 165.05621 94.79364 856.23982
8.55000 -5044.75650 18.36420 -30.90029 153.90376 92.19448 836.95409
8.65000 -4996.13613 19.29812 -27.67401 150.27342 90.47957 814.43115
8.75000 -4950.22051 20.20557 -20.99964 151.32056 85.17468 787.44464
8.85000 -4905.51647 17.65590 -19.96050 155.91583 83.33035 774.13475
8.95000 -4858.64033 20.41044 -31.12275 143.64700 80.55379 756.31868
9.05000 -4807.40018 20.54139 -0.44869 142.22675 78.05171 743.22902
9.15000 -4762.73413 17.18545 -36.77150 132.43992 76.53897 702.62255
9.25000 -4719.06704 16.09852 -5.30115 126.75160 75.23087 695.11996
9.35000 -4671.78753 18.83510 -37.43750 124.05161 72.49036 676.96394
9.45000 -4626.06681 17.47271 12.18131 125.06573 67.78883 675.09864
9.55000 -4588.46540 17.04615 1.18062 120.12903 68.59523 653.45363
9.65000 -4544.06089 15.16342 16.68248 120.70002 66.54326 637.72575
9.75000 -4502.91736 18.39641 -5.04334 119.85267 63.91369 619.22714
9.85000 -4462.36217 16.32669 -5.43720 117.79209 62.62185 604.29156
9.95000 -4419.88716 14.52930 14.89830 112.72784 60.02241 590.94464
10.05000 -4382.97670 14.74867 12.75656 110.80074 58.41307 583.04686
10.15000 -4341.09743 14.33608 26.62366 110.39608 58.69110 562.89977
10.25000 -4304.03820 14.76439 33.49494 110.88671 57.24417 550.00892
10.35000 -4266.75629 14.50030 24.39228 107.12748 54.64887 539.15748
10.45000 -4229.93348 17.22416 16.39712 102.32811 53.73989 531.62735
10.55000 -4196.71854 14.23351 32.96625 100.56157 52.72608 521.54073
10.65000 -4161.35001 13.49768 32.84113 100.11021 51.71315 514.38817
10.75000 -4127.64898 14.09063 26.85277 95.44708 50.90491 497.01452
10.85000 -4092.06293 13.52489 23.68602 94.24855 50.52287 490.84394
10.95000 -4057.84998 13.07958 21.18494 90.65144 50.77467 470.84570
11.05000 -4026.31370 14.68349 32.08872 106.64698 48.68393 472.12735
11.15000 -3997.41037 13.59330 36.71545 85.09926 49.09623 447.13718
11.25000 -3963.49988 12.63657 30.31460 82.23793 45.69962 450.98276
11.35000 -3934.24983 11.83053 42.29370 73.08297 44.90482 423.13177
11.45000 -3903.30350 13.24442 18.22749 72.56485 43.16434 427.02677
11.55000 -3874.98229 10.91497 40.12212 70.95011 43.02083 415.03410
11.65000 -3843.71627 9.47694 16.87428 67.10416 42.58962 408.62727
11.75000 -3813.68947 10.83709 17.34905 66.08444 41.51251 401.56120
11.85000 -3788.23770 8.99898 34.57393 63.25834 40.79877 376.88320
11.95000 -3757.66319 9.37938 23.02158 59.04062 40.52326 372.58285
12.05000 -3732.26126 9.45356 34.17550 58.72929 40.52129 368.76590
12.15000 -3706.19332 10.01596 19.82452 57.00122 40.24574 360.50360
12.25000 -3673.89745 8.36800 21.31481 54.92232 39.85791 357.51726
12.35000 -3650.34625 6.80957 30.76129 54.00581 39.15758 342.36866
12.45000 -3623.47118 7.71995 24.69780 52.54507 38.78609 329.15592
12.55000 -3594.70158 6.84355 25.34343 54.34206 40.00461 335.78774
12.65000 -3567.65923 10.80553 31.37681 52.35686 38.67332 322.25075
12.75000 -3539.96537 8.05751 28.47814 49.49678 37.39114 314.61041
12.85000 -3513.22688 7.70646 19.22122 50.16763 36.62808 304.48109
12.95000 -3485.13357 6.75519 12.34539 48.51974 36.41823 305.08561
13.05000 -3458.14512 7.93001 22.96043 48.98900 35.61798 296.37351
13.15000 -3431.08235 8.28767 15.50935 45.23687 35.54610 290.23773
13.25000 -3407.83327 9.42891 7.80358 46.94593 35.90193 284.44721
13.35000 -3380.59481 5.76942 12.92775 43.72686 35.29036 276.20728
13.45000 -3357.01207 6.78485 8.64117 42.03362 35.24121 273.75651
13.55000 -3332.72928 6.95165 14.38526 39.84752 34.19871 258.04338
13.65000 -3308.75463 7.09242 16.33359 39.47420 34.02530 259.49251
13.75000 -3285.70073 7.60589 15.66508 39.24585 32.56358 253.93975
13.85000 -3261.28061 7.04434 14.89264 40.62791 32.10339 249.70918
13.95000 -3235.55501 6.59242 2.39508 38.81522 32.50389 240.47396
14.05000 -3212.85010 6.55724 7.69053 36.90887 33.28708 233.63941
14.15000 -3191.06246 7.57736 9.36134 37.77722 33.14124 233.37791
14.25000 -3170.66467 6.28984 22.08699 38.51585 31.81503 216.41438
14.35000 -3149.69862 7.36092 22.48210 39.92266 31.19026 226.73094
14.45000 -3126.20182 7.22642 15.64470 39.40398 30.64815 224.65193
14.55000 -3105.66816 5.59137 -8.50952 38.97815 29.86952 211.36161
14.65000 -3083.44999 6.28823 14.08828 37.48802 31.35148 210.64763
14.75000 -3062.72547 6.99037 14.09372 36.90396 30.56520 205.69148
14.85000 -3038.93700 6.62815 7.77996 36.60945 29.62166 207.49480
14.95000 -3018.81310 7.34854 13.06987 38.01878 28.88678 207.88473
15.05000 -2998.86952 5.85726 17.53857 35.99311 29.66006 205.77624
15.15000 -2976.07102 5.40855 0.69185 33.83342 28.74470 193.29616
15.25000 -2953.91713 7.45362 -3.73616 32.88936 28.95683 197.02604
15.35000 -2934.88252 5.13654 3.54002 30.84589 28.72031 180.81369
15.45000 -2915.87926 5.41274 14.23945 31.98340 28.60252 178.96223
15.55000 -2896.75128 5.75359 0.33909 30.58834 27.87750 177.62433
15.65000 -2873.77213 5.96426 -7.45633 31.78058 27.52097 178.10269
15.75000 -2856.77882 4.38051 -13.64995 31.16723 27.90503 175.33992
15.85000 -2838.47692 3.28744 5.63765 31.07893 27.83633 166.98836
15.95000 -2819.26338 4.22121 -6.57691 32.08967 27.43283 173.31813
16.05000 -2803.32951 4.56342 -4.19719 32.49954 27.07248 163.71557
16.15000 -2779.55719 5.11915 -17.92511 30.49596 27.03815 162.88597
16.25000 -2760.59543 4.92830 -1.73774 30.66480 25.86300 170.66705
16.35000 -2739.05945 5.55357 -19.67958 31.21885 24.46413 163.34113
16.45000 -2718.15886 5.35530 -12.56549 31.12823 25.87167 170.36110
16.55000 -2702.52940 2.64347 -5.39817 29.55935 26.87769 156.51411
16.65000 -2683.96742 4.11994 5.80732 31.78407 26.92606 158.83521
16.75000 -2665.07003 5.58495 2.25445 31.36846 26.43243 149.26667
16.85000 -2650.39124 3.29575 13.75451 29.32071 27.07181 147.12909
16.95000 -2631.31051 3.61979 10.01775 29.35830 26.53268 148.86364
17.05000 -2613.03097 5.90151 12.91010 28.32864 26.31064 150.69945
17.15000 -2597.42093 3.24533 7.89946 27.10174 25.60257 135.06352
17.25000 -2579.81166 3.54874 15.28439 25.88377 27.06992 138.55007
17.35000 -2565.30457 3.41117 26.29955 27.28775 26.87903 133.33861
17.45000 -2549.54557 3.21199 10.09522 25.38002 26.82974 136.41653
17.55000 -2533.04937 5.49234 22.85627 25.90882 25.03484 130.38026
17.65000 -2517.29399 5.16688 18.87796 26.51800 26.42989 127.66549
17.75000 -2503.59993 4.64631 22.54329 24.97689 26.87690 128.25865
17.85000 -2489.92279 3.72264 20.80091 24.90750 24.95175 119.94371
17.95000 -2473.96231 5.19739 17.30510 26.80712 25.46978 111.84832
18.05000 -2457.07711 1.91432 21.86967 24.57979 25.12259 118.99884
18.15000 -2442.58783 4.00079 16.98636 23.49170 26.82718 112.43887
18.25000 -2430.73765 5.89723 13.89536 24.15631 26.60470 117.79325
18.35000 -2413.87001 3.83174 15.37487 25.50364 25.27624 112.74594
18.45000 -2402.01182 3.81509 21.41595 22.89413 26.15414 106.24454
18.55000 -2387.31006 5.97920 5.20495 25.11184 26.69194 103.08615
18.65000 -2373.58859 6.59452 18.32015 22.94114 22.68774 107.72965
18.75000 -2359.16698 6.45093 15.09387 23.99009 26.63294 98.27202
18.85000 -2343.94142 8.81719 13.21304 24.52708 23.98994 92.73255
18.95000 -2331.85363 11.97053 11.06799 23.57901 25.60630 95.29006
19.05000 -2316.49515 15.58509 8.60528 25.67638 24.85449 104.04136
19.15000 -2302.54444 19.15298 5.25236 22.31022 23.92854 105.17393
19.25000 -2290.97652 20.40750 8.17425 23.45813 24.04212 94.66621
19.35000 -2278.45710 21.17438 8.52772 23.05315 22.37718 90.37803
19.45000 -2263.98149 21.84037 -0.96135 23.73528 23.27642 91.40716
19.55000 -2252.58050 22.87942 17.34498 23.40670 25.73889 89.30883
19.65000 -2238.76303 20.27766 9.12753 20.76375 24.48766 87.20104
19.75000 -2227.09950 20.94000 21.29876 20.69964 24.67934 89.06086
19.85000 -2215.97006 17.89186 20.45829 19.79418 23.81374 86.56374
19.95000 -2199.17212 19.07939 17.05214 19.50961 20.95162 86.31814
