0.05000 -1679.42180 124.24638 -226239.08992 1637.37592 2226.83293 763839.18332
0.15000 -3651.03364 20.03114 -6093.05910 1746.31913 1833.73849 375481.89400
0.25000 -5551.51099 13.22778 -25376.05120 1489.37182 1433.99264 381746.35509
0.35000 -6359.51568 80.10479 -6649.54804 1430.74453 1156.21868 355421.52534
0.45000 -6971.92717 25.03612 12039.69668 1564.83362 1079.39335 394734.88519
0.55000 -7633.07396 103.28334 4403.61458 1644.70907 972.19798 393485.13164
0.65000 -8013.33971 53.23197 13024.36494 1620.87284 859.69940 335561.20103
0.75000 -8275.62847 76.14159 662.90346 1618.12638 839.15537 309674.93459
0.85000 -8503.78450 82.75306 4423.42998 1604.23010 761.89151 286867.52444
0.95000 -8602.87085 67.60141 3839.35339 1473.24311 721.52833 327256.32023
1.05000 -8712.32212 73.12683 -10535.45385 1387.99733 689.03267 300646.70172
1.15000 -8793.78987 62.19620 -2525.22695 1355.91569 656.09642 289448.85238
1.25000 -8797.91520 73.45207 1300.94381 1288.08412 617.17902 270928.01875
1.35000 -8778.33212 75.21696 682.46413 1237.03282 605.96614 271257.39127
1.45000 -8773.54675 65.39593 -2880.53843 1142.02903 582.18675 231966.24833
1.55000 -8713.55831 77.69487 -1283.39367 1073.66515 549.79002 215546.63148
1.65000 -8608.40320 83.73579 -838.92196 999.68259 513.77271 228436.97200
1.75000 -8565.13490 58.19049 2109.57835 947.25575 521.03378 214194.26302
1.85000 -8534.74397 73.08825 3305.82067 903.26381 503.30888 189772.04075
1.95000 -8508.97896 64.37108 2398.57469 816.56790 533.08201 201125.52057
2.05000 -8488.58314 67.10931 -1330.39401 761.61766 488.57719 178779.02724
2.15000 -8430.85428 65.32129 1311.92954 717.03482 474.49678 167927.62957
2.25000 -8390.83350 66.00924 -1782.29071 683.06889 463.75309 164058.64967
2.35000 -8372.15432 59.31546 245.20405 621.00393 463.78079 150589.03191
2.45000 -8335.11137 61.06182 -3164.16190 577.92984 426.65624 158285.06215
2.55000 -8271.11310 61.78267 -466.59179 555.34942 441.78753 155250.24416
2.65000 -8228.13356 53.22872 -384.70112 543.62258 428.69725 144447.73252
2.75000 -8197.01967 63.73590 772.16423 497.16619 429.56065 137502.34568
2.85000 -8152.96043 62.44872 778.43422 464.96119 408.01986 129066.62969
2.95000 -8109.21559 52.53920 -1226.75727 429.84116 393.07065 123497.72656
3.05000 -8072.49874 52.17002 725.46021 421.31403 403.19471 129126.45776
3.15000 -8034.17261 54.78452 1907.69698 416.33355 384.71740 116083.80369
3.25000 -7973.40374 53.83634 1205.87330 417.29349 401.41470 120278.64558
3.35000 -7922.50955 49.43181 -952.86632 381.09057 376.66940 113860.41052
3.45000 -7848.32047 53.00120 1931.55793 363.88177 353.33043 102325.50592
3.55000 -7783.48132 57.21241 -1855.65263 345.30205 362.51178 101981.03472
3.65000 -7741.29320 52.10892 381.70502 361.62102 354.50406 92060.59878
3.75000 -7681.93266 57.67431 -1491.31030 344.92005 359.57567 92739.72202
3.85000 -7610.06499 48.34203 295.33543 311.26492 321.33067 91713.57134
3.95000 -7546.66488 49.70808 2011.86852 343.50821 331.09809 82476.50987
4.05000 -7488.07430 45.96229 60.50356 318.19971 318.24770 86150.56539
4.15000 -7422.06618 48.76388 653.37668 310.25214 323.42756 82379.32332
4.25000 -7349.72036 40.74999 62.63966 295.53484 291.76172 73423.37288
4.35000 -7298.81177 45.03051 -833.28859 310.75860 333.65779 78116.41810
4.45000 -7241.72543 44.79716 -71.26466 268.98794 281.86564 72641.78539
4.55000 -7181.79993 46.48463 965.78535 289.90761 298.00109 70085.06281
4.65000 -7122.07298 41.83149 -1424.26758 285.78542 282.03858 72840.75182
4.75000 -7059.45268 40.69556 -1106.23886 283.45380 297.65113 67952.34700
4.85000 -6988.86948 38.21234 -1251.94095 295.35396 278.31359 66577.29052
4.95000 -6923.86396 38.20467 569.91427 255.27260 278.24052 57665.22832
5.05000 -6871.05364 34.27846 -1034.43704 289.24578 278.60626 68516.60141
5.15000 -6815.54764 37.21995 743.96686 265.41980 264.62079 58199.10065
5.25000 -6751.49902 38.24382 1066.23828 266.45726 257.65888 58819.35892
5.35000 -6693.27429 35.61177 576.52887 264.86321 262.30383 72010.16344
5.45000 -6625.03124 35.54377 -891.84142 281.39616 248.37577 64307.08179
5.55000 -6562.65261 34.23640 278.73323 247.01994 232.18241 50109.00350
5.65000 -6512.24537 35.81379 -108.04207 226.30729 229.44342 50496.79826
5.75000 -6463.32419 38.01851 781.53353 231.37378 242.18953 45535.61561
5.85000 -6406.19761 31.35113 -438.05554 238.81353 243.62295 48605.03512
5.95000 -6359.85655 30.24309 -1035.97486 229.82299 234.18852 88921.62810
6.05000 -6301.95825 32.71669 -249.93346 261.06038 248.52705 39480.06765
6.15000 -6252.33799 35.96891 27.27947 211.64510 212.22095 38395.44797
6.25000 -6189.92497 28.42641 153.90581 208.75820 208.65038 35798.86790
6.35000 -6137.63949 30.64846 597.48404 247.82360 234.18749 39805.55917
6.45000 -6084.24660 36.90534 709.23124 235.79083 230.61785 40040.91833
6.55000 -6040.91327 24.10299 316.87721 248.71586 227.71473 51466.38955
6.65000 -5992.86165 27.58082 -1774.94672 212.17203 195.67831 96437.82517
6.75000 -5946.15790 25.95545 127.17313 228.55137 199.54824 36325.15334
6.85000 -5887.14893 27.51913 -529.80331 234.53061 200.45308 39766.99037
6.95000 -5835.79228 24.21541 -153.19603 206.36719 189.62500 30983.79808
7.05000 -5786.31322 26.79158 520.61055 199.12318 190.13009 29830.63811
7.15000 -5739.34113 26.99354 180.58736 214.66301 158.88080 28628.71357
7.25000 -5697.15875 23.93312 -60.72677 227.63139 191.75270 26691.00860
7.35000 -5655.82195 23.26423 193.27625 209.51216 194.85931 27087.99040
7.45000 -5613.62734 22.77703 -511.19197 226.43488 196.33143 34247.45308
7.55000 -5562.90530 26.28244 57.82555 208.11195 210.24787 29496.72372
7.65000 -5522.82688 24.31862 64.36744 210.53977 168.51319 26252.95046
7.75000 -5482.40893 23.47545 444.41323 192.42938 185.31871 25618.82625
7.85000 -5445.90152 20.62738 323.69888 199.93206 179.14036 24978.15790
7.95000 -5405.11450 28.10372 -42.15740 212.53509 190.13946 22554.00514
8.05000 -5362.89962 26.60400 60.71990 199.59736 180.08813 21303.28641
8.15000 -5321.56011 20.35226 367.71023 184.41396 182.58748 20853.84778
8.25000 -5280.02671 17.71733 -143.70468 200.17089 190.15336 21141.08230
8.35000 -5230.80673 23.58815 227.58852 204.32425 188.92106 21682.58148
8.45000 -5187.60637 19.33169 535.18014 179.57867 197.74104 19012.77307
8.55000 -5145.92762 20.25176 134.22670 194.49399 188.00346 18954.99649
8.65000 -5106.48676 19.37953 -87.07329 200.73568 158.64525 18541.93076
8.75000 -5054.84342 22.05071 -39.63570 188.40129 190.67652 29414.54775
8.85000 -5015.64713 20.90157 196.33933 198.81023 186.87789 26993.37477
8.95000 -4968.28575 21.39507 450.22871 164.92838 188.36287 18145.32071
9.05000 -4926.62828 16.71337 -556.27927 185.18018 153.40037 42915.69964
9.15000 -4880.78590 16.61950 427.65335 160.62922 203.18729 15800.01878
9.25000 -4843.13100 12.90313 299.97914 175.42353 156.97692 24486.54142
9.35000 -4800.22203 17.16503 -875.24169 166.41100 190.41859 61883.67253
9.45000 -4754.01880 18.28743 112.75297 158.11079 166.90545 15051.71629
9.55000 -4716.46687 15.35473 -68.86745 176.78906 148.82622 14401.93875
9.65000 -4677.29581 15.43374 112.34306 168.08881 160.84409 14925.35009
9.75000 -4644.80918 17.79198 -400.78768 179.42197 150.20421 18684.85289
9.85000 -4597.46147 17.20162 143.72269 177.84820 145.71573 19962.58987
9.95000 -4561.24498 19.18069 214.64530 165.20105 161.93923 21677.49710
10.05000 -4520.14601 17.83884 -237.77481 151.17291 147.73787 13107.03437
10.15000 -4485.23945 13.48650 244.01500 157.65148 147.23960 12331.65582
10.25000 -4450.72214 20.48789 -682.82570 158.75566 146.07280 49362.45259
10.35000 -4416.66657 15.74932 -135.23577 123.59975 138.72283 10679.33287
10.45000 -4378.85240 23.33721 -220.17755 145.03948 175.15413 11130.74180
10.55000 -4349.20214 17.97236 339.68219 114.01520 112.33478 10158.96278
10.65000 -4316.26338 15.22537 -159.72103 106.27806 117.38381 10337.94864
10.75000 -4275.97756 12.23140 93.06958 113.07712 141.53227 12476.33098
10.85000 -4244.34680 13.79949 56.60347 118.22596 120.25512 9154.36165
10.95000 -4209.30180 12.57155 -93.20489 157.18596 166.85334 9621.88278
11.05000 -4179.02401 9.86390 169.38045 132.22091 152.32753 7799.29641
11.15000 -4142.94908 17.06566 -165.43676 153.26385 123.79686 9107.04208
11.25000 -4112.95414 13.81821 368.75565 137.37557 131.11445 8598.20311
11.35000 -4081.89063 15.53745 340.36108 133.30180 124.32567 9016.47104
11.45000 -4045.67252 16.34262 -40.27766 137.40947 129.99364 7754.76483
11.55000 -4017.76891 11.80795 125.55717 137.84853 115.57609 8225.93347
11.65000 -3981.55270 13.46838 170.94732 105.88706 111.58359 8956.95809
11.75000 -3944.78511 10.85558 -45.17193 97.21842 103.22203 7670.50244
11.85000 -3919.84610 11.75633 226.12231 100.43947 99.54977 6780.27557
11.95000 -3888.10927 12.26684 44.08353 170.41786 85.44910 7549.00059
12.05000 -3856.55097 8.96800 135.17929 130.49836 123.15899 7291.55707
12.15000 -3831.24124 10.45290 212.37991 131.14717 148.35387 7021.40081
12.25000 -3794.27542 8.65380 23.86048 119.91988 115.16034 7409.56262
12.35000 -3767.74953 9.20477 -53.04340 141.01253 122.56291 6679.69433
12.45000 -3739.33838 5.56047 157.33610 118.37066 109.51902 5531.19564
12.55000 -3702.76881 9.47028 48.74433 158.51865 135.34463 6216.43724
12.65000 -3679.69675 10.97026 -325.45300 140.70973 85.51055 5828.67152
12.75000 -3657.84051 3.92926 66.33794 119.12359 139.79785 5242.97693
12.85000 -3627.70358 10.38770 309.94439 94.54019 93.71042 5490.79323
12.95000 -3604.47149 5.71541 -84.66519 147.56093 123.11600 6565.04147
13.05000 -3571.45926 9.23289 -14.84875 86.60282 99.61458 5004.30856
13.15000 -3548.24371 4.91446 -13.00385 99.31379 143.03660 4990.16348
13.25000 -3517.24701 9.47354 61.88950 96.67865 117.74402 4281.01217
13.35000 -3497.43431 11.31613 -12.16534 83.06540 118.02059 5243.72872
13.45000 -3472.85567 4.85500 309.39337 91.55883 110.12469 5220.12209
13.55000 -3445.87337 11.42180 148.69313 70.33799 98.40693 5192.12716
13.65000 -3417.91778 6.08985 -93.57166 127.10361 81.57803 6862.09106
13.75000 -3395.99743 7.04105 11.79282 90.45854 90.87992 4002.42753
13.85000 -3372.52824 6.99137 122.05122 112.83119 96.50343 4774.83649
13.95000 -3346.36859 10.33274 -98.82568 79.41937 139.40054 4986.13934
14.05000 -3329.58233 4.16168 69.04487 120.73513 119.67815 3899.72095
14.15000 -3300.82365 7.90282 180.22483 87.44261 67.48478 7768.09511
14.25000 -3271.90192 4.96088 -66.06999 100.93213 110.25428 5316.31961
14.35000 -3249.62225 7.55821 126.27004 139.46622 87.57251 3830.46900
14.45000 -3229.07174 8.34101 78.29078 77.23072 70.55626 4461.84928
14.55000 -3204.96608 3.63728 -38.56349 147.56868 81.74022 2944.56945
14.65000 -3182.74314 6.25931 38.35206 62.39081 62.43772 2972.07861
14.75000 -3158.67888 9.15266 13.24350 64.60486 78.42339 3466.19970
14.85000 -3141.09893 8.09468 38.52920 152.01235 109.68717 2941.12312
14.95000 -3117.60055 10.52901 -135.22265 156.15787 88.02133 2584.09010
15.05000 -3087.90580 10.45704 49.47056 111.09509 99.93190 3678.32248
15.15000 -3069.76901 9.94422 -186.22357 70.94554 60.58929 3133.29660
15.25000 -3055.48057 6.81391 -13.64730 102.77228 91.26093 3172.97594
15.35000 -3033.48856 8.50131 36.00485 125.18092 115.05137 2350.03540
15.45000 -3011.50049 9.68037 180.12129 67.12348 50.94011 3212.38787
15.55000 -2988.68535 7.74448 34.22857 66.18089 78.16273 2792.27269
15.65000 -2968.82823 9.67261 77.23587 70.71619 75.22847 3168.19411
15.75000 -2953.33966 12.02606 -7.19579 92.75369 131.17434 2448.06793
15.85000 -2933.79422 7.27177 73.32813 86.63892 75.86335 2552.01446
15.95000 -2917.16142 3.36039 86.93497 56.85273 59.57371 2273.86950
16.05000 -2902.11401 6.82685 69.22257 131.92739 86.28197 2182.03230
16.15000 -2875.45846 4.88033 93.42587 79.78419 92.04346 1993.29669
16.25000 -2856.76386 2.35564 47.21717 155.89566 86.21444 2171.28933
16.35000 -2837.70384 4.95245 26.85986 57.15047 61.08929 2439.51944
16.45000 -2822.91048 3.81788 62.03758 85.72158 64.85272 2634.84401
16.55000 -2801.66320 9.76550 -202.10959 139.30275 69.03355 3421.05492
16.65000 -2787.51387 2.36914 -4.70873 56.14687 63.91992 2356.63371
16.75000 -2765.20794 1.33724 155.04269 67.21473 73.85779 2096.33705
16.85000 -2743.36075 7.79865 -4.51948 72.56001 41.91540 1976.63581
16.95000 -2726.69059 7.54122 -132.17729 74.65522 119.59430 3062.87655
17.05000 -2704.40000 5.32145 22.47939 42.73058 42.32572 2476.68214
17.15000 -2684.45338 4.28904 -23.10016 51.28972 82.78495 2324.30303
17.25000 -2667.66428 5.79688 131.95031 75.57404 50.83078 2056.93715
17.35000 -2649.56561 9.13385 47.50158 77.32966 56.58615 1727.25793
17.45000 -2632.24867 5.10309 120.02748 66.45066 73.57918 4111.00720
17.55000 -2614.16449 4.34607 0.59851 56.90849 57.03974 1521.94562
17.65000 -2596.50308 1.29457 79.41844 52.52306 58.73314 1839.41947
17.75000 -2584.03547 5.48778 70.99350 45.83657 58.17277 1528.12854
17.85000 -2564.57900 7.34382 -136.58633 60.62350 70.50278 2416.05586
17.95000 -2550.81386 5.50616 72.90226 70.02599 42.47381 2171.98108
18.05000 -2535.11431 5.80361 53.19677 57.30866 63.37750 1940.73003
18.15000 -2517.71496 8.73681 24.57557 49.99575 52.82753 1479.58138
18.25000 -2504.97795 5.69020 24.60741 46.16665 50.75119 1465.07490
18.35000 -2486.99010 7.79835 57.95766 78.43510 41.49404 939.23563
18.45000 -2470.60768 1.84801 61.66766 134.97722 68.76601 1444.59668
18.55000 -2463.78885 7.38726 12.35526 40.94617 47.71767 1731.78301
18.65000 -2446.64474 6.23828 -36.97962 50.75302 53.53638 3313.80905
18.75000 -2437.23351 1.42949 93.42510 52.67122 73.95618 1400.43244
18.85000 -2419.81759 1.75893 16.00618 55.93930 83.51422 1383.25071
18.95000 -2409.28256 5.23185 75.41697 44.95220 34.10250 1550.26531
19.05000 -2394.41938 1.30465 -80.50696 42.92369 36.53135 1109.13517
19.15000 -2379.79089 1.47897 16.18389 53.04332 42.78150 1302.51304
19.25000 -2377.97790 10.31553 9.55405 177.60863 130.40710 1230.61982
19.35000 -2350.53521 0.46597 53.06089 81.95188 121.03290 1309.11778
19.45000 -2338.63834 7.36188 -15.35000 53.49145 39.18424 1343.42669
19.55000 -2326.70254 4.74302 -21.77581 47.99818 32.65618 1638.60870
19.65000 -2310.33910 3.48752 17.75628 35.56583 28.14485 1220.53863
19.75000 -2296.47031 4.21947 17.47610 53.20551 35.92240 1177.83381
19.85000 -2282.09558 5.26792 -40.70487 31.41274 35.13936 1038.27115
19.95000 -2268.71468 6.53715 144.98872 50.09315 66.64373 1640.90799
