0.120000 -0.626270
0.380000 -0.799160
0.620000 -1.234640
0.880000 -0.939670
1.120000 2.862760
1.380000 2.899440
1.620000 3.039960
1.880000 -3.096800
2.120000 2.769040
2.380000 3.057850
2.620000 2.864240
2.880000 2.620610
3.120000 2.436220
3.380000 2.466490
3.620000 2.266160
3.880000 1.444270
4.120000 1.173310
4.380000 1.792520
4.620000 2.282520
4.880000 1.890740
5.120000 -1.227840
5.380000 0.630190
5.620000 -1.352170
5.880000 -0.118310
6.120000 0.699170
6.380000 -0.021170
6.620000 -0.662220
6.880000 -0.007350
7.120000 -0.379950
7.380000 -0.622800
7.620000 -1.216730
7.880000 -1.786800
8.120000 -1.501620
8.380000 -0.748880
8.620000 -0.726320
8.880000 0.866290
9.120000 2.318330
9.380000 -1.824530
9.620000 -1.089720
9.880000 0.412870
10.120000 0.811820
10.380000 -1.314350
10.620000 1.860610
10.880000 -1.355170
11.120000 -2.306830
11.380000 -1.228820
11.620000 3.085150
11.880000 0.110060
12.120000 -0.098900
12.380000 0.342060
12.620000 0.367980
12.880000 1.321290
13.120000 -0.603140
13.380000 0.455770
13.620000 2.233790
13.880000 -3.120880
14.120000 3.118830
14.380000 2.534590
14.620000 -2.391390
14.880000 2.722170
15.120000 2.832080
15.380000 -1.892810
15.620000 -2.971130
15.880000 0.978930
16.120000 2.022670
16.380000 0.097670
16.620000 0.978690
16.880000 1.441290
17.120000 2.166820
17.380000 0.573990
17.620000 0.508730
17.880000 -2.593690
18.120000 -2.388970
18.380000 -0.117070
18.620000 -2.384860
18.880000 -3.064830
19.120000 -2.761580
19.380000 -2.753380
19.620000 2.879710
19.880000 2.225920
