0.12500 0.02475
0.37500 0.02040
0.62500 0.02014
0.87500 0.01482
1.12500 0.00384
1.37500 0.01280
1.62500 0.01040
1.87500 0.01065
2.12500 0.01605
2.37500 0.01083
2.62500 0.01188
2.87500 0.01808
3.12500 0.02140
3.37500 0.01663
3.62500 0.01766
3.87500 0.01012
4.12500 0.00979
4.37500 0.00856
4.62500 0.01567
4.87500 0.00651
5.12500 0.00709
5.37500 0.01133
5.62500 0.01673
5.87500 0.00324
6.12500 0.00481
6.37500 0.00492
6.62500 0.02026
6.87500 0.01559
7.12500 0.01050
7.37500 0.00684
7.62500 0.01924
7.87500 0.01337
8.12500 0.00745
8.37500 0.00860
8.62500 0.02071
8.87500 0.01868
9.12500 0.01402
9.37500 0.01816
9.62500 0.02827
9.87500 0.01466
10.12500 0.02233
10.37500 0.01625
10.62500 0.02954
10.87500 0.02932
11.12500 0.02344
11.37500 0.01844
11.62500 0.01455
11.87500 0.02285
12.12500 0.01557
12.37500 0.02162
12.62500 0.03068
12.87500 0.02038
13.12500 0.01886
13.37500 0.01857
13.62500 0.01121
13.87500 0.00502
14.12500 0.02355
14.37500 0.02305
14.62500 0.02135
14.87500 0.00162
15.12500 0.00364
15.37500 0.01503
15.62500 0.01616
15.87500 0.01922
16.12500 0.02145
16.37500 0.04665
16.62500 0.02070
16.87500 0.01289
17.12500 0.02186
17.37500 0.01027
17.62500 0.03706
17.87500 0.02552
18.12500 0.03130
18.37500 0.05017
18.62500 0.03105
18.87500 0.00901
19.12500 0.02185
19.37500 0.01250
19.62500 0.02355
19.87500 0.01416
