0.125 -0.003 0.004 0.035
0.375 -0.016 0.018 0.380
0.625 -0.045 0.004 0.947
0.875 -0.038 0.041 1.580
1.125 -0.023 0.023 2.194
1.375 -0.099 0.025 2.759
1.625 -0.083 -0.016 3.428
1.875 -0.031 -0.034 4.211
2.125 -0.159 -0.028 5.252
2.375 -0.094 0.034 6.679
2.625 -0.195 -0.121 7.978
2.875 -0.194 -0.042 9.901
3.125 -0.202 -0.075 11.601
3.375 -0.189 -0.072 13.713
3.625 -0.359 -0.220 15.949
3.875 -0.253 -0.108 16.628
4.125 -0.218 -0.263 18.126
4.375 -0.331 -0.195 19.328
4.625 -0.322 -0.150 20.541
4.875 -0.329 -0.187 21.030
5.125 -0.345 -0.179 21.748
5.375 -0.336 -0.152 22.600
5.625 -0.305 -0.167 22.414
5.875 -0.263 -0.203 22.614
6.125 -0.167 -0.201 22.813
6.375 -0.355 -0.114 21.920
6.625 -0.284 -0.123 22.254
6.875 -0.349 -0.018 21.508
7.125 -0.388 0.010 21.629
7.375 -0.359 -0.036 21.159
7.625 -0.407 0.024 21.126
7.875 -0.456 0.048 21.961
8.125 -0.453 -0.090 22.160
8.375 -0.512 -0.158 23.347
8.625 -0.511 -0.096 22.670
8.875 -0.559 -0.143 23.296
9.125 -0.503 -0.179 22.608
9.375 -0.519 -0.209 22.516
9.625 -0.507 -0.271 22.248
9.875 -0.396 -0.261 21.053
10.125 -0.390 -0.292 20.875
10.375 -0.345 -0.242 20.292
10.625 -0.267 -0.263 18.453
10.875 -0.260 -0.301 18.125
11.125 -0.178 -0.250 16.989
11.375 -0.127 -0.159 15.628
11.625 -0.134 -0.139 14.389
11.875 -0.140 -0.127 14.337
12.125 -0.145 -0.126 13.773
12.375 -0.063 -0.116 12.709
12.625 -0.061 -0.080 12.890
12.875 -0.061 -0.114 11.891
13.125 -0.106 -0.093 11.198
13.375 -0.048 -0.104 10.102
13.625 -0.087 -0.051 10.396
13.875 -0.056 -0.089 9.777
14.125 -0.036 -0.061 9.794
14.375 -0.063 -0.038 9.714
14.625 -0.005 -0.053 9.070
14.875 0.009 -0.018 8.327
15.125 0.015 -0.027 7.712
15.375 -0.010 -0.020 7.445
15.625 0.004 0.024 7.277
15.875 -0.032 0.022 7.183
16.125 -0.017 0.028 6.181
16.375 -0.027 0.046 5.803
16.625 -0.053 0.035 5.280
16.875 -0.073 0.052 5.108
17.125 -0.069 0.037 5.182
17.375 -0.055 0.023 4.375
17.625 -0.053 0.041 4.121
17.875 -0.055 0.056 4.231
18.125 -0.063 0.020 3.454
18.375 -0.056 0.010 3.278
18.625 -0.068 0.007 3.363
18.875 -0.066 0.034 3.329
19.125 -0.071 0.006 3.005
19.375 -0.067 0.015 2.851
19.625 -0.047 0.010 2.426
19.875 -0.043 -0.007 2.074
