0.12500 0.04190
0.37500 0.04296
0.62500 0.10556
0.87500 0.16802
1.12500 0.21054
1.37500 0.25765
1.62500 0.28155
1.87500 0.32751
2.12500 0.33884
2.37500 0.35022
2.62500 0.37562
2.87500 0.36126
3.12500 0.35895
3.37500 0.34527
3.62500 0.33976
3.87500 0.34021
4.12500 0.31816
4.37500 0.29411
4.62500 0.26460
4.87500 0.26337
5.12500 0.23122
5.37500 0.20591
5.62500 0.17957
5.87500 0.19019
6.12500 0.15862
6.37500 0.13498
6.62500 0.13280
6.87500 0.12089
7.12500 0.07500
7.37500 0.08615
7.62500 0.09244
7.87500 0.07246
8.12500 0.06438
8.37500 0.02636
8.62500 0.02915
8.87500 0.03834
9.12500 0.04308
9.37500 0.06074
9.62500 0.05851
9.87500 0.04056
10.12500 0.03927
10.37500 0.05974
10.62500 0.06236
10.87500 0.09074
11.12500 0.08723
11.37500 0.09037
11.62500 0.09065
11.87500 0.09551
12.12500 0.10897
12.37500 0.08577
12.62500 0.09159
12.87500 0.10229
13.12500 0.05980
13.37500 0.01073
13.62500 0.05105
13.87500 0.02104
14.12500 0.03889
14.37500 0.01866
14.62500 0.05447
14.87500 0.04818
15.12500 0.03037
15.37500 0.08262
15.62500 0.04128
15.87500 0.09032
16.12500 0.05722
16.37500 0.08365
16.62500 0.05125
16.87500 0.08095
17.12500 0.08075
17.37500 0.05359
17.62500 0.07194
17.87500 0.10163
18.12500 0.04079
18.37500 0.06857
18.62500 0.09129
18.87500 0.05525
19.12500 0.05426
19.37500 0.06719
19.62500 0.03978
19.87500 0.05150
