0.12500 0.01525
0.37500 0.02296
0.62500 0.00188
0.87500 0.02233
1.12500 0.01045
1.37500 0.02943
1.62500 0.02042
1.87500 0.01606
2.12500 0.00893
2.37500 0.01069
2.62500 0.01307
2.87500 0.01622
3.12500 0.01027
3.37500 0.01213
3.62500 0.01164
3.87500 0.01319
4.12500 0.02320
4.37500 0.01546
4.62500 0.01103
4.87500 0.01685
5.12500 0.01538
5.37500 0.02003
5.62500 0.00903
5.87500 0.00678
6.12500 0.00626
6.37500 0.01563
6.62500 0.00538
6.87500 0.01517
7.12500 0.01396
7.37500 0.01164
7.62500 0.02012
7.87500 0.00879
8.12500 0.00203
8.37500 0.02130
8.62500 0.01351
8.87500 0.02834
9.12500 0.03443
9.37500 0.03345
9.62500 0.02648
9.87500 0.02144
10.12500 0.02309
10.37500 0.02532
10.62500 0.02954
10.87500 0.01923
11.12500 0.01844
11.37500 0.02826
11.62500 0.04655
11.87500 0.02389
12.12500 0.02154
12.37500 0.02149
12.62500 0.01442
12.87500 0.00127
13.12500 0.02405
13.37500 0.03653
13.62500 0.02553
13.87500 0.04241
14.12500 0.01049
14.37500 0.02356
14.62500 0.02153
14.87500 0.01856
