0.05000 6110.38904
0.15000 7086.71347
0.25000 9436.10309
0.35000 10225.94672
0.45000 10573.13898
0.55000 10661.27672
0.65000 10539.29527
0.75000 10620.03760
0.85000 10346.94131
0.95000 10028.03527
1.05000 9642.60595
1.15000 9246.11819
1.25000 8922.41476
1.35000 8530.96875
1.45000 8125.84937
1.55000 7775.98587
1.65000 7507.01454
1.75000 7175.42371
1.85000 6879.02226
1.95000 6654.54201
2.05000 6410.60417
2.15000 6241.66176
2.25000 5950.13234
2.35000 5709.46458
2.45000 5503.71376
2.55000 5323.12512
2.65000 5157.21692
2.75000 4924.37240
2.85000 4852.07629
2.95000 4607.25973
3.05000 4531.73083
3.15000 4401.87486
3.25000 4279.13796
3.35000 4118.40829
3.45000 3996.90147
3.55000 3868.99339
3.65000 3733.64627
3.75000 3662.69790
3.85000 3565.05527
3.95000 3427.81078
4.05000 3361.30766
4.15000 3262.87383
4.25000 3145.57006
4.35000 3048.54944
4.45000 2971.94820
4.55000 2915.78180
4.65000 2797.68591
4.75000 2736.81470
4.85000 2682.24548
4.95000 2563.14653
5.05000 2529.66108
5.15000 2442.10201
5.25000 2323.37314
5.35000 2295.64118
5.45000 2177.09492
5.55000 2137.64693
5.65000 2058.83095
5.75000 1944.96064
5.85000 1901.91509
5.95000 1821.26233
6.05000 1727.11663
6.15000 1682.39457
6.25000 1634.47916
6.35000 1579.18315
6.45000 1523.00856
6.55000 1480.66778
6.65000 1422.84903
6.75000 1379.62467
6.85000 1347.69910
6.95000 1293.01643
7.05000 1260.74826
7.15000 1209.08721
7.25000 1175.79083
7.35000 1140.98301
7.45000 1106.07502
7.55000 1067.15285
7.65000 1048.58676
7.75000 1029.47811
7.85000 1006.53064
7.95000 958.79143
8.05000 946.58154
8.15000 926.42506
8.25000 912.50650
8.35000 870.04307
8.45000 878.78664
8.55000 826.54152
8.65000 809.73886
8.75000 787.89192
8.85000 768.00759
8.95000 732.99531
9.05000 721.15917
9.15000 712.11399
9.25000 692.40335
9.35000 683.33804
9.45000 660.38740
9.55000 646.73320
9.65000 628.43685
9.75000 610.79178
9.85000 586.13562
9.95000 581.11867
10.05000 587.24990
10.15000 551.21649
10.25000 537.13115
10.35000 529.29663
10.45000 515.25160
10.55000 513.96254
10.65000 506.51671
10.75000 495.40111
10.85000 474.10494
10.95000 465.45661
11.05000 455.81645
11.15000 452.42459
11.25000 447.05861
11.35000 428.70058
11.45000 418.00177
11.55000 406.24048
11.65000 400.49292
11.75000 397.95039
11.85000 384.18272
11.95000 378.42374
12.05000 372.52357
12.15000 373.59720
12.25000 355.77729
12.35000 354.48075
12.45000 338.80190
12.55000 348.32163
12.65000 343.53494
12.75000 330.19415
12.85000 332.39315
12.95000 315.37993
13.05000 316.57237
13.15000 300.74011
13.25000 300.51376
13.35000 300.94311
13.45000 283.99257
13.55000 287.11653
13.65000 288.62545
13.75000 265.29108
13.85000 271.65721
13.95000 269.69926
14.05000 257.55405
14.15000 262.07472
14.25000 255.64490
14.35000 255.12343
14.45000 244.18798
14.55000 237.47719
14.65000 234.03123
14.75000 231.37820
14.85000 219.21590
14.95000 225.74826
15.05000 230.26340
15.15000 213.42524
15.25000 216.74874
15.35000 211.62143
15.45000 203.69771
15.55000 206.87678
15.65000 200.86708
15.75000 197.26287
15.85000 197.25360
15.95000 195.39176
16.05000 184.49460
16.15000 184.41762
16.25000 173.27493
16.35000 179.66384
16.45000 185.66224
16.55000 174.08100
16.65000 166.40882
16.75000 164.09902
16.85000 165.67746
16.95000 161.29634
17.05000 158.57864
17.15000 158.66715
17.25000 153.56312
17.35000 168.87200
17.45000 158.73795
17.55000 152.12833
17.65000 156.44811
17.75000 169.80463
17.85000 147.38033
17.95000 150.55319
18.05000 149.10133
18.15000 145.45023
18.25000 139.43946
18.35000 141.42878
18.45000 140.76794
18.55000 142.31375
18.65000 135.22157
18.75000 129.12521
18.85000 138.74541
18.95000 130.43063
19.05000 130.94057
19.15000 130.04251
19.25000 133.03611
19.35000 118.85109
19.45000 116.50192
19.55000 118.33860
19.65000 111.78636
19.75000 108.86148
19.85000 115.05543
19.95000 110.78597
