0.125 -0.000 -0.000 0.001
0.375 -0.001 0.004 0.034
0.625 -0.005 -0.003 0.182
0.875 -0.006 -0.002 0.528
1.125 -0.025 0.014 1.090
1.375 -0.005 0.021 1.705
1.625 -0.000 0.028 2.438
1.875 -0.011 0.048 3.163
2.125 0.020 0.039 3.941
2.375 -0.010 0.069 4.517
2.625 0.003 0.035 5.492
2.875 -0.002 0.057 6.218
3.125 0.009 0.073 6.872
3.375 -0.034 0.012 7.759
3.625 -0.030 0.077 8.842
3.875 -0.040 0.098 10.013
4.125 -0.036 0.088 11.355
4.375 -0.025 0.020 12.753
4.625 -0.032 0.064 14.570
4.875 -0.078 0.111 15.908
5.125 0.002 0.034 17.304
5.375 0.020 0.102 18.728
5.625 0.000 0.148 20.335
5.875 -0.010 0.170 21.349
6.125 0.041 0.126 22.178
6.375 0.048 0.161 22.985
6.625 0.040 0.132 23.530
6.875 -0.011 0.143 24.312
7.125 -0.022 0.205 25.003
7.375 0.026 0.213 25.267
7.625 0.021 0.187 26.094
7.875 0.018 0.137 26.498
8.125 -0.041 0.147 26.786
8.375 -0.011 0.139 26.565
8.625 0.010 0.162 26.977
8.875 -0.038 0.175 26.714
9.125 -0.000 0.225 26.756
9.375 -0.001 0.156 27.085
9.625 0.018 0.161 27.272
9.875 0.040 0.173 27.813
10.125 0.074 0.173 27.436
10.375 0.046 0.216 27.569
10.625 -0.007 0.234 27.166
10.875 0.037 0.180 26.453
11.125 0.055 0.184 25.843
11.375 0.017 0.177 24.964
11.625 0.061 0.182 24.451
11.875 0.044 0.193 23.803
12.125 -0.003 0.206 23.318
12.375 0.007 0.197 23.254
12.625 0.012 0.235 22.311
12.875 -0.004 0.206 21.638
13.125 -0.006 0.210 20.812
13.375 -0.002 0.217 21.061
13.625 0.026 0.199 19.693
13.875 0.004 0.159 18.947
14.125 -0.018 0.152 18.817
14.375 -0.041 0.150 17.571
14.625 0.003 0.135 17.371
14.875 0.016 0.158 16.732
