0.10101 0.44645 0.96851
0.30303 0.26404 0.39330
0.50505 0.16691 0.18803
0.70707 0.11666 0.10274
0.90909 0.08762 0.06221
1.11111 0.06757 0.04034
1.31313 0.05516 0.02811
1.51515 0.04513 0.02045
1.71717 0.03800 0.01537
1.91919 0.03323 0.01187
2.12121 0.02832 0.00946
2.32323 0.02404 0.00739
2.52525 0.02170 0.00624
2.72727 0.01988 0.00524
2.92929 0.01790 0.00443
3.13131 0.01612 0.00372
3.33333 0.01512 0.00328
3.53535 0.01451 0.00292
3.73737 0.01398 0.00265
3.93939 0.01399 0.00246
4.14141 0.01411 0.00232
4.34343 0.01413 0.00223
4.54545 0.01395 0.00206
4.74747 0.01374 0.00195
4.94949 0.01322 0.00179
5.15152 0.01244 0.00163
5.35354 0.01141 0.00145
5.55556 0.01075 0.00130
5.75758 0.01013 0.00119
5.95960 0.00955 0.00107
6.16162 0.00899 0.00099
6.36364 0.00851 0.00090
6.56566 0.00803 0.00083
6.76768 0.00754 0.00075
6.96970 0.00706 0.00068
7.17172 0.00662 0.00062
7.37374 0.00631 0.00058
7.57576 0.00611 0.00054
7.77778 0.00567 0.00050
7.97980 0.00541 0.00045
8.18182 0.00511 0.00042
8.38384 0.00485 0.00039
8.58586 0.00470 0.00037
8.78788 0.00456 0.00035
8.98990 0.00426 0.00032
9.19192 0.00415 0.00030
9.39394 0.00400 0.00029
9.59596 0.00378 0.00026
9.79798 0.00366 0.00025
10.00000 0.00359 0.00024
10.20202 0.00338 0.00022
10.40404 0.00336 0.00021
10.60606 0.00314 0.00020
10.80808 0.00306 0.00019
11.01010 0.00294 0.00018
11.21212 0.00280 0.00017
11.41414 0.00267 0.00016
11.61616 0.00262 0.00015
11.81818 0.00249 0.00014
12.02020 0.00238 0.00013
12.22222 0.00227 0.00013
12.42424 0.00212 0.00011
12.62626 0.00206 0.00011
12.82828 0.00196 0.00010
13.03030 0.00183 0.00009
13.23232 0.00172 0.00009
13.43434 0.00164 0.00008
13.63636 0.00151 0.00007
13.83838 0.00148 0.00007
14.04040 0.00141 0.00007
14.24242 0.00132 0.00006
14.44444 0.00122 0.00006
14.64646 0.00119 0.00005
14.84848 0.00112 0.00005
15.05051 0.00105 0.00005
15.25253 0.00100 0.00004
15.45455 0.00096 0.00004
15.65657 0.00093 0.00004
15.85859 0.00082 0.00003
16.06061 0.00081 0.00003
16.26263 0.00075 0.00003
16.46465 0.00075 0.00003
16.66667 0.00070 0.00003
16.86869 0.00066 0.00003
17.07071 0.00062 0.00002
17.27273 0.00061 0.00002
17.47475 0.00058 0.00002
17.67677 0.00055 0.00002
17.87879 0.00050 0.00002
18.08081 0.00047 0.00002
18.28283 0.00046 0.00002
18.48485 0.00046 0.00002
18.68687 0.00041 0.00001
18.88889 0.00041 0.00001
19.09091 0.00035 0.00001
19.29293 0.00035 0.00001
19.49495 0.00031 0.00001
19.69697 0.00029 0.00001
19.89899 0.00027 0.00001
