0.120000 2.303670
0.380000 1.182840
0.620000 0.957110
0.880000 1.001500
1.120000 1.000570
1.380000 1.016430
1.620000 0.997960
1.880000 1.047080
2.120000 1.041030
2.380000 1.040560
2.620000 1.054990
2.880000 1.034880
3.120000 1.053390
3.380000 1.055320
3.620000 1.062220
3.880000 1.076170
4.120000 1.082310
4.380000 1.069760
4.620000 1.069360
4.880000 1.085390
5.120000 1.073820
5.380000 1.094920
5.620000 1.080210
5.880000 1.110230
6.120000 1.103150
6.380000 1.086310
6.620000 1.058900
6.880000 1.035530
7.120000 0.999480
7.380000 0.961800
7.620000 0.928960
7.880000 0.947620
8.120000 0.748300
8.380000 0.634590
8.620000 0.417630
8.880000 0.233770
9.120000 0.532730
9.380000 0.687360
9.620000 0.561730
9.880000 0.335180
10.120000 0.688710
10.380000 1.084190
10.620000 1.624900
10.880000 1.636610
11.120000 1.105070
11.380000 1.469600
11.620000 0.995130
11.880000 1.311650
12.120000 1.066660
12.380000 1.123330
12.620000 0.987360
12.880000 0.287240
13.120000 0.380940
13.380000 0.183020
13.620000 0.037820
13.880000 -0.134640
14.120000 -0.191740
14.380000 -0.476790
14.620000 -0.547830
14.880000 -0.835010
