0.120000 0.883520
0.380000 1.183920
0.620000 1.153970
0.880000 0.839720
1.120000 1.015130
1.380000 1.263400
1.620000 1.137500
1.880000 1.158550
2.120000 1.181230
2.380000 1.017040
2.620000 0.877680
2.880000 0.695390
3.120000 0.730250
3.380000 0.519130
3.620000 0.602330
3.880000 0.969140
4.120000 0.765430
4.380000 0.785480
4.620000 0.586040
4.880000 -0.474660
5.120000 -0.589260
5.380000 -0.582660
5.620000 -1.549310
5.880000 1.330900
6.120000 -2.256800
6.380000 0.469400
6.620000 1.985220
6.880000 0.867430
7.120000 -0.379480
7.380000 -0.055060
7.620000 0.781770
7.880000 1.467750
8.120000 -0.118670
8.380000 -0.900070
8.620000 -1.046040
8.880000 -1.490390
9.120000 -1.640960
9.380000 2.550020
9.620000 -1.729170
9.880000 -1.866310
10.120000 -2.693140
10.380000 -2.048060
10.620000 1.702610
10.880000 2.706070
11.120000 -2.026790
11.380000 -1.423260
11.620000 -0.630570
11.880000 -0.791000
12.120000 -2.079520
12.380000 -2.287970
12.620000 -2.457360
12.880000 -1.579940
13.120000 -2.986690
13.380000 -2.632110
13.620000 2.971040
13.880000 -2.052070
14.120000 -0.095120
14.380000 -2.583190
14.620000 1.603480
14.880000 1.146210
15.120000 3.072420
15.380000 1.416420
15.620000 1.720460
15.880000 1.762690
16.120000 1.309990
16.380000 1.152390
16.620000 1.288270
16.880000 1.487100
17.120000 0.806010
17.380000 0.193130
17.620000 -2.459490
17.880000 2.401210
18.120000 1.389640
18.380000 -0.958510
18.620000 -1.308140
18.880000 0.398570
19.120000 -2.844510
19.380000 -1.624390
19.620000 0.483050
19.880000 0.182170
