0.450000 -2.051560
1.350000 -2.189550
2.250000 -2.009960
3.150000 -2.005100
4.050000 -1.939340
4.950000 -1.968220
5.850000 -2.028870
6.750000 -2.290460
7.650000 -2.685520
8.550000 -2.807850
9.450000 -2.760230
10.350000 -2.580080
11.250000 -3.041200
12.150000 2.879860
13.050000 2.252950
13.950000 1.628210
14.850000 -0.122840
15.750000 1.877650
16.650000 2.731660
17.550000 2.073450
