0.05000 -614.53537 3227.00112 -1585.20075 0.00000 0.00000 0.00000
0.15000 -325.69677 473.52748 -2313.88653 2398.37718 2294.44647 1512.48330
0.25000 -971.85005 -926.13703 -2056.96746 2003.95134 2446.21351 810.63680
0.35000 -807.86309 -73.13930 -2085.53117 2586.41876 2196.34920 860.99613
0.45000 -588.82047 -27.87215 -1938.29836 2547.55586 2333.29832 1028.91374
0.55000 -921.82596 3.37417 -1816.55134 2326.63555 2464.67925 1447.92309
0.65000 -890.26022 29.56415 -1963.34472 2096.17210 2428.55314 1475.82143
0.75000 -1295.71448 171.09104 -1668.10932 2095.46661 2428.45604 1748.33045
0.85000 -1584.82037 114.44570 -1253.14416 1974.84313 2462.50118 1948.92504
0.95000 -1824.49112 -70.35757 -1036.58821 1730.59077 2315.43557 2141.25438
1.05000 -2113.73837 64.63980 -920.76897 1696.81670 2121.25004 2268.14078
1.15000 -2304.23742 109.59314 -717.90474 1424.24283 2027.86690 2324.33817
1.25000 -2427.98820 74.70796 -729.37463 1419.94004 1949.57991 2313.29621
1.35000 -2639.86009 3.76165 -613.24967 1323.83735 1813.46839 2320.81925
1.45000 -2830.04829 0.80157 -429.58914 1345.77526 1762.93445 2297.76492
1.55000 -2773.53692 5.78700 -484.82741 1345.63059 1582.30073 2460.69978
1.65000 -2788.27874 -1.73774 -432.03746 1276.89840 1549.22559 2498.28827
1.75000 -2938.34181 -21.59750 -317.69182 1261.24900 1420.17566 2451.55439
1.85000 -3029.20953 4.18542 -219.26710 1253.31454 1375.92252 2471.88917
1.95000 -3040.11540 -20.44348 -255.40832 1209.13908 1304.57345 2470.95765
2.05000 -3110.67929 -29.83224 -263.12920 1111.02914 1212.36022 2458.80750
2.15000 -3046.05602 1.32691 -317.00202 1141.01947 1125.98710 2502.42894
2.25000 -3152.58117 37.77893 -280.37428 1059.78742 1128.35750 2407.25587
2.35000 -3099.59355 -11.73476 -196.16249 1193.77890 1109.80607 2491.18712
2.45000 -3151.46515 11.27488 -156.02231 1089.65225 1016.32253 2462.77200
2.55000 -3101.81650 4.48239 -128.72175 1136.55640 953.70987 2494.82209
2.65000 -3127.94732 -27.31409 -192.96220 1117.39247 957.12696 2461.27456
2.75000 -3143.18761 4.43995 -269.45179 1065.71948 899.93844 2391.62555
2.85000 -3138.78039 -17.35283 -202.25831 1080.57841 892.37794 2405.33570
2.95000 -3109.66171 9.89966 -243.63259 1055.31130 839.69124 2401.46004
3.05000 -3171.98816 -54.80419 -95.03872 1037.06908 836.62433 2335.51604
3.15000 -3099.87804 14.15677 -63.28869 1014.13379 818.37525 2404.94989
3.25000 -3148.80513 1.88136 -212.19488 1000.04211 764.11815 2351.20504
3.35000 -3119.92913 13.17619 -124.94510 1025.10595 780.32110 2350.46551
3.45000 -3051.11259 -6.93396 -149.03631 1057.78890 717.66162 2384.78698
3.55000 -3046.52255 1.68187 -181.23822 1022.24066 723.64311 2408.95621
3.65000 -3056.70022 22.37489 15.43783 980.42639 688.29182 2397.46945
3.75000 -3076.89230 1.42252 -148.19680 1025.10969 654.46152 2344.08873
3.85000 -3064.74653 -20.95553 -15.85821 979.42356 695.74253 2348.20601
3.95000 -3090.68140 7.96489 -50.26248 926.44526 608.62559 2300.86231
4.05000 -3052.17755 -10.09550 -79.93499 947.50914 568.10066 2302.58580
4.15000 -3077.26517 1.81386 -186.88185 940.88770 617.18393 2258.75735
4.25000 -3010.33187 -11.38728 -61.68882 977.67624 594.34195 2333.11569
4.35000 -3058.12897 -0.51968 58.85079 933.11087 564.83052 2250.78390
4.45000 -3038.58472 -7.21836 -128.46016 954.26323 555.80153 2250.17483
4.55000 -2989.76259 4.75979 -149.82546 946.98118 557.94304 2285.83651
4.65000 -2952.00931 5.99365 -126.20301 957.67014 529.33471 2311.27390
4.75000 -2994.89843 20.32171 -93.01963 895.87744 520.32193 2241.49113
4.85000 -2950.11953 3.99472 -1.87735 914.84553 525.30296 2257.71125
4.95000 -2970.01299 -3.68199 -115.18617 871.58711 470.51858 2202.12513
5.05000 -2960.80989 8.87363 -32.15222 889.91295 472.65835 2205.36784
5.15000 -2952.18548 -20.21916 -23.41273 891.62859 489.97567 2168.82799
5.25000 -2878.59851 0.15233 -45.37250 935.46846 460.79336 2226.67776
5.35000 -2917.48851 2.67984 -24.34549 884.23457 464.67609 2178.99010
5.45000 -2926.96800 -11.75120 -46.99853 869.52532 450.76622 2131.83842
5.55000 -2879.70493 17.13677 -47.43425 906.10694 446.43096 2159.51628
5.65000 -2845.05666 9.61109 -101.12770 882.75532 464.34506 2164.92770
5.75000 -2838.23010 -9.26398 -75.22341 884.07950 430.72090 2141.38392
5.85000 -2850.23709 7.76366 -43.23011 845.56208 411.59263 2119.33421
5.95000 -2821.25204 -4.32588 -11.43796 852.64071 400.81366 2114.86734
6.05000 -2805.14666 -2.33291 -23.44928 852.91089 408.80991 2116.20995
6.15000 -2779.04999 0.02176 -74.05467 870.17614 389.64714 2114.85744
6.25000 -2796.36486 -6.52573 36.35177 821.03814 405.66139 2073.67781
6.35000 -2776.08865 -3.45982 -6.71127 824.94720 352.12368 2062.95882
6.45000 -2785.81243 -2.52341 -15.81427 807.08588 373.48568 2028.48762
6.55000 -2774.70808 -7.94957 71.76731 808.32816 348.24420 2033.86224
6.65000 -2717.12994 6.99434 25.42116 835.34300 353.35575 2056.46178
6.75000 -2695.38346 -10.10600 -0.43886 817.55853 327.88117 2058.54850
6.85000 -2738.41044 6.09594 21.23232 802.51147 360.57385 1989.71049
6.95000 -2693.07851 -1.57051 31.13434 840.17294 337.24457 2009.75906
7.05000 -2656.85118 2.24989 -21.84905 811.76232 320.31044 2028.91774
7.15000 -2680.30737 -7.97247 7.03155 775.90273 315.41613 1975.49439
7.25000 -2647.32861 8.61193 -28.95281 791.90968 362.29235 1988.02233
7.35000 -2625.67996 -3.79393 -36.17182 794.99462 299.98460 1971.67596
7.45000 -2613.40138 2.25782 47.43035 772.93923 324.93718 1977.78886
7.55000 -2604.63572 -4.46956 41.27778 788.49458 326.43519 1955.13592
7.65000 -2625.63627 -2.81077 58.22770 788.98636 306.48319 1908.30072
7.75000 -2599.71945 0.81079 0.94239 795.00281 308.02099 1906.24269
7.85000 -2594.63188 -9.42461 -5.05308 752.00988 259.61759 1890.80119
7.95000 -2569.29170 -1.86729 15.14581 763.03589 287.97455 1889.20542
8.05000 -2560.55869 -8.76201 44.91618 755.15270 264.41690 1861.04050
8.15000 -2514.10935 1.50776 -29.81527 765.64879 253.83849 1894.56385
8.25000 -2515.02326 -5.04376 0.18159 736.56237 316.71903 1876.58496
8.35000 -2520.28490 -0.79776 -20.40962 734.73369 241.77906 1837.01613
8.45000 -2495.47682 4.64050 -26.98707 727.52705 271.65402 1849.45033
8.55000 -2505.58629 -1.35230 28.87982 726.00194 255.66807 1811.74866
8.65000 -2452.69447 -1.12917 16.35381 738.66118 234.54964 1841.42558
8.75000 -2432.13734 -1.64936 23.79749 728.70679 242.63254 1834.58242
8.85000 -2470.16209 -2.23918 66.90165 704.77610 223.91514 1771.36245
8.95000 -2444.15700 -4.23224 8.67147 719.92091 232.23602 1781.21617
9.05000 -2439.02127 2.53865 -32.03203 726.56550 252.79638 1761.87701
9.15000 -2393.30452 6.35746 71.28559 728.37100 256.13999 1779.84108
9.25000 -2351.87893 -1.07831 -30.98562 752.48366 237.96607 1798.36207
9.35000 -2393.45739 7.97419 10.66597 692.71546 213.82607 1734.19049
9.45000 -2363.06289 2.60326 18.93328 696.86191 255.36745 1751.25138
9.55000 -2320.39508 2.50692 33.06592 707.71217 258.23959 1776.45913
9.65000 -2362.42187 6.04075 29.68478 658.06233 231.96881 1709.06355
9.75000 -2330.56243 -1.06965 64.34254 690.55225 236.28406 1717.88002
9.85000 -2317.57808 -1.55183 82.66413 692.86255 239.95216 1716.72487
9.95000 -2301.64533 -3.25320 36.05145 671.01856 227.47846 1708.43421
10.05000 -2303.66206 -3.72901 52.13610 663.86375 206.77770 1680.69319
10.15000 -2280.68127 -0.27190 48.31796 672.87205 216.51329 1681.71209
10.25000 -2274.72065 -2.86940 40.07099 655.87259 186.74798 1668.31473
10.35000 -2254.51161 3.18482 5.28046 683.01685 262.60718 1658.62801
10.45000 -2250.47494 -4.82850 57.30082 652.17874 195.67539 1649.75491
10.55000 -2224.08351 4.32963 -14.56515 649.19637 188.43832 1658.66853
10.65000 -2217.63734 2.01701 9.23136 668.83104 219.59591 1644.18117
10.75000 -2213.56624 2.03631 -40.79171 651.41043 181.07452 1615.36639
10.85000 -2194.05924 -2.10578 32.56803 640.74973 169.95567 1622.16595
10.95000 -2172.83448 1.80097 -6.03932 642.07897 201.83018 1624.99523
11.05000 -2156.91854 -0.38723 28.71169 649.71655 166.46745 1615.61948
11.15000 -2150.71894 -1.49660 73.05024 626.82399 178.25644 1611.62733
11.25000 -2149.35241 1.91768 38.19103 631.42237 181.59877 1590.45031
11.35000 -2156.73382 -4.50606 -39.04868 612.27018 183.38518 1547.20257
11.45000 -2120.92349 4.84579 13.38859 635.32846 193.16359 1577.09284
11.55000 -2126.52775 -2.12048 77.21228 610.61413 163.55937 1551.74606
11.65000 -2103.38061 0.13506 4.25804 621.12988 216.52032 1551.13028
11.75000 -2087.87074 -2.34035 9.80188 628.77721 166.17129 1545.50598
11.85000 -2081.31172 1.30489 -2.63025 614.02848 154.33095 1541.25510
11.95000 -2077.08685 -3.70112 23.21700 617.31279 172.57572 1527.71144
12.05000 -2077.79462 0.07593 55.81706 600.35762 148.19144 1504.86602
12.15000 -2063.72074 3.00078 61.63486 594.02061 178.16740 1503.30631
12.25000 -2059.92865 -1.80805 1.37661 594.16100 149.71043 1491.29099
12.35000 -2028.52966 0.04248 20.19119 627.73977 201.86964 1506.09860
12.45000 -2038.18194 3.92626 52.68284 593.06634 165.13133 1479.52864
12.55000 -2025.92306 5.25699 -8.03221 589.21191 144.61859 1467.16757
12.65000 -2011.34629 -0.52276 7.91482 596.21708 175.56007 1478.33492
12.75000 -1988.91758 1.70152 10.06013 597.82470 168.74798 1483.19360
12.85000 -1987.43902 0.62770 33.02076 576.70436 130.81824 1461.80603
12.95000 -1971.76431 0.14890 29.56575 574.98814 164.90854 1465.81881
13.05000 -1971.49365 0.12246 36.61799 586.67318 135.28311 1441.42898
13.15000 -1974.06085 1.38609 44.62952 574.23407 146.48398 1422.25783
13.25000 -1950.56908 0.30545 8.44735 571.11692 214.52969 1432.26249
13.35000 -1944.69407 -0.52105 31.36987 563.35798 124.31422 1420.50722
13.45000 -1911.90164 1.23817 38.18932 582.44709 136.94758 1440.62217
13.55000 -1913.80965 4.15750 24.86284 579.95771 130.84292 1419.06022
13.65000 -1912.84872 3.98424 6.33627 554.02006 135.54983 1403.50171
13.75000 -1905.64157 -1.06080 25.79755 542.97237 132.03972 1398.33633
13.85000 -1889.76644 3.28148 45.17601 558.66373 128.17556 1396.18530
13.95000 -1899.12105 1.07425 -15.00476 535.98866 110.43347 1364.27547
14.05000 -1867.21639 -2.30947 -5.73791 558.29534 119.67535 1383.61362
14.15000 -1862.85844 -2.74917 6.43511 538.11620 123.10579 1369.02129
14.25000 -1837.38770 -0.10222 -5.60008 551.36663 163.74071 1391.67017
14.35000 -1844.87073 1.01119 42.75135 562.95938 161.79593 1375.72373
14.45000 -1836.74941 -0.62292 24.00546 537.41930 137.45131 1353.46486
14.55000 -1814.14603 -2.11602 27.90571 545.49187 134.76929 1366.62242
14.65000 -1822.32394 -2.42558 -7.34266 523.78668 118.60158 1341.87104
14.75000 -1805.07838 2.57804 46.04857 520.03940 140.12023 1346.43532
14.85000 -1799.09180 -5.43365 25.99348 522.51338 102.29819 1336.29039
14.95000 -1793.89578 3.22727 -24.21475 517.91489 106.09162 1320.17332
15.05000 -1791.09806 -1.06196 27.35187 513.27233 113.67942 1317.62815
15.15000 -1771.62122 0.71161 20.05810 520.73616 105.07380 1326.55502
15.25000 -1772.16099 -2.71820 30.51731 514.42969 119.48135 1301.72066
15.35000 -1761.37948 0.92484 20.72945 501.80847 98.02851 1302.83604
15.45000 -1740.98029 0.54724 -2.15366 523.05095 105.51027 1305.57283
15.55000 -1741.90200 0.10884 20.39068 503.78059 101.53242 1290.73444
15.65000 -1743.61913 0.16645 -6.26879 497.23640 114.52145 1276.63093
15.75000 -1735.90233 -1.45587 69.02518 493.34736 98.18489 1269.47120
15.85000 -1720.24264 -2.45805 -23.86797 501.37821 94.32688 1270.38568
15.95000 -1708.34161 0.65188 42.78504 503.91364 98.56198 1269.97809
16.05000 -1707.21132 1.37228 43.93605 496.50410 98.80025 1260.66205
16.15000 -1689.55433 -0.16664 2.42772 510.67194 119.72940 1271.10503
16.25000 -1682.03541 0.01804 84.44423 510.56105 150.30865 1263.20863
16.35000 -1683.34108 -2.08324 9.84161 477.97006 91.75992 1247.09910
16.45000 -1688.19717 -0.06309 14.44380 473.72126 93.06326 1225.24121
16.55000 -1644.56754 0.42537 53.66741 505.16327 92.41777 1251.77576
16.65000 -1651.51736 -0.99949 -2.60665 495.63111 125.74226 1237.61912
16.75000 -1641.14232 -0.82616 44.29349 483.61174 128.41440 1235.47680
16.85000 -1649.90000 1.65983 33.61078 494.29726 87.48895 1213.23302
16.95000 -1638.29951 1.16512 12.61568 503.26202 103.26612 1208.94587
17.05000 -1634.51610 2.74161 32.00233 471.74573 98.56734 1199.58106
17.15000 -1628.87777 0.38951 25.97632 464.04861 101.80997 1189.41676
17.25000 -1606.59402 -0.80155 -9.95328 467.19233 81.40858 1204.89968
17.35000 -1622.14731 -0.57727 37.21647 448.78365 86.13661 1174.06040
17.45000 -1605.37449 -1.64006 17.98934 453.65046 81.74022 1180.81368
17.55000 -1597.61913 -0.12900 3.87093 456.49477 94.34721 1171.21189
17.65000 -1592.55672 -1.55764 -11.31947 454.39757 100.72011 1166.73500
17.75000 -1588.21426 -0.29396 -14.64057 450.65460 88.70725 1159.55043
17.85000 -1574.98361 0.53172 22.99296 463.93777 110.99102 1165.28314
17.95000 -1566.54529 -1.03647 23.86615 457.99603 78.74568 1156.32193
18.05000 -1554.24349 0.63884 61.37899 452.78889 80.82022 1162.09051
18.15000 -1548.21702 -0.85188 22.26870 461.25870 99.82021 1165.28879
18.25000 -1545.22241 1.00568 -13.29269 444.90857 75.62919 1143.34975
18.35000 -1538.44905 0.22789 62.86434 450.20036 78.25166 1137.26478
18.45000 -1536.97373 0.11277 37.60568 436.61381 84.26903 1125.84256
18.55000 -1533.56201 0.34243 24.14524 436.51082 76.40231 1117.95554
18.65000 -1514.73465 0.84518 -14.48433 438.88941 72.49317 1125.51479
18.75000 -1528.24388 0.05846 2.07633 423.75286 87.02555 1100.77249
18.85000 -1511.12466 -0.33256 19.30624 426.86328 77.52418 1107.45335
18.95000 -1487.69038 0.48085 28.74146 449.38372 79.12778 1120.42850
19.05000 -1499.91995 -1.62519 -5.86715 435.97803 84.58421 1098.02137
19.15000 -1493.66429 1.04571 -12.05033 420.10350 90.57856 1097.52872
19.25000 -1462.44946 -2.08284 44.61827 435.94599 89.79511 1110.17074
19.35000 -1469.74062 -2.37538 6.44357 427.38916 118.73982 1092.21876
19.45000 -1469.99558 4.25068 6.80453 428.06663 116.89498 1084.58015
19.55000 -1454.94167 -0.67726 35.93089 422.28653 66.47921 1088.14448
19.65000 -1446.90227 -0.01987 0.22479 422.30524 66.42396 1082.64537
19.75000 -1461.30780 -0.88749 18.59130 404.56041 66.32728 1053.44528
19.85000 -1433.51446 0.18274 24.85855 422.44941 69.45423 1074.67201
19.95000 -1440.67343 -1.44201 -0.62188 420.22557 72.20552 1061.75572
