0.05000 -25165.00638 -1613.58802 635.97460 25680.71831 21448.96129 26293.40341
0.15000 -34632.00820 40.66559 373.11445 14562.62731 13527.75240 30526.17652
0.25000 -29672.21460 -222.19811 1054.55306 10857.44360 7113.62381 25364.16685
0.35000 -24288.56852 -50.19513 488.63868 8574.23411 5204.19376 21709.81057
0.45000 -21171.65643 2.34077 -281.67860 7010.12433 4136.59582 19069.96201
0.55000 -19120.98410 25.82181 -181.64190 5844.81982 3939.36380 16730.08211
0.65000 -17500.32409 96.58392 -2.56674 5915.38671 3396.43727 15390.82659
0.75000 -16360.85877 -24.80197 106.88031 4850.33606 3325.84380 14173.22983
0.85000 -15565.63079 -25.76617 53.95128 4372.22446 2861.93611 12997.64420
0.95000 -14735.68568 16.75845 123.85176 3909.94843 2806.21889 12041.20237
1.05000 -13913.85833 -27.35998 183.68395 3643.45396 2870.70329 11346.85889
1.15000 -13427.63579 -35.57730 140.63060 3236.90986 2466.55247 10528.25515
1.25000 -12775.55412 57.55599 102.23615 3143.04805 2634.48166 10197.69687
1.35000 -12453.42318 -11.24746 -79.79331 2993.04116 2752.69042 9454.72166
1.45000 -11925.77009 71.92672 -67.97781 3247.17264 2448.39823 8973.32766
1.55000 -11595.30228 38.84579 2.24208 2930.35845 2458.07507 8570.90987
1.65000 -11275.15875 -18.45271 50.09278 2264.97046 2051.22801 8060.36004
1.75000 -10936.22389 40.22315 -173.49700 2255.89627 2073.24896 7760.55169
1.85000 -10618.84219 -15.61129 -28.25162 1975.23081 2013.88586 7408.96560
1.95000 -10398.98768 6.51018 105.63570 2182.46634 2162.86511 7124.34540
2.05000 -10019.17142 -55.79895 -165.31794 1943.54588 1916.94397 6969.56488
2.15000 -9858.40402 3.48088 148.09118 1768.65057 2054.15275 6499.10027
2.25000 -9641.88505 -53.48980 -110.38290 1432.78465 1934.18133 6157.03414
2.35000 -9447.89327 -73.06201 -21.78314 1652.84598 2410.16534 6081.42896
2.45000 -9301.01403 -16.91006 -98.18820 1325.72943 2154.74096 5730.25201
2.55000 -9176.99787 -56.50044 36.93247 1347.54573 1772.59592 5582.30055
2.65000 -8997.98466 -81.56285 25.76861 1082.02795 1629.87650 5217.73374
2.75000 -8895.60551 -21.14115 -75.62422 1366.78471 1676.53427 5064.09509
2.85000 -8814.15892 -16.58997 -44.55478 1100.14673 1658.43549 4889.27638
2.95000 -8733.34441 -39.80947 -122.59668 985.67968 1536.02861 4693.99895
3.05000 -8651.72162 26.16315 -5.41640 1456.92316 1731.06557 4548.90936
3.15000 -8519.53989 -30.60557 -7.01996 1308.34933 1406.51106 4418.64528
3.25000 -8463.08580 23.99905 12.43341 875.49755 1389.09155 4296.17077
3.35000 -8392.79046 -8.66208 -18.19460 1297.33818 1437.78669 4149.21291
3.45000 -8355.35197 17.25610 58.69084 956.01675 1284.46096 4017.08850
3.55000 -8333.38060 13.00349 8.33595 1021.61508 1433.69598 3819.07711
3.65000 -8274.56380 11.52124 8.72083 1091.69190 1132.48605 3738.77133
3.75000 -8175.60357 18.47141 2.22821 1209.30171 1101.32349 3648.13977
3.85000 -8093.96270 -0.89249 78.01289 1063.99515 1071.37837 3510.96918
3.95000 -8034.17373 13.86436 126.39534 1280.84672 1023.00111 3401.89186
4.05000 -7956.54942 12.06102 -24.42140 1024.37382 976.45920 3284.72639
4.15000 -7901.24876 -4.46487 -45.76025 965.09459 930.13303 3197.26740
4.25000 -7786.88439 -6.50946 59.07157 900.86263 894.03714 3149.07437
4.35000 -7693.38805 6.51349 17.56878 993.98394 844.30189 3043.31291
4.45000 -7647.50266 2.43161 36.04379 872.44896 724.76853 2942.27562
4.55000 -7575.66001 -7.83955 22.29854 809.41392 1524.70967 2991.08101
4.65000 -7509.16078 -4.99883 19.24001 995.90177 913.34916 2786.60050
4.75000 -7413.12398 12.80460 74.69968 818.98622 652.07998 2732.27694
4.85000 -7349.33042 -2.08989 1.49683 750.30924 619.57108 2678.55470
4.95000 -7275.39860 3.54018 28.56422 673.33982 549.98446 2556.98346
5.05000 -7205.82227 13.44725 -26.60962 681.75916 615.59888 2474.43866
5.15000 -7177.09709 6.59391 21.42063 1602.18407 865.04541 2410.90789
5.25000 -7093.37915 4.95834 47.22046 1376.56043 519.62723 2377.27836
5.35000 -6996.66792 5.38213 -38.99069 718.64641 511.74955 2359.81795
5.45000 -6957.84661 9.37166 -46.22527 592.30466 587.64827 2482.19650
5.55000 -6886.57497 -0.26353 -25.48884 566.48670 495.70545 2206.50414
5.65000 -6831.33781 -9.79518 -17.81045 804.20919 1143.00087 2131.27569
5.75000 -6745.01212 -5.26482 -61.31479 738.37978 590.48547 2204.30525
5.85000 -6696.85280 -9.95608 9.31838 684.37211 597.68505 2160.75645
5.95000 -6647.80934 2.93379 13.54622 484.28193 495.65838 1971.99783
6.05000 -6567.47257 5.81767 -7.69971 503.08310 370.40026 1931.95194
6.15000 -6504.35541 10.31094 -53.61093 638.61154 502.60363 1917.42820
6.25000 -6440.14296 3.10984 -39.47027 494.40157 379.26547 1863.97186
6.35000 -6384.50508 -0.73767 -50.66426 643.07962 681.99100 1829.08014
6.45000 -6310.17981 3.49678 -20.72315 471.11903 341.85200 1766.23696
6.55000 -6269.58059 17.27864 -17.58530 1543.60501 1202.60118 1882.42216
6.65000 -6188.25486 1.87629 -50.91054 407.46954 392.83038 1780.22634
6.75000 -6138.42307 -15.05835 -70.85022 425.60400 1455.71551 1858.29873
6.85000 -6083.08196 -4.55683 -45.65854 412.22513 311.53511 1591.05129
6.95000 -6028.87250 0.42961 -3.14207 377.50932 268.27935 1550.14480
7.05000 -5971.87445 4.44126 -41.28523 537.45688 417.81711 1591.75182
7.15000 -5916.26962 2.71447 45.65481 328.58863 233.81707 1505.79360
7.25000 -5870.24340 6.33354 -21.08008 368.48009 224.65181 1486.80863
7.35000 -5813.61269 0.56701 13.48063 353.92147 309.39729 1429.06233
7.45000 -5768.79619 -5.23109 -16.38621 400.83195 331.11510 1395.99663
7.55000 -5729.62594 19.41896 17.08426 1456.59662 1274.94593 1417.77033
7.65000 -5660.61665 -4.63894 -48.64384 475.47066 451.34152 1417.67726
7.75000 -5603.66469 4.43936 12.57449 297.43441 281.69721 1302.59011
7.85000 -5567.53274 2.64220 5.96978 509.12409 289.75993 1288.42724
7.95000 -5518.65550 -1.10414 -35.29887 438.36399 247.28710 1257.06379
8.05000 -5464.13969 -1.68085 -4.78819 257.52150 237.95656 1230.46369
8.15000 -5418.63114 -3.13875 -11.61829 277.23439 203.69907 1202.90595
8.25000 -5361.55185 14.09779 41.72885 772.26367 683.87497 2182.36015
8.35000 -5324.49884 -0.31657 -23.45020 274.86671 179.44717 1136.19874
8.45000 -5288.78933 15.64756 -20.24601 402.87575 890.63034 1323.30963
8.55000 -5239.88855 8.86307 5.80932 444.25767 308.98970 1277.28610
8.65000 -5194.14883 7.17222 -5.82480 343.33282 310.02767 1191.30590
8.75000 -5147.87042 1.52866 -24.32036 295.62449 278.48794 1082.26220
8.85000 -5099.01126 4.77161 -24.08896 355.54693 237.12990 1048.05766
8.95000 -5054.17697 -2.38432 -22.84406 312.61553 157.85296 1047.27121
9.05000 -4997.85549 -4.30719 15.04317 635.26223 312.84212 1132.73922
9.15000 -4966.03312 4.92165 -8.56186 242.28393 144.58604 984.44583
9.25000 -4941.21278 -10.13369 -7.74179 716.87692 537.35631 988.16333
9.35000 -4890.31525 -3.45797 -8.91396 208.20914 406.76235 936.70103
9.45000 -4841.24057 -4.48635 -10.86340 301.30661 334.97292 954.14503
9.55000 -4795.28104 -0.38279 -39.97570 287.96073 336.51541 911.93820
9.65000 -4757.70652 2.28508 -28.77416 191.46798 141.81653 901.01308
9.75000 -4720.27290 2.23422 -33.70843 201.26619 163.71837 883.49469
9.85000 -4680.08683 5.29624 -22.27833 187.11206 172.29501 857.21881
9.95000 -4643.30872 -2.92965 -20.63622 244.21999 153.03143 843.52770
10.05000 -4608.49731 4.60906 -11.39092 188.54793 138.98010 821.35145
10.15000 -4577.77174 -0.34452 7.26313 203.74772 190.93111 811.95820
10.25000 -4539.49391 -3.19535 -19.29426 163.19076 145.93014 789.75605
10.35000 -4503.76594 0.04826 -10.14089 310.38690 298.34092 788.49752
10.45000 -4471.29410 -2.72764 -26.69919 327.07623 465.75242 814.43618
10.55000 -4436.42933 0.52590 -18.59698 304.73809 347.55103 823.19119
10.65000 -4410.11414 14.65882 40.97175 744.88769 843.26808 2265.50078
10.75000 -4364.46228 -2.94922 -31.61368 267.36156 226.02039 732.94864
10.85000 -4328.94948 -1.09384 3.51846 148.95992 350.25605 737.93172
10.95000 -4301.21781 3.15533 -5.11059 138.58352 616.76063 688.39792
11.05000 -4256.02219 -4.53991 -55.10864 408.48234 270.22933 861.98256
11.15000 -4237.92525 1.93955 -38.18151 127.77547 119.07474 656.13919
11.25000 -4197.68230 -0.00354 -16.84350 372.10110 307.78660 738.76183
11.35000 -4171.42717 -2.45176 -37.25515 156.34601 163.13740 658.40780
11.45000 -4119.87143 16.13039 -50.27903 796.55001 1220.03835 719.27918
11.55000 -4104.62414 2.59419 -18.49173 173.76372 178.10293 644.38895
11.65000 -4077.62808 0.49365 -29.97185 128.04087 125.32784 607.56775
11.75000 -4046.09945 -2.60242 -38.29011 134.66813 123.80526 594.45264
11.85000 -4021.68420 -2.75916 -34.50603 136.33956 163.80480 589.57269
11.95000 -3983.18317 -3.69872 -33.16408 141.91334 163.73538 586.94279
12.05000 -3960.58717 -4.72849 13.28890 171.58998 257.95955 565.59905
12.15000 -3928.74029 -4.70737 -29.47607 186.46091 398.31640 672.79851
12.25000 -3895.58336 0.85925 -38.78461 114.04588 99.43760 545.27480
12.35000 -3864.82656 4.20033 -27.36006 188.65882 158.44817 543.47618
12.45000 -3843.67528 0.48008 -23.91580 167.87107 108.42914 520.24920
12.55000 -3819.42481 3.32169 -23.30775 185.55586 124.26238 523.62066
12.65000 -3786.89762 -0.03950 -33.11396 109.02219 103.09307 492.10110
12.75000 -3753.68035 2.29885 -22.94064 132.77502 117.29553 502.06035
12.85000 -3733.21887 0.98298 -46.22342 108.74117 115.59248 470.28634
12.95000 -3710.28985 -1.02625 -24.83009 120.98492 134.96589 478.00848
13.05000 -3694.78805 -10.66893 -23.40456 241.79604 383.44536 483.07280
13.15000 -3656.70100 0.15770 -34.45810 200.90189 167.22651 495.07955
13.25000 -3631.98300 -5.03955 -14.98222 132.63420 139.68706 457.79589
13.35000 -3612.24232 -1.98999 -16.69111 171.04780 181.51970 440.42857
13.45000 -3585.23231 1.77222 -27.47403 117.14128 89.25443 435.68216
13.55000 -3561.38702 -2.05168 -22.29402 100.32294 90.37327 430.03321
13.65000 -3539.70813 -2.49114 -0.86646 102.99705 124.59896 422.55462
13.75000 -3511.84283 0.82848 -18.03282 152.25522 73.33332 415.94873
13.85000 -3485.48591 10.42423 -7.02574 226.34565 426.36875 883.22067
13.95000 -3460.59778 1.23335 -8.77424 459.26126 99.42043 548.56432
14.05000 -3444.42993 0.28467 11.79707 342.32865 210.91768 1088.63662
14.15000 -3419.95376 -0.42934 -14.25948 251.71954 97.63300 391.60545
14.25000 -3391.83477 1.17752 -14.92399 91.10951 81.44839 378.27180
14.35000 -3373.45264 3.11400 1.72241 191.66955 194.59333 389.64791
14.45000 -3349.03730 0.54618 -7.03594 99.49551 78.66409 418.34678
14.55000 -3325.94905 2.22968 2.35572 130.26085 84.81608 361.20276
14.65000 -3305.38957 -1.02100 -10.35454 84.11208 73.87376 339.69977
14.75000 -3276.17502 0.21260 -20.18480 99.04027 99.23727 341.08331
14.85000 -3256.15659 1.42277 -10.65091 95.98119 74.87961 336.30370
14.95000 -3239.52068 -7.60698 -8.39636 228.43139 247.22808 347.29930
15.05000 -3215.64459 0.81503 -13.57014 131.32147 96.54173 334.72014
15.15000 -3191.06528 1.67924 -1.59482 98.70194 106.83769 324.82332
15.25000 -3169.01138 0.23726 -7.30081 63.98144 55.11560 316.38322
15.35000 -3143.30387 -0.24788 -12.46753 117.33222 102.19560 348.44564
15.45000 -3126.18383 0.41648 -16.51253 90.24008 61.54189 304.14523
15.55000 -3100.19371 2.35720 -9.96962 176.20955 226.69843 319.24698
15.65000 -3080.67004 1.46695 7.44613 70.51221 72.72085 292.63272
15.75000 -3063.19692 0.57331 -9.03804 62.81513 57.10409 282.57667
15.85000 -3041.94476 -1.13562 2.38061 105.58087 95.31777 293.78590
15.95000 -3020.88321 -1.20547 5.41485 72.21138 53.50180 270.83905
16.05000 -3002.15288 0.55713 1.62445 98.58351 82.14022 273.08186
16.15000 -2978.94617 -1.03300 2.27941 57.54059 58.98153 263.05184
16.25000 -2959.63086 2.22372 -7.71586 72.14054 55.27146 262.91109
16.35000 -2939.33868 2.29023 19.14281 115.57640 112.98643 268.60368
16.45000 -2918.52465 3.45585 4.16600 158.89121 138.34302 318.06667
16.55000 -2903.07165 1.77622 14.19334 58.86642 52.23081 245.75655
16.65000 -2885.95238 -0.62402 -3.27958 95.96387 73.38606 246.44360
16.75000 -2863.68345 0.83528 -2.09068 88.83031 906.35471 241.06086
16.85000 -2848.34503 2.45090 5.86395 160.13473 255.77650 309.40139
16.95000 -2823.59459 5.05608 -4.83022 107.58168 73.68788 233.55618
17.05000 -2814.90239 3.20423 10.13571 131.68895 116.58843 233.81241
17.15000 -2789.04955 3.05969 -8.39131 109.57703 206.96693 310.94218
17.25000 -2775.87683 1.22804 7.86102 64.48598 49.11541 216.30326
17.35000 -2755.78679 4.08832 10.72242 55.55450 43.56405 207.36857
17.45000 -2743.42133 0.40359 10.13825 71.50416 60.96609 220.81300
17.55000 -2728.95675 -2.27384 13.36079 178.07575 101.97449 235.24097
17.65000 -2708.70552 1.51235 -0.58286 81.11297 67.04360 206.15325
17.75000 -2685.03491 -5.00393 1.53983 151.55326 133.97296 237.40048
17.85000 -2676.79950 1.65346 -2.72081 181.47220 58.77977 269.15414
17.95000 -2651.82599 -1.31063 0.25527 87.34698 59.03032 202.23725
18.05000 -2638.10036 3.09608 5.42555 51.95822 49.75021 193.00025
18.15000 -2623.09736 1.39688 13.27986 56.15031 68.46090 206.95946
18.25000 -2606.14317 3.82187 -4.70223 57.46828 58.73932 196.32639
18.35000 -2589.62705 2.07034 -5.87964 142.48926 93.99345 238.48909
18.45000 -2578.82214 1.01228 10.91301 45.89581 64.62515 180.92398
18.55000 -2564.37931 2.77950 3.77695 71.27845 68.54285 190.02399
18.65000 -2545.03219 3.51508 1.75906 47.39744 39.49352 174.21712
18.75000 -2522.67463 -0.16706 3.86494 121.24139 48.84303 181.89681
18.85000 -2535.60890 -0.43107 -11.57096 470.00637 101.62791 199.44801
18.95000 -2497.23506 0.83588 -6.66017 49.62945 49.76876 174.83782
19.05000 -2492.70030 -2.97320 -13.22280 126.90595 161.20888 172.42088
19.15000 -2473.17423 -2.16277 -3.76368 56.12175 78.71460 167.35905
19.25000 -2454.67452 -2.53568 -4.50635 46.11025 45.10009 168.28370
19.35000 -2441.19669 1.09501 2.14705 90.48427 98.68579 168.36256
19.45000 -2431.03152 -1.08395 -10.10679 117.57075 89.36443 169.56909
19.55000 -2416.11788 1.54406 -11.66016 56.57832 86.73730 149.78436
19.65000 -2400.32441 2.01633 -22.00009 62.52072 46.49747 158.45609
19.75000 -2387.58528 -0.70756 -3.03819 48.26523 42.63232 151.41800
19.85000 -2373.88679 -28.11516 -0.94719 85.26194 720.53755 240.61807
19.95000 -2361.19995 2.54340 2.65950 47.21630 44.42876 136.86410
