0.12500 0.00846
0.37500 0.06285
0.62500 0.12556
0.87500 0.18994
1.12500 0.23990
1.37500 0.28161
1.62500 0.33384
1.87500 0.38159
2.12500 0.41018
2.37500 0.42528
2.62500 0.44302
2.87500 0.44924
3.12500 0.42382
3.37500 0.40416
3.62500 0.37545
3.87500 0.36096
4.12500 0.33354
4.37500 0.29939
4.62500 0.27888
4.87500 0.25740
5.12500 0.24501
5.37500 0.22305
5.62500 0.19932
5.87500 0.15917
6.12500 0.12466
6.37500 0.08779
6.62500 0.06130
6.87500 0.05005
7.12500 0.04416
7.37500 0.04693
7.62500 0.04309
7.87500 0.06311
8.12500 0.06685
8.37500 0.08271
8.62500 0.08451
8.87500 0.09046
9.12500 0.07311
9.37500 0.04818
9.62500 0.03149
9.87500 0.02263
10.12500 0.04036
10.37500 0.05397
10.62500 0.07182
10.87500 0.08331
11.12500 0.09688
11.37500 0.10693
11.62500 0.10929
11.87500 0.08362
12.12500 0.10501
12.37500 0.08320
12.62500 0.06171
12.87500 0.06897
13.12500 0.08741
13.37500 0.08173
13.62500 0.07389
13.87500 0.08382
14.12500 0.07847
14.37500 0.06555
14.62500 0.04399
14.87500 0.03696
