0.120000 2.214630
0.380000 1.675930
0.620000 2.210020
0.880000 2.175640
1.120000 2.148870
1.380000 2.160500
1.620000 2.193980
1.880000 2.172380
2.120000 2.178520
2.380000 2.154760
2.620000 2.157660
2.880000 2.150510
3.120000 2.136010
3.380000 2.151660
3.620000 2.119300
3.880000 2.100870
4.120000 2.082170
4.380000 2.014590
4.620000 1.958440
4.880000 1.879180
5.120000 1.852580
5.380000 1.814910
5.620000 1.772050
5.880000 1.704600
6.120000 1.639030
6.380000 1.673550
6.620000 1.615060
6.880000 1.612590
7.120000 1.740360
7.380000 1.766120
7.620000 2.167200
7.880000 0.727860
8.120000 -1.733180
8.380000 -2.452670
8.620000 -2.042050
8.880000 -2.450030
9.120000 -2.558540
9.380000 2.363300
9.620000 1.795370
9.880000 2.030500
10.120000 1.339220
10.380000 1.016460
10.620000 1.377020
10.880000 1.232540
11.120000 1.511830
11.380000 1.263370
11.620000 1.298870
11.880000 1.542310
12.120000 1.242450
12.380000 1.269280
12.620000 1.111960
12.880000 1.149850
13.120000 1.184300
13.380000 1.371550
13.620000 1.273390
13.880000 1.275160
14.120000 1.311740
14.380000 0.458830
14.620000 0.670990
14.880000 0.430990
