0.120000 2.328140
0.380000 -2.231240
0.620000 -2.298970
0.880000 -2.305850
1.120000 -2.274900
1.380000 -2.237670
1.620000 -2.259880
1.880000 -2.252200
2.120000 -2.252690
2.380000 -2.272530
2.620000 -2.289880
2.880000 -2.298300
3.120000 -2.274650
3.380000 -2.295220
3.620000 -2.285090
3.880000 -2.280490
4.120000 -2.285850
4.380000 -2.300840
4.620000 -2.309500
4.880000 -2.280690
5.120000 -2.244770
5.380000 -2.173640
5.620000 -2.126670
5.880000 -2.060680
6.120000 -2.050280
6.380000 -2.022900
6.620000 -2.042610
6.880000 -2.312390
7.120000 -2.480570
7.380000 -2.779380
7.620000 -2.365350
7.880000 -2.715340
8.120000 -2.474980
8.380000 -2.127720
8.620000 -2.437540
8.880000 -2.539220
9.120000 -2.650210
9.380000 -2.533670
9.620000 -2.492780
9.880000 -2.658460
10.120000 -2.818840
10.380000 3.058360
10.620000 3.003330
10.880000 1.910540
11.120000 1.943000
11.380000 1.775000
11.620000 1.367180
11.880000 1.042620
12.120000 0.992240
12.380000 1.016260
12.620000 1.046300
12.880000 1.051930
13.120000 0.874660
13.380000 0.908310
13.620000 1.012790
13.880000 1.062280
14.120000 0.543270
14.380000 0.216080
14.620000 0.454960
14.880000 0.243990
