0.12500 0.00830
0.37500 0.04161
0.62500 0.11029
0.87500 0.20023
1.12500 0.27707
1.37500 0.35951
1.62500 0.41637
1.87500 0.45524
2.12500 0.50014
2.37500 0.53937
2.62500 0.56792
2.87500 0.55953
3.12500 0.55056
3.37500 0.53236
3.62500 0.51655
3.87500 0.47392
4.12500 0.44964
4.37500 0.40097
4.62500 0.36957
4.87500 0.32673
5.12500 0.30952
5.37500 0.29137
5.62500 0.28957
5.87500 0.27860
6.12500 0.25192
6.37500 0.21687
6.62500 0.16624
6.87500 0.14046
7.12500 0.09867
7.37500 0.08430
7.62500 0.07657
7.87500 0.06692
8.12500 0.03325
8.37500 0.03056
8.62500 0.03155
8.87500 0.04029
9.12500 0.07452
9.37500 0.07325
9.62500 0.08689
9.87500 0.08433
10.12500 0.09634
10.37500 0.06795
10.62500 0.09251
10.87500 0.09834
11.12500 0.12393
11.37500 0.14150
11.62500 0.15076
11.87500 0.15763
12.12500 0.15941
12.37500 0.17015
12.62500 0.16029
12.87500 0.16320
13.12500 0.16585
13.37500 0.12428
13.62500 0.12889
13.87500 0.08954
14.12500 0.07260
14.37500 0.05814
14.62500 0.05591
14.87500 0.03191
