0.05000 -1483.88350 -22.94315 -31372.70301 2106.57080 2339.32544 312934.80654
0.15000 -4101.46338 174.83154 -7727.64580 2029.33655 2317.86873 341388.26312
0.25000 -6231.27764 2.74650 11038.98040 1899.89633 1832.89199 338105.42088
0.35000 -7718.15485 43.29574 -3850.78305 2002.11887 1726.80044 354670.67576
0.45000 -8615.88413 126.72078 -3704.17109 1973.58441 1506.92180 343506.48389
0.55000 -9249.22848 84.81053 2600.78647 1956.64931 1434.41862 266898.50939
0.65000 -9793.45421 81.93399 304.63974 1834.52263 1281.81453 301439.65337
0.75000 -9974.60742 76.60591 -6069.09619 1777.69107 1188.63228 265809.95115
0.85000 -10105.85363 108.89334 2993.90920 1688.45494 1165.72935 250520.62625
0.95000 -10091.57908 63.14729 -1808.51508 1587.84768 1122.46932 229469.61508
1.05000 -10097.29365 72.56843 -5264.66990 1506.86016 1085.08677 227218.65814
1.15000 -10015.62835 88.00605 257.28645 1384.97348 1041.23539 232469.61404
1.25000 -9887.04753 107.91120 -2097.30802 1288.03141 1042.54665 203865.21430
1.35000 -9835.88657 105.24652 384.47228 1219.68157 1009.07381 190560.59119
1.45000 -9699.02323 82.58105 -1081.23369 1140.04421 995.19514 166879.26982
1.55000 -9647.41982 94.94996 746.91681 1090.51714 991.64198 168626.47727
1.65000 -9609.41257 83.92477 53.14493 978.97767 977.43348 155565.44555
1.75000 -9510.78852 78.50107 1246.79788 886.81853 947.15841 147851.93087
1.85000 -9437.41355 73.11484 2193.63149 816.52323 945.90374 144521.72019
1.95000 -9377.21150 89.45835 -1308.62860 777.30281 922.64857 154836.23969
2.05000 -9293.91197 80.10818 -2919.36560 714.66055 906.12352 127480.57922
2.15000 -9261.98889 67.46426 317.06486 666.55378 896.64907 123589.50696
2.25000 -9235.83769 67.89650 2181.89103 598.93986 854.01709 139916.07589
2.35000 -9150.69141 52.54477 931.59722 550.54256 829.94922 117401.29720
2.45000 -9066.33263 83.92654 -728.82263 530.40480 790.99885 115403.75334
2.55000 -9004.14399 69.79804 744.29500 491.87837 777.21709 100154.45588
2.65000 -8950.28802 63.01580 -174.85631 472.16017 746.02602 103192.27107
2.75000 -8890.05813 64.45280 -519.05560 470.11206 727.68306 98395.54808
2.85000 -8814.97146 66.24976 2689.71063 473.84793 672.05653 94908.57144
2.95000 -8757.39766 55.45616 -20.16585 477.63883 679.60857 102733.09878
3.05000 -8666.10784 70.63666 -851.80520 462.82999 626.35213 88500.10296
3.15000 -8586.96011 47.61539 2158.96266 462.79966 604.85735 80860.83058
3.25000 -8500.48239 62.35469 654.56106 472.81489 592.35282 76074.18632
3.35000 -8436.56173 67.70060 -155.17612 466.20183 559.34168 68316.04511
3.45000 -8374.80523 51.91077 595.48827 449.45219 529.34915 69424.87696
3.55000 -8286.59958 62.08052 192.53359 439.43668 493.37272 68171.79422
3.65000 -8169.83131 53.27701 1234.50265 444.26033 464.56013 71084.82783
3.75000 -8089.64956 57.65444 -454.57092 436.00095 469.39863 68353.88857
3.85000 -8021.15701 50.62516 250.79693 422.35605 424.55412 62886.75689
3.95000 -7910.92944 57.87223 479.34707 426.89032 418.35229 60366.25795
4.05000 -7828.38778 56.26638 2154.23444 431.40863 403.28714 59287.92827
4.15000 -7753.81917 51.99596 -530.33024 410.11445 382.89680 55785.65874
4.25000 -7649.26155 60.43724 465.37447 395.54841 376.10934 51336.61998
4.35000 -7576.13113 51.62457 215.03358 388.64918 360.69131 48731.94079
4.45000 -7511.98489 52.39057 993.50951 396.68095 345.70553 54031.24279
4.55000 -7429.60272 52.37969 -230.58668 375.70065 317.06921 75463.08529
4.65000 -7368.82359 47.84781 616.66435 379.46214 326.78356 43663.95053
4.75000 -7287.84609 41.61609 276.73947 351.20528 322.11799 47129.38067
4.85000 -7215.60308 49.01527 435.50407 342.80832 286.49109 44044.64576
4.95000 -7152.37765 48.60471 1068.99126 344.43933 301.41434 38364.47584
5.05000 -7078.77548 44.77999 289.33861 317.32282 271.99690 36898.98919
5.15000 -7022.69383 43.48741 414.98641 325.03471 269.36816 37981.38060
5.25000 -6947.08806 45.95789 32.04968 324.46680 290.80031 34878.17778
5.35000 -6881.36197 44.08276 362.90439 302.70998 274.90041 34430.52950
5.45000 -6815.10107 42.27309 214.45082 302.86955 265.89639 32898.39564
5.55000 -6753.26564 38.82586 658.30941 272.12038 236.09920 30946.93671
5.65000 -6686.31473 36.68306 687.61781 272.13657 226.49039 34048.29895
5.75000 -6618.02971 40.14204 353.84291 282.38896 249.05751 30349.91158
5.85000 -6556.59931 34.93676 230.48697 265.98276 222.15257 26952.43950
5.95000 -6492.29289 39.00547 -420.10485 269.09662 249.74592 33455.49224
6.05000 -6434.65156 31.99778 -13.00760 265.20969 242.94242 33179.26769
6.15000 -6376.29066 33.13740 -235.92099 261.26275 224.51704 23868.76869
6.25000 -6313.60900 29.78546 -272.77589 243.89274 226.33674 23261.30880
6.35000 -6241.34002 34.25594 -31.26149 243.92923 214.40094 22955.45818
6.45000 -6188.34763 31.60215 73.90953 234.23279 201.00155 29591.63180
6.55000 -6126.84687 31.88663 -225.41840 237.37042 218.00472 22097.58141
6.65000 -6065.19340 31.96775 130.37019 231.23267 191.70548 19134.98591
6.75000 -6004.55426 26.31190 -556.17502 225.92161 222.12250 22100.87484
6.85000 -5954.47669 25.90376 -446.51827 219.61827 205.26941 21235.38495
6.95000 -5906.11104 24.84192 -190.13753 199.44381 191.04779 28569.60246
7.05000 -5840.49004 27.17744 -959.14472 207.68107 212.38317 37668.43678
7.15000 -5792.32142 23.21925 0.64110 210.88350 198.15164 17410.81328
7.25000 -5727.92837 24.48861 4.57588 199.78298 184.25940 16947.17319
7.35000 -5674.63785 24.33915 102.45589 180.01148 166.23081 16901.75205
7.45000 -5614.30122 21.56117 -160.52507 178.10441 169.52363 14551.38492
7.55000 -5559.94413 22.09335 -228.52178 199.13560 192.06342 24317.69804
7.65000 -5507.60266 27.25399 -103.10613 193.04001 166.40614 13261.62856
7.75000 -5455.10504 23.58347 88.98030 207.94086 179.36035 15342.35593
7.85000 -5406.49348 26.14720 53.76888 158.75964 172.57713 13703.86791
7.95000 -5345.51576 21.86849 24.74424 151.14690 194.66653 11941.27782
8.05000 -5289.86667 24.87059 61.83576 186.56345 178.66933 12915.61551
8.15000 -5233.68242 24.77629 -201.35292 165.42906 174.34096 12274.90933
8.25000 -5182.17916 22.17427 93.11012 162.97654 136.30904 11559.82636
8.35000 -5126.27739 26.51666 211.32391 159.10525 137.62954 11078.38713
8.45000 -5062.22473 21.43968 712.74603 171.07302 175.61280 63529.48319
8.55000 -5010.26425 18.65296 -357.52543 175.96169 156.18562 10406.35050
8.65000 -4965.92749 19.34960 -100.66997 137.08190 153.60711 11797.60296
8.75000 -4919.22234 18.75568 111.31466 209.85450 208.22570 9974.71769
8.85000 -4869.94395 15.98146 -91.32434 158.00353 170.90192 8774.41894
8.95000 -4824.80343 17.57057 -0.60209 170.83534 167.13178 8793.27482
9.05000 -4769.91625 21.28448 125.61107 167.25864 150.16745 9131.74592
9.15000 -4727.30842 12.16672 -783.19990 140.92643 150.44076 38781.54972
9.25000 -4675.27719 16.46404 121.30931 172.82008 148.88149 7749.28949
9.35000 -4626.83732 16.80609 241.14493 185.99533 174.79974 17992.85124
9.45000 -4590.92846 18.01873 267.49785 138.25990 138.20387 7827.31868
9.55000 -4548.16064 12.80148 -120.84511 155.75492 165.27709 7694.04356
9.65000 -4510.18658 14.51645 11.32672 178.42694 158.76631 7079.97480
9.75000 -4472.84122 14.57612 -229.42718 137.80831 119.46666 7805.68445
9.85000 -4433.12817 14.91727 -190.39861 123.22708 122.42786 6346.18017
9.95000 -4387.92084 13.61889 -108.81719 118.40573 156.46193 5800.21176
10.05000 -4345.90264 12.64785 -137.14125 136.65382 159.77079 6785.42615
10.15000 -4307.55242 15.17219 -407.74685 142.83740 146.25881 5910.37284
10.25000 -4275.31297 13.63570 34.19810 147.96383 125.75631 5376.20937
10.35000 -4237.20563 15.56879 169.76721 117.41268 152.02250 13692.25617
10.45000 -4203.58186 7.53458 -52.35446 134.01169 166.95820 5885.84446
10.55000 -4161.87429 12.94119 3.95516 148.12290 129.42967 5367.87717
10.65000 -4128.22493 14.11761 -239.45451 176.51077 136.88853 6640.15395
10.75000 -4093.36814 9.56851 -209.38523 143.98166 133.59101 4379.44452
10.85000 -4067.09608 13.01121 -9.59872 146.64773 125.09350 5105.55938
10.95000 -4031.61351 14.92598 -44.18477 101.57905 104.14479 4924.07820
11.05000 -3997.89451 14.29736 -179.55126 143.63841 91.54593 4834.78136
11.15000 -3957.46146 12.38542 -208.73808 153.76711 119.35739 4820.50283
11.25000 -3929.80638 9.11086 -115.16917 169.19958 155.10500 4355.46288
11.35000 -3899.89471 13.26022 -27.31211 95.95024 106.11786 3937.70417
11.45000 -3876.67323 12.63125 -58.98253 163.78058 124.45469 5180.72889
11.55000 -3838.44837 11.92637 -125.97849 104.61094 101.88509 4131.41883
11.65000 -3816.45979 10.12716 -63.16250 163.73379 148.61769 3973.60646
11.75000 -3779.82919 8.59886 -202.37775 86.87000 135.67648 4521.52169
11.85000 -3756.18016 9.44733 -13.16627 144.11181 112.31807 4186.18176
11.95000 -3721.63706 16.39986 -62.09435 122.80239 115.92945 3475.43020
12.05000 -3697.24025 9.46589 12.56948 136.08149 117.20101 3869.53591
12.15000 -3668.26059 12.14376 -110.62017 85.69816 79.22756 3462.12002
12.25000 -3635.95551 9.91785 -113.89379 89.93329 90.01555 3052.99375
12.35000 -3607.30465 11.79300 -88.77263 85.30555 77.79326 3697.82877
12.45000 -3575.92608 10.05845 6.95581 99.55898 70.96311 3873.56057
12.55000 -3549.61044 5.27374 118.67236 119.44904 131.15235 3818.59372
12.65000 -3526.56430 7.07280 -77.99607 172.64743 89.49104 2888.23293
12.75000 -3487.62691 7.22391 -16.60836 76.64347 63.93610 2968.47316
12.85000 -3456.63668 9.41496 175.73079 84.16592 66.95829 2757.91158
12.95000 -3428.69132 9.39346 -54.14839 94.22896 137.53325 2076.56145
13.05000 -3409.36997 7.58207 17.22285 75.57020 73.45921 2209.21420
13.15000 -3375.61435 9.20877 -58.15797 75.99446 84.56240 2485.15712
13.25000 -3360.18792 9.26174 101.65661 70.79467 72.43242 2191.69190
13.35000 -3328.79998 10.09173 -152.06352 66.75176 60.68023 3066.92347
13.45000 -3308.43281 6.86086 -182.81018 89.15857 81.68701 2183.09042
13.55000 -3280.56248 6.39247 -127.45137 123.26969 134.82729 2580.59056
13.65000 -3259.68634 5.58508 -88.35855 72.76823 165.21487 2433.94661
13.75000 -3229.86857 3.55232 -42.13289 178.60058 121.82181 2219.21864
13.85000 -3213.55770 14.35693 -87.29487 124.32298 121.50341 1603.34908
13.95000 -3189.85521 7.65860 -32.95285 60.59047 55.78781 2478.49988
14.05000 -3161.97325 7.92986 -98.07565 61.53952 110.51444 2218.49372
14.15000 -3140.82542 10.08963 -111.80838 89.94408 133.84837 2087.26549
14.25000 -3123.44723 9.59465 -47.36308 152.33130 59.24226 2247.95379
14.35000 -3109.99971 7.65551 -27.69220 100.33627 68.23155 2179.58154
14.45000 -3079.74008 8.20335 -41.51088 53.96811 46.67759 1511.19817
14.55000 -3054.79130 7.93791 -76.43607 58.63473 56.65230 1358.72159
14.65000 -3032.39897 10.00123 -17.01580 65.13458 60.07285 1930.96906
14.75000 -3014.04757 5.09096 -39.17529 134.02369 89.26361 1540.34113
14.85000 -2983.39753 4.48548 -101.38104 53.31396 43.61270 1595.79360
14.95000 -2961.70068 6.66024 -16.06337 57.54877 68.87554 1419.29278
15.05000 -2938.88758 7.18991 22.90523 99.35759 87.69513 1465.40269
15.15000 -2914.89581 4.74739 36.23090 54.60337 47.18261 1792.51421
15.25000 -2888.15869 8.62050 -81.49865 93.73419 90.77664 1413.11819
15.35000 -2880.39129 7.85792 -44.19346 62.40700 46.13072 1834.59470
15.45000 -2854.90392 9.42664 -13.66318 49.29597 57.71353 1470.16094
15.55000 -2846.99326 9.50390 -31.10903 157.41791 79.26455 941.90222
15.65000 -2819.20792 11.32198 -66.53308 57.96196 100.35963 1330.58435
15.75000 -2810.43075 9.64058 19.16960 71.00455 71.99853 952.58556
15.85000 -2785.10829 10.50619 -78.39648 64.75978 134.51349 1209.31384
15.95000 -2762.88368 9.72112 -12.98653 47.82909 80.44414 896.85269
16.05000 -2749.60419 5.25623 -122.01110 44.15023 53.81264 1317.30322
16.15000 -2729.96507 5.42898 -85.19823 57.14544 58.59598 1288.10372
16.25000 -2711.91324 7.23456 -19.17190 46.89135 48.64126 813.98375
16.35000 -2697.46342 4.39270 -131.36083 61.34613 60.69711 1047.57439
16.45000 -2678.91852 4.38814 11.06613 48.10824 44.64677 751.73059
16.55000 -2668.59782 11.34599 -57.44535 63.02597 62.23095 1306.88945
16.65000 -2642.14720 9.61338 -33.57531 80.27799 148.55648 810.54177
16.75000 -2629.42498 -1.26095 55.68318 67.63535 76.79112 856.51242
16.85000 -2616.30693 6.57317 -6.16884 52.65182 55.57620 690.21705
16.95000 -2603.52448 18.29549 45.27083 123.95570 78.99771 1005.57120
17.05000 -2586.63152 7.67225 -8.20338 98.93941 66.69044 1192.30385
17.15000 -2561.10706 7.33171 -40.43154 63.24506 40.97605 1121.17728
17.25000 -2548.74964 4.53804 43.45601 45.50605 61.26370 1096.47374
17.35000 -2529.84168 7.80409 -19.72685 44.70054 37.53312 582.06643
17.45000 -2511.73243 6.89738 62.69998 37.06832 38.00341 1027.33180
17.55000 -2501.22926 3.53745 34.36595 38.95493 34.32961 838.15948
17.65000 -2478.75658 4.89305 -12.98073 40.66258 43.51509 800.03506
17.75000 -2465.27164 5.55568 47.16225 47.36892 36.87673 584.66728
17.85000 -2448.64824 6.84702 31.25317 57.25967 105.51609 943.45642
17.95000 -2437.80282 5.35229 -23.15106 151.13421 50.78788 509.05938
18.05000 -2425.46619 8.34989 31.38382 34.75410 48.30645 535.73045
18.15000 -2410.37618 8.51690 -2.59216 42.81033 62.47517 513.44376
18.25000 -2399.54478 4.00440 0.08115 57.60765 34.52312 729.05230
18.35000 -2388.63792 7.41630 0.10712 74.88046 74.15950 522.45499
18.45000 -2369.22331 4.59473 -58.17076 40.75270 43.11838 822.98559
18.55000 -2355.69216 0.61148 52.96103 36.35167 47.99337 803.61400
18.65000 -2334.91483 7.00048 6.11998 64.52627 52.75870 752.17515
18.75000 -2326.02599 0.20611 -41.85541 43.90754 78.19709 659.06907
18.85000 -2306.27857 -5.95709 27.00491 68.59906 111.89624 1226.32190
18.95000 -2302.74867 0.31753 72.74630 34.02587 29.62794 956.42696
19.05000 -2291.69244 2.11740 -52.55863 58.86311 38.26826 891.05890
19.15000 -2279.89718 0.45109 -21.06048 37.59811 36.74333 393.51343
19.25000 -2262.34147 2.92268 -14.81804 55.60767 65.15427 597.14205
19.35000 -2257.18652 1.63669 -53.69672 30.69616 30.69125 533.15991
19.45000 -2238.09172 -0.69333 54.70519 40.84882 51.66054 1480.66641
19.55000 -2225.34530 4.25855 14.14289 40.77302 42.14223 595.79357
19.65000 -2213.02411 5.78536 40.11119 38.37343 37.99474 536.18285
19.75000 -2191.16836 14.43145 9.32450 219.52758 183.11880 400.75525
19.85000 -2190.02186 7.61217 31.35142 31.76916 80.75666 608.31161
19.95000 -2179.85581 0.95385 91.40934 56.11064 37.30844 306.41921
