0.2 0.42558 21.56238 0.29744 107.85591 107.08101 83.08751
0.6 0.85255 45.07108 0.39249 107.64437 98.2844 79.79153
1.0 -0.52528 66.84689 -0.11205 104.87157 89.68199 76.05266
1.4 0.04452 79.91376 -1.33296 100.20912 82.38412 72.19468
1.8 -0.05235 87.99301 -0.08661 94.31887 78.10244 67.76804
2.2 -0.4827 96.05059 -1.08173 89.5127 73.63599 63.68815
2.6 0.31142 104.64826 -1.1877 83.48749 69.94123 60.14992
3.0 0.2021 112.48496 -0.83841 77.63518 65.93943 56.81167
3.4 0.64501 119.04429 -0.10404 70.70265 63.66888 52.86241
3.8 2.61434 126.61639 0.62295 64.249 61.8343 50.13916
4.2 2.08918 137.65009 1.04962 58.79485 59.91727 47.56784
4.6 2.43062 151.13078 1.25653 53.91326 56.70516 44.13114
5.0 1.75784 165.72719 1.25525 50.96715 51.99716 40.89886
5.4 1.91317 176.79777 0.46642 48.69059 44.01236 38.55319
5.8 0.70332 182.73322 0.98243 46.95196 38.30996 35.18138
6.2 0.19426 184.35003 0.79433 45.18205 35.58848 32.47544
6.6 0.45876 185.59184 0.63586 43.92698 34.10234 29.72568
7.0 0.97613 185.98507 0.55538 43.01093 33.00542 28.17235
7.4 -0.24223 186.75366 0.79336 43.18529 31.35908 26.26789
7.8 0.28918 188.60789 0.03498 42.23976 30.21315 25.2389
8.2 0.15402 189.53605 0.25304 41.30216 28.94462 24.18961
8.6 -0.57821 190.66473 0.05522 39.86555 27.7038 23.25147
9.0 -0.58417 191.6986 0.61167 38.02515 27.00267 22.45097
9.4 -0.52285 192.50835 -0.06646 36.07242 25.77153 21.66161
9.8 -0.42106 192.66222 0.266 34.11388 25.06431 20.67303
10.2 -0.5337 194.07981 -0.17931 32.52877 25.07475 19.99883
10.6 0.00551 194.83475 -0.54379 30.64965 25.50974 19.14564
11.0 -0.07412 196.45734 0.12165 29.01282 25.97663 18.48834
11.4 -0.3466 198.22045 0.07947 28.00382 25.19791 17.94203
11.8 -0.18427 199.25587 -0.20232 27.1693 24.34371 17.29971
12.2 -0.34687 200.78576 -0.14735 26.4349 22.66834 16.88787
12.6 0.43811 202.64806 -0.04797 26.2361 20.57463 16.53047
13.0 0.65043 203.58626 -0.56336 25.44254 18.62339 15.89942
13.4 0.9168 203.62719 -0.91162 24.45417 16.37295 15.39549
13.8 0.97981 203.11503 -1.07176 23.17576 14.84873 14.85537
14.2 0.64655 201.93177 -0.85787 23.01107 14.54144 13.93124
14.6 -0.09151 200.7859 -1.26836 21.16499 15.40887 13.45658
15.0 -0.60365 201.16241 -0.67317 20.09231 15.92201 13.07916
15.4 -0.42365 201.60658 -0.40667 18.37674 16.2601 12.40191
15.8 -0.5329 202.75414 -0.00441 17.10223 15.94247 12.15513
16.2 0.03163 204.5796 0.29977 16.44224 15.09641 11.30134
16.6 -0.04964 205.76866 0.7129 15.05342 13.73792 11.38098
17.0 -0.43982 206.31448 1.94072 14.95049 12.77974 10.64009
17.4 -0.52009 206.33775 1.31184 14.17788 11.53875 10.35954
17.8 -0.19815 207.14894 1.49035 13.82788 9.94816 9.76763
18.2 -0.3126 207.13088 0.74062 13.33331 9.72946 9.29827
18.6 -0.33482 207.02939 0.80575 12.43171 9.41415 8.68032
19.0 0.22945 207.13065 0.70501 12.26794 8.8788 8.26746
19.4 0.69411 207.10489 -0.45414 12.1019 8.5713 8.18728
19.8 0.36108 206.27914 -0.34661 11.66567 8.3854 7.97042
