0.120000 -0.751540
0.380000 1.215990
0.620000 2.014310
0.880000 -1.906430
1.120000 0.341580
1.380000 0.575340
1.620000 -2.854030
1.880000 1.474180
2.120000 0.188340
2.380000 -0.716420
2.620000 -0.585550
2.880000 -0.711750
3.120000 -0.751650
3.380000 -0.872070
3.620000 -1.023190
3.880000 -1.125250
4.120000 -1.496200
4.380000 -1.603990
4.620000 -1.800440
4.880000 -1.740840
5.120000 -2.193220
5.380000 -1.902810
5.620000 -2.062000
5.880000 -2.505490
6.120000 -2.945960
6.380000 1.917090
6.620000 2.769090
6.880000 0.614750
7.120000 0.692830
7.380000 0.346290
7.620000 0.457690
7.880000 -0.255690
8.120000 -0.704260
8.380000 -0.912130
8.620000 -1.126970
8.880000 -1.517780
9.120000 -1.865460
9.380000 -2.082720
9.620000 -2.336060
9.880000 -2.972470
10.120000 2.850370
10.380000 -2.814520
10.620000 2.808890
10.880000 2.522890
11.120000 -2.299250
11.380000 -2.671880
11.620000 2.178990
11.880000 -1.090160
12.120000 0.508160
12.380000 -0.915220
12.620000 2.494080
12.880000 1.975910
13.120000 0.256450
13.380000 -0.062810
13.620000 0.375400
13.880000 0.237980
14.120000 0.302410
14.380000 -3.011140
14.620000 -0.355130
14.880000 0.171760
