0.12500 0.01884
0.37500 0.00453
0.62500 0.00864
0.87500 0.00919
1.12500 0.00456
1.37500 0.01068
1.62500 0.02872
1.87500 0.04738
2.12500 0.06283
2.37500 0.06879
2.62500 0.09311
2.87500 0.10345
3.12500 0.10992
3.37500 0.09697
3.62500 0.08406
3.87500 0.05861
4.12500 0.04869
4.37500 0.03238
4.62500 0.01989
4.87500 0.02048
5.12500 0.02062
5.37500 0.02094
5.62500 0.01693
5.87500 0.00206
6.12500 0.02532
6.37500 0.02148
6.62500 0.01218
6.87500 0.03146
7.12500 0.02709
7.37500 0.03028
7.62500 0.01931
7.87500 0.01233
8.12500 0.01405
8.37500 0.00282
8.62500 0.01012
8.87500 0.01451
9.12500 0.00805
9.37500 0.01952
9.62500 0.02474
9.87500 0.02222
10.12500 0.02469
10.37500 0.00556
10.62500 0.01321
10.87500 0.01778
11.12500 0.00955
11.37500 0.01014
11.62500 0.00821
11.87500 0.01730
12.12500 0.00992
12.37500 0.00895
12.62500 0.02733
12.87500 0.00731
13.12500 0.01617
13.37500 0.00803
13.62500 0.01915
13.87500 0.01961
14.12500 0.00787
14.37500 0.00536
14.62500 0.01047
14.87500 0.01602
