0.12500 0.04028
0.37500 0.02275
0.62500 0.03760
0.87500 0.07242
1.12500 0.08840
1.37500 0.10292
1.62500 0.11236
1.87500 0.12512
2.12500 0.11348
2.37500 0.09141
2.62500 0.07454
2.87500 0.05842
3.12500 0.04397
3.37500 0.04067
3.62500 0.02279
3.87500 0.02109
4.12500 0.01836
4.37500 0.01992
4.62500 0.02422
4.87500 0.02120
5.12500 0.03231
5.37500 0.02877
5.62500 0.03859
5.87500 0.03716
6.12500 0.02726
6.37500 0.02041
6.62500 0.01717
6.87500 0.02996
7.12500 0.02238
7.37500 0.02919
7.62500 0.00862
7.87500 0.01340
8.12500 0.01357
8.37500 0.00639
8.62500 0.03048
8.87500 0.02636
9.12500 0.00803
9.37500 0.02723
9.62500 0.00251
9.87500 0.01479
10.12500 0.03042
10.37500 0.01749
10.62500 0.01878
10.87500 0.02324
11.12500 0.02547
11.37500 0.00997
11.62500 0.03160
11.87500 0.02498
12.12500 0.03379
12.37500 0.04736
12.62500 0.01526
12.87500 0.02519
13.12500 0.02898
13.37500 0.06171
13.62500 0.00683
13.87500 0.03070
14.12500 0.02821
14.37500 0.05191
14.62500 0.01554
14.87500 0.01492
