0.2 0.00608 15.80167 -0.46801 118.27644 116.37763 90.42919
0.6 0.04268 37.50853 -0.60621 117.67649 109.70392 88.02147
1.0 -1.34856 56.86873 -0.19166 118.13941 102.22819 84.39292
1.4 1.24715 67.48251 0.44059 118.01694 95.46246 80.85132
1.8 -0.13659 76.18964 -0.70604 116.88491 89.76166 76.4136
2.2 -0.19471 82.50535 -0.24461 115.08949 85.20045 72.43648
2.6 -0.01254 86.69867 -0.24245 111.2319 81.4823 68.02973
3.0 0.55488 91.06219 -0.64021 106.30124 77.81109 64.224
3.4 0.53574 95.0501 -1.74514 101.4969 74.36437 60.73098
3.8 -0.12848 98.63111 -0.77922 95.8348 70.77964 57.15092
4.2 1.48321 103.73563 -0.1848 88.04691 68.41538 54.22463
4.6 2.50333 109.09735 -0.25142 80.54521 67.06954 50.72599
5.0 3.36473 113.39168 -0.77055 72.93905 66.66835 47.99201
5.4 3.44883 122.34179 -0.36627 64.91054 67.08562 45.39814
5.8 2.91497 137.63561 0.28046 59.95414 66.72963 42.62515
6.2 2.69214 156.08635 0.07333 54.01711 62.79013 40.34531
6.6 1.13983 171.61308 0.3921 49.1907 54.73265 37.84387
7.0 0.39816 181.63259 -0.32789 45.18984 45.37998 35.15102
7.4 0.03435 187.49173 0.53563 42.23403 38.59812 33.07733
7.8 -0.91308 189.65234 0.15868 40.67005 35.45171 31.42971
8.2 -0.5349 190.61328 0.55866 39.60206 34.43213 29.61314
8.6 -0.42069 190.81373 0.49006 39.02895 33.55823 27.965
9.0 -1.02498 190.53279 0.41122 38.14629 32.61931 26.34413
9.4 -0.56715 192.42546 0.11028 37.72544 31.17286 24.9712
9.8 0.02079 194.92804 0.17971 37.92748 29.16632 23.43221
10.2 0.09113 197.64243 0.26599 37.47233 26.18095 22.6124
10.6 0.78257 198.61449 0.16956 36.74917 24.01812 21.75973
11.0 1.24249 198.82079 -0.25855 35.3969 23.16196 21.58776
11.4 0.54976 198.82359 0.31805 33.66865 23.14477 20.8823
11.8 0.82876 198.58015 0.37346 32.21432 23.55196 20.09692
12.2 0.54579 198.67268 0.76348 30.28335 23.38798 19.39817
12.6 0.49826 199.52823 0.81884 27.92759 23.37722 18.78054
13.0 0.62939 199.94534 0.8521 26.52899 23.01395 17.91446
13.4 -0.05619 201.17132 0.47465 25.18524 22.52063 17.32044
13.8 1.01495 202.40728 0.49874 24.18099 22.09071 16.9929
14.2 0.87411 204.45245 0.67001 23.04684 20.70059 16.29341
14.6 0.91803 205.39042 0.43522 22.74251 19.5562 15.74856
15.0 0.75005 205.8795 0.58034 22.01971 17.13989 15.3454
15.4 1.2282 206.61587 0.57482 21.00605 15.84193 14.78766
15.8 0.83912 207.15344 0.32124 19.96367 15.67292 14.15327
16.2 -0.19287 207.50494 0.76831 19.85551 16.0074 14.07351
16.6 0.22569 208.79816 0.83055 18.53061 15.35253 13.45512
17.0 0.22642 209.55896 0.97986 18.51739 14.73998 13.39993
17.4 -0.36953 209.72364 1.37862 17.97681 13.43416 13.27286
17.8 -0.44453 209.76667 1.31469 17.55783 12.18839 13.17336
18.2 -0.4649 209.02876 2.17877 16.97951 11.31647 13.16384
18.6 -0.42418 208.18116 1.62076 16.83492 10.88817 12.73409
19.0 -0.84518 207.21904 1.68031 16.63313 10.89857 12.57145
19.4 -0.82182 206.5894 1.862 16.71584 10.40272 12.23409
19.8 -1.22628 205.88914 1.53914 15.64447 10.61778 11.69845
