0.125 -0.004 -0.001 0.032
0.375 0.001 -0.005 0.398
0.625 0.005 0.000 0.859
0.875 -0.006 -0.028 1.249
1.125 -0.031 0.002 1.572
1.375 0.011 -0.003 1.916
1.625 -0.033 -0.011 2.225
1.875 -0.028 -0.016 2.845
2.125 -0.022 -0.013 3.661
2.375 -0.050 -0.004 4.696
2.625 -0.099 0.033 6.287
2.875 -0.122 -0.007 7.722
3.125 -0.132 0.038 9.382
3.375 -0.127 0.070 10.653
3.625 -0.158 0.077 12.455
3.875 -0.151 0.060 13.913
4.125 -0.225 0.153 15.407
4.375 -0.220 0.123 16.936
4.625 -0.291 0.178 18.320
4.875 -0.272 0.188 19.391
5.125 -0.264 0.171 20.462
5.375 -0.303 0.225 21.234
5.625 -0.362 0.240 22.257
5.875 -0.408 0.233 22.782
6.125 -0.324 0.265 23.204
6.375 -0.396 0.300 23.697
6.625 -0.427 0.301 24.001
6.875 -0.388 0.299 23.495
7.125 -0.367 0.296 23.778
7.375 -0.401 0.273 23.406
7.625 -0.445 0.304 23.729
7.875 -0.428 0.358 23.549
8.125 -0.479 0.317 23.980
8.375 -0.467 0.309 24.493
8.625 -0.484 0.337 24.920
8.875 -0.512 0.323 25.214
9.125 -0.472 0.341 26.007
9.375 -0.506 0.251 25.782
9.625 -0.516 0.277 25.116
9.875 -0.499 0.236 24.995
10.125 -0.473 0.281 24.504
10.375 -0.454 0.254 24.940
10.625 -0.426 0.277 23.513
10.875 -0.426 0.233 22.859
11.125 -0.398 0.245 22.314
11.375 -0.387 0.196 21.303
11.625 -0.359 0.191 20.658
11.875 -0.288 0.215 20.295
12.125 -0.319 0.181 19.659
12.375 -0.360 0.189 18.925
12.625 -0.271 0.183 18.695
12.875 -0.261 0.179 17.961
13.125 -0.257 0.189 17.625
13.375 -0.277 0.199 17.282
13.625 -0.237 0.161 16.062
13.875 -0.254 0.196 15.926
14.125 -0.215 0.214 15.060
14.375 -0.212 0.173 14.037
14.625 -0.188 0.182 13.179
14.875 -0.199 0.204 12.559
