0.05000 1648.64389
0.15000 2527.33149
0.25000 3429.36502
0.35000 4488.26482
0.45000 5469.87215
0.55000 6318.70190
0.65000 6812.76772
0.75000 7205.44279
0.85000 7551.45514
0.95000 7662.98939
1.05000 7658.06698
1.15000 7793.75822
1.25000 7727.34772
1.35000 7661.08311
1.45000 7496.27955
1.55000 7248.33502
1.65000 7082.30024
1.75000 6851.79366
1.85000 6620.27574
1.95000 6508.34598
2.05000 6229.68640
2.15000 6090.49760
2.25000 5951.43821
2.35000 5691.28751
2.45000 5460.88615
2.55000 5264.37227
2.65000 5066.31169
2.75000 4884.41011
2.85000 4668.88981
2.95000 4545.38542
3.05000 4411.93591
3.15000 4228.96549
3.25000 4102.83226
3.35000 4005.44581
3.45000 3852.68415
3.55000 3749.77979
3.65000 3631.02159
3.75000 3537.69024
3.85000 3413.43581
3.95000 3300.13895
4.05000 3239.87540
4.15000 3087.44362
4.25000 3073.22443
4.35000 2966.70963
4.45000 2865.62706
4.55000 2839.30381
4.65000 2766.35648
4.75000 2664.10589
4.85000 2584.79071
4.95000 2529.69810
5.05000 2474.16171
5.15000 2375.20133
5.25000 2328.26109
5.35000 2229.37778
5.45000 2145.54137
5.55000 2077.47923
5.65000 2016.19696
5.75000 1945.53220
5.85000 1933.72348
5.95000 1869.61076
6.05000 1791.53615
6.15000 1745.62768
6.25000 1673.52594
6.35000 1605.41524
6.45000 1575.18516
6.55000 1500.06304
6.65000 1473.34081
6.75000 1434.99869
6.85000 1416.10821
6.95000 1373.84569
7.05000 1327.79451
7.15000 1287.12903
7.25000 1251.59054
7.35000 1213.86040
7.45000 1193.85594
7.55000 1181.25717
7.65000 1140.42004
7.75000 1104.33781
7.85000 1083.37824
7.95000 1060.45367
8.05000 1036.01080
8.15000 1020.81758
8.25000 989.28671
8.35000 977.23174
8.45000 959.98959
8.55000 941.37177
8.65000 932.98083
8.75000 907.75532
8.85000 884.72703
8.95000 867.61158
9.05000 857.38149
9.15000 844.44572
9.25000 819.16897
9.35000 806.74215
9.45000 792.47058
9.55000 767.83691
9.65000 755.60157
9.75000 761.15954
9.85000 746.13602
9.95000 723.72466
10.05000 714.49035
10.15000 685.15363
10.25000 680.54291
10.35000 671.02004
10.45000 658.70187
10.55000 638.25154
10.65000 629.50752
10.75000 620.77653
10.85000 598.99725
10.95000 595.74201
11.05000 582.06944
11.15000 569.78388
11.25000 557.96738
11.35000 551.25863
11.45000 540.36093
11.55000 536.83911
11.65000 524.60685
11.75000 505.61818
11.85000 493.76029
11.95000 485.42673
12.05000 477.49774
12.15000 473.04124
12.25000 457.31119
12.35000 457.32416
12.45000 445.41017
12.55000 430.88618
12.65000 429.99054
12.75000 430.15572
12.85000 420.86284
12.95000 407.42184
13.05000 401.90225
13.15000 405.07788
13.25000 394.86840
13.35000 376.34964
13.45000 378.92664
13.55000 370.74884
13.65000 359.58495
13.75000 355.38289
13.85000 349.87133
13.95000 349.88205
14.05000 346.31883
14.15000 334.99323
14.25000 319.74578
14.35000 315.69228
14.45000 317.34156
14.55000 312.88746
14.65000 302.07321
14.75000 307.29099
14.85000 290.93003
14.95000 290.23588
15.05000 280.27207
15.15000 280.75767
15.25000 279.51552
15.35000 271.03659
15.45000 262.85965
15.55000 266.49361
15.65000 256.06214
15.75000 257.35421
15.85000 255.36707
15.95000 248.85435
16.05000 242.37754
16.15000 245.43763
16.25000 234.80985
16.35000 236.59434
16.45000 224.85434
16.55000 230.10273
16.65000 229.83451
16.75000 229.29200
16.85000 221.97787
16.95000 216.31393
17.05000 210.09678
17.15000 208.86136
17.25000 206.51845
17.35000 197.19185
17.45000 187.14511
17.55000 198.69196
17.65000 189.60859
17.75000 188.83168
17.85000 180.45559
17.95000 182.10899
18.05000 177.40539
18.15000 165.78902
18.25000 167.49951
18.35000 164.59399
18.45000 170.02085
18.55000 160.25922
18.65000 166.59764
18.75000 154.84020
18.85000 146.93495
18.95000 150.10645
19.05000 148.86497
19.15000 139.12433
19.25000 137.56808
19.35000 138.27603
19.45000 134.64487
19.55000 129.00077
19.65000 132.33325
19.75000 137.88930
19.85000 125.84905
19.95000 128.41012
