0.05000 18238.58909
0.15000 26260.56221
0.25000 26687.96035
0.35000 26165.02555
0.45000 23632.10490
0.55000 21683.57541
0.65000 19610.56712
0.75000 18693.88408
0.85000 16953.09761
0.95000 15381.42848
1.05000 14254.73329
1.15000 13036.25228
1.25000 12424.67946
1.35000 11438.18879
1.45000 10982.08303
1.55000 10199.65194
1.65000 9552.64517
1.75000 8942.07975
1.85000 8733.89929
1.95000 8084.79889
2.05000 7867.47876
2.15000 7441.29499
2.25000 6915.16340
2.35000 6619.22932
2.45000 6396.26277
2.55000 6183.27959
2.65000 5951.96666
2.75000 5567.06961
2.85000 5380.04346
2.95000 5242.01456
3.05000 5197.76443
3.15000 5025.04001
3.25000 4804.26616
3.35000 4664.49677
3.45000 4472.23196
3.55000 4390.95981
3.65000 4305.99334
3.75000 4069.78989
3.85000 4004.32395
3.95000 3812.64271
4.05000 3713.93596
4.15000 3635.39315
4.25000 3538.68021
4.35000 3364.37333
4.45000 3372.09076
4.55000 3339.72272
4.65000 3179.77119
4.75000 3036.54739
4.85000 3104.38190
4.95000 3004.83641
5.05000 2851.79323
5.15000 2820.53865
5.25000 2752.13856
5.35000 2589.57285
5.45000 2495.83807
5.55000 2351.92327
5.65000 2439.91959
5.75000 2292.05206
5.85000 2261.14172
5.95000 2121.64848
6.05000 2151.60120
6.15000 2049.04087
6.25000 1903.08218
6.35000 1851.82688
6.45000 1899.18130
6.55000 1685.93267
6.65000 1771.09538
6.75000 1678.55168
6.85000 1653.63317
6.95000 1574.68823
7.05000 1527.89325
7.15000 1480.59056
7.25000 1392.18777
7.35000 1404.79666
7.45000 1370.43105
7.55000 1304.58637
7.65000 1291.21696
7.75000 1230.64636
7.85000 1229.90192
7.95000 1164.16461
8.05000 1149.39163
8.15000 1101.30766
8.25000 1063.44106
8.35000 990.42424
8.45000 980.53987
8.55000 962.67059
8.65000 939.80131
8.75000 889.30213
8.85000 869.85149
8.95000 839.15103
9.05000 824.21315
9.15000 800.35734
9.25000 781.87779
9.35000 732.38926
9.45000 731.71550
9.55000 732.52775
9.65000 716.21055
9.75000 690.76273
9.85000 682.47191
9.95000 644.88657
10.05000 643.09968
10.15000 657.92420
10.25000 605.08852
10.35000 618.36972
10.45000 589.19352
10.55000 584.91297
10.65000 567.48264
10.75000 502.71906
10.85000 548.34055
10.95000 551.26330
11.05000 519.23976
11.15000 531.63744
11.25000 508.70571
11.35000 511.54811
11.45000 476.98204
11.55000 471.52568
11.65000 486.02543
11.75000 464.99552
11.85000 446.64821
11.95000 444.90289
12.05000 429.54077
12.15000 434.56679
12.25000 419.94226
12.35000 423.16524
12.45000 409.42922
12.55000 424.04069
12.65000 392.34696
12.75000 395.86878
12.85000 383.51365
12.95000 390.73225
13.05000 361.22500
13.15000 357.04226
13.25000 368.70955
13.35000 355.90940
13.45000 369.05237
13.55000 340.96241
13.65000 356.54705
13.75000 336.00654
13.85000 337.33843
13.95000 338.55008
14.05000 335.47457
14.15000 314.07888
14.25000 314.93651
14.35000 300.83248
14.45000 309.40978
14.55000 299.91565
14.65000 299.65540
14.75000 295.30376
14.85000 292.49869
14.95000 302.05169
15.05000 265.68589
15.15000 279.01458
15.25000 270.75276
15.35000 282.37454
15.45000 255.93588
15.55000 246.22107
15.65000 242.53364
15.75000 255.28309
15.85000 253.04276
15.95000 241.99250
16.05000 241.85556
16.15000 244.39061
16.25000 234.66787
16.35000 246.45980
16.45000 224.23972
16.55000 232.34841
16.65000 218.69695
16.75000 230.32604
16.85000 205.56263
16.95000 221.50512
17.05000 214.14534
17.15000 184.51279
17.25000 203.75743
17.35000 194.29293
17.45000 197.99010
17.55000 204.15176
17.65000 195.43993
17.75000 205.08871
17.85000 186.93559
17.95000 179.47312
18.05000 170.37470
18.15000 179.56983
18.25000 175.66385
18.35000 168.14352
18.45000 177.10593
18.55000 175.30785
18.65000 160.70861
18.75000 173.11040
18.85000 172.67709
18.95000 157.44758
19.05000 153.57375
19.15000 155.46723
19.25000 172.03840
19.35000 157.76644
19.45000 155.64089
19.55000 163.35285
19.65000 145.02665
19.75000 157.99178
19.85000 143.22694
19.95000 132.37993
