0.05000 -839.58155 -342.25714 744.17838 1108.13673 1535.09388 1123.60782
0.15000 -1519.21659 89.31850 122.17593 1305.97871 1170.77455 2459.48518
0.25000 -2303.01007 20.82874 400.84042 931.98347 857.98717 3193.71769
0.35000 -2907.80700 103.50952 252.34853 1109.65379 783.81886 3919.97390
0.45000 -3411.69466 40.24393 236.19464 1116.22759 786.35925 4749.88103
0.55000 -3890.97030 82.62373 183.73367 1182.48641 853.63448 5313.29930
0.65000 -4285.61880 12.57866 114.63509 1238.02142 865.21993 5653.71188
0.75000 -4557.42627 69.49091 -200.57072 1320.34714 892.03460 5960.25439
0.85000 -4870.02780 30.41825 32.94366 1402.86103 898.67680 6182.47955
0.95000 -5213.01880 42.89056 -23.01848 1378.30271 887.22008 6281.26810
1.05000 -5489.23117 26.72576 -8.69012 1413.43473 879.18957 6343.31981
1.15000 -5789.49178 43.55485 -259.57675 1456.78992 903.11206 6283.65775
1.25000 -5943.31226 65.44874 54.51511 1477.95546 912.08264 6286.45172
1.35000 -6118.78000 38.67194 77.82688 1428.56481 950.57913 6198.38744
1.45000 -6281.38756 38.72532 33.49072 1424.61413 977.47679 6118.29182
1.55000 -6407.01359 61.06898 -82.98352 1468.00284 990.39970 6078.64407
1.65000 -6600.29608 31.09104 20.76886 1406.30286 1029.77597 5923.30450
1.75000 -6685.47192 44.71306 25.11202 1423.89375 1049.47750 5844.49263
1.85000 -6829.01379 19.48079 -77.05151 1352.57462 1073.40951 5573.96457
1.95000 -6862.00085 26.57124 38.64745 1324.67333 1094.53575 5506.58573
2.05000 -6887.04888 22.29462 7.73624 1253.57388 1111.23549 5359.23841
2.15000 -6923.89771 41.17605 -31.80104 1211.91513 1131.53116 5298.42549
2.25000 -6972.10990 32.55910 -18.62533 1165.09610 1147.70781 5056.27411
2.35000 -7009.08834 15.99274 -39.34358 1110.50077 1140.50969 4971.86661
2.45000 -7021.85028 18.75878 -84.49647 1075.39651 1148.02553 4843.28801
2.55000 -6987.73013 36.66578 -22.89739 1024.15498 1139.18838 4797.30568
2.65000 -7007.76716 39.53096 -32.40465 955.21361 1131.54809 4661.05771
2.75000 -7027.24137 17.47835 -44.98567 913.69179 1136.14559 4550.03099
2.85000 -7025.70201 17.82263 22.00852 835.61403 1126.56980 4438.15607
2.95000 -7029.59923 45.76917 22.53067 812.60352 1099.04941 4322.64332
3.05000 -7008.61472 28.76931 16.02653 780.41086 1101.16401 4262.05701
3.15000 -7001.86284 30.96265 -125.52794 708.23423 1082.09277 4113.25505
3.25000 -6992.70416 7.88376 -33.40292 679.43672 1054.59452 4019.74791
3.35000 -6988.65362 15.57071 48.97899 638.32202 1028.86132 3937.01267
3.45000 -6987.90038 35.65889 -79.79031 597.12963 1014.98218 3832.43518
3.55000 -6970.15350 25.90316 -93.65580 602.24813 986.38992 3732.42258
3.65000 -6953.31526 35.29911 -41.32742 594.49482 954.95214 3679.57567
3.75000 -6953.70974 9.72470 -99.49783 555.84034 926.09248 3557.73726
3.85000 -6959.04049 19.57886 -68.92263 540.41169 907.82473 3443.49842
3.95000 -6935.38917 20.62282 13.60893 549.48828 874.61433 3396.26283
4.05000 -6931.04574 5.37131 -31.41766 554.30265 850.22492 3280.29343
4.15000 -6909.85539 21.06716 -17.26713 563.43135 811.83106 3218.18553
4.25000 -6890.39277 54.89752 -5.98526 523.26530 796.49317 3116.20595
4.35000 -6858.93349 33.09159 -3.08073 508.22497 772.45050 3041.47842
4.45000 -6849.19507 27.52098 -46.35151 498.96463 741.01215 2959.41685
4.55000 -6805.01704 31.49981 -40.49532 536.25117 720.64877 2938.69472
4.65000 -6785.59354 36.54256 -6.03777 514.57122 693.35221 2814.53212
4.75000 -6744.93661 48.51307 25.06979 504.49134 665.64405 2775.80766
4.85000 -6707.22005 35.07500 7.99664 503.34838 648.23178 2718.04745
4.95000 -6663.53985 38.72821 61.04150 495.86172 621.51727 2620.31932
5.05000 -6610.93111 38.43526 23.65262 506.43283 595.04965 2565.84690
5.15000 -6587.68502 28.69132 22.66009 483.97363 578.13269 2517.75090
5.25000 -6542.04774 26.07514 64.79304 471.44592 559.06613 2443.32063
5.35000 -6507.88044 33.47578 28.12324 469.33747 535.02213 2386.27811
5.45000 -6455.14011 25.98436 -9.29425 477.39167 513.06036 2351.92435
5.55000 -6412.84697 45.27231 27.39398 467.83966 498.62542 2264.00263
5.65000 -6361.94982 38.16026 23.64843 478.60863 480.91819 2220.76789
5.75000 -6308.37551 31.50071 23.00394 466.16758 463.42134 2186.08888
5.85000 -6276.22290 29.57215 -7.03778 465.92458 444.79811 2107.81256
5.95000 -6240.47464 38.97333 69.90831 469.10204 428.18638 2057.83495
6.05000 -6182.37363 40.49574 -4.65561 462.12995 410.17269 1991.63597
6.15000 -6138.96679 41.21398 20.49970 458.23641 393.67323 1950.54659
6.25000 -6067.68533 41.53318 -20.92179 432.67189 377.72254 1939.36116
6.35000 -6016.91578 43.66512 15.36695 440.61497 361.18215 1881.28805
6.45000 -5977.31138 47.16915 21.90415 423.71436 347.48260 1833.41856
6.55000 -5926.81824 34.20663 -4.50146 409.97741 335.20112 1796.11905
6.65000 -5880.26300 36.89649 41.21729 413.80979 325.10851 1755.96077
6.75000 -5821.79738 45.56494 43.39350 423.64191 310.91405 1727.52456
6.85000 -5790.60082 33.57737 10.99632 403.65152 300.52470 1668.50116
6.95000 -5739.67606 41.77440 30.41860 382.67307 288.81928 1644.98929
7.05000 -5698.29709 39.71554 3.62740 369.73058 281.00347 1576.23014
7.15000 -5648.00915 45.50438 -35.46344 369.66558 267.24292 1549.45339
7.25000 -5588.62214 49.41780 -18.48167 375.81549 256.04623 1532.68248
7.35000 -5550.83592 45.72980 37.28996 356.20616 254.69733 1486.13220
7.45000 -5508.56310 40.84642 25.98605 338.66426 243.43235 1432.27715
7.55000 -5471.05009 39.19770 33.54689 323.59673 236.75092 1419.33255
7.65000 -5434.88843 38.49922 16.08431 320.40075 229.43055 1368.09363
7.75000 -5384.77844 37.61162 25.47836 320.21484 219.06316 1354.48658
7.85000 -5340.52367 38.48439 -7.19485 310.97478 212.13607 1327.34759
7.95000 -5299.47162 38.03097 39.82593 304.02356 206.61266 1297.48773
8.05000 -5245.49159 39.28016 14.83258 295.12216 202.77892 1266.97528
8.15000 -5206.08914 36.23187 -29.52899 274.38312 194.48921 1238.48267
8.25000 -5165.80869 37.09711 -4.96913 260.44131 193.34256 1198.91221
8.35000 -5122.80834 31.42070 -2.96489 252.78307 182.71029 1203.14522
8.45000 -5082.94498 32.02303 7.85490 240.61307 181.72449 1162.50597
8.55000 -5037.85389 33.48762 28.07857 238.61373 176.94805 1136.01368
8.65000 -5002.85471 32.24577 6.03060 221.11455 171.85232 1104.76490
8.75000 -4964.80931 35.09548 18.84188 221.35472 170.59422 1086.41717
8.85000 -4920.20330 32.63721 -10.16169 215.07989 166.16815 1075.55889
8.95000 -4883.65369 26.76291 9.81793 207.94236 161.33389 1043.12603
9.05000 -4847.49800 31.07422 -16.89564 200.55479 158.95234 1016.06263
9.15000 -4806.89456 25.72839 48.13636 207.65112 155.57926 1008.09320
9.25000 -4772.79086 26.84039 -3.10346 193.55127 149.67339 954.39247
9.35000 -4736.85611 28.07829 -7.55352 191.63103 146.89192 957.71658
9.45000 -4700.13161 25.75620 34.93645 179.96768 146.50559 923.17193
9.55000 -4659.88392 20.63273 19.63252 178.50937 141.72047 923.35107
9.65000 -4624.76603 23.34393 20.89801 178.23686 135.97895 891.38020
9.75000 -4589.20240 23.98927 4.52930 174.68782 133.78087 885.47478
9.85000 -4549.11018 21.58792 18.72611 170.38716 141.76443 855.47866
9.95000 -4514.76697 23.25513 9.61216 170.75635 126.26835 840.25531
10.05000 -4481.26243 23.40988 2.69409 170.20424 123.77140 813.86558
10.15000 -4437.77620 19.09811 20.18019 165.72391 121.16393 812.93922
10.25000 -4407.04036 21.55304 17.35475 165.33648 127.09564 797.60045
10.35000 -4363.17216 22.00210 14.62105 159.96875 115.68398 785.91468
10.45000 -4329.54002 17.80927 12.03933 162.16904 120.86191 757.52064
10.55000 -4286.26199 22.85253 9.33675 151.65944 115.31654 746.56866
10.65000 -4255.46664 19.13601 13.81773 148.49432 113.86564 728.35276
10.75000 -4227.68500 18.49962 2.00053 147.36465 116.58698 709.54749
10.85000 -4193.92185 17.48672 21.91425 146.38383 114.49922 699.20121
10.95000 -4161.11804 16.99921 -1.47789 143.48108 107.88551 679.57365
11.05000 -4120.72949 20.80407 0.78615 137.61307 104.09977 677.61569
11.15000 -4095.89678 19.35536 1.65522 136.98886 104.54926 654.07684
11.25000 -4058.58984 17.97297 28.30212 141.82658 102.46497 649.76400
11.35000 -4021.14869 18.68797 9.91482 133.47239 99.36802 635.63193
11.45000 -3991.20563 14.89300 6.78106 127.38041 96.27579 613.50553
11.55000 -3956.94193 15.75824 23.50848 128.67278 101.87356 609.26859
11.65000 -3923.54025 11.98622 16.96919 132.72905 97.39956 594.55934
11.75000 -3893.68090 14.01521 16.13906 128.06007 98.96747 585.24500
11.85000 -3861.14799 18.45103 17.04681 124.35426 89.29814 568.31963
11.95000 -3828.67780 13.60515 2.82702 128.14448 98.71477 558.15661
12.05000 -3802.47258 17.82971 -9.48846 122.49084 91.14558 549.16353
12.15000 -3773.20842 14.62307 13.96795 120.82355 90.73303 530.02086
12.25000 -3744.06389 13.01393 4.68944 122.30506 93.13820 529.46774
12.35000 -3717.33659 15.45695 8.25331 115.65939 82.31780 518.87492
12.45000 -3682.17083 15.39307 -0.46563 117.68736 89.95733 507.15638
12.55000 -3657.00654 16.31974 7.56543 116.06433 92.65806 498.53926
12.65000 -3629.07982 16.34745 -5.87418 112.15728 86.33882 496.45918
12.75000 -3605.01163 12.87400 8.98127 109.32336 83.28336 499.45100
12.85000 -3582.38015 16.96225 -10.12923 108.30191 85.30837 471.33569
12.95000 -3551.45418 15.41968 3.91580 108.29636 87.98517 465.90873
13.05000 -3523.33013 15.27588 6.18055 107.58307 81.88363 470.08775
13.15000 -3505.40838 16.95558 -5.22776 107.88838 83.63740 447.03451
13.25000 -3479.18309 17.08936 -4.10713 105.24859 82.60880 443.17470
13.35000 -3459.24943 13.52883 -16.70994 102.98603 78.69724 431.19196
13.45000 -3438.03719 15.67262 -10.80677 93.46096 73.36963 428.68058
13.55000 -3411.70396 13.65973 -2.76338 99.19921 69.75068 425.82797
13.65000 -3390.01936 17.46561 3.46904 91.67127 77.47091 405.42408
13.75000 -3363.86363 14.17039 -3.08383 93.18240 71.56156 404.08948
13.85000 -3339.74605 12.69205 -26.20397 101.01899 69.11306 390.88545
13.95000 -3315.06209 10.41411 -5.84922 93.32382 79.43912 394.60989
14.05000 -3296.52645 11.72941 -10.71907 86.00961 75.45191 378.06551
14.15000 -3275.05222 12.89536 -0.85791 88.61676 71.85799 377.58459
14.25000 -3251.13470 11.96449 -15.09992 89.00337 81.82699 372.66170
14.35000 -3225.66075 9.15473 -9.33332 85.11615 66.02928 355.62877
14.45000 -3200.70176 9.63696 -12.23892 84.01675 67.86325 356.68194
14.55000 -3176.05447 13.95380 -19.13190 81.74415 62.14221 356.07178
14.65000 -3158.74925 11.58492 -4.69008 86.31206 73.48899 343.56825
14.75000 -3131.96586 12.12449 7.60912 85.81824 62.67745 342.84837
14.85000 -3110.19903 9.36555 -3.17639 81.86262 69.48298 327.86380
14.95000 -3089.66736 11.69026 -3.01954 78.62961 66.57938 325.84378
15.05000 -3070.79015 6.51801 -1.30607 76.65324 68.14210 328.28281
15.15000 -3052.35721 9.24421 7.19611 77.20222 63.56536 304.33882
15.25000 -3029.89365 9.37450 16.27412 76.67555 62.17715 307.06376
15.35000 -3012.12346 8.31855 13.04172 74.09893 54.66199 299.73471
15.45000 -2992.78392 6.82250 14.95883 75.93880 55.38963 288.61668
15.55000 -2969.98914 7.58447 1.93158 70.67080 59.60744 284.89885
15.65000 -2946.30802 9.38708 13.92734 70.73494 64.47102 285.06190
15.75000 -2932.54589 8.18942 12.79144 71.19268 72.96073 281.89350
15.85000 -2909.58127 5.85782 5.88279 79.15240 56.44979 275.39337
15.95000 -2891.13088 8.14894 2.00560 67.51626 56.59443 275.51431
16.05000 -2870.04159 10.41865 12.31648 61.42107 54.30182 277.14206
16.15000 -2850.86206 6.04407 18.85370 66.60744 54.17926 267.37404
16.25000 -2836.63377 8.00757 9.34153 74.36195 58.02277 262.34729
16.35000 -2815.04490 9.62775 15.92574 59.01949 52.64943 256.54132
16.45000 -2796.95198 7.57093 10.99478 70.43596 53.53987 250.16187
16.55000 -2777.57725 11.35699 17.07569 62.89001 55.61970 245.68704
16.65000 -2761.88732 4.33727 11.40509 64.52022 55.55385 242.85853
16.75000 -2742.72035 8.64345 10.75042 53.49865 59.14548 240.58995
16.85000 -2726.04960 7.16011 16.69901 64.95645 56.67019 237.47286
16.95000 -2707.51737 8.86189 2.95935 52.13747 47.23045 228.01447
17.05000 -2688.76640 6.23257 -1.48344 64.43774 50.51957 223.99934
17.15000 -2672.62767 7.33724 2.73044 50.03334 47.35371 214.76217
17.25000 -2649.66540 5.79660 4.65002 70.79096 58.43166 221.74237
17.35000 -2636.05962 7.44587 0.87932 56.03787 51.01927 218.65747
17.45000 -2619.59259 3.13736 -1.89601 57.88797 54.77868 218.40461
17.55000 -2600.08445 5.51172 -0.46605 51.69229 56.33226 206.47580
17.65000 -2583.28480 7.57394 -3.79949 50.66788 52.73203 198.62618
17.75000 -2572.40682 3.13914 0.21377 48.40823 48.09093 191.18871
17.85000 -2554.52108 4.41450 5.48160 61.01945 65.81657 202.28341
17.95000 -2540.09634 6.21410 5.49055 59.63245 48.74593 190.13553
18.05000 -2525.15914 8.77233 1.75365 63.90459 49.84547 193.91031
18.15000 -2506.34626 7.35858 3.99555 55.36552 40.88406 187.19353
18.25000 -2491.21854 6.71374 9.60519 54.09635 52.29129 187.12944
18.35000 -2475.63716 6.10637 13.27028 45.46970 46.21285 183.28296
18.45000 -2459.40960 6.72710 10.77065 51.59566 43.06530 176.22779
18.55000 -2447.72100 8.82829 9.88264 53.91404 47.64734 184.85139
18.65000 -2433.76375 6.24993 7.27514 46.12067 43.38224 173.46907
18.75000 -2418.66592 9.19318 15.39269 43.38534 66.17897 172.73402
18.85000 -2402.38032 1.91188 17.62807 49.64705 42.26757 171.76028
18.95000 -2389.48574 4.74132 30.95624 49.09904 52.04187 166.70774
19.05000 -2377.76461 9.52521 16.73579 45.85591 58.28832 171.92959
19.15000 -2365.75113 8.14050 9.17572 45.95937 44.96644 168.10121
19.25000 -2352.13561 7.67255 18.49480 45.01360 54.83422 161.68624
19.35000 -2333.50976 3.92611 27.15598 45.57003 40.41971 161.85644
19.45000 -2318.54249 3.47775 31.03590 52.49624 40.46817 158.76253
19.55000 -2303.93654 3.10990 12.31722 41.76965 37.15303 152.63883
19.65000 -2292.85490 3.26302 22.13184 39.26095 46.30600 152.40603
19.75000 -2281.76863 3.74954 24.03962 43.93844 53.52594 157.52604
19.85000 -2264.89924 4.20110 19.67474 52.68887 63.41067 155.58037
19.95000 -2251.87782 5.68373 25.13562 35.97769 35.49033 144.08986
