0.05000 -1102.59564 390.31842 -99144.62593 1119.18891 1927.48901 624333.49577
0.15000 -3445.77552 86.31586 21728.19983 2007.84645 1833.03535 283152.43891
0.25000 -5425.43023 -125.39442 25221.54391 2023.50514 1954.08741 344033.32589
0.35000 -6340.53455 -14.86201 -11287.75838 1955.81407 1870.18674 346876.16525
0.45000 -7390.82658 -37.30342 -3392.26988 1574.73467 1599.38953 364376.27991
0.55000 -7812.29696 51.80070 -8494.19855 1694.05579 1319.78598 335052.14521
0.65000 -8248.11267 -18.97017 4141.09729 1684.03075 1178.04637 303078.82888
0.75000 -8418.57565 24.40111 6730.59756 1725.67845 1122.02164 315095.17147
0.85000 -8510.46718 19.84180 -3457.93080 1717.19819 1215.80907 330554.61433
0.95000 -8643.51141 -3.74561 6410.66209 1740.64997 1246.69082 324455.05060
1.05000 -8734.29762 30.62335 -7061.96810 1494.23011 942.02993 246802.52442
1.15000 -8650.66506 17.60677 6089.24432 1454.36847 1000.88142 262114.61969
1.25000 -8683.92547 24.48116 -1150.89415 1359.14144 924.89337 236823.49917
1.35000 -8588.61728 19.43035 1107.39464 1342.24543 951.20701 232960.60921
1.45000 -8581.54076 12.60937 450.58583 1296.51948 889.51925 228799.23993
1.55000 -8576.35291 20.56094 -527.76116 1142.14368 802.04355 222742.66314
1.65000 -8505.19593 3.08537 766.25818 1167.89564 822.43790 204306.85708
1.75000 -8414.69584 11.53313 223.18888 1058.06020 791.32131 215468.74655
1.85000 -8390.46002 11.45169 2058.71911 1135.35774 818.63126 206411.24167
1.95000 -8342.57831 12.00239 -2303.87438 940.46799 736.63722 206775.51252
2.05000 -8270.07932 22.18619 2252.93714 909.89209 818.95471 177412.03105
2.15000 -8226.02776 6.61949 1375.99764 871.90917 717.50792 185491.34705
2.25000 -8164.38842 9.69623 -3960.88072 930.96485 736.09744 154956.50413
2.35000 -8130.74403 19.51014 2091.66641 750.70779 692.28347 166963.52792
2.45000 -8097.40803 16.25285 2535.25287 756.04674 702.80615 148414.56086
2.55000 -8041.12970 22.16204 526.58510 699.61530 652.34220 152726.11127
2.65000 -7979.01428 12.77936 -1059.67390 659.95036 683.53183 145310.25858
2.75000 -7941.27988 7.70118 -2271.81133 645.21164 708.36881 134025.69746
2.85000 -7918.24314 20.85272 -2162.19888 644.04856 595.07787 133068.72496
2.95000 -7881.62565 17.88550 -1964.77284 702.71318 634.92836 123200.97241
3.05000 -7850.73608 4.67359 2080.79118 677.45955 608.83385 129928.38410
3.15000 -7805.08008 14.20734 -1542.29507 522.61633 522.74009 114303.15313
3.25000 -7761.21805 14.06153 -807.35384 629.46325 563.28672 119465.07186
3.35000 -7738.29293 9.42512 79.17174 609.53445 534.37068 111511.26698
3.45000 -7700.09139 20.96036 1389.42413 506.88396 559.48374 107110.83074
3.55000 -7653.07152 14.30434 362.91373 460.61350 478.89391 107584.12597
3.65000 -7601.70802 8.71423 -664.71121 498.06151 505.46915 94300.03244
3.75000 -7565.15400 14.24386 -435.67126 527.95485 480.71358 98629.14211
3.85000 -7521.67335 12.26497 -1195.04909 482.60650 413.97991 93851.82023
3.95000 -7483.22323 11.13454 -119.79265 443.51053 471.75496 86031.85665
4.05000 -7463.05776 10.97488 -519.70424 459.36836 499.56201 87179.94366
4.15000 -7430.18234 18.96478 120.40038 430.25484 463.22593 83537.93819
4.25000 -7390.70099 15.34035 404.46396 430.29991 378.33281 72902.24099
4.35000 -7345.09584 15.15875 -1063.16430 396.45387 414.75454 77611.52968
4.45000 -7287.64053 10.42356 41.94540 388.46435 448.93319 71599.74668
4.55000 -7218.07285 14.43166 727.79310 375.53775 425.47273 80061.74885
4.65000 -7170.73717 15.32304 1066.75226 481.68432 374.45315 76663.65208
4.75000 -7132.40388 17.90729 514.30086 318.09937 389.34321 68385.44488
4.85000 -7071.41627 7.67136 21.22932 439.72628 436.00371 63336.25350
4.95000 -7009.62134 5.27434 485.70387 421.78193 380.45282 63549.01719
5.05000 -6961.46602 9.81007 -963.08562 384.53756 385.72572 59289.86578
5.15000 -6908.43549 8.39539 226.39859 374.76820 353.52014 59345.09397
5.25000 -6858.17443 4.21941 -282.43880 387.36707 370.86075 64193.95762
5.35000 -6792.45687 -0.15288 365.76483 360.21676 429.13462 53247.35134
5.45000 -6750.72856 2.75091 -1322.73727 321.94403 286.15983 53028.16521
5.55000 -6703.00799 5.77266 -653.10549 457.98853 446.32656 45904.94190
5.65000 -6651.58210 11.66149 212.65158 426.05433 356.86048 49988.61228
5.75000 -6591.64904 15.94929 1141.33196 385.46481 373.91042 49535.99815
5.85000 -6551.08451 3.49748 633.83242 322.77489 358.62979 45068.75038
5.95000 -6499.18059 11.61324 834.80686 347.34031 275.30895 41693.45209
6.05000 -6458.36052 9.44623 211.02659 283.59391 276.29325 37773.45880
6.15000 -6406.39861 7.38091 -1168.42567 257.85919 261.15428 41661.90262
6.25000 -6355.24661 6.80022 123.91395 341.74531 350.79684 52585.49050
6.35000 -6310.88490 8.27892 425.35326 399.60716 348.11522 49176.64095
6.45000 -6251.29963 9.61044 809.75430 316.30794 261.27606 38356.99372
6.55000 -6200.60920 11.37820 -221.74686 268.17798 358.58099 40108.11093
6.65000 -6144.50195 7.24218 -395.02365 376.10961 343.59509 31103.14022
6.75000 -6091.59095 9.00419 587.84034 258.47378 347.14462 34163.50141
6.85000 -6032.42764 6.99881 440.19492 253.23380 237.80981 38002.31285
6.95000 -5978.80526 8.39304 568.05987 255.08646 215.74097 31607.07653
7.05000 -5919.45173 2.56607 -753.98943 298.80904 249.67686 30530.49470
7.15000 -5860.63570 12.45421 -1012.59093 289.25349 279.80922 75861.04918
7.25000 -5811.63180 8.57702 8.99732 254.83566 208.78723 26944.27695
7.35000 -5767.52631 11.26014 -127.47386 361.30485 372.74680 38076.67220
7.45000 -5702.09896 12.15563 -622.45677 233.78832 205.42392 39094.12508
7.55000 -5647.46564 8.84117 1088.86949 352.91253 358.40685 58238.47897
7.65000 -5593.97225 13.67672 163.22420 336.26493 370.48862 26912.47640
7.75000 -5546.92261 5.87724 365.25368 333.75830 228.04476 25171.88918
7.85000 -5492.99449 11.17419 524.07165 290.81006 268.37964 22570.54974
7.95000 -5432.02644 3.85056 1046.82275 218.60583 217.79439 50516.05987
8.05000 -5387.39123 10.45701 66.26753 241.44753 232.14152 20267.55475
8.15000 -5336.82698 10.71875 553.06077 174.11232 194.88252 22962.90413
8.25000 -5288.74824 5.99339 328.83347 227.35863 168.66117 21549.53650
8.35000 -5235.52420 6.08064 -119.16526 425.35514 315.53852 21139.92571
8.45000 -5191.82703 6.46685 -413.39340 243.75407 188.23017 21421.45499
8.55000 -5151.88355 8.32312 287.99248 228.25728 201.77369 18982.02446
8.65000 -5103.66354 4.24132 94.21351 223.82245 254.97285 16429.68954
8.75000 -5058.70970 5.90455 176.83054 163.23489 164.13461 22032.55327
8.85000 -5016.21957 9.53234 114.64811 198.20774 245.89171 16622.49516
8.95000 -4981.48654 4.49220 -6.16174 266.86300 217.07911 14609.03337
9.05000 -4937.32475 11.64230 424.00180 263.77008 293.83775 21393.63625
9.15000 -4899.63445 6.08359 67.07012 170.98744 161.30423 15282.85466
9.25000 -4858.31012 4.86899 -108.97885 201.22136 228.85521 17404.98969
9.35000 -4820.16425 3.48923 216.01207 211.98600 278.08477 14932.65260
9.45000 -4782.22151 6.08017 151.07141 180.69315 159.90064 16986.97998
9.55000 -4744.22763 2.88592 175.27735 220.31675 181.49108 14307.00604
9.65000 -4708.54723 7.44973 236.08691 211.73538 178.25314 12102.53064
9.75000 -4672.80710 8.87286 76.88962 255.29584 328.29984 13212.70830
9.85000 -4628.17950 1.26054 862.88260 188.38802 185.06506 19434.54750
9.95000 -4593.04047 4.67773 -126.21811 263.83012 208.24870 12025.34916
10.05000 -4554.76579 -1.54992 546.34105 213.59371 413.64285 12068.89528
10.15000 -4517.18440 6.68118 366.91360 127.36549 123.80651 11904.98941
10.25000 -4483.71789 5.07397 68.07538 135.89537 151.46792 10494.09541
10.35000 -4450.89066 8.59365 -7.46303 260.42717 158.47051 10897.36076
10.45000 -4416.33921 3.19609 252.01416 177.06967 238.48689 10041.94512
10.55000 -4377.91637 4.33589 -89.81328 314.23535 189.14711 10245.47701
10.65000 -4336.66452 12.57098 36.32431 172.63029 257.55708 9451.58082
10.75000 -4315.86793 -1.74001 156.11936 357.65262 330.10491 10613.88661
10.85000 -4281.46683 -1.71021 -225.09131 314.72419 228.24904 9773.98299
10.95000 -4240.23439 6.61371 -64.08681 225.05287 208.79759 8503.82855
11.05000 -4203.60144 7.71742 181.20468 128.46873 136.62261 9738.76674
11.15000 -4168.90035 -1.18487 64.96995 278.42933 194.57365 9795.63838
11.25000 -4135.66081 3.22974 -515.28738 184.84212 198.58740 31613.51366
11.35000 -4103.25025 -1.10150 158.13284 174.62082 146.80371 7541.05458
11.45000 -4071.09479 4.56260 306.91766 98.32174 117.68156 10779.89830
11.55000 -4040.58053 3.99173 111.21639 114.45192 177.82538 8160.51473
11.65000 -4012.10668 11.54094 -116.17708 183.01689 229.58048 7983.90321
11.75000 -3978.51518 4.28322 221.43794 150.21730 140.80495 8254.15069
11.85000 -3947.45673 -1.81598 305.01821 171.16948 159.11448 6957.97477
11.95000 -3922.14982 -0.53014 -208.74497 183.85648 121.98428 7254.83115
12.05000 -3887.53685 2.39102 -55.28720 114.02208 99.49358 7280.73659
12.15000 -3858.04949 0.69679 209.84681 262.29829 179.72754 6344.09241
12.25000 -3828.32694 3.44212 82.77646 165.00965 103.09039 7269.03325
12.35000 -3790.98630 7.73349 69.34174 257.28410 198.08530 9921.10014
12.45000 -3765.22202 4.53954 -9.42800 116.87523 141.29221 7260.05874
12.55000 -3739.77979 5.49925 -129.53511 94.50086 124.15623 6086.65366
12.65000 -3698.53847 1.73175 -66.28003 323.38408 115.73011 6431.70596
12.75000 -3679.71723 1.45153 203.62958 96.50086 93.97669 7026.14624
12.85000 -3649.21679 4.66244 -68.20217 129.26090 133.57279 6366.72537
12.95000 -3619.58421 -2.61377 -186.07830 184.94062 143.82898 6406.31424
13.05000 -3591.93347 4.72431 118.10473 101.94317 99.19033 5576.50653
13.15000 -3564.20147 2.35328 -241.50649 76.24743 90.58887 6290.44143
13.25000 -3535.61654 -6.64880 -93.43748 123.46300 433.77886 4380.95728
13.35000 -3501.44951 3.81461 -3.60220 120.79823 81.74305 5616.66573
13.45000 -3479.68046 1.50702 -379.86612 124.21133 107.64782 5013.92775
13.55000 -3454.52650 4.85390 -94.91209 95.40839 76.92511 4726.38165
13.65000 -3426.37226 0.17982 -76.59635 121.33307 102.52362 4653.66846
13.75000 -3403.04759 5.34874 -187.88437 110.55714 145.69153 5243.54443
13.85000 -3375.16910 3.77274 10.08624 108.62440 73.39187 4007.98443
13.95000 -3354.40362 2.65090 35.64708 89.80927 76.03145 3794.07180
14.05000 -3332.58436 4.29008 -26.80140 184.43582 172.46124 4449.63222
14.15000 -3310.08518 3.30401 -52.28163 84.08936 72.38361 3548.81015
14.25000 -3288.03082 -2.76276 -73.70208 146.75303 255.90340 4621.72890
14.35000 -3271.09321 4.56834 -10.53010 93.68147 85.16179 3678.44823
14.45000 -3244.46002 2.27360 -9.49768 144.11959 113.40300 4232.35646
14.55000 -3219.76159 12.29109 -146.62488 138.01196 465.57620 3557.97915
14.65000 -3203.13018 3.55496 37.95877 79.28096 58.81742 3230.63711
14.75000 -3187.56663 -8.39293 80.63792 330.37739 344.25719 3654.77787
14.85000 -3160.01720 0.58760 28.54225 56.18783 58.03607 3421.07143
14.95000 -3134.10834 0.13265 58.33995 68.30394 63.14779 3043.96954
15.05000 -3111.50302 0.27457 -29.73716 104.27285 84.38857 3729.38092
15.15000 -3083.29960 1.33602 3.32414 65.97000 75.85228 2825.97289
15.25000 -3061.30065 -1.22526 76.66451 96.16180 201.08991 3022.31838
15.35000 -3045.36037 3.05555 -37.32920 143.26707 55.84210 3868.18913
15.45000 -3021.56397 -0.45145 -83.99977 62.09556 60.72888 2714.96591
15.55000 -2995.17369 0.24826 -78.29108 59.17066 55.74741 3257.29132
15.65000 -2967.67164 6.35402 -11.17403 111.02833 102.63677 2623.42600
15.75000 -2947.52524 4.54217 -31.93461 51.84022 69.09681 2795.19006
15.85000 -2932.22609 5.91591 -114.89826 129.93277 162.82987 2660.26271
15.95000 -2907.07195 6.60835 28.77662 75.48167 57.76667 3196.25349
16.05000 -2877.14522 1.12054 -129.46336 64.04137 64.86519 2070.92234
16.15000 -2856.14481 1.46420 -49.77155 93.03617 63.59937 3195.31260
16.25000 -2843.10205 3.32510 214.14194 63.97094 67.12512 2291.21594
16.35000 -2823.12042 3.82086 133.29854 130.54124 78.94003 3412.41013
16.45000 -2803.94032 1.28823 75.22243 97.66517 66.60700 2122.25447
16.55000 -2775.26032 1.86671 102.03741 319.87846 83.57337 2737.62040
16.65000 -2768.55800 4.14602 -8.98441 61.62810 71.73892 2030.06146
16.75000 -2749.14833 3.05122 -55.93891 89.78809 59.35140 2494.80353
16.85000 -2732.37824 0.56302 198.20391 49.47299 39.55571 5387.62874
16.95000 -2716.41051 -1.79700 62.45030 73.53689 127.04435 2878.45473
17.05000 -2684.30778 8.83472 9.67282 427.67331 170.69758 2000.71659
17.15000 -2684.37340 -1.18815 41.71030 126.48590 113.70553 1356.89944
17.25000 -2665.89391 1.72769 38.77912 56.01992 56.01906 1661.24391
17.35000 -2648.47839 4.02361 98.54614 63.52854 116.41033 1412.66627
17.45000 -2640.29214 2.03767 -5.53773 77.86155 52.19071 1789.16480
17.55000 -2620.27223 6.20424 31.57882 149.55648 196.20598 1573.20371
17.65000 -2604.69347 0.87108 19.17910 137.42383 88.52230 1273.69547
17.75000 -2592.63267 1.97439 42.77317 40.61524 55.70651 1724.98831
17.85000 -2577.66096 2.60682 4.13020 57.48919 47.35158 2038.18441
17.95000 -2562.19512 1.42068 -26.70739 36.28607 46.58470 1791.38989
18.05000 -2550.77512 -1.72897 -48.77046 65.21502 100.22255 1853.18336
18.15000 -2531.13135 1.20487 9.94994 79.48313 58.07147 1662.95201
18.25000 -2516.77686 -2.61338 21.51282 91.29214 111.47808 1436.52129
18.35000 -2498.39697 1.76171 -115.05634 74.50831 93.34039 2025.16934
18.45000 -2490.67393 2.84635 54.49486 110.19172 78.03944 3229.02925
18.55000 -2473.32870 0.30153 89.25511 79.85389 60.38208 1878.82085
18.65000 -2460.72361 2.08675 -30.90864 42.27926 37.95811 1421.29610
18.75000 -2445.00793 -0.79629 -63.69982 39.83350 37.11019 1721.41476
18.85000 -2431.45744 1.57765 2.46015 33.80371 37.64208 1459.06372
18.95000 -2416.48036 -2.00198 182.93865 60.75854 51.88041 1959.76511
19.05000 -2392.32956 -5.06807 153.72442 227.53900 106.86566 1646.75857
19.15000 -2355.14832 -21.75269 78.34790 440.52669 484.43878 1283.37642
19.25000 -2364.76367 21.18936 131.51881 156.79044 437.36319 1598.00653
19.35000 -2354.62900 -0.40779 -1.84485 30.24784 31.64317 1299.48361
19.45000 -2346.90494 -1.91964 10.45833 58.58531 39.43800 1299.27705
19.55000 -2329.31994 2.22752 38.77436 38.51888 32.85268 1097.21401
19.65000 -2315.77393 -2.04787 -69.33032 37.06838 31.15473 1861.25611
19.75000 -2299.91519 2.09896 -45.93272 32.03398 38.89762 1508.74556
19.85000 -2290.83049 -0.28612 42.19411 85.37407 46.11813 1311.84436
19.95000 -2266.51678 -2.64390 -81.57993 40.70761 43.01009 1804.30959
