0.120000 2.435080
0.380000 2.481970
0.620000 2.401870
0.880000 2.433870
1.120000 2.443590
1.380000 2.427250
1.620000 2.406640
1.880000 2.435670
2.120000 2.484920
2.380000 2.499120
2.620000 2.563120
2.880000 2.565930
3.120000 2.539590
3.380000 2.487970
3.620000 2.455640
3.880000 2.392730
4.120000 2.374500
4.380000 2.255870
4.620000 2.141940
4.880000 2.020820
5.120000 1.898210
5.380000 1.720710
5.620000 1.475330
5.880000 1.208260
6.120000 1.010200
6.380000 0.837450
6.620000 0.839720
6.880000 0.675330
7.120000 0.837360
7.380000 0.863950
7.620000 0.274430
7.880000 -2.212290
8.120000 -2.505360
8.380000 -2.671040
8.620000 -2.612970
8.880000 -2.644540
9.120000 -2.766630
9.380000 -2.719790
9.620000 3.104480
9.880000 2.529430
10.120000 1.849830
10.380000 1.612590
10.620000 1.312920
10.880000 1.157480
11.120000 1.128830
11.380000 1.095630
11.620000 0.972120
11.880000 0.913760
12.120000 0.809960
12.380000 1.116070
12.620000 1.212910
12.880000 1.893350
13.120000 2.023200
13.380000 2.155700
13.620000 1.758590
13.880000 1.745450
14.120000 1.017340
14.380000 0.673990
14.620000 0.893000
14.880000 0.473370
