0.05000 1215.67574
0.15000 1895.81316
0.25000 2942.07937
0.35000 3715.74119
0.45000 4258.02884
0.55000 4960.51028
0.65000 5103.67691
0.75000 5298.69657
0.85000 5437.04421
0.95000 5524.44392
1.05000 5513.03037
1.15000 5472.92370
1.25000 5412.00235
1.35000 5331.10381
1.45000 5157.62073
1.55000 5080.04405
1.65000 4833.44477
1.75000 4749.64072
1.85000 4669.65007
1.95000 4508.87618
2.05000 4365.19008
2.15000 4254.09342
2.25000 4118.93922
2.35000 4031.09779
2.45000 3972.02060
2.55000 3878.30981
2.65000 3761.71534
2.75000 3642.00158
2.85000 3609.28417
2.95000 3491.83334
3.05000 3379.93493
3.15000 3320.93980
3.25000 3229.98670
3.35000 3180.48840
3.45000 3081.77862
3.55000 2996.62632
3.65000 2956.62215
3.75000 2887.92931
3.85000 2786.41568
3.95000 2714.27349
4.05000 2649.42080
4.15000 2589.51692
4.25000 2546.89650
4.35000 2459.94510
4.45000 2412.04377
4.55000 2375.72524
4.65000 2293.02411
4.75000 2241.15017
4.85000 2172.27564
4.95000 2112.61249
5.05000 2092.50572
5.15000 2030.16340
5.25000 1977.24581
5.35000 1926.45641
5.45000 1869.32513
5.55000 1839.82816
5.65000 1823.04619
5.75000 1724.67164
5.85000 1684.77870
5.95000 1652.53651
6.05000 1611.96402
6.15000 1575.83445
6.25000 1542.22667
6.35000 1488.75529
6.45000 1445.12986
6.55000 1424.19081
6.65000 1368.84178
6.75000 1341.38334
6.85000 1324.67489
6.95000 1279.43079
7.05000 1260.54406
7.15000 1228.74188
7.25000 1212.14262
7.35000 1174.09613
7.45000 1138.18254
7.55000 1098.92366
7.65000 1095.10886
7.75000 1053.32040
7.85000 1032.10015
7.95000 1008.09400
8.05000 997.39627
8.15000 961.63265
8.25000 951.28269
8.35000 938.05330
8.45000 907.35130
8.55000 881.59315
8.65000 858.33479
8.75000 841.23358
8.85000 827.50875
8.95000 794.32417
9.05000 793.11212
9.15000 779.41582
9.25000 749.96536
9.35000 745.19286
9.45000 736.91103
9.55000 708.90653
9.65000 693.69749
9.75000 677.24338
9.85000 666.37892
9.95000 659.15886
10.05000 644.36283
10.15000 622.28918
10.25000 612.79539
10.35000 603.90657
10.45000 585.20519
10.55000 574.20870
10.65000 560.97434
10.75000 557.48724
10.85000 531.65042
10.95000 517.91745
11.05000 514.40415
11.15000 507.10551
11.25000 484.61518
11.35000 480.37519
11.45000 469.35768
11.55000 464.38648
11.65000 462.02780
11.75000 445.41838
11.85000 438.79428
11.95000 433.23081
12.05000 415.97351
12.15000 406.16344
12.25000 399.92806
12.35000 403.37556
12.45000 385.12822
12.55000 376.57963
12.65000 366.95594
12.75000 362.98500
12.85000 369.07887
12.95000 346.39754
13.05000 347.65956
13.15000 342.77204
13.25000 327.53889
13.35000 325.81981
13.45000 320.38360
13.55000 314.66250
13.65000 311.67266
13.75000 303.36296
13.85000 296.85454
13.95000 292.95310
14.05000 286.78902
14.15000 281.27467
14.25000 288.53583
14.35000 270.45126
14.45000 275.74943
14.55000 263.85585
14.65000 254.15329
14.75000 249.86197
14.85000 248.47419
14.95000 237.71562
15.05000 234.55652
15.15000 230.35847
15.25000 232.50542
15.35000 228.70888
15.45000 223.54839
15.55000 214.71544
15.65000 217.88146
15.75000 213.60002
15.85000 207.36064
15.95000 199.53360
16.05000 200.03622
16.15000 198.59923
16.25000 196.78461
16.35000 188.95502
16.45000 187.56101
16.55000 187.16496
16.65000 175.22833
16.75000 174.55782
16.85000 165.84194
16.95000 172.48340
17.05000 160.02744
17.15000 161.33922
17.25000 160.07187
17.35000 156.41333
17.45000 158.12946
17.55000 148.38351
17.65000 153.82204
17.75000 141.45329
17.85000 143.35518
17.95000 142.39077
18.05000 142.58831
18.15000 142.83823
18.25000 131.90716
18.35000 132.64577
18.45000 134.29441
18.55000 128.73316
18.65000 125.52366
18.75000 125.76966
18.85000 127.19543
18.95000 121.66782
19.05000 116.24681
19.15000 118.35081
19.25000 115.11818
19.35000 113.16830
19.45000 109.46125
19.55000 105.50184
19.65000 109.70349
19.75000 106.52438
19.85000 104.30590
19.95000 104.78200
