0.2 0.90528 21.10506 -0.69068 78.37957 77.57995 68.4909
0.6 -1.44992 41.68592 -1.05818 76.75263 75.70081 66.57302
1.0 0.45 62.75099 -0.34573 74.50299 71.23234 63.82139
1.4 0.78222 81.17197 0.05608 71.86109 67.9351 60.94509
1.8 1.26222 96.67916 0.99309 68.25577 63.82426 57.9386
2.2 0.62642 109.44168 1.07719 65.36045 60.73757 55.37713
2.6 0.69232 120.83909 0.51011 61.97162 56.96587 52.53466
3.0 0.29858 131.10683 -0.21846 58.73647 53.17729 50.32614
3.4 0.24569 140.32974 0.20603 54.84371 50.31858 47.78208
3.8 -0.07309 150.86988 0.32195 51.49136 47.33444 45.22312
4.2 -0.67131 158.97917 0.36291 49.02502 44.06454 42.58141
4.6 -0.4223 166.06872 -0.03579 46.19522 40.86871 40.67297
5.0 -0.67556 170.98615 -0.78144 44.19425 38.39925 38.68614
5.4 -0.82889 175.97506 -0.78737 42.27508 36.34638 36.49341
5.8 -1.47628 180.7852 -0.40201 40.85356 34.23733 34.96109
6.2 -1.52066 184.84992 -0.34527 38.8157 32.22946 33.43373
6.6 -1.15559 188.331 0.21924 37.40813 30.80499 31.92436
7.0 -0.72709 191.60486 0.69669 36.01408 29.44361 30.30762
7.4 -0.41683 193.88015 0.41663 34.89418 28.27019 28.92739
7.8 -0.0137 196.51263 0.71457 33.74703 27.07527 27.8017
8.2 0.20797 197.7234 0.71848 32.19459 25.72441 26.70986
8.6 0.0812 199.38349 0.5587 31.34547 24.88219 25.56095
9.0 0.12873 200.892 0.53026 29.95752 23.98403 24.45425
9.4 0.09343 202.44217 0.47886 28.9875 23.11713 23.53843
9.8 0.48277 203.83177 0.34247 28.12004 22.49129 22.7026
10.2 0.63655 205.40637 0.32608 27.07413 21.4083 21.58563
10.6 0.24038 205.73893 0.03356 26.24066 20.71708 21.16809
11.0 0.60017 207.15003 -0.24915 25.40567 19.75566 20.03915
11.4 0.54587 207.72704 -0.52898 24.6853 18.96615 19.4239
11.8 0.57259 207.71365 -0.85077 23.86362 18.07944 18.7949
12.2 0.27293 208.08956 -0.80949 23.53642 17.37714 17.87502
12.6 0.05017 208.90416 -0.73595 22.65614 17.01444 17.49284
13.0 -0.13912 209.11603 -0.7269 21.5302 16.08038 16.36215
13.4 0.11553 209.06187 -0.32824 20.99331 15.4673 16.132
13.8 0.0277 209.36468 -0.25081 19.92924 15.06449 15.20635
14.2 0.43054 209.65442 -0.24516 19.47808 14.51794 14.68563
14.6 0.57799 209.8568 -0.52633 18.72794 13.98992 14.25744
15.0 0.78444 209.98018 -0.65156 18.17719 13.63113 13.52497
15.4 -0.01536 210.149 -1.03404 17.60997 13.11462 13.53212
15.8 0.04969 209.94958 -1.00233 17.32734 12.47866 12.79418
16.2 0.3101 209.79732 -0.68934 16.38374 12.19186 12.52762
16.6 0.03261 209.84688 -0.81575 15.65399 12.02063 11.81938
17.0 0.23342 210.08635 -1.06029 15.33048 11.72561 11.47578
17.4 -0.32692 210.18051 -1.34886 14.59935 11.37684 11.22857
17.8 0.24905 210.56079 -1.44467 14.41604 11.14494 11.09883
18.2 0.3005 210.21907 -1.03614 14.09 10.4571 10.76387
18.6 0.16496 210.54199 -1.36624 13.84997 10.00091 10.39226
19.0 0.40598 210.57515 -1.46982 13.143 9.41647 10.16593
19.4 0.50963 209.83404 -1.13189 13.204 9.01646 9.87189
19.8 -0.14391 209.15329 -1.09001 12.8259 8.81175 9.68262
