0.12500 0.00922
0.37500 0.00577
0.62500 0.00911
0.87500 0.02253
1.12500 0.02316
1.37500 0.03893
1.62500 0.06321
1.87500 0.07773
2.12500 0.08907
2.37500 0.09376
2.62500 0.08840
2.87500 0.08135
3.12500 0.07792
3.37500 0.04668
3.62500 0.03950
3.87500 0.02245
4.12500 0.02539
4.37500 0.02224
4.62500 0.03114
4.87500 0.03774
5.12500 0.02478
5.37500 0.04464
5.62500 0.02856
5.87500 0.02132
6.12500 0.03010
6.37500 0.03979
6.62500 0.03167
6.87500 0.03025
7.12500 0.03020
7.37500 0.03682
7.62500 0.03271
7.87500 0.02717
8.12500 0.03495
8.37500 0.04654
8.62500 0.01488
8.87500 0.02321
9.12500 0.01758
9.37500 0.01714
9.62500 0.03763
9.87500 0.02425
10.12500 0.02571
10.37500 0.02274
10.62500 0.02683
10.87500 0.02398
11.12500 0.01468
11.37500 0.00966
11.62500 0.02317
11.87500 0.02567
12.12500 0.04034
12.37500 0.03859
12.62500 0.05447
12.87500 0.04000
13.12500 0.03948
13.37500 0.03447
13.62500 0.04186
13.87500 0.04080
14.12500 0.02567
14.37500 0.05955
14.62500 0.03062
14.87500 0.02925
