0.120000 -2.800550
0.380000 2.870540
0.620000 -0.624240
0.880000 -2.781580
1.120000 -2.249910
1.380000 -2.384600
1.620000 -2.615570
1.880000 -2.529220
2.120000 -2.470560
2.380000 2.800280
2.620000 2.857060
2.880000 -3.071690
3.120000 2.798260
3.380000 2.552570
3.620000 2.514440
3.880000 2.642560
4.120000 2.602850
4.380000 2.358970
4.620000 2.002680
4.880000 1.594110
5.120000 1.320280
5.380000 0.777300
5.620000 0.589670
5.880000 0.498320
6.120000 0.150400
6.380000 -0.345910
6.620000 -0.509510
6.880000 -0.987890
7.120000 -1.042210
7.380000 -1.033380
7.620000 -1.071460
7.880000 -1.265920
8.120000 -1.623620
8.380000 -1.511470
8.620000 -0.587070
8.880000 -1.132140
9.120000 -1.107340
9.380000 0.065760
9.620000 -0.609720
9.880000 2.889960
10.120000 0.478720
10.380000 0.133240
10.620000 0.505030
10.880000 0.765770
11.120000 0.465650
11.380000 0.497730
11.620000 0.016910
11.880000 0.149080
12.120000 -0.423100
12.380000 -1.264080
12.620000 -1.580300
12.880000 -1.901110
13.120000 -0.650590
13.380000 -2.183520
13.620000 -1.838070
13.880000 -2.558850
14.120000 -2.228900
14.380000 2.758810
14.620000 2.601060
14.880000 2.249640
