0.05000 -2450.62639 180.21688 237702.37347 2699.99574 3457.26384 1268661.50763
0.15000 -3319.64261 179.75214 42468.74364 2529.82545 3072.93293 970919.22448
0.25000 -5702.71147 290.47967 -38454.46070 2404.06310 2919.29506 1137985.77256
0.35000 -7474.32135 137.53546 2025.68607 2287.06588 2984.32563 988413.61759
0.45000 -9069.69342 129.86233 -22005.31043 2272.89715 2871.95731 965259.33187
0.55000 -10343.85626 236.34292 4257.86192 2168.07680 2807.34585 991486.02502
0.65000 -11211.05846 195.65121 3781.92628 2207.03621 2849.43594 928587.47697
0.75000 -11867.26787 169.18854 -3972.19686 2153.57238 2943.31705 877198.12161
0.85000 -12332.29014 121.17237 -2427.51128 2126.39151 3007.07559 799028.70492
0.95000 -12635.23178 107.87852 3883.21848 2099.95788 3009.31525 778241.42487
1.05000 -12891.58245 149.63516 8145.37757 1972.06462 3042.20606 754758.93764
1.15000 -12984.53857 187.55070 -790.09812 1849.79573 3043.80769 739167.19601
1.25000 -12943.32931 90.81866 -10237.44100 1728.10779 3008.33293 687828.94235
1.35000 -12903.64201 190.71586 4516.77754 1567.29638 2967.46212 681335.10966
1.45000 -12782.49929 52.58839 -350.87371 1452.20140 2932.96040 620965.95150
1.55000 -12664.32090 110.34900 -317.34135 1350.50506 2882.77809 616780.97609
1.65000 -12505.76971 96.51924 3093.39941 1235.02079 2852.53391 578362.93924
1.75000 -12321.89175 113.09421 8541.50368 1126.33718 2792.00601 546129.80937
1.85000 -12118.51298 148.99848 -1621.24536 1046.91687 2741.80036 510989.24916
1.95000 -11901.54087 81.69168 8840.65687 964.23057 2681.41994 484213.80726
2.05000 -11714.85928 112.40350 1074.91682 884.56826 2641.04046 473422.25229
2.15000 -11521.06161 51.58886 6033.67272 822.53313 2591.21009 454432.32310
2.25000 -11288.69744 57.29326 -3984.68510 761.44965 2506.25231 435183.94095
2.35000 -11072.28932 121.10560 1412.41524 723.21471 2462.17724 425181.75491
2.45000 -10883.11403 95.37509 3406.49710 672.04579 2396.00247 419061.22206
2.55000 -10654.57071 91.28320 6831.54945 636.03414 2345.89543 369651.85897
2.65000 -10429.43800 34.97348 5550.06697 626.59517 2289.59554 341429.91968
2.75000 -10217.56755 93.13473 -5002.62475 591.12924 2219.50315 323755.36752
2.85000 -10013.41604 43.14656 8769.27107 560.98339 2183.46929 336648.22399
2.95000 -9818.08255 28.90205 -5080.30611 540.15398 2121.46407 337560.28265
3.05000 -9619.66615 51.44183 1316.20293 515.87375 2077.57191 302732.29503
3.15000 -9414.72878 47.56853 3368.84751 485.38513 2035.28313 301625.51728
3.25000 -9227.70153 82.91647 756.52483 462.21251 2013.00239 282137.58719
3.35000 -9054.21580 31.14065 -3952.99137 430.02143 1964.84866 272520.17120
3.45000 -8876.75194 120.11981 3250.23111 406.54985 1925.71179 264742.26146
3.55000 -8732.72447 104.34993 -3478.05365 378.52303 1878.79815 257627.18626
3.65000 -8593.78880 76.57671 -459.19880 359.89627 1869.67696 259539.03391
3.75000 -8446.97835 66.30510 -2621.89366 342.96159 1829.02513 233055.75508
3.85000 -8311.52318 88.09828 1805.11415 322.95652 1788.47137 235816.50155
3.95000 -8179.96547 100.89713 -1589.82613 302.07035 1757.74527 233706.16908
4.05000 -8065.75321 86.60976 -4210.08541 281.42500 1731.30441 200893.38278
4.15000 -7958.45729 29.50856 -115.80092 268.98630 1684.63859 195300.19029
4.25000 -7848.88392 72.90385 481.99313 260.85412 1649.48126 211868.43472
4.35000 -7755.26183 73.88375 2661.79922 260.32276 1639.27658 198675.33336
4.45000 -7674.16657 43.39473 5015.02362 273.87614 1581.75108 197394.99874
4.55000 -7587.27034 -10.56634 1170.04701 278.27455 1557.67236 180570.20673
4.65000 -7500.08800 34.16479 -2195.13790 283.89819 1540.73043 182508.40968
4.75000 -7428.15210 21.14999 -1651.17318 285.90111 1508.70962 191343.86363
4.85000 -7346.78302 5.67546 -962.60522 292.45347 1470.00037 169109.97453
4.95000 -7277.56673 -21.70905 5353.47375 293.63675 1427.98740 168817.14736
5.05000 -7198.95753 -24.82295 2918.79149 302.99035 1411.58037 156262.08998
5.15000 -7141.09450 -70.20811 -1410.57801 321.84743 1346.29127 167796.34850
5.25000 -7072.82070 -54.56396 3059.07374 334.74012 1336.01218 159244.87777
5.35000 -7015.70272 -53.63529 3447.40408 357.93436 1284.11162 150253.41210
5.45000 -6946.73618 -60.05017 1812.12145 377.45746 1276.33015 145036.16075
5.55000 -6890.80499 -62.80637 2455.80157 388.79631 1232.90822 133791.18185
5.65000 -6820.40313 -53.38196 2670.83909 407.07475 1205.94103 131077.89709
5.75000 -6747.20461 0.14397 -1292.02246 432.90670 1183.00472 135048.17549
5.85000 -6695.23540 -22.12524 4998.65594 449.97964 1144.56971 127152.89529
5.95000 -6629.94898 -11.27999 1092.14896 468.99309 1100.27656 118395.92080
6.05000 -6568.46958 -14.11700 2133.01193 475.70015 1087.09205 120057.89392
6.15000 -6489.77616 11.78226 -1656.32433 502.94101 1030.63425 120619.38957
6.25000 -6433.03604 11.75433 122.29317 503.76144 1017.44862 110390.71077
6.35000 -6355.50405 20.39056 976.31214 518.48550 993.46748 110277.28141
6.45000 -6295.58204 41.31577 1950.26305 534.06790 947.42463 100858.89386
6.55000 -6217.95223 52.61841 -106.45690 560.17976 915.08956 94844.39069
6.65000 -6163.74838 48.32136 -1462.30262 575.02810 887.89458 94047.71484
6.75000 -6089.32761 68.57569 572.68303 592.80817 850.23524 83623.22000
6.85000 -6011.36358 88.64162 -1836.26173 602.69972 824.57914 83381.99844
6.95000 -5971.15649 92.54817 -411.57776 602.96184 793.87914 86627.74253
7.05000 -5892.08790 109.51486 -902.68720 612.50175 770.26631 87579.29361
7.15000 -5833.65128 122.20614 579.20465 624.17046 731.67130 77499.94265
7.25000 -5780.63246 101.56871 295.54713 638.28791 705.54883 81981.73205
7.35000 -5707.49467 112.89865 1235.38852 647.82986 678.82562 66064.16549
7.45000 -5639.94023 123.98097 852.79924 654.04528 652.23620 68771.80878
7.55000 -5566.66805 139.01313 892.42941 657.03013 627.10025 108481.02280
7.65000 -5506.15563 134.25624 -762.48714 666.64167 590.94143 61185.23726
7.75000 -5454.63712 133.17396 1577.77758 657.88092 579.87371 66420.78410
7.85000 -5384.88156 126.16327 2815.37531 653.46607 546.92395 60358.17618
7.95000 -5355.37015 124.26096 2036.52170 658.00832 524.64350 54408.10845
8.05000 -5280.28064 124.83411 1231.92156 648.80916 505.87270 50199.55319
8.15000 -5231.57768 140.34662 598.44382 641.33093 474.10618 46501.47728
8.25000 -5186.46061 124.17709 295.89409 629.89423 454.45757 46146.12004
8.35000 -5142.76400 128.52749 46.10605 622.70900 435.79582 48495.79004
8.45000 -5091.17718 137.06216 -347.63354 606.11996 415.90161 45151.38753
8.55000 -5051.70260 123.17938 599.96596 599.79140 402.74926 37903.60021
8.65000 -5007.20717 127.79510 689.75754 588.21060 377.08156 39139.68468
8.75000 -4968.33506 118.54531 584.01735 581.34187 365.88005 39650.31915
8.85000 -4916.09930 124.24059 399.83484 561.12241 346.50845 37294.66401
8.95000 -4886.29741 112.54126 540.69877 552.54658 333.94310 33556.97859
9.05000 -4823.70423 99.06434 772.34877 530.02303 317.01835 29576.10486
9.15000 -4776.13412 96.53987 151.66735 509.91866 304.71337 27095.46550
9.25000 -4737.77012 99.39746 654.95066 502.07983 288.95658 28689.02160
9.35000 -4693.55580 87.04802 586.93941 484.11233 274.89192 27162.16557
9.45000 -4644.36949 79.29133 548.83113 463.10621 264.74599 29175.84896
9.55000 -4607.10636 77.39853 1654.74878 444.86276 252.38243 27838.94032
9.65000 -4544.11804 70.77983 40.88139 430.91215 243.27466 25543.24819
9.75000 -4520.00563 65.16212 766.04575 413.55051 232.51834 23442.07840
9.85000 -4471.99617 65.27143 451.63804 396.91210 224.79990 26125.40769
9.95000 -4429.02154 65.64145 980.14682 379.10499 218.28334 48511.13726
10.05000 -4386.50488 56.40603 463.19073 365.23386 206.85067 22880.93120
10.15000 -4348.17141 62.89095 700.90963 348.28954 199.22480 24126.04146
10.25000 -4309.95056 61.30671 -135.24052 330.57775 192.80449 51195.92569
10.35000 -4270.01928 52.39301 1.20766 305.88227 184.15965 25217.78330
10.45000 -4236.93764 51.10313 -174.67375 293.10702 179.17106 21078.90605
10.55000 -4193.93245 54.79450 301.82984 272.32968 173.83917 18769.09310
10.65000 -4156.41673 47.77209 249.66448 256.07776 166.29299 21349.49364
10.75000 -4138.15856 46.14076 413.44301 243.05436 159.32626 15185.80501
10.85000 -4104.68579 47.09855 370.36138 232.60736 154.16201 18836.75939
10.95000 -4074.00561 43.52935 -188.65492 221.01539 149.32953 19120.17083
11.05000 -4044.69570 49.06349 -249.01384 209.97656 145.07903 17447.87558
11.15000 -4009.54084 46.24541 202.57602 198.83079 136.82268 15419.02638
11.25000 -3983.69071 45.56805 411.18926 185.95783 134.29123 17867.82829
11.35000 -3946.30671 47.97549 272.50520 173.64123 133.56530 14203.41008
11.45000 -3931.70301 41.96789 21.12124 163.22901 125.49369 14886.11707
11.55000 -3903.09095 39.93300 241.22417 153.58848 120.13522 15298.60448
11.65000 -3876.07300 40.84116 321.39051 148.17347 118.49047 15755.20713
11.75000 -3845.87710 45.91516 14.38511 142.31682 114.79206 14778.10172
11.85000 -3817.75146 41.67417 92.16862 133.47381 114.97236 13045.97164
11.95000 -3795.14159 39.88314 -341.16413 126.80275 111.70246 13290.02818
12.05000 -3763.81620 42.93500 212.07545 121.53118 105.84776 12655.69119
12.15000 -3738.99114 42.34220 -63.83888 113.09979 104.35921 12513.72740
12.25000 -3709.41016 39.06264 -213.85614 107.96069 99.49456 12467.93929
12.35000 -3690.22489 39.10965 -114.00441 101.47983 98.75774 12468.61914
12.45000 -3662.90948 37.86103 524.95822 100.45288 94.96990 15975.67171
12.55000 -3648.13116 38.91059 -296.22630 95.80457 92.80185 11278.42483
12.65000 -3625.52190 35.31020 -302.60855 90.09430 89.92635 11939.78925
12.75000 -3603.67016 34.28154 255.08249 89.27444 87.29808 11818.46064
12.85000 -3579.54235 34.86622 101.14273 88.23666 84.22548 10617.04066
12.95000 -3554.21411 32.07421 143.33711 85.45447 82.29037 11471.17095
13.05000 -3530.85997 31.50728 -24.57580 84.93630 81.64997 11888.01055
13.15000 -3506.87237 35.01078 60.30744 82.92135 78.55405 10042.26940
13.25000 -3486.78260 34.07715 86.33628 80.78412 78.13823 9473.09487
13.35000 -3464.15986 35.24400 -15.73144 83.54782 75.20076 10281.98795
13.45000 -3444.70137 33.20259 -92.52515 81.22584 75.15710 9935.24075
13.55000 -3425.31111 32.39434 559.41950 82.44634 71.16774 10195.12695
13.65000 -3406.17519 31.59502 -118.39234 80.35475 70.00271 9447.42324
13.75000 -3385.44247 34.41593 -74.10666 80.65500 68.88951 9245.69846
13.85000 -3364.25442 28.84644 58.65855 81.00280 67.22846 10920.91631
13.95000 -3348.41906 26.55729 -190.87124 86.05578 64.76209 8744.37668
14.05000 -3325.86161 26.48466 269.28572 86.65545 64.37505 9158.59623
14.15000 -3304.17398 30.63790 -377.42459 85.66404 62.47538 9469.44856
14.25000 -3280.20962 31.79378 -91.64297 84.09591 63.63919 8117.76169
14.35000 -3263.20755 26.14915 87.89046 84.49134 60.90031 7134.87609
14.45000 -3241.44068 29.38130 -29.31727 84.93067 60.20970 7004.55285
14.55000 -3218.31893 30.22989 -307.15176 82.82792 58.07791 6967.87083
14.65000 -3200.57390 28.38695 1.04676 84.15814 57.32238 7075.63427
14.75000 -3173.78460 29.73379 -225.84960 83.88957 57.01071 6581.92248
14.85000 -3154.78932 27.06306 15.35790 81.92779 53.37808 6830.17448
14.95000 -3136.79068 28.80506 -170.29638 82.45532 55.86247 7636.27082
15.05000 -3121.42742 28.13954 -125.91066 82.33703 54.40039 5767.51841
15.15000 -3097.15549 29.18031 21.24215 82.40424 52.38516 7427.06991
15.25000 -3082.72653 27.41505 -119.84796 80.49951 50.71576 6571.41129
15.35000 -3056.15956 29.13930 -181.95723 80.13328 50.97147 5542.27277
15.45000 -3039.01151 27.37451 -48.71038 81.90010 48.05515 5580.47673
15.55000 -3018.85157 27.38150 163.27656 80.02074 47.29140 5805.19183
15.65000 -2999.30381 27.10450 -74.17521 78.96259 46.61407 6500.04315
15.75000 -2981.47411 26.00281 -140.54994 78.42733 46.18151 5919.23710
15.85000 -2958.43207 29.13946 -166.26136 78.11212 45.88081 5670.04523
15.95000 -2937.05480 30.12575 131.74492 77.18893 45.64899 4990.47734
16.05000 -2926.99309 28.28684 -12.85410 76.04022 45.16768 4989.57236
16.15000 -2906.78352 29.84837 -128.79281 75.82644 42.84339 5763.50971
16.25000 -2886.50036 26.75651 188.43112 74.56439 41.09702 6326.51249
16.35000 -2865.97951 29.94157 335.13820 74.52666 41.89873 6972.29931
16.45000 -2854.03090 26.22348 201.35664 68.87666 40.58897 5486.45733
16.55000 -2833.35903 28.26981 181.65585 68.87501 40.14483 4897.37122
16.65000 -2815.96015 27.93202 -198.76049 68.15977 39.85985 5758.70294
16.75000 -2802.99708 27.87588 -233.94596 65.96260 38.00490 4718.78801
16.85000 -2783.71816 26.19788 -125.88638 68.40242 37.15541 6090.63328
16.95000 -2765.54814 26.31281 -57.74049 65.33954 36.73426 4868.28313
17.05000 -2747.17783 28.14180 256.61489 65.05538 36.00605 6877.63479
17.15000 -2733.66319 25.45491 67.31853 62.34121 34.85130 4971.41039
17.25000 -2717.44640 25.59615 117.18067 59.46361 34.59247 4345.28619
17.35000 -2700.46721 24.77759 117.08329 57.85434 34.26714 5628.93445
17.45000 -2688.21500 24.52680 15.52939 56.72541 35.84751 4483.13392
17.55000 -2669.63884 25.91543 68.61310 56.95212 33.87927 4226.27788
17.65000 -2654.25076 25.71827 -53.11633 54.46488 32.97706 4049.06492
17.75000 -2641.03586 25.32466 97.03440 54.05127 32.40126 4461.19993
17.85000 -2624.22355 23.95377 151.03255 54.02515 31.13347 4670.82114
17.95000 -2609.83922 24.29628 -1.75884 51.92381 31.73542 4340.64288
18.05000 -2596.57958 21.42376 38.42350 50.53048 31.39152 3513.46905
18.15000 -2580.25016 22.81103 22.85285 49.88226 31.20407 3603.66742
18.25000 -2564.89299 21.75708 143.17622 49.03443 29.78039 4429.50470
18.35000 -2546.86855 21.71295 -32.29214 47.27189 28.99028 4398.35231
18.45000 -2534.65246 20.48407 111.41905 47.74710 28.87789 3909.60677
18.55000 -2521.50395 22.60105 -108.91825 45.42581 29.58092 3352.78261
18.65000 -2506.78014 21.26661 79.04102 45.51903 28.02082 3390.35708
18.75000 -2495.63641 21.02676 153.80862 43.79851 28.83003 2991.04394
18.85000 -2476.08114 21.68521 127.10251 44.18867 29.04679 4413.30870
18.95000 -2463.14619 20.57363 384.55300 43.50276 28.90944 3768.07714
19.05000 -2447.72559 21.36156 194.86872 41.32056 26.78177 3797.06923
19.15000 -2434.33798 19.11131 106.54816 40.45184 27.31129 4549.46993
19.25000 -2422.77537 21.18714 204.34344 40.96799 26.64735 3044.32585
19.35000 -2413.87581 18.58922 -43.08504 41.24911 27.68820 3773.60336
19.45000 -2396.65579 19.66094 -3.70161 39.11183 26.13128 3678.64718
19.55000 -2385.25077 20.70331 33.04989 39.45917 26.62004 2823.00549
19.65000 -2370.35230 21.05251 103.87166 38.88498 27.15197 3590.04386
19.75000 -2355.99563 22.70874 121.74941 40.08154 25.85800 3428.65429
19.85000 -2342.21307 23.00798 -24.19206 36.61377 26.46829 3367.55217
19.95000 -2330.48649 23.60970 -348.96198 34.36407 25.29386 6075.19195
