0.05000 -97390.25549 -5731.17466 -13829.98371 87915.08482 103869.92471 122152.73226
0.15000 -106840.95018 586.50511 1351.76820 46041.37957 41047.86589 90681.40003
0.25000 -73144.39312 -14.64300 -909.12700 26356.28824 16209.59218 59028.58109
0.35000 -54425.17334 -73.51152 241.11131 17886.01597 8602.50699 43738.14292
0.45000 -44347.96609 42.10409 178.96500 13594.15676 5953.00353 35366.14685
0.55000 -37706.91354 67.48498 -249.03764 11088.91526 4742.49694 30025.67045
0.65000 -33319.84830 40.34134 -194.10085 9536.02944 3719.51521 26221.76595
0.75000 -29756.13129 77.06365 315.56976 8550.89276 3126.05163 23328.94917
0.85000 -27055.37526 -14.16790 381.87593 7532.73947 2905.73718 20682.22010
0.95000 -24756.40823 89.02797 163.06081 6712.18201 2495.03537 18714.26482
1.05000 -23072.40481 28.85960 110.24544 6051.65770 2876.95714 16868.90528
1.15000 -21439.32582 38.52015 -247.87544 5474.31200 2116.75809 15547.53858
1.25000 -20126.98623 2.84952 -366.09302 5045.96921 2548.35361 14294.99447
1.35000 -18859.08019 43.10261 -115.19682 4742.96433 2103.91873 13429.31740
1.45000 -17879.79552 -23.20020 24.15590 4245.99023 1935.62989 12477.23971
1.55000 -16982.83186 50.59252 59.76716 3916.11211 1925.76208 11634.91677
1.65000 -16198.75741 51.52818 -33.83416 3636.83328 1902.63313 10887.98892
1.75000 -15422.13413 43.37518 -59.49132 3417.34348 1779.57136 10265.45072
1.85000 -14719.01424 13.50394 161.98818 3137.02063 1886.44940 9800.52761
1.95000 -14119.93569 44.80860 -59.07593 3021.49324 2231.63969 9185.17060
2.05000 -13637.58732 8.34584 202.91884 3005.85412 2015.45104 8757.03236
2.15000 -13121.68141 39.70203 15.44375 2576.64694 1731.09351 8303.83947
2.25000 -12590.25394 15.46033 38.82844 2454.47939 1696.77943 8160.85970
2.35000 -12291.47289 9.77636 56.55930 2271.00946 1644.57781 7529.98663
2.45000 -11832.37671 38.54619 -51.18843 2152.40052 1600.23019 7288.61662
2.55000 -11470.67124 8.29494 -137.02081 1956.17171 1472.87722 6951.59873
2.65000 -11149.27929 -9.44982 19.49318 1856.89651 1581.15088 6689.80589
2.75000 -10840.45837 27.68641 42.64229 1990.84365 1631.83816 6629.81823
2.85000 -10552.53361 -34.54033 117.25529 1726.98380 1510.82729 6212.11200
2.95000 -10292.68503 7.03038 4.95245 1533.45737 1414.76940 5988.89225
3.05000 -10106.77991 16.50897 -81.75098 1417.99176 1374.45372 5657.40288
3.15000 -9889.01857 21.10896 274.07602 1249.66140 1313.90701 5482.27257
3.25000 -9662.67611 -5.63746 49.96378 1334.67520 1323.78912 5390.36942
3.35000 -9443.21787 9.46434 64.95484 1170.89594 1279.28362 5115.95903
3.45000 -9290.78019 -36.77108 47.08553 1077.22488 1303.17178 4948.29292
3.55000 -9122.22418 -4.26849 121.90459 954.04265 1230.81808 4726.67882
3.65000 -8956.52011 7.17360 9.56738 946.27429 1222.03305 4518.30114
3.75000 -8809.88179 4.29524 -68.87328 844.65034 1158.67501 4319.09005
3.85000 -8655.47993 -7.11284 26.65565 737.83994 1155.34024 4071.47075
3.95000 -8487.12417 -8.25958 70.05206 726.94310 1120.62826 3909.71043
4.05000 -8358.50897 -43.91581 -4.76605 743.09736 1264.62058 3788.68636
4.15000 -8216.39036 -1.59979 41.92058 596.29652 1066.54518 3602.64454
4.25000 -8093.31178 -24.58681 21.98548 630.30021 1103.85248 3406.54643
4.35000 -7958.77714 8.84252 1.38053 581.89277 1116.39040 3274.56446
4.45000 -7853.73642 -20.62544 17.38415 606.91575 1074.17519 3148.25025
4.55000 -7783.43989 -10.86393 -12.23779 597.69423 1097.71100 2976.08889
4.65000 -7710.12179 -16.29731 -39.36144 554.77772 994.18294 2895.96426
4.75000 -7661.16939 -12.38772 -9.82052 564.08896 1001.24627 2783.84367
4.85000 -7595.37928 7.33977 -72.38890 609.49120 945.20617 2701.70559
4.95000 -7544.84902 13.05236 -30.81143 730.50223 956.27045 2642.29847
5.05000 -7492.08032 -3.80349 -13.48853 621.97497 897.12583 2604.10450
5.15000 -7443.87493 2.06797 -29.71505 659.47800 865.75384 2516.66221
5.25000 -7390.44165 9.83015 -68.16635 745.49760 828.90214 2477.09145
5.35000 -7336.41256 13.64480 -23.71721 827.43040 847.13945 2399.60954
5.45000 -7320.33784 17.34636 -25.84266 776.12070 756.16252 2336.96050
5.55000 -7259.95364 26.75460 -17.68662 757.23933 668.42307 2236.87055
5.65000 -7176.30722 24.84353 6.04420 729.70533 642.56121 2191.03576
5.75000 -7121.14877 31.58427 -29.64292 700.26503 599.79398 2134.11981
5.85000 -7028.13639 17.40108 -37.17455 709.33011 599.18424 2090.11454
5.95000 -6972.51497 10.85635 -15.75264 700.59503 562.96526 1998.18382
6.05000 -6877.91572 15.88782 -33.81213 709.36816 583.74835 1977.46478
6.15000 -6818.36309 11.95181 -5.63094 652.93434 522.67027 1897.63578
6.25000 -6755.86994 14.83429 -39.76651 596.96553 463.76270 1829.80275
6.35000 -6685.94422 20.76319 -67.57776 645.05279 486.44002 1826.94221
6.45000 -6586.98657 15.54238 27.67851 610.77683 434.19140 1774.08607
6.55000 -6557.16488 12.83130 9.69317 548.69335 404.06243 1705.64639
6.65000 -6468.96608 14.67738 -10.52789 555.26910 478.98854 1719.34773
6.75000 -6405.99170 12.55284 21.90876 605.96831 376.09166 1640.34509
6.85000 -6333.35903 26.78153 -10.72101 530.55137 363.73755 1603.06390
6.95000 -6262.45891 11.00147 -5.25706 467.74848 351.66639 1568.88174
7.05000 -6199.25140 20.89841 11.47595 485.76893 382.18797 1527.64252
7.15000 -6124.73482 5.22493 -44.68850 510.20052 364.63636 1488.33536
7.25000 -6059.69591 7.30248 18.26937 463.66015 357.34780 1463.64480
7.35000 -5995.96737 10.37848 44.31108 427.31526 307.53602 1409.69090
7.45000 -5943.77993 12.95660 -12.90058 405.08818 321.20912 1369.91935
7.55000 -5867.12919 23.34500 -11.18817 374.21751 268.84970 1345.98383
7.65000 -5811.97022 8.77079 2.20203 448.47247 324.86658 1306.49769
7.75000 -5748.02602 9.37502 22.04541 441.12627 303.23003 1302.85196
7.85000 -5689.35515 12.85784 3.97022 348.52785 260.58449 1258.92666
7.95000 -5640.73277 17.27185 -1.05802 469.99861 403.29500 1230.27842
8.05000 -5575.44276 12.57957 37.98277 515.57055 440.60733 1232.15143
8.15000 -5525.25461 11.68093 32.09201 339.90266 211.55090 1169.68973
8.25000 -5464.14358 5.63203 22.53528 318.70069 246.55556 1144.55550
8.35000 -5409.31380 15.71353 11.95234 416.71694 318.98581 1114.01380
8.45000 -5350.52234 3.93968 19.51484 370.07491 287.56563 1121.37563
8.55000 -5301.06082 13.82426 8.78542 318.46919 228.03374 1091.30357
8.65000 -5252.39813 11.05014 5.13146 527.39808 536.37141 1139.65715
8.75000 -5206.88520 5.68988 32.43712 296.96786 283.49830 1031.19512
8.85000 -5157.42625 10.11382 43.52676 330.06216 290.19500 1033.21049
8.95000 -5106.69323 11.33077 10.54911 280.55158 219.48639 987.59794
9.05000 -5056.74489 6.74745 33.62935 279.26000 204.92435 972.37012
9.15000 -5009.13669 10.82043 46.61352 279.36159 223.48618 966.34219
9.25000 -4961.83783 9.54665 37.19588 274.31605 216.05117 975.70805
9.35000 -4901.04395 9.63148 46.15808 372.93728 224.02040 950.14172
9.45000 -4861.42104 12.22109 62.82316 267.31736 292.49524 968.65883
9.55000 -4818.12971 12.96441 57.50706 368.60135 367.03777 911.75640
9.65000 -4778.17390 9.08660 22.12738 586.46044 284.00015 873.53195
9.75000 -4744.14269 12.67608 16.01324 258.21619 178.87114 869.52317
9.85000 -4698.69168 1.75297 48.95215 361.99554 354.43792 870.84335
9.95000 -4658.43276 7.57923 48.97623 217.42727 183.87425 828.54108
10.05000 -4607.97300 10.59822 14.20987 244.25750 179.37397 813.29958
10.15000 -4572.12015 8.78299 32.97173 206.27587 125.02049 813.24622
10.25000 -4531.56724 6.35057 37.65752 295.60728 253.17928 788.83075
10.35000 -4501.66505 7.36939 37.05398 221.56737 154.33943 773.97818
10.45000 -4465.90389 11.14961 33.91993 221.72872 260.68170 757.67104
10.55000 -4427.96128 13.00942 32.53665 200.57374 154.21721 741.10521
10.65000 -4400.05606 11.05662 38.97988 283.89846 253.38142 769.43738
10.75000 -4361.33751 -0.17972 29.40357 178.37201 231.26455 734.07779
10.85000 -4333.60307 9.50610 41.36675 239.64204 198.14501 743.19464
10.95000 -4291.69800 6.20676 31.77380 338.18317 196.96105 699.00363
11.05000 -4263.18765 8.64122 37.84441 159.05708 124.98534 699.58306
11.15000 -4227.91136 7.31157 15.08618 294.08523 279.09167 693.26208
11.25000 -4200.93924 7.56383 14.81221 203.73808 232.84420 688.07143
11.35000 -4179.85615 5.70989 24.03142 236.58241 148.11759 650.50203
11.45000 -4143.96740 7.44802 26.48523 170.75089 133.69653 652.73485
11.55000 -4111.87680 11.64998 16.32243 168.32809 139.06611 653.03857
11.65000 -4081.03219 7.95135 24.82001 204.13335 108.22664 631.15142
11.75000 -4055.85052 9.05732 31.49885 251.81775 182.96691 657.74825
11.85000 -4026.27781 2.29892 5.46431 205.19803 194.23353 611.88611
11.95000 -4006.56842 2.69968 31.22536 146.86732 246.53130 612.47458
12.05000 -3967.45721 1.79381 24.98076 297.45065 551.41870 648.67644
12.15000 -3945.34668 10.83786 32.05990 145.87497 155.72983 577.54085
12.25000 -3921.32588 5.22977 23.64560 136.25827 103.23414 570.13252
12.35000 -3888.68319 8.10153 25.12914 146.37795 158.70810 588.08556
12.45000 -3868.88665 4.79027 19.27676 126.88925 100.49015 547.09372
12.55000 -3844.10846 7.50114 30.54817 169.61893 128.59680 552.74597
12.65000 -3815.98393 7.69288 -5.80764 130.61407 124.57684 537.60338
12.75000 -3789.62316 4.43258 -1.76033 133.43539 183.09422 525.89751
12.85000 -3762.38882 4.58738 -12.90712 125.73143 112.62413 522.54401
12.95000 -3743.04661 10.29713 19.54431 160.60952 167.65026 507.55218
13.05000 -3712.40447 -1.71559 13.39041 130.66420 181.40268 509.94913
13.15000 -3692.93821 5.05184 -3.85783 137.75482 146.25793 496.59602
13.25000 -3661.98090 7.46301 11.56537 178.45711 102.20806 486.41133
13.35000 -3633.68089 7.12383 0.30181 586.14422 141.29910 632.18715
13.45000 -3612.35685 5.76503 15.91435 236.02850 115.18218 477.19606
13.55000 -3591.32091 10.36738 -20.20902 114.69445 102.18809 458.17127
13.65000 -3561.84267 2.74798 11.15827 123.11112 116.63583 442.82842
13.75000 -3538.42625 5.71413 6.18643 364.48325 157.04808 588.03371
13.85000 -3501.54885 5.67232 16.08955 129.30793 114.86576 455.29875
13.95000 -3482.82685 2.00062 -9.50941 104.83060 113.95377 419.70881
14.05000 -3458.63571 4.05292 -1.83732 101.28409 73.45293 408.77826
14.15000 -3433.85679 4.73548 28.02942 124.94902 192.56244 428.11783
14.25000 -3407.50298 1.88930 -11.15292 234.91787 140.12280 421.65957
14.35000 -3389.63638 5.31050 -0.53538 90.98414 76.59883 394.12200
14.45000 -3371.55542 4.71034 -5.97365 143.93885 119.51736 379.18261
14.55000 -3341.74644 3.99160 -4.14988 98.08107 77.52250 394.77970
14.65000 -3323.61337 5.83289 16.22793 85.41319 83.40144 365.37578
14.75000 -3297.56711 -1.24320 -13.86911 124.91080 207.29565 390.95971
14.85000 -3273.03796 1.78219 3.14517 111.23162 142.39696 373.11975
14.95000 -3249.37707 4.74897 1.29828 86.85398 96.18325 364.23109
15.05000 -3230.32940 0.21098 26.12991 89.62836 102.10658 346.39131
15.15000 -3206.94716 3.00812 -7.19671 142.13469 130.41964 351.17088
15.25000 -3188.66513 4.01191 10.56536 84.99686 59.97131 333.99146
15.35000 -3163.86165 4.36194 12.46742 190.22335 199.80560 350.95333
15.45000 -3145.59287 -0.50633 23.97588 84.98858 63.61554 318.19810
15.55000 -3128.30257 -0.49324 14.76861 99.68145 87.68312 327.64945
15.65000 -3105.39934 2.98842 18.20569 79.42454 61.89865 313.30949
15.75000 -3072.87458 3.53205 24.30945 242.46149 82.94508 353.01218
15.85000 -3059.58065 6.13886 10.29607 127.55600 153.69724 313.73829
15.95000 -3038.95370 -0.38798 31.60285 129.16654 169.78364 300.51768
16.05000 -3023.61621 1.14772 23.91303 76.86453 86.74543 295.25059
16.15000 -3004.97214 1.07688 35.55298 72.19987 79.16793 289.17171
16.25000 -2982.18581 -2.36469 18.14986 91.97982 60.60390 286.95112
16.35000 -2966.98340 0.79632 52.46148 108.26568 121.68508 292.49099
16.45000 -2931.11240 5.24946 30.87412 302.99140 90.55331 305.81528
16.55000 -2928.92350 1.71392 21.52672 89.49454 106.97943 285.64662
16.65000 -2903.50737 2.17564 18.72695 291.81889 215.35739 288.27888
16.75000 -2888.94295 -2.17072 42.56130 70.40011 76.67206 283.42474
16.85000 -2872.87582 1.07636 27.25644 69.59281 66.30329 257.85564
16.95000 -2864.05610 -4.85532 52.62102 368.50598 150.89054 315.17397
17.05000 -2836.11552 -0.12760 30.53415 61.26123 74.94008 261.62570
17.15000 -2819.75354 0.99686 43.35835 88.22030 66.40185 246.24317
17.25000 -2800.82835 4.72465 32.00424 68.03941 68.21393 247.78172
17.35000 -2778.70513 3.02298 44.62300 151.94765 96.77544 241.87009
17.45000 -2766.03371 -1.19562 35.99300 59.84729 80.76616 236.96708
17.55000 -2752.58082 -0.24314 25.11669 76.15891 100.00790 234.99563
17.65000 -2730.80607 5.06004 41.71806 64.51136 61.74917 235.94759
17.75000 -2716.63532 4.57356 27.97602 63.62881 58.47326 230.34865
17.85000 -2701.56592 2.26159 44.59767 83.52184 74.97202 229.55156
17.95000 -2679.39457 3.77277 34.41278 93.37302 70.32943 221.40499
18.05000 -2660.97094 8.52681 29.97585 129.93605 116.19741 288.13780
18.15000 -2648.83351 1.69373 45.80904 60.18217 57.44733 210.10264
18.25000 -2632.69795 2.60091 37.37482 66.36156 59.14317 210.72298
18.35000 -2613.27790 -2.34440 32.64407 63.97016 56.22894 202.92413
18.45000 -2598.36024 0.61540 21.59941 59.00529 48.78745 197.13328
18.55000 -2588.33754 0.43088 33.41084 57.67187 43.76761 196.97222
18.65000 -2560.66612 1.51554 23.95590 113.00797 55.56262 240.11802
18.75000 -2558.60935 0.46556 25.31867 81.52383 59.24046 191.99328
18.85000 -2535.67325 0.36983 33.80365 49.41995 89.03135 201.45973
18.95000 -2518.71342 3.31615 30.16355 157.11459 61.98532 207.83050
19.05000 -2506.19673 4.77064 16.29076 89.66827 71.50534 182.40749
19.15000 -2491.46447 7.47158 9.01904 58.73017 118.30892 171.26556
19.25000 -2476.45238 -1.86606 6.71257 50.40448 44.55676 185.23238
19.35000 -2461.47217 4.22265 24.49789 55.37229 50.45905 176.73970
19.45000 -2446.75450 -1.72442 6.18172 141.21615 94.41466 171.25500
19.55000 -2428.97804 -3.16095 8.51642 64.05739 60.45390 187.00208
19.65000 -2418.69549 -1.42706 5.90241 47.74633 48.79994 172.07660
19.75000 -2405.15173 -0.44228 9.67377 81.63797 76.45763 178.11068
19.85000 -2387.08241 -2.72676 6.31746 41.41630 39.18609 158.08088
19.95000 -2371.81410 0.85452 4.21407 63.11491 43.13431 157.57344
