0.26 0.415 48.70993 0.05532
0.51 1.01192 112.58801 0.05046
0.77 1.2487 136.77667 0.0477
1.02 1.28044 132.12459 0.04293
1.28 1.33072 133.52607 0.04012
1.54 1.35391 128.06847 0.03639
1.79 1.28461 118.29589 0.03404
2.05 1.32888 115.55768 0.031
2.31 1.31174 110.47153 0.02888
2.56 1.29242 102.57852 0.02622
2.82 1.3064 99.07069 0.02427
3.08 1.31876 95.1101 0.02235
3.33 1.31657 91.75296 0.02072
3.59 1.33028 87.95467 0.01896
3.84 1.33753 83.75562 0.01738
4.1 1.33637 80.66498 0.01609
4.36 1.37621 78.23084 0.01476
4.61 1.40125 76.6546 0.01368
4.87 1.38105 70.73777 0.01238
5.12 1.46956 72.38634 0.0115
5.38 1.47243 69.44593 0.01053
5.64 1.44881 65.7018 0.00987
5.89 1.51287 64.95537 0.00899
6.15 1.53593 62.53604 0.00824
6.41 1.53049 60.0564 0.00758
6.66 1.62812 60.16535 0.007
6.92 1.55794 54.96004 0.00642
7.17 1.70471 57.38152 0.00584
7.43 1.63804 53.13297 0.00554
7.69 1.79167 53.94433 0.00496
7.94 1.73407 49.86033 0.0046
8.2 1.8737 51.52002 0.00423
8.46 1.87579 48.37773 0.00385
8.71 1.89202 46.90466 0.00357
8.97 1.97048 46.10323 0.00327
9.22 2.11793 46.38793 0.00301
9.48 2.11953 44.38387 0.00279
9.74 2.09106 42.18521 0.00258
9.99 2.1746 41.57776 0.00231
