0.125 0.001 -0.001 0.002
0.375 0.000 -0.006 0.082
0.625 -0.015 0.003 0.350
0.875 -0.038 -0.005 0.836
1.125 -0.047 0.008 1.511
1.375 -0.082 -0.037 2.242
1.625 -0.100 -0.013 3.167
1.875 -0.210 -0.029 4.113
2.125 -0.148 -0.003 5.437
2.375 -0.232 0.049 6.793
2.625 -0.291 0.055 8.265
2.875 -0.400 0.023 10.129
3.125 -0.409 0.087 11.349
3.375 -0.531 0.050 12.821
3.625 -0.571 -0.049 14.500
3.875 -0.548 -0.057 15.836
4.125 -0.780 -0.037 17.348
4.375 -0.711 -0.131 17.861
4.625 -0.656 -0.038 18.931
4.875 -0.718 -0.056 20.008
5.125 -0.724 -0.044 20.801
5.375 -0.738 -0.040 21.409
5.625 -0.806 -0.076 21.869
5.875 -0.791 -0.236 22.349
6.125 -0.745 -0.057 23.520
6.375 -0.852 -0.170 23.392
6.625 -0.903 -0.094 24.191
6.875 -0.804 -0.161 25.305
7.125 -0.861 -0.171 26.099
7.375 -0.855 -0.182 25.343
7.625 -0.784 -0.183 26.456
7.875 -0.776 -0.098 25.217
8.125 -0.768 -0.145 24.795
8.375 -0.789 -0.081 24.153
8.625 -0.673 -0.161 24.567
8.875 -0.751 -0.088 23.947
9.125 -0.789 -0.105 23.763
9.375 -0.676 -0.110 24.318
9.625 -0.836 -0.131 24.820
9.875 -0.704 -0.140 23.578
10.125 -0.785 -0.098 24.824
10.375 -0.747 -0.107 23.917
10.625 -0.883 -0.177 25.150
10.875 -0.736 -0.160 23.626
11.125 -0.734 -0.151 22.574
11.375 -0.623 -0.221 22.390
11.625 -0.635 -0.207 20.987
11.875 -0.566 -0.227 20.142
12.125 -0.523 -0.254 19.575
12.375 -0.461 -0.299 17.856
12.625 -0.444 -0.269 17.557
12.875 -0.375 -0.260 18.406
13.125 -0.312 -0.315 17.557
13.375 -0.326 -0.289 17.158
13.625 -0.255 -0.199 16.503
13.875 -0.241 -0.187 17.105
14.125 -0.239 -0.122 16.816
14.375 -0.187 -0.065 15.606
14.625 -0.201 -0.040 15.422
14.875 -0.198 0.021 14.247
15.125 -0.200 0.066 13.593
15.375 -0.198 0.046 13.398
15.625 -0.268 0.056 11.969
15.875 -0.330 0.038 12.561
16.125 -0.389 0.015 12.240
16.375 -0.419 0.009 11.466
16.625 -0.402 0.044 10.938
16.875 -0.450 -0.024 10.709
17.125 -0.458 -0.028 10.530
17.375 -0.399 -0.053 9.113
17.625 -0.334 -0.084 8.123
17.875 -0.306 -0.113 7.570
18.125 -0.295 -0.150 7.442
18.375 -0.296 -0.146 6.779
18.625 -0.221 -0.140 5.705
18.875 -0.213 -0.168 6.506
19.125 -0.195 -0.169 6.221
19.375 -0.182 -0.187 6.246
19.625 -0.174 -0.209 6.946
19.875 -0.118 -0.174 6.449
