0.2 0.12909 15.1345 0.30981 120.9287 118.52453 92.98634
0.6 0.13843 32.8517 0.07898 121.26973 113.26888 88.45108
1.0 -0.18091 51.76574 -0.27984 122.3932 105.07951 83.19123
1.4 0.13725 64.91681 0.29702 122.9409 98.9523 78.48045
1.8 -0.13635 73.13475 0.57 122.35288 93.42463 73.84933
2.2 1.20608 77.1569 0.75101 119.78555 87.64036 69.15322
2.6 0.23408 81.50219 0.26864 115.98099 82.87923 65.08383
3.0 -0.3414 84.4265 0.52962 111.14446 78.60802 61.27635
3.4 1.29159 86.71167 1.19761 105.80448 76.38826 57.86606
3.8 0.97283 88.82422 -0.16102 100.58341 72.80269 54.58455
4.2 1.34602 93.01538 -0.54445 95.21274 71.85702 50.94682
4.6 1.10523 100.48272 0.2049 90.45246 71.88733 48.37495
5.0 0.11567 111.13642 0.13798 86.46842 70.79728 46.97709
5.4 2.00497 123.80651 -0.18196 83.26122 69.68521 44.90891
5.8 2.02126 136.18078 -0.58526 77.40843 66.29363 43.84947
6.2 0.13237 145.5447 -1.10366 71.45413 63.21968 41.38405
6.6 0.70727 153.2474 -0.37194 64.48004 60.20986 38.72356
7.0 0.37129 159.69546 -1.16631 58.79558 57.03501 36.10367
7.4 0.13621 165.51583 -0.30261 53.07951 54.49276 33.23781
7.8 0.32238 170.04548 0.51097 48.40513 51.23552 30.43833
8.2 0.19701 173.96656 0.31895 44.0349 47.08768 28.31359
8.6 0.38574 178.64982 0.19824 40.07966 40.70876 26.44652
9.0 0.56589 184.1463 0.51792 37.9216 34.2327 24.47434
9.4 0.99188 189.24721 0.36404 35.73321 29.3507 23.31796
9.8 0.36225 191.44885 0.36234 34.26458 27.27631 21.71896
10.2 0.07043 193.93729 -0.52571 32.62474 25.61227 20.5811
10.6 0.23786 195.13217 -0.46945 31.58869 24.83522 20.26247
11.0 0.20635 196.13941 -0.66144 30.14067 24.14669 19.08241
11.4 -0.89895 197.34628 -0.59765 29.06298 23.49261 18.26546
11.8 -0.74463 197.8216 -0.64839 27.65439 22.68636 17.7014
12.2 -0.93153 198.51755 -0.53137 26.36858 22.28717 16.82784
12.6 -0.08811 199.25766 -0.49805 25.55099 20.98398 16.14085
13.0 -0.28985 200.51089 -0.59913 24.01856 19.44899 15.87473
13.4 0.2765 201.04006 -0.30296 23.4228 18.83019 15.33102
13.8 0.38659 201.7366 -0.82068 22.03211 17.90307 14.95707
14.2 0.31095 202.36487 -1.11171 21.06852 16.94124 14.19447
14.6 0.75635 202.98928 -0.98373 20.60294 15.96177 13.52584
15.0 1.21003 202.6783 -1.31273 19.81473 15.38193 13.42031
15.4 0.76424 202.74593 -1.8963 19.42817 14.921 13.20052
15.8 1.34179 202.73194 -1.83509 18.94044 14.56002 12.84626
16.2 0.85348 202.52905 -1.10319 18.20632 13.97115 12.60121
16.6 0.77351 203.44635 -1.48026 17.7597 14.41979 12.09117
17.0 -0.68293 203.88969 -0.66338 16.81093 14.41316 11.44686
17.4 -1.39041 205.3028 -0.38976 16.20198 13.80848 11.24318
17.8 -1.09777 205.82588 -0.76677 16.04409 13.39503 10.9049
18.2 -0.71026 206.14768 0.19309 16.30802 12.72474 11.13607
18.6 -1.37932 206.62772 0.06691 16.227 11.62373 10.47723
19.0 -1.40184 206.05125 0.62139 15.7371 10.20697 10.45151
19.4 -1.14187 205.76771 0.25228 15.49594 9.3758 10.01346
19.8 -0.6363 204.7604 0.07326 14.63675 9.11358 9.56837
