0.2 0.79539 25.22185 1.91503 98.92919 98.48786 71.99709
0.6 -0.10286 50.76141 1.46623 100.90416 92.23613 69.10528
1.0 1.52573 68.5327 1.24073 102.44164 83.77726 65.40247
1.4 0.59818 78.18237 0.81629 101.6534 77.12585 61.99811
1.8 0.88099 82.15467 0.28955 100.43236 71.62702 58.30126
2.2 -0.57547 87.076 0.11525 97.83493 67.45478 55.13244
2.6 -0.33069 91.56373 -0.21759 93.24199 64.20306 52.48942
3.0 -0.68679 101.10562 -0.53344 86.57648 61.4241 50.65371
3.4 0.12466 113.06405 -1.49499 78.47885 58.21452 48.7946
3.8 0.86727 125.50313 -1.27227 71.06101 55.75317 46.57839
4.2 1.21784 140.3541 -1.02544 63.32821 53.22827 44.06463
4.6 2.9629 152.43292 -0.79833 56.12529 49.40997 41.06744
5.0 3.8327 162.67361 -0.86555 49.82374 44.52353 38.05644
5.4 3.92221 169.27326 -0.97625 44.96412 40.26304 35.19769
5.8 3.01542 176.39655 -0.62133 41.24785 36.58615 32.74428
6.2 1.2246 183.56325 -1.01024 37.99089 33.40596 30.63126
6.6 0.36465 188.40173 -0.57424 35.76525 30.51902 28.92793
7.0 0.54741 191.33984 -0.2662 33.75886 27.95228 27.4385
7.4 0.80409 193.297 0.0 32.38207 25.87369 25.99618
7.8 0.49886 194.2621 -0.06029 30.39594 24.74336 24.68425
8.2 0.24329 195.94612 0.30808 29.54188 23.93746 23.47893
8.6 0.14569 197.30155 0.10724 27.80818 23.10694 22.15914
9.0 0.22277 199.85534 0.08665 26.32019 22.27548 21.15288
9.4 0.36441 202.22736 1.06829 25.52695 21.13104 20.16115
9.8 -0.05837 204.06819 0.98178 24.91586 19.86799 19.126
10.2 -0.28578 205.20336 0.98335 24.00695 18.62531 18.74761
10.6 -0.59909 206.12862 1.16791 23.67495 17.58752 18.02486
11.0 -1.3964 206.44931 1.1837 23.13508 16.51686 17.69025
11.4 -1.46772 206.24153 1.14476 22.39681 15.66666 17.10351
11.8 -2.15715 206.00733 0.58559 21.66613 14.6498 16.39281
12.2 -1.96672 205.44213 0.19353 20.93589 14.15797 15.89859
12.6 -1.48616 205.30152 0.21945 20.43989 13.86329 15.25264
13.0 -1.18134 204.98882 -0.06754 19.69009 14.18974 14.42949
13.4 -0.57963 205.02259 0.17316 18.95482 13.74398 13.57857
13.8 -0.15481 204.74265 0.8165 18.03287 14.09293 13.14983
14.2 -0.07257 205.05351 0.90105 17.38466 13.62066 12.52301
14.6 0.50736 206.06763 1.21986 16.21838 13.71063 12.07722
15.0 0.36907 207.44735 1.45039 15.60993 12.92178 11.41954
15.4 0.64489 208.1919 1.78257 14.67983 11.99883 10.87482
15.8 0.5264 208.09395 1.55732 14.70277 11.4721 10.3552
16.2 0.56846 208.28927 1.40256 14.00857 11.18788 10.27787
16.6 0.96494 208.16131 1.058 14.28137 11.13658 9.8348
17.0 -0.01645 208.83368 0.83454 14.11353 10.40494 9.75721
17.4 0.18385 208.79256 0.55721 14.2821 9.84634 9.29312
17.8 0.59653 208.23775 0.51315 14.59756 8.81878 8.80108
18.2 0.51026 207.34247 0.64567 13.46812 8.66407 8.34747
18.6 0.51002 206.88034 -0.16642 12.9991 8.71541 8.18683
19.0 0.00244 206.6083 0.38606 11.69671 8.91753 8.03352
19.4 -0.14614 206.7546 0.53463 11.34762 8.54332 7.75025
19.8 -0.18235 206.45457 0.62029 10.83202 8.31369 7.46159
