0.12500 0.02899
0.37500 0.02635
0.62500 0.00703
0.87500 0.02360
1.12500 0.03817
1.37500 0.07027
1.62500 0.08575
1.87500 0.08927
2.12500 0.10493
2.37500 0.09777
2.62500 0.08987
2.87500 0.06753
3.12500 0.06433
3.37500 0.04267
3.62500 0.02520
3.87500 0.01100
4.12500 0.02118
4.37500 0.01867
4.62500 0.01423
4.87500 0.01710
5.12500 0.01484
5.37500 0.02468
5.62500 0.02001
5.87500 0.01583
6.12500 0.02716
6.37500 0.02181
6.62500 0.03514
6.87500 0.02486
7.12500 0.02497
7.37500 0.02364
7.62500 0.02214
7.87500 0.02410
8.12500 0.01775
8.37500 0.02723
8.62500 0.00958
8.87500 0.00989
9.12500 0.00457
9.37500 0.00358
9.62500 0.01113
9.87500 0.00807
10.12500 0.01090
10.37500 0.00811
10.62500 0.00746
10.87500 0.01640
11.12500 0.04389
11.37500 0.01689
11.62500 0.01809
11.87500 0.02508
12.12500 0.00246
12.37500 0.01754
12.62500 0.01721
12.87500 0.01119
13.12500 0.00643
13.37500 0.00846
13.62500 0.02263
13.87500 0.02408
14.12500 0.01357
14.37500 0.02491
14.62500 0.01655
14.87500 0.02693
