0.05000 0.00000 0.00000 0.00000 0.00000 0.00000 0.00000
0.15000 192.23957 80.41631 -527666.97110 1548.48415 1253.51153 1290691.84221
0.25000 -324.28041 -447.40639 256377.28617 2771.54830 970.89956 1490254.97628
0.35000 -789.29786 -279.84230 166039.14126 2176.63835 1002.07452 819446.80696
0.45000 -552.58405 304.88583 216430.08030 2516.93287 1115.77967 1264121.12024
0.55000 -910.81036 -18.12434 63358.78883 2335.24953 1145.08610 699283.76406
0.65000 -878.21212 21.66171 -16794.97515 2426.53196 1239.99954 1858409.69907
0.75000 -1249.27795 82.41733 -29349.81710 2376.12983 1189.43194 523475.27588
0.85000 -998.36475 -108.75442 18666.20215 2252.66231 1275.64149 1128353.37293
0.95000 -1350.98399 3.30164 13637.01085 2203.95794 1312.68117 2253774.29190
1.05000 -1319.57979 -110.26219 -75469.44295 2092.05222 1376.76203 1287616.15130
1.15000 -1698.00630 -109.36108 -79787.31323 1845.77599 1405.66455 1274616.42480
1.25000 -1882.50794 18.36331 24417.58802 1658.85989 1486.98869 1087826.19918
1.35000 -2259.46097 -67.01823 -96393.96133 1374.12419 1422.99506 1631836.81207
1.45000 -2446.05728 34.16337 50645.62363 1105.57772 1402.86257 2115987.19493
1.55000 -2881.09665 -75.65706 5114.45815 857.43254 1277.14689 1603564.40669
1.65000 -3042.72003 -11.80585 -44190.64201 707.48869 1304.94521 2080795.73572
1.75000 -3259.37352 58.98612 31515.27642 556.20731 1179.28578 1599723.65568
1.85000 -3450.34165 -66.10623 32657.96814 448.67522 1131.54049 2195843.49354
1.95000 -3585.13979 -43.20184 11307.03132 392.49310 1046.12044 1818291.24340
2.05000 -3655.14051 35.00120 -82237.24582 357.44528 944.22268 2021607.27312
2.15000 -3718.91908 38.71752 16287.76323 314.18375 885.22445 1512567.70091
2.25000 -3766.51104 -14.10120 5011.07519 296.21285 894.42150 1883944.97204
2.35000 -3833.72780 46.30080 -13299.59933 275.37060 849.10121 2573314.27959
2.45000 -3878.02179 5.94039 16385.33270 261.55663 797.46214 1875620.30019
2.55000 -3906.71776 35.14449 -80204.81668 247.48937 746.24711 1800846.12536
2.65000 -3962.33308 1.62602 41963.64956 263.67875 750.73777 2103359.21212
2.75000 -3980.78380 30.84352 24617.42927 247.07225 658.30584 2450304.21557
2.85000 -3967.53329 -29.15714 63020.05314 241.43698 636.16121 2289973.42059
2.95000 -3993.69287 3.02588 7373.85218 233.17464 612.84882 2036491.55635
3.05000 -4001.82909 -10.67796 52293.68116 224.73934 590.38882 1806518.98883
3.15000 -4001.15829 5.57196 116641.09665 229.42063 554.05718 2439449.46742
3.25000 -4003.12020 -1.28648 -18967.88866 223.21761 536.52202 1881154.83576
3.35000 -3994.64233 5.53348 -12585.54142 225.45886 515.37046 2527731.33687
3.45000 -3994.22466 -7.39054 106629.09250 223.22621 505.10560 2042629.10361
3.55000 -3989.31703 15.42110 -77953.56829 207.82910 469.79643 1866179.31211
3.65000 -3991.92601 -13.58931 131383.93126 210.97168 468.40958 2317650.57583
3.75000 -3979.73132 -13.02681 10982.41878 224.81972 457.24603 2248618.90978
3.85000 -3978.61299 -1.27192 39114.43178 221.62741 446.49352 2200450.10338
3.95000 -3970.78411 2.01951 -12905.21461 224.80386 431.68397 2280232.67616
4.05000 -3950.79485 -14.51420 -52883.46346 227.65137 405.68135 2025221.18794
4.15000 -3934.60570 -2.97430 3461.99313 235.60552 386.28562 2202309.88587
4.25000 -3912.59032 8.54518 31180.69759 223.81624 374.91643 2052955.78573
4.35000 -3907.72545 -0.71205 -6349.98592 218.67355 368.18998 2238231.91310
4.45000 -3889.95698 5.22109 2496.40135 224.54759 362.15383 2106398.81933
4.55000 -3877.79385 -6.60275 -16284.61595 236.57262 343.33210 2196439.00145
4.65000 -3844.40266 -7.87399 26884.61775 221.44481 333.99376 2345258.03979
4.75000 -3830.93465 19.00146 -9997.04596 229.89401 328.32189 2032027.44876
4.85000 -3817.44612 -8.21167 987.05012 226.86767 314.47769 2214090.73815
4.95000 -3787.77930 0.96054 -62667.00391 214.90200 307.43649 2350363.49032
5.05000 -3777.03563 -2.06264 -86963.60273 209.54839 298.22580 2445824.35951
5.15000 -3761.60014 0.27687 55417.85361 217.84527 292.89562 2178945.46351
5.25000 -3747.46185 0.90000 3968.14829 216.67329 284.40651 2221526.51346
5.35000 -3733.89622 0.71745 87646.40991 218.73362 278.48955 2229996.73564
5.45000 -3724.21128 3.30054 -48555.78458 211.19691 275.97691 2359602.65600
5.55000 -3694.35451 -3.53334 27831.04288 213.11050 263.30378 2207059.42729
5.65000 -3676.65340 -4.87117 -53851.07759 205.08000 257.58926 2518418.86307
5.75000 -3650.89519 -3.34335 -59841.87512 201.72119 252.63300 2586675.20824
5.85000 -3636.24206 10.94984 -49447.67056 200.18017 241.95330 2337304.43271
5.95000 -3625.26873 -1.20793 58997.91014 193.61893 235.92057 2280035.88107
6.05000 -3599.54189 -4.51736 -21762.54883 190.47964 232.16526 2379533.11786
6.15000 -3590.12224 4.50952 -43142.07024 192.37293 226.56312 2476120.98090
6.25000 -3570.69638 -1.14689 -15874.96871 188.45699 222.12385 2233666.99584
6.35000 -3553.97807 -1.74163 -8160.82492 177.62899 219.13477 2190027.13290
6.45000 -3534.70800 2.39346 32218.54496 180.99069 213.88574 2329562.85731
6.55000 -3518.59973 4.58513 -94945.96299 173.04321 209.27201 2244897.95201
6.65000 -3496.52895 -3.56915 -21039.34870 174.36239 207.02462 2336598.66975
6.75000 -3477.16423 4.83968 -1290.48296 167.93782 198.54478 2616738.58759
6.85000 -3472.04115 -3.32225 -45284.46025 165.15048 193.66318 2553780.81396
6.95000 -3452.52459 -2.04132 -2280.63994 166.89772 192.01740 2334231.01121
7.05000 -3426.66516 -2.74129 48524.52460 157.16835 194.19497 2240609.47316
7.15000 -3416.86906 2.98313 105752.75133 160.92110 185.45886 2218996.67255
7.25000 -3400.13201 -3.10427 88223.67841 156.37058 184.26062 2276772.61310
7.35000 -3384.31203 8.03538 -55527.39702 153.99322 178.26643 2341126.11123
7.45000 -3361.58754 -1.58287 101774.10843 158.26200 175.23815 2178812.25066
7.55000 -3347.51941 -2.24973 33340.44240 154.78794 172.66114 2252859.87483
7.65000 -3334.23388 -3.82967 -126280.41764 158.67414 171.08778 2288152.28874
7.75000 -3319.34353 -3.69396 -103429.70640 154.89980 166.17555 2265702.68086
7.85000 -3293.87628 -5.80645 -41432.50098 151.38636 165.92803 2461990.89974
7.95000 -3280.09829 -1.10316 2970.86851 154.55017 165.11782 2175707.72885
8.05000 -3267.32753 2.91729 16010.71196 151.95390 160.66546 2387592.31981
8.15000 -3244.84415 5.09720 -13480.76619 147.25888 156.89673 2228730.36309
8.25000 -3228.14626 0.15681 -9330.97052 143.29372 154.33204 2352418.95541
8.35000 -3213.47037 -0.85195 -5655.39428 143.88365 152.10489 2174352.95581
8.45000 -3199.24323 -1.31806 43195.45136 140.50819 148.93862 2301669.78987
8.55000 -3180.66641 7.05916 49131.87324 141.79654 149.31257 1975720.27437
8.65000 -3164.48138 -2.34337 11006.64415 141.80208 144.87949 2504323.91600
8.75000 -3146.08719 -0.49792 -8703.58152 140.57446 143.45026 2671399.71111
8.85000 -3137.33973 4.71640 -57517.00690 139.72373 139.25895 2274356.86832
8.95000 -3117.99062 -5.61805 34969.56691 139.54596 138.92944 2103191.75207
9.05000 -3096.99785 0.60815 33523.58043 140.87723 137.28772 2336250.47859
9.15000 -3085.25387 1.10845 54479.36890 136.84115 136.11763 2287395.98995
9.25000 -3067.93799 -1.09699 -44600.62320 138.97043 132.05648 2349829.36353
9.35000 -3050.40778 -0.02740 -28577.14544 140.90213 130.31655 2019804.91311
9.45000 -3037.32249 -3.49251 -37960.01763 134.82532 130.75291 2348229.70134
9.55000 -3024.26877 4.01150 -66078.14939 135.83503 127.49276 2085638.64338
9.65000 -3003.23879 1.25308 -122719.52546 132.90830 124.95503 2372105.84571
9.75000 -2991.84513 0.49131 -57953.69976 134.71302 124.36066 2231444.25932
9.85000 -2977.06153 -1.53045 -55106.13197 133.76163 121.97047 2176625.64538
9.95000 -2961.40143 1.93985 59241.86591 135.05933 118.38801 2158043.87710
10.05000 -2952.31999 -1.12627 -421.60625 132.54172 120.35719 2310986.18836
10.15000 -2934.79538 -0.73631 6046.10819 134.37882 117.46635 2256986.72600
10.25000 -2915.13926 3.31603 28984.95707 131.65693 115.16754 2345336.59435
10.35000 -2901.06078 -0.46429 2104.90549 132.73968 113.58532 2065407.64688
10.45000 -2882.01088 3.34641 -4241.18147 131.77984 112.26691 2352536.24997
10.55000 -2869.14850 2.29885 -12094.70721 132.29184 109.96492 2066811.92537
10.65000 -2854.02426 -2.93419 -11089.42301 130.37827 111.28307 2381059.89716
10.75000 -2839.69238 -1.53654 31053.33412 128.94675 108.69486 1933844.46508
10.85000 -2827.07317 -2.79377 -10077.15172 127.00130 106.50409 2060579.98937
10.95000 -2810.10164 1.22380 2343.95409 127.16329 104.70271 2498428.01672
11.05000 -2794.47920 1.33369 -8170.30035 126.38994 102.87320 2404173.91862
11.15000 -2783.85262 -1.23273 -48361.89618 127.03745 102.44700 2165546.67076
11.25000 -2770.16070 -0.88322 65880.17843 124.61661 101.13417 2108029.11535
11.35000 -2755.89649 0.84113 6463.52074 124.27416 101.81384 2147991.04421
11.45000 -2740.71043 0.44067 16376.17774 123.62605 99.84819 2140077.85740
11.55000 -2726.00053 2.70868 51545.95073 124.22157 96.53002 2211251.66730
11.65000 -2709.33746 -0.68154 -47562.93525 121.20629 96.80128 2190096.85023
11.75000 -2701.42466 -1.43062 -3015.74212 123.69045 97.19327 2123144.24504
11.85000 -2681.45039 1.40101 28455.76476 120.03609 94.55193 2303752.19693
11.95000 -2669.11044 -3.08239 -31039.51340 117.99528 94.02698 2154201.52822
12.05000 -2657.44751 2.14070 76702.10369 117.92381 91.48486 2124841.53020
12.15000 -2643.26501 0.31967 49877.72517 118.64192 89.76288 2155064.91723
12.25000 -2628.76035 2.04029 19117.44597 115.00404 89.15473 2051048.23395
12.35000 -2614.22134 -1.31577 18858.80462 115.13120 88.03975 1933210.82769
12.45000 -2602.16164 0.82126 -20214.60280 116.52262 90.63442 2081404.61441
12.55000 -2591.36600 -0.82394 -63969.44040 111.72055 86.03908 1943465.17712
12.65000 -2579.67864 0.64466 35811.36780 113.57656 87.40015 2047788.62001
12.75000 -2565.55385 1.45565 19755.37803 112.83008 84.71442 2171952.18519
12.85000 -2547.69854 -2.52155 -11294.87310 111.41988 82.07792 1922878.43957
12.95000 -2538.36272 -0.31810 52078.13993 110.33677 83.70704 1938757.20761
13.05000 -2524.97867 0.72371 43785.09743 110.34084 80.62272 2186521.43095
13.15000 -2512.79453 0.43369 8114.54570 109.64760 83.01717 1932736.83653
13.25000 -2498.04564 -0.02918 -46722.43026 109.37577 80.45393 2055582.38458
13.35000 -2490.09483 0.74127 -49509.82299 106.84619 80.73596 2251788.89764
13.45000 -2477.97513 -2.16954 44963.23529 108.10400 77.26281 2016416.86496
13.55000 -2467.57858 2.40796 15394.29731 106.35719 76.36558 1979251.13289
13.65000 -2451.27261 -2.75069 19998.11781 106.23098 75.09505 2050389.30918
13.75000 -2437.34585 1.27827 26042.90813 104.47458 73.86333 2218574.66489
13.85000 -2427.43116 -0.46492 -610.37368 104.74184 75.59803 2037987.86354
13.95000 -2416.51509 -1.80256 5791.33637 102.84839 73.31987 2085569.38260
14.05000 -2404.40696 2.02344 -84900.03479 103.03342 73.62115 2063169.22046
14.15000 -2396.87684 -0.17989 30238.72508 101.24121 75.17003 1978647.18774
14.25000 -2380.00387 1.54855 35595.34472 102.13099 70.41622 2045899.98966
14.35000 -2367.37505 2.07644 -9989.87899 99.45904 72.24079 1863823.91022
14.45000 -2356.68521 -1.06419 47568.72680 99.84692 71.91039 2195220.28331
14.55000 -2348.75615 0.20771 34540.99800 99.17123 69.69337 1865752.41274
14.65000 -2333.23852 -1.57903 -79062.22070 96.33997 66.65856 1892855.76332
14.75000 -2323.86186 1.90433 -674.93915 93.71662 66.68707 2040136.48995
14.85000 -2313.40006 1.57218 42955.45037 95.13058 69.26103 2083552.75639
14.95000 -2302.63605 -1.51590 36619.96046 96.37032 67.82221 2017210.24202
15.05000 -2291.83653 0.19032 -2739.82516 93.38981 66.44130 2136681.84086
15.15000 -2280.51928 -1.21312 44568.28898 92.62272 64.45980 2145972.32743
15.25000 -2268.96121 -1.28125 7526.96048 92.16337 64.63782 1954179.21752
15.35000 -2257.77130 2.85557 29425.47191 93.05816 63.77202 1943262.17383
15.45000 -2247.77077 -1.25782 13338.97609 90.76191 65.65605 1800686.29417
15.55000 -2238.52546 -0.67552 6388.46345 88.56344 61.74516 1956980.55463
15.65000 -2227.78801 -0.09654 2390.32206 88.34645 61.13628 2089396.37891
15.75000 -2219.49333 -1.04955 10205.36494 89.15158 62.22053 2036251.45027
15.85000 -2208.03572 0.45661 -54943.47914 85.85086 60.28881 2026336.42142
15.95000 -2198.50667 -0.11223 1437.72478 85.62009 61.06528 1875401.68218
16.05000 -2186.37177 -0.82272 -26768.75079 88.48403 59.46409 2063328.50001
16.15000 -2176.66129 -0.20739 -22753.64338 87.27368 59.08098 1780223.65131
16.25000 -2168.39532 1.89628 -40097.32213 85.36866 57.37372 2196731.97710
16.35000 -2158.25885 -1.53062 34773.38858 85.45099 58.91007 1904399.66407
16.45000 -2148.56932 0.88073 -1348.50192 85.99715 59.06545 1976087.44000
16.55000 -2141.50297 1.79627 31699.94692 84.69281 57.27416 2005964.23169
16.65000 -2128.06854 -0.03735 2040.91322 82.85658 56.82992 2144811.59812
16.75000 -2119.78098 -1.22367 100812.48216 81.39690 57.19992 1956640.66138
16.85000 -2111.98734 0.49519 -48825.76446 82.06636 56.66127 1826598.10371
16.95000 -2103.00203 0.58341 866.08609 82.93417 54.47642 1856415.49001
17.05000 -2092.62218 0.60487 31830.10541 80.81314 55.89307 1833083.82133
17.15000 -2078.16120 0.89085 -8618.70380 81.47881 53.26752 1906708.75210
17.25000 -2071.04313 0.81129 16022.11340 79.45051 53.57175 1979784.06600
17.35000 -2063.49343 0.73050 -29785.37926 79.20309 54.55118 2029391.00932
17.45000 -2054.72751 0.37322 30103.79385 80.55733 54.26054 1904787.15383
17.55000 -2044.90996 0.26957 32172.97531 77.81105 53.04633 1900966.26662
17.65000 -2038.10624 -1.05000 -45894.72530 79.09666 54.24728 2094766.87036
17.75000 -2029.36757 -0.93627 -29129.23163 77.39362 50.76331 1992037.63722
17.85000 -2018.02797 -0.13858 24386.27139 77.80160 50.11274 1953032.95888
17.95000 -2007.47717 0.19284 -18017.52217 77.57867 52.95713 1815265.52532
18.05000 -2001.44967 0.08609 -31495.40846 77.73963 51.68721 1769588.32585
18.15000 -1990.13540 1.93866 -29615.10455 76.05786 49.59559 1946188.42979
18.25000 -1981.10684 -0.98973 56289.42701 76.50008 50.64932 1875278.59917
18.35000 -1975.14645 1.32139 -28959.66169 74.33117 49.90230 1920577.98361
18.45000 -1965.11921 -0.28359 -42111.96247 73.42601 48.80244 1776336.07565
18.55000 -1956.44369 -1.52286 -32892.21202 73.86961 51.40756 1781016.84213
18.65000 -1947.59655 -0.81649 18956.78688 71.66766 46.98610 1780553.58895
18.75000 -1939.48601 -0.14510 410.30876 74.17618 46.91211 1932683.60058
18.85000 -1931.27239 0.87158 -28017.11741 72.62206 47.87129 1816404.58458
18.95000 -1927.27815 0.12335 -4024.54694 73.00286 45.98393 1857024.12634
19.05000 -1914.28001 0.18105 -17231.65636 72.73862 47.85645 1814527.25673
19.15000 -1907.64999 -0.34032 -31072.47893 73.98677 48.21301 1991875.99010
19.25000 -1898.03858 1.68295 -18490.20770 71.32339 45.48430 1752573.71025
19.35000 -1889.44239 0.37301 -65958.21564 69.51334 45.34982 1921777.25294
19.45000 -1881.16992 1.45486 5681.53977 68.75599 46.09251 1661302.12097
19.55000 -1875.95614 0.15475 -25153.36700 69.53635 47.10771 1896295.68409
19.65000 -1864.83621 -0.63838 9861.96588 69.96870 43.03208 1842709.84902
19.75000 -1857.10351 1.35023 1872.97633 68.99712 44.62801 1671149.89854
19.85000 -1850.29077 0.67322 32543.85612 70.99014 45.01945 1752348.13870
19.95000 -1841.79430 0.11663 -11732.56094 70.02464 44.15253 1668023.25909
