0.05000 29433.96485
0.15000 35263.10473
0.25000 29948.91570
0.35000 25643.60125
0.45000 21103.07073
0.55000 18957.52984
0.65000 16899.51014
0.75000 15263.16387
0.85000 13788.72607
0.95000 12430.12626
1.05000 11326.38812
1.15000 10721.72923
1.25000 9642.37168
1.35000 8923.98411
1.45000 8405.57168
1.55000 7863.90313
1.65000 7438.89644
1.75000 6901.93861
1.85000 6682.54820
1.95000 6161.08366
2.05000 5893.74246
2.15000 5649.75842
2.25000 5278.60657
2.35000 4921.59056
2.45000 4665.47335
2.55000 4349.20351
2.65000 4359.39696
2.75000 4103.34613
2.85000 3868.86677
2.95000 3599.18635
3.05000 3396.91620
3.15000 3254.85711
3.25000 3138.59453
3.35000 2996.42562
3.45000 2894.16027
3.55000 2812.75927
3.65000 2707.87625
3.75000 2666.14784
3.85000 2568.01655
3.95000 2474.04260
4.05000 2429.85852
4.15000 2294.31505
4.25000 2256.17344
4.35000 2131.12474
4.45000 2124.51903
4.55000 2060.04473
4.65000 2022.57289
4.75000 2014.69357
4.85000 1906.17079
4.95000 1858.13244
5.05000 1791.60680
5.15000 1826.54763
5.25000 1640.40993
5.35000 1669.48775
5.45000 1611.79712
5.55000 1555.84592
5.65000 1530.09973
5.75000 1505.31443
5.85000 1457.25225
5.95000 1387.20535
6.05000 1382.80199
6.15000 1351.72300
6.25000 1283.38765
6.35000 1234.28562
6.45000 1194.48632
6.55000 1171.55055
6.65000 1134.26577
6.75000 1131.15856
6.85000 1096.84821
6.95000 1079.41627
7.05000 1022.59969
7.15000 1002.88418
7.25000 961.99375
7.35000 952.28244
7.45000 921.27247
7.55000 889.45912
7.65000 856.71785
7.75000 836.37630
7.85000 857.97805
7.95000 805.97603
8.05000 794.78080
8.15000 776.42936
8.25000 749.66086
8.35000 716.03117
8.45000 717.56832
8.55000 698.48252
8.65000 701.03605
8.75000 663.93899
8.85000 659.47868
8.95000 648.76250
9.05000 634.25708
9.15000 608.01541
9.25000 607.17982
9.35000 627.19661
9.45000 574.16283
9.55000 578.92775
9.65000 545.38690
9.75000 550.26286
9.85000 533.80349
9.95000 528.15357
10.05000 496.91047
10.15000 508.64005
10.25000 485.12520
10.35000 486.44996
10.45000 479.41404
10.55000 491.61061
10.65000 422.28354
10.75000 436.21768
10.85000 439.66770
10.95000 412.46910
11.05000 393.33215
11.15000 402.75146
11.25000 384.99320
11.35000 360.63961
11.45000 378.04272
11.55000 357.40116
11.65000 352.82960
11.75000 345.77103
11.85000 337.19837
11.95000 338.70716
12.05000 325.25229
12.15000 310.64585
12.25000 322.09484
12.35000 313.06365
12.45000 317.43664
12.55000 325.82984
12.65000 277.33641
12.75000 307.04153
12.85000 270.51684
12.95000 285.83215
13.05000 264.05112
13.15000 275.16316
13.25000 275.29988
13.35000 262.60576
13.45000 252.48033
13.55000 247.02268
13.65000 237.20879
13.75000 292.03621
13.85000 230.66436
13.95000 237.25450
14.05000 199.45843
14.15000 210.83994
14.25000 208.78731
14.35000 211.11516
14.45000 199.03309
14.55000 199.47449
14.65000 190.40408
14.75000 192.52144
14.85000 192.20322
14.95000 181.04681
15.05000 193.64697
15.15000 176.55481
15.25000 192.33655
15.35000 165.27018
15.45000 166.15385
15.55000 157.05678
15.65000 169.00187
15.75000 148.66495
15.85000 151.26966
15.95000 149.91701
16.05000 155.35882
16.15000 132.60492
16.25000 150.28795
16.35000 150.63551
16.45000 127.63025
16.55000 131.89400
16.65000 128.28538
16.75000 127.34945
16.85000 138.21482
16.95000 139.88823
17.05000 190.53149
17.15000 126.54870
17.25000 126.45258
17.35000 160.77022
17.45000 138.76963
17.55000 129.49157
17.65000 133.15621
17.75000 125.38614
17.85000 123.01488
17.95000 128.67313
18.05000 113.49013
18.15000 118.22798
18.25000 104.37350
18.35000 100.98410
18.45000 122.25749
18.55000 118.40217
18.65000 120.14428
18.75000 118.18567
18.85000 98.09970
18.95000 120.87585
19.05000 103.85785
19.15000 101.17133
19.25000 87.85932
19.35000 100.15774
19.45000 103.05341
19.55000 101.95907
19.65000 115.37193
19.75000 117.55616
19.85000 85.57259
19.95000 80.40287
