0.12500 0.00384
0.37500 0.04601
0.62500 0.03188
0.87500 0.07728
1.12500 0.09892
1.37500 0.09605
1.62500 0.11625
1.87500 0.15101
2.12500 0.16007
2.37500 0.16341
2.62500 0.15891
2.87500 0.17843
3.12500 0.15150
3.37500 0.16737
3.62500 0.15553
3.87500 0.14224
4.12500 0.13611
4.37500 0.11821
4.62500 0.11737
4.87500 0.10720
5.12500 0.09264
5.37500 0.10170
5.62500 0.07434
5.87500 0.07802
6.12500 0.06163
6.37500 0.04569
6.62500 0.05049
6.87500 0.03306
7.12500 0.03555
7.37500 0.02706
7.62500 0.03867
7.87500 0.01422
8.12500 0.04694
8.37500 0.02531
8.62500 0.05622
8.87500 0.03158
9.12500 0.02762
9.37500 0.02071
9.62500 0.04009
9.87500 0.02201
10.12500 0.01974
10.37500 0.04118
10.62500 0.04425
10.87500 0.03650
11.12500 0.01468
11.37500 0.02659
11.62500 0.03140
11.87500 0.05542
12.12500 0.04344
12.37500 0.03889
12.62500 0.04671
12.87500 0.05336
13.12500 0.04667
13.37500 0.02464
13.62500 0.03565
13.87500 0.05152
14.12500 0.03337
14.37500 0.02190
14.62500 0.02803
14.87500 0.04486
