0.125 0.000 0.000 0.004
0.375 -0.002 0.005 0.094
0.625 -0.003 0.009 0.444
0.875 -0.013 0.006 1.149
1.125 -0.024 0.012 2.128
1.375 -0.076 0.018 3.385
1.625 -0.089 0.017 4.817
1.875 -0.140 0.022 6.291
2.125 -0.149 0.022 7.903
2.375 -0.154 0.081 9.460
2.625 -0.193 0.079 10.935
2.875 -0.202 0.110 12.475
3.125 -0.199 0.108 14.051
3.375 -0.242 0.117 15.574
3.625 -0.206 0.121 17.023
3.875 -0.228 0.111 18.428
4.125 -0.240 0.214 19.907
4.375 -0.291 0.191 21.254
4.625 -0.290 0.183 22.305
4.875 -0.278 0.182 23.089
5.125 -0.252 0.236 23.605
5.375 -0.320 0.227 24.234
5.625 -0.298 0.234 24.110
5.875 -0.358 0.236 24.350
6.125 -0.344 0.227 24.738
6.375 -0.322 0.215 24.912
6.625 -0.315 0.208 24.492
6.875 -0.360 0.181 24.458
7.125 -0.306 0.135 24.776
7.375 -0.358 0.143 24.748
7.625 -0.339 0.133 24.918
7.875 -0.322 0.099 24.522
8.125 -0.256 0.107 23.571
8.375 -0.261 0.105 22.464
8.625 -0.240 0.088 22.437
8.875 -0.198 0.104 22.116
9.125 -0.187 0.120 21.774
9.375 -0.232 0.100 21.744
9.625 -0.168 0.094 21.067
9.875 -0.155 0.110 19.916
10.125 -0.155 0.091 19.204
10.375 -0.138 0.121 17.654
10.625 -0.146 0.043 16.521
10.875 -0.109 0.066 14.951
11.125 -0.066 0.056 14.622
11.375 -0.095 0.032 14.542
11.625 -0.067 0.030 14.858
11.875 -0.049 0.062 15.059
12.125 -0.056 0.046 14.884
12.375 -0.019 0.033 13.566
12.625 -0.041 0.053 12.236
12.875 -0.021 0.039 10.736
13.125 -0.021 0.070 10.245
13.375 -0.045 0.075 9.782
13.625 -0.031 0.075 9.894
13.875 -0.037 0.100 10.784
14.125 -0.053 0.086 10.625
14.375 -0.071 0.080 10.118
14.625 -0.054 0.057 9.125
14.875 -0.058 0.051 8.096
