0.05000 -2462.25629 -119.22190 -3714.39072 3787.33993 3228.08352 2943.48561
0.15000 -3942.68348 226.43092 -2900.22870 3725.91104 3545.72010 5135.18645
0.25000 -5073.24697 -56.91384 -2001.66695 3360.52131 3644.26994 7338.19876
0.35000 -7099.46101 -13.50945 -808.39225 3636.70129 3572.05711 9091.36122
0.45000 -8184.94468 170.48483 -416.11123 3654.64931 3497.83055 10490.17394
0.55000 -9036.66122 8.06862 178.76186 3555.10694 3565.36926 10904.77389
0.65000 -9395.06364 -4.93567 558.69466 3501.38755 3585.86196 11352.25495
0.75000 -9743.31742 98.90166 194.30554 3482.29781 3571.64431 11214.43078
0.85000 -10116.99312 -20.38388 368.83265 3398.67093 3650.89832 11033.02569
0.95000 -10293.59430 78.87711 190.95506 3326.69361 3560.29859 10895.17779
1.05000 -10393.19803 90.87140 104.35354 3235.85690 3512.51231 10579.22517
1.15000 -10421.00904 61.28738 13.56528 2991.19256 3490.80338 10165.13525
1.25000 -10514.98953 145.72348 270.56946 2816.77468 3467.16647 9759.44698
1.35000 -10533.39590 75.38163 169.22237 2616.26263 3412.05362 9311.05634
1.45000 -10552.75741 120.77463 53.68245 2448.07427 3288.65331 8951.25060
1.55000 -10586.14769 125.76260 55.69751 2301.09642 3160.65262 8654.33056
1.65000 -10599.79676 107.62072 208.24168 2110.63441 3096.64654 8250.13850
1.75000 -10605.13993 141.77780 -18.62116 1953.35911 3016.27333 7841.52121
1.85000 -10612.87386 193.39098 -157.95231 1881.20869 2897.72467 7545.46609
1.95000 -10564.03472 150.92550 -104.81955 1785.00363 2757.00548 7315.19908
2.05000 -10524.95343 211.39584 -49.84641 1748.57443 2644.37419 6993.47089
2.15000 -10497.50280 196.74363 -7.41848 1732.51659 2518.14772 6687.59637
2.25000 -10449.46075 171.66824 -46.79843 1650.07750 2399.60054 6421.48514
2.35000 -10375.89499 90.27335 7.45651 1658.28944 2304.25634 6268.76889
2.45000 -10305.42359 115.91329 105.72306 1611.72884 2170.92160 5967.71237
2.55000 -10191.50492 130.05327 77.30547 1590.98929 2047.65671 5742.69753
2.65000 -10125.24291 141.92428 14.81438 1555.61165 1944.78310 5453.59182
2.75000 -9949.08613 87.27702 18.88704 1565.78548 1848.23512 5231.99796
2.85000 -9835.69979 66.34437 -81.95449 1483.82427 1738.41615 5015.96050
2.95000 -9681.11863 82.13185 -17.15005 1474.94976 1625.42921 4794.87127
3.05000 -9457.97063 77.54460 51.46886 1421.93869 1503.26343 4619.34774
3.15000 -9254.61122 25.69918 -41.58571 1334.62048 1403.48057 4403.69313
3.25000 -9067.23851 45.88048 -25.85738 1309.72667 1304.35573 4244.15313
3.35000 -8878.23926 0.57594 84.28494 1261.14387 1212.31124 4053.41225
3.45000 -8697.83220 -11.93930 54.51129 1208.45821 1149.26228 3859.20653
3.55000 -8536.37263 -18.41643 6.34742 1159.90808 1081.81667 3736.72582
3.65000 -8370.36950 -18.29993 12.86026 1104.33172 1036.94381 3589.97953
3.75000 -8179.35283 -33.78404 -62.45238 1060.80941 973.83592 3430.54511
3.85000 -8037.93879 -51.29791 -119.36492 1015.61930 921.84319 3327.63881
3.95000 -7858.03457 -58.06291 -101.26696 983.23256 864.46679 3216.14130
4.05000 -7706.47194 -69.41892 -51.97227 934.27523 815.28585 3035.21003
4.15000 -7558.79600 -58.04218 -132.03453 907.17446 763.47664 2959.20346
4.25000 -7415.77968 -74.02118 -91.77830 878.81493 693.75728 2800.30518
4.35000 -7273.03114 -63.28190 -33.56968 841.32543 668.74884 2740.32728
4.45000 -7126.81801 -85.93213 -108.32320 829.18361 627.26346 2621.65190
4.55000 -7009.61617 -75.62952 -132.50422 784.42911 578.77074 2581.08559
4.65000 -6861.75480 -92.46018 -107.34311 736.56517 552.34179 2470.71323
4.75000 -6757.35816 -87.36977 -101.70730 695.72395 530.29509 2379.09488
4.85000 -6638.93798 -78.41929 -38.22129 631.76176 514.39282 2322.45554
4.95000 -6549.64928 -79.61189 -79.37252 610.73077 485.81160 2242.60862
5.05000 -6449.96609 -79.03794 -102.59543 578.01473 466.26665 2165.83516
5.15000 -6366.13160 -79.46973 -101.49419 525.23795 434.36351 2137.95483
5.25000 -6294.71143 -78.86186 -46.38317 521.52515 430.12838 2047.51127
5.35000 -6219.17076 -59.24192 -107.54118 489.56726 407.59772 2010.34624
5.45000 -6144.61160 -65.07034 -53.50615 458.42144 403.72657 1940.46451
5.55000 -6079.28679 -50.00265 8.81983 461.36865 386.49891 1901.85928
5.65000 -6025.92394 -37.39399 -73.54257 432.76297 371.44000 1846.52477
5.75000 -5959.30663 -33.22135 -29.42258 442.11772 363.47863 1808.19347
5.85000 -5913.37337 -37.34685 -28.57072 422.51578 348.67602 1740.47895
5.95000 -5843.47546 -25.59878 9.62969 438.31399 357.03196 1719.34895
6.05000 -5794.70662 -19.65747 -0.31016 439.42456 332.01104 1671.71004
6.15000 -5741.31313 -11.39661 6.55436 417.09004 310.36489 1611.81229
6.25000 -5687.35030 -3.23643 -6.48804 430.41659 340.10542 1592.80216
6.35000 -5651.12251 2.11466 -28.32450 451.95173 311.82614 1560.29049
6.45000 -5625.20601 -0.53224 -26.24367 439.73667 298.68328 1518.56318
6.55000 -5584.45561 8.19924 9.40736 453.65412 292.11111 1472.65036
6.65000 -5555.38272 4.65134 -17.92512 457.56099 283.77727 1435.10324
6.75000 -5508.88036 13.45745 21.85557 447.57333 260.47219 1392.73112
6.85000 -5470.09706 10.55610 -69.24602 440.22902 265.41182 1362.36723
6.95000 -5422.82512 14.74791 -0.35260 445.91805 280.68014 1347.76364
7.05000 -5371.00391 21.99817 -8.79048 436.12388 284.90787 1319.26596
7.15000 -5340.05949 15.93430 -17.35158 436.79676 266.01293 1288.47332
7.25000 -5298.66725 17.21411 -18.57114 420.95339 241.86902 1285.51088
7.35000 -5268.38399 18.17129 7.25392 399.19693 253.98644 1235.67818
7.45000 -5221.74121 17.44617 -32.59781 400.43792 275.33749 1236.57062
7.55000 -5195.00843 15.87757 -13.20333 384.67369 256.03766 1181.14701
7.65000 -5158.91300 21.65151 -4.16973 358.56304 215.87884 1147.05970
7.75000 -5104.01357 24.17791 -9.06612 349.51916 230.63796 1157.56282
7.85000 -5062.53762 24.48749 4.38839 318.66932 211.28032 1110.64395
7.95000 -5031.43701 21.80087 2.71149 304.90303 217.68333 1097.26100
8.05000 -4992.62449 14.96754 -8.24334 304.96906 217.81060 1075.30132
8.15000 -4952.11719 21.19744 -32.48571 294.13037 209.37021 1059.98544
8.25000 -4904.75707 10.25953 -16.99500 275.29124 224.18589 1029.01365
8.35000 -4868.55430 19.58665 13.41054 257.62115 201.56664 1004.45363
8.45000 -4839.97512 13.96138 -9.10023 269.43181 197.29566 989.78562
8.55000 -4804.46432 14.22062 6.79379 255.13383 210.01293 982.32709
8.65000 -4765.73075 17.16223 20.72684 242.16478 198.08054 962.18491
8.75000 -4734.85784 10.65770 11.31278 252.71341 179.25469 935.00790
8.85000 -4699.23917 16.74418 20.30564 243.46589 198.65799 942.00578
8.95000 -4674.81613 11.04498 -13.59968 251.05299 194.68350 904.63407
9.05000 -4645.68286 11.18237 2.83631 237.82684 177.96535 885.10649
9.15000 -4612.98525 12.45093 6.38269 230.57785 191.67707 864.17765
9.25000 -4587.16130 6.87051 -2.82088 226.11187 159.83837 847.83224
9.35000 -4557.03532 9.72803 -14.08132 226.38857 177.79989 823.80548
9.45000 -4520.86527 13.62005 2.80276 217.43285 199.09675 805.61636
9.55000 -4491.39717 7.75759 12.07688 223.85590 169.21595 809.28223
9.65000 -4448.68824 7.79420 21.32419 206.66379 139.80778 786.41638
9.75000 -4419.49991 10.04925 24.44340 205.01178 171.59954 775.74912
9.85000 -4394.24785 10.14335 11.25986 194.09100 165.94799 760.54498
9.95000 -4376.00769 9.92449 11.29807 193.27911 144.06997 731.51273
10.05000 -4348.06400 6.23725 2.41447 176.87757 150.64003 715.15491
10.15000 -4319.40145 9.05802 26.93196 219.76977 158.82918 705.82448
10.25000 -4290.64288 7.12548 0.61055 212.86052 162.39030 692.09500
10.35000 -4256.37652 4.85843 0.70470 178.59784 161.10285 662.07305
10.45000 -4224.14419 3.90166 24.48410 186.21999 154.65854 651.55953
10.55000 -4195.73077 7.45463 19.46476 173.17824 165.14292 647.34998
10.65000 -4171.64670 1.87653 5.98695 172.80983 150.84765 629.61893
10.75000 -4144.24393 1.21666 8.22100 198.52113 166.44799 618.30613
10.85000 -4110.93817 3.19065 7.30544 155.23200 146.00779 598.92614
10.95000 -4088.46963 2.80877 8.64970 147.37489 157.92549 589.63043
11.05000 -4061.07024 4.58231 12.13650 142.46057 112.42117 570.67155
11.15000 -4034.97766 3.98367 -9.44023 150.66004 134.79358 555.96803
11.25000 -4003.80474 3.99478 0.71225 120.64679 100.52796 544.00521
11.35000 -3967.15476 4.95200 23.50449 159.29279 145.17259 545.35105
11.45000 -3943.36883 0.83086 -16.86311 152.95113 115.67729 533.17843
11.55000 -3911.77429 9.29288 1.42760 143.09090 164.94436 512.00192
11.65000 -3886.35282 -0.40335 12.34449 119.55100 101.86681 497.88069
11.75000 -3850.46496 4.65492 5.01229 157.43846 110.14406 502.24125
11.85000 -3826.33380 2.85653 8.93720 159.21689 107.83331 481.59766
11.95000 -3792.54974 -0.47703 6.71706 118.10318 89.11234 470.06975
12.05000 -3770.03539 2.87442 -8.72493 132.12344 108.21077 454.12390
12.15000 -3737.21957 3.69677 -6.43003 97.81158 98.94463 439.76039
12.25000 -3705.03274 2.48747 -13.86102 126.46070 170.98172 440.81154
12.35000 -3676.60720 4.68253 -0.69316 124.31280 93.36362 425.88932
12.45000 -3649.65017 1.92309 -3.14359 140.44641 122.70737 436.06453
12.55000 -3618.75319 2.39865 -0.26511 114.29831 93.83669 418.20386
12.65000 -3591.85597 3.38469 1.05521 94.66278 102.51651 406.96961
12.75000 -3563.38032 3.09453 12.17042 118.83282 135.83981 408.51330
12.85000 -3535.08911 0.11030 -1.45316 123.51946 100.10757 419.05234
12.95000 -3512.33585 3.64063 6.33298 119.87265 135.08718 398.60970
13.05000 -3486.94406 0.51745 2.54139 89.74676 85.53055 390.93373
13.15000 -3464.69209 0.46697 3.51939 96.24219 88.43633 377.48387
13.25000 -3441.07396 3.34533 23.27753 96.83666 98.96797 366.10707
13.35000 -3412.07601 1.39129 19.45379 157.58015 151.92153 365.04524
13.45000 -3388.94885 1.32967 15.48548 128.90107 100.89359 366.11375
13.55000 -3365.43773 4.08683 25.70052 143.89700 95.74786 368.96895
13.65000 -3346.52365 3.78500 39.21525 137.73800 89.40159 347.54853
13.75000 -3329.23759 5.05591 33.41615 95.43973 103.65899 355.46258
13.85000 -3305.56366 1.98362 22.15399 83.81775 168.38934 333.90767
13.95000 -3288.85193 -0.22162 15.08961 104.06466 86.86770 318.41102
14.05000 -3264.75540 1.09712 22.50034 79.26793 74.19654 315.64094
14.15000 -3242.76120 5.06287 28.55918 79.81860 64.34454 299.93335
14.25000 -3219.41274 2.68380 30.77440 93.84173 72.56677 321.78018
14.35000 -3198.44668 -1.54424 18.28920 89.15519 86.34867 303.99051
14.45000 -3175.49186 2.74462 30.18482 106.57405 68.94380 294.99371
14.55000 -3149.46415 -0.39005 25.50906 70.89279 142.19645 293.93134
14.65000 -3133.25452 1.30974 36.27651 101.77401 98.72090 301.47523
14.75000 -3114.23398 2.93823 40.12265 78.70559 63.77034 273.33486
14.85000 -3088.91549 2.94726 50.98324 88.62222 98.59485 285.69772
14.95000 -3067.18189 8.16342 39.17923 103.00436 155.11544 261.84357
15.05000 -3048.07054 0.04509 40.56656 75.05747 72.79153 271.84894
15.15000 -3022.56829 3.29044 34.40724 72.17580 76.06371 268.87838
15.25000 -3001.38890 1.83281 38.17461 68.04541 60.57774 254.60963
15.35000 -2983.21150 6.49023 31.23849 84.32981 89.57289 256.01104
15.45000 -2959.59219 0.80113 33.04398 93.54057 68.93548 275.83153
15.55000 -2947.70438 2.04197 27.65409 77.57127 57.22840 236.81659
15.65000 -2919.49850 2.33894 47.40720 71.83332 59.73796 237.48187
15.75000 -2901.70688 0.34436 47.29885 214.43328 132.11403 244.85631
15.85000 -2878.48946 1.59901 16.17682 113.13698 80.93821 220.71396
15.95000 -2859.47611 0.33228 14.78566 58.98522 61.81821 234.36904
16.05000 -2839.10181 -0.69621 27.40651 106.22002 68.48204 221.19265
16.15000 -2819.63858 1.17963 8.69494 77.55823 67.26876 220.96034
16.25000 -2805.67055 2.97339 29.77840 63.19425 104.89322 203.27330
16.35000 -2785.75516 1.18056 17.63041 65.09981 59.69248 204.72312
16.45000 -2772.66891 3.52352 32.83066 89.38610 60.58870 208.26384
16.55000 -2751.59596 -1.24129 14.52341 46.53994 45.62525 200.95686
16.65000 -2732.53386 0.79496 10.08728 51.47370 60.93549 189.00557
16.75000 -2713.63285 2.39394 26.37595 51.02705 72.36784 179.23962
16.85000 -2693.79114 -1.63519 18.22765 66.82349 45.91415 186.05880
16.95000 -2680.96357 -3.27180 6.64658 87.51208 108.57326 233.21101
17.05000 -2659.86276 -1.28251 14.73317 57.14836 39.71118 174.90633
17.15000 -2645.81360 1.03834 2.65254 43.30444 43.52321 170.21506
17.25000 -2627.41600 0.61120 16.77234 99.96473 52.85785 182.68504
17.35000 -2615.34513 3.64571 1.84764 52.05261 50.03587 166.38643
17.45000 -2600.08331 3.80990 -2.53154 47.52446 58.25500 193.89078
17.55000 -2579.69348 2.45476 8.21859 49.34826 35.68685 162.52047
17.65000 -2559.49796 -3.64180 4.06575 57.00131 63.21304 159.75010
17.75000 -2551.73661 3.97741 8.40339 69.99971 42.65349 152.46170
17.85000 -2533.93570 1.82887 2.91223 59.39441 47.93160 152.61689
17.95000 -2521.97740 -1.43486 4.90303 89.31564 65.94993 165.23466
18.05000 -2503.73071 1.65448 20.24963 40.88314 40.37190 163.42276
18.15000 -2487.50716 3.14992 14.56570 39.34240 32.63698 145.31009
18.25000 -2474.43761 2.08002 12.04634 40.08258 42.15623 147.90733
18.35000 -2459.28614 -0.27123 14.95397 84.21488 35.40085 162.35421
18.45000 -2440.09696 -2.03906 21.06149 45.79110 94.88235 138.61126
18.55000 -2425.79504 1.61050 30.04697 35.72327 34.31397 144.70717
18.65000 -2414.86946 2.67411 15.95941 62.07578 32.73436 134.25851
18.75000 -2400.38131 0.05086 26.04922 55.63661 51.68857 144.94551
18.85000 -2383.25655 4.10499 17.81374 39.20888 39.05335 129.22463
18.95000 -2369.69163 3.47152 32.05960 50.90367 45.58024 139.80673
19.05000 -2348.30310 4.55690 31.61432 61.97864 57.28257 127.95811
19.15000 -2343.25007 -4.23468 25.56819 31.25055 44.88556 122.38640
19.25000 -2328.74923 1.46708 28.39177 31.18452 29.55162 118.11287
19.35000 -2314.65450 0.74932 24.56660 37.75873 31.75483 116.98363
19.45000 -2300.21192 0.61467 32.17123 32.32973 27.57433 118.40894
19.55000 -2277.01492 -0.62042 33.42019 180.50971 53.59494 118.96275
19.65000 -2276.44576 0.55832 25.04449 46.59347 43.81716 117.16779
19.75000 -2264.99210 0.53883 29.44611 44.38324 42.72655 121.09823
19.85000 -2250.99290 1.35920 31.76325 41.96397 37.22836 120.07958
19.95000 -2238.63905 -2.52479 31.77399 59.98286 39.76139 120.13160
