0.120000 2.291260
0.380000 2.361800
0.620000 3.061200
0.880000 -2.720570
1.120000 -2.461440
1.380000 -2.271520
1.620000 -2.095680
1.880000 -2.194770
2.120000 -2.277210
2.380000 -2.258970
2.620000 -2.206400
2.880000 -2.265680
3.120000 -2.262350
3.380000 -2.299500
3.620000 -2.354800
3.880000 -2.409460
4.120000 -2.424440
4.380000 -2.464610
4.620000 -2.249420
4.880000 -2.218310
5.120000 -2.239640
5.380000 -2.101270
5.620000 -2.229750
5.880000 -2.569820
6.120000 -2.302550
6.380000 -2.231060
6.620000 -2.989200
6.880000 1.293210
7.120000 -2.612130
7.380000 -0.974990
7.620000 -0.988160
7.880000 -1.084110
8.120000 -1.303320
8.380000 -1.723560
8.620000 -1.803110
8.880000 -1.902620
9.120000 -1.112070
9.380000 -0.713660
9.620000 -1.528800
9.880000 -0.714190
10.120000 -0.243340
10.380000 -0.588020
10.620000 0.007400
10.880000 -0.235640
11.120000 -0.265690
11.380000 0.210760
11.620000 -0.307590
11.880000 -1.791180
12.120000 -0.234540
12.380000 -0.438060
12.620000 -0.416150
12.880000 -0.789760
13.120000 -0.602290
13.380000 -0.958410
13.620000 2.403160
13.880000 0.459870
14.120000 2.497570
14.380000 2.059180
14.620000 -3.091290
14.880000 1.072290
