0.125 0.001 -0.002 0.001
0.375 -0.011 -0.001 0.068
0.625 -0.041 0.001 0.374
0.875 -0.066 0.005 0.991
1.125 -0.110 0.002 1.766
1.375 -0.188 -0.009 2.587
1.625 -0.225 0.006 3.283
1.875 -0.240 -0.063 3.939
2.125 -0.270 -0.096 4.402
2.375 -0.315 -0.156 4.913
2.625 -0.317 -0.094 5.411
2.875 -0.346 -0.132 5.875
3.125 -0.404 -0.109 6.251
3.375 -0.381 -0.083 6.625
3.625 -0.414 -0.135 6.801
3.875 -0.416 -0.158 7.142
4.125 -0.462 -0.101 7.591
4.375 -0.452 -0.143 7.875
4.625 -0.436 -0.164 8.209
4.875 -0.509 -0.180 8.357
5.125 -0.515 -0.172 8.612
5.375 -0.468 -0.186 9.110
5.625 -0.511 -0.158 9.566
5.875 -0.501 -0.263 10.366
6.125 -0.556 -0.239 10.896
6.375 -0.581 -0.325 11.767
6.625 -0.660 -0.338 12.843
6.875 -0.672 -0.292 14.079
7.125 -0.717 -0.360 15.580
7.375 -0.841 -0.453 17.975
7.625 -0.857 -0.425 19.462
7.875 -0.957 -0.554 20.739
8.125 -0.980 -0.485 21.785
8.375 -0.943 -0.486 22.291
8.625 -0.978 -0.467 22.116
8.875 -0.964 -0.454 21.838
9.125 -0.887 -0.425 21.011
9.375 -0.870 -0.421 20.445
9.625 -0.781 -0.379 18.823
9.875 -0.788 -0.366 18.376
10.125 -0.715 -0.357 18.122
10.375 -0.790 -0.376 18.729
10.625 -0.809 -0.364 19.432
10.875 -0.804 -0.376 19.312
11.125 -0.837 -0.356 19.791
11.375 -0.850 -0.381 20.568
11.625 -0.883 -0.334 21.262
11.875 -0.861 -0.377 21.293
12.125 -0.906 -0.389 21.954
12.375 -0.921 -0.352 21.853
12.625 -0.894 -0.346 21.768
12.875 -0.933 -0.338 21.593
13.125 -0.803 -0.312 20.120
13.375 -0.746 -0.301 19.439
13.625 -0.749 -0.291 18.808
13.875 -0.669 -0.255 17.425
14.125 -0.672 -0.212 16.400
14.375 -0.635 -0.223 15.785
14.625 -0.596 -0.163 14.604
14.875 -0.569 -0.145 13.706
