0.120000 -1.996860
0.380000 1.136190
0.620000 -0.297870
0.880000 -1.444320
1.120000 1.418780
1.380000 1.549640
1.620000 1.942400
1.880000 1.781040
2.120000 -0.992500
2.380000 -1.921530
2.620000 -0.490630
2.880000 -1.452970
3.120000 -0.661400
3.380000 -0.934510
3.620000 -0.779950
3.880000 -1.206420
4.120000 -0.972580
4.380000 -1.081020
4.620000 2.664640
4.880000 -0.026610
5.120000 -0.845460
5.380000 -2.705380
5.620000 -2.681110
5.880000 -0.173990
6.120000 0.291260
6.380000 0.473950
6.620000 0.383700
6.880000 0.793150
7.120000 0.435070
7.380000 0.892880
7.620000 0.417440
7.880000 0.073320
8.120000 0.080350
8.380000 -0.140640
8.620000 -0.115090
8.880000 1.214380
9.120000 -2.190850
9.380000 -2.974660
9.620000 2.908460
9.880000 0.551240
10.120000 -2.456030
10.380000 1.759010
10.620000 2.157830
10.880000 -2.507450
11.120000 2.287140
11.380000 -2.207690
11.620000 -2.454290
11.880000 -1.501490
12.120000 -2.714680
12.380000 -2.679250
12.620000 2.629380
12.880000 2.877650
13.120000 1.757320
13.380000 -3.098330
13.620000 2.341700
13.880000 2.211530
14.120000 -3.022210
14.380000 1.627470
14.620000 1.643650
14.880000 2.746730
