0.120000 -2.339530
0.380000 2.474380
0.620000 2.590510
0.880000 2.465930
1.120000 2.447460
1.380000 2.482360
1.620000 2.391220
1.880000 2.474540
2.120000 2.440570
2.380000 2.445770
2.620000 2.484950
2.880000 2.457570
3.120000 2.465620
3.380000 2.489580
3.620000 2.460170
3.880000 2.481250
4.120000 2.447300
4.380000 2.443240
4.620000 2.466270
4.880000 2.467050
5.120000 2.476060
5.380000 2.474870
5.620000 2.461640
5.880000 2.422590
6.120000 2.454990
6.380000 2.444690
6.620000 2.446250
6.880000 2.446400
7.120000 2.426600
7.380000 2.426980
7.620000 2.490960
7.880000 2.495650
8.120000 2.497680
8.380000 2.519140
8.620000 2.569100
8.880000 2.577890
9.120000 2.496890
9.380000 2.592600
9.620000 2.553560
9.880000 2.474190
10.120000 2.726460
10.380000 2.599790
10.620000 2.648750
10.880000 2.934210
11.120000 3.019560
11.380000 2.932650
11.620000 -2.835410
11.880000 -2.804190
12.120000 -2.951330
12.380000 2.804010
12.620000 -2.529030
12.880000 2.269390
13.120000 2.520080
13.380000 1.457330
13.620000 2.195700
13.880000 1.793500
14.120000 2.162940
14.380000 1.724400
14.620000 2.228180
14.880000 2.168330
15.120000 2.498800
15.380000 -3.095400
15.620000 1.506310
15.880000 1.801400
16.120000 2.519030
16.380000 1.732330
16.620000 0.934470
16.880000 1.974140
17.120000 1.402460
17.380000 1.926280
17.620000 1.753590
17.880000 1.417410
18.120000 1.313500
18.380000 1.106150
18.620000 1.236110
18.880000 0.884490
19.120000 0.592210
19.380000 0.531020
19.620000 0.595360
19.880000 0.220210
