0.2 0.8128 18.59997 1.04952 74.0431 74.18087 67.16722
0.6 0.20879 43.38723 1.04621 71.65775 71.44441 65.57397
1.0 -0.12064 66.93872 0.20617 68.36699 66.66545 61.93527
1.4 0.17113 85.89928 0.23657 65.75412 62.98966 58.4269
1.8 -0.20861 100.93617 0.14454 61.71157 59.33382 55.63024
2.2 -0.13397 115.75981 0.0956 57.87569 55.91487 52.6115
2.6 -0.01446 127.67701 0.46624 54.88757 52.15854 50.14646
3.0 -1.09935 137.51783 0.3002 51.97767 49.14123 47.6153
3.4 -0.56524 146.25407 -0.05391 49.79277 45.97163 45.13404
3.8 -0.60778 154.66378 0.26794 47.05756 42.96498 42.51295
4.2 -0.73427 162.59856 0.0188 44.76626 39.95755 40.12136
4.6 -0.51658 168.77763 0.01707 42.93036 37.5928 38.38824
5.0 -0.20433 173.69952 0.39808 40.97486 35.26144 36.09516
5.4 -0.55379 178.21832 0.45243 39.09546 32.856 34.33436
5.8 -1.76453 181.92218 0.28791 37.65671 31.71596 32.8192
6.2 -1.41791 185.84077 0.07858 36.29562 30.31234 31.27715
6.6 -1.32643 189.54372 -0.14934 34.44388 28.73808 29.98033
7.0 -0.25152 192.55197 0.11147 33.07031 27.52337 28.34137
7.4 0.62046 194.94612 0.56457 31.99751 26.12271 27.23827
7.8 0.58736 197.32642 0.19929 30.9382 24.81061 26.20741
8.2 0.7449 198.63822 -0.04842 29.52007 23.73948 24.81393
8.6 0.58216 200.28658 -0.22994 28.7812 22.9179 23.50223
9.0 0.17676 201.78969 -0.43174 27.6166 22.12077 22.67844
9.4 -0.55549 203.32487 -0.31474 26.07148 20.92783 21.6411
9.8 -0.90135 204.33442 -0.14515 24.87151 19.76814 20.62116
10.2 -1.04409 205.26531 -0.46862 24.64426 18.56458 19.58584
10.6 -1.05849 205.85376 -0.67226 23.47258 17.76461 18.82133
11.0 -1.11635 206.12038 -0.53158 22.42921 17.30496 18.36565
11.4 -0.3277 207.16189 -0.37751 21.77907 16.84774 17.2517
11.8 0.17475 207.61395 -0.61588 21.242 15.8785 16.75503
12.2 0.07353 207.8108 -0.64811 20.19712 15.57349 16.04859
12.6 0.24456 207.62815 -1.01248 20.04263 14.84536 15.57772
13.0 0.494 208.38274 -1.6938 18.68559 14.80003 14.86216
13.4 0.32674 208.6986 -1.21371 18.50584 14.33585 14.49755
13.8 0.63858 209.42256 -0.78038 17.46392 13.79376 14.00865
14.2 1.00151 209.93811 0.22948 17.35685 12.72731 13.59774
14.6 1.15196 209.93364 0.08844 16.39798 12.41969 12.9928
15.0 0.34899 209.30533 -0.48014 15.72753 12.17762 12.99822
15.4 -0.25471 209.13847 -1.18229 15.16097 11.55237 12.30295
15.8 -1.20197 209.17026 -1.85632 14.81987 11.28176 11.97201
16.2 -1.22378 209.53186 -1.54589 14.25145 11.29708 11.60056
16.6 -0.89401 210.51544 -0.50105 13.39043 10.07104 11.56271
17.0 -0.51614 210.25217 -0.17337 13.3317 9.5081 11.01239
17.4 -1.03134 209.22895 -0.38502 12.56912 8.55926 10.59849
17.8 -1.06504 208.69964 -0.73724 12.67232 9.01353 10.481
18.2 -1.47939 209.16396 -1.47087 12.10052 8.87284 9.93533
18.6 -0.79238 209.90385 -1.7398 11.59421 8.45481 9.10284
19.0 -0.1275 209.26495 -1.76024 11.14287 8.13842 9.28566
19.4 -0.01158 208.48621 -1.3789 10.75441 7.66456 9.65915
19.8 -0.13879 207.42824 -1.1178 10.72566 8.13981 9.3248
