0.12500 0.02628
0.37500 0.07142
0.62500 0.14222
0.87500 0.20358
1.12500 0.25529
1.37500 0.30700
1.62500 0.33680
1.87500 0.34851
2.12500 0.35992
2.37500 0.37756
2.62500 0.38368
2.87500 0.39652
3.12500 0.39816
3.37500 0.41654
3.62500 0.42467
3.87500 0.43083
4.12500 0.44029
4.37500 0.45968
4.62500 0.46490
4.87500 0.46823
5.12500 0.48652
5.37500 0.49139
5.62500 0.50649
5.87500 0.52484
6.12500 0.53342
6.37500 0.54592
6.62500 0.55766
6.87500 0.54746
7.12500 0.56912
7.37500 0.57551
7.62500 0.57055
7.87500 0.57510
8.12500 0.56932
8.37500 0.56968
8.62500 0.54408
8.87500 0.54582
9.12500 0.52815
9.37500 0.49995
9.62500 0.49048
9.87500 0.47692
10.12500 0.44706
10.37500 0.42362
10.62500 0.41836
10.87500 0.41604
11.12500 0.38518
11.37500 0.39007
11.62500 0.37893
11.87500 0.36396
12.12500 0.34955
12.37500 0.31848
12.62500 0.30992
12.87500 0.29738
13.12500 0.26755
13.37500 0.24716
13.62500 0.22919
13.87500 0.20198
14.12500 0.16505
14.37500 0.15419
14.62500 0.15218
14.87500 0.12517
15.12500 0.07991
15.37500 0.09560
15.62500 0.08612
15.87500 0.07090
16.12500 0.07278
16.37500 0.07689
16.62500 0.06068
16.87500 0.05188
17.12500 0.03518
17.37500 0.04220
17.62500 0.02628
17.87500 0.02855
18.12500 0.03324
18.37500 0.02752
18.62500 0.03063
18.87500 0.05160
19.12500 0.01920
19.37500 0.05903
19.62500 0.05445
19.87500 0.05268
