0.05000 2823.29282
0.15000 3863.17129
0.25000 5553.68553
0.35000 7022.14712
0.45000 7629.72019
0.55000 8219.62485
0.65000 7783.66116
0.75000 7777.56888
0.85000 7785.91284
0.95000 7414.95593
1.05000 7235.79165
1.15000 7150.22784
1.25000 6743.80442
1.35000 6430.21032
1.45000 6139.92481
1.55000 5913.63297
1.65000 5685.03927
1.75000 5397.28674
1.85000 5322.42854
1.95000 5041.92435
2.05000 4995.70744
2.15000 4763.89974
2.25000 4689.30995
2.35000 4440.46594
2.45000 4346.46908
2.55000 4198.52558
2.65000 4024.95797
2.75000 3920.81957
2.85000 3799.18163
2.95000 3688.30317
3.05000 3591.18518
3.15000 3437.83758
3.25000 3365.69647
3.35000 3261.76041
3.45000 3115.87375
3.55000 3001.73859
3.65000 2960.02894
3.75000 2859.14877
3.85000 2768.16224
3.95000 2729.73763
4.05000 2633.01084
4.15000 2514.67608
4.25000 2498.88965
4.35000 2463.72038
4.45000 2428.96387
4.55000 2289.78971
4.65000 2196.72599
4.75000 2195.47932
4.85000 2173.06402
4.95000 2070.96187
5.05000 1959.74536
5.15000 1951.21944
5.25000 1904.11698
5.35000 1858.39548
5.45000 1848.94864
5.55000 1805.86962
5.65000 1729.36784
5.75000 1690.19275
5.85000 1622.39188
5.95000 1582.86793
6.05000 1554.68299
6.15000 1583.68465
6.25000 1444.56267
6.35000 1420.59871
6.45000 1403.71485
6.55000 1345.90118
6.65000 1345.74260
6.75000 1325.34899
6.85000 1256.03606
6.95000 1256.39612
7.05000 1220.80387
7.15000 1184.78531
7.25000 1168.26751
7.35000 1133.09137
7.45000 1099.32047
7.55000 1100.28939
7.65000 1050.55339
7.75000 1026.28663
7.85000 1008.35798
7.95000 960.52120
8.05000 964.85388
8.15000 915.83695
8.25000 913.96073
8.35000 888.22231
8.45000 880.11820
8.55000 858.78264
8.65000 845.93968
8.75000 817.03969
8.85000 806.91213
8.95000 793.39679
9.05000 798.98183
9.15000 757.76470
9.25000 727.44430
9.35000 728.56240
9.45000 716.82751
9.55000 687.56010
9.65000 684.33530
9.75000 662.45268
9.85000 645.43224
9.95000 640.16065
10.05000 610.46150
10.15000 605.47658
10.25000 593.63897
10.35000 588.72445
10.45000 561.47201
10.55000 547.94842
10.65000 566.22926
10.75000 557.54331
10.85000 517.11900
10.95000 529.85567
11.05000 514.53458
11.15000 497.82130
11.25000 481.30656
11.35000 480.50263
11.45000 446.07546
11.55000 434.93831
11.65000 453.32192
11.75000 440.17832
11.85000 419.68482
11.95000 431.79056
12.05000 404.83217
12.15000 391.76753
12.25000 408.40406
12.35000 380.83179
12.45000 373.94969
12.55000 353.97807
12.65000 359.08821
12.75000 348.33423
12.85000 343.25411
12.95000 339.01442
13.05000 334.90381
13.15000 326.44265
13.25000 311.13085
13.35000 314.77881
13.45000 308.26217
13.55000 287.04040
13.65000 291.87105
13.75000 293.93571
13.85000 294.87144
13.95000 260.36438
14.05000 271.23301
14.15000 250.42608
14.25000 260.62701
14.35000 252.72984
14.45000 245.73137
14.55000 247.36772
14.65000 232.02005
14.75000 241.91623
14.85000 234.67991
14.95000 236.94652
15.05000 252.51348
15.15000 215.39009
15.25000 213.25670
15.35000 241.92509
15.45000 216.36369
15.55000 280.09854
15.65000 209.09668
15.75000 202.99206
15.85000 207.04085
15.95000 200.30383
16.05000 249.28787
16.15000 185.26990
16.25000 201.99606
16.35000 214.83222
16.45000 189.35359
16.55000 175.97988
16.65000 220.49357
16.75000 172.07597
16.85000 177.57367
16.95000 175.24066
17.05000 149.51236
17.15000 155.16687
17.25000 159.02285
17.35000 151.72885
17.45000 148.20455
17.55000 139.73146
17.65000 145.75439
17.75000 145.95602
17.85000 131.64452
17.95000 139.85160
18.05000 141.57531
18.15000 134.34936
18.25000 141.33755
18.35000 120.30588
18.45000 135.81619
18.55000 125.90625
18.65000 131.05806
18.75000 145.37277
18.85000 128.73132
18.95000 119.74488
19.05000 111.82263
19.15000 111.78616
19.25000 122.76895
19.35000 122.25179
19.45000 150.75415
19.55000 108.46738
19.65000 128.06891
19.75000 119.93032
19.85000 94.85745
19.95000 106.32413
