0.125 0.000 0.000 0.001
0.375 -0.003 0.002 0.034
0.625 -0.003 -0.003 0.169
0.875 -0.001 0.001 0.498
1.125 -0.008 0.003 1.026
1.375 -0.008 0.002 1.665
1.625 -0.024 0.045 2.381
1.875 -0.016 0.006 3.126
2.125 -0.030 -0.009 3.791
2.375 -0.023 0.009 4.592
2.625 -0.042 0.011 5.258
2.875 -0.049 0.035 5.993
3.125 -0.035 0.080 6.833
3.375 -0.039 0.085 7.803
3.625 -0.082 0.025 8.751
3.875 -0.058 0.083 9.723
4.125 -0.086 0.069 10.960
4.375 -0.079 0.051 12.355
4.625 -0.100 0.079 14.018
4.875 -0.150 0.133 15.756
5.125 -0.143 0.118 17.446
5.375 -0.101 0.128 18.644
5.625 -0.131 0.117 20.315
5.875 -0.149 0.192 21.362
6.125 -0.201 0.145 22.208
6.375 -0.194 0.110 22.357
6.625 -0.136 0.152 23.247
6.875 -0.157 0.194 23.944
7.125 -0.124 0.157 24.571
7.375 -0.097 0.148 24.839
7.625 -0.213 0.163 25.238
7.875 -0.160 0.132 25.719
8.125 -0.138 0.145 26.406
8.375 -0.200 0.149 26.379
8.625 -0.190 0.195 26.416
8.875 -0.139 0.120 26.043
9.125 -0.193 0.101 26.385
9.375 -0.168 0.097 26.873
9.625 -0.180 0.102 27.088
9.875 -0.178 0.144 26.369
10.125 -0.214 0.138 26.858
10.375 -0.167 0.062 27.141
10.625 -0.165 0.154 26.348
10.875 -0.164 0.110 26.184
11.125 -0.131 0.008 25.804
11.375 -0.201 0.111 25.720
11.625 -0.155 0.094 24.659
11.875 -0.167 0.087 24.784
12.125 -0.143 0.112 24.719
12.375 -0.181 0.078 23.559
12.625 -0.129 0.050 23.070
12.875 -0.170 0.065 22.149
13.125 -0.189 0.039 21.916
13.375 -0.134 0.047 21.026
13.625 -0.090 0.051 20.295
13.875 -0.115 0.032 19.402
14.125 -0.084 0.029 18.340
14.375 -0.076 0.018 18.513
14.625 -0.111 0.012 17.512
14.875 -0.104 0.013 17.146
