0.05000 0.00000 0.00000 0.00000 0.00000 0.00000 0.00000
0.15000 -401.97658 309.30611 4252.41802 1339.43861 1092.36638 232.88104
0.25000 -1260.67966 -201.04996 4109.90295 1015.66294 1346.01160 289.67226
0.35000 -649.61871 -449.98387 4054.01251 1382.69217 1266.40919 373.91526
0.45000 -887.07463 38.74620 4000.00461 1314.39900 1418.62307 452.09864
0.55000 -1334.10825 80.07038 3840.98536 1369.18002 1353.18867 462.38006
0.65000 -1135.98907 94.03133 3822.06207 1388.59126 1469.00915 517.81365
0.75000 -1357.91872 3.81129 3709.21978 1361.72232 1418.61261 617.98534
0.85000 -1564.43611 9.50782 3565.13581 1363.21474 1464.04418 715.61154
0.95000 -1654.13508 -58.12769 3481.84673 1349.13880 1496.15892 693.47577
1.05000 -1889.37132 41.36539 3279.65292 1407.65540 1520.17684 831.08383
1.15000 -2122.12652 24.15072 3056.11974 1398.04640 1591.71865 907.55426
1.25000 -2206.49723 61.65117 2880.59390 1363.78917 1596.84758 1040.74603
1.35000 -2324.76152 -23.84089 2577.29436 1467.76990 1656.51643 1208.08103
1.45000 -2596.38908 -77.56016 2226.45832 1358.76692 1647.54434 1404.69122
1.55000 -2804.84754 -38.32669 1900.28602 1315.11156 1610.17246 1602.38883
1.65000 -2874.29027 -54.32222 1668.96914 1356.74234 1529.08389 1739.30097
1.75000 -2960.95540 48.92194 1581.04775 1300.89543 1466.14978 1898.98955
1.85000 -3132.23288 132.19828 1269.15837 1261.27219 1375.33766 2062.21088
1.95000 -3174.72621 -59.96755 1369.29206 1199.16344 1236.36743 2064.70213
2.05000 -3198.36955 -105.20623 979.03951 1261.25487 1237.25092 2235.99386
2.15000 -3258.07279 -32.34677 976.81365 1159.46981 1149.83907 2256.94160
2.25000 -3265.11626 -9.19386 936.14727 1186.43933 1048.43329 2289.42548
2.35000 -3328.38651 -13.80338 725.18576 1169.10922 1029.44274 2324.83071
2.45000 -3341.85051 13.25285 667.97131 1159.93883 958.08790 2356.05384
2.55000 -3367.19171 -20.54562 636.95786 1106.21709 920.10573 2340.05090
2.65000 -3330.26651 -29.76633 552.61486 1121.41635 871.77951 2383.21641
2.75000 -3366.86500 6.94016 501.05317 1063.58016 819.79135 2379.41482
2.85000 -3352.88372 -19.73229 447.10445 1104.92370 776.91353 2411.38447
2.95000 -3328.43659 27.45521 651.98768 1070.77293 735.22992 2343.22251
3.05000 -3323.54193 14.49553 223.59520 1063.67665 726.07268 2447.40410
3.15000 -3296.15361 4.27631 516.79513 1058.55575 669.90668 2394.42719
3.25000 -3340.51468 -20.17387 419.05357 1049.10558 634.32742 2322.99764
3.35000 -3260.87317 -9.57851 341.89127 1050.31953 624.86936 2410.37355
3.45000 -3285.43071 -21.06219 272.78175 1030.82144 606.14582 2384.95901
3.55000 -3280.95104 8.91401 337.70594 990.94376 555.33679 2356.10398
3.65000 -3219.62306 7.15406 186.49920 1033.46938 562.85928 2402.25617
3.75000 -3237.66259 -14.07263 367.21850 991.42585 523.47829 2321.13465
3.85000 -3224.37196 -2.27800 301.19612 1000.16836 516.33504 2305.12921
3.95000 -3208.98323 -15.06383 156.05866 964.39508 513.48565 2330.26731
4.05000 -3151.75210 -19.60229 228.39142 968.73425 487.67735 2347.90664
4.15000 -3176.39727 -19.73191 262.38964 945.82215 463.86206 2284.04154
4.25000 -3101.87810 0.54298 314.75299 958.05788 452.59963 2307.71458
4.35000 -3174.33279 -1.85003 97.09024 949.75431 451.99484 2235.34310
4.45000 -3046.68237 7.78817 138.83358 976.59860 432.68123 2351.12831
4.55000 -3122.07543 -7.69727 197.32574 911.08669 417.89260 2232.19413
4.65000 -3073.61954 -3.67807 221.96657 926.27706 410.38166 2254.49959
4.75000 -3068.96353 -6.20550 223.15497 927.08851 392.46716 2228.32653
4.85000 -3048.70039 3.76995 90.76358 905.01550 381.28622 2233.39704
4.95000 -3006.69143 -2.47849 233.52246 915.97078 365.59764 2223.40994
5.05000 -3011.43462 8.73568 145.78174 903.93100 362.72152 2207.63025
5.15000 -3032.93490 1.78820 61.87452 871.11049 364.18173 2167.20730
5.25000 -2986.29805 0.58682 87.77790 914.80912 352.14049 2170.60543
5.35000 -2946.50561 11.13443 57.07047 890.99521 336.20891 2225.10402
5.45000 -2957.34430 1.80581 99.78782 862.50106 326.20963 2155.54355
5.55000 -2955.12774 8.57910 143.42799 848.38245 322.23710 2117.30148
5.65000 -2916.52455 -7.09413 138.31811 866.59989 313.49761 2128.49197
5.75000 -2910.27663 1.44598 69.67148 863.69005 301.00563 2104.93357
5.85000 -2880.61145 3.68737 24.16751 862.78597 302.62268 2126.99976
5.95000 -2850.94075 -0.26746 89.98658 867.18501 296.50346 2121.39295
6.05000 -2869.75375 6.25832 99.57712 839.35635 288.49152 2072.48838
6.15000 -2863.93405 1.19816 102.44544 821.25830 284.04258 2062.02884
6.25000 -2819.98594 2.32845 96.82015 843.39849 275.43289 2075.67339
6.35000 -2804.44551 -3.32320 31.22836 857.96689 270.30371 2073.03854
6.45000 -2798.02101 -5.08270 33.43463 811.18856 263.94342 2070.58026
6.55000 -2800.57969 -1.88184 38.66690 823.61361 257.94865 2036.62268
6.65000 -2794.13782 0.23313 -28.31440 777.73152 261.07472 2019.90473
6.75000 -2758.56113 2.49207 -13.13965 806.02942 250.79079 2031.86872
6.85000 -2758.34611 -2.43546 46.98743 806.11740 248.84409 1988.50522
6.95000 -2730.89468 -0.77180 23.04642 812.64256 240.17833 2002.15085
7.05000 -2737.44649 3.98604 -20.83263 795.02840 233.04672 1966.06271
7.15000 -2710.83379 3.15294 22.11867 792.66207 227.54982 1972.18857
7.25000 -2694.91278 -3.58066 1.35217 799.36069 224.02409 1956.31418
7.35000 -2680.09679 -9.35242 64.90441 783.89661 226.60119 1950.47698
7.45000 -2661.79964 4.93865 54.35281 790.70371 222.53692 1930.53562
7.55000 -2646.94350 -0.75314 81.83720 760.39166 209.27407 1929.79042
7.65000 -2627.40028 -1.61962 -42.39747 779.10523 210.37249 1932.93791
7.75000 -2627.95344 6.56628 21.42206 747.87401 206.71974 1905.23773
7.85000 -2625.79070 -0.68655 0.66998 758.55842 209.25691 1885.13702
7.95000 -2618.50643 5.92042 19.93685 749.94448 202.10667 1870.24422
8.05000 -2606.87697 -2.42204 -39.26541 757.52029 198.03698 1859.72154
8.15000 -2583.27561 -0.73680 -11.11691 751.24329 197.24189 1856.73593
8.25000 -2543.45307 2.54862 -8.05235 768.03892 189.64537 1876.77166
8.35000 -2544.03376 6.08892 -77.72420 734.71271 191.40532 1863.37187
8.45000 -2525.83382 -6.61428 -101.83496 754.61635 189.00497 1858.05756
8.55000 -2515.76875 3.81462 -60.01412 745.89549 188.78341 1840.74845
8.65000 -2528.50116 5.39104 -59.91240 721.21483 183.10205 1810.99480
8.75000 -2522.67552 4.36277 -41.37097 719.96936 179.12156 1785.57966
8.85000 -2447.61844 -1.43116 -46.21001 744.47450 176.95292 1849.32985
8.95000 -2462.69853 0.85223 -15.14771 726.90181 173.12156 1802.74257
9.05000 -2456.48211 2.00229 -41.37181 730.64610 171.57655 1790.28988
9.15000 -2469.60236 2.17436 -63.91207 699.30307 171.21849 1753.96484
9.25000 -2396.59159 2.24821 -13.79331 730.56306 171.91387 1810.83410
9.35000 -2413.09026 -0.61634 -42.20642 709.16501 156.09762 1765.97371
9.45000 -2391.28073 2.26006 -68.78112 711.17252 153.66799 1774.93411
9.55000 -2392.28683 2.17504 -60.89920 691.61677 158.52832 1746.94232
9.65000 -2370.95753 -0.15095 -60.94391 687.94820 154.08043 1751.36167
9.75000 -2372.57359 0.02166 -33.62509 676.77184 154.42752 1725.56122
9.85000 -2366.09438 2.28814 -67.85417 675.54898 154.41871 1707.84383
9.95000 -2327.46680 -0.08604 -24.71119 687.53102 148.03909 1721.71110
10.05000 -2285.60574 3.20059 -19.67392 694.69924 149.93883 1746.36588
10.15000 -2319.82545 -1.16993 -29.45900 660.28672 147.96175 1685.43163
10.25000 -2316.08713 -3.58006 -34.80530 658.29987 145.18678 1670.21093
10.35000 -2267.79984 3.66170 -50.29815 671.83334 139.05172 1700.06524
10.45000 -2267.91290 -2.22566 -66.93209 675.60139 135.96212 1675.26826
10.55000 -2279.17699 -0.22647 -98.99462 652.10787 134.29758 1653.61197
10.65000 -2235.51258 -0.59493 -73.98771 668.07965 133.54075 1672.51949
10.75000 -2240.86457 1.66552 -55.58472 649.65639 126.54141 1646.38538
10.85000 -2227.68941 -1.54703 -22.58626 661.38961 135.43106 1628.44743
10.95000 -2199.81872 -1.00899 -9.93460 648.30734 127.97215 1644.74432
11.05000 -2206.60863 -0.17534 -94.13122 636.72044 124.71027 1618.21986
11.15000 -2185.29119 -4.92438 -104.92947 639.66700 134.50623 1626.11713
11.25000 -2148.21712 -1.67864 3.18141 647.61199 128.37135 1637.86790
11.35000 -2176.04726 0.77987 -83.09338 610.11835 122.38034 1591.32734
11.45000 -2156.97988 2.92037 -82.51804 630.95633 128.03190 1591.33689
11.55000 -2138.84717 -0.69424 -45.14627 631.05803 118.35453 1588.85319
11.65000 -2143.71860 -2.49952 -95.30923 609.43425 120.08328 1566.10768
11.75000 -2121.46735 -2.37667 -37.02537 615.50246 116.95078 1566.26133
11.85000 -2123.18408 -1.59888 -26.56692 612.11828 115.30640 1536.30335
11.95000 -2118.11939 1.58694 -46.62420 600.11482 117.48098 1530.41976
12.05000 -2080.84961 -0.22954 -8.98936 608.82670 115.63529 1548.05408
12.15000 -2086.40300 -0.21326 -45.83667 594.11767 113.45075 1530.75371
12.25000 -2072.57832 -0.82094 -43.46670 601.10224 107.80762 1518.33473
12.35000 -2034.72500 -0.66290 -3.52385 615.16469 105.72022 1537.81978
12.45000 -2058.67821 0.21997 -11.55635 589.56848 108.70385 1501.01119
12.55000 -2033.90681 1.92882 -90.25545 605.82892 106.97538 1509.18186
12.65000 -2019.17018 -1.59559 -77.93523 597.11668 111.85497 1513.65837
12.75000 -2020.07168 -1.51141 -61.45697 593.15133 104.71191 1487.73175
12.85000 -2009.45530 1.03803 0.37614 582.97652 107.57321 1477.51280
12.95000 -2003.36711 -0.14538 -64.78334 572.74757 102.13030 1474.64420
13.05000 -2008.62921 0.50417 -36.03970 560.01420 108.12518 1450.94572
13.15000 -1976.01796 0.93565 -20.43661 578.18830 103.58049 1464.40966
13.25000 -1976.95728 -1.83864 -40.05852 568.01949 103.14074 1450.52442
13.35000 -1971.95730 1.17081 -87.21992 555.91362 98.69058 1434.38523
13.45000 -1964.35995 1.37607 -77.22612 545.41410 101.68162 1432.76361
13.55000 -1930.49824 0.67723 -82.76459 564.52653 94.88437 1447.24175
13.65000 -1934.25854 -0.22502 -21.23319 554.52445 88.78224 1419.21708
13.75000 -1923.83859 0.83082 -19.68224 553.87033 92.19890 1411.18714
13.85000 -1917.34858 -3.18348 -71.08656 556.71423 95.92280 1407.50063
13.95000 -1908.69353 3.54217 -71.75348 551.98403 94.21170 1400.53872
14.05000 -1899.47787 2.04002 -43.72512 543.81478 95.30341 1392.51850
14.15000 -1885.44919 0.12185 -102.45078 553.22307 92.88185 1389.87359
14.25000 -1874.06418 1.72896 -73.89474 547.52475 86.09143 1382.94220
14.35000 -1878.35161 -0.63729 -81.64784 534.17954 86.69553 1367.48300
14.45000 -1873.27845 0.48187 -69.36170 524.87821 89.62396 1350.79777
14.55000 -1835.28441 -2.04797 -94.21291 535.28927 89.44482 1377.19336
14.65000 -1833.94796 -2.22329 -77.43012 528.84813 84.43392 1364.32433
14.75000 -1828.91398 3.71336 -34.12181 519.80963 88.34330 1351.88284
14.85000 -1812.81145 -1.46037 -37.85038 535.46055 85.96620 1347.94937
14.95000 -1817.24917 -0.00783 -79.09111 525.98449 80.14444 1332.95175
15.05000 -1815.09242 0.29382 -55.93819 520.84485 85.34499 1313.55085
15.15000 -1785.81945 0.26141 -30.15660 529.98042 83.31605 1328.49724
15.25000 -1796.19935 0.87101 -27.37508 502.12602 80.96586 1306.82896
15.35000 -1759.29872 2.28181 -62.21416 515.50164 80.41010 1333.80711
15.45000 -1793.91536 -0.06274 -66.27652 490.53508 75.64998 1279.27087
15.55000 -1765.68700 -1.68459 -51.62426 512.59523 79.24583 1288.29186
15.65000 -1747.42271 2.86424 -31.94969 504.34380 85.03858 1297.97349
15.75000 -1738.88285 -1.26253 -64.47758 503.85297 77.26341 1293.91695
15.85000 -1750.75092 -1.39677 -49.59630 489.83480 77.35783 1264.39555
15.95000 -1724.68147 -0.31383 -8.85864 505.16107 76.18915 1272.16841
16.05000 -1717.90635 -0.85598 -61.00336 493.04493 72.28806 1271.65746
16.15000 -1721.00607 0.55584 -114.41678 487.08359 73.49420 1254.78454
16.25000 -1704.29805 -0.15351 -93.46024 490.11200 77.53330 1259.12831
16.35000 -1707.20575 1.23651 -58.71912 485.42289 73.05060 1243.59712
16.45000 -1692.87197 -2.63520 -35.54420 480.46651 72.77224 1240.68716
16.55000 -1696.67973 0.29258 -77.86950 490.06432 76.82315 1220.36498
16.65000 -1670.83197 0.05127 -59.48320 485.79220 73.59138 1237.51019
16.75000 -1670.32273 1.60476 -44.85460 476.66229 72.52573 1223.79414
16.85000 -1661.41122 -1.40189 -90.59494 476.53274 67.06083 1222.42957
16.95000 -1642.41002 0.47209 -8.16865 476.70772 68.64710 1224.22878
17.05000 -1627.24906 0.40090 -68.88991 482.83333 65.94090 1231.15361
17.15000 -1631.77078 0.69917 -24.46371 469.86029 65.21783 1212.10760
17.25000 -1622.97838 -0.46888 -65.74514 473.41078 71.79748 1205.26175
17.35000 -1631.47791 -1.99639 -47.28109 461.10061 64.75467 1184.09119
17.45000 -1613.18070 2.49807 -98.28447 450.41022 66.56855 1200.65873
17.55000 -1601.74832 -0.13344 -87.01085 462.45188 64.45445 1192.55912
17.65000 -1605.02021 -0.84910 -53.60900 466.89563 64.26174 1171.19208
17.75000 -1598.12603 -0.79232 -49.36791 451.11438 66.24429 1168.36953
17.85000 -1592.28928 -1.30681 -51.22692 448.27700 61.30522 1158.74413
17.95000 -1578.94650 -0.53930 -19.67981 448.98449 60.13087 1163.20941
18.05000 -1593.04857 0.03739 -57.06819 431.18827 59.54423 1132.41230
18.15000 -1575.99357 0.68495 -62.11309 436.88282 66.62799 1140.28689
18.25000 -1565.59343 -0.20887 -114.56337 444.38137 69.46156 1139.08748
18.35000 -1562.21737 -0.63580 -84.78656 432.28181 65.14329 1130.69835
18.45000 -1555.33208 1.53788 -16.18158 432.83198 66.77613 1123.00176
18.55000 -1538.25483 -0.81321 -31.58557 445.39524 62.67867 1124.97791
18.65000 -1520.94403 0.52068 -61.20651 436.46269 62.11800 1141.88979
18.75000 -1526.92869 0.40202 -46.27608 433.18324 71.52015 1120.04847
18.85000 -1518.58577 1.31243 -64.64251 436.87731 54.29574 1114.79912
18.95000 -1512.50845 -2.07003 -52.19614 429.22580 59.69998 1111.01867
19.05000 -1510.82308 0.49917 -31.52630 437.02664 58.96154 1096.47703
19.15000 -1501.78796 0.38111 -10.41824 427.48902 55.02980 1094.35039
19.25000 -1499.66218 0.07127 -42.44745 425.74830 53.43524 1087.51993
19.35000 -1472.79121 0.28180 -43.24287 444.13845 60.92636 1100.24926
19.45000 -1474.05141 0.25811 -28.19203 429.26482 60.40033 1094.00794
19.55000 -1469.94195 -0.23195 4.25933 418.14115 56.63514 1081.55749
19.65000 -1458.69906 1.45878 -73.06570 425.48278 57.45571 1086.74333
19.75000 -1451.08327 0.30112 -58.40502 427.65383 50.88125 1083.55545
19.85000 -1456.86851 -0.84913 -69.94910 414.70403 56.12551 1067.86615
19.95000 -1456.18064 -0.77242 -73.78344 419.61767 65.03144 1054.97983
