0.05000 -6447.88574 58.48768 2629.75413 6917.85617 5844.37665 7894.48868
0.15000 -8744.94528 -7.78528 1276.73910 5541.35969 5634.65375 10547.14414
0.25000 -11480.54534 -85.75517 232.44917 5102.13721 4708.90460 12586.25859
0.35000 -12940.16148 -26.94269 315.62863 5193.31315 4321.91241 13560.88266
0.45000 -13456.63052 43.03791 -503.85497 5244.66225 4126.21049 13928.50893
0.55000 -13519.34499 0.00130 236.51857 4849.00779 4078.26968 13934.62585
0.65000 -13571.80262 52.87263 -156.24143 4848.55901 4099.41695 13920.87153
0.75000 -13505.50535 5.67501 34.33541 4620.45245 4059.46999 13707.03544
0.85000 -13420.17425 62.54014 -134.95895 4492.15085 3952.53594 13274.70851
0.95000 -13248.87177 80.84810 -67.13008 4188.33450 3993.76282 12747.29387
1.05000 -13062.44986 -22.31700 52.20675 3983.26233 3918.43596 12222.14548
1.15000 -12790.63011 27.25273 -213.53282 3781.30079 3857.21311 11728.65305
1.25000 -12559.39765 47.79356 -229.90241 3574.53974 3795.20605 11184.50153
1.35000 -12342.22147 -24.29384 129.87811 3432.02310 3742.08732 10690.08617
1.45000 -12102.21415 -39.95825 30.56258 3251.15906 3641.09297 10297.34499
1.55000 -11941.91141 13.05110 -107.77812 3056.26135 3567.13319 9780.99831
1.65000 -11807.06733 7.46975 49.81633 2877.24709 3529.81124 9361.63509
1.75000 -11606.58204 13.49049 174.01794 2746.05715 3446.00195 9018.03690
1.85000 -11453.03244 28.06354 33.29179 2577.61031 3354.82695 8623.90163
1.95000 -11291.88629 26.77473 -20.37633 2446.23949 3272.67384 8272.07730
2.05000 -11138.28144 -10.70463 133.36656 2294.02405 3167.91856 8021.06265
2.15000 -11007.11826 -34.93390 -34.47847 2190.10122 3108.76211 7668.29410
2.25000 -10879.73318 57.82242 -11.19499 2104.84322 2990.10042 7368.30361
2.35000 -10690.81033 1.20511 2.09160 2007.90234 2911.09726 7093.68635
2.45000 -10555.88234 28.80006 -27.42108 1946.83290 2846.41789 6808.83846
2.55000 -10425.16445 -27.26198 58.71553 1875.43250 2746.07230 6625.47293
2.65000 -10278.85121 72.06161 124.62965 1781.31023 2643.84793 6401.32501
2.75000 -10134.35424 51.10178 -12.69100 1779.11705 2588.40741 6184.23520
2.85000 -10000.67281 -6.61917 118.94681 1630.31133 2498.42899 5992.83077
2.95000 -9864.44198 8.92558 11.13756 1625.81085 2457.87720 5700.01480
3.05000 -9671.98226 23.36563 14.01581 1576.73003 2353.45689 5611.43410
3.15000 -9524.80161 -35.56742 12.57275 1517.09889 2262.57038 5405.17508
3.25000 -9392.00008 12.24988 177.19170 1404.81433 2213.02138 5216.91140
3.35000 -9266.95106 -21.92238 12.50959 1361.46956 2146.91230 5043.29085
3.45000 -9119.08187 20.35479 -97.34075 1358.57510 2084.34434 4923.02083
3.55000 -8992.86037 13.30113 -66.94848 1278.30257 1999.14210 4775.94579
3.65000 -8860.66507 21.54059 82.88706 1207.86285 1981.82775 4609.17687
3.75000 -8731.30756 -23.23373 -21.29144 1181.66000 1919.19621 4469.00207
3.85000 -8584.66103 25.18653 38.26000 1152.31198 1850.01355 4365.88932
3.95000 -8476.20475 10.91877 100.70816 1112.28393 1797.00231 4214.34121
4.05000 -8367.64509 20.63415 48.93349 1080.49351 1751.77842 4092.65131
4.15000 -8243.55083 -6.68464 -88.53203 1032.56823 1652.18778 3990.44861
4.25000 -8108.11634 3.35385 33.13983 1051.37562 1607.95396 3887.18121
4.35000 -8001.90819 28.64467 -36.03638 1016.53075 1600.56790 3835.85070
4.45000 -7934.04627 -45.34087 -5.89817 974.68579 1519.28387 3648.16904
4.55000 -7800.24310 -17.45449 -25.76139 922.55784 1481.78173 3591.65556
4.65000 -7676.54707 -14.82797 -16.05581 909.75356 1451.74446 3502.06979
4.75000 -7609.58764 30.64059 -27.38290 851.08945 1394.01194 3388.18745
4.85000 -7522.26222 9.28351 -3.92867 839.47568 1374.95356 3294.21483
4.95000 -7421.19118 -8.09068 5.17073 836.30489 1363.52778 3217.71295
5.05000 -7314.34382 3.66494 19.06549 816.56374 1263.26527 3124.85762
5.15000 -7214.55561 24.41595 -8.11731 853.61060 1250.88912 3111.84769
5.25000 -7119.13454 -25.99102 46.76970 752.98752 1197.41973 2977.56038
5.35000 -7002.03877 -15.13090 2.32376 749.89629 1153.65354 2901.30013
5.45000 -6938.82791 -26.34502 -3.49585 727.27389 1160.66012 2829.09252
5.55000 -6860.44989 2.71535 -14.58607 710.83459 1098.77037 2747.50771
5.65000 -6750.84185 39.77378 -11.98821 731.84596 1041.94000 2686.93284
5.75000 -6669.72686 14.41962 -47.91166 676.69612 1035.25050 2574.19918
5.85000 -6557.27898 -23.12388 -2.20372 692.05504 982.69797 2565.61221
5.95000 -6478.22805 -13.56609 30.37353 644.48810 962.11875 2461.12239
6.05000 -6393.44233 2.22194 2.37853 597.06512 919.72850 2356.63593
6.15000 -6284.48039 13.89268 -62.41477 590.17461 892.23817 2319.50674
6.25000 -6187.23290 14.17505 -34.41042 678.24104 901.97955 2276.60407
6.35000 -6102.09446 3.47272 -27.91755 540.82711 845.01465 2183.18523
6.45000 -5998.74015 -7.38288 20.42081 535.20007 819.88514 2166.89166
6.55000 -5912.93853 2.50720 -38.81479 514.97864 798.74821 2058.82867
6.65000 -5839.45111 -2.84109 -73.11963 487.20678 807.36844 1997.16267
6.75000 -5754.83420 -24.62298 -12.59125 530.84823 812.13935 1982.39094
6.85000 -5678.33270 -17.60277 -33.49058 433.83259 731.59063 1941.10904
6.95000 -5592.13498 22.46765 30.81527 425.72881 711.39809 1870.79353
7.05000 -5506.35585 0.88725 47.17310 415.68936 699.24029 1861.79540
7.15000 -5441.81543 8.73614 -7.47601 509.94227 686.70559 1810.30197
7.25000 -5391.34678 -7.75580 -28.29117 405.81258 671.91180 1730.76224
7.35000 -5318.69545 -9.03657 -25.36643 364.75209 691.27343 1702.57369
7.45000 -5266.47298 -1.72898 -13.23006 387.62713 681.60597 1623.94154
7.55000 -5207.93312 6.03984 28.75991 397.58126 625.04452 1634.80705
7.65000 -5148.47584 14.19561 7.86914 356.34073 618.07340 1598.89671
7.75000 -5092.67049 -27.29770 36.45796 363.55795 631.20724 1514.44302
7.85000 -5044.73140 3.62603 46.20036 411.03129 614.28805 1556.12356
7.95000 -4989.57317 -13.48655 -18.24716 327.76759 618.17804 1471.96203
8.05000 -4950.63547 10.26741 26.50711 399.27234 630.23560 1446.46368
8.15000 -4920.67871 -16.56617 28.78962 306.39897 566.12399 1391.36645
8.25000 -4882.03754 -3.06189 12.69680 345.13050 561.63215 1401.25485
8.35000 -4846.26771 -8.45167 28.50337 484.96341 593.93630 1349.31650
8.45000 -4813.48197 0.04717 -6.79261 420.73855 602.73162 1334.98821
8.55000 -4780.51945 -4.46458 31.72044 334.38044 556.98023 1263.54475
8.65000 -4766.27664 -7.06782 18.80836 436.10932 590.21901 1241.67814
8.75000 -4738.41101 -14.66357 -9.36101 328.30909 528.93800 1196.01139
8.85000 -4723.97654 -19.52876 -11.20331 366.34819 530.59329 1191.55389
8.95000 -4710.93607 -35.11134 3.82605 331.42797 565.08906 1129.86575
9.05000 -4705.45264 -35.44570 18.61324 347.93582 539.08760 1107.75036
9.15000 -4701.07034 -27.53086 -26.70099 381.82417 507.99644 1076.67678
9.25000 -4676.10842 -26.34227 -5.76022 435.14961 476.17753 1076.49984
9.35000 -4680.78511 -14.41270 16.17376 420.18696 563.21512 1057.51720
9.45000 -4652.57652 -24.25642 -31.76063 477.17607 518.03172 1017.99906
9.55000 -4633.61443 -28.03282 -19.65925 469.11383 449.31866 969.96811
9.65000 -4628.00814 -31.53580 -13.03629 463.41620 429.53764 912.59418
9.75000 -4596.24629 -26.20375 -41.28721 494.89664 421.04508 907.67122
9.85000 -4569.00579 -28.30043 -19.42188 508.73854 464.75595 879.81172
9.95000 -4551.73998 -21.67120 -26.83359 602.19979 405.41183 836.82709
10.05000 -4489.44476 -23.50540 -25.52657 492.83884 367.99913 809.87923
10.15000 -4444.30926 -15.94387 -50.78019 483.42109 344.24420 782.50710
10.25000 -4397.91555 -22.28087 -29.96896 475.48278 327.38139 760.87311
10.35000 -4347.77417 -10.69829 -19.50861 457.84638 391.12963 745.49979
10.45000 -4292.44032 -18.30624 -54.93272 429.03523 300.44167 705.51067
10.55000 -4237.75794 -19.58103 -23.20692 482.06602 395.60999 749.16347
10.65000 -4202.48762 -10.07941 -0.80324 420.54276 263.33033 733.23075
10.75000 -4152.90340 -13.91710 -6.31885 379.00619 273.14275 640.91961
10.85000 -4104.82926 -8.57876 -4.98507 417.05683 324.82330 633.44249
10.95000 -4061.30014 -5.62278 -3.33246 380.06830 344.28676 625.88184
11.05000 -4033.39055 -4.93065 -8.05889 483.75901 230.07951 614.72367
11.15000 -4003.08992 -4.19161 -16.70180 334.89911 226.09537 582.06751
11.25000 -3947.56426 0.94893 -15.21085 403.71296 282.54250 598.33638
11.35000 -3931.24212 5.56438 -5.38980 301.67863 224.83074 560.97256
11.45000 -3896.33630 10.61389 -4.31477 295.82845 226.38692 541.07242
11.55000 -3860.67902 9.29598 -5.54324 296.56283 219.60411 534.74221
11.65000 -3827.14660 -11.81823 -27.04979 285.34942 389.74757 528.14899
11.75000 -3814.16631 9.27214 -13.72176 244.22950 183.07500 505.42308
11.85000 -3773.81186 3.94196 3.85415 344.24990 201.01535 545.46148
11.95000 -3747.50723 13.78302 -21.52697 240.69872 174.72152 494.29410
12.05000 -3712.57079 8.50559 -6.69920 242.78357 187.08658 481.19538
12.15000 -3693.68014 4.96474 -2.44687 318.35912 169.45874 465.38791
12.25000 -3660.85937 4.48388 -31.83467 210.38462 179.79459 468.21238
12.35000 -3631.42834 8.92350 -15.20374 199.67455 229.22652 467.20153
12.45000 -3602.63451 7.32618 -5.86781 206.31936 150.80244 448.02599
12.55000 -3572.32185 4.35352 -31.80082 257.97217 211.92776 443.02000
12.65000 -3555.78096 9.52565 2.28593 180.03710 146.25834 423.97722
12.75000 -3523.38655 3.54657 -13.94624 196.45822 165.83576 417.36081
12.85000 -3503.86296 10.95129 -3.51597 216.37908 349.92944 454.90897
12.95000 -3480.53916 2.83602 -16.80460 172.75157 233.89591 396.25740
13.05000 -3450.27537 8.66973 -6.58991 244.64041 271.38224 413.78574
13.15000 -3421.71551 -1.03676 -6.45202 395.80320 308.92092 405.46342
13.25000 -3400.74332 2.59377 -14.08876 188.69395 114.18496 394.16243
13.35000 -3381.71235 2.78570 -13.48340 153.04601 139.06720 380.47735
13.45000 -3345.99262 6.11641 -11.72166 183.72586 150.70987 364.74705
13.55000 -3325.45687 3.09910 -7.60744 152.99092 123.68339 363.31053
13.65000 -3300.54993 0.58649 -14.35421 139.26166 114.26291 368.21343
13.75000 -3275.15651 6.19113 -19.04882 154.22271 155.80825 367.60061
13.85000 -3253.04265 7.81549 -13.54185 142.57374 186.64599 354.96814
13.95000 -3233.25929 6.32491 -12.02040 188.85786 176.48643 347.74231
14.05000 -3200.62748 -0.74375 -20.67922 161.34509 136.78712 345.11509
14.15000 -3194.22193 -0.44107 -21.17791 157.38207 134.92734 336.88757
14.25000 -3163.78016 2.16520 -21.79069 141.53463 149.96785 331.54899
14.35000 -3140.78580 3.52967 13.51758 152.90180 115.25048 681.51446
14.45000 -3121.71109 0.03855 -11.78513 144.52897 151.83006 321.01734
14.55000 -3104.31867 5.07678 -13.50525 158.31106 164.20045 319.01193
14.65000 -3077.00636 -2.93741 -8.83861 120.98415 185.95911 309.78268
14.75000 -3056.03830 -0.81549 -21.14455 134.95419 107.86022 307.11121
14.85000 -3041.14455 3.10792 -12.25680 142.73471 91.55013 292.37095
14.95000 -3022.90859 3.83634 -8.95879 113.39382 84.80288 278.25321
15.05000 -3000.77283 3.88907 11.27417 91.23445 100.94385 278.13625
15.15000 -2978.32361 5.40614 -10.07778 133.61994 97.45901 274.27252
15.25000 -2967.86823 -6.75076 -5.12323 105.74118 215.22533 271.88335
15.35000 -2947.40646 0.08045 -17.34985 114.64132 124.78568 263.24881
15.45000 -2925.90495 2.00654 8.64614 94.54441 85.17337 264.16096
15.55000 -2902.56095 -3.85696 -7.76581 99.45241 92.54117 260.58532
15.65000 -2889.19122 2.87454 -5.59795 118.36765 77.69933 248.97154
15.75000 -2877.26961 2.98560 -5.75934 112.62497 77.81386 233.33884
15.85000 -2849.72737 2.22504 12.05914 103.63976 103.13388 271.62900
15.95000 -2833.77712 -0.59072 8.34429 95.55064 77.95626 242.76777
16.05000 -2820.59296 0.82331 -2.98124 83.17200 70.06828 231.01653
16.15000 -2804.11188 6.43594 4.68965 105.44122 188.60085 231.53271
16.25000 -2786.72866 2.55239 -3.61720 87.68453 98.74404 245.81706
16.35000 -2771.02547 -4.60998 -0.37085 110.83043 70.36895 212.60457
16.45000 -2750.12017 0.38380 -23.62721 78.60841 146.80749 244.75357
16.55000 -2731.69891 2.04206 5.26339 114.78533 68.61719 216.70406
16.65000 -2712.67730 2.69753 -5.03291 71.29893 60.49580 294.87119
16.75000 -2688.71103 -1.69369 2.48823 86.75762 68.00587 208.55154
16.85000 -2675.32127 -3.15050 -7.67414 84.41006 84.85717 219.80867
16.95000 -2655.84100 -4.85011 -11.44567 81.43154 150.64178 216.02485
17.05000 -2646.87449 0.69436 -9.21689 71.61808 82.28113 231.87648
17.15000 -2629.04607 2.30683 -3.71359 78.07763 62.68701 203.80823
17.25000 -2611.51656 -3.71110 0.68004 68.35256 53.50660 193.85087
17.35000 -2586.28400 11.06978 -7.91849 325.64596 252.71601 410.79258
17.45000 -2580.08796 -2.39123 -6.26347 64.11347 56.85550 181.46814
17.55000 -2565.42008 -1.87078 -11.62439 57.56114 57.84804 176.64689
17.65000 -2545.97495 -1.25121 1.62550 89.12826 59.08580 186.12679
17.75000 -2537.17545 1.32920 -7.45169 59.20372 50.92939 176.88798
17.85000 -2523.59248 -2.99355 1.45630 66.96097 49.91298 172.02942
17.95000 -2505.64836 -0.74553 5.79410 70.24509 61.44516 189.96251
18.05000 -2489.21233 4.61982 1.19327 103.54314 114.79037 175.16947
18.15000 -2480.65720 -2.71491 -12.33187 83.55272 93.90304 177.90672
18.25000 -2460.99010 -2.75635 -13.41605 62.88100 45.76449 173.39321
18.35000 -2484.19069 1.22711 7.80297 768.75116 72.93847 329.09194
18.45000 -2439.87650 -0.31167 -18.27703 112.39245 107.74876 183.16683
18.55000 -2420.61635 4.62374 -19.15171 54.87364 48.85319 157.61287
18.65000 -2403.60104 2.48147 -17.94141 63.00727 53.89674 167.99336
18.75000 -2384.51164 0.95793 -9.28341 97.00297 83.45217 164.71504
18.85000 -2377.03274 13.48190 15.05380 313.08483 333.70003 305.51727
18.95000 -2363.42286 2.34855 -27.24004 65.70107 42.27024 147.22819
19.05000 -2352.02043 -10.37792 -18.27533 154.27589 242.31535 154.12716
19.15000 -2334.00649 3.84950 -22.56151 56.66114 42.86200 160.25976
19.25000 -2308.64598 0.12376 -11.51295 89.47760 43.99224 147.67970
19.35000 -2304.13746 3.21487 -23.34997 80.03119 44.75585 144.83088
19.45000 -2287.42304 0.49575 -18.61275 56.91966 47.76761 150.07032
19.55000 -2277.66756 -3.81509 -19.46703 86.99236 56.88983 149.93660
19.65000 -2257.55976 1.80872 -24.14380 56.45702 42.08423 143.34588
19.75000 -2243.11212 0.65651 -26.58406 54.28746 34.67383 139.37051
19.85000 -2224.49750 3.55062 -17.22252 74.19003 64.60304 151.95660
19.95000 -2221.92921 0.87677 -5.37324 86.65890 47.65072 156.08593
