0.125 -0.001 -0.000 0.004
0.375 -0.009 0.001 0.105
0.625 -0.001 0.002 0.453
0.875 0.006 0.005 1.149
1.125 -0.025 -0.006 2.246
1.375 -0.035 0.016 3.561
1.625 -0.039 0.026 4.819
1.875 -0.023 -0.002 6.346
2.125 -0.000 0.073 7.595
2.375 -0.028 0.041 8.789
2.625 -0.007 0.073 10.629
2.875 -0.018 0.159 12.284
3.125 -0.013 0.058 14.184
3.375 -0.022 0.150 15.621
3.625 0.027 0.162 16.531
3.875 -0.072 0.171 18.017
4.125 -0.154 0.209 18.882
4.375 -0.035 0.167 20.296
4.625 -0.164 0.251 21.184
4.875 -0.170 0.237 22.363
5.125 -0.174 0.283 23.967
5.375 -0.173 0.221 24.735
5.625 -0.247 0.270 25.335
5.875 -0.311 0.371 25.540
6.125 -0.259 0.292 25.575
6.375 -0.273 0.207 25.157
6.625 -0.280 0.218 25.171
6.875 -0.330 0.193 23.544
7.125 -0.272 0.268 22.877
7.375 -0.258 0.223 21.975
7.625 -0.297 0.135 22.244
7.875 -0.242 0.137 21.796
8.125 -0.225 0.134 21.892
8.375 -0.204 0.092 22.551
8.625 -0.270 0.057 21.529
8.875 -0.260 0.051 21.015
9.125 -0.226 0.051 21.690
9.375 -0.218 0.072 20.062
9.625 -0.245 0.016 19.373
9.875 -0.276 0.091 19.636
10.125 -0.241 0.003 18.820
10.375 -0.184 0.003 19.081
10.625 -0.214 -0.021 19.467
10.875 -0.211 0.013 18.351
11.125 -0.141 -0.017 17.433
11.375 -0.097 -0.056 16.434
11.625 -0.094 -0.038 16.082
11.875 -0.105 -0.004 13.908
12.125 -0.118 0.009 13.160
12.375 -0.069 0.026 12.799
12.625 -0.126 -0.001 12.762
12.875 -0.112 0.008 12.510
13.125 -0.087 0.011 12.271
13.375 -0.065 0.020 11.977
13.625 -0.088 0.008 10.676
13.875 -0.124 0.007 10.196
14.125 -0.049 0.006 9.815
14.375 -0.065 0.018 9.675
14.625 -0.055 0.016 8.509
14.875 -0.090 0.017 8.860
15.125 -0.056 0.004 8.247
15.375 -0.080 0.026 8.180
15.625 -0.041 -0.007 7.296
15.875 -0.029 0.024 6.472
16.125 -0.027 -0.000 5.635
16.375 -0.042 0.007 5.169
16.625 -0.031 0.018 5.034
16.875 -0.041 -0.010 4.827
17.125 -0.028 -0.017 3.884
17.375 -0.011 0.004 4.259
17.625 -0.026 0.005 3.758
17.875 -0.019 0.003 3.572
18.125 -0.012 0.004 3.402
18.375 -0.018 0.012 3.246
18.625 -0.019 -0.009 3.171
18.875 -0.027 -0.009 2.673
19.125 -0.008 -0.004 2.783
19.375 -0.021 -0.005 2.731
19.625 -0.023 -0.006 2.641
19.875 -0.021 0.003 2.671
