0.05000 -1141.10077 -216.01109 125.23220 1649.02117 1481.62537 1911.47045
0.15000 -2636.62719 15.87506 69.35007 1535.29656 1498.89457 3604.49015
0.25000 -3859.53028 129.36050 -419.20867 1662.69465 1312.93536 5080.59295
0.35000 -4854.75360 104.84094 -496.85405 1727.59819 1147.62348 6115.33948
0.45000 -5521.80031 107.39759 -192.61144 1584.68062 1034.93515 6916.83117
0.55000 -5895.76808 119.52319 -226.21606 1603.81188 876.02581 7274.65456
0.65000 -6202.17308 113.54214 -117.97108 1588.01274 760.29967 7483.08255
0.75000 -6374.31920 102.04540 -43.50539 1485.96896 677.25233 7516.20394
0.85000 -6575.18454 95.29123 -190.00072 1467.31172 607.76329 7386.57733
0.95000 -6748.85616 84.79033 -3.89958 1439.33738 568.17521 7357.32422
1.05000 -6921.11359 108.90355 -93.97235 1356.22732 536.24830 7105.22230
1.15000 -7084.19348 83.69335 -66.85088 1288.25088 505.74919 6908.43969
1.25000 -7351.62381 91.35387 93.39194 1252.71352 491.44765 6700.84051
1.35000 -7500.42796 91.94110 72.92292 1223.04677 473.53443 6520.96488
1.45000 -7612.37409 86.75885 157.42273 1213.39256 452.60771 6324.84588
1.55000 -7689.76056 88.64374 46.26948 1108.40202 434.63900 6133.38934
1.65000 -7768.40517 98.98139 24.66615 1045.33339 421.46547 5915.86488
1.75000 -7834.59576 95.08225 125.67611 988.49994 404.59045 5782.19141
1.85000 -7896.44011 91.83464 88.70292 943.87402 403.09966 5570.20637
1.95000 -7978.76822 94.63375 114.13750 883.89197 383.63161 5379.22211
2.05000 -8058.60702 86.76332 113.21468 878.81545 379.93264 5215.75969
2.15000 -8099.22585 89.27733 168.03357 864.78161 365.14268 5077.04925
2.25000 -8125.59655 85.97973 45.31772 795.58076 353.15897 4891.03126
2.35000 -8156.42494 82.49524 106.37013 766.09504 349.57272 4711.64882
2.45000 -8169.13527 87.36821 44.40674 768.35685 336.40952 4528.22139
2.55000 -8155.94973 82.81976 69.38640 717.67279 321.81181 4414.08224
2.65000 -8151.49157 91.23413 109.93068 669.61252 317.15885 4312.86463
2.75000 -8157.64653 88.13947 116.64964 640.00908 303.33586 4146.84617
2.85000 -8141.58054 92.17981 4.23224 643.47089 293.95634 4015.97486
2.95000 -8096.75904 90.44861 -38.53323 622.43963 282.69053 3904.88238
3.05000 -8055.26774 94.48556 2.62619 592.33246 269.43364 3777.35040
3.15000 -8020.76814 99.35968 45.64054 567.93386 266.55477 3651.16779
3.25000 -7976.51203 100.91617 92.20626 558.19983 259.74938 3572.79206
3.35000 -7930.63757 100.12440 50.55895 526.99037 243.94956 3417.94546
3.45000 -7885.88009 96.43042 16.69070 508.65990 242.43817 3265.57048
3.55000 -7831.44908 92.02958 57.98884 489.87477 247.01948 3203.18670
3.65000 -7783.74398 94.10203 -14.10676 469.41811 238.69076 3098.03675
3.75000 -7724.69776 94.54567 5.99405 456.17652 226.44703 3016.34789
3.85000 -7666.98441 89.22193 -48.90331 436.63123 229.68273 2937.55931
3.95000 -7605.19189 91.64389 -15.65314 441.29428 229.28322 2847.19930
4.05000 -7551.97080 93.62806 -60.40229 422.43616 214.64778 2723.31649
4.15000 -7484.30375 90.86471 -42.85381 414.50420 208.64086 2662.88058
4.25000 -7429.62804 85.93627 -60.37030 401.05733 207.93171 2560.12390
4.35000 -7372.27924 85.29141 -58.09875 396.42334 204.16541 2512.54682
4.45000 -7321.57685 83.95986 -88.73789 378.97186 194.51973 2412.27772
4.55000 -7249.00013 82.17437 -99.75087 375.99829 190.65846 2357.06391
4.65000 -7189.72812 83.23684 -64.42070 365.17130 185.87770 2293.75096
4.75000 -7133.74944 82.32857 -85.89248 340.71452 182.67846 2202.99306
4.85000 -7064.07980 78.66269 -75.28271 331.09118 177.48958 2128.18113
4.95000 -6991.59656 74.59565 -90.11821 333.34134 187.03771 2085.86749
5.05000 -6938.57205 72.62094 -42.63055 314.70539 173.34684 2020.20116
5.15000 -6866.18423 70.93328 -75.88424 317.61866 171.68418 1977.50798
5.25000 -6808.86833 66.32597 -87.91472 297.13425 166.40791 1903.71266
5.35000 -6752.61605 68.20773 -68.19661 278.11608 170.01202 1837.41663
5.45000 -6694.98048 67.95090 -54.22465 268.18697 166.60969 1792.14856
5.55000 -6638.52889 63.56168 -100.23255 267.10411 161.73017 1738.24724
5.65000 -6569.86201 61.97745 -76.39363 253.58644 160.82930 1700.71371
5.75000 -6505.05979 60.36429 -39.22814 249.64842 154.87901 1652.03854
5.85000 -6445.69593 60.21636 -23.37267 254.69303 154.41630 1606.97110
5.95000 -6393.28079 57.01696 -34.37967 241.43518 148.84554 1556.78929
6.05000 -6329.85197 58.74240 -39.94089 240.06507 156.22773 1522.36126
6.15000 -6269.18383 56.72925 -20.44861 228.90008 150.58971 1471.07686
6.25000 -6201.31483 56.30056 -4.19244 219.35656 142.22412 1415.42879
6.35000 -6144.97784 54.84065 -11.50189 213.65583 144.41795 1386.28980
6.45000 -6082.28475 51.13460 12.08033 209.93351 144.77749 1351.67107
6.55000 -6036.10118 50.69445 -34.27167 203.59341 138.89282 1299.67979
6.65000 -5981.29263 48.84471 -10.01270 200.06891 138.36995 1283.06371
6.75000 -5926.50330 48.05934 4.80788 198.69939 131.21284 1243.26606
6.85000 -5870.94293 45.69981 -3.70018 194.39395 126.93417 1211.12689
6.95000 -5819.05428 48.15352 18.76962 196.42616 128.51192 1152.56880
7.05000 -5753.27853 43.03917 -0.06372 183.97728 131.90240 1141.15642
7.15000 -5704.05426 45.03663 14.93974 189.30623 122.07137 1113.88116
7.25000 -5653.38893 39.97499 -35.82771 174.76377 121.93003 1078.50106
7.35000 -5600.91807 46.97060 22.03668 178.05078 119.88326 1049.58806
7.45000 -5542.18076 39.30341 -2.03655 172.60968 128.88574 1025.21896
7.55000 -5502.39423 42.02496 14.26109 166.45704 121.26228 997.14244
7.65000 -5441.14018 41.35410 -5.80232 168.76324 115.86219 983.18272
7.75000 -5391.57808 37.13528 12.02696 165.59145 116.85369 939.11431
7.85000 -5339.33794 37.86760 17.63491 172.93280 114.45226 920.84862
7.95000 -5297.00030 38.65221 17.64986 164.46410 117.69675 898.46863
8.05000 -5251.28612 36.32692 -15.46482 163.36264 113.41292 876.89474
8.15000 -5214.47312 35.97295 8.94146 154.03826 105.83813 838.30503
8.25000 -5166.07301 35.34574 -18.75718 153.57747 111.84414 821.35353
8.35000 -5125.55031 31.86604 -9.66646 146.60778 108.29874 787.66911
8.45000 -5074.99477 32.27714 -21.39397 147.38837 106.91090 769.06872
8.55000 -5025.23255 34.88444 21.87567 145.31067 112.91699 752.64660
8.65000 -4979.47549 35.85068 -32.49999 142.98696 105.41264 744.52757
8.75000 -4933.55721 32.03881 -17.79341 138.68344 100.95972 712.61674
8.85000 -4886.92175 32.19394 -23.15313 137.02719 101.26714 690.28913
8.95000 -4831.97140 30.50134 -14.31677 137.54841 100.93568 686.34555
9.05000 -4783.13287 33.80439 -9.09952 133.69142 92.21287 667.20986
9.15000 -4733.70442 30.53131 12.19958 123.40483 100.04991 649.25840
9.25000 -4693.42714 31.74807 2.35997 127.40081 99.54122 627.95839
9.35000 -4645.34043 27.89737 8.49299 112.13861 95.59731 606.16085
9.45000 -4606.69992 27.84517 15.04069 114.32662 98.69088 586.59336
9.55000 -4571.98132 30.16279 25.02437 118.39581 90.58609 569.60123
9.65000 -4521.99647 29.16822 40.31570 122.17525 89.81038 568.24014
9.75000 -4490.12091 29.94096 29.08891 113.73546 91.77272 543.83407
9.85000 -4450.77865 26.51708 31.12984 109.71009 86.25897 528.60637
9.95000 -4407.56742 27.99116 44.18073 103.64474 86.49564 515.63041
10.05000 -4368.58459 27.45303 38.02439 106.19336 92.05797 508.28327
10.15000 -4337.19545 24.74921 25.54594 104.70680 86.43798 479.66741
10.25000 -4292.05591 24.58839 30.06951 108.90540 83.15678 474.30961
10.35000 -4251.19216 20.89122 24.76561 105.92534 88.39261 477.40036
10.45000 -4218.37863 27.11384 27.94651 111.27190 89.73889 462.22375
10.55000 -4179.93265 23.67481 32.90370 96.89032 81.33287 443.72648
10.65000 -4135.76083 22.64091 48.27936 91.41867 75.18974 435.34322
10.75000 -4094.05590 18.18844 17.69661 93.84587 78.15641 427.65047
10.85000 -4052.22654 20.03116 11.19486 88.61838 83.27504 415.06735
10.95000 -4011.05188 22.26970 -0.98763 87.74704 78.75002 418.45436
11.05000 -3976.64498 17.54845 -6.31164 89.58325 83.59916 405.80286
11.15000 -3940.63905 21.30708 32.79980 87.46109 75.77860 382.32608
11.25000 -3903.90406 23.71025 8.21815 81.14228 80.79235 376.99855
11.35000 -3869.19259 18.57559 8.32325 81.24353 81.85816 375.68751
11.45000 -3834.36590 19.99837 -5.91280 100.33742 83.63235 357.61319
11.55000 -3804.07478 21.38189 9.36483 77.96613 74.59222 345.33044
11.65000 -3774.03248 19.39724 -3.23126 80.90818 76.41400 345.36546
11.75000 -3747.34722 20.24024 13.57647 80.10106 79.40974 327.11257
11.85000 -3720.84379 17.47628 1.73432 83.60661 85.51828 323.82517
11.95000 -3696.42206 17.29690 -2.85552 74.87748 71.18199 319.16330
12.05000 -3664.09191 15.76234 -9.13167 83.41605 81.71403 316.25352
12.15000 -3640.74246 14.67793 0.87344 70.68013 70.59583 302.34722
12.25000 -3616.09191 20.14769 -7.69721 79.30180 73.35642 298.34380
12.35000 -3589.26911 15.38628 -14.63744 78.18824 79.46685 294.05248
12.45000 -3567.06687 18.65375 -15.16658 81.02833 75.54496 292.36315
12.55000 -3544.01742 15.52628 -16.90804 77.66655 68.12776 285.39129
12.65000 -3519.16180 17.90585 -21.56338 77.19300 69.87356 278.27613
12.75000 -3497.77640 14.00525 -26.64986 88.92653 77.09242 289.74017
12.85000 -3469.51035 18.44997 -17.96801 75.33234 74.49586 275.57676
12.95000 -3447.00256 18.53919 -29.90662 74.96219 63.64558 263.38934
13.05000 -3418.57329 13.97093 -26.49110 71.70643 70.99249 264.44503
13.15000 -3391.48004 15.75602 -40.72461 70.46556 63.13911 249.09399
13.25000 -3362.84618 16.62500 -31.48586 76.51636 63.29534 246.09137
13.35000 -3337.70790 15.20809 -47.63511 69.46469 67.14473 237.42890
13.45000 -3307.61637 14.34640 -25.58424 70.10708 64.92794 243.59015
13.55000 -3286.03870 16.77483 -32.24562 66.24456 59.66286 230.91603
13.65000 -3256.94517 15.87422 -22.28124 62.08185 68.60810 231.32229
13.75000 -3229.40139 16.53803 6.64532 66.72934 61.51416 219.34588
13.85000 -3212.27670 15.22129 -3.64337 64.94514 70.77747 220.53291
13.95000 -3181.08527 12.41843 -15.95109 73.27261 66.21256 210.15782
14.05000 -3154.88143 12.91873 -8.22669 59.12689 52.50237 215.95495
14.15000 -3127.72701 10.41429 11.08535 63.45827 67.86775 211.94281
14.25000 -3108.32084 14.48990 2.48549 62.42889 68.64403 199.90605
14.35000 -3084.01758 12.69814 -1.31500 66.03022 63.58333 201.09072
14.45000 -3061.90261 13.06345 15.88794 74.36963 58.53651 186.76791
14.55000 -3036.66493 16.04366 15.71604 71.84952 65.82420 186.74091
14.65000 -3015.64791 12.11588 16.82902 58.32527 63.89392 183.87464
14.75000 -2999.86425 12.64819 18.16466 64.81271 59.88962 170.42609
14.85000 -2975.60125 12.65335 18.34101 69.62710 68.19116 179.79785
14.95000 -2954.41869 9.72195 8.01853 55.39544 51.79446 164.99482
15.05000 -2938.09982 9.68264 34.82550 70.67457 67.75107 167.00985
15.15000 -2914.99090 8.09635 21.58851 71.64241 68.85911 165.60209
15.25000 -2898.14352 14.20430 12.17299 71.65219 62.21828 165.04991
15.35000 -2876.59614 10.94150 11.49088 53.94960 45.22643 157.92191
15.45000 -2854.34570 9.58282 16.13848 65.07592 55.61763 161.69719
15.55000 -2837.95869 13.75406 4.21963 63.51695 59.80793 153.14964
15.65000 -2819.08726 6.35562 22.17530 53.31532 53.82655 160.69375
15.75000 -2800.47901 9.50448 14.11764 61.40833 53.77367 138.15718
15.85000 -2782.04961 7.66792 -1.27417 52.35162 45.90406 150.95269
15.95000 -2759.67441 11.31070 14.12966 52.81013 68.47253 157.74923
16.05000 -2749.44119 8.14684 8.19671 53.30870 68.75083 141.10617
16.15000 -2731.83837 6.46046 12.96840 49.49742 46.81642 136.22080
16.25000 -2708.86148 8.18942 2.19132 54.24853 46.59461 133.26851
16.35000 -2695.62605 8.70904 7.47182 64.14101 53.28293 142.65946
16.45000 -2678.94387 7.75654 17.41225 52.12103 51.16344 141.85575
16.55000 -2659.36960 7.61538 17.67508 65.20884 53.42616 133.99835
16.65000 -2644.33062 13.13482 13.11988 56.51798 64.62086 134.14782
16.75000 -2621.82182 7.04412 11.87307 46.65745 36.49247 129.62820
16.85000 -2611.62260 9.31105 19.80631 59.99726 60.70281 128.65658
16.95000 -2596.80271 8.79314 20.85821 55.48303 43.67263 123.45795
17.05000 -2576.92787 8.85831 10.78156 44.53640 52.85796 118.77161
17.15000 -2561.05723 10.67943 17.99807 59.23348 66.05725 125.85189
17.25000 -2549.16505 7.60312 18.82725 53.88076 57.38679 126.41027
17.35000 -2534.07668 8.81788 22.71441 59.20203 61.13880 119.10416
17.45000 -2519.23434 13.01725 29.49321 59.89415 71.67105 120.71254
17.55000 -2503.83234 9.87251 18.92797 53.86716 49.92675 108.36381
17.65000 -2484.41141 7.75228 25.70487 51.91165 53.64003 111.55957
17.75000 -2475.67319 6.11329 33.29703 45.15827 52.42841 103.94497
17.85000 -2453.54209 11.94954 29.06317 48.06898 45.33942 103.83807
17.95000 -2445.19289 11.63295 27.00591 58.06369 41.17739 110.31648
18.05000 -2427.52935 6.65012 22.67663 42.58013 41.24147 99.64804
18.15000 -2414.16246 7.02673 41.53230 44.36566 42.25108 99.26188
18.25000 -2393.61064 13.71440 36.10827 50.00034 54.20548 100.01160
18.35000 -2382.21289 9.94066 40.44107 59.47792 46.58879 103.68504
18.45000 -2365.54362 6.87592 32.30949 47.96614 35.74452 87.33431
18.55000 -2357.71974 6.08633 34.60374 43.69809 38.95276 90.42652
18.65000 -2350.09741 10.05152 27.21327 79.01073 48.34416 104.42496
18.75000 -2329.39046 4.93333 28.02601 49.38985 41.92797 90.14398
18.85000 -2323.14121 8.42047 17.80257 47.99755 37.73993 87.06219
18.95000 -2297.71506 8.43481 14.02352 65.34420 64.02812 94.65080
19.05000 -2283.97999 6.34098 23.17897 78.35832 33.35901 83.57115
19.15000 -2271.81376 -3.94871 32.17658 73.73689 79.69507 107.33902
19.25000 -2265.33623 14.55863 37.42294 43.98337 57.07352 96.58891
19.35000 -2235.26335 7.01565 21.50177 64.80653 60.68823 87.94587
19.45000 -2235.33711 10.00949 20.94863 51.19522 44.31055 86.26066
19.55000 -2226.82397 6.75217 21.03151 42.92881 43.23349 98.93405
19.65000 -2206.83855 8.73259 14.89406 41.10355 31.80877 81.93302
19.75000 -2195.24460 2.67778 17.68181 46.77783 41.10334 77.65064
19.85000 -2189.54643 10.69165 10.83516 42.00084 32.44414 70.72736
19.95000 -2179.97043 5.53892 18.72475 43.02679 40.47257 73.93693
