0.12500 0.03370
0.37500 0.02034
0.62500 0.00659
0.87500 0.03133
1.12500 0.02495
1.37500 0.04330
1.62500 0.04831
1.87500 0.05309
2.12500 0.07910
2.37500 0.10662
2.62500 0.12715
2.87500 0.13482
3.12500 0.14018
3.37500 0.12916
3.62500 0.11572
3.87500 0.11000
4.12500 0.10323
4.37500 0.07839
4.62500 0.08876
4.87500 0.07936
5.12500 0.09945
5.37500 0.08151
5.62500 0.06306
5.87500 0.07492
6.12500 0.03575
6.37500 0.03885
6.62500 0.04773
6.87500 0.04018
7.12500 0.04074
7.37500 0.05763
7.62500 0.02551
7.87500 0.03704
8.12500 0.02413
8.37500 0.03825
8.62500 0.02600
8.87500 0.02985
9.12500 0.00315
9.37500 0.03468
9.62500 0.02252
9.87500 0.05860
10.12500 0.03486
10.37500 0.04122
10.62500 0.02754
10.87500 0.03052
11.12500 0.06286
11.37500 0.07057
11.62500 0.03562
11.87500 0.06327
12.12500 0.04212
12.37500 0.05372
12.62500 0.05128
12.87500 0.02777
13.12500 0.01325
13.37500 0.02029
13.62500 0.02812
13.87500 0.04426
14.12500 0.01865
14.37500 0.06051
14.62500 0.02145
14.87500 0.06628
