0.120000 -2.234460
0.380000 -0.916570
0.620000 -0.816040
0.880000 -0.955840
1.120000 -1.100140
1.380000 -1.040510
1.620000 -1.058490
1.880000 -1.092610
2.120000 -1.119830
2.380000 -1.063600
2.620000 -1.061960
2.880000 -1.066460
3.120000 -1.104910
3.380000 -1.085640
3.620000 -1.117270
3.880000 -1.069560
4.120000 -1.086060
4.380000 -1.068300
4.620000 -1.055560
4.880000 -1.039950
5.120000 -1.081420
5.380000 -1.013590
5.620000 -1.044710
5.880000 -1.055470
6.120000 -0.939840
6.380000 -1.007800
6.620000 -1.040900
6.880000 -1.068950
7.120000 -1.093920
7.380000 -1.051240
7.620000 -1.015700
7.880000 -1.103730
8.120000 -0.822840
8.380000 -1.081900
8.620000 -1.076370
8.880000 -1.048230
9.120000 -0.940930
9.380000 -1.270930
9.620000 -1.258390
9.880000 -1.642120
10.120000 -0.954780
10.380000 -0.482570
10.620000 -1.193600
10.880000 -0.543190
11.120000 -1.275390
11.380000 -0.717540
11.620000 -1.554060
11.880000 -1.002080
12.120000 -1.461940
12.380000 -1.906960
12.620000 -1.778270
12.880000 -2.305990
13.120000 -2.526200
13.380000 -2.550940
13.620000 -2.938240
13.880000 2.995460
14.120000 2.897070
14.380000 2.878180
14.620000 2.754980
14.880000 2.518830
15.120000 2.425490
15.380000 2.319570
15.620000 2.294710
15.880000 2.289070
16.120000 2.041930
16.380000 2.204520
16.620000 1.782640
16.880000 2.115160
17.120000 1.752280
17.380000 1.720380
17.620000 1.183310
17.880000 1.830160
18.120000 1.366400
18.380000 -2.422410
18.620000 2.018550
18.880000 1.411040
19.120000 3.027520
19.380000 -3.101940
19.620000 -2.048420
19.880000 2.547690
