0.2 0.21995 17.60351 -0.92823 117.35535 116.34414 90.97622
0.6 -0.79408 38.95491 -0.81223 118.99753 110.02022 86.46308
1.0 -0.4571 57.69187 0.1988 119.49628 101.00666 82.59648
1.4 0.54036 68.07136 -0.01343 117.59177 93.09188 78.25222
1.8 0.01275 74.67793 0.47467 114.26569 86.89448 74.44006
2.2 -0.69999 78.82431 0.29433 109.42958 82.48389 70.32171
2.6 0.11475 81.67591 1.22545 105.41673 78.15378 67.4841
3.0 -0.3196 86.82075 0.79251 101.49794 75.1399 63.20503
3.4 1.32271 90.83736 0.71233 96.61357 72.07071 60.45739
3.8 -0.18357 94.4264 0.65829 91.77033 69.94406 57.22663
4.2 0.22204 100.68257 -0.05991 86.23512 68.47594 54.63145
4.6 0.38693 108.67934 -0.4793 81.11425 68.46104 51.91091
5.0 -0.5972 120.12807 -1.08308 74.74797 69.56926 48.56861
5.4 -0.38426 133.52573 0.01626 69.86159 67.16959 45.76096
5.8 1.34108 145.98883 0.46862 63.07287 63.15193 43.21991
6.2 1.25759 158.01843 -0.61506 56.92774 57.11221 40.08106
6.6 1.47893 166.64098 0.31576 51.85989 51.22663 36.96655
7.0 1.01109 173.19242 0.12948 46.90346 46.55668 33.86261
7.4 0.75423 178.11255 0.67956 42.62493 42.85071 31.3218
7.8 0.44595 183.09694 0.39203 39.35482 39.06498 28.07857
8.2 0.57162 187.47723 0.13326 37.04671 34.33723 26.03026
8.6 0.59334 190.89642 -0.48452 35.56936 29.90363 24.3356
9.0 0.52236 193.33048 -0.22451 34.89408 26.16444 22.77789
9.4 0.08562 194.27117 -0.72126 34.072 24.53374 21.97945
9.8 -0.45973 195.23714 -0.90789 32.779 23.2275 20.83756
10.2 -0.21395 196.63198 -0.43504 31.18707 22.51401 19.8419
10.6 -1.04658 197.7241 -0.19415 29.32541 21.81892 19.10625
11.0 -1.98754 198.92084 -0.06931 27.24413 21.04836 18.37308
11.4 -1.23849 199.96308 0.10895 26.01196 20.60078 17.61811
11.8 -1.38883 200.19867 0.14905 24.3983 20.51198 16.94408
12.2 -0.1116 202.08297 0.30805 23.37794 20.06823 16.47507
12.6 0.20245 203.23664 0.33615 22.87922 18.98054 16.18518
13.0 0.35136 204.89993 -0.09386 22.09724 17.71001 15.88764
13.4 0.3047 205.1999 -0.35005 21.34141 16.03272 15.67744
13.8 0.21229 205.65661 -1.14815 20.9195 15.19796 15.27933
14.2 -0.29186 205.46766 -1.47856 19.77049 14.12101 15.02793
14.6 -0.09029 204.80389 -1.73016 19.23538 14.01347 14.05306
15.0 0.05037 204.87136 -2.22567 18.01812 13.69065 13.82965
15.4 0.21678 205.07302 -1.80794 17.50484 13.87706 13.43035
15.8 0.09376 205.73768 -1.5991 17.21073 14.69881 12.75946
16.2 0.07268 207.30908 -1.28676 16.43069 14.40726 12.57547
16.6 0.25133 208.85938 -0.85153 16.53497 13.42092 12.23676
17.0 -0.29408 209.91779 -0.74025 15.6624 11.80483 12.06872
17.4 0.08294 209.45846 -0.55974 15.99482 10.79776 12.38421
17.8 0.26559 208.60627 -0.46741 16.09885 9.89592 11.64947
18.2 -0.20918 207.16322 -0.08214 15.55485 9.22196 11.25829
18.6 0.80727 206.47997 0.09346 15.31482 9.39234 10.65904
19.0 -0.12403 205.81875 -0.09533 14.2082 10.01019 10.26044
19.4 0.19139 204.90084 -0.3552 14.76411 10.43557 9.91134
19.8 0.41188 204.85957 -0.74493 13.73849 10.49891 9.56637
