0.12500 0.01140
0.37500 0.02778
0.62500 0.08066
0.87500 0.13130
1.12500 0.20077
1.37500 0.26325
1.62500 0.31740
1.87500 0.37811
2.12500 0.42481
2.37500 0.48598
2.62500 0.51935
2.87500 0.55646
3.12500 0.58214
3.37500 0.60534
3.62500 0.60591
3.87500 0.60856
4.12500 0.60660
4.37500 0.59947
4.62500 0.57505
4.87500 0.56329
5.12500 0.52517
5.37500 0.48946
5.62500 0.45554
5.87500 0.42110
6.12500 0.39266
6.37500 0.36964
6.62500 0.35745
6.87500 0.35292
7.12500 0.32668
7.37500 0.29663
7.62500 0.26570
7.87500 0.22730
8.12500 0.17990
8.37500 0.12674
8.62500 0.10060
8.87500 0.07438
9.12500 0.07785
9.37500 0.06010
9.62500 0.05364
9.87500 0.04253
10.12500 0.01914
10.37500 0.01718
10.62500 0.01008
10.87500 0.01011
11.12500 0.05043
11.37500 0.04378
11.62500 0.05233
11.87500 0.06494
12.12500 0.07367
12.37500 0.07708
12.62500 0.05371
12.87500 0.04165
13.12500 0.05651
13.37500 0.04387
13.62500 0.04725
13.87500 0.04617
14.12500 0.04823
14.37500 0.06375
14.62500 0.07744
14.87500 0.06869
