0.450000 -2.160620
1.350000 -2.133410
2.250000 -2.185950
3.150000 -2.183130
4.050000 -2.189670
4.950000 -2.154270
5.850000 -2.079570
6.750000 -2.026910
7.650000 -1.920310
8.550000 -2.001830
9.450000 -2.210530
10.350000 -2.350390
11.250000 -2.475060
12.150000 -2.487100
13.050000 -2.753350
13.950000 -2.925810
14.850000 -2.320790
15.750000 -2.272360
16.650000 -2.310690
17.550000 -2.482040
