0.05000 16104.15939
0.15000 20406.48339
0.25000 22830.42622
0.35000 21819.97711
0.45000 19968.10331
0.55000 18328.31995
0.65000 15967.99091
0.75000 14822.93529
0.85000 13351.96161
0.95000 12113.10275
1.05000 11339.59778
1.15000 10661.24824
1.25000 9694.13851
1.35000 9224.28828
1.45000 8544.11618
1.55000 7963.47070
1.65000 7770.59407
1.75000 7145.02941
1.85000 6752.70482
1.95000 6472.31092
2.05000 6099.90708
2.15000 6014.89299
2.25000 5586.82314
2.35000 5580.24313
2.45000 5206.19814
2.55000 4935.67855
2.65000 4765.38066
2.75000 4538.11604
2.85000 4393.73174
2.95000 4233.34489
3.05000 4211.68084
3.15000 3932.21069
3.25000 3865.87344
3.35000 3688.37195
3.45000 3655.99350
3.55000 3423.51292
3.65000 3380.66069
3.75000 3167.44091
3.85000 3122.11955
3.95000 3019.06227
4.05000 2897.73324
4.15000 2758.58567
4.25000 2780.20757
4.35000 2660.16934
4.45000 2640.78906
4.55000 2521.37768
4.65000 2562.97392
4.75000 2431.56098
4.85000 2369.03562
4.95000 2278.25530
5.05000 2261.33794
5.15000 2231.98132
5.25000 2131.87038
5.35000 2094.96632
5.45000 2108.71721
5.55000 2008.56147
5.65000 1945.28308
5.75000 1921.97402
5.85000 1883.24551
5.95000 1790.55486
6.05000 1760.40993
6.15000 1734.72308
6.25000 1696.00510
6.35000 1717.36653
6.45000 1604.56270
6.55000 1590.95282
6.65000 1535.65896
6.75000 1505.94232
6.85000 1462.29255
6.95000 1410.59187
7.05000 1349.41778
7.15000 1360.62747
7.25000 1319.35631
7.35000 1271.75188
7.45000 1242.78022
7.55000 1232.10938
7.65000 1216.27763
7.75000 1177.07196
7.85000 1154.80379
7.95000 1131.34465
8.05000 1090.61566
8.15000 1084.69166
8.25000 995.77749
8.35000 1007.27503
8.45000 987.39535
8.55000 976.95761
8.65000 913.44266
8.75000 923.52760
8.85000 875.50988
8.95000 887.80753
9.05000 888.70239
9.15000 867.52934
9.25000 867.82310
9.35000 836.07710
9.45000 842.33377
9.55000 798.81649
9.65000 789.63569
9.75000 769.57223
9.85000 765.94745
9.95000 714.53355
10.05000 725.37122
10.15000 701.78924
10.25000 680.59373
10.35000 667.51874
10.45000 645.53499
10.55000 650.51855
10.65000 641.13503
10.75000 617.30056
10.85000 614.77776
10.95000 592.61203
11.05000 608.71968
11.15000 559.34065
11.25000 543.74278
11.35000 581.74161
11.45000 544.62685
11.55000 515.16671
11.65000 528.21038
11.75000 508.35525
11.85000 508.17364
11.95000 495.76230
12.05000 479.55022
12.15000 449.50885
12.25000 479.97868
12.35000 509.97023
12.45000 457.66129
12.55000 440.92167
12.65000 422.33993
12.75000 465.98227
12.85000 405.09782
12.95000 416.61908
13.05000 398.20160
13.15000 418.97947
13.25000 388.09638
13.35000 397.96234
13.45000 407.43763
13.55000 383.58689
13.65000 404.79044
13.75000 368.91747
13.85000 356.86964
13.95000 341.81216
14.05000 340.81685
14.15000 331.80218
14.25000 338.34147
14.35000 301.22921
14.45000 335.66372
14.55000 311.25311
14.65000 317.66897
14.75000 310.66319
14.85000 300.16933
14.95000 300.47511
15.05000 310.75308
15.15000 295.93218
15.25000 288.17172
15.35000 280.52933
15.45000 285.01740
15.55000 264.79046
15.65000 247.99027
15.75000 260.30116
15.85000 256.81484
15.95000 263.56371
16.05000 246.13183
16.15000 253.69409
16.25000 244.00429
16.35000 246.55161
16.45000 238.08119
16.55000 232.69831
16.65000 212.61029
16.75000 227.22936
16.85000 206.31074
16.95000 212.32231
17.05000 215.35188
17.15000 216.61676
17.25000 222.17948
17.35000 205.62072
17.45000 200.95543
17.55000 198.84574
17.65000 186.74324
17.75000 185.29818
17.85000 182.21143
17.95000 187.44495
18.05000 194.11715
18.15000 185.33516
18.25000 168.05585
18.35000 174.17150
18.45000 150.13971
18.55000 171.89228
18.65000 175.46226
18.75000 164.56678
18.85000 168.58625
18.95000 159.61496
19.05000 155.98157
19.15000 167.50543
19.25000 163.20206
19.35000 158.96610
19.45000 151.44881
19.55000 145.37153
19.65000 159.27079
19.75000 139.11698
19.85000 136.08174
19.95000 144.92154
