0.05000 -1249.87901 -599.09047 69.38872 1361.30979 1289.32539 1540.86225
0.15000 -1927.57445 -87.16099 132.74740 1334.59398 1393.31714 2561.21841
0.25000 -2789.19616 134.49222 -238.93657 1242.36016 1186.11223 3423.04072
0.35000 -3478.87963 94.92067 66.43043 1207.03473 1152.00431 4379.20001
0.45000 -4114.71116 90.94898 -257.97348 1440.73626 1057.82015 5105.16675
0.55000 -4520.14701 114.63092 -332.93066 1440.91791 958.31128 5590.78489
0.65000 -4824.24382 138.33917 -46.61258 1464.52111 866.74244 5951.37643
0.75000 -5142.38854 110.26261 -120.59641 1485.19079 805.31688 6133.27505
0.85000 -5342.74034 99.22959 -185.80456 1449.62041 755.28105 6253.77185
0.95000 -5581.32502 82.02431 -284.01922 1454.65972 740.33054 6260.61615
1.05000 -5772.08302 91.45693 -246.62381 1471.08792 703.48919 6314.70974
1.15000 -5955.37592 120.35757 -107.55976 1410.55200 707.22587 6202.82731
1.25000 -6080.53279 95.15980 60.02591 1390.70313 695.12142 6186.81160
1.35000 -6206.71251 106.09001 -177.50541 1347.23373 671.39507 6078.79062
1.45000 -6338.55347 114.32608 58.15596 1319.65153 665.37828 5937.15211
1.55000 -6439.76361 104.74847 30.25342 1262.83501 643.19150 5851.80950
1.65000 -6535.74032 115.28684 18.14511 1214.22993 638.64071 5663.20344
1.75000 -6558.17486 103.24072 -71.43310 1216.65919 626.64605 5622.87322
1.85000 -6659.07893 115.21913 122.98849 1137.00480 626.01612 5368.65869
1.95000 -6689.06899 121.38323 -31.94871 1091.91196 616.96803 5259.29082
2.05000 -6749.70469 115.73545 -111.11330 1012.05118 628.74977 5102.34274
2.15000 -6759.95756 110.61664 -54.02728 1015.72901 603.16577 5072.94166
2.25000 -6884.28772 104.73562 44.41621 927.80515 600.22589 4804.42662
2.35000 -6897.22081 114.10170 100.23929 924.67891 583.51802 4750.86046
2.45000 -6927.90378 104.16447 68.46215 881.83577 574.59002 4632.75565
2.55000 -6942.08458 115.56674 -107.03771 878.89510 562.96655 4529.98711
2.65000 -6968.66451 101.64746 -5.50150 819.93114 550.91407 4389.99596
2.75000 -6978.82287 97.52410 30.15792 773.93538 534.25591 4279.84800
2.85000 -7000.40485 93.97656 57.75435 756.60685 522.43589 4136.54813
2.95000 -6969.11258 99.63082 -78.74622 752.51827 502.10846 4082.66805
3.05000 -6965.69214 91.23939 135.08346 692.29135 486.84468 3978.68320
3.15000 -6950.70493 107.02989 -50.02256 693.80836 481.86976 3916.57974
3.25000 -6962.33939 100.22991 25.60051 643.53576 454.33475 3773.58045
3.35000 -6931.57753 101.73128 -19.13444 640.20502 447.30401 3685.88612
3.45000 -6920.76042 89.95147 10.71720 581.66192 429.63437 3591.95265
3.55000 -6884.02895 95.15226 -13.14475 545.95497 412.09504 3553.89536
3.65000 -6865.79124 91.94726 73.29659 539.24975 397.19286 3409.31585
3.75000 -6831.45914 90.04617 37.14819 529.55841 388.38758 3315.79393
3.85000 -6816.91368 90.61779 -44.92537 518.05703 376.27252 3216.94994
3.95000 -6803.31573 86.16186 10.52599 491.15747 363.53709 3163.38337
4.05000 -6762.74189 86.37230 1.16124 513.21011 352.58350 3137.18335
4.15000 -6755.70995 85.88133 7.69502 474.80582 344.75611 3001.99413
4.25000 -6721.73484 91.82104 13.58237 472.77798 333.17679 2935.41020
4.35000 -6682.97965 74.92659 27.04146 458.04958 318.67988 2895.78417
4.45000 -6646.83491 77.46353 58.93547 449.69373 307.76170 2816.42396
4.55000 -6603.43340 87.42694 71.16870 431.93798 298.86393 2766.24097
4.65000 -6571.57736 80.41395 -7.25740 415.13937 290.80286 2682.11003
4.75000 -6549.62285 73.31418 -5.20605 422.17130 284.09423 2591.43478
4.85000 -6503.89715 72.49300 86.19930 407.83985 270.47284 2567.41269
4.95000 -6484.18765 71.12611 9.53183 391.54417 263.61056 2496.45386
5.05000 -6448.49964 77.45042 45.55852 386.83731 257.75130 2454.14197
5.15000 -6410.61436 73.75108 20.00515 386.41048 251.92862 2402.10246
5.25000 -6376.40314 74.21036 35.31336 371.91504 242.44487 2325.86753
5.35000 -6339.30009 70.72059 -1.68172 355.56961 233.64788 2263.48818
5.45000 -6289.21850 70.63412 21.03010 349.12776 232.02876 2222.98758
5.55000 -6258.60013 66.16176 -3.70754 346.70865 218.73481 2189.51718
5.65000 -6220.42369 68.09114 14.49155 346.24042 217.82134 2112.80269
5.75000 -6195.35789 67.73402 13.46608 322.40601 213.28548 2035.66568
5.85000 -6149.36554 63.54938 79.72486 316.72713 203.77319 2020.25544
5.95000 -6105.71696 62.22136 -19.61500 323.92282 193.70321 1994.25055
6.05000 -6071.26329 67.28088 42.41926 313.45538 192.40537 1934.67142
6.15000 -6029.75446 66.80319 30.48827 302.29502 191.09980 1917.21673
6.25000 -5989.61993 63.86135 63.27953 306.99871 188.80273 1875.47088
6.35000 -5960.71206 59.84926 16.77136 287.88121 184.10076 1839.03580
6.45000 -5928.57354 59.57933 34.37114 288.99423 178.78534 1783.03105
6.55000 -5890.73089 58.07731 19.96080 273.56947 179.14793 1747.94682
6.65000 -5851.65307 55.61932 46.84570 270.21202 172.02385 1681.08477
6.75000 -5816.10371 50.48052 59.49021 259.31468 169.18534 1666.35987
6.85000 -5773.21360 56.28784 47.49795 252.18077 160.13109 1627.77497
6.95000 -5732.19481 54.36437 69.33648 252.49181 157.02678 1587.41035
7.05000 -5692.08270 54.90556 23.07468 243.62635 160.40583 1553.46701
7.15000 -5644.88857 53.80953 20.16931 254.51122 157.61124 1549.62152
7.25000 -5611.16470 49.77511 -11.16826 226.21279 148.80445 1498.08095
7.35000 -5573.38292 50.50736 33.97976 228.54386 149.17575 1448.30482
7.45000 -5530.78161 47.39754 9.89188 223.97740 146.94685 1427.13517
7.55000 -5486.05579 45.73923 38.57255 223.02151 136.27879 1409.54926
7.65000 -5457.12844 46.68682 60.09227 216.30906 138.18270 1354.10063
7.75000 -5414.94111 48.45029 42.78485 223.56832 136.23829 1338.37796
7.85000 -5377.20442 45.36333 41.79703 210.88434 134.78919 1319.54059
7.95000 -5342.83751 43.83164 18.90063 216.05353 137.65437 1267.98488
8.05000 -5300.80020 46.63427 28.33559 209.86717 138.47427 1257.11212
8.15000 -5264.10228 43.51466 38.39554 205.47428 129.44026 1241.63854
8.25000 -5228.36589 44.69534 21.91059 199.54007 128.61251 1192.55949
8.35000 -5190.32217 41.41269 33.73561 204.08288 127.29403 1178.58735
8.45000 -5155.69066 43.77468 11.43394 193.65369 123.66922 1138.70336
8.55000 -5125.50300 43.00891 47.43565 190.63904 126.03978 1117.30366
8.65000 -5079.66634 39.48044 37.84162 193.93651 118.11087 1117.28696
8.75000 -5045.44542 40.42724 34.24109 185.94592 118.28793 1084.11896
8.85000 -5007.64192 35.73192 14.41962 181.34884 115.27630 1066.54483
8.95000 -4969.57902 37.05675 5.77810 179.41499 111.20727 1049.33253
9.05000 -4935.32988 37.60188 33.64693 180.15962 109.43032 1025.35993
9.15000 -4900.01050 39.71888 -2.53684 171.18506 107.47790 992.55610
9.25000 -4855.90077 39.40866 -17.50781 182.31870 104.16208 986.41144
9.35000 -4818.47404 37.61091 -4.42457 164.08635 106.48054 963.39084
9.45000 -4782.25073 36.99496 -35.85017 165.38367 105.09475 942.23299
9.55000 -4737.11299 34.42902 5.31612 168.40600 106.93141 934.64684
9.65000 -4703.87659 34.51004 -43.49545 150.70958 103.46335 897.18261
9.75000 -4668.75494 33.50296 -39.35686 145.94505 100.71842 887.36290
9.85000 -4630.70710 33.47642 -9.63289 143.77359 99.53753 843.07178
9.95000 -4590.28979 36.21279 -30.48118 142.21583 95.28705 852.60456
10.05000 -4554.91993 32.39024 -42.91408 144.86104 94.10417 832.13924
10.15000 -4518.35694 33.01181 -51.12723 136.55481 98.83240 803.92868
10.25000 -4484.87707 27.31283 -51.90051 131.60413 95.03495 783.06051
10.35000 -4449.27631 30.91317 -30.38100 126.94325 89.21879 777.68148
10.45000 -4412.07797 29.52939 -65.42854 131.93861 96.42565 769.96971
10.55000 -4382.47070 31.19080 -25.84812 124.68742 88.88824 753.83647
10.65000 -4346.18626 28.04026 -52.14702 121.63082 92.63324 731.00100
10.75000 -4315.25663 29.35141 -50.39305 118.21778 97.77983 723.43189
10.85000 -4283.89301 28.93555 -26.91781 123.02065 92.12067 700.28040
10.95000 -4259.77750 29.40149 -56.02167 119.27216 87.75034 676.54060
11.05000 -4224.19212 29.38217 -56.40549 113.23923 82.89428 673.28960
11.15000 -4191.42711 24.59322 -41.17594 112.24831 90.76733 671.75336
11.25000 -4165.74786 27.51345 -31.85249 113.66875 85.19140 653.03294
11.35000 -4132.51692 26.99427 -32.64694 115.08852 81.80327 637.69540
11.45000 -4110.07935 24.55883 -41.90440 104.98712 80.25073 613.77534
11.55000 -4078.30352 23.03993 -40.85712 113.16479 75.29995 607.49733
11.65000 -4043.83812 24.65956 -34.04164 107.18279 82.19282 601.16400
11.75000 -4014.24746 25.88558 -51.92547 112.17353 79.38738 591.82296
11.85000 -3985.82226 24.58440 -14.66269 106.43519 83.64127 569.10896
11.95000 -3957.31161 20.92782 -41.89654 102.78864 75.27716 575.30533
12.05000 -3928.36602 24.04034 -25.00380 101.64902 79.32174 564.39532
12.15000 -3900.81395 21.99119 -16.39999 101.56232 78.64347 542.12967
12.25000 -3875.50229 23.81493 -14.19500 99.51335 75.81040 520.85817
12.35000 -3842.45729 22.62186 -16.95218 99.48847 70.36460 509.97157
12.45000 -3812.62995 22.59261 -15.85942 91.15623 71.00061 514.38513
12.55000 -3783.63680 23.79706 -39.12150 92.11831 71.32253 502.34354
12.65000 -3750.44654 20.76201 -15.04731 92.66324 71.37667 491.55826
12.75000 -3724.79658 19.86022 -24.55341 93.00012 73.03793 483.05162
12.85000 -3699.19212 20.11640 -34.21388 89.73791 71.38748 476.31812
12.95000 -3673.06439 17.95127 -16.41624 92.11359 82.11026 453.37857
13.05000 -3644.00770 17.70425 3.29593 90.40261 72.74250 454.21863
13.15000 -3617.73637 19.22678 -25.44835 86.86892 73.70988 451.45405
13.25000 -3593.44106 19.44888 -9.74846 89.09326 65.95039 439.80326
13.35000 -3570.35382 18.63900 -21.13484 89.90312 70.94219 431.88642
13.45000 -3541.86488 19.51314 -14.96825 84.95904 63.56653 424.78666
13.55000 -3515.51973 20.38471 0.44232 85.27512 74.05560 412.44688
13.65000 -3488.97735 18.66128 2.08201 90.25399 69.12993 404.95697
13.75000 -3465.94699 19.94829 -0.35693 85.38359 72.74654 395.56317
13.85000 -3441.14310 19.50907 -29.43921 79.40359 66.13792 390.59639
13.95000 -3418.05160 16.93637 -10.78896 77.25682 69.49444 379.84601
14.05000 -3385.98569 15.73995 -15.96542 74.52967 69.17848 382.10409
14.15000 -3366.76900 15.60012 -26.61453 72.85527 61.67718 372.01615
14.25000 -3341.01890 18.58028 -12.31618 69.71594 64.56621 365.90949
14.35000 -3316.76722 14.41727 -23.41123 71.07690 59.46495 353.64021
14.45000 -3294.76762 15.81472 -8.68269 64.63799 61.63461 356.31481
14.55000 -3273.05940 18.29142 -23.29220 69.38578 61.26938 343.17801
14.65000 -3250.66586 17.04386 -14.87916 68.36998 65.76096 336.82037
14.75000 -3229.00765 19.24414 -12.98710 64.17381 58.07296 332.53482
14.85000 -3208.17530 16.74667 -13.29419 62.79119 60.82781 325.36991
14.95000 -3185.81415 16.04748 -21.87853 68.31311 54.61411 330.10087
15.05000 -3164.40081 14.27579 -10.10044 61.95352 56.54842 315.61057
15.15000 -3145.99805 16.99562 -13.50333 66.63857 56.20329 305.90945
15.25000 -3121.26632 14.16894 -25.75314 65.40823 55.23335 316.71080
15.35000 -3099.94965 14.40186 -17.58236 59.38299 55.63377 302.39467
15.45000 -3084.98618 16.68999 -21.22362 62.45068 58.47087 300.88556
15.55000 -3059.14568 13.29703 -19.77680 69.28920 60.39356 296.55260
15.65000 -3043.89832 14.66075 -17.30736 58.91408 54.93998 284.37165
15.75000 -3026.21599 17.53130 -25.70571 79.10792 64.00343 280.57086
15.85000 -3003.27721 16.46406 -18.20540 61.71313 59.98367 279.13411
15.95000 -2988.12683 14.80130 -32.93341 68.47034 59.36236 269.81150
16.05000 -2972.87315 12.97985 -17.54478 65.35694 57.71060 275.87740
16.15000 -2954.00464 13.23609 -15.78160 57.43984 55.73712 254.91130
16.25000 -2936.61337 13.85384 -31.06701 68.07481 66.29976 259.45689
16.35000 -2913.80129 14.46100 -23.80409 50.01380 50.95165 251.77391
16.45000 -2895.21639 12.84076 -20.09699 49.37376 48.31738 251.33377
16.55000 -2879.78732 12.13136 -10.73301 62.89840 56.96772 257.37714
16.65000 -2859.07313 11.19167 -36.67033 54.73020 49.57053 242.90184
16.75000 -2839.89303 11.18048 -30.69679 49.62870 42.55675 237.40755
16.85000 -2824.06572 13.69740 -14.69213 56.01949 47.37020 232.25761
16.95000 -2800.88845 13.51558 -29.86589 52.90425 40.78509 235.08725
17.05000 -2787.46971 11.37192 -20.10486 61.47064 55.12191 226.51751
17.15000 -2769.12507 12.38353 -10.60799 52.84988 51.79319 218.12508
17.25000 -2749.87554 12.61478 -22.45104 50.48747 47.55801 230.45104
17.35000 -2729.69838 12.40824 -14.68025 52.37117 45.45193 221.06942
17.45000 -2717.98935 8.80055 -21.12329 60.62825 53.66334 209.47568
17.55000 -2702.03463 14.93595 -26.99941 60.55970 60.27847 213.55669
17.65000 -2679.97991 13.13780 -17.10902 53.90647 49.89884 201.89871
17.75000 -2665.55471 10.37882 -22.29776 46.75836 41.73255 198.46068
17.85000 -2644.80188 9.72045 -16.69376 46.81881 45.37500 198.29824
17.95000 -2630.00379 11.18293 -24.80690 46.65636 46.77509 187.61759
18.05000 -2612.35448 9.89902 -13.73290 50.75760 44.90167 192.03331
18.15000 -2597.53101 12.94908 -14.22088 49.07333 60.50804 195.15502
18.25000 -2581.68428 8.77562 -11.39688 46.60189 47.76714 186.15106
18.35000 -2563.73405 11.26221 -21.43139 62.58967 44.37199 185.02244
18.45000 -2547.61473 10.76237 -19.13156 43.95257 40.92881 182.91523
18.55000 -2529.26369 8.73765 -10.67737 60.06389 53.80299 178.36359
18.65000 -2517.83328 9.74998 -9.26990 51.66670 52.15166 179.14342
18.75000 -2505.06629 10.94814 -10.06397 47.90795 50.01832 173.04471
18.85000 -2489.95261 10.91667 -11.68235 41.30023 43.04252 166.30789
18.95000 -2474.12048 5.94059 -7.48055 41.85159 52.79648 168.50059
19.05000 -2459.82136 9.35107 -12.02165 57.36833 43.98277 165.81094
19.15000 -2443.54574 8.01117 -5.59660 43.90135 35.73931 169.29248
19.25000 -2434.19195 6.72887 -14.96272 44.69011 40.74973 160.21287
19.35000 -2416.96165 9.05291 -11.08310 44.75676 46.56242 162.59191
19.45000 -2400.09784 11.25591 -16.79349 57.65054 49.44093 159.04482
19.55000 -2392.65811 7.61929 -16.75604 40.97552 53.56355 152.26538
19.65000 -2374.99187 9.98504 -9.60943 39.31473 37.61207 148.02062
19.75000 -2361.47645 6.54168 2.23813 38.10034 29.01784 148.41278
19.85000 -2347.80945 8.41133 -5.54544 48.91390 42.33662 146.16381
19.95000 -2331.60926 5.47056 -12.37796 37.35987 49.31982 146.56156
