0.05000 2558.41691 -2849.57353 -1954.13224 1679.95839 1276.35677 394.05396
0.15000 2732.70232 -1718.19749 -1816.33442 900.50803 2026.27355 559.96679
0.25000 -192.99816 -160.38551 -1800.07112 2928.27900 2692.18838 672.98638
0.35000 183.65780 143.11333 -1953.89400 2953.88044 2927.96020 1052.62202
0.45000 -228.37666 611.23840 -1868.14426 2629.48071 2667.28092 840.79387
0.55000 -24.18406 -82.68043 -1794.08917 2518.21818 2847.72355 1305.42945
0.65000 -455.63476 111.02660 -1609.30714 2324.37866 2890.21594 1327.19588
0.75000 -325.07552 -99.22153 -1655.95840 2500.62461 2576.84588 1350.96426
0.85000 -341.92316 -214.61797 -1436.84674 2314.84582 2745.22539 1547.58653
0.95000 -848.83903 58.10580 -1375.52162 2248.96428 2662.31476 1656.95404
1.05000 -1023.88601 61.72719 -1371.88021 2138.08982 2541.52814 1714.00156
1.15000 -999.16083 -196.84652 -1324.93528 2051.18345 2518.71561 1870.92773
1.25000 -1284.98889 26.96077 -1048.88048 1877.54301 2557.31651 2046.19605
1.35000 -1625.06991 25.94971 -1065.43672 1720.42539 2499.54917 2102.45388
1.45000 -1703.89946 -27.69129 -870.90459 1708.53370 2287.41380 2376.94228
1.55000 -2069.12058 29.85165 -677.29790 1521.90407 2255.84384 2302.94156
1.65000 -2268.74051 85.73491 -375.02656 1475.17997 2197.46150 2400.72923
1.75000 -2478.46524 225.18004 -543.79916 1449.84563 1992.69318 2402.93409
1.85000 -2576.24655 -57.75606 -377.99720 1384.50328 1918.67232 2476.10897
1.95000 -2667.81433 -32.89056 -218.48253 1389.16036 1878.54155 2505.76528
2.05000 -2716.83875 36.73019 -421.22488 1278.37661 1718.74301 2491.84233
2.15000 -2835.71076 -55.26047 -295.53281 1286.23216 1651.57751 2479.53702
2.25000 -2887.32731 51.46503 -235.68967 1270.73582 1558.92017 2475.73574
2.35000 -2920.09154 -87.34152 -263.07526 1217.67489 1476.80871 2475.61902
2.45000 -2970.29486 -0.64543 -256.62637 1208.14947 1441.39109 2440.22190
2.55000 -2976.17009 8.85027 -288.24823 1219.76952 1375.42917 2452.49836
2.65000 -2920.76979 -93.74794 -195.82714 1175.86247 1358.62583 2475.34439
2.75000 -2946.51244 3.19851 -231.17435 1183.64548 1270.86152 2487.19982
2.85000 -2959.06345 19.68726 -291.65845 1181.57999 1220.79391 2427.53369
2.95000 -3007.67108 15.67980 -241.30067 1073.87519 1189.45618 2382.44831
3.05000 -2980.94820 44.53574 -157.12685 1129.44306 1156.79708 2438.25617
3.15000 -2991.67401 -16.85819 -172.75315 1056.79402 1129.08409 2402.24469
3.25000 -3047.11511 -33.84423 -249.83207 1059.00712 1055.40079 2342.16015
3.35000 -2998.42869 -10.65715 -132.72919 1095.64636 1052.14383 2396.36766
3.45000 -3030.91115 -19.05273 -45.18873 1042.21761 1003.44862 2339.08861
3.55000 -2950.99124 -20.13450 -231.47136 1073.32325 976.37359 2408.00940
3.65000 -2993.47754 21.79136 -116.25415 1047.33423 965.15080 2368.36237
3.75000 -3012.77809 8.10403 -70.27279 1025.47553 932.07148 2329.97033
3.85000 -2985.11080 1.85056 -104.05880 1065.38791 898.59505 2349.15245
3.95000 -2978.64331 10.39249 -25.12259 1060.45082 884.63672 2356.91592
4.05000 -3018.28667 30.23693 -42.00230 1015.11975 858.38506 2306.03994
4.15000 -3004.16267 -16.46691 -73.75580 999.39248 827.33105 2327.67311
4.25000 -2974.35857 -15.42624 -101.72569 973.91923 794.21241 2314.40427
4.35000 -2976.71007 -25.54975 -16.42960 1004.19572 770.04366 2298.73178
4.45000 -2978.15019 17.33670 -7.51229 968.55506 746.82867 2267.62442
4.55000 -2958.04960 -42.26535 34.05863 963.03106 733.15671 2266.59926
4.65000 -2942.05755 24.04950 -45.93776 963.74439 733.25177 2234.03491
4.75000 -2915.60908 -25.02892 -70.91447 944.03184 715.62311 2268.77481
4.85000 -2927.25464 -25.32927 -23.58720 923.68426 680.54590 2232.55225
4.95000 -2929.92448 -3.28576 -10.51946 955.68456 677.97705 2213.06903
5.05000 -2882.87607 -5.43964 -137.28895 947.87646 653.44562 2229.79957
5.15000 -2863.95579 -6.05947 -30.02429 953.33040 625.22492 2222.49725
5.25000 -2902.94140 -8.92679 -107.61947 911.96058 600.98346 2167.11011
5.35000 -2854.82585 3.53036 20.62759 911.62604 623.34659 2203.42553
5.45000 -2861.48671 7.19444 9.02636 903.78223 643.42265 2187.43080
5.55000 -2865.30989 -15.23986 -72.80603 914.64029 592.80145 2135.67072
5.65000 -2855.86061 -9.42780 -60.36419 871.25483 572.48284 2117.29550
5.75000 -2823.83357 27.97335 -31.07397 899.25820 573.48389 2137.56791
5.85000 -2772.68788 -10.67262 -127.74877 907.22194 553.82047 2152.47600
5.95000 -2763.99894 14.42131 -45.34674 868.69699 519.28825 2144.29608
6.05000 -2810.05684 4.67911 -14.85743 827.75574 507.69497 2076.10768
6.15000 -2779.65881 11.23593 8.88238 857.68212 500.53940 2075.19831
6.25000 -2767.44392 6.84063 -8.41001 859.94345 538.19064 2080.54994
6.35000 -2733.51655 -15.44291 28.85787 863.97951 502.94741 2088.23780
6.45000 -2735.10504 4.99277 -11.56885 847.48440 512.61875 2060.68201
6.55000 -2692.58742 12.10278 -16.44396 868.17768 458.85374 2084.12719
6.65000 -2698.88739 -3.80715 9.43807 853.37308 492.25360 2046.74902
6.75000 -2677.27112 -10.25173 -43.00880 847.90948 453.61659 2065.78867
6.85000 -2688.79387 6.46031 34.81408 802.16675 442.12788 2026.42039
6.95000 -2686.53686 5.47651 39.69952 799.22962 444.19017 2009.28834
7.05000 -2647.19386 -10.22945 -2.52962 835.70880 420.96664 2010.67871
7.15000 -2647.69647 -26.74675 -25.28034 826.28015 429.32952 1994.88884
7.25000 -2656.59408 -3.48311 10.49800 792.31230 424.83976 1957.71687
7.35000 -2635.60729 3.04222 7.53242 804.41628 421.04609 1956.61638
7.45000 -2634.70053 -10.81017 29.58726 779.09812 404.29050 1942.44963
7.55000 -2578.20702 8.25511 77.19195 820.69357 409.13919 1977.29809
7.65000 -2578.75066 -2.16364 -72.97396 807.95130 414.33631 1941.50756
7.75000 -2577.08420 -3.23287 -29.86142 810.27731 361.52730 1915.25339
7.85000 -2602.88730 5.88074 38.69887 753.70880 373.44867 1877.88967
7.95000 -2569.41210 2.58172 -35.40541 761.10461 386.91798 1893.07258
8.05000 -2539.87884 14.23031 79.65753 781.10750 400.48905 1901.74888
8.15000 -2489.93761 0.00390 3.78788 789.78277 388.57506 1929.93147
8.25000 -2511.11512 -0.72784 6.54365 755.34478 339.69271 1882.78925
8.35000 -2511.12863 -9.30296 13.87260 763.46404 341.02318 1859.14228
8.45000 -2505.51265 2.39219 -38.48371 743.55318 338.53158 1829.03527
8.55000 -2497.65323 0.81061 50.66758 769.24525 332.01890 1816.88209
8.65000 -2467.01989 7.20382 -8.59317 752.59400 347.59138 1840.18189
8.75000 -2460.14383 2.51201 67.29047 744.32027 342.31932 1837.36799
8.85000 -2436.80442 3.60529 24.19851 730.29435 317.83816 1825.40138
8.95000 -2412.18715 1.41243 -19.18268 740.46731 308.07563 1821.76720
9.05000 -2397.33592 0.39465 2.04677 743.50108 313.15830 1809.94708
9.15000 -2385.10660 -0.56281 -24.55950 733.44608 337.23508 1810.34896
9.25000 -2419.29185 0.25967 9.25332 709.30711 291.51021 1744.50239
9.35000 -2395.61008 5.23990 66.83304 715.46422 298.78900 1740.36827
9.45000 -2362.49889 -0.91089 -8.33647 706.16989 304.33752 1756.28230
9.55000 -2366.21207 -11.02556 92.53682 678.80222 284.46274 1737.27445
9.65000 -2344.11156 -3.69844 -21.18552 700.48606 285.64017 1733.40942
9.75000 -2319.28623 -1.78621 69.25565 720.79514 306.86228 1744.30310
9.85000 -2332.65337 12.24835 31.70948 675.41751 274.32144 1705.64611
9.95000 -2305.77474 5.11979 44.71374 683.32615 264.50666 1727.25341
10.05000 -2305.63457 2.70134 49.43326 676.42355 266.27877 1697.23599
10.15000 -2285.49303 7.23182 59.20447 680.54473 266.02792 1688.98831
10.25000 -2254.14033 -6.06548 2.49221 675.86169 275.90274 1698.92682
10.35000 -2268.92593 5.73004 26.24737 671.07040 247.85206 1655.71604
10.45000 -2248.12601 -2.05654 3.50702 661.77877 256.78470 1676.14681
10.55000 -2245.55151 1.33662 -6.79668 657.26278 236.10794 1649.77642
10.65000 -2245.30442 1.34209 26.55263 661.23077 253.01133 1632.26182
10.75000 -2211.08621 8.26210 7.06065 655.95751 259.52547 1637.21995
10.85000 -2187.08760 -5.75189 33.02401 657.26586 229.00666 1651.22291
10.95000 -2187.91345 -2.19981 53.77777 671.24554 226.71577 1620.18219
11.05000 -2186.45167 -1.27701 48.46521 655.60405 272.22177 1601.84366
11.15000 -2165.61060 -1.06293 33.14985 645.15563 222.41361 1612.52662
11.25000 -2166.58550 3.31651 -5.76336 632.47914 221.02747 1580.19888
11.35000 -2138.59174 -1.84212 -22.40111 652.64303 239.11565 1598.09149
11.45000 -2137.25040 -1.59501 40.85490 652.73637 231.90371 1583.46522
11.55000 -2116.22959 4.80979 8.47063 630.44653 209.92824 1581.87036
11.65000 -2103.93221 -0.61252 1.05068 641.63328 232.23970 1567.40482
11.75000 -2084.97335 -3.09352 -17.13212 628.87547 275.65704 1581.34250
11.85000 -2095.54316 8.29671 24.68214 625.20629 254.56023 1549.68953
11.95000 -2086.27860 -6.30240 44.04176 624.50037 215.72676 1537.02887
12.05000 -2076.79885 -4.03202 56.08290 626.90945 230.94569 1532.43921
12.15000 -2078.01676 -3.16768 37.73605 598.63959 199.59122 1508.98817
12.25000 -2050.47383 1.20518 45.94218 598.65391 193.78165 1518.51855
12.35000 -2057.36596 -3.11788 3.09244 602.33604 189.69463 1496.03163
12.45000 -2013.76135 -1.87518 -52.90648 604.20282 214.84955 1518.80423
12.55000 -2026.72202 -0.43891 -3.21870 589.27205 186.86983 1491.11185
12.65000 -2034.39016 -1.75095 18.99056 595.31888 188.27289 1459.88435
12.75000 -1992.74740 -3.46616 61.46930 597.86478 194.78069 1494.61030
12.85000 -1983.98369 2.48155 23.35371 596.42783 181.75631 1473.60967
12.95000 -1984.95720 -3.32887 5.99559 582.70911 184.42892 1456.67185
13.05000 -1971.55022 -0.58200 13.29867 587.03405 190.63628 1459.05037
13.15000 -1983.19768 0.97041 60.82443 569.97029 222.80286 1431.43900
13.25000 -1957.42369 3.84648 24.93960 577.91042 168.60684 1432.03798
13.35000 -1949.16378 -0.68903 14.94589 571.96433 187.73394 1432.98416
13.45000 -1939.72622 -7.52695 38.29688 562.28391 173.12879 1430.27619
13.55000 -1912.76185 -0.27780 46.89342 574.62375 174.52165 1438.40595
13.65000 -1921.36872 1.06393 51.51303 561.76792 165.06531 1413.31774
13.75000 -1902.38477 0.00368 4.06304 560.03759 158.12926 1421.90605
13.85000 -1907.15564 -1.17392 17.53256 544.44397 159.33603 1400.11541
13.95000 -1878.46261 -2.40784 -10.61741 576.02973 183.11442 1413.18192
14.05000 -1872.99999 -4.02923 -8.00083 554.12508 156.54140 1403.40786
14.15000 -1860.29337 -0.07372 40.31122 563.35348 154.72190 1400.00785
14.25000 -1867.48295 -3.20774 45.67222 554.84735 156.51676 1370.30380
14.35000 -1852.86869 -3.33420 23.06460 542.64218 145.75831 1373.03818
14.45000 -1838.56941 -0.35251 40.53195 536.61590 151.89588 1380.14659
14.55000 -1832.04942 1.24840 -12.40001 533.28760 146.60424 1365.74426
14.65000 -1831.83088 -0.63160 49.95572 528.24855 184.96357 1355.37899
14.75000 -1817.02602 -0.34311 -5.65937 532.23787 178.69159 1358.76640
14.85000 -1821.85745 -3.29841 5.95082 520.52089 140.21154 1331.47191
14.95000 -1818.82977 -0.14337 3.54597 527.50000 140.26246 1315.39159
15.05000 -1805.51311 1.74588 -15.94259 518.13782 136.06595 1315.04172
15.15000 -1797.75643 -0.05390 21.26872 518.82067 136.85043 1303.74941
15.25000 -1780.63207 1.79529 20.21954 522.60952 142.36027 1312.22377
15.35000 -1766.50946 1.40827 59.75626 529.44550 176.95501 1313.58268
15.45000 -1767.54523 -1.57061 -25.81333 507.16800 125.92503 1292.56226
15.55000 -1767.36684 -0.95803 -4.98434 499.67595 133.72014 1285.39342
15.65000 -1744.26024 2.77712 55.70707 503.25506 133.01210 1293.46421
15.75000 -1735.17984 -2.52669 -40.34299 515.39146 125.93578 1280.38684
15.85000 -1736.09977 0.11268 33.41353 506.16081 123.84960 1267.80941
15.95000 -1722.58665 -0.85871 42.45348 496.48343 124.95173 1275.31137
16.05000 -1708.01518 -2.78012 15.38107 516.74726 128.36670 1272.76870
16.15000 -1713.67998 -1.32911 44.18309 498.13988 149.97377 1250.45998
16.25000 -1692.08275 0.58760 -5.57929 500.20457 143.65344 1261.03394
16.35000 -1691.51764 2.53246 38.83724 498.24645 128.34218 1244.67615
16.45000 -1685.35017 0.83493 -0.49714 494.46609 115.93069 1236.15227
16.55000 -1684.29634 0.96346 59.72384 476.98818 120.40518 1223.62925
16.65000 -1671.43559 0.15873 -4.97784 482.38624 129.34218 1224.90868
16.75000 -1653.13968 3.56745 25.72278 501.40301 118.52449 1229.67555
16.85000 -1670.59222 3.22290 24.21519 463.52930 109.32761 1194.97432
16.95000 -1650.98449 0.47858 13.34316 476.51251 121.01017 1208.33134
17.05000 -1638.60327 -0.47098 31.75574 486.88140 141.70151 1210.89038
17.15000 -1626.74965 -0.18125 32.37977 482.58331 118.69060 1200.92011
17.25000 -1626.98543 -0.81116 15.18132 487.89167 112.17924 1190.23799
17.35000 -1602.26127 -1.46495 32.50845 479.82670 113.84303 1207.90133
17.45000 -1616.00975 -3.35606 38.14461 472.28853 117.49241 1176.97622
17.55000 -1613.00250 -0.10033 -53.42360 460.99293 103.38307 1167.13276
17.65000 -1583.72142 1.62040 13.48406 467.40452 125.50544 1191.82408
17.75000 -1581.85910 -0.13688 -3.76513 463.32366 114.49143 1175.18280
17.85000 -1571.37316 -1.76776 41.69530 476.40930 123.98702 1167.92410
17.95000 -1574.25198 -0.26403 0.01061 457.76742 123.31331 1157.12098
18.05000 -1550.23411 -2.32814 8.60526 464.11450 128.91796 1169.38074
18.15000 -1559.99864 2.55641 43.68062 455.59430 99.77215 1150.19724
18.25000 -1533.09693 -3.32360 -3.53169 459.90708 99.44518 1161.19310
18.35000 -1552.96312 2.41301 16.20863 445.26573 95.38377 1126.84508
18.45000 -1534.41405 -2.58754 25.04616 454.35288 97.32533 1133.88181
18.55000 -1532.17828 0.82496 7.32866 440.99684 95.73759 1132.36474
18.65000 -1534.63840 -3.87495 42.82910 440.04749 105.74161 1110.94470
18.75000 -1498.45111 0.05485 11.57709 453.25472 113.93042 1139.44614
18.85000 -1500.90207 -0.02866 49.48939 444.66958 118.99691 1126.71922
18.95000 -1502.06803 -1.94618 12.11216 452.37529 118.88468 1109.84361
19.05000 -1504.73877 1.08003 -2.97891 434.29534 102.06680 1100.62545
19.15000 -1484.67041 1.34676 10.75370 430.06049 99.66011 1107.52587
19.25000 -1475.00591 1.10704 11.25054 433.56762 91.10474 1109.22362
19.35000 -1471.68990 -0.03655 -7.93256 426.59855 89.96944 1095.53190
19.45000 -1494.53055 -1.14999 33.99420 430.24717 102.67161 1053.48945
19.55000 -1465.30085 0.45141 26.53503 424.97775 102.08930 1081.62671
19.65000 -1458.39478 -0.41339 16.60391 427.16279 93.49554 1075.77846
19.75000 -1434.60292 -0.39136 1.34691 431.94612 84.15563 1091.07755
19.85000 -1441.90235 0.16367 35.69367 421.86040 152.60417 1070.27025
19.95000 -1442.07610 1.63175 19.64265 428.61575 154.42911 1060.33414
