0.26 0.89171 120.3595 0.07211
0.51 1.09632 131.83166 0.06359
0.77 1.23761 132.5201 0.05462
1.02 1.45202 139.27196 0.04779
1.28 1.47486 127.79836 0.0413
1.54 1.57436 131.94826 0.03858
1.79 1.55868 120.11333 0.03455
2.05 1.57637 111.75148 0.03052
2.31 1.71895 116.16735 0.02781
2.56 1.61258 103.9874 0.02553
2.82 1.67464 100.94667 0.02285
3.08 1.73414 98.41567 0.02128
3.33 1.59467 90.20736 0.0203
3.59 1.6095 91.08869 0.01975
3.84 1.58291 83.49134 0.01772
4.1 1.6326 84.19167 0.01717
4.36 1.63582 80.71453 0.01578
4.61 1.63632 76.08779 0.01454
4.87 1.63772 74.06412 0.01374
5.12 1.62097 70.41283 0.01279
5.38 1.69294 69.50756 0.01193
5.64 1.85648 70.44036 0.01085
5.89 1.73939 61.51161 0.00974
6.15 1.94576 64.65465 0.0089
6.41 2.00548 61.09639 0.0079
6.66 2.11071 59.84001 0.00709
6.92 2.23147 59.37068 0.00659
7.17 2.12056 53.38559 0.00599
7.43 2.3981 57.62572 0.00557
7.69 2.18991 50.75171 0.00521
7.94 2.29765 52.07655 0.00494
8.2 2.43985 51.35815 0.00458
8.46 2.49732 49.68378 0.00419
8.71 2.36988 45.42318 0.00393
8.97 2.59487 48.54993 0.0037
9.22 2.54446 45.32279 0.0034
9.48 2.98791 46.77518 0.00306
9.74 2.56812 39.18519 0.00288
9.99 3.28132 45.4765 0.00255
