0.12500 0.01518
0.37500 0.07804
0.62500 0.18548
0.87500 0.28463
1.12500 0.34780
1.37500 0.38684
1.62500 0.42271
1.87500 0.43946
2.12500 0.43671
2.37500 0.46341
2.62500 0.46452
2.87500 0.47801
3.12500 0.49987
3.37500 0.50427
3.62500 0.51431
3.87500 0.52589
4.12500 0.54177
4.37500 0.54998
4.62500 0.56389
4.87500 0.57465
5.12500 0.58544
5.37500 0.58654
5.62500 0.59800
5.87500 0.59973
6.12500 0.59282
6.37500 0.58723
6.62500 0.58397
6.87500 0.56063
7.12500 0.54164
7.37500 0.50332
7.62500 0.47652
7.87500 0.44769
8.12500 0.42623
8.37500 0.38932
8.62500 0.34511
8.87500 0.34231
9.12500 0.31798
9.37500 0.27393
9.62500 0.27814
9.87500 0.26474
10.12500 0.28099
10.37500 0.27185
10.62500 0.27144
10.87500 0.26607
11.12500 0.23523
11.37500 0.20831
11.62500 0.19623
11.87500 0.16700
12.12500 0.15634
12.37500 0.13739
12.62500 0.14128
12.87500 0.12295
13.12500 0.11290
13.37500 0.10677
13.62500 0.09716
13.87500 0.07390
14.12500 0.09560
14.37500 0.07429
14.62500 0.07086
14.87500 0.08190
15.12500 0.07528
15.37500 0.07461
15.62500 0.07993
15.87500 0.08429
16.12500 0.08386
16.37500 0.09400
16.62500 0.07068
16.87500 0.07438
17.12500 0.10008
17.37500 0.10558
17.62500 0.11857
17.87500 0.13973
18.12500 0.13334
18.37500 0.11217
18.62500 0.14229
18.87500 0.14688
19.12500 0.15666
19.37500 0.15007
19.62500 0.17678
19.87500 0.21149
