0.2 -0.55475 25.32857 0.15015 127.3851 119.20792 114.29297
0.6 -0.30643 54.0093 0.12319 116.62936 96.03467 91.71416
1.0 -0.3672 68.22607 0.57428 104.33986 83.85465 79.70715
1.4 -0.08093 78.09402 0.29785 92.27967 76.03397 70.9124
1.8 -0.0965 90.85566 0.72913 81.50261 71.40263 65.566
2.2 -0.15205 105.42986 0.76605 71.09728 68.00997 61.36407
2.6 -0.94081 123.97333 0.90392 62.00487 63.70978 56.84135
3.0 -2.07988 142.44176 0.66731 54.38284 56.89197 51.05338
3.4 -1.89363 158.26628 0.342 49.52998 47.62447 45.03052
3.8 -1.14653 168.10419 -0.03677 45.57592 39.05382 40.68584
4.2 -0.32511 171.61166 -0.13794 42.51202 35.23011 37.65078
4.6 -0.36605 174.53515 -0.32201 40.50625 34.07429 34.92367
5.0 -0.11452 178.12534 -0.2394 38.95084 32.48695 33.07853
5.4 -0.1443 182.1139 0.1273 38.09359 30.57118 31.38448
5.8 0.53623 184.90515 -0.00184 36.96218 28.90669 29.83649
6.2 0.38441 187.71966 -0.16004 35.01502 27.80772 28.20634
6.6 0.6837 189.86796 -0.69187 33.29943 26.73918 26.73903
7.0 0.68186 191.55641 -0.61085 31.6779 26.75947 25.41905
7.4 0.80451 194.34802 -0.9158 30.29997 26.23104 24.25155
7.8 0.27598 197.68359 -0.81462 29.01702 24.93478 23.09495
8.2 0.79585 200.26772 -0.40804 28.04535 22.96364 22.49557
8.6 0.76144 201.83898 -0.42781 27.29225 21.23175 21.54944
9.0 1.11024 202.87578 -0.37877 26.47466 19.65104 21.02176
9.4 0.36558 202.69482 0.15301 25.72812 18.92808 20.25798
9.8 0.2925 202.72134 0.08081 24.70732 18.37247 19.45074
10.2 0.18737 203.07383 0.32903 24.30955 17.87704 18.39004
10.6 0.27243 204.14739 0.0876 22.91044 17.69797 17.76541
11.0 0.74166 205.07881 0.20848 21.88421 17.30047 16.6935
11.4 1.07635 205.63497 -0.38341 21.17095 16.89289 15.98139
11.8 0.93576 206.50484 -1.13941 20.84319 16.4398 15.27823
12.2 0.22257 207.14358 -0.85683 19.71196 15.53894 14.96832
12.6 0.65509 207.03948 -1.39731 18.9778 14.91711 14.40136
13.0 -0.10261 207.69807 -1.03403 19.09928 13.70269 13.97112
13.4 -0.15772 207.06614 -0.80797 18.3168 13.26241 13.41612
13.8 -0.20714 207.97783 0.09247 17.69471 12.19569 13.08305
14.2 -0.75689 207.7775 0.5239 16.86085 12.22631 12.51174
14.6 -0.75351 207.25318 0.63733 16.48686 11.64438 12.18645
15.0 -0.35328 207.26195 0.41125 15.54324 10.90227 11.59043
15.4 -0.60332 206.90088 -0.01415 14.92356 10.81341 11.48197
15.8 0.23716 207.12978 -0.17619 14.03663 10.64569 11.00248
16.2 0.2238 206.82434 -0.47474 13.5767 10.38393 10.45134
16.6 0.11297 207.54417 -0.6958 13.17557 10.11506 10.59297
17.0 0.4119 207.56898 -0.94911 12.94056 9.51356 10.52265
17.4 1.06295 207.59975 -0.40781 12.41571 9.24213 10.21654
17.8 1.45814 207.78651 -0.9285 11.64533 9.44281 9.89698
18.2 0.85638 207.36331 -1.15932 12.1395 9.19557 9.81625
18.6 0.73419 207.80197 -1.9558 10.86745 8.52539 9.04631
19.0 -0.32818 207.29842 -2.05178 10.71681 7.52808 8.38281
19.4 -1.0278 207.37527 -2.38019 10.74479 7.97423 8.42176
19.8 -1.5833 207.3126 -1.21324 10.37972 7.79585 8.27964
