0.1875 0.28006 19.21909 -1.26015 123.70969 120.9721 118.29959
0.5625 -1.14623 45.72994 -0.9146 105.26242 100.15341 94.87189
0.9375 0.79386 70.46665 -0.74809 94.56814 87.23056 81.96751
1.3125 -0.14169 92.69332 -2.12269 81.74992 80.47971 72.93343
1.6875 -1.70598 113.9257 -0.87915 73.11603 72.56817 66.27226
2.0625 -2.01569 130.41396 0.14856 65.02682 64.53592 59.78417
2.4375 -2.68065 142.87182 0.27982 60.53434 58.44455 54.65878
2.8125 -1.76478 153.31662 0.15854 56.21176 51.27486 49.92605
3.1875 -1.92338 160.46197 -0.24227 53.68735 46.18482 46.84109
3.5625 -1.15912 164.337 0.73021 50.50573 43.03604 43.1145
3.9375 -2.59866 169.57324 0.14475 48.29492 40.95328 41.03094
4.3125 -2.21317 173.43436 0.83926 45.42899 38.76287 39.17507
4.6875 -1.26423 177.55781 0.86443 43.88805 36.19751 37.29156
5.0625 -0.25266 180.50298 1.16847 42.44499 35.98285 35.48483
5.4375 -0.30502 183.82534 1.35314 40.79803 34.66851 33.42376
5.8125 -0.26769 186.71172 0.86552 39.15997 33.22317 32.59528
6.1875 -0.18634 190.86121 0.14075 38.06167 31.49779 30.3882
6.5625 0.38703 192.43769 0.05549 37.08758 29.75767 29.69038
6.9375 -1.01611 195.64984 -0.44839 35.58937 28.76832 28.337
7.3125 -0.24491 196.97288 -0.60657 34.48814 27.00694 27.87042
7.6875 -1.21264 198.06421 -0.04043 33.70487 25.36284 26.37159
8.0625 -0.20276 199.05248 -0.34123 32.12593 24.68418 25.91707
8.4375 -0.78888 199.19184 0.23942 31.40595 24.26942 24.4704
8.8125 -0.64206 200.27582 0.45139 30.67284 23.60018 24.31874
9.1875 -0.60231 201.13981 0.67156 29.59574 23.16882 23.27633
9.5625 -0.86045 201.98009 0.55067 29.39494 22.33891 22.49311
9.9375 -0.05072 203.02561 0.61086 28.81242 21.19984 20.93166
10.3125 -0.67859 203.82506 0.91457 27.75602 21.04566 21.07972
10.6875 -0.21602 204.14524 1.16546 26.46266 20.78445 20.09803
11.0625 -0.76528 204.29547 0.97306 25.59839 19.87886 19.63507
11.4375 -1.06763 204.63368 0.05536 24.20194 19.01998 18.60453
11.8125 -0.83507 204.34457 0.33632 24.15688 18.43533 18.12247
12.1875 -1.06739 205.18095 -0.96815 23.245 17.05589 17.70351
12.5625 -2.03951 205.19484 -0.10355 22.74878 17.04385 16.50843
12.9375 -3.03809 204.95193 -1.09009 22.58452 16.52009 15.79618
13.3125 -2.46484 205.39774 -0.99408 21.32013 15.94543 15.83921
13.6875 -1.36804 206.19306 -1.25577 19.78918 15.65239 15.17264
14.0625 -1.15214 206.13424 -0.45946 20.01029 14.6927 14.58714
14.4375 -1.31169 206.03052 -2.02524 18.51271 14.51631 13.67682
14.8125 -2.07207 206.56977 -0.59033 18.53474 13.49543 13.03481
15.1875 -1.12027 206.20626 0.42161 17.57057 12.82754 13.73605
15.5625 -1.06739 205.94001 -0.99102 16.98865 13.225 12.28217
15.9375 -2.9945 205.26917 -0.55449 16.65289 13.31811 12.42234
16.3125 -0.36716 205.60749 -1.26073 17.2318 12.31842 13.09066
16.6875 -1.19269 206.24369 -0.731 16.07773 12.32556 12.46981
17.0625 -0.01217 206.57236 -0.53391 14.78842 11.41066 12.92183
17.4375 1.89063 206.77903 0.62707 14.8116 10.966 13.14191
17.8125 1.06619 205.29427 0.52763 15.49076 10.70774 12.88336
18.1875 2.29955 205.65672 0.82572 15.11132 10.87712 12.76938
18.5625 3.71507 206.50784 2.51251 13.47556 10.06079 12.61939
18.9375 1.91253 205.42899 2.84386 13.86863 9.82527 12.25792
19.3125 1.00591 206.69646 3.1025 12.50195 9.88288 11.3071
19.6875 2.25404 206.04279 3.74564 13.52698 10.25844 11.43463
20.0625 1.52162 205.61587 3.94595 12.78407 10.38383 9.898
20.4375 2.25275 205.81581 3.23714 12.22431 10.76763 9.53379
20.8125 1.1288 206.87423 1.38997 13.26939 8.80697 8.53226
21.1875 0.9374 206.94436 1.84098 11.75041 8.70328 8.26771
21.5625 -0.82125 206.1751 0.75947 11.36509 8.75723 8.10717
21.9375 0.0659 205.13168 0.28799 11.99401 7.90861 8.57312
22.3125 -0.02076 204.92427 1.53506 12.29248 8.53816 6.85271
22.6875 0.59138 205.12698 -0.9768 11.54017 8.27975 9.99441
23.0625 0.74669 205.3315 0.97726 10.60998 6.93194 8.59268
23.4375 2.7821 204.99714 1.19836 10.06814 6.98019 6.87494
23.8125 -2.95569 205.27406 0.5411 10.81544 6.37073 7.09019
24.1875 -0.13928 205.5781 1.32359 10.5741 7.19674 8.11212
24.5625 3.17451 204.2545 -0.24126 9.12715 7.74271 7.95759
24.9375 1.27265 205.94828 0.63067 9.27379 6.02614 7.74978
25.3125 3.07174 205.79027 0.22678 9.2278 5.44184 7.22216
25.6875 -0.62922 205.75826 2.03859 9.8156 6.09683 6.07211
26.0625 1.88068 204.33388 0.73837 8.85112 5.59543 6.2807
26.4375 0.749 206.58854 0.79668 9.74345 6.60933 7.32215
26.8125 -1.89907 203.06595 0.82926 9.4347 8.31232 7.51275
27.1875 -1.88621 201.9607 0.67756 6.64882 5.43304 6.02321
27.5625 -1.19514 207.50048 0.33014 7.43064 8.76819 7.49739
27.9375 -0.5322 201.05397 0.42777 5.98378 5.65313 4.8885
28.3125 3.11774 204.7062 1.38586 8.91186 5.70175 6.13273
28.6875 2.77778 202.72733 2.08606 7.24038 4.02033 5.2599
29.0625 4.23427 201.29049 0.78782 6.16075 4.46742 5.25923
29.4375 1.37978 196.39694 3.06434 5.69278 5.27906 4.22798
29.8125 -7.90998 201.9221 -1.63894 6.47296 5.20119 6.50787
