0.05000 -1342.09518 -499.16030 6142.40028 1030.84083 829.70798 98489.16546
0.15000 -3879.58448 -497.16939 -55897.03114 4046.05110 2715.00364 379723.92156
0.25000 -5468.96255 -77.86768 14924.20891 2511.02955 2073.83633 570763.46897
0.35000 -7342.33751 62.68076 5291.08040 2460.79561 2369.87130 328391.58258
0.45000 -7898.86506 11.05493 11303.60414 2785.12649 2226.15755 356152.79830
0.55000 -8880.52284 -50.83907 -23429.54085 2605.13963 2110.64053 337718.26355
0.65000 -9639.98009 97.20856 -6887.85558 2603.98230 2329.47597 402852.33976
0.75000 -9483.79257 112.34446 -2757.69067 2093.07289 1865.75960 273797.87157
0.85000 -9628.69256 102.67333 -3133.29655 2258.32022 1974.81615 332924.62994
0.95000 -9627.30757 48.60986 -20520.74968 1789.15225 1494.20224 339280.94148
1.05000 -9643.85928 30.15708 1025.41642 1828.03952 1595.86053 293828.61054
1.15000 -9645.51501 5.25530 4075.17936 1508.37410 1678.13331 290711.61485
1.25000 -9501.47257 15.27766 -1032.35346 1909.72367 1412.47370 324185.52965
1.35000 -9513.59506 3.22270 -14241.82835 1530.21043 1526.82727 355039.95274
1.45000 -9388.15037 41.14394 -197.25044 1614.69851 1051.19968 293059.59359
1.55000 -9233.35630 70.96825 637.33888 1467.21979 1294.29449 250559.72288
1.65000 -9225.62083 -2.33883 4262.02935 1377.66727 1059.33841 257054.24629
1.75000 -9190.05934 3.69252 5768.23126 1582.70793 1277.77786 279241.74177
1.85000 -9117.50810 32.16387 6730.53053 1593.27501 1211.60219 217243.72437
1.95000 -9008.82160 33.70641 -4916.52698 1208.68238 995.61376 234193.03135
2.05000 -8892.96411 17.09322 -2065.90411 1213.98697 1206.82885 232267.33534
2.15000 -8836.90667 6.94669 -5609.96635 1189.56598 1061.41742 182686.50738
2.25000 -8789.49563 38.69259 -6.90451 1378.19999 1212.77708 173201.03069
2.35000 -8662.94559 33.96052 -194.61703 1292.36524 1061.90380 181941.35408
2.45000 -8603.01972 -5.02605 7678.47496 812.39808 1046.94276 170982.82817
2.55000 -8468.61936 12.24697 -2597.53997 1521.09944 908.85272 229600.24930
2.65000 -8325.99467 22.73500 187.78926 853.30383 991.18668 177277.36258
2.75000 -8291.15836 43.46654 1564.10533 819.27831 772.68522 168339.10725
2.85000 -8162.53554 -5.20373 -1511.96018 864.81971 868.14627 176062.40130
2.95000 -8082.70000 26.70614 -355.89402 700.64774 754.11197 140292.40192
3.05000 -7996.16937 34.91840 127.07507 901.30778 832.99197 163918.05452
3.15000 -7957.50113 -3.16488 -587.82466 670.13772 736.80552 161406.98050
3.25000 -7903.84770 18.33488 282.15945 757.59201 833.59270 142505.74433
3.35000 -7808.78436 36.67203 -461.17184 662.46661 819.85214 158435.39491
3.45000 -7769.52342 -1.93255 -5345.77334 927.75018 1241.76099 131562.23862
3.55000 -7713.99384 23.54717 -6055.68066 832.18640 905.87652 143455.90302
3.65000 -7633.25362 3.14420 2367.94022 1281.96886 785.50159 114655.89651
3.75000 -7599.41208 12.79742 868.49274 717.54537 805.56933 116468.98496
3.85000 -7538.56788 32.70760 1926.09101 598.24014 735.56899 131603.76538
3.95000 -7493.64205 44.91513 -4413.75270 737.79699 581.66586 110701.01301
4.05000 -7443.76049 10.48293 4030.11781 726.66587 680.47054 104016.77890
4.15000 -7340.10809 21.17884 3322.42996 639.07016 557.05346 109131.62727
4.25000 -7288.88597 21.79237 -1914.95954 640.61134 538.60553 109034.25477
4.35000 -7222.08143 17.80352 -2922.29438 624.04478 667.43552 86666.07975
4.45000 -7187.91706 1.66468 -1577.37368 780.35294 655.58285 92464.70061
4.55000 -7136.38017 13.73018 1405.24254 588.95608 657.07835 89160.72395
4.65000 -7075.43165 23.09896 -4122.47619 623.33598 775.98203 80572.26221
4.75000 -6997.03508 11.21228 1117.67702 520.62735 474.41303 83334.01752
4.85000 -6948.96782 43.33586 -1944.50209 541.79347 737.03678 81075.85304
4.95000 -6845.98966 39.31542 -758.48749 544.02319 592.46875 73709.93100
5.05000 -6814.42727 22.55437 551.89328 802.16356 624.38601 75117.67150
5.15000 -6770.14350 20.29953 -3807.64932 598.69507 659.75467 83221.26724
5.25000 -6717.31768 26.69424 130.41026 625.87180 654.65900 85260.73218
5.35000 -6686.88881 3.50921 719.84831 523.72451 663.57742 65190.00604
5.45000 -6648.06789 18.95473 -593.71922 478.48462 533.43417 60892.57902
5.55000 -6602.57362 13.59593 -808.73030 480.75929 477.67094 69282.02020
5.65000 -6538.69538 20.01474 -1693.07694 554.82907 559.59427 84874.52155
5.75000 -6492.65766 13.81727 -1577.04991 438.28817 488.78718 62823.52422
5.85000 -6475.64110 15.59495 451.44570 641.81248 728.12979 63275.76262
5.95000 -6403.63448 22.81934 -2474.32423 378.75105 403.14888 99615.60562
6.05000 -6358.45387 21.96399 2395.84474 376.12633 475.21872 61254.59085
6.15000 -6302.75664 -5.13069 -536.40678 651.83694 1049.77823 53985.99337
6.25000 -6245.48354 22.70551 -618.50493 431.03410 384.57783 59127.19026
6.35000 -6215.99135 18.28092 -1060.41202 438.73962 394.86286 48671.90450
6.45000 -6173.83830 19.38206 2413.20911 368.31868 401.59629 50904.40298
6.55000 -6120.88888 33.67797 2637.39393 389.84014 473.65380 46520.69710
6.65000 -6084.95497 5.07976 -483.75842 437.06157 441.11536 48661.73151
6.75000 -6046.66385 18.89157 2308.71547 374.12798 436.05383 58923.35664
6.85000 -6016.85044 17.37099 -1539.66101 547.33130 595.78727 46340.11920
6.95000 -5948.12314 20.35764 -1960.51256 449.38180 475.96627 84252.45585
7.05000 -5910.49440 15.50462 635.90101 533.28664 422.67970 35788.54895
7.15000 -5871.71235 26.79454 2577.75737 415.98519 362.19612 39616.85884
7.25000 -5845.41613 11.79746 2291.58384 347.86105 369.07317 67589.30929
7.35000 -5775.10953 0.88329 419.85740 623.61417 747.33526 35849.80205
7.45000 -5750.52874 7.04868 44.43488 407.38373 434.12311 32154.44336
7.55000 -5693.72133 16.45226 908.67787 408.65653 383.76505 34654.56096
7.65000 -5641.94013 17.84247 846.88048 296.22698 320.87798 32005.99918
7.75000 -5591.33151 19.53042 2908.95408 356.84259 288.60213 39794.09036
7.85000 -5542.41524 9.35587 1841.87249 330.71862 346.23158 29491.17897
7.95000 -5515.38978 11.39879 -640.90469 354.57326 281.05786 32062.09112
8.05000 -5450.90855 8.90693 -129.73102 477.34750 371.91176 39704.91358
8.15000 -5414.88615 16.56310 820.45711 511.05340 272.65977 27331.66095
8.25000 -5362.46483 12.25598 -150.74937 308.28588 267.93546 25550.96603
8.35000 -5292.32076 7.94147 412.45275 309.99960 420.99067 33256.12849
8.45000 -5258.47629 3.38535 1019.95989 322.59218 291.91474 28165.01305
8.55000 -5217.44407 11.80910 191.06553 293.02189 214.10982 28529.49657
8.65000 -5189.12592 15.07556 -553.92798 208.88942 200.24837 29513.37416
8.75000 -5121.90532 11.33917 282.76487 489.53505 353.58641 25084.52188
8.85000 -5104.09339 24.07655 1190.10655 494.68265 568.02304 25855.12973
8.95000 -5058.18233 3.97978 64.11868 241.45597 300.88177 22495.30150
9.05000 -5013.55670 12.86719 696.59571 288.08558 211.24080 25218.71772
9.15000 -4984.93672 15.42705 -109.86504 204.79531 233.10699 21532.52727
9.25000 -4932.72047 12.75093 -590.66667 297.41030 407.85457 34241.24662
9.35000 -4905.64196 4.63662 -499.75957 570.86962 455.59254 23256.34921
9.45000 -4860.24775 15.37576 484.24274 228.82537 253.87319 21685.39329
9.55000 -4808.42928 2.45027 72.78532 218.40167 282.57966 19598.54350
9.65000 -4770.15912 6.74568 1012.95673 206.40896 193.00035 18360.52165
9.75000 -4743.02857 5.21475 1611.22071 419.26981 463.92288 21287.50386
9.85000 -4693.91159 2.93787 -180.54782 167.75310 249.42399 20665.96376
9.95000 -4643.36846 1.28816 464.32630 308.09172 205.81447 15199.46805
10.05000 -4597.53437 8.62524 645.91675 183.55096 206.07219 18457.44549
10.15000 -4576.72693 15.26410 1031.28591 316.51564 206.52535 20363.73897
10.25000 -4539.58541 16.08813 -877.76541 569.98246 268.99945 21298.98864
10.35000 -4502.36644 6.67790 128.05196 328.32884 274.48235 13909.52308
10.45000 -4450.56933 11.59271 -330.53203 243.87923 180.64029 14691.41356
10.55000 -4422.88067 8.48033 403.85701 206.96524 165.37522 17735.13218
10.65000 -4389.11117 1.20415 820.07655 263.23577 201.02460 16978.91211
10.75000 -4349.07099 0.21518 -159.09444 240.79152 199.95238 13369.86896
10.85000 -4329.06006 9.79376 53.26381 187.71569 157.35004 15171.00435
10.95000 -4305.88389 4.86966 408.21949 200.43848 131.60580 12310.85553
11.05000 -4273.48065 0.14757 -446.83446 164.79798 186.63287 12531.06406
11.15000 -4242.83670 -3.40588 -703.27923 204.33565 265.11270 13172.23322
11.25000 -4218.11268 2.54193 -173.66633 154.14661 170.51102 11847.73422
11.35000 -4185.48094 3.88073 -319.23471 178.67269 160.47035 12232.78981
11.45000 -4149.42111 7.75121 -13.85993 399.13112 383.60166 12118.15629
11.55000 -4125.80093 -4.32826 -358.90339 158.57614 179.94730 10237.32715
11.65000 -4091.16241 8.72426 -201.74193 240.00294 320.78514 17094.47144
11.75000 -4052.57876 12.70335 -528.40584 257.59982 253.64803 12653.24711
11.85000 -4036.62960 5.27977 -1122.17917 285.93763 249.65520 11706.65612
11.95000 -4006.00490 7.98868 30.27411 152.38099 163.31087 10827.75763
12.05000 -3968.00029 9.56612 200.08637 137.50883 105.62415 10670.16827
12.15000 -3935.67156 8.93558 226.03958 129.87079 105.62776 8824.20419
12.25000 -3912.68648 3.32445 -372.10848 357.92946 274.73727 10222.90817
12.35000 -3872.57022 6.18491 38.58899 295.47305 252.34882 10169.29651
12.45000 -3861.93739 11.01024 151.86076 255.72086 199.44260 9062.73798
12.55000 -3795.49721 -23.63288 84.36000 381.90636 451.17598 7513.00601
12.65000 -3785.70983 6.22985 -537.12747 196.61300 161.86691 7858.93215
12.75000 -3753.49944 -20.19143 342.34278 138.63223 776.29526 9562.31665
12.85000 -3730.57092 1.02117 -158.59601 175.99505 129.92529 9436.50962
12.95000 -3697.03353 11.59503 13.96310 106.34649 115.93250 10029.90477
13.05000 -3667.46264 -4.14624 -145.85108 182.55729 143.73123 10088.90693
13.15000 -3641.19011 8.34836 -212.52651 93.27896 103.45650 6267.66880
13.25000 -3615.42933 11.13317 -269.05819 220.97495 205.83474 8735.21800
13.35000 -3575.63891 3.87071 494.51984 114.59913 96.41869 8167.07676
13.45000 -3551.67937 8.77710 68.26207 130.85349 169.34741 6120.47121
13.55000 -3525.66790 -9.02954 -630.39381 152.67529 362.94529 8230.40580
13.65000 -3497.20449 4.06519 291.70363 103.10251 100.14059 9047.05761
13.75000 -3467.22785 6.92901 41.38325 241.38742 140.43445 5710.22198
13.85000 -3432.89084 11.26241 -306.64478 289.69245 198.28432 5594.27034
13.95000 -3422.86594 0.77769 -335.63330 152.06382 90.16245 6973.77959
14.05000 -3386.57599 4.04397 -425.75906 131.06316 114.85581 6502.37560
14.15000 -3367.74871 4.84249 -87.10526 136.20222 142.93868 8219.71691
14.25000 -3337.18551 14.24760 -62.53157 453.39933 338.44486 5212.35464
14.35000 -3332.96907 6.49195 295.91435 200.68191 106.99789 7052.39047
14.45000 -3304.91581 8.91330 -84.39788 99.57298 102.04083 4238.39433
14.55000 -3284.04040 1.53352 339.27232 105.04379 116.89709 8093.59269
14.65000 -3261.81265 -0.64071 198.22878 209.37165 115.04958 5145.71302
14.75000 -3245.43958 10.24442 -238.96209 200.73864 143.51690 4999.32258
14.85000 -3243.52085 -11.37957 382.29472 566.19468 437.51278 5296.06312
14.95000 -3227.80421 3.83981 76.10943 139.38430 173.43540 4444.33913
15.05000 -3196.25818 8.30846 -315.48605 162.52853 109.97933 6011.65050
15.15000 -3183.46105 4.82692 251.65315 200.66327 129.54854 5403.93311
15.25000 -3175.14357 6.74444 -93.90324 103.20943 94.98016 5412.16185
15.35000 -3140.61446 1.63495 -206.26431 246.35741 228.93727 3362.73756
15.45000 -3139.03020 8.42913 -174.89698 167.08718 89.81323 6981.31926
15.55000 -3113.36944 7.41670 -89.07297 203.90110 113.58458 5174.67530
15.65000 -3088.15494 -2.95884 7.23528 114.71308 104.64590 4160.20212
15.75000 -3064.99757 0.81127 -359.97870 115.60213 102.19621 3481.03090
15.85000 -3044.81073 -0.85407 149.95826 100.27806 94.89214 6404.11240
15.95000 -3032.32489 8.98557 -359.14761 85.85732 75.57911 4044.83427
16.05000 -3011.48214 12.74768 -96.90034 82.49520 111.56605 4179.23634
16.15000 -2981.39394 -3.33842 -336.56303 89.31581 114.70575 5404.35821
16.25000 -2968.60826 -1.63714 -67.48776 127.65374 103.53200 4114.10085
16.35000 -2949.13125 1.96201 319.21536 103.71804 120.78322 4084.37118
16.45000 -2920.93968 -11.29178 126.10413 106.47276 108.01936 3861.62603
16.55000 -2906.02999 -0.15046 -399.41714 84.06048 86.69536 4285.31428
16.65000 -2891.70027 6.72319 -192.94788 96.65410 90.10955 3374.93572
16.75000 -2863.16909 9.09821 -29.90398 112.28979 64.27448 2989.55635
16.85000 -2876.80331 16.82372 111.39336 440.98865 131.40288 2622.64469
16.95000 -2830.44313 6.10629 56.01185 104.26613 100.23565 5244.69472
17.05000 -2805.09608 0.57111 106.03321 88.10731 57.51709 5134.88914
17.15000 -2777.88828 -8.12513 228.54796 465.60875 189.25239 2779.93006
17.25000 -2761.63892 -3.30590 97.83565 79.18472 92.25885 2653.88727
17.35000 -2748.73422 -4.98588 -96.89270 51.48486 69.40712 2348.63284
17.45000 -2719.34560 11.38707 427.13173 95.37055 218.01137 3906.55247
17.55000 -2705.72117 3.00706 154.75653 49.91719 49.52904 2871.34162
17.65000 -2684.99605 6.95907 1.89475 92.20237 74.01585 2600.33683
17.75000 -2666.92367 -4.86606 -236.60636 91.45523 131.91167 2574.09577
17.85000 -2649.80497 -1.72794 -32.56972 55.24671 74.47489 1828.45821
17.95000 -2635.03558 5.30655 -154.15253 63.20966 66.98158 1752.32246
18.05000 -2622.48987 4.65110 21.71803 46.36075 46.72998 1811.11636
18.15000 -2610.53884 8.28564 46.68135 193.47734 182.71086 2057.17257
18.25000 -2579.57078 0.15977 201.77237 229.33269 88.65161 1747.67006
18.35000 -2554.75627 4.20823 148.14480 96.06271 72.56745 2486.08891
18.45000 -2565.59491 23.99880 285.78426 198.59975 341.90485 2714.58416
18.55000 -2529.48918 2.33114 188.34992 54.88735 52.88101 2808.31034
18.65000 -2512.92527 5.16689 69.51568 103.88437 49.33399 3290.55866
18.75000 -2502.62817 8.11950 -83.47616 56.97534 51.27580 2108.80784
18.85000 -2490.68676 4.22191 98.80370 57.06724 62.44430 2629.84551
18.95000 -2468.18962 3.77013 108.31144 67.98837 75.90339 1388.41755
19.05000 -2457.59745 4.34995 -9.28581 75.54956 49.73192 2028.68966
19.15000 -2444.49673 2.78141 67.70296 77.73169 68.51643 1318.41136
19.25000 -2424.97816 1.34855 71.09787 116.32093 54.43904 1644.19512
19.35000 -2419.54621 -7.96194 -5.01633 100.68616 140.58574 1127.59932
19.45000 -2400.25904 3.79455 -30.01090 63.35749 50.09745 1452.83904
19.55000 -2389.56075 3.45639 -154.71027 52.66891 69.43381 2445.67132
19.65000 -2395.16597 3.85918 147.82281 239.58588 51.70760 1281.52718
19.75000 -2364.26465 -2.38509 -117.82361 42.53636 47.09602 1406.04664
19.85000 -2343.73857 7.91612 -27.51027 102.80498 60.30235 1820.34941
19.95000 -2333.05113 -1.27788 -42.90149 44.74831 41.99070 1166.00617
