0.05000 -234857.65841 -1444.36498 -59742.90292 101623.09829 98941.23988 196308.65241
0.15000 -170775.18945 1229.98684 -3366.02616 65804.90834 33605.53700 136126.97549
0.25000 -106615.08232 439.38665 1978.59599 37312.10570 13763.74256 84809.36969
0.35000 -74687.71624 184.44613 1341.80889 23819.97184 9574.07230 58284.63461
0.45000 -56702.50004 130.64905 1067.11336 17438.90229 5746.17813 44735.33469
0.55000 -45503.59918 196.54369 616.12433 13933.03408 4576.88992 37299.94347
0.65000 -38922.91945 186.64029 282.67418 11252.39879 3407.31412 31234.01730
0.75000 -33683.81726 26.82970 -463.96002 9523.35890 4440.90069 27325.31178
0.85000 -29953.50275 114.05843 641.07168 8086.60092 2322.06672 23474.30697
0.95000 -26958.89942 60.70723 -311.80943 7543.82634 3423.73010 21322.41134
1.05000 -24649.63489 31.21438 -222.22400 6937.98148 2947.79495 19094.37354
1.15000 -22972.62151 74.67381 413.20765 5784.80656 2755.01350 17032.49888
1.25000 -21517.70960 82.24705 362.50208 5515.98487 1904.46904 15544.43447
1.35000 -20105.88354 69.46292 -442.00766 4945.67091 1829.09901 14629.70482
1.45000 -19184.22417 51.62273 -105.79795 4266.45251 1633.80663 13207.61867
1.55000 -18152.18112 48.60422 -448.68140 4159.47532 1908.05748 12293.63103
1.65000 -17484.99562 8.09358 -121.38918 3706.19036 1543.42763 11319.31780
1.75000 -16740.40420 36.44267 2.10891 3626.61939 1585.14947 10707.97804
1.85000 -16238.22091 58.23640 -258.75966 2912.85011 1233.94544 9710.88306
1.95000 -15733.29619 24.22060 -315.30972 2731.23749 1339.00469 9128.22419
2.05000 -15241.55529 95.59299 137.86730 2934.80983 2520.65780 8535.00325
2.15000 -14753.07835 26.30741 85.57126 2940.01464 1720.10996 8194.18883
2.25000 -14320.97960 55.37851 -178.35434 2733.52776 1171.05997 7808.92027
2.35000 -14041.69717 27.33642 -125.08806 2286.66488 1461.00934 7124.01244
2.45000 -13608.23620 25.94201 -54.54942 2069.27550 1169.75527 6833.32525
2.55000 -13326.44839 16.93866 62.19926 2022.10075 1204.02097 6366.20664
2.65000 -13032.00906 13.07720 22.40615 1958.36695 1297.10468 6080.22565
2.75000 -12720.95768 20.09296 -10.58756 1629.44684 704.98190 5678.25428
2.85000 -12452.70104 13.03605 -97.78210 1734.32464 932.28235 5513.54878
2.95000 -12070.95124 -5.58850 -15.61444 2630.34933 1456.98994 5347.00606
3.05000 -11909.02489 21.81088 -72.29757 1580.84960 723.57233 4939.42702
3.15000 -11664.94259 -19.95651 -102.26522 1510.56004 1380.67165 4930.71382
3.25000 -11473.18402 -8.52810 -31.76928 1437.09454 1166.92797 4546.79035
3.35000 -11195.91100 16.78063 -8.49559 1159.25358 537.03416 4336.45470
3.45000 -10998.48486 24.56909 -4.57597 1108.71004 734.00793 4021.59467
3.55000 -10757.74025 -1.73171 -25.62815 999.23425 527.76466 3922.19672
3.65000 -10531.44530 20.66219 109.78002 1082.58386 685.02833 3858.85708
3.75000 -10343.48224 15.40635 63.00762 1373.65938 788.49655 3715.29369
3.85000 -10148.16465 -2.49640 33.34921 977.52552 567.55291 3536.88896
3.95000 -9981.39766 10.03343 41.72076 960.81584 670.92023 3396.91743
4.05000 -9805.27962 9.51818 105.54108 887.88702 648.84943 3322.06214
4.15000 -9634.51418 -14.24434 58.90693 1035.51195 917.81808 3139.91432
4.25000 -9487.19246 13.76280 68.73632 960.76721 645.22461 3087.55324
4.35000 -9332.48151 7.31336 29.10251 1029.14653 591.70223 2889.75289
4.45000 -9142.13426 -12.19990 51.59287 1115.60794 1298.20174 2846.51727
4.55000 -9004.78699 11.30092 -64.05415 807.30903 480.84636 2722.50277
4.65000 -8790.31310 -12.87337 116.21142 1443.22770 799.98253 2634.18977
4.75000 -8678.12197 1.85725 32.00606 910.54834 757.86166 2508.57085
4.85000 -8524.60036 10.80767 11.69331 888.67778 440.12492 2417.34980
4.95000 -8401.85097 21.16215 -48.84598 620.42395 589.12052 2453.24265
5.05000 -8271.77414 19.54936 61.87377 710.08206 1032.26674 2366.44407
5.15000 -8117.59750 -16.48388 -5.06697 830.58830 814.67329 2315.16535
5.25000 -7987.45176 -2.51443 29.13183 531.10983 351.69746 2167.66374
5.35000 -7863.25821 23.77135 -4.62652 472.84168 377.25439 2143.34755
5.45000 -7777.93008 0.92997 46.16948 502.96228 375.19818 2015.90173
5.55000 -7663.66570 13.75772 25.83361 487.81766 399.88924 1972.36532
5.65000 -7548.34573 12.11417 68.81937 421.08324 260.99315 1910.73362
5.75000 -7431.87434 14.87704 -27.68712 450.31873 374.00844 1844.32039
5.85000 -7317.92256 -0.16155 -74.76923 731.84572 795.93408 1944.02527
5.95000 -7253.27482 13.60283 47.54233 501.19809 326.92599 1702.86988
6.05000 -7142.76735 8.46606 24.49264 442.48388 610.68699 1820.43779
6.15000 -7056.27905 6.67384 89.24143 398.10103 276.10729 1635.47699
6.25000 -6984.93472 6.41532 20.03924 401.20417 442.03541 1599.37023
6.35000 -6864.25412 7.35025 69.12699 429.93165 359.45863 1593.19984
6.45000 -6812.00116 7.25063 30.45957 447.24502 293.54285 1599.30269
6.55000 -6704.75029 10.48572 128.29885 656.81632 394.98426 1532.44613
6.65000 -6639.81842 -2.19051 58.31603 354.76588 332.73670 1461.58528
6.75000 -6576.48989 20.82791 81.28500 395.23343 467.71393 1381.00008
6.85000 -6475.57078 2.24412 51.51201 418.45370 592.25086 1400.42685
6.95000 -6389.27337 13.40102 103.23740 403.90210 344.33897 1390.09923
7.05000 -6312.19801 1.79234 100.50784 363.28841 302.75741 1333.52398
7.15000 -6274.39452 10.67020 98.04431 1624.02422 331.37838 1400.47545
7.25000 -6160.99261 7.66143 109.38556 724.62675 457.44983 1497.77933
7.35000 -6094.18124 10.05754 52.81700 335.91705 260.48236 1275.54994
7.45000 -6040.29528 0.00237 82.64271 465.31306 409.99514 1250.31799
7.55000 -5953.26335 6.90972 95.43612 351.42433 316.12129 1202.72062
7.65000 -5928.80456 41.74211 130.26913 886.09054 926.06535 1264.60353
7.75000 -5839.08970 14.13125 162.69182 369.34615 234.71052 1223.73225
7.85000 -5760.10121 6.29197 184.85059 357.05966 257.63455 1145.45919
7.95000 -5724.04208 -82.35053 206.93563 316.65444 3196.60485 1408.80668
8.05000 -5663.03370 -1.26892 137.16087 294.84153 182.58657 1096.07748
8.15000 -5598.63131 15.56966 130.40708 411.60686 302.69544 1071.33192
8.25000 -5533.00793 6.56346 125.51045 490.73662 204.84207 1053.82083
8.35000 -5491.01244 -0.30604 88.56797 349.70744 328.66331 1088.93104
8.45000 -5423.13256 -6.83443 156.66999 252.47355 247.72128 1031.48274
8.55000 -5382.42400 2.68501 164.28928 247.74103 186.82338 948.38681
8.65000 -5338.19239 8.63983 151.97609 336.68967 441.11455 970.03620
8.75000 -5292.66222 -2.53765 174.12754 438.49650 420.36374 1035.10384
8.85000 -5233.34752 3.91945 130.25726 270.75265 170.19427 905.05685
8.95000 -5190.31452 3.33700 153.36693 356.67852 242.31413 919.09716
9.05000 -5126.08533 -6.71107 146.71803 387.33719 540.08571 912.03438
9.15000 -5078.47932 4.25737 106.14750 219.71985 188.16212 840.57650
9.25000 -5029.04482 8.69515 192.98942 422.93108 246.28207 836.45640
9.35000 -4987.10956 -2.40972 109.44427 296.96729 373.06995 880.51882
9.45000 -4904.91551 -82.07425 131.06331 490.62332 2730.82871 1342.28791
9.55000 -4886.09023 13.53786 122.77995 203.71989 192.13953 798.77945
9.65000 -4814.30889 3.43280 163.60173 585.13322 398.00460 901.70114
9.75000 -4786.45989 -0.59952 100.94462 473.35374 247.25357 1035.87460
9.85000 -4732.00788 9.26117 141.81394 397.36210 194.86480 783.63032
9.95000 -4710.21163 -2.65050 142.13150 175.01645 159.79923 729.97907
10.05000 -4637.26165 -1.47672 38.03743 371.20278 158.59600 1473.50087
10.15000 -4596.17901 -11.71865 124.32545 296.37323 433.39648 779.33016
10.25000 -4567.04910 1.52354 80.27547 171.60426 139.83018 657.01153
10.35000 -4519.87332 -1.80258 106.14522 295.59613 370.23863 944.03955
10.45000 -4497.23269 12.99181 117.41813 167.72020 137.46853 658.25772
10.55000 -4467.69176 1.51600 132.77725 435.87719 236.94559 748.29537
10.65000 -4417.90029 22.01288 88.13678 138.83834 242.47624 620.88313
10.75000 -4367.90230 4.65341 43.85077 193.96757 190.28593 641.57767
10.85000 -4343.50518 19.15719 88.45813 262.67623 187.40617 577.36140
10.95000 -4275.10411 -6.93457 95.35596 409.04607 313.59968 794.27296
11.05000 -4252.18438 -0.87702 59.26316 125.54267 130.13190 588.88646
11.15000 -4198.44962 11.07692 84.92445 287.88077 131.72960 656.70222
11.25000 -4202.25834 -4.92175 98.65322 354.97070 352.71762 630.65438
11.35000 -4145.18298 -1.82966 71.17210 128.19001 98.14911 553.92961
11.45000 -4119.97460 13.04814 49.72757 198.32361 184.42634 538.31944
11.55000 -4075.11597 4.74961 55.01050 149.59971 137.00579 528.41178
11.65000 -4038.42112 22.18297 84.14840 639.91102 583.09554 1082.94615
11.75000 -4006.21971 11.90863 70.85465 155.71477 168.75415 526.93362
11.85000 -3972.68230 11.17582 60.41544 214.67825 131.13195 535.06407
11.95000 -3934.82775 3.87590 84.95411 146.24176 125.92734 487.24470
12.05000 -3901.54071 -4.36034 61.02657 151.42306 145.40936 489.02368
12.15000 -3873.75397 10.84510 91.19369 134.50683 122.00043 490.98598
12.25000 -3847.22204 9.78012 80.20019 115.26668 109.34961 504.16344
12.35000 -3818.50349 3.50977 58.37343 101.26796 96.59306 441.02572
12.45000 -3781.38372 9.65008 65.29549 97.71779 104.15465 463.40121
12.55000 -3748.58252 20.87852 45.37711 135.08854 155.51137 431.86003
12.65000 -3716.21167 -0.13212 30.13133 116.67820 126.14322 442.80654
12.75000 -3683.18676 15.84295 38.95260 109.39514 99.94362 449.92668
12.85000 -3651.85562 10.77426 -2.20645 119.30787 83.66507 409.67081
12.95000 -3625.68010 8.76012 69.60228 109.45194 95.17848 402.69883
13.05000 -3591.96904 7.14633 21.78884 84.11754 77.98989 405.24820
13.15000 -3557.10993 -2.40605 64.02240 114.96040 125.37310 406.52631
13.25000 -3508.13753 1.51461 -31.03159 324.64722 154.85659 538.07308
13.35000 -3508.73301 -5.38657 33.72620 96.67147 120.25048 394.67422
13.45000 -3481.53913 3.24418 96.48249 88.94692 157.48415 742.79524
13.55000 -3457.76622 9.30801 54.40398 88.20582 81.59387 398.58309
13.65000 -3423.18537 3.86558 -0.76493 102.54583 100.60310 362.85446
13.75000 -3390.85386 -3.21316 15.94298 231.75405 266.23692 387.87038
13.85000 -3380.22275 11.15352 58.37084 88.54677 82.66504 338.81652
13.95000 -3359.58176 1.09964 8.84596 100.74013 108.61158 323.61976
14.05000 -3328.62769 13.55478 24.76870 118.94460 96.47601 353.48104
14.15000 -3306.22243 6.02740 24.52155 84.99705 47.74271 363.85278
14.25000 -3275.81818 14.42259 57.22172 195.62978 199.06607 367.11119
14.35000 -3251.12680 1.87602 29.53230 77.65560 81.67906 347.30730
14.45000 -3237.40942 -13.03349 56.20704 194.64564 215.54889 331.87442
14.55000 -3203.14507 4.14854 -6.59523 79.77495 64.98083 349.06646
14.65000 -3176.97667 2.03761 54.34466 75.78741 57.60845 330.17840
14.75000 -3157.13948 7.76729 5.72735 91.45790 79.26484 330.12056
14.85000 -3135.91612 0.17799 26.29513 84.95334 83.50698 334.00688
14.95000 -3112.39027 -7.60002 38.19093 135.69411 101.96763 334.30139
15.05000 -3085.14141 7.25237 57.92747 108.57185 86.70524 321.54262
15.15000 -3062.07054 3.53978 12.05190 76.60119 66.94992 304.65730
15.25000 -3039.23410 15.73961 2.83205 62.76467 73.84684 292.81313
15.35000 -3018.62675 12.14647 53.95276 73.48102 70.44722 313.69323
15.45000 -3001.42731 3.28586 53.40042 82.10571 97.61620 356.45276
15.55000 -2972.76471 8.00038 79.39513 241.92910 68.99355 289.80022
15.65000 -2953.95596 -3.52347 55.43500 78.68583 68.46626 289.46643
15.75000 -2935.30748 8.66627 14.95655 76.07982 80.15710 282.07084
15.85000 -2921.85498 0.60076 49.39640 80.63268 49.33862 288.71398
15.95000 -2895.21583 4.00231 43.52495 82.07382 101.89660 272.04312
16.05000 -2877.13567 5.28669 88.15570 65.61634 124.60221 276.66345
16.15000 -2843.55085 6.47023 36.20650 165.87582 126.62484 301.43978
16.25000 -2830.50214 7.70511 71.12580 65.62864 46.65622 277.69729
16.35000 -2823.34973 4.29157 69.84597 45.06253 51.91748 254.93985
16.45000 -2814.80174 -0.68573 32.50467 110.66046 62.94997 241.37714
16.55000 -2786.12471 7.05354 59.38554 78.92841 67.22803 225.90562
16.65000 -2760.87347 2.33194 75.27893 91.95593 118.46243 283.44195
16.75000 -2744.92561 0.14877 81.54942 86.93346 92.17072 238.84789
16.85000 -2719.30392 8.11103 84.58875 93.69484 51.43689 254.22107
16.95000 -2685.32767 -13.27728 69.10809 209.85535 109.95261 305.80505
17.05000 -2684.22552 12.63070 64.92176 65.02069 54.32089 241.32901
17.15000 -2669.21154 7.29003 58.23147 47.92612 42.97214 235.19761
17.25000 -2666.70017 15.51260 66.06847 109.52777 107.93284 241.71513
17.35000 -2637.43866 0.20011 99.81416 48.99738 61.03030 219.81821
17.45000 -2618.83239 5.84162 74.33769 56.64542 62.04832 239.52198
17.55000 -2601.87965 8.67167 107.94535 73.89231 52.93167 243.69569
17.65000 -2600.50827 -4.38962 74.36676 158.82394 56.60272 239.34765
17.75000 -2554.72916 -15.84372 98.55462 209.58241 168.43596 224.22544
17.85000 -2558.40009 11.36443 43.23380 56.46926 51.37180 209.42139
17.95000 -2538.45864 6.04820 55.31665 53.27993 44.42731 212.60014
18.05000 -2531.08376 0.45092 71.29851 78.57713 46.08591 212.41909
18.15000 -2512.31563 13.09447 85.58311 38.07168 61.80952 210.16124
18.25000 -2484.51090 18.82899 67.48594 110.81908 147.10928 199.53465
18.35000 -2479.46573 5.94000 85.44894 42.33403 41.93244 214.69855
18.45000 -2455.90268 3.61252 103.46135 67.82602 57.24350 176.33170
18.55000 -2445.18293 -11.39168 101.44596 56.36454 120.68861 212.39404
18.65000 -2441.32106 5.45428 108.24873 43.81318 42.24803 168.90386
18.75000 -2407.19576 30.57551 136.41842 167.65784 203.04562 259.02645
18.85000 -2409.36475 -3.52680 111.85869 48.42912 52.06350 194.58617
18.95000 -2390.15315 10.20494 123.96828 91.55196 53.46307 204.28653
19.05000 -2439.56234 -18.43036 137.01322 565.66321 214.26429 361.60189
19.15000 -2371.49348 7.80484 126.30007 49.80707 39.56925 152.12550
19.25000 -2356.25308 -1.17198 68.12385 46.34814 62.36940 186.39308
19.35000 -2335.35393 1.53016 108.94314 43.25265 32.08743 165.93365
19.45000 -2340.52392 3.53132 66.26178 68.72666 24.49666 159.28832
19.55000 -2301.70882 2.33168 84.90668 64.04980 35.56196 162.61239
19.65000 -2303.80215 2.06874 102.05584 45.38821 32.21552 163.12921
19.75000 -2289.11626 9.15243 119.56160 40.52736 29.70316 133.93831
19.85000 -2281.13768 -3.60431 93.38356 64.19235 83.95236 150.53267
19.95000 -2260.22325 -0.01037 73.33106 42.24077 40.21326 158.77957
