0.12500 0.02310
0.37500 0.01543
0.62500 0.01995
0.87500 0.04049
1.12500 0.08445
1.37500 0.12197
1.62500 0.17140
1.87500 0.17502
2.12500 0.19276
2.37500 0.21912
2.62500 0.22216
2.87500 0.21361
3.12500 0.21349
3.37500 0.17906
3.62500 0.16279
3.87500 0.12998
4.12500 0.10722
4.37500 0.10422
4.62500 0.08521
4.87500 0.06777
5.12500 0.06623
5.37500 0.07410
5.62500 0.07409
5.87500 0.07863
6.12500 0.05909
6.37500 0.05969
6.62500 0.05475
6.87500 0.05392
7.12500 0.06254
7.37500 0.06936
7.62500 0.06981
7.87500 0.07084
8.12500 0.06403
8.37500 0.06850
8.62500 0.07302
8.87500 0.05405
9.12500 0.05890
9.37500 0.06034
9.62500 0.04475
9.87500 0.03834
10.12500 0.05895
10.37500 0.06997
10.62500 0.05681
10.87500 0.07161
11.12500 0.05518
11.37500 0.04002
11.62500 0.04698
11.87500 0.02925
12.12500 0.01317
12.37500 0.00461
12.62500 0.01417
12.87500 0.02717
13.12500 0.01862
13.37500 0.00691
13.62500 0.04061
13.87500 0.04166
14.12500 0.01608
14.37500 0.02819
14.62500 0.03361
14.87500 0.03026
