0.120000 2.654610
0.380000 1.664160
0.620000 1.679280
0.880000 1.820120
1.120000 1.777650
1.380000 1.760700
1.620000 1.852030
1.880000 1.809710
2.120000 1.789290
2.380000 1.824600
2.620000 1.912120
2.880000 1.887070
3.120000 1.843920
3.380000 1.814860
3.620000 1.776740
3.880000 1.778290
4.120000 1.786400
4.380000 1.760630
4.620000 1.762650
4.880000 1.758020
5.120000 1.680860
5.380000 1.646020
5.620000 1.627950
5.880000 1.573960
6.120000 1.504350
6.380000 1.530290
6.620000 1.456800
6.880000 1.480300
7.120000 1.480640
7.380000 1.406400
7.620000 1.187990
7.880000 0.840590
8.120000 0.565860
8.380000 0.162310
8.620000 -0.303610
8.880000 -1.360520
9.120000 -1.783270
9.380000 -1.925640
9.620000 -1.726970
9.880000 -1.550830
10.120000 -1.561970
10.380000 -1.137020
10.620000 -1.163190
10.880000 -1.510760
11.120000 -1.575420
11.380000 -1.612430
11.620000 2.375580
11.880000 1.108240
12.120000 1.108350
12.380000 1.146230
12.620000 1.155870
12.880000 1.064200
13.120000 1.143190
13.380000 1.112380
13.620000 1.055790
13.880000 1.298300
14.120000 1.326780
14.380000 1.307480
14.620000 1.278530
14.880000 1.156860
