0.05000 -1579.60230 19.00668 30989.90341 2127.42149 1680.50636 537360.21119
0.15000 -3856.01050 -27.54700 9054.64827 1993.58618 1984.70135 351870.28368
0.25000 -5913.43592 -85.47338 -14663.40618 3133.59532 2270.52222 435385.12811
0.35000 -7694.90216 -6.13784 3092.60299 2484.96826 1972.47652 383980.59092
0.45000 -8870.02532 -52.03501 -4432.89084 6806.42481 2627.17263 397330.83972
0.55000 -9319.86706 29.29216 -1756.96131 1975.65052 1381.94841 361813.49089
0.65000 -9762.31220 24.68588 -4636.74643 2160.58720 1867.29872 329315.40235
0.75000 -10007.82226 0.87572 -4362.49424 2463.37547 2121.17810 374212.68830
0.85000 -10049.60017 -14.36543 -2453.66927 1959.43235 2305.56965 313225.53338
0.95000 -10142.13872 18.02052 7941.42472 1846.01078 1761.16292 342112.29395
1.05000 -10169.41145 31.66615 6918.81754 1829.49821 1106.69456 320177.63426
1.15000 -10066.15327 -6.33607 -3269.77907 2040.71411 2070.69090 275495.07940
1.25000 -9957.12802 -18.77868 -2214.32712 1691.91206 1391.17863 293431.86227
1.35000 -9881.86211 6.65519 -103.04801 1375.33008 1052.13173 283025.44437
1.45000 -9811.69364 -13.67619 566.84245 1362.12575 1060.64017 260068.31969
1.55000 -9758.27983 -25.29275 -1737.17298 1355.32133 1453.29773 249462.18698
1.65000 -9661.07048 1.25797 -1554.21348 1616.33411 1226.20978 246176.04218
1.75000 -9507.97928 -3.93928 1803.48618 1347.07410 1435.85496 214801.50649
1.85000 -9435.89516 9.47872 3627.87894 1674.10477 1611.01961 209767.13361
1.95000 -9348.51289 22.77157 -1150.97070 1124.19046 1215.88583 234142.93569
2.05000 -9222.89390 -0.16143 -2968.14535 1011.56613 937.33511 195388.12603
2.15000 -9159.85004 -3.29252 2772.84244 1061.47205 1788.10358 191364.08136
2.25000 -9134.28850 4.62358 -2344.92366 757.26078 803.44328 184830.31671
2.35000 -9031.02058 10.22247 423.23496 1158.61500 1285.23816 174687.30321
2.45000 -8961.35334 7.72124 4011.70824 1000.00997 894.37373 150945.52352
2.55000 -8880.91419 -29.76619 3090.39803 738.48841 2907.30389 150019.36727
2.65000 -8794.99702 6.63771 1316.28550 634.42460 762.43215 140462.31105
2.75000 -8721.20207 -7.99870 1255.74868 1285.12908 1120.75492 148142.20162
2.85000 -8634.51233 4.63716 1042.48802 667.14875 715.96294 146904.14694
2.95000 -8568.17711 16.68858 441.58851 621.23414 1243.42072 143564.41502
3.05000 -8487.96020 20.52910 464.36428 2967.38254 2050.57286 124674.84690
3.15000 -8437.02447 -4.73977 800.06847 538.91848 630.52204 115142.40623
3.25000 -8365.81204 3.95724 347.51185 650.28336 651.59491 115782.31647
3.35000 -8255.59830 -5.53966 939.75541 866.11216 1337.29352 110625.71070
3.45000 -8177.59212 12.85257 1816.43455 1242.00811 909.56344 106193.73257
3.55000 -8081.09131 2.92759 2224.45387 715.24308 615.76509 97850.16783
3.65000 -7993.47192 9.92051 -1434.82489 598.61710 653.72913 98256.27288
3.75000 -7918.36769 6.50947 -11.30368 527.79067 539.81516 98055.88045
3.85000 -7848.23964 20.97131 1969.33548 601.37167 1099.15969 91167.10586
3.95000 -7790.32070 6.00245 854.16695 609.71789 625.59463 86362.61174
4.05000 -7689.81338 10.81196 615.33230 607.18835 500.30788 80656.12219
4.15000 -7619.62739 4.94286 897.52979 636.76586 900.27363 84467.20381
4.25000 -7555.20389 9.25792 670.25879 535.13866 494.42641 83176.35872
4.35000 -7478.52467 15.79068 -733.00872 667.38407 915.88909 74616.98317
4.45000 -7431.60541 10.85830 -937.23250 480.84909 423.59129 77366.87134
4.55000 -7355.25623 -0.58177 734.32312 592.61530 850.88442 69710.96911
4.65000 -7290.86460 9.87371 1082.72935 562.54050 473.27582 76140.67276
4.75000 -7225.41346 3.64728 1038.30901 514.35684 436.35183 65599.10838
4.85000 -7155.02275 7.85216 68.90906 469.99316 415.39366 64058.00972
4.95000 -7084.70418 10.81314 27.96256 457.33729 476.61098 69145.89690
5.05000 -7025.67157 -13.04802 411.07556 530.75526 1607.90000 56229.34975
5.15000 -6963.84299 2.84795 -764.57655 369.39768 367.77728 53865.18896
5.25000 -6905.06364 4.63631 -633.85003 362.59838 633.69283 54610.30930
5.35000 -6835.40446 7.80086 1387.47170 474.32713 534.27991 54241.94393
5.45000 -6772.21752 -0.62367 -447.93855 398.08029 370.82310 73388.17284
5.55000 -6710.21239 9.84352 195.23721 370.09688 314.07988 44753.10206
5.65000 -6645.99759 9.18863 1202.35651 302.77075 326.50555 56614.78114
5.75000 -6582.02341 7.08853 460.25164 339.17843 335.79405 48687.27575
5.85000 -6525.96742 2.16046 483.54957 488.25681 501.13261 44682.25142
5.95000 -6480.03130 -0.64830 174.81782 360.02805 386.32268 55312.38414
6.05000 -6432.15647 6.78286 2.11465 323.03484 364.20475 39911.75514
6.15000 -6371.02524 7.22954 -1012.81387 353.67915 344.71769 40707.22577
6.25000 -6324.14366 6.62637 -228.87511 320.93822 281.12485 41045.04452
6.35000 -6272.81894 3.90093 -871.18127 759.48593 432.97223 39149.44227
6.45000 -6213.55661 -0.66540 456.16485 546.69137 577.21908 35890.34739
6.55000 -6155.41571 6.10840 -502.68280 280.75659 298.36841 37792.38661
6.65000 -6115.62306 7.60548 757.54214 380.32801 433.20068 32186.02501
6.75000 -6041.71244 -28.66785 304.00144 1715.98167 2458.90475 34112.51406
6.85000 -6020.05163 4.46203 -114.99446 348.01471 391.68026 32530.83401
6.95000 -5965.47182 4.16973 672.19618 278.77906 260.87588 30227.50550
7.05000 -5910.46823 2.26381 -161.42371 432.41299 394.72732 61868.63574
7.15000 -5878.92680 -1.81169 -128.41363 743.11151 465.57049 29061.88062
7.25000 -5820.06261 3.35991 515.40183 1100.16149 863.93193 27399.23849
7.35000 -5789.87025 -1.26127 79.33024 364.82987 294.82221 27637.89259
7.45000 -5743.72848 2.80744 -622.14454 572.97964 1200.95065 43937.78553
7.55000 -5718.40052 -3.04594 -81.94513 1089.80697 679.48732 26414.07750
7.65000 -5648.35504 3.02569 -651.12551 249.70616 260.13599 38401.42651
7.75000 -5595.47765 5.53440 -220.59550 417.47277 202.42930 26350.98941
7.85000 -5542.90186 8.76298 616.84404 245.00688 779.94013 48139.88224
7.95000 -5493.12337 -6.77618 244.82637 636.08857 670.18397 21574.79098
8.05000 -5440.19464 2.47301 -203.43679 663.01053 525.21221 21818.74751
8.15000 -5392.57211 2.81436 -1199.82783 264.11130 249.15027 67589.10935
8.25000 -5343.74855 3.84816 83.39376 256.81606 224.57147 20239.28666
8.35000 -5299.76315 11.84374 1068.05303 242.88992 390.87161 49099.99794
8.45000 -5240.75556 1.39314 -766.74954 256.38332 229.48421 35792.80373
8.55000 -5199.23111 -2.72335 87.80721 296.29842 281.29380 19417.58749
8.65000 -5157.66104 0.64436 42.13557 237.75305 289.27496 18885.99821
8.75000 -5108.32971 -0.87716 34.88662 502.25805 518.28366 21622.18379
8.85000 -5068.47776 2.68742 -358.61304 208.98332 181.25215 22017.80976
8.95000 -5019.96886 1.15257 -4.87486 195.89780 171.65599 16339.74494
9.05000 -4972.21633 2.93109 -30.77520 367.87399 330.16201 17466.31824
9.15000 -4927.41146 9.23811 -88.89352 499.39681 358.59020 16125.62902
9.25000 -4885.35487 -3.82093 -150.86477 280.93556 538.72845 14607.80407
9.35000 -4858.33405 -5.46656 -78.47875 244.96559 355.03084 15253.96205
9.45000 -4805.39638 3.32887 -255.85418 331.93143 216.38684 14905.14588
9.55000 -4758.14140 -5.48744 -107.21124 321.96210 405.52302 14509.96629
9.65000 -4729.10593 1.79235 414.76291 171.04399 278.57896 18529.83590
9.75000 -4688.78486 1.71504 -26.92378 144.80822 130.49922 12350.84097
9.85000 -4652.01314 -3.87149 -182.65927 175.19479 299.72078 14275.38582
9.95000 -4615.84562 0.46913 -298.96857 247.64266 178.59256 14881.89889
10.05000 -4577.11413 -0.73060 -123.07995 172.35179 183.99735 12494.41036
10.15000 -4543.47908 3.97458 -138.83949 144.21990 144.41390 11249.37484
10.25000 -4501.66058 3.66078 3.57144 201.10980 158.14423 14765.73304
10.35000 -4460.02440 2.51871 -159.82366 225.25944 187.06709 10094.25548
10.45000 -4433.05394 -2.25244 192.93480 241.21634 165.23011 9371.72536
10.55000 -4386.33958 0.56791 -132.00614 254.91205 445.71948 10896.61378
10.65000 -4355.00076 7.19553 227.58861 130.70818 138.79639 10091.66823
10.75000 -4316.77843 1.91363 -54.18423 124.96768 102.40323 9980.05664
10.85000 -4279.40997 -2.60562 -113.24926 137.64418 149.32625 10725.20603
10.95000 -4242.39154 2.57785 -97.11033 183.05433 153.70357 10814.69714
11.05000 -4207.57579 2.79818 33.62068 151.36143 168.97568 9304.16475
11.15000 -4180.47598 -10.63350 303.66565 473.95705 588.21584 8208.01817
11.25000 -4151.40658 1.09261 -44.68866 220.47862 182.97161 7730.27629
11.35000 -4097.10681 -6.08077 73.83732 475.35732 436.43563 7680.60103
11.45000 -4076.59888 5.20274 -95.89225 143.23804 222.70963 8062.73556
11.55000 -4042.01302 1.59193 -134.44732 138.63325 118.53231 7452.48631
11.65000 -4007.67662 0.44727 -34.11581 154.50200 144.75368 8463.31348
11.75000 -3975.84179 3.28384 4.57472 109.93398 128.18213 7413.99898
11.85000 -3943.97130 3.70190 -104.27128 115.24610 114.14598 7680.11393
11.95000 -3909.02089 3.53417 496.05199 108.48425 101.24792 8073.80639
12.05000 -3906.06037 -8.98407 -82.89747 866.83001 549.27488 6484.81797
12.15000 -3856.70680 -7.96453 271.41477 251.36412 333.26884 7847.05069
12.25000 -3823.52516 -0.73047 129.92227 114.61841 177.85206 5732.76251
12.35000 -3803.64082 -11.23133 62.78642 185.94072 444.45536 6107.28487
12.45000 -3760.11959 2.08428 96.67369 95.36980 88.73451 5458.35493
12.55000 -3723.92385 -7.20885 71.26355 211.46182 226.74468 7190.23232
12.65000 -3700.55822 1.23394 286.10585 126.80492 104.67747 5624.20555
12.75000 -3667.99191 2.22253 232.61788 141.84665 101.62124 5823.21474
12.85000 -3648.13063 4.56684 275.24498 115.34963 166.88508 6407.46541
12.95000 -3616.08834 -0.83676 -41.06562 155.82223 88.17912 5305.12702
13.05000 -3599.26326 -0.50961 23.22800 301.18082 396.08798 5199.73754
13.15000 -3564.20736 2.05464 5.79649 100.59371 105.90129 4654.33626
13.25000 -3540.63996 -0.58670 76.38455 359.78541 118.99322 4882.73179
13.35000 -3510.99094 -2.00167 139.59035 337.79052 224.62571 4302.65546
13.45000 -3501.18674 -3.34742 66.17011 182.09889 316.61321 4927.77141
13.55000 -3471.15823 4.23632 178.59878 120.14432 117.32913 4756.53326
13.65000 -3445.61094 -3.80217 74.90087 130.88753 172.65204 4804.28753
13.75000 -3421.62749 3.01793 86.55992 98.89931 90.01183 4547.54601
13.85000 -3396.33887 2.13945 100.89825 90.40204 91.18588 3638.90790
13.95000 -3371.92332 -20.53676 94.46435 131.31019 906.58573 5107.98185
14.05000 -3356.42150 -0.27197 99.62819 84.01642 84.62139 3907.17505
14.15000 -3331.06079 3.52138 160.27566 120.76773 77.62338 5575.75765
14.25000 -3306.89626 -0.43562 208.64331 118.90689 168.05664 3949.14424
14.35000 -3287.91183 0.41879 41.31852 107.89414 92.81379 4156.26533
14.45000 -3255.71672 2.71218 -65.74220 142.43724 76.26129 3666.11546
14.55000 -3229.82284 0.11591 69.54516 314.97821 349.42845 4696.55896
14.65000 -3200.86511 -0.49334 -58.01806 78.10089 96.86274 3733.33642
14.75000 -3176.39255 4.14741 -166.35077 85.77501 66.86962 6057.69795
14.85000 -3149.57647 1.76880 23.84032 91.93885 86.01278 3238.80454
14.95000 -3125.53410 -2.29340 156.73468 69.25026 72.18976 3107.67135
15.05000 -3104.53628 5.85359 209.87704 85.73913 93.32435 2885.06945
15.15000 -3078.63676 -0.79751 192.90340 86.35831 84.67923 3818.84074
15.25000 -3057.94220 3.36563 8.60049 55.43879 64.09243 2970.42883
15.35000 -3040.95847 -0.82208 208.81095 65.15119 74.04719 4011.71531
15.45000 -3015.93579 -2.94856 21.15989 69.39122 50.56881 2122.63285
15.55000 -2996.56773 -1.22878 66.42982 95.05856 98.13711 3417.93499
15.65000 -2962.78586 -3.23786 134.97409 247.91210 81.92314 3720.87527
15.75000 -2951.87771 1.63518 174.01868 60.64826 59.11530 2706.20727
15.85000 -2930.60437 0.00323 66.86113 67.75549 56.17737 2830.58156
15.95000 -2911.35324 4.26728 -37.76944 97.22591 87.42722 3665.03410
16.05000 -2894.48997 1.21206 11.01559 52.08518 51.76245 2934.56573
16.15000 -2879.94410 -0.28031 137.57671 64.88357 53.75517 2117.72093
16.25000 -2862.54815 4.17018 52.40511 55.79430 140.74890 1745.73019
16.35000 -2831.84765 -3.29610 127.72305 435.01955 149.51712 1852.52868
16.45000 -2825.40986 0.41623 -45.41399 91.83325 55.58739 2778.61069
16.55000 -2812.01749 1.12527 83.38707 76.56616 69.05634 2021.20344
16.65000 -2784.13261 -3.56474 25.63844 189.31886 342.14201 1585.14034
16.75000 -2782.52206 0.96052 29.00391 69.03355 54.40421 1845.27930
16.85000 -2766.60208 2.68671 11.94777 74.11808 76.72258 1972.45999
16.95000 -2747.60192 3.74160 -58.82271 100.04733 93.04736 2563.53522
17.05000 -2730.30707 1.19111 92.14013 70.58459 53.91933 2167.04609
17.15000 -2712.68719 2.78478 -30.65202 48.76535 66.10990 2001.86353
17.25000 -2695.38222 -3.31681 13.25138 54.37198 90.33796 1582.30893
17.35000 -2674.96428 2.92273 112.52563 66.49895 54.63980 1981.22142
17.45000 -2661.99933 -0.51526 -71.67566 63.05995 69.19656 1745.63599
17.55000 -2641.25705 0.47668 111.69220 70.96292 70.46787 1921.44972
17.65000 -2625.05928 1.39835 -26.81295 52.32244 46.06780 2097.22003
17.75000 -2614.06977 -0.48584 -80.84322 57.26686 59.86786 2085.46011
17.85000 -2596.18501 2.02766 74.90933 44.79616 36.86317 1619.47932
17.95000 -2580.58464 -1.56345 -39.73891 73.15802 89.98586 2122.76856
18.05000 -2560.83191 1.40654 -41.69260 54.76735 45.31692 1446.50734
18.15000 -2547.95561 -9.34209 -35.53361 131.65113 116.46770 1234.69417
18.25000 -2529.30608 0.91307 20.98705 54.80713 37.61138 1478.21553
18.35000 -2509.47373 4.17685 20.16692 35.65548 50.86807 1690.96842
18.45000 -2495.17432 20.23265 83.18821 71.42609 354.11901 1330.96786
18.55000 -2478.89801 -1.98292 -156.20333 39.71297 42.77407 1693.94873
18.65000 -2465.62912 0.85886 2.24572 37.96023 41.97533 1183.31784
18.75000 -2443.82121 2.62991 22.79476 32.47577 30.58890 1098.28755
18.85000 -2435.25727 0.55420 17.13087 54.22138 53.54999 1075.99114
18.95000 -2416.96046 -0.19060 65.38094 82.42303 52.87792 1055.51183
19.05000 -2400.27817 -3.96976 6.49565 54.75098 53.66728 1007.56339
19.15000 -2385.58629 3.19298 -86.36051 51.49429 56.31627 1351.87233
19.25000 -2372.81048 3.14592 128.35597 57.08864 43.75391 1083.23415
19.35000 -2357.45287 2.21766 105.61081 44.73655 40.07070 1238.53283
19.45000 -2341.23197 -0.24525 47.90076 59.05713 58.74499 844.99228
19.55000 -2327.65074 20.23560 4.07742 41.52594 362.55798 966.62173
19.65000 -2318.55204 -1.84833 37.59453 41.15664 46.27266 1082.27390
19.75000 -2300.41681 -1.37563 -36.57741 36.52425 41.57424 753.77747
19.85000 -2290.80263 -1.36261 -23.53330 45.76759 44.14160 692.35332
19.95000 -2280.21283 -8.61864 -10.81404 52.80858 103.98135 1092.54018
