0.05000 1632.57844 536.55726 4213.19142 0.00000 0.00000 0.00000
0.15000 -1180.08338 -9.53900 3966.43310 1062.34249 1192.83046 302.21356
0.25000 -827.70218 346.82051 4160.92324 1384.25687 1175.33391 324.03150
0.35000 -644.40444 -351.56984 4121.16258 1391.73877 1310.34238 412.82088
0.45000 -1089.42236 26.02695 3980.05119 1276.76293 1472.35248 450.22772
0.55000 -1307.87646 -92.16292 3868.53639 1195.81620 1517.13483 538.76818
0.65000 -1650.76806 -123.63616 3747.15190 1272.44997 1442.43682 557.16567
0.75000 -1744.17732 90.90819 3597.03963 1381.89961 1506.62121 713.81351
0.85000 -1917.99732 -113.15589 3354.76985 1350.58914 1544.49275 801.41783
0.95000 -2206.80844 -4.76832 3098.65660 1344.22577 1531.31332 931.48521
1.05000 -2267.58601 75.80342 2811.97103 1284.19247 1715.32016 1043.71826
1.15000 -2421.76330 34.20033 2484.61820 1434.06767 1664.52556 1258.76260
1.25000 -2690.85489 52.30902 2197.49112 1322.30376 1613.27126 1414.19822
1.35000 -2741.77563 -31.92201 2071.84679 1338.54908 1508.08100 1554.28591
1.45000 -2898.54333 117.92762 1721.96998 1318.91225 1430.41115 1801.61269
1.55000 -3031.89124 -10.18203 1342.05620 1284.39736 1457.40632 2002.40594
1.65000 -2998.54436 -49.36383 1247.41327 1321.58287 1333.96195 2215.30651
1.75000 -3146.16120 -76.87313 1015.68675 1227.88965 1243.75561 2250.44551
1.85000 -3219.70402 30.73647 1064.27210 1115.17101 1115.86710 2260.27009
1.95000 -3300.23512 36.83870 936.95646 1074.54064 1054.22302 2240.87454
2.05000 -3307.27418 17.60051 798.06399 1113.48702 992.44625 2316.08465
2.15000 -3286.69984 -14.30371 805.65711 1109.00103 935.26553 2368.32857
2.25000 -3287.90501 30.09480 800.77841 1152.51850 873.79965 2333.04342
2.35000 -3260.53829 -54.38712 794.74719 1077.10195 825.00344 2393.22354
2.45000 -3299.58726 45.87716 683.36740 1072.62529 779.64827 2381.00332
2.55000 -3367.58867 4.11614 590.88385 1039.89771 763.95670 2326.38075
2.65000 -3401.00421 -18.31092 559.20302 1004.79738 726.02335 2315.39122
2.75000 -3382.53226 -7.65301 557.48773 1029.53788 690.32279 2306.96861
2.85000 -3336.20924 18.94930 459.64119 1052.59127 672.07163 2345.34683
2.95000 -3271.26434 -25.93811 401.86335 1066.17408 651.42436 2428.44059
3.05000 -3283.51432 12.66410 301.54705 1048.37538 624.07035 2414.93960
3.15000 -3280.44428 -4.20510 474.49648 1039.67970 582.25761 2369.74389
3.25000 -3292.20533 9.77322 337.09088 1007.51707 578.38820 2367.49836
3.35000 -3277.67523 2.52237 401.75344 1005.20096 546.69159 2326.53635
3.45000 -3262.62144 14.19675 254.80740 1017.80105 531.52430 2336.80476
3.55000 -3240.67315 -0.58226 207.30127 997.86620 521.99177 2351.62279
3.65000 -3230.92822 1.48786 246.02743 970.61283 501.68697 2346.69163
3.75000 -3240.57159 -2.20762 164.69241 937.09349 478.64522 2325.71894
3.85000 -3172.11936 -20.77120 259.61072 1000.92814 465.09089 2344.52079
3.95000 -3252.94205 11.86880 178.95981 918.00403 447.81029 2252.37837
4.05000 -3204.87531 -4.12008 230.85866 952.39750 445.31838 2270.82605
4.15000 -3158.98001 -9.58574 92.78350 948.69861 425.96436 2310.20224
4.25000 -3159.14613 4.78871 206.08251 956.06215 412.24083 2257.88322
4.35000 -3102.21162 4.79904 235.91510 934.07333 387.36022 2294.51307
4.45000 -3094.30395 -7.18457 102.97128 942.17671 388.66874 2286.34038
4.55000 -3050.83600 -4.76977 131.77408 963.10610 379.79068 2282.67040
4.65000 -3054.52519 25.47369 201.16510 923.36860 365.20110 2243.45527
4.75000 -2996.08894 0.91781 74.63331 925.26016 357.15795 2299.72119
4.85000 -3051.57827 -2.33433 188.51742 878.94666 346.07558 2198.08638
4.95000 -3016.23845 6.06262 93.83770 868.07909 335.17355 2215.63136
5.05000 -2962.52658 0.68750 74.80256 896.14709 333.65385 2245.12152
5.15000 -3005.40750 2.74440 56.43950 852.48450 322.20086 2181.22785
5.25000 -2990.25137 3.26404 71.10856 863.68998 310.85148 2150.02962
5.35000 -2962.18872 1.29059 53.63072 859.42539 307.07839 2165.15051
5.45000 -2952.36396 4.08910 120.19230 849.77153 296.72020 2144.73693
5.55000 -2927.32745 -0.66603 90.51336 880.81341 288.12322 2127.33564
5.65000 -2915.39138 -3.86106 60.50523 863.02469 287.40046 2128.38420
5.75000 -2914.78210 0.78387 63.66592 838.75779 276.88791 2102.73163
5.85000 -2858.74733 1.52297 -6.81069 854.74751 272.73316 2151.34797
5.95000 -2874.73601 6.25613 20.96141 851.36455 267.47375 2092.16874
6.05000 -2883.78784 0.52300 123.85852 810.09562 253.63941 2045.19392
6.15000 -2841.65969 1.68187 70.14404 830.09262 249.23378 2072.31683
6.25000 -2828.75995 -9.45292 59.83866 833.97400 251.83208 2059.41755
6.35000 -2805.34886 4.95028 41.68893 821.51075 243.47101 2060.54694
6.45000 -2771.10904 -1.29852 25.98353 819.93392 236.25523 2075.29421
6.55000 -2756.25254 3.85557 -12.75625 827.09974 233.59595 2070.57363
6.65000 -2758.82276 6.94619 4.64857 802.28389 226.95184 2038.95684
6.75000 -2753.20060 6.12157 48.97660 784.71112 223.09066 2019.82005
6.85000 -2750.34626 -4.23914 85.71030 782.70607 221.74738 1986.60612
6.95000 -2719.92820 -4.81725 5.08172 790.96280 213.28977 2006.43949
7.05000 -2707.43288 -4.13384 -32.24196 788.63713 212.09169 1993.93531
7.15000 -2702.94011 0.41365 75.40139 778.74439 209.40288 1959.73299
7.25000 -2695.88621 0.67956 -34.51709 776.21390 201.44411 1955.37162
7.35000 -2679.00477 1.61500 18.68373 764.17503 197.91071 1949.42097
7.45000 -2659.01704 5.54904 -26.24587 773.67518 195.20836 1939.35358
7.55000 -2633.48377 -7.77999 1.50862 764.68763 196.84716 1941.88580
7.65000 -2641.59194 -0.30568 -11.31653 755.64349 192.69485 1907.75820
7.75000 -2619.01965 -3.47586 -60.12059 751.28104 188.46822 1909.44200
7.85000 -2589.02968 3.03787 -19.01491 766.47948 184.13339 1910.14083
7.95000 -2587.54421 1.20514 40.37680 748.46799 180.42665 1880.06809
8.05000 -2572.34243 2.20618 38.60349 751.00876 179.85189 1867.47768
8.15000 -2517.94320 5.35558 -8.00131 765.80347 174.11970 1912.71400
8.25000 -2556.89791 -5.22674 -19.17732 750.60141 170.72123 1840.66845
8.35000 -2549.60923 5.19720 -63.29889 699.52611 168.80680 1843.29062
8.45000 -2498.24785 -4.50919 -16.45694 732.58544 168.37669 1861.25905
8.55000 -2520.54644 -3.83155 -36.33132 717.88857 165.39732 1819.59311
8.65000 -2477.86691 5.00459 -66.11327 721.21554 161.23972 1840.55051
8.75000 -2466.17740 1.02598 -55.51303 713.56773 161.05856 1835.66292
8.85000 -2466.07393 -1.87026 7.06192 707.90323 154.55205 1808.36653
8.95000 -2490.12874 -1.62917 -73.40842 688.79780 158.20584 1756.35143
9.05000 -2437.23759 -1.68062 -10.56437 711.46915 150.78262 1788.33111
9.15000 -2398.13613 1.75767 -40.45216 717.67518 149.50455 1810.84307
9.25000 -2424.31968 2.85551 -91.56859 699.81995 149.38109 1765.21043
9.35000 -2397.68247 1.24259 -38.95961 697.46386 146.40410 1768.11452
9.45000 -2378.12438 0.41745 -50.77265 686.00748 142.77216 1771.10378
9.55000 -2396.56111 0.06484 11.52916 660.80237 143.80649 1717.58631
9.65000 -2337.55539 -1.45343 -5.30776 696.22954 140.98781 1758.41931
9.75000 -2356.84619 -2.33113 -70.55629 677.33519 137.90878 1714.49863
9.85000 -2341.45522 6.54528 -92.83980 666.45289 133.68801 1719.00257
9.95000 -2341.35867 0.95363 -35.42566 658.02392 133.29617 1691.58727
10.05000 -2333.83246 -1.55644 -30.14333 657.97536 129.36517 1674.65977
10.15000 -2298.88316 -3.47556 -11.35065 665.73486 131.40006 1689.66258
10.25000 -2254.34018 -1.18830 -25.09472 676.59106 128.28322 1719.22634
10.35000 -2280.48428 -0.84452 -45.89139 651.01382 125.86394 1670.01496
10.45000 -2262.34405 -2.39554 -4.62589 647.21248 123.98757 1662.50337
10.55000 -2252.54524 1.33075 -42.83848 646.87814 121.55565 1652.89086
10.65000 -2241.96866 0.69630 -62.85875 638.78485 121.38576 1647.97399
10.75000 -2228.53616 -0.80639 -19.23824 630.89678 118.75384 1640.97637
10.85000 -2221.12416 -2.32600 -48.97451 633.97394 115.29188 1625.13244
10.95000 -2197.30004 3.38532 -36.69779 643.51498 119.58045 1628.22155
11.05000 -2204.56606 0.67476 -24.53492 623.10930 115.66265 1601.34548
11.15000 -2166.95498 -2.79074 -42.31100 633.61241 113.34542 1625.13302
11.25000 -2173.76061 -3.33543 -68.38063 623.14410 113.03292 1598.75672
11.35000 -2167.33308 3.06707 -62.60287 617.03506 112.61354 1583.59841
11.45000 -2137.03140 0.02051 -94.78210 620.87229 109.44905 1596.24728
11.55000 -2127.64148 1.96049 12.89508 615.98164 105.09511 1578.28334
11.65000 -2131.98937 -0.07454 -90.45087 622.99989 108.73829 1554.31514
11.75000 -2096.63040 -2.07558 -74.80890 633.77891 105.96041 1572.44948
11.85000 -2086.99027 0.54034 -71.61612 615.17085 106.06601 1573.76544
11.95000 -2094.06137 2.23746 18.32610 616.86592 102.21069 1529.09874
12.05000 -2087.67343 -2.76490 7.54537 593.34151 101.32649 1527.82889
12.15000 -2063.23936 3.00205 -67.93073 602.32096 100.66712 1536.35454
12.25000 -2067.62548 -1.63112 -42.63364 583.34791 98.44258 1515.60210
12.35000 -2060.99110 -0.14074 -96.63877 586.92636 100.91683 1505.87548
12.45000 -2046.10467 -2.30985 -3.63833 588.14178 97.34003 1494.57669
12.55000 -2042.86216 -1.11400 -71.35344 577.48815 96.25289 1486.80487
12.65000 -2019.92744 -0.80174 -73.69952 578.90118 93.72976 1493.34547
12.75000 -2026.25621 0.14781 -69.84787 565.59556 94.69425 1466.36808
12.85000 -1993.26795 -1.02792 -62.16710 584.11339 91.08897 1480.09849
12.95000 -2007.00822 0.61240 -32.31066 557.78658 92.72335 1447.92349
13.05000 -1977.18910 -3.72451 -55.78790 564.91353 91.45484 1465.98997
13.15000 -1964.87745 -2.07647 -55.89389 562.03166 89.97307 1460.10696
13.25000 -1971.00304 -0.37937 -45.48860 557.58282 88.73599 1430.52601
13.35000 -1945.56897 -1.46710 -47.23654 561.01139 87.09981 1444.40953
13.45000 -1958.01846 -0.26349 -83.43050 554.37476 86.62738 1412.37332
13.55000 -1956.03348 -1.60965 -118.23289 544.74887 86.10684 1395.50507
13.65000 -1917.91445 -0.00923 -108.94195 559.53814 85.74070 1421.32674
13.75000 -1915.43159 0.39263 -34.22673 549.54307 83.66566 1405.26505
13.85000 -1887.92576 0.35933 -43.43526 555.27201 84.29447 1417.74204
13.95000 -1872.55049 0.12216 -55.43528 556.30959 82.62688 1420.10226
14.05000 -1876.76900 0.26061 -39.28058 545.25479 80.45368 1397.67910
14.15000 -1876.61517 -0.07694 -45.90439 538.47979 82.04028 1382.29145
14.25000 -1858.95708 0.11934 -39.60851 538.75961 80.63255 1385.32419
14.35000 -1861.21850 1.48569 -111.47140 534.01654 79.79821 1365.91379
14.45000 -1837.25139 -1.31554 -29.23192 526.26691 79.09975 1379.45742
14.55000 -1835.13325 0.48836 -83.68462 535.08050 75.97480 1361.78295
14.65000 -1843.27310 0.05416 -53.43874 516.34059 77.12179 1335.36130
14.75000 -1833.82108 -0.99397 -45.77837 511.95826 76.69657 1330.96782
14.85000 -1811.21976 1.90446 -65.26925 521.56127 75.64577 1341.22895
14.95000 -1817.88444 -0.41864 -36.14434 502.24657 74.95625 1322.97965
15.05000 -1800.72385 0.65418 -12.86800 521.05964 72.16501 1312.60148
15.15000 -1777.13213 -0.03575 -52.08982 518.90421 72.50321 1332.73367
15.25000 -1793.44629 0.18977 -103.28474 502.42528 72.92123 1300.45046
15.35000 -1762.34465 -0.65517 -62.25671 514.51658 72.95049 1315.47051
15.45000 -1761.72777 -0.99441 -11.43145 509.03451 69.28694 1297.00945
15.55000 -1756.40418 1.30003 -54.67803 495.30054 69.39792 1292.89708
15.65000 -1734.14319 -0.13399 -21.19777 521.61955 67.46990 1292.64053
15.75000 -1737.93378 -0.28616 -72.94388 499.83887 71.21604 1285.25119
15.85000 -1740.59491 -0.45847 -60.20089 486.74485 67.26230 1266.83690
15.95000 -1715.04199 -0.36300 -35.03105 498.15807 68.49321 1276.22068
16.05000 -1713.91638 -0.11347 -60.82722 495.22938 67.41600 1266.52991
16.15000 -1714.70391 0.26119 -71.04076 476.85697 65.40382 1254.56084
16.25000 -1708.60820 -1.07518 -42.98414 482.50976 67.08305 1241.09342
16.35000 -1688.17787 -0.08605 -104.06524 488.61522 66.44642 1253.83375
16.45000 -1675.93088 -0.17707 -61.05723 486.52077 63.58666 1252.49200
16.55000 -1694.21375 -0.83012 8.22697 460.25111 64.11264 1214.04400
16.65000 -1652.14434 -0.03612 -27.75392 483.98729 64.49399 1247.23496
16.75000 -1651.27462 -0.99052 -30.29069 484.62209 63.05591 1231.77115
16.85000 -1652.66142 -0.45551 -70.98547 473.03364 62.09060 1223.58694
16.95000 -1653.87781 -0.30220 -55.03998 473.31701 64.32138 1200.16402
17.05000 -1634.61164 0.95549 -48.95415 474.62024 60.78901 1208.77519
17.15000 -1630.90683 1.67401 -38.28973 463.25467 61.67215 1203.62955
17.25000 -1627.43190 -0.43065 -54.88416 464.42439 59.45375 1192.24727
17.35000 -1631.98499 2.20539 -60.06875 453.91911 59.73944 1171.08934
17.45000 -1630.32145 -0.28288 -59.32348 447.93953 59.54873 1161.66269
17.55000 -1606.23013 -0.44966 -48.40477 452.90986 59.61523 1176.33841
17.65000 -1605.16714 0.28479 -42.72610 448.75368 57.93769 1163.39211
17.75000 -1584.92587 -2.18869 -57.71704 454.75379 59.25634 1174.10077
17.85000 -1589.15468 2.00054 -23.95368 447.94057 58.10438 1150.24808
17.95000 -1570.68846 0.84586 -33.67873 454.35412 57.39740 1162.55105
18.05000 -1573.12946 2.06256 -55.24353 438.73603 57.06437 1144.29053
18.15000 -1575.51318 0.89781 -77.11384 438.49958 55.35348 1131.31533
18.25000 -1560.84518 -0.78608 -84.53146 445.11617 55.44972 1133.96825
18.35000 -1536.26636 -0.20122 -19.81397 442.74053 54.40172 1148.57178
18.45000 -1539.24581 1.12879 -52.07763 441.65052 53.59967 1133.47434
18.55000 -1527.54532 0.72264 -67.89791 436.68448 51.90021 1132.87956
18.65000 -1510.94639 0.95800 -50.40961 449.85013 52.37018 1136.51637
18.75000 -1517.28844 -0.93675 -31.38718 424.91260 53.48167 1120.03701
18.85000 -1507.52064 0.83069 -91.23462 442.96145 51.11189 1115.11420
18.95000 -1513.25083 -1.23009 -68.84407 429.44059 52.47418 1096.68451
19.05000 -1494.78931 0.34079 -47.43198 431.90950 51.58804 1106.17622
19.15000 -1474.67757 -0.53300 -54.66862 431.20439 53.48432 1118.03545
19.25000 -1486.05173 0.60877 -88.67257 426.34938 51.65880 1091.40190
19.35000 -1469.78602 -1.62771 -23.24739 424.33689 51.02257 1097.13013
19.45000 -1458.79732 0.70063 -49.59121 434.17724 49.43475 1096.04103
19.55000 -1477.32186 -0.17726 -24.64613 409.68854 49.60772 1063.51177
19.65000 -1466.72266 1.19080 -25.19027 414.65175 48.89316 1061.32224
19.75000 -1443.87914 -0.12170 -60.20398 425.53818 48.91287 1081.18309
19.85000 -1450.58088 1.57148 -47.01969 415.33150 49.43747 1058.10874
19.95000 -1440.78499 -0.61985 -18.49872 409.57066 46.38858 1060.52734
