0.12500 0.00888
0.37500 0.02671
0.62500 0.03771
0.87500 0.06385
1.12500 0.09674
1.37500 0.13197
1.62500 0.16948
1.87500 0.20417
2.12500 0.23168
2.37500 0.25154
2.62500 0.26231
2.87500 0.29069
3.12500 0.28116
3.37500 0.28374
3.62500 0.27587
3.87500 0.26800
4.12500 0.25735
4.37500 0.24955
4.62500 0.23109
4.87500 0.21466
5.12500 0.16962
5.37500 0.13886
5.62500 0.09518
5.87500 0.07203
6.12500 0.04361
6.37500 0.03985
6.62500 0.04906
6.87500 0.03950
7.12500 0.05341
7.37500 0.05817
7.62500 0.04895
7.87500 0.03983
8.12500 0.04337
8.37500 0.04670
8.62500 0.04931
8.87500 0.06427
9.12500 0.06426
9.37500 0.06407
9.62500 0.07445
9.87500 0.07136
10.12500 0.08135
10.37500 0.08733
10.62500 0.07550
10.87500 0.09233
11.12500 0.09187
11.37500 0.08092
11.62500 0.07359
11.87500 0.09066
12.12500 0.07563
12.37500 0.05868
12.62500 0.05864
12.87500 0.06073
13.12500 0.06393
13.37500 0.06191
13.62500 0.04296
13.87500 0.04330
14.12500 0.04877
14.37500 0.03754
14.62500 0.03553
14.87500 0.04168
