0.120000 1.610880
0.380000 0.673950
0.620000 0.609930
0.880000 0.458410
1.120000 0.537640
1.380000 0.504110
1.620000 0.501710
1.880000 0.555140
2.120000 0.510650
2.380000 0.545720
2.620000 0.493400
2.880000 0.529630
3.120000 0.522810
3.380000 0.529260
3.620000 0.547150
3.880000 0.552980
4.120000 0.552650
4.380000 0.550590
4.620000 0.547720
4.880000 0.549460
5.120000 0.549240
5.380000 0.608090
5.620000 0.614000
5.880000 0.599700
6.120000 0.624630
6.380000 0.644750
6.620000 0.615460
6.880000 0.632820
7.120000 0.678550
7.380000 0.685550
7.620000 0.688090
7.880000 0.773090
8.120000 0.756600
8.380000 0.737450
8.620000 0.692510
8.880000 0.776560
9.120000 0.698170
9.380000 0.623320
9.620000 0.532350
9.880000 0.299930
10.120000 -0.023890
10.380000 0.199260
10.620000 -0.277190
10.880000 -0.363030
11.120000 -0.500130
11.380000 -0.728720
11.620000 0.209400
11.880000 1.014480
12.120000 -0.354040
12.380000 0.714450
12.620000 0.648630
12.880000 0.947280
13.120000 0.286320
13.380000 0.896850
13.620000 0.661390
13.880000 0.822130
14.120000 0.787230
14.380000 0.942640
14.620000 1.011080
14.880000 0.464100
