0.125 -0.000 -0.001 0.001
0.375 -0.007 0.005 0.039
0.625 -0.001 0.004 0.230
0.875 -0.000 -0.010 0.659
1.125 -0.001 -0.001 1.322
1.375 0.019 0.052 2.141
1.625 -0.028 0.029 2.872
1.875 0.006 0.061 3.650
2.125 -0.018 0.119 4.312
2.375 -0.040 0.114 4.939
2.625 -0.041 0.161 5.386
2.875 -0.033 0.115 5.804
3.125 -0.059 0.180 6.284
3.375 -0.077 0.211 6.801
3.625 -0.037 0.182 7.226
3.875 -0.026 0.161 7.790
4.125 -0.118 0.190 8.097
4.375 -0.097 0.226 8.640
4.625 -0.053 0.279 9.120
4.875 -0.092 0.159 9.522
5.125 -0.105 0.181 10.101
5.375 -0.103 0.249 10.640
5.625 -0.134 0.205 11.130
5.875 -0.121 0.194 11.569
6.125 -0.205 0.297 12.700
6.375 -0.179 0.215 13.313
6.625 -0.251 0.297 14.127
6.875 -0.163 0.253 15.017
7.125 -0.237 0.338 16.680
7.375 -0.311 0.260 18.001
7.625 -0.322 0.220 19.543
7.875 -0.336 0.312 21.475
8.125 -0.358 0.376 22.514
8.375 -0.384 0.333 23.915
8.625 -0.412 0.295 24.177
8.875 -0.507 0.394 24.720
9.125 -0.459 0.319 24.960
9.375 -0.503 0.332 24.365
9.625 -0.425 0.324 24.005
9.875 -0.370 0.311 23.007
10.125 -0.422 0.305 22.892
10.375 -0.405 0.289 22.557
10.625 -0.381 0.254 22.053
10.875 -0.430 0.254 21.855
11.125 -0.400 0.285 22.470
11.375 -0.393 0.209 22.015
11.625 -0.346 0.262 21.710
11.875 -0.388 0.247 22.103
12.125 -0.429 0.215 22.207
12.375 -0.378 0.206 22.355
12.625 -0.451 0.265 22.748
12.875 -0.425 0.188 22.176
13.125 -0.363 0.233 22.125
13.375 -0.353 0.186 22.001
13.625 -0.375 0.239 21.314
13.875 -0.356 0.286 21.110
14.125 -0.347 0.205 20.425
14.375 -0.300 0.240 20.036
14.625 -0.307 0.217 19.489
14.875 -0.310 0.219 18.481
