0.120000 -0.065440
0.380000 -0.514040
0.620000 -0.033250
0.880000 -0.279100
1.120000 -0.236590
1.380000 -0.370560
1.620000 -0.333210
1.880000 -0.452010
2.120000 -0.324190
2.380000 -0.265320
2.620000 -0.221150
2.880000 -0.167800
3.120000 -0.177690
3.380000 -0.105460
3.620000 0.060900
3.880000 -0.011740
4.120000 0.055200
4.380000 -0.087610
4.620000 -0.072360
4.880000 -0.215640
5.120000 -0.508510
5.380000 -0.300860
5.620000 -0.490100
5.880000 -0.658410
6.120000 -0.788440
6.380000 -1.229730
6.620000 -1.057650
6.880000 -0.924730
7.120000 -1.231760
7.380000 -1.008170
7.620000 -0.734310
7.880000 -1.128430
8.120000 -0.980660
8.380000 -0.865930
8.620000 -0.792550
8.880000 -0.996990
9.120000 -1.115360
9.380000 -1.249960
9.620000 -1.098980
9.880000 -1.744740
10.120000 -2.264220
10.380000 -2.068640
10.620000 -1.491620
10.880000 -1.624930
11.120000 -2.122610
11.380000 -2.521670
11.620000 -2.118130
11.880000 3.139580
12.120000 -2.248840
12.380000 3.130790
12.620000 -2.121850
12.880000 3.069710
13.120000 -1.902440
13.380000 -0.202380
13.620000 0.448460
13.880000 0.503380
14.120000 -0.157780
14.380000 1.134710
14.620000 -0.560170
14.880000 -0.685690
15.120000 -2.672380
15.380000 -2.420880
15.620000 3.090670
15.880000 2.419040
16.120000 0.938970
16.380000 1.604450
16.620000 1.045260
16.880000 0.686970
17.120000 2.131990
17.380000 -0.145840
17.620000 -0.196920
17.880000 -0.577780
18.120000 0.713110
18.380000 1.890380
18.620000 1.641600
18.880000 1.245780
19.120000 0.670600
19.380000 -0.188330
19.620000 -0.038080
19.880000 0.305410
