0.12500 0.00691
0.37500 0.01683
0.62500 0.00339
0.87500 0.01601
1.12500 0.01508
1.37500 0.01547
1.62500 0.02366
1.87500 0.02521
2.12500 0.03251
2.37500 0.02596
2.62500 0.01834
2.87500 0.02008
3.12500 0.01635
3.37500 0.01493
3.62500 0.03323
3.87500 0.02615
4.12500 0.02555
4.37500 0.03329
4.62500 0.03692
4.87500 0.02749
5.12500 0.01898
5.37500 0.02489
5.62500 0.01955
5.87500 0.01791
6.12500 0.00924
6.37500 0.03012
6.62500 0.02217
6.87500 0.03802
7.12500 0.02751
7.37500 0.03420
7.62500 0.01830
7.87500 0.02670
8.12500 0.02272
8.37500 0.02003
8.62500 0.01200
8.87500 0.01677
9.12500 0.02160
9.37500 0.00583
9.62500 0.02242
9.87500 0.01395
10.12500 0.02337
10.37500 0.01902
10.62500 0.03018
10.87500 0.02263
11.12500 0.00892
11.37500 0.00765
11.62500 0.01282
11.87500 0.00898
12.12500 0.01616
12.37500 0.00401
12.62500 0.01188
12.87500 0.01525
13.12500 0.01239
13.37500 0.02050
13.62500 0.00860
13.87500 0.01039
14.12500 0.01478
14.37500 0.02272
14.62500 0.02159
14.87500 0.02156
