0.12500 0.03047
0.37500 0.04728
0.62500 0.07357
0.87500 0.10444
1.12500 0.13582
1.37500 0.16334
1.62500 0.18890
1.87500 0.19740
2.12500 0.22561
2.37500 0.24969
2.62500 0.25346
2.87500 0.26208
3.12500 0.27074
3.37500 0.25093
3.62500 0.24072
3.87500 0.22070
4.12500 0.20939
4.37500 0.20559
4.62500 0.20668
4.87500 0.18291
5.12500 0.16636
5.37500 0.14958
5.62500 0.13037
5.87500 0.10691
6.12500 0.08504
6.37500 0.08778
6.62500 0.08744
6.87500 0.06421
7.12500 0.06214
7.37500 0.06105
7.62500 0.04803
7.87500 0.03848
8.12500 0.03387
8.37500 0.03604
8.62500 0.02634
8.87500 0.02791
9.12500 0.03415
9.37500 0.04473
9.62500 0.04009
9.87500 0.05278
10.12500 0.04875
10.37500 0.05115
10.62500 0.04216
10.87500 0.04826
11.12500 0.03083
11.37500 0.04874
11.62500 0.05833
11.87500 0.03497
12.12500 0.05103
12.37500 0.04117
12.62500 0.05774
12.87500 0.04498
13.12500 0.05155
13.37500 0.06118
13.62500 0.05869
13.87500 0.04486
14.12500 0.05358
14.37500 0.06823
14.62500 0.03447
14.87500 0.03444
15.12500 0.05433
15.37500 0.06256
15.62500 0.05564
15.87500 0.08046
16.12500 0.06495
16.37500 0.03401
16.62500 0.00606
16.87500 0.01740
17.12500 0.02144
17.37500 0.02006
17.62500 0.01574
17.87500 0.01014
18.12500 0.03354
18.37500 0.03265
18.62500 0.02533
18.87500 0.04712
19.12500 0.02745
19.37500 0.03444
19.62500 0.03950
19.87500 0.05044
