0.05000 -5309.93078 345.02683 885.33769 12776.22547 11710.48691 11768.42004
0.15000 -13987.59365 716.56085 783.95890 9625.33972 9897.07680 15488.48896
0.25000 -18529.24159 201.17770 396.74976 7969.33563 8920.48190 18060.86728
0.35000 -20052.48949 -334.00625 -326.01642 7974.99965 7484.20522 19434.10196
0.45000 -20240.24856 241.47928 94.82004 7428.71590 6542.27429 19923.65449
0.55000 -20371.96679 179.79919 803.28418 6759.08270 5586.13939 18832.79356
0.65000 -19483.22822 -227.29333 785.58960 6639.90200 5098.83973 18067.36799
0.75000 -18758.47675 33.41710 122.65368 6256.93751 5075.15719 16937.15649
0.85000 -17904.96027 47.27283 -232.23587 5667.79096 4420.02473 16053.80319
0.95000 -17080.22271 101.71725 133.25309 5156.95878 4279.23951 15066.74069
1.05000 -16668.78060 58.64959 150.61440 4773.35625 4182.32497 13829.83046
1.15000 -15869.97923 -33.25953 140.48954 4639.60093 3905.40305 13250.12588
1.25000 -15265.48975 45.32923 111.49476 4302.14129 3627.62063 12333.34384
1.35000 -14589.77358 130.75793 -109.39669 4086.98946 3612.93002 11935.00142
1.45000 -14246.02972 88.02589 102.63649 3746.09863 3425.97616 11097.06843
1.55000 -13920.14212 65.40594 -62.70687 3614.20830 3325.11041 10602.59131
1.65000 -13656.62073 39.88563 -79.64674 3330.75982 3342.81152 9953.09561
1.75000 -13193.46992 30.03858 124.15886 3180.41910 3120.86151 9700.01979
1.85000 -12862.53140 -25.87968 -357.26875 3003.33570 2967.08440 9220.50746
1.95000 -12626.82984 108.90581 -1.67617 2890.50286 2829.48286 8710.12855
2.05000 -12344.76403 22.72379 -285.21745 2682.69346 2733.56553 8217.58213
2.15000 -12005.82080 94.33884 -174.37707 2594.47145 2626.16255 7986.85984
2.25000 -11603.20295 -8.07077 -358.58937 2553.20813 2530.13944 7842.30809
2.35000 -11474.72265 -10.18954 -23.63559 2298.76019 2479.24672 7355.32481
2.45000 -11172.10781 55.50320 208.42343 2168.92224 2338.46032 7083.34489
2.55000 -10871.30201 16.05816 -305.94112 2186.36261 2314.55630 6935.74501
2.65000 -10672.73165 3.89806 -510.58580 2024.06266 2135.48592 6597.88172
2.75000 -10373.45867 89.44318 -25.06464 1916.65354 2036.65013 6436.92791
2.85000 -10175.26386 51.69350 -198.84230 1841.46524 1962.15291 6230.51227
2.95000 -9990.12704 33.94420 -128.28776 1778.75628 2028.87229 5963.41833
3.05000 -9754.77135 7.52191 -147.47237 1709.92384 1902.23981 5797.76056
3.15000 -9535.40867 26.77748 -114.91905 1694.54957 1819.37367 5745.26482
3.25000 -9380.85316 92.68967 -148.57422 1629.76719 1718.08775 5458.00079
3.35000 -9193.81586 0.59981 -148.74856 1602.16355 1745.57146 5308.18174
3.45000 -8996.80676 39.62051 -134.12477 1412.41487 1544.32742 5182.70665
3.55000 -8835.47874 55.37153 -211.65734 1473.10961 1514.05091 4986.67705
3.65000 -8672.21790 31.93197 -226.18340 1299.13692 1493.50447 4834.50931
3.75000 -8537.01199 16.47499 -88.66343 1233.45788 1474.44118 4718.01033
3.85000 -8364.82584 39.71622 -238.32998 1363.39318 1462.27381 4680.86412
3.95000 -8297.50722 15.42171 -88.84878 1133.04572 1342.36501 4361.68877
4.05000 -8111.04642 22.07232 -101.36271 1138.81621 1355.07374 4314.83905
4.15000 -7977.58667 2.95700 129.32529 1138.16199 1269.07167 4344.06025
4.25000 -7933.55884 15.96488 -100.78142 1116.87047 1376.11844 4097.08680
4.35000 -7788.54079 42.93862 -66.07209 989.80293 1134.25389 3934.78901
4.45000 -7675.15779 -27.75150 -115.19184 1188.62233 1271.80991 3883.35006
4.55000 -7541.96374 16.20843 -35.93251 946.29379 1120.22683 3741.80325
4.65000 -7398.87013 2.78022 -93.81021 955.61480 1291.35996 3744.86875
4.75000 -7319.33214 0.43925 53.10699 1146.83022 1047.20897 3440.55736
4.85000 -7178.89507 27.57806 -58.51339 1037.15455 1115.75394 3432.00942
4.95000 -7123.01693 -40.90787 65.25720 791.21335 948.56725 3214.59818
5.05000 -7026.57961 19.04577 162.85744 750.14660 930.94235 3220.94795
5.15000 -6878.15701 -5.98108 -48.80134 774.09955 947.71695 3137.20219
5.25000 -6857.96765 5.43080 -76.14117 1018.87434 946.74727 2985.68523
5.35000 -6714.17006 -4.09047 126.52459 702.15159 963.25634 2864.46499
5.45000 -6634.84559 15.40087 -12.95235 665.26192 823.12460 2805.38685
5.55000 -6556.37384 19.75960 106.15658 624.50562 814.26998 2594.56625
5.65000 -6440.66993 15.83286 68.81788 555.24468 762.72491 2604.93140
5.75000 -6384.36747 31.14785 18.40565 516.09735 766.09885 2406.55361
5.85000 -6331.59316 16.23522 25.08216 487.86565 752.09214 2283.55633
5.95000 -6263.52076 20.27459 92.30054 667.53787 765.03046 2254.01584
6.05000 -6199.28561 -20.49031 83.86963 522.29324 734.89647 2169.81713
6.15000 -6107.86258 -20.23058 37.99458 475.52504 694.84356 2064.89922
6.25000 -6052.31008 2.33266 82.78393 422.14254 673.83678 2014.81579
6.35000 -6022.57824 1.44328 30.18386 759.04827 666.33746 1932.58815
6.45000 -5942.36964 -18.55656 73.04002 475.97072 813.59318 2118.91033
6.55000 -5886.71360 -30.91440 70.88295 502.34736 626.72577 1844.27526
6.65000 -5882.23547 0.70006 118.75252 507.30395 682.10860 1826.78792
6.75000 -5833.70663 -37.11028 75.56958 472.04472 635.55609 1700.28013
6.85000 -5808.96319 -11.96007 111.03146 409.82520 590.22119 1673.91009
6.95000 -5776.48568 8.35530 121.02851 455.29822 587.50882 1642.23264
7.05000 -5742.12785 -15.36174 99.12736 448.34095 574.49552 1565.64706
7.15000 -5714.03991 -31.71247 112.63436 501.99647 557.93117 1546.97038
7.25000 -5721.50195 -4.91054 156.18998 569.62627 563.93204 1550.10391
7.35000 -5696.99792 0.41781 80.11796 491.97334 557.80910 1502.19751
7.45000 -5645.83573 7.92890 51.56587 574.96451 532.94906 1419.04600
7.55000 -5615.98669 -15.07276 78.65262 510.30588 471.72423 1380.86493
7.65000 -5581.45682 -7.59178 38.04697 520.23633 528.29595 1345.34645
7.75000 -5540.90126 7.23998 45.54062 549.37970 480.28908 1333.20605
7.85000 -5481.32519 20.49428 61.21072 521.65328 462.44498 1260.61781
7.95000 -5417.81643 5.08650 46.90529 517.18374 432.19774 1228.37130
8.05000 -5395.55317 16.06517 88.92739 529.02327 416.32428 1235.88521
8.15000 -5346.54730 14.19796 17.57990 955.02205 473.78363 1169.21336
8.25000 -5275.35157 10.51700 -23.34293 457.97141 358.46077 1134.26482
8.35000 -5225.63160 4.74075 31.44601 462.73386 416.98352 1101.63847
8.45000 -5170.04869 17.24404 -42.63518 459.65747 352.56742 1070.89655
8.55000 -5124.64499 5.53924 48.42430 878.88521 603.84682 1052.73366
8.65000 -5085.53392 20.37403 91.53478 430.84315 307.03762 1043.64399
8.75000 -5033.14339 19.70984 57.26962 471.92304 348.27009 1025.52141
8.85000 -4993.60428 13.49578 -14.93433 436.74616 364.71462 972.15914
8.95000 -4971.24686 15.83762 14.32831 410.46904 299.51195 945.91543
9.05000 -4884.87289 12.03985 86.72717 477.64491 295.56695 969.22525
9.15000 -4843.69660 8.57082 51.42254 363.53398 409.62718 897.49000
9.25000 -4798.93594 13.33500 15.29403 365.45600 233.53278 867.65393
9.35000 -4764.68412 25.25432 49.11920 321.14040 245.31982 859.73450
9.45000 -4710.36542 15.51580 43.03828 322.83403 259.15665 816.16013
9.55000 -4657.59612 23.79060 81.74132 304.71590 245.15960 833.65953
9.65000 -4642.53224 10.32958 71.55745 365.29206 264.22875 834.39139
9.75000 -4580.75895 23.59931 48.44070 375.83443 293.57285 799.00704
9.85000 -4539.85652 9.56190 13.41290 363.60648 251.85193 778.52057
9.95000 -4519.18399 -6.10105 42.20679 355.24772 568.80781 789.46959
10.05000 -4473.37118 3.00062 5.88018 337.70425 225.88185 739.91533
10.15000 -4423.97524 14.62569 -5.03435 313.23427 205.16554 726.26788
10.25000 -4388.73069 16.62554 65.78554 323.92306 235.42152 719.53882
10.35000 -4345.54765 18.62842 59.71932 334.48859 262.58219 709.67961
10.45000 -4295.18440 13.93963 4.46534 282.68660 192.21947 712.57614
10.55000 -4273.67720 7.85658 20.61549 272.61769 182.05198 682.76672
10.65000 -4226.29228 5.05476 -20.14534 308.09908 202.41178 674.93473
10.75000 -4192.87251 15.20340 50.55154 213.44513 141.89877 676.24087
10.85000 -4168.46918 6.44926 67.09103 246.90735 199.66282 661.67159
10.95000 -4122.82837 18.14732 4.50503 194.56173 147.02237 604.24247
11.05000 -4091.10560 4.98191 47.22207 293.28349 236.53663 642.34779
11.15000 -4058.90307 7.00739 -13.20566 207.10069 184.06474 601.20272
11.25000 -4034.73588 16.86857 28.74073 256.71216 238.30384 604.26931
11.35000 -3988.08564 15.44238 -11.01053 192.23160 170.21593 579.88381
11.45000 -3968.61352 15.19129 -16.45565 177.06826 204.61585 560.89648
11.55000 -3925.01310 6.63662 8.53139 193.44332 187.27837 564.49647
11.65000 -3915.44300 17.95615 1.15060 185.32367 141.99548 531.13619
11.75000 -3867.32390 11.71912 -24.90763 214.34922 185.66426 563.30452
11.85000 -3852.99088 17.77679 -46.67150 191.93690 286.50196 543.51197
11.95000 -3809.25200 17.18018 -9.84091 186.05795 231.25904 534.13156
12.05000 -3784.43758 16.50206 -20.67839 228.87932 324.12988 521.10212
12.15000 -3761.48374 4.81366 -14.96532 240.71781 179.13602 532.46741
12.25000 -3726.41627 19.01947 -32.05418 262.91988 257.53390 495.08166
12.35000 -3709.73342 19.52827 25.75459 153.05538 231.13595 475.47928
12.45000 -3689.15367 1.48785 9.79537 159.41108 153.45520 514.31926
12.55000 -3652.46474 13.35327 -63.86395 143.14888 118.49215 479.13379
12.65000 -3640.60425 9.99868 -11.34138 149.57480 131.09959 470.17224
12.75000 -3603.43781 6.69110 -34.72099 131.76004 107.89565 452.66571
12.85000 -3573.45850 6.94593 12.59351 236.07443 134.07227 449.19800
12.95000 -3553.23849 6.31735 -22.81446 176.98492 155.58986 435.50309
13.05000 -3532.45057 13.61524 -23.00419 193.84344 166.47264 453.81661
13.15000 -3504.30563 17.82310 -29.73893 201.64082 159.88964 435.18920
13.25000 -3481.07084 3.46885 -14.92525 203.55440 248.54374 478.38573
13.35000 -3464.05207 11.33281 -24.46938 145.45625 206.47127 455.31502
13.45000 -3440.31898 9.93933 -14.84004 136.69648 114.00124 407.70354
13.55000 -3423.95962 -11.65227 -45.36468 435.18934 583.89664 640.08005
13.65000 -3394.76326 13.04573 -25.70775 130.40480 116.36743 395.50717
13.75000 -3367.92008 6.10659 -21.70292 158.75155 157.37245 429.36049
13.85000 -3348.64628 14.22001 -0.70419 108.93426 98.40184 392.20018
13.95000 -3327.93681 6.22011 -8.35293 117.89653 110.92615 371.02531
14.05000 -3298.43555 18.32292 -28.95803 117.16705 93.66015 370.97145
14.15000 -3263.57375 1.31336 -14.93796 150.70257 142.03427 412.48340
14.25000 -3251.52147 10.91788 -18.49885 120.61416 160.67187 361.04807
14.35000 -3214.80451 9.87542 2.60911 305.71858 110.36637 336.07961
14.45000 -3209.34924 -3.29845 0.90831 118.17525 214.29480 357.05600
14.55000 -3184.10769 0.32327 6.46140 115.66967 132.08651 383.70631
14.65000 -3163.80413 10.19042 11.82498 127.50808 116.17926 334.34523
14.75000 -3139.55721 2.84505 7.15583 189.05583 130.00887 327.49113
14.85000 -3125.54038 -0.18322 8.57881 212.31661 122.65272 339.44542
14.95000 -3108.56261 11.07054 6.68174 187.99680 121.91561 342.50239
15.05000 -3082.10368 2.36170 0.65284 121.59565 213.60790 329.42356
15.15000 -3062.96324 7.75289 -7.52317 107.44376 84.59665 298.73386
15.25000 -3033.00693 4.28026 9.22559 163.44630 138.76993 321.01982
15.35000 -3023.28849 3.75534 -4.77328 102.80116 76.84147 312.49195
15.45000 -2994.00808 9.60958 -20.56818 93.76865 100.55799 308.53708
15.55000 -2989.94927 7.59345 30.66178 123.71732 87.48819 295.28255
15.65000 -2961.01225 5.66875 10.04743 100.59462 88.01900 290.59027
15.75000 -2939.16960 10.25954 22.43144 110.73759 123.59284 288.18964
15.85000 -2919.64975 4.20493 -12.01381 88.48261 68.65982 279.70425
15.95000 -2914.99311 2.82148 17.82054 242.54523 99.82922 331.46986
16.05000 -2897.21302 9.24065 23.61074 96.37415 94.30053 303.40411
16.15000 -2865.70956 6.12021 6.69555 97.42993 79.94949 259.23278
16.25000 -2857.91617 8.47380 -14.61404 167.17470 93.27625 287.89574
16.35000 -2841.04324 8.81560 18.70458 235.16336 212.30231 286.19388
16.45000 -2813.77237 9.79606 35.33798 193.77829 71.15133 292.42788
16.55000 -2794.80519 10.19703 18.87529 222.52793 96.83879 292.14339
16.65000 -2760.96390 9.22244 3.35954 448.60062 104.57341 340.63540
16.75000 -2768.16465 9.68365 14.39625 75.88964 61.26574 252.88350
16.85000 -2755.92435 7.05159 29.87041 91.56388 57.03044 251.68533
16.95000 -2730.70324 5.44533 26.65458 129.46613 74.09131 242.87751
17.05000 -2728.53391 -9.31606 26.39256 139.09873 203.97950 383.18152
17.15000 -2702.87313 7.00449 27.86150 124.54578 150.94237 242.08435
17.25000 -2684.88194 5.79830 13.44679 66.42597 61.42463 244.45371
17.35000 -2655.61278 5.02127 35.49708 151.06967 86.87395 354.71873
17.45000 -2659.05037 -0.24792 57.27116 81.60506 95.05367 248.91360
17.55000 -2642.18758 5.36193 16.42702 69.48452 85.40342 226.06859
17.65000 -2636.23014 6.25310 40.33915 90.62512 118.33994 237.28502
17.75000 -2605.50030 8.86732 -0.42093 242.29489 116.68981 309.90915
17.85000 -2599.79551 -1.91993 19.93816 108.58057 97.27499 242.52730
17.95000 -2590.46224 3.12651 24.17838 73.34036 117.04723 215.14943
18.05000 -2572.64314 8.34149 10.93269 69.68103 53.98059 202.52698
18.15000 -2555.68094 -2.10659 17.47106 71.83225 63.20325 229.81299
18.25000 -2549.13840 -2.58748 23.20800 60.66695 56.15595 196.15963
18.35000 -2524.72296 8.89786 24.46979 62.01856 68.81779 211.39074
18.45000 -2522.52990 1.76054 36.95367 135.70217 71.63795 215.92542
18.55000 -2496.17149 0.81999 19.50380 58.61194 113.79408 194.92469
18.65000 -2490.76200 1.51709 26.52578 120.42709 123.30214 256.71153
18.75000 -2468.59630 6.24648 24.41171 56.56751 89.70556 189.39585
18.85000 -2451.05325 4.80565 43.09450 46.87623 58.43008 174.63345
18.95000 -2442.15862 4.86286 37.17717 67.04191 56.90962 186.58393
19.05000 -2427.11101 3.57770 48.23065 114.78754 83.91135 177.99765
19.15000 -2409.08625 10.27951 3.05984 75.10053 83.86576 164.85001
19.25000 -2392.71579 7.97831 24.02601 48.47799 54.51096 181.69145
19.35000 -2374.03771 -7.94894 17.89334 64.08709 66.34550 162.61725
19.45000 -2356.85926 9.06811 27.57586 48.95150 51.38439 182.21322
19.55000 -2353.43847 0.78297 40.05876 50.53808 52.67771 164.99943
19.65000 -2351.44758 -6.25618 21.23121 67.71764 75.71402 173.71056
19.75000 -2330.76347 8.47018 10.99949 40.85235 37.92557 156.44195
19.85000 -2320.25866 2.90396 23.26657 47.31582 48.62424 168.83999
19.95000 -2308.62383 -11.15758 7.44555 45.40855 55.91961 147.12407
