0.450000 -0.418190
1.350000 -0.350750
2.250000 -0.348780
3.150000 -0.368220
4.050000 -0.289350
4.950000 -0.257330
5.850000 -0.326440
6.750000 -0.434640
7.650000 -0.458350
8.550000 -0.836850
9.450000 -1.350430
10.350000 -1.857060
11.250000 -2.259570
12.150000 -2.830720
13.050000 -3.087950
13.950000 2.916350
14.850000 2.613520
15.750000 1.764650
16.650000 1.086660
17.550000 -0.468850
