0.05000 2425.58426
0.15000 3591.32596
0.25000 5529.45337
0.35000 7376.79017
0.45000 8884.20952
0.55000 9493.67153
0.65000 9694.72958
0.75000 9911.97121
0.85000 10171.68375
0.95000 10004.83287
1.05000 9715.44422
1.15000 9360.48466
1.25000 9088.12529
1.35000 8707.86827
1.45000 8083.00604
1.55000 7935.46745
1.65000 7694.31762
1.75000 7253.10126
1.85000 6918.29196
1.95000 6601.09359
2.05000 6280.53751
2.15000 6044.40631
2.25000 5722.41883
2.35000 5494.40823
2.45000 5331.51711
2.55000 5209.84203
2.65000 4881.67089
2.75000 4694.11966
2.85000 4617.77444
2.95000 4444.25684
3.05000 4199.80264
3.15000 4164.51739
3.25000 3873.68042
3.35000 3902.98903
3.45000 3718.24479
3.55000 3607.73375
3.65000 3430.21326
3.75000 3349.24116
3.85000 3271.85375
3.95000 3186.43890
4.05000 3051.74029
4.15000 2993.19646
4.25000 2976.43996
4.35000 2855.49987
4.45000 2766.78154
4.55000 2632.83884
4.65000 2581.04767
4.75000 2469.79617
4.85000 2442.51993
4.95000 2336.99350
5.05000 2327.79050
5.15000 2179.84226
5.25000 2076.64426
5.35000 2040.71085
5.45000 1978.74137
5.55000 1949.72680
5.65000 1808.79358
5.75000 1756.56538
5.85000 1643.97734
5.95000 1627.83834
6.05000 1579.72519
6.15000 1509.82945
6.25000 1449.98983
6.35000 1447.71657
6.45000 1388.36656
6.55000 1353.79903
6.65000 1284.85681
6.75000 1274.72427
6.85000 1276.40476
6.95000 1185.69546
7.05000 1172.08735
7.15000 1151.10968
7.25000 1123.73584
7.35000 1061.77588
7.45000 1058.60968
7.55000 986.30976
7.65000 976.56882
7.75000 969.76798
7.85000 934.62887
7.95000 864.56461
8.05000 866.76369
8.15000 844.55669
8.25000 817.09328
8.35000 778.20842
8.45000 750.41289
8.55000 738.72697
8.65000 706.27495
8.75000 685.73459
8.85000 662.11315
8.95000 672.85229
9.05000 664.27454
9.15000 635.53504
9.25000 619.79842
9.35000 593.34066
9.45000 576.45304
9.55000 581.20078
9.65000 535.66396
9.75000 551.58040
9.85000 541.47961
9.95000 527.14595
10.05000 532.35372
10.15000 505.54140
10.25000 497.81476
10.35000 497.50179
10.45000 446.08968
10.55000 468.16143
10.65000 483.28849
10.75000 437.83457
10.85000 434.67533
10.95000 431.78670
11.05000 420.38634
11.15000 418.72807
11.25000 419.14190
11.35000 407.30696
11.45000 387.11240
11.55000 380.44662
11.65000 377.30227
11.75000 380.39290
11.85000 390.11580
11.95000 344.70139
12.05000 330.19247
12.15000 334.56850
12.25000 348.60649
12.35000 357.21208
12.45000 342.90331
12.55000 349.12098
12.65000 349.60143
12.75000 332.58766
12.85000 307.61184
12.95000 356.23951
13.05000 311.24238
13.15000 337.31509
13.25000 305.16028
13.35000 290.97794
13.45000 291.76606
13.55000 318.83809
13.65000 310.01953
13.75000 313.08546
13.85000 297.90781
13.95000 265.52858
14.05000 263.69916
14.15000 285.92089
14.25000 280.96480
14.35000 298.06663
14.45000 256.62339
14.55000 272.64071
14.65000 255.17761
14.75000 284.13900
14.85000 256.92559
14.95000 257.82575
15.05000 252.99722
15.15000 245.24140
15.25000 261.80560
15.35000 236.57790
15.45000 221.33428
15.55000 228.17594
15.65000 227.35002
15.75000 220.80151
15.85000 226.94346
15.95000 223.81568
16.05000 190.07509
16.15000 204.69377
16.25000 216.53561
16.35000 201.24843
16.45000 205.25213
16.55000 207.50983
16.65000 189.13926
16.75000 204.38641
16.85000 186.59496
16.95000 192.87723
17.05000 182.65378
17.15000 174.55773
17.25000 208.07793
17.35000 184.21542
17.45000 179.20007
17.55000 177.41982
17.65000 173.53375
17.75000 179.32739
17.85000 153.58213
17.95000 165.63766
18.05000 178.28407
18.15000 145.85792
18.25000 161.45227
18.35000 174.97016
18.45000 156.42284
18.55000 159.82612
18.65000 154.95272
18.75000 139.75985
18.85000 165.30199
18.95000 132.66367
19.05000 141.27807
19.15000 157.89843
19.25000 151.94545
19.35000 147.97816
19.45000 142.61042
19.55000 147.14341
19.65000 153.38455
19.75000 163.29723
19.85000 143.96260
19.95000 125.38462
