0.05000 0.00000 0.00000 0.00000 0.00000 0.00000 0.00000
0.15000 -16.17354 -763.80066 4353.65018 1644.37894 1103.19542 280.53628
0.25000 -536.05212 -13.26581 4295.53206 1584.60968 1503.16716 1690.16352
0.35000 -649.55109 -62.96642 4150.96678 1529.71084 1412.48782 396.33222
0.45000 -867.84532 -261.96918 4231.29609 1288.09828 1468.40532 530.29800
0.55000 -1119.93682 -103.51285 4102.03720 1638.87104 1503.74356 709.60598
0.65000 -1441.96259 34.66665 3960.02100 1406.37101 1516.35655 664.21207
0.75000 -1535.77802 11.89723 3926.29922 1483.40784 1546.83173 877.81712
0.85000 -1792.28523 37.44895 3752.97339 1664.50070 1663.12576 2210.52138
0.95000 -2143.26903 36.23378 3521.46813 1598.12400 1605.39057 856.37977
1.05000 -2163.27440 102.19491 3401.63652 1645.88003 1711.36702 1048.73625
1.15000 -2280.18701 15.68675 3120.82564 1662.56037 1798.06500 1160.03032
1.25000 -2571.01264 -32.16181 2831.16973 1542.53349 1793.59805 1509.40829
1.35000 -2674.77512 58.15014 2523.40927 1607.07755 1828.47118 1585.28706
1.45000 -2850.76358 -20.96697 2312.14994 1486.06175 2026.54941 3011.76602
1.55000 -2998.70295 -45.10227 1878.92838 6929.74026 4926.89758 5834.07963
1.65000 -3155.91536 -90.37256 1636.53414 1680.95992 1876.28649 2321.35126
1.75000 -3225.19326 11.77839 1397.32337 1497.72944 1732.49296 2305.18153
1.85000 -3368.61356 -13.38658 1111.61603 1411.07550 1502.80936 2368.38888
1.95000 -3431.47252 55.33780 1287.99987 1429.25049 1671.65704 2612.90193
2.05000 -3487.87853 13.84355 1040.15687 1312.22333 1609.91032 2357.94805
2.15000 -3443.90345 -24.21088 782.73366 19862.88741 12072.78962 13338.29186
2.25000 -3497.22621 46.21147 777.37236 1236.16328 1214.72554 2801.50829
2.35000 -3608.37102 6.27056 734.59112 1183.42406 1063.52090 2472.45867
2.45000 -3543.78932 -1.38097 593.59344 1318.10180 978.90442 2573.27650
2.55000 -3528.63085 -8.26241 622.17956 1196.22661 917.38785 2578.97592
2.65000 -3522.98360 -35.16397 578.84877 1149.87796 906.59536 2505.56035
2.75000 -3455.46465 -2.92948 523.51721 1252.66330 896.68198 2631.60994
2.85000 -3473.47876 -1.96450 432.24448 1276.90706 2072.94546 2905.63340
2.95000 -3491.26659 5.66162 447.05408 1244.28717 947.41065 2631.84713
3.05000 -3478.18491 -2.87606 366.59351 1197.78340 883.34364 2671.29779
3.15000 -3537.95262 -0.15715 351.49713 5405.93530 5507.42084 3873.71775
3.25000 -3489.72048 2.65239 428.71310 1129.28242 687.11945 2476.05974
3.35000 -3434.24255 32.56063 253.19984 1093.50410 646.98115 2574.07339
3.45000 -3422.26737 7.63611 324.46997 1147.82106 602.82743 2522.86844
3.55000 -3450.80598 19.84723 241.81513 1001.75596 731.56383 2454.56189
3.65000 -3375.08796 10.31618 177.54812 1084.59285 584.83683 2493.68799
3.75000 -3391.23906 -6.06292 204.29529 1059.08529 1059.56908 2453.46946
3.85000 -3354.55467 3.78641 152.12418 1490.07461 1201.41235 3148.60006
3.95000 -3371.56779 -15.57437 195.32887 1077.75479 889.16954 2497.60860
4.05000 -3335.32087 2.15138 134.65892 1038.28724 511.39408 2429.83191
4.15000 -3264.77111 8.91655 196.04821 1129.50464 684.62294 2528.31641
4.25000 -3291.18330 20.10195 171.65487 1018.53197 543.47350 2397.62849
4.35000 -3242.85104 -18.86388 154.31049 1008.24693 453.11149 2396.54619
4.45000 -3234.33973 6.40043 136.60381 978.19584 527.96181 2349.02447
4.55000 -3214.95866 -1.79272 124.56169 992.13508 518.76399 2410.41462
4.65000 -3190.06365 0.35570 88.70175 993.11805 851.88265 2373.93298
4.75000 -3193.59187 -11.60452 138.39031 967.98977 653.47812 2315.61565
4.85000 -3153.84028 3.86508 146.87221 983.77988 433.09070 2358.84255
4.95000 -3107.41302 -10.91392 34.79283 972.53189 397.10348 2327.96411
5.05000 -3113.61651 6.47233 33.38573 942.42965 417.54212 2298.48825
5.15000 -3084.40242 -7.54647 103.02690 928.98363 355.60409 2278.20587
5.25000 -3072.52996 -12.36972 26.30453 2464.46753 1214.64333 2489.41180
5.35000 -3050.10167 -15.99330 38.02174 945.90908 398.97660 2276.44465
5.45000 -3030.62509 -4.69986 58.05830 970.88286 541.32737 2290.64457
5.55000 -2999.00607 4.58040 80.13635 941.11848 340.57993 2227.46654
5.65000 -2970.69022 3.29542 120.80063 968.69226 396.78738 2248.90346
5.75000 -2968.33747 -7.51749 138.25078 1038.62644 846.31031 2428.27269
5.85000 -2976.33592 1.38766 16.86272 893.98903 342.27246 2182.87313
5.95000 -2922.28090 12.87818 118.28019 940.87298 323.05635 2209.36495
6.05000 -2961.92859 1.09273 39.81009 867.62727 410.11281 2150.66491
6.15000 -2901.64559 2.16760 62.72331 882.90334 329.12676 2169.83202
6.25000 -2910.62105 -3.57160 45.78223 868.46647 313.59681 2133.01738
6.35000 -2889.74737 4.10981 34.04159 875.96722 300.96097 2133.73459
6.45000 -2858.07639 -0.20087 72.30689 907.88216 305.28961 2145.66377
6.55000 -2867.93948 -5.08155 98.56919 842.83708 262.52186 2083.59852
6.65000 -2839.81395 2.42426 78.70569 823.13753 305.36874 2106.26642
6.75000 -2829.55303 0.36256 -16.99617 843.01546 258.98023 2077.25497
6.85000 -2826.48103 0.52853 36.16185 1443.78156 1000.15762 2130.94511
6.95000 -2812.66974 -9.47912 -32.94285 824.14422 255.66475 2050.04941
7.05000 -2778.50069 5.25780 9.30814 808.74871 236.09819 2054.83097
7.15000 -2794.30679 -0.81277 -79.77207 810.09027 284.77066 2017.23737
7.25000 -2796.61748 2.69607 -64.26332 807.50171 326.59341 1988.26501
7.35000 -2757.89210 -2.20881 -51.83912 823.73336 260.17363 1992.67819
7.45000 -2759.16362 -5.12924 0.78357 788.07730 261.27149 1957.81427
7.55000 -2703.36982 1.82145 -45.32467 814.61076 229.16849 1989.50740
7.65000 -2712.66438 1.40161 -41.58830 952.93391 254.21078 1955.79562
7.75000 -2679.61609 0.11910 -79.87529 802.58475 323.43583 1959.81822
7.85000 -2658.13111 6.27544 -101.32827 794.74437 303.41165 1966.83941
7.95000 -2612.42085 5.12397 -90.26484 939.08448 566.63430 2011.07544
8.05000 -2630.26388 -0.16898 -15.66758 779.10131 198.45147 1932.14046
8.15000 -2619.28800 2.16649 -13.44942 785.52440 244.59235 1938.17563
8.25000 -2591.71303 6.62801 -49.46635 811.84674 245.86091 1936.41809
8.35000 -2573.55716 -4.62627 -9.90665 789.68954 292.42773 1916.68270
8.45000 -2561.74242 -2.51171 -52.49314 828.38271 242.64211 1938.77577
8.55000 -2559.65479 -3.82856 -96.48926 756.44558 190.22600 1873.76685
8.65000 -2544.02570 1.64629 -14.27765 765.81426 194.70690 1866.06251
8.75000 -2534.97720 5.15680 5.74985 913.15791 573.60665 2098.27533
8.85000 -2529.11541 5.37990 -80.06302 738.35334 167.25132 1839.25720
8.95000 -2525.09061 -2.53690 -21.61148 759.38771 238.74841 1812.55175
9.05000 -2483.96367 -1.66736 -74.69544 746.02494 192.28992 1843.35218
9.15000 -2473.70858 0.63568 -105.66593 740.48283 430.64399 1946.13355
9.25000 -2461.18806 0.90572 -140.46025 722.09414 185.89926 1822.30726
9.35000 -2466.19045 -3.24841 -105.16490 701.86176 293.87482 1795.68178
9.45000 -2415.99885 3.16888 -61.28368 1033.57316 1267.92754 1817.40790
9.55000 -2439.54356 0.49447 -93.70804 719.91854 164.59514 1766.10376
9.65000 -2415.81654 -0.68079 -79.80644 712.91832 162.77496 1774.96159
9.75000 -2389.12723 -1.34128 -20.12304 696.55160 175.17516 1767.40308
9.85000 -2362.07825 -1.18986 -59.44689 696.71606 170.26840 1776.40772
9.95000 -2379.02443 -0.60370 -89.66798 702.55440 198.25891 1754.87102
10.05000 -2346.15866 3.37847 -77.67789 691.07402 185.42408 1755.20002
10.15000 -2341.20399 -3.84293 -72.52215 694.93350 153.78919 1728.15326
10.25000 -2319.53506 0.61878 -110.28947 713.76337 365.61693 1768.14311
10.35000 -2314.04530 -1.49384 -49.94996 680.06200 150.92075 1708.36577
10.45000 -2310.13372 -1.99203 -61.38489 684.71961 331.26518 1731.37614
10.55000 -2290.79254 -3.17025 -88.92384 693.53570 196.63212 1736.66677
10.65000 -2254.20889 0.55398 -85.72086 680.78460 208.83906 1706.54492
10.75000 -2261.16545 0.98894 -36.96775 674.95196 172.38157 1664.80705
10.85000 -2250.29311 -3.44031 -59.88704 656.69003 140.87807 1674.89719
10.95000 -2245.17564 -0.65383 -95.92607 658.46594 141.50455 1654.17326
11.05000 -2236.27927 -2.24048 -20.13390 646.22348 148.85412 1675.58494
11.15000 -2214.36169 0.57651 -82.71121 649.80068 153.54553 1643.83155
11.25000 -2202.67529 -3.04468 -65.01563 637.20008 120.52908 1630.95832
11.35000 -2182.10451 3.69359 -31.05942 647.81879 153.79117 1627.42251
11.45000 -2189.32388 -0.39259 -67.25375 631.76732 129.00018 1602.74919
11.55000 -2173.69033 -0.08826 -76.64716 645.44740 187.36157 1602.98028
11.65000 -2150.63914 -1.49102 -13.10302 650.53057 173.45725 1612.43856
11.75000 -2151.32756 2.22823 -53.26760 666.55335 353.75638 1591.58574
11.85000 -2145.95034 -2.07057 16.15479 619.42371 197.51644 1566.32199
11.95000 -2117.20590 2.61127 -58.17383 640.50555 210.13438 1581.08524
12.05000 -2114.58209 -0.26529 -67.76000 618.35370 153.25294 1564.58526
12.15000 -2092.91872 1.59396 -54.22012 615.61809 127.60696 1565.22508
12.25000 -2082.88881 0.29087 -14.93050 606.46991 134.55812 1551.62013
12.35000 -2074.22432 -0.95288 -31.41715 619.58057 114.72638 1540.69179
12.45000 -2058.93194 -0.92753 -79.65847 608.53498 1009.29870 1583.97382
12.55000 -2067.64064 1.62511 -90.65102 591.67908 102.70173 1516.31835
12.65000 -2065.47448 1.59171 -105.81088 596.10727 119.66593 1501.01638
12.75000 -2014.45500 0.86168 -48.00015 607.19140 173.40038 1538.32669
12.85000 -2030.41798 -1.04695 -0.25424 592.48450 131.27707 1491.64993
12.95000 -2024.86698 -0.20961 -92.79506 581.59156 99.89558 1483.81104
13.05000 -2001.30659 2.29225 -95.72795 582.56762 100.09917 1492.40532
13.15000 -2022.13681 -3.57423 -64.92520 579.41069 122.43260 1444.89436
13.25000 -1982.97370 1.66401 -59.85894 574.46863 91.86077 1478.38617
13.35000 -1976.77756 -1.95913 -89.69216 577.92527 231.40897 1462.30340
13.45000 -1970.07902 0.15861 -51.19040 872.99770 302.50012 1610.92355
13.55000 -1955.28535 1.34360 -82.64689 562.63535 93.79139 1451.42608
13.65000 -1959.10185 -1.70795 7.88379 559.29045 164.38181 1426.22908
13.75000 -1935.77482 0.89128 -72.65426 559.49617 94.24809 1429.19290
13.85000 -1917.84859 1.74618 -51.68634 557.17825 88.84008 1433.77140
13.95000 -1921.66775 -2.30158 -48.84965 548.97306 107.76260 1414.15728
14.05000 -1889.28020 0.51400 -73.81372 564.85652 98.37991 1426.95471
14.15000 -1893.79066 -1.21804 -85.01028 560.27077 93.03616 1405.47866
14.25000 -1880.93045 0.12758 -43.54251 545.89246 89.63784 1403.38543
14.35000 -1883.82679 -0.88955 -57.59726 538.56087 95.16999 1382.11817
14.45000 -1854.20564 -0.18244 -81.50715 557.61365 100.23757 1400.46329
14.55000 -1862.82996 0.31950 -25.72752 531.30422 83.35222 1369.83400
14.65000 -1858.40199 1.67256 -94.38195 533.29410 89.35904 1361.65791
14.75000 -1852.41285 -1.06764 -37.54938 529.89505 154.56520 1349.84325
14.85000 -1842.67479 -0.48882 -56.17264 527.28731 104.45335 1350.33204
14.95000 -1842.49841 1.98300 -35.62276 519.94411 91.00405 1329.35841
15.05000 -1827.21175 -1.22664 -58.94906 520.64934 122.61145 1329.22114
15.15000 -1840.05456 0.58923 -45.57160 509.36882 134.23694 1296.77550
15.25000 -1808.34382 1.32146 -49.03668 539.88625 167.42388 1319.96978
15.35000 -1792.43402 -1.76153 -24.94810 566.85116 170.06326 1319.99143
15.45000 -1798.11845 2.50518 -17.77416 513.49179 106.57716 1292.47505
15.55000 -1772.22510 1.78934 -57.47268 505.48744 86.45677 1308.57183
15.65000 -1774.07435 -0.20357 -99.21560 503.15632 88.47669 1297.09058
15.75000 -1764.89336 0.31379 -94.72475 513.50837 91.86288 1285.23673
15.85000 -1750.05801 -0.96676 -45.98718 509.68135 87.58799 1281.06780
15.95000 -1749.66660 0.95753 -99.90204 500.67133 76.65091 1275.28795
16.05000 -1730.95346 -1.34124 -50.58935 500.86385 77.46276 1275.62134
16.15000 -1726.62218 -0.35481 -32.48643 657.50284 214.27020 1329.46833
16.25000 -1713.14435 0.42824 -63.28156 502.45535 71.50086 1267.95825
16.35000 -1710.22924 -1.26644 -18.41596 489.75291 69.83300 1252.94867
16.45000 -1720.75477 -1.50282 -75.51670 472.08971 75.00902 1229.17147
16.55000 -1692.99989 -0.09808 -68.05049 493.41263 96.72738 1247.57007
16.65000 -1675.69591 -0.56779 -76.73756 489.68884 71.41430 1252.20635
16.75000 -1698.33958 -1.32192 -106.84049 471.42690 106.35362 1210.11605
16.85000 -1667.87401 1.38397 -86.46530 491.97839 141.78915 1235.49322
16.95000 -1654.59967 0.59295 -51.85594 493.55476 71.32239 1225.91488
17.05000 -1660.45811 -1.13765 -58.29408 479.23023 76.42112 1215.18849
17.15000 -1651.50191 -0.10245 -49.13205 490.22936 122.30815 1207.31512
17.25000 -1647.70737 -0.14046 -15.15005 467.17435 127.22920 1202.11859
17.35000 -1643.17408 1.96027 -74.82724 460.48849 82.60262 1187.76798
17.45000 -1629.88874 -2.55792 -20.33591 464.90824 76.23750 1185.32307
17.55000 -1611.63888 0.16007 -44.67594 468.60030 62.30828 1190.67752
17.65000 -1611.24494 -1.10202 -21.09158 457.19153 61.55423 1180.18901
17.75000 -1604.04651 -0.50120 -28.55808 457.85129 66.34046 1175.10382
17.85000 -1609.48659 -0.26029 6.31900 468.31165 168.36394 1151.65591
17.95000 -1594.80020 2.05369 -11.38554 459.07963 104.73147 1157.06489
18.05000 -1572.85267 1.10177 -48.66068 464.56965 76.50113 1170.70839
18.15000 -1567.00397 -1.17304 -28.29820 467.26810 230.06981 1192.56596
18.25000 -1570.58540 1.24371 -48.35264 446.31402 125.67722 1147.55599
18.35000 -1560.15772 -1.78561 -46.29926 443.67755 96.03323 1144.14068
18.45000 -1542.98940 0.44735 -17.90979 462.41546 68.55348 1144.05908
18.55000 -1541.84812 0.54985 -52.31833 453.99268 72.21608 1144.87617
18.65000 -1528.96349 0.53478 -84.08179 447.32773 54.46264 1141.30305
18.75000 -1538.98722 0.80487 -69.47198 441.52252 62.48088 1115.33202
18.85000 -1524.45062 1.26153 -67.59498 438.87062 73.76900 1121.52192
18.95000 -1504.97446 1.08924 -81.76315 444.94206 64.26208 1132.09559
19.05000 -1500.87736 -1.11622 -55.46533 464.38454 87.79001 1128.63699
19.15000 -1516.22094 0.56916 -38.86029 427.18889 71.18776 1092.09956
19.25000 -1490.59102 0.35980 -65.92630 476.22097 201.63191 1120.98161
19.35000 -1487.84341 1.56859 -0.58765 437.76587 84.12374 1091.40114
19.45000 -1473.57328 -0.83132 -20.14800 427.79166 55.12480 1106.78949
19.55000 -1474.85633 -1.05746 -23.85459 424.22909 75.51215 1087.39428
19.65000 -1470.84599 1.00582 -50.79889 423.28440 73.10238 1085.96960
19.75000 -1451.99520 0.03642 -9.63122 429.37379 58.72709 1089.99921
19.85000 -1480.81834 0.02943 -24.09993 407.18181 56.44509 1046.00546
19.95000 -1463.61829 -0.55743 -28.49511 411.76714 84.69548 1056.54622
