0.120000 2.453590
0.380000 1.926340
0.620000 1.922970
0.880000 1.961130
1.120000 1.970000
1.380000 1.980410
1.620000 1.979670
1.880000 1.972850
2.120000 1.978420
2.380000 1.987320
2.620000 2.002520
2.880000 1.971620
3.120000 1.980880
3.380000 1.981730
3.620000 1.988810
3.880000 1.986080
4.120000 1.982550
4.380000 1.979600
4.620000 1.960150
4.880000 1.975610
5.120000 1.973300
5.380000 1.996160
5.620000 2.005280
5.880000 2.023560
6.120000 2.093860
6.380000 2.120230
6.620000 2.228170
6.880000 2.259820
7.120000 2.315360
7.380000 2.335360
7.620000 2.401030
7.880000 2.385520
8.120000 2.444290
8.380000 2.422570
8.620000 2.462970
8.880000 2.470810
9.120000 2.445500
9.380000 2.478100
9.620000 2.382860
9.880000 2.215480
10.120000 2.060820
10.380000 1.726170
10.620000 1.810110
10.880000 1.527880
11.120000 1.420140
11.380000 1.686650
11.620000 1.652750
11.880000 1.560890
12.120000 1.201360
12.380000 1.001870
12.620000 1.061360
12.880000 0.885420
13.120000 1.026930
13.380000 0.851020
13.620000 0.814800
13.880000 0.846960
14.120000 1.010530
14.380000 1.208130
14.620000 1.395920
14.880000 1.214030
