0.120000 -0.375280
0.380000 -0.529250
0.620000 1.193090
0.880000 -0.251190
1.120000 -0.212550
1.380000 -0.262800
1.620000 -0.257310
1.880000 -0.247760
2.120000 -0.234880
2.380000 -0.206780
2.620000 -0.067400
2.880000 -0.043440
3.120000 -0.011180
3.380000 0.117990
3.620000 0.141170
3.880000 0.129160
4.120000 0.181610
4.380000 0.196030
4.620000 0.182320
4.880000 0.143110
5.120000 0.116450
5.380000 0.118220
5.620000 0.055660
5.880000 0.234080
6.120000 0.560410
6.380000 0.579670
6.620000 0.790900
6.880000 0.870360
7.120000 0.248110
7.380000 0.305350
7.620000 -0.432730
7.880000 0.432350
8.120000 -1.652790
8.380000 -2.909950
8.620000 -2.735740
8.880000 -1.675610
9.120000 -0.919240
9.380000 -0.683940
9.620000 -1.217840
9.880000 -0.747930
10.120000 -1.347380
10.380000 -1.169990
10.620000 -1.078370
10.880000 -1.489300
11.120000 -1.385520
11.380000 -1.076780
11.620000 -0.813200
11.880000 -0.849130
12.120000 -1.083230
12.380000 -0.881250
12.620000 -1.079000
12.880000 -1.860700
13.120000 -1.773710
13.380000 -1.564710
13.620000 -2.629380
13.880000 -3.110900
14.120000 -2.750960
14.380000 -2.837670
14.620000 3.102970
14.880000 2.824160
