0.12500 0.00507
0.37500 0.04190
0.62500 0.09243
0.87500 0.15467
1.12500 0.19681
1.37500 0.23169
1.62500 0.24775
1.87500 0.27272
2.12500 0.28985
2.37500 0.30702
2.62500 0.33430
2.87500 0.36943
3.12500 0.39842
3.37500 0.42766
3.62500 0.44557
3.87500 0.44746
4.12500 0.43867
4.37500 0.42034
4.62500 0.40043
4.87500 0.37643
5.12500 0.34430
5.37500 0.33165
5.62500 0.32593
5.87500 0.28677
6.12500 0.28316
6.37500 0.26762
6.62500 0.22558
6.87500 0.18763
7.12500 0.15522
7.37500 0.11930
7.62500 0.10275
7.87500 0.07671
8.12500 0.06100
8.37500 0.05526
8.62500 0.05897
8.87500 0.03953
9.12500 0.05356
9.37500 0.06070
9.62500 0.05963
9.87500 0.05985
10.12500 0.06309
10.37500 0.05852
10.62500 0.07529
10.87500 0.05434
11.12500 0.06599
11.37500 0.07539
11.62500 0.06595
11.87500 0.06190
12.12500 0.07289
12.37500 0.06995
12.62500 0.06878
12.87500 0.07464
13.12500 0.07374
13.37500 0.07854
13.62500 0.09006
13.87500 0.08488
14.12500 0.11251
14.37500 0.12022
14.62500 0.13093
14.87500 0.12645
