0.12500 0.03459
0.37500 0.02401
0.62500 0.01688
0.87500 0.01656
1.12500 0.03190
1.37500 0.04974
1.62500 0.04019
1.87500 0.05247
2.12500 0.04895
2.37500 0.05485
2.62500 0.05678
2.87500 0.04676
3.12500 0.05560
3.37500 0.03964
3.62500 0.02528
3.87500 0.02787
4.12500 0.01108
4.37500 0.00165
4.62500 0.00901
4.87500 0.00461
5.12500 0.01191
5.37500 0.00886
5.62500 0.03153
5.87500 0.01919
6.12500 0.02301
6.37500 0.02087
6.62500 0.01927
6.87500 0.00749
7.12500 0.02280
7.37500 0.01688
7.62500 0.01949
7.87500 0.02337
8.12500 0.00769
8.37500 0.02188
8.62500 0.02638
8.87500 0.01950
9.12500 0.02941
9.37500 0.03286
9.62500 0.04236
9.87500 0.03982
10.12500 0.02812
10.37500 0.01751
10.62500 0.02085
10.87500 0.01245
11.12500 0.02079
11.37500 0.01853
11.62500 0.02805
11.87500 0.00876
12.12500 0.00894
12.37500 0.01479
12.62500 0.02366
12.87500 0.01665
13.12500 0.00639
13.37500 0.00289
13.62500 0.02550
13.87500 0.02727
14.12500 0.00572
14.37500 0.01346
14.62500 0.01687
14.87500 0.00873
15.12500 0.02134
15.37500 0.02950
15.62500 0.02871
15.87500 0.02479
16.12500 0.03411
16.37500 0.03089
16.62500 0.02874
16.87500 0.04651
17.12500 0.02904
17.37500 0.00386
17.62500 0.00621
17.87500 0.01438
18.12500 0.02538
18.37500 0.01947
18.62500 0.03044
18.87500 0.03419
19.12500 0.01489
19.37500 0.06484
19.62500 0.03446
19.87500 0.00637
