0.05000 -7562.94588 -1265.07511 5512.20855 6834.40914 8584.90811 7785.19775
0.15000 -10262.05604 551.53296 5611.95640 8112.56094 8803.46637 11788.55197
0.25000 -13410.02555 -354.99559 2991.63973 7709.65734 8270.64398 14821.72932
0.35000 -16087.76872 -8.67603 2700.86086 6736.89728 7121.63307 16375.73645
0.45000 -16883.87112 105.69043 783.82299 6447.82297 6495.28866 17598.86972
0.55000 -17008.40870 -146.91841 1045.05073 6121.96916 5666.32255 16844.75210
0.65000 -16608.84485 33.78322 829.73919 5770.26594 5026.99161 16285.47656
0.75000 -16277.20700 31.67742 169.01853 5408.90180 4532.44989 15551.03217
0.85000 -15853.68326 -84.59085 -110.28926 5078.49463 4280.95450 14601.49143
0.95000 -15331.92355 40.91088 210.66280 4804.59731 4161.83215 13657.32351
1.05000 -14750.63786 2.08983 -388.76632 4421.08838 3862.55491 13093.78452
1.15000 -14445.30530 90.26431 -67.53154 4071.82510 3721.89786 12208.15107
1.25000 -13989.75865 -4.75335 -6.67379 3943.53649 3603.30804 11634.81694
1.35000 -13489.50484 16.95687 -264.60120 3660.70394 3408.28856 11120.73640
1.45000 -13141.46572 -107.89645 -295.95800 3567.10322 3459.59550 10672.92004
1.55000 -12967.16527 -3.66029 2.26773 3278.24301 3183.10081 9983.58303
1.65000 -12612.36443 91.27235 -222.36938 3109.59368 3048.43348 9560.97318
1.75000 -12418.27523 -34.68622 -2.49863 2844.19619 3029.06553 8954.99792
1.85000 -12073.87031 -59.66737 134.60376 2840.80359 2920.96966 8754.29333
1.95000 -11705.13262 28.90076 130.62117 2649.95818 2691.63946 8320.56837
2.05000 -11513.80454 23.06675 -378.23155 2568.41765 2759.56552 7906.11653
2.15000 -11186.61288 -29.25018 27.34240 2454.22878 2548.79843 7694.36341
2.25000 -10938.46289 -11.57517 -74.47725 2377.57778 2476.16695 7338.08653
2.35000 -10731.60278 -46.46389 -151.93491 2259.49413 2383.12490 7150.59387
2.45000 -10623.31007 35.48161 -109.48040 2178.70361 2300.04356 6817.42294
2.55000 -10405.73684 -7.79727 121.62668 2015.27703 2171.13172 6499.66865
2.65000 -10139.77671 26.03250 20.82098 2022.91751 2142.03179 6477.86700
2.75000 -10002.30248 10.89967 -105.32951 1884.80163 1979.76538 6192.83820
2.85000 -9855.57521 -35.86071 -249.86407 1967.58813 2014.89000 6003.59803
2.95000 -9683.70101 -21.71829 -223.19494 1737.98578 1917.74994 5706.13745
3.05000 -9459.51705 3.07918 -241.31480 1584.10583 1785.03251 5582.64825
3.15000 -9273.55448 49.61147 -380.08237 1539.45789 1715.63677 5411.19663
3.25000 -9083.42816 -3.34502 -293.38546 1528.88947 1657.48202 5363.14377
3.35000 -8934.28067 -60.21360 -186.79144 1452.49926 1763.68476 5242.91686
3.45000 -8748.48791 47.14994 -341.25405 1341.83360 1521.58572 5011.85943
3.55000 -8618.96112 -14.35757 -241.43956 1354.29570 1478.99629 4894.93834
3.65000 -8499.73287 -47.56204 -428.46556 1177.60183 1477.28937 4647.98373
3.75000 -8353.31856 -14.31620 -394.81401 1169.79257 1461.38172 4435.58767
3.85000 -8243.85372 -9.60501 -109.16166 1105.32409 1369.79895 4416.47989
3.95000 -8133.44253 -31.18894 -318.20032 1273.47129 1351.34558 4336.57572
4.05000 -7972.88063 -16.00201 -304.57899 1120.22035 1282.37234 4267.19271
4.15000 -7845.22133 -20.01739 -199.79308 980.90421 1180.00807 4143.50923
4.25000 -7756.39252 41.32328 -414.32951 1052.98718 1192.60564 4036.45191
4.35000 -7693.03355 -9.40973 -352.90138 974.40636 1119.06854 3850.20256
4.45000 -7553.81777 -0.59650 -253.03334 941.36312 1093.66043 3858.54611
4.55000 -7501.55979 4.05483 -281.08283 954.78793 1071.75166 3596.02094
4.65000 -7406.77847 25.32880 -264.97689 847.89125 1032.53134 3501.03595
4.75000 -7343.20364 22.73543 -264.11359 809.74878 1004.60893 3351.71587
4.85000 -7200.82281 2.04670 -166.45080 805.52129 986.55709 3257.26779
4.95000 -7143.86190 -21.61176 -229.99051 797.52170 950.39585 3145.89040
5.05000 -7043.95282 -1.50969 -39.68903 812.37926 1037.09837 2946.34376
5.15000 -6938.72204 2.45736 -141.80312 760.18421 986.94353 2916.78276
5.25000 -6922.32690 -76.67298 -89.25977 731.77459 876.72369 2786.94948
5.35000 -6857.65905 -35.90046 -18.32311 749.20357 895.48600 2780.10607
5.45000 -6801.25315 -25.31316 79.94968 644.95593 826.28301 2525.67446
5.55000 -6698.04500 -35.51576 -61.21584 780.88824 836.07564 2448.37395
5.65000 -6653.74278 -21.34611 104.40943 662.10546 752.10393 2349.27275
5.75000 -6581.67834 -25.23129 45.74380 659.13845 750.94922 2231.44079
5.85000 -6498.37335 -21.87073 207.66570 695.78539 747.05007 2178.23415
5.95000 -6432.12216 18.62474 154.32118 895.56964 769.76848 2152.45450
6.05000 -6387.56639 23.92282 224.45872 605.47029 686.15797 2009.05133
6.15000 -6350.07528 -17.15647 221.51845 561.18682 618.80768 1999.88166
6.25000 -6246.03321 7.68828 106.71809 523.64346 624.43949 1815.67789
6.35000 -6185.23529 13.03921 139.27307 559.21582 607.80643 1817.91964
6.45000 -6113.10407 10.95595 135.77215 914.49646 633.71164 1759.32940
6.55000 -6048.68883 26.20602 145.50729 599.47316 662.23833 1686.76282
6.65000 -5983.15156 59.44511 123.19316 489.02009 546.82866 1614.44160
6.75000 -5946.80947 25.26720 106.48480 565.83267 527.73476 1575.02791
6.85000 -5893.85080 25.45087 125.99775 543.49482 486.70512 1605.17227
6.95000 -5841.77516 50.30351 112.42950 507.09008 475.58828 1527.83441
7.05000 -5776.45801 26.56232 113.94229 525.46800 527.65265 1458.61345
7.15000 -5729.89457 19.96639 105.59141 548.59414 533.40338 1455.82997
7.25000 -5668.11141 48.85135 40.98066 523.07550 486.81996 1445.34541
7.35000 -5652.93037 21.74045 -1.78152 443.03900 413.67023 1354.86096
7.45000 -5589.20048 34.08934 27.97430 464.17585 452.05877 1333.00524
7.55000 -5570.58384 0.19067 9.33789 601.47422 399.69254 1332.04614
7.65000 -5514.50744 24.78775 77.63921 485.55319 405.91640 1255.15312
7.75000 -5477.08496 31.20213 83.01862 519.56570 372.15719 1230.30181
7.85000 -5429.13971 30.68462 24.47743 514.83104 410.36300 1406.37282
7.95000 -5380.51375 22.54215 76.88164 431.19590 371.41949 1204.01769
8.05000 -5320.76203 23.80516 36.41767 402.12838 338.16840 1131.31179
8.15000 -5267.85496 18.07359 49.40033 396.89497 367.38981 1119.84864
8.25000 -5230.77141 8.52620 -6.76266 365.13537 339.72446 1102.15034
8.35000 -5186.79626 11.90516 49.72543 515.88138 357.30144 1097.85550
8.45000 -5157.34323 -0.02007 -27.33731 359.66070 359.11878 1031.08908
8.55000 -5123.79778 6.79688 35.90993 450.83454 421.83474 1011.62456
8.65000 -5042.69675 10.48396 14.29188 367.48459 353.21754 998.79411
8.75000 -5004.91093 10.74825 17.68288 564.99725 469.08353 1055.05941
8.85000 -4987.50878 -4.89421 -12.23386 806.84752 605.37831 992.19900
8.95000 -4902.94644 17.32888 6.09037 348.91569 385.03575 989.20367
9.05000 -4871.01042 19.27536 31.23108 299.42277 310.03029 926.87810
9.15000 -4841.30503 5.60180 -0.28132 339.14000 300.75425 923.68762
9.25000 -4783.01367 12.47318 39.18785 305.71666 282.61737 885.21581
9.35000 -4728.71814 26.33726 5.07570 289.38008 245.54447 866.16484
9.45000 -4692.48831 5.86151 32.65485 279.92206 257.47240 857.06388
9.55000 -4659.83751 10.51451 40.16286 304.15114 246.63976 838.58222
9.65000 -4605.55292 6.58345 91.44796 319.21807 221.72212 807.30716
9.75000 -4599.21800 -5.68060 12.32675 278.18988 415.72873 888.19077
9.85000 -4534.75726 -5.39345 44.13979 464.82164 342.59715 800.54298
9.95000 -4508.50258 24.52683 3.52944 233.21110 192.25778 768.50991
10.05000 -4451.00219 11.57803 49.99391 249.66109 235.85789 739.70749
10.15000 -4441.29645 20.74916 29.10997 305.15016 203.49598 823.99848
10.25000 -4384.35555 13.13385 6.63768 254.91163 233.93047 742.63668
10.35000 -4381.50500 -2.76438 54.64021 573.96978 244.79449 709.22775
10.45000 -4318.03513 12.65071 18.34448 247.78488 203.45904 691.82103
10.55000 -4294.20252 15.32962 33.00525 232.19580 203.12270 685.97911
10.65000 -4256.07278 16.02874 19.89311 213.93777 171.31965 651.92984
10.75000 -4208.95209 15.11179 25.32634 215.30177 302.84995 688.30568
10.85000 -4184.26833 19.99346 49.22154 263.77545 206.18871 659.00225
10.95000 -4142.76061 14.43087 40.16587 203.84494 297.41817 626.39426
11.05000 -4086.00734 11.78606 30.65784 521.08580 262.05465 653.08001
11.15000 -4080.90393 17.29858 19.00851 232.91959 173.39800 622.76071
11.25000 -4059.12695 19.80279 58.87736 277.31149 211.54534 588.74272
11.35000 -4033.78122 16.78671 32.53457 200.99917 167.74288 558.12621
11.45000 -4002.06361 5.94327 14.65169 166.58947 173.51259 560.15265
11.55000 -3964.25303 8.72008 9.68305 175.31741 156.35224 574.41600
11.65000 -3938.43912 11.07073 7.86601 204.19825 146.18426 559.76691
11.75000 -3886.78936 7.76037 20.43582 216.41746 172.81183 552.48431
11.85000 -3876.77724 5.51499 23.68757 267.91304 135.47331 565.32958
11.95000 -3842.95644 11.91711 45.07031 239.22783 171.63779 522.97439
12.05000 -3817.40227 13.58118 22.97258 169.85152 141.27986 512.42760
12.15000 -3789.66477 7.84921 3.05685 138.53154 131.10610 472.25940
12.25000 -3745.33549 11.55399 11.33261 203.72271 147.21173 524.91662
12.35000 -3733.45167 -0.28939 -19.06438 205.05329 163.32594 496.06566
12.45000 -3694.75749 13.82413 16.46759 181.67396 204.70641 470.88083
12.55000 -3665.56429 13.30257 -25.63418 230.39167 179.93565 497.62132
12.65000 -3647.85434 9.41474 15.07976 162.66913 117.51796 477.69848
12.75000 -3600.47995 9.34955 19.33575 173.27889 179.29203 457.63390
12.85000 -3579.50098 6.13053 -24.75687 235.11585 133.96553 470.71938
12.95000 -3565.13697 12.75837 16.25203 320.37822 138.43648 483.07567
13.05000 -3544.12088 5.35161 -3.71721 162.19400 101.11598 423.54319
13.15000 -3501.18178 7.14637 -6.09271 190.37305 131.22218 438.10798
13.25000 -3489.47164 9.49575 1.62575 170.38804 107.00320 428.31317
13.35000 -3464.80517 14.33627 -1.49488 168.54833 105.94683 399.80434
13.45000 -3437.58720 11.12161 49.56505 139.05449 105.80891 422.57720
13.55000 -3421.77583 11.82595 9.90256 169.21973 170.79001 408.50758
13.65000 -3373.69971 10.46286 -16.03651 167.69885 125.22531 405.32898
13.75000 -3352.67904 10.74005 -9.03556 191.00880 119.21245 393.23849
13.85000 -3343.12784 10.98372 10.49248 153.50770 95.02966 376.40402
13.95000 -3305.68587 11.95112 12.15029 142.32296 121.84891 388.30566
14.05000 -3289.38161 10.02027 0.68313 197.38439 190.61575 388.34507
14.15000 -3273.09896 3.64491 -3.51276 242.95805 156.98574 470.99862
14.25000 -3243.84102 0.35800 14.02125 210.84692 127.11317 346.84948
14.35000 -3233.52343 15.55008 -1.20169 207.98449 149.55503 385.87059
14.45000 -3218.05167 5.48307 12.56543 124.75064 188.60852 363.08187
14.55000 -3182.76164 11.37884 -13.43384 128.97318 137.24413 347.33961
14.65000 -3168.32484 4.84176 6.50561 124.37972 85.15190 327.43521
14.75000 -3155.20522 9.02139 -7.66335 267.78303 111.13140 391.53981
14.85000 -3131.07000 6.08243 -9.41922 109.39259 106.84434 326.08443
14.95000 -3110.17698 13.47056 -3.26880 148.21482 112.67134 324.54629
15.05000 -3098.28970 8.84858 11.12810 125.59506 128.59646 323.52664
15.15000 -3073.45710 10.09913 7.60317 116.35318 110.59344 324.61538
15.25000 -3046.95381 23.23567 -25.54680 328.90883 146.35787 524.04724
15.35000 -3034.11364 -0.57375 18.77139 98.74722 178.53266 312.89536
15.45000 -3019.93506 14.97116 5.22548 112.83117 97.03356 290.52393
15.55000 -2999.48912 3.56059 -28.49317 107.14896 127.72710 297.08524
15.65000 -2987.17276 16.46470 19.85044 109.35334 99.11695 302.06579
15.75000 -2964.48668 10.64961 2.98115 87.26877 100.88174 280.09955
15.85000 -2959.93309 14.23910 0.60575 311.67870 90.63742 305.01985
15.95000 -2927.30825 10.03931 -6.37042 122.16331 122.24682 299.38280
16.05000 -2893.07051 17.92736 -24.43360 141.13428 114.50855 275.81581
16.15000 -2886.96452 20.29559 -7.06212 98.36263 100.43585 266.73289
16.25000 -2862.25872 1.53803 8.18675 113.46447 130.79514 269.59087
16.35000 -2852.91085 13.99323 9.60087 93.85793 85.48091 259.27716
16.45000 -2831.55846 10.08475 12.09267 92.06916 328.26230 257.29705
16.55000 -2813.25817 11.80967 -23.27533 96.67041 111.60360 257.54403
16.65000 -2795.52848 11.99801 -11.78065 139.67441 94.30264 247.05577
16.75000 -2784.56646 20.13349 -2.49424 209.56466 254.39851 249.04039
16.85000 -2767.96016 4.00985 -5.75378 72.04110 65.75038 224.21105
16.95000 -2754.72165 16.10459 -10.35939 100.24412 99.53897 224.44784
17.05000 -2721.72391 12.80674 -9.20577 228.05257 105.21384 269.93771
17.15000 -2708.92535 4.29134 -4.52140 82.18734 82.89734 248.90844
17.25000 -2696.73662 26.80672 6.91220 235.79291 298.82147 300.08549
17.35000 -2687.43706 -2.79031 15.22968 82.54544 241.35060 235.09971
17.45000 -2661.88768 4.91176 -21.15195 97.53126 72.82447 222.13635
17.55000 -2648.27077 7.73027 -26.33638 73.70929 55.49734 201.65040
17.65000 -2616.03393 18.72340 3.73848 272.26267 140.16707 225.27688
17.75000 -2606.87904 7.80041 -3.63042 71.05269 66.77521 197.49069
17.85000 -2592.45369 9.28595 -37.78754 68.00487 74.94608 205.62438
17.95000 -2580.77934 7.88838 -0.65282 87.65853 64.83135 210.15523
18.05000 -2558.27836 12.95129 23.99635 94.38078 71.32956 202.86419
18.15000 -2550.70188 14.94068 -7.96152 73.49699 47.99118 202.62517
18.25000 -2536.33065 8.96945 3.75578 67.75468 75.12485 195.89934
18.35000 -2522.08932 11.37384 -16.39409 42.10501 59.05992 183.29975
18.45000 -2511.95647 10.64366 13.42279 60.99388 47.98398 171.41560
18.55000 -2486.23580 3.79386 8.77297 52.56604 60.82593 190.03130
18.65000 -2474.08473 5.38458 15.23683 45.96116 42.92341 186.22293
18.75000 -2459.68581 9.86011 11.40389 42.12014 46.77165 176.99800
18.85000 -2441.36239 3.42021 -15.75968 85.22237 85.65930 182.53690
18.95000 -2433.18070 5.26237 -2.57658 51.69117 46.70222 169.61918
19.05000 -2417.54255 6.37031 5.38515 50.70204 41.08171 203.88409
19.15000 -2409.50186 5.21220 -14.21820 76.55768 57.11408 183.82718
19.25000 -2401.70271 21.28650 49.28968 130.20421 77.19639 241.93938
19.35000 -2371.91168 -6.38274 -6.16715 51.05097 140.28044 288.13925
19.45000 -2358.93502 7.23944 -9.44730 36.96071 42.48271 170.39996
19.55000 -2345.60154 -1.87829 -0.07892 53.50466 84.47090 174.37903
19.65000 -2327.37758 7.05318 4.82357 63.18988 48.18065 177.89369
19.75000 -2319.94649 1.50114 29.32129 48.00026 46.35037 176.52229
19.85000 -2315.46352 1.59574 9.62976 66.53711 60.54248 151.70671
19.95000 -2288.68424 7.48927 -7.94804 64.82404 57.49995 165.49895
