0.12500 0.02975
0.37500 0.04733
0.62500 0.11144
0.87500 0.17147
1.12500 0.22719
1.37500 0.26622
1.62500 0.28735
1.87500 0.30714
2.12500 0.34007
2.37500 0.36807
2.62500 0.40160
2.87500 0.42127
3.12500 0.44754
3.37500 0.45242
3.62500 0.48417
3.87500 0.49613
4.12500 0.51645
4.37500 0.53172
4.62500 0.55057
4.87500 0.53684
5.12500 0.53156
5.37500 0.48840
5.62500 0.45213
5.87500 0.40092
6.12500 0.33261
6.37500 0.30391
6.62500 0.25504
6.87500 0.23728
7.12500 0.20848
7.37500 0.20104
7.62500 0.15663
7.87500 0.14379
8.12500 0.13834
8.37500 0.10400
8.62500 0.10369
8.87500 0.10014
9.12500 0.08308
9.37500 0.09167
9.62500 0.09978
9.87500 0.09658
10.12500 0.07673
10.37500 0.09508
10.62500 0.09183
10.87500 0.06906
11.12500 0.03872
11.37500 0.05038
11.62500 0.03436
11.87500 0.07031
12.12500 0.07795
12.37500 0.09054
12.62500 0.08966
12.87500 0.11560
13.12500 0.11688
13.37500 0.11579
13.62500 0.11860
13.87500 0.10843
14.12500 0.10353
14.37500 0.07215
14.62500 0.08233
14.87500 0.07162
