0.120000 -0.760020
0.380000 0.060110
0.620000 -0.454350
0.880000 -0.384660
1.120000 -0.421800
1.380000 -0.427190
1.620000 -0.412820
1.880000 -0.406570
2.120000 -0.411640
2.380000 -0.439220
2.620000 -0.405150
2.880000 -0.406610
3.120000 -0.408530
3.380000 -0.410180
3.620000 -0.404200
3.880000 -0.380810
4.120000 -0.397520
4.380000 -0.380520
4.620000 -0.379030
4.880000 -0.386080
5.120000 -0.377000
5.380000 -0.364270
5.620000 -0.372710
5.880000 -0.369630
6.120000 -0.353650
6.380000 -0.332010
6.620000 -0.339430
6.880000 -0.343460
7.120000 -0.306870
7.380000 -0.304890
7.620000 -0.294560
7.880000 -0.305790
8.120000 -0.295730
8.380000 -0.317150
8.620000 -0.336540
8.880000 -0.299370
9.120000 -0.342080
9.380000 -0.315250
9.620000 -0.330800
9.880000 -0.337030
10.120000 -0.418460
10.380000 -0.543800
10.620000 -0.613490
10.880000 -0.942900
11.120000 -0.984480
11.380000 -1.143110
11.620000 -1.062050
11.880000 -1.359240
12.120000 -0.470560
12.380000 -0.385930
12.620000 -0.340470
12.880000 0.615910
13.120000 0.396150
13.380000 0.133800
13.620000 -0.016550
13.880000 -0.102650
14.120000 -0.771990
14.380000 0.510080
14.620000 -0.989210
14.880000 -1.542800
