0.120000 -2.007410
0.380000 1.249150
0.620000 2.175860
0.880000 2.252300
1.120000 0.426110
1.380000 0.537560
1.620000 0.356320
1.880000 0.455210
2.120000 0.411720
2.380000 0.295760
2.620000 0.299100
2.880000 0.181200
3.120000 0.309640
3.380000 0.025900
3.620000 0.089510
3.880000 -0.044420
4.120000 -0.197210
4.380000 -0.168470
4.620000 -0.348120
4.880000 -0.648400
5.120000 -1.065820
5.380000 -1.642960
5.620000 -1.957680
5.880000 -1.939890
6.120000 -2.703420
6.380000 2.376340
6.620000 2.476350
6.880000 -2.867130
7.120000 1.985330
7.380000 2.646470
7.620000 -0.737850
7.880000 -1.376470
8.120000 -0.049250
8.380000 -0.752200
8.620000 -0.691840
8.880000 -1.474630
9.120000 -1.673620
9.380000 -1.609060
9.620000 -1.504040
9.880000 2.869870
10.120000 1.004660
10.380000 0.243870
10.620000 1.019880
10.880000 0.084570
11.120000 0.232570
11.380000 -0.832290
11.620000 -0.497030
11.880000 -0.596020
12.120000 -1.362580
12.380000 -2.691570
12.620000 -2.839160
12.880000 3.103580
13.120000 -3.112320
13.380000 -3.033440
13.620000 2.963690
13.880000 -3.093350
14.120000 1.918740
14.380000 -3.007600
14.620000 1.807940
14.880000 -2.944880
