0.2 2.28128 17.66358 2.74131 74.11557 71.24722 68.55703
0.6 -1.28322 38.41468 -0.53568 71.15095 70.48421 67.81644
1.0 -0.28654 59.01024 -0.12081 67.5356 68.91575 64.71977
1.4 -0.48362 79.05923 0.38293 65.01771 65.67981 61.51916
1.8 0.47904 96.25304 0.01277 62.328 61.7662 58.92781
2.2 1.11727 109.29454 -1.04387 59.68743 58.18601 56.49592
2.6 0.90438 119.75257 -0.34084 57.21337 55.89601 53.57294
3.0 -0.13797 130.92043 -0.62839 55.0762 52.77732 51.2855
3.4 -1.23495 140.27267 -0.82946 52.64819 50.7298 49.15152
3.8 -0.9717 148.98971 -0.78193 51.02934 47.29573 47.08197
4.2 -1.05664 156.38047 -0.49161 48.9179 45.05587 45.0648
4.6 -0.66216 162.06827 -0.27452 47.34213 42.80171 42.92957
5.0 -0.91137 168.02704 -0.08795 45.4098 40.75545 41.26371
5.4 -0.01129 173.48414 -0.41025 43.71953 38.82171 39.09575
5.8 0.42924 178.20978 0.15295 42.37136 36.86971 37.3682
6.2 0.19663 183.00249 0.22081 40.78892 35.03873 36.09635
6.6 0.41973 186.46603 0.14652 39.35269 33.46622 34.40202
7.0 0.6213 189.74437 0.6115 38.52961 32.16253 33.30145
7.4 0.09281 192.73882 0.48552 37.24146 31.0946 31.80186
7.8 -0.12195 195.74623 0.8231 36.30533 29.64761 30.74443
8.2 -0.39612 198.34945 0.94652 34.54746 28.36393 28.97654
8.6 -0.89823 199.89686 1.23358 33.39482 27.14114 27.92961
9.0 -1.181 202.11572 0.99445 32.27947 26.13619 26.88347
9.4 -1.13127 204.03827 0.90021 31.75894 25.10137 26.28028
9.8 -0.82421 204.8803 1.07861 30.36632 24.19912 24.84676
10.2 -0.97685 205.89737 0.39265 29.7451 23.34813 24.27161
10.6 -1.58034 206.76153 0.46919 28.54104 22.17058 22.83578
11.0 -1.11736 208.08479 -0.39393 27.63263 21.82621 22.32104
11.4 -0.94668 209.0756 -0.06728 27.1895 20.9166 21.38699
11.8 -0.70972 210.20279 -0.10637 25.893 20.11141 20.48241
12.2 -0.26863 210.75553 -0.43933 24.99231 19.36035 19.62727
12.6 -0.46308 211.04816 -0.27443 24.25975 18.86112 19.08732
13.0 -0.49301 211.02208 -0.38815 23.8158 18.17942 18.37704
13.4 -1.23146 211.5065 -0.89844 22.64587 17.34291 17.5339
13.8 -1.41386 211.85553 -0.47862 22.18446 16.92832 16.95093
14.2 -0.96452 212.38442 -0.44969 21.1804 16.61105 16.20111
14.6 -1.17613 213.01076 -0.00881 20.27837 15.93734 16.26286
15.0 -0.73715 213.29088 0.01359 19.93785 15.03271 15.41862
15.4 -0.97563 213.11021 0.50146 19.41918 14.02094 14.69788
15.8 -0.92846 212.88739 0.87255 18.69394 13.79046 14.45009
16.2 -0.9349 212.79947 0.17518 18.18612 13.575 13.87092
16.6 -0.79454 212.75274 0.65396 17.51137 13.3042 13.71854
17.0 -0.52113 212.7882 0.07277 16.77873 13.44554 13.06418
17.4 -0.29665 213.00497 -0.0323 16.54556 12.77772 12.59854
17.8 0.37821 213.08156 0.29063 16.61756 12.27812 12.36227
18.2 0.01568 212.76629 -0.06782 15.7598 11.74398 12.15076
18.6 -0.2203 213.02711 -0.46159 15.28623 11.42031 11.7788
19.0 0.56908 213.08342 -0.2691 14.88452 11.29099 11.27584
19.4 0.41056 213.19128 -0.57417 13.98985 10.63423 11.20595
19.8 0.22252 212.76008 -0.30769 13.95618 10.23726 10.6261
