0.12500 0.02161
0.37500 0.07275
0.62500 0.11453
0.87500 0.16405
1.12500 0.22787
1.37500 0.26728
1.62500 0.29712
1.87500 0.32306
2.12500 0.35457
2.37500 0.38383
2.62500 0.41448
2.87500 0.44461
3.12500 0.45790
3.37500 0.48002
3.62500 0.51411
3.87500 0.47712
4.12500 0.49135
4.37500 0.45342
4.62500 0.45456
4.87500 0.39581
5.12500 0.37988
5.37500 0.33049
5.62500 0.27188
5.87500 0.23604
6.12500 0.24887
6.37500 0.20433
6.62500 0.21035
6.87500 0.17903
7.12500 0.16905
7.37500 0.12914
7.62500 0.12837
7.87500 0.13892
8.12500 0.09218
8.37500 0.06385
8.62500 0.10270
8.87500 0.06533
9.12500 0.08357
9.37500 0.07350
9.62500 0.06727
9.87500 0.04854
10.12500 0.04414
10.37500 0.04340
10.62500 0.02285
10.87500 0.05846
11.12500 0.07272
11.37500 0.05068
11.62500 0.02359
11.87500 0.09016
12.12500 0.05610
12.37500 0.07109
12.62500 0.08220
12.87500 0.08554
13.12500 0.06524
13.37500 0.11977
13.62500 0.09490
13.87500 0.12366
14.12500 0.10752
14.37500 0.13705
14.62500 0.10935
14.87500 0.14778
15.12500 0.16379
15.37500 0.11361
15.62500 0.15874
15.87500 0.14640
16.12500 0.11730
16.37500 0.11132
16.62500 0.13457
16.87500 0.14227
17.12500 0.20244
17.37500 0.15924
17.62500 0.11002
17.87500 0.17023
18.12500 0.11004
18.37500 0.03274
18.62500 0.11095
18.87500 0.08313
19.12500 0.09415
19.37500 0.04634
19.62500 0.04559
19.87500 0.08192
