0.05000 20011.80515
0.15000 22563.71380
0.25000 22817.54180
0.35000 20858.67811
0.45000 18734.72170
0.55000 16689.50522
0.65000 15239.09215
0.75000 13583.75654
0.85000 12813.41428
0.95000 11533.06636
1.05000 10866.68954
1.15000 10117.17446
1.25000 9404.31945
1.35000 9116.84565
1.45000 8462.96420
1.55000 8050.51549
1.65000 7644.15055
1.75000 7176.66707
1.85000 6855.95055
1.95000 6495.17037
2.05000 6094.44494
2.15000 6086.51382
2.25000 5696.76184
2.35000 5487.00747
2.45000 5290.23854
2.55000 4978.47767
2.65000 5026.37675
2.75000 4672.76809
2.85000 4592.57937
2.95000 4374.77596
3.05000 4306.90227
3.15000 4089.37060
3.25000 3962.98994
3.35000 3786.29680
3.45000 3740.24280
3.55000 3449.24317
3.65000 3403.41469
3.75000 3141.35476
3.85000 3148.58282
3.95000 3076.17082
4.05000 2892.49622
4.15000 2903.11133
4.25000 2774.17403
4.35000 2670.15493
4.45000 2580.95215
4.55000 2489.36242
4.65000 2422.16557
4.75000 2399.71105
4.85000 2378.54481
4.95000 2265.09003
5.05000 2158.97306
5.15000 2152.47879
5.25000 2085.42448
5.35000 2011.73396
5.45000 1977.78886
5.55000 1890.14593
5.65000 1823.50728
5.75000 1811.72186
5.85000 1753.37681
5.95000 1621.11096
6.05000 1649.07389
6.15000 1573.17349
6.25000 1568.80246
6.35000 1499.18109
6.45000 1451.28931
6.55000 1424.29242
6.65000 1378.55732
6.75000 1327.28776
6.85000 1307.35406
6.95000 1274.30170
7.05000 1243.81050
7.15000 1175.13359
7.25000 1186.12109
7.35000 1158.35852
7.45000 1111.02603
7.55000 1101.68001
7.65000 1052.67224
7.75000 1044.61602
7.85000 1008.07559
7.95000 975.29021
8.05000 979.41008
8.15000 953.07606
8.25000 940.87451
8.35000 905.57917
8.45000 889.85404
8.55000 828.40477
8.65000 803.49381
8.75000 800.70327
8.85000 829.70605
8.95000 771.36785
9.05000 778.57501
9.15000 735.41026
9.25000 729.52627
9.35000 692.66618
9.45000 690.18741
9.55000 675.04769
9.65000 653.34100
9.75000 664.25504
9.85000 651.65973
9.95000 622.86697
10.05000 632.15374
10.15000 635.15792
10.25000 611.41013
10.35000 594.05874
10.45000 572.76524
10.55000 554.11126
10.65000 559.95825
10.75000 576.44647
10.85000 582.05879
10.95000 531.82252
11.05000 545.15550
11.15000 532.11107
11.25000 507.41186
11.35000 505.14506
11.45000 494.58610
11.55000 499.71574
11.65000 463.39644
11.75000 456.54721
11.85000 447.93515
11.95000 438.28032
12.05000 434.99160
12.15000 420.97414
12.25000 433.39901
12.35000 439.44463
12.45000 418.86256
12.55000 417.22173
12.65000 395.92538
12.75000 405.85598
12.85000 371.74472
12.95000 370.87919
13.05000 364.85981
13.15000 356.32606
13.25000 353.68606
13.35000 345.37067
13.45000 334.49170
13.55000 320.01061
13.65000 321.96347
13.75000 340.40473
13.85000 302.73948
13.95000 289.14862
14.05000 295.84110
14.15000 291.23405
14.25000 287.60132
14.35000 289.42051
14.45000 290.72444
14.55000 266.88849
14.65000 275.61320
14.75000 279.06911
14.85000 253.45395
14.95000 260.60256
15.05000 248.27742
15.15000 248.28356
15.25000 241.67914
15.35000 223.09599
15.45000 241.46324
15.55000 261.28648
15.65000 224.51665
15.75000 224.87819
15.85000 227.26736
15.95000 209.62562
16.05000 212.25957
16.15000 192.17229
16.25000 212.42011
16.35000 200.73283
16.45000 193.85130
16.55000 209.54554
16.65000 191.42627
16.75000 189.78412
16.85000 178.34212
16.95000 176.04847
17.05000 187.77393
17.15000 188.14995
17.25000 162.35479
17.35000 178.81603
17.45000 165.88157
17.55000 174.10177
17.65000 175.50450
17.75000 182.69614
17.85000 158.43061
17.95000 158.06992
18.05000 154.77896
18.15000 148.87649
18.25000 160.21280
18.35000 199.88130
18.45000 161.97897
18.55000 147.82895
18.65000 139.95957
18.75000 150.09312
18.85000 142.56117
18.95000 154.50993
19.05000 141.30132
19.15000 134.18870
19.25000 145.47276
19.35000 137.71239
19.45000 128.19464
19.55000 127.94651
19.65000 135.36257
19.75000 131.18356
19.85000 127.25443
19.95000 113.26729
