0.2 0.22718 17.51873 0.29785 67.97149 68.88434 68.31189
0.6 -0.716 40.4393 -0.36809 65.36297 65.65333 64.78855
1.0 -1.13601 63.58693 -0.09128 62.48518 63.10444 60.87396
1.4 0.5518 84.70162 -0.46205 59.16305 58.38336 57.83753
1.8 0.60563 101.51618 0.28642 56.41182 55.96846 54.4318
2.2 1.35185 114.48312 -0.37168 54.29046 53.01651 52.49735
2.6 0.04531 125.49191 -0.75813 52.63888 50.27029 50.31557
3.0 0.51667 136.07182 -0.56827 50.4552 48.21132 47.58936
3.4 0.26455 145.27407 -1.09408 48.25539 45.30679 45.49619
3.8 1.06931 154.20426 -0.69754 46.02878 42.88393 43.14399
4.2 1.49872 161.55966 -0.82038 44.62684 40.57437 41.11877
4.6 1.96049 168.31444 -0.24006 42.73099 38.43269 39.10629
5.0 1.7475 173.79598 -0.37172 41.48835 36.17315 37.16144
5.4 1.52279 179.15508 0.00383 39.58391 34.18201 35.24021
5.8 0.78925 183.42741 0.55219 37.95661 32.91222 33.67677
6.2 -0.05469 187.10167 0.64635 36.70364 30.59551 32.16067
6.6 -0.04177 190.53638 0.77875 35.29741 29.05783 30.70852
7.0 -0.48159 192.84869 0.93892 33.65415 27.48276 29.45428
7.4 -0.43776 196.03302 0.36201 32.62323 26.29194 28.03462
7.8 -0.66949 199.02365 -0.35413 30.92058 25.59 26.67607
8.2 -0.24346 201.16438 -1.06801 30.01121 24.12618 25.39701
8.6 0.1692 201.98355 -1.51693 28.76484 22.47359 24.60907
9.0 0.06376 202.69419 -1.60584 28.31053 21.94692 23.46567
9.4 -0.12193 204.78458 -0.38634 26.66865 21.67353 22.35321
9.8 0.22124 206.8613 0.13808 25.77309 20.93663 21.74183
10.2 0.16701 207.84518 0.97138 24.826 19.43148 20.57414
10.6 0.09794 207.82583 1.33745 24.13594 18.62013 19.52192
11.0 -1.25168 207.9323 1.63632 23.87539 17.59072 18.81258
11.4 -2.21266 207.89967 1.27151 22.71892 16.71115 18.51412
11.8 -2.72117 208.87296 0.8372 21.79145 15.95369 17.55454
12.2 -2.05696 209.96653 1.05535 20.76409 15.8935 16.6014
12.6 -0.58641 211.17487 1.56149 19.61124 15.22123 15.8918
13.0 0.82863 211.26538 1.34013 18.70446 14.76048 14.97142
13.4 1.15293 211.25827 1.3585 18.45784 14.56036 14.50084
13.8 0.93013 212.33357 0.75556 17.50173 14.70015 14.05866
14.2 1.30029 212.83877 0.7386 17.48121 13.70996 13.59163
14.6 0.33179 212.64777 0.88695 17.58692 12.55184 13.24352
15.0 -1.1104 211.83225 1.43847 17.09793 11.79465 12.6443
15.4 -2.06432 211.24523 2.02935 16.65922 11.76837 12.0862
15.8 -2.87013 211.12487 1.81855 15.37964 11.32022 11.76662
16.2 -2.49863 211.45697 2.38487 13.96009 10.72182 11.39346
16.6 -1.74718 211.52021 1.90651 13.77669 10.33644 10.41733
17.0 -0.59099 211.53726 1.4662 13.29923 9.67104 10.11504
17.4 -0.54213 211.09662 0.82631 13.3428 9.20548 9.85856
17.8 -1.56012 211.26011 0.05141 12.67775 8.42966 9.2347
18.2 -2.20738 210.85216 -0.80049 11.44201 8.195 9.14858
18.6 -2.80128 210.57457 -1.1875 10.97652 7.67471 9.05955
19.0 -1.48526 209.88575 -1.84847 10.36314 7.43101 8.98582
19.4 -0.82078 209.34326 -1.3667 10.45395 7.91108 8.36977
19.8 1.80062 209.65142 -1.14242 10.8826 8.44334 8.2614
