0.120000 -0.876230
0.380000 -1.397200
0.620000 0.329320
0.880000 3.127950
1.120000 -3.068580
1.380000 -3.085250
1.620000 2.637300
1.880000 2.125650
2.120000 1.958470
2.380000 1.993990
2.620000 1.984540
2.880000 1.887780
3.120000 1.410990
3.380000 0.619190
3.620000 0.433550
3.880000 -1.083080
4.120000 -0.880780
4.380000 -1.986320
4.620000 0.157650
4.880000 0.120980
5.120000 0.102370
5.380000 0.728050
5.620000 0.687100
5.880000 1.768710
6.120000 0.833760
6.380000 0.614030
6.620000 0.099470
6.880000 1.259480
7.120000 0.932750
7.380000 1.396360
7.620000 1.277330
7.880000 0.206270
8.120000 2.803330
8.380000 -1.468980
8.620000 0.584160
8.880000 -0.041220
9.120000 0.226720
9.380000 -0.010480
9.620000 -1.342380
9.880000 -0.200440
10.120000 1.330940
10.380000 -2.464100
10.620000 -0.160770
10.880000 1.332560
11.120000 -0.678170
11.380000 -2.065270
11.620000 -1.833190
11.880000 -3.140250
12.120000 -0.786390
12.380000 -2.566880
12.620000 -2.872350
12.880000 -0.368010
13.120000 2.431360
13.380000 3.053290
13.620000 -1.980670
13.880000 -1.703920
14.120000 -1.808860
14.380000 -2.609470
14.620000 -2.570810
14.880000 -0.810090
15.120000 -2.677740
15.380000 -1.910100
15.620000 -2.011930
15.880000 -2.863330
16.120000 2.433230
16.380000 3.133680
16.620000 2.931700
16.880000 -2.114470
17.120000 -2.766700
17.380000 -0.812230
17.620000 -0.485330
17.880000 2.442170
18.120000 2.826520
18.380000 -1.532770
18.620000 -0.163600
18.880000 -0.737590
19.120000 2.723990
19.380000 -2.937360
19.620000 0.431910
19.880000 1.421390
