0.450000 1.080940
1.350000 2.612880
2.250000 3.031770
3.150000 0.819060
4.050000 -1.190600
4.950000 -0.356560
5.850000 -0.404370
6.750000 -0.552210
7.650000 0.887720
8.550000 -0.005930
9.450000 -2.506490
10.350000 -1.813720
11.250000 -2.159760
12.150000 0.737850
13.050000 -2.402310
13.950000 -1.293400
14.850000 2.653880
15.750000 -0.015760
16.650000 0.750480
17.550000 -0.987810
