0.12500 0.02675
0.37500 0.04089
0.62500 0.05877
0.87500 0.07742
1.12500 0.11627
1.37500 0.13628
1.62500 0.16771
1.87500 0.17759
2.12500 0.18176
2.37500 0.18292
2.62500 0.17216
2.87500 0.17718
3.12500 0.16625
3.37500 0.15072
3.62500 0.11595
3.87500 0.12381
4.12500 0.08607
4.37500 0.07750
4.62500 0.06769
4.87500 0.05623
5.12500 0.04557
5.37500 0.03911
5.62500 0.03532
5.87500 0.00868
6.12500 0.03016
6.37500 0.02297
6.62500 0.02714
6.87500 0.04289
7.12500 0.01881
7.37500 0.04450
7.62500 0.02457
7.87500 0.03437
8.12500 0.01907
8.37500 0.01767
8.62500 0.01839
8.87500 0.03511
9.12500 0.01036
9.37500 0.02475
9.62500 0.03116
9.87500 0.00996
10.12500 0.02905
10.37500 0.03035
10.62500 0.02445
10.87500 0.03258
11.12500 0.03078
11.37500 0.02337
11.62500 0.02544
11.87500 0.00688
12.12500 0.02798
12.37500 0.03550
12.62500 0.03039
12.87500 0.01681
13.12500 0.01747
13.37500 0.05616
13.62500 0.02641
13.87500 0.02004
14.12500 0.03115
14.37500 0.02820
14.62500 0.03357
14.87500 0.00710
