0.12500 0.01380
0.37500 0.04191
0.62500 0.12633
0.87500 0.18776
1.12500 0.22619
1.37500 0.25137
1.62500 0.28597
1.87500 0.29918
2.12500 0.27721
2.37500 0.28440
2.62500 0.28167
2.87500 0.27839
3.12500 0.27303
3.37500 0.24780
3.62500 0.23775
3.87500 0.21689
4.12500 0.21660
4.37500 0.19329
4.62500 0.17083
4.87500 0.17464
5.12500 0.14598
5.37500 0.15369
5.62500 0.14560
5.87500 0.12213
6.12500 0.13161
6.37500 0.11854
6.62500 0.10238
6.87500 0.08668
7.12500 0.04673
7.37500 0.06573
7.62500 0.03650
7.87500 0.06141
8.12500 0.04766
8.37500 0.04542
8.62500 0.03700
8.87500 0.06087
9.12500 0.04981
9.37500 0.05997
9.62500 0.06467
9.87500 0.07557
10.12500 0.03606
10.37500 0.02762
10.62500 0.01273
10.87500 0.01749
11.12500 0.04946
11.37500 0.05300
11.62500 0.07757
11.87500 0.07310
12.12500 0.08782
12.37500 0.10609
12.62500 0.16402
12.87500 0.13448
13.12500 0.12325
13.37500 0.13336
13.62500 0.07939
13.87500 0.05770
14.12500 0.08564
14.37500 0.02781
14.62500 0.05574
14.87500 0.04967
15.12500 0.03236
15.37500 0.04806
15.62500 0.03917
15.87500 0.07497
16.12500 0.04724
16.37500 0.04819
16.62500 0.04840
16.87500 0.08120
17.12500 0.08763
17.37500 0.07851
17.62500 0.07678
17.87500 0.06517
18.12500 0.06132
18.37500 0.14679
18.62500 0.02108
18.87500 0.11221
19.12500 0.15715
19.37500 0.06490
19.62500 0.10553
19.87500 0.08668
