0.12500 0.01736
0.37500 0.05883
0.62500 0.10811
0.87500 0.18173
1.12500 0.22959
1.37500 0.30116
1.62500 0.35322
1.87500 0.38074
2.12500 0.40780
2.37500 0.41413
2.62500 0.41438
2.87500 0.40468
3.12500 0.38938
3.37500 0.38158
3.62500 0.35783
3.87500 0.33457
4.12500 0.31502
4.37500 0.29670
4.62500 0.27988
4.87500 0.25564
5.12500 0.23743
5.37500 0.19919
5.62500 0.17640
5.87500 0.14694
6.12500 0.13259
6.37500 0.10263
6.62500 0.09457
6.87500 0.08317
7.12500 0.07256
7.37500 0.06889
7.62500 0.08233
7.87500 0.09252
8.12500 0.10345
8.37500 0.13426
8.62500 0.13783
8.87500 0.14125
9.12500 0.13563
9.37500 0.13994
9.62500 0.10633
9.87500 0.11635
10.12500 0.11005
10.37500 0.13814
10.62500 0.12068
10.87500 0.11706
11.12500 0.11176
11.37500 0.13012
11.62500 0.11870
11.87500 0.11510
12.12500 0.10868
12.37500 0.11464
12.62500 0.10443
12.87500 0.10878
13.12500 0.08156
13.37500 0.08651
13.62500 0.05820
13.87500 0.06793
14.12500 0.05018
14.37500 0.05027
14.62500 0.05657
14.87500 0.06583
