0.05000 4305.12582
0.15000 7538.06951
0.25000 9162.02639
0.35000 10593.53425
0.45000 10776.40771
0.55000 11300.54081
0.65000 11095.95907
0.75000 10918.97206
0.85000 10719.26271
0.95000 10410.10256
1.05000 9996.70297
1.15000 9619.70914
1.25000 9238.93798
1.35000 8898.56629
1.45000 8351.83031
1.55000 8208.64313
1.65000 7864.34914
1.75000 7515.59393
1.85000 7184.04868
1.95000 6887.25057
2.05000 6597.25580
2.15000 6371.49593
2.25000 6134.49632
2.35000 5830.88726
2.45000 5622.50241
2.55000 5463.93056
2.65000 5307.40395
2.75000 5156.60606
2.85000 4954.86205
2.95000 4823.25091
3.05000 4596.70758
3.15000 4463.03251
3.25000 4267.96880
3.35000 4160.54964
3.45000 4077.94532
3.55000 3940.42446
3.65000 3832.57184
3.75000 3669.97037
3.85000 3588.74997
3.95000 3485.53546
4.05000 3396.46021
4.15000 3315.17147
4.25000 3209.08903
4.35000 3184.87585
4.45000 2994.68978
4.55000 2948.91687
4.65000 2854.60241
4.75000 2773.92698
4.85000 2701.91135
4.95000 2647.07599
5.05000 2582.79106
5.15000 2470.61541
5.25000 2387.84052
5.35000 2338.91063
5.45000 2237.10479
5.55000 2159.23758
5.65000 2118.28479
5.75000 2023.39470
5.85000 1971.57421
5.95000 1890.88175
6.05000 1838.30146
6.15000 1721.27463
6.25000 1699.76253
6.35000 1658.86558
6.45000 1567.18696
6.55000 1529.11873
6.65000 1481.03478
6.75000 1426.53995
6.85000 1407.90221
6.95000 1377.10698
7.05000 1328.18524
7.15000 1298.85223
7.25000 1272.24169
7.35000 1207.61242
7.45000 1185.43507
7.55000 1168.27093
7.65000 1117.61157
7.75000 1110.51185
7.85000 1097.18405
7.95000 1052.17984
8.05000 1024.73244
8.15000 987.92480
8.25000 962.10383
8.35000 962.88924
8.45000 923.25836
8.55000 899.09655
8.65000 860.75056
8.75000 842.27704
8.85000 807.21983
8.95000 779.49347
9.05000 753.41936
9.15000 739.36879
9.25000 715.48834
9.35000 688.85572
9.45000 659.24524
9.55000 646.93996
9.65000 636.45006
9.75000 625.62225
9.85000 594.89734
9.95000 598.54874
10.05000 578.27545
10.15000 568.26949
10.25000 553.05666
10.35000 532.01652
10.45000 528.38112
10.55000 522.23562
10.65000 510.07423
10.75000 496.45605
10.85000 481.65391
10.95000 468.64467
11.05000 460.55989
11.15000 458.60428
11.25000 446.59206
11.35000 434.74099
11.45000 444.20470
11.55000 411.94310
11.65000 413.81317
11.75000 399.35536
11.85000 391.36639
11.95000 381.87504
12.05000 373.83239
12.15000 373.17937
12.25000 363.47845
12.35000 354.21234
12.45000 348.20877
12.55000 332.90326
12.65000 328.53062
12.75000 327.03964
12.85000 323.72679
12.95000 316.94375
13.05000 306.54645
13.15000 300.60650
13.25000 285.42077
13.35000 286.86412
13.45000 288.26418
13.55000 296.95818
13.65000 275.88015
13.75000 273.97228
13.85000 280.31471
13.95000 253.82556
14.05000 260.85042
14.15000 249.52892
14.25000 253.45088
14.35000 246.46282
14.45000 250.55308
14.55000 239.83804
14.65000 233.75476
14.75000 240.89750
14.85000 228.06772
14.95000 217.46447
15.05000 218.61344
15.15000 216.49824
15.25000 205.53387
15.35000 210.49349
15.45000 207.12782
15.55000 205.43832
15.65000 198.30354
15.75000 191.37165
15.85000 200.07261
15.95000 193.69184
16.05000 190.60083
16.15000 186.72499
16.25000 180.07349
16.35000 173.82644
16.45000 173.65348
16.55000 170.50865
16.65000 168.18541
16.75000 161.30876
16.85000 163.77148
16.95000 158.90873
17.05000 178.18614
17.15000 157.80976
17.25000 152.46658
17.35000 151.02753
17.45000 141.03097
17.55000 140.11878
17.65000 145.23990
17.75000 136.61374
17.85000 129.07514
17.95000 139.58932
18.05000 137.70857
18.15000 135.27800
18.25000 133.01142
18.35000 127.85780
18.45000 126.40034
18.55000 127.87196
18.65000 130.60110
18.75000 131.18992
18.85000 137.18029
18.95000 130.59847
19.05000 124.29810
19.15000 129.47524
19.25000 124.22008
19.35000 117.02942
19.45000 119.40168
19.55000 127.93119
19.65000 127.43601
19.75000 115.49899
19.85000 119.43516
19.95000 119.81621
