0.05000 27880.82010
0.15000 27570.79000
0.25000 24589.65248
0.35000 22163.82319
0.45000 18534.89897
0.55000 16794.88194
0.65000 14894.45285
0.75000 13628.83811
0.85000 12263.56523
0.95000 11328.01696
1.05000 10784.53848
1.15000 9679.30823
1.25000 9020.76099
1.35000 8570.17348
1.45000 8101.22398
1.55000 7508.81122
1.65000 7248.44165
1.75000 6650.82324
1.85000 6456.79894
1.95000 6070.81802
2.05000 5776.13602
2.15000 5726.77597
2.25000 5370.24314
2.35000 5261.97393
2.45000 4992.57915
2.55000 4796.95177
2.65000 4635.69365
2.75000 4513.52942
2.85000 4211.85402
2.95000 4047.38614
3.05000 4003.49385
3.15000 3764.12664
3.25000 3586.65544
3.35000 3552.62285
3.45000 3408.06345
3.55000 3231.35560
3.65000 3219.79985
3.75000 3136.12634
3.85000 3015.72823
3.95000 2928.30325
4.05000 2792.61040
4.15000 2781.90309
4.25000 2788.57332
4.35000 2637.04176
4.45000 2536.38232
4.55000 2481.95380
4.65000 2456.28155
4.75000 2357.84076
4.85000 2307.58447
4.95000 2196.48022
5.05000 2215.01495
5.15000 2111.33289
5.25000 2051.19099
5.35000 2016.56973
5.45000 1994.71360
5.55000 1961.31129
5.65000 1845.25394
5.75000 1830.20601
5.85000 1777.25634
5.95000 1738.65440
6.05000 1705.45065
6.15000 1675.82259
6.25000 1625.54292
6.35000 1571.58002
6.45000 1533.96404
6.55000 1504.88947
6.65000 1473.39248
6.75000 1429.99288
6.85000 1398.49179
6.95000 1371.34512
7.05000 1298.44272
7.15000 1283.85226
7.25000 1283.78934
7.35000 1281.49714
7.45000 1246.37486
7.55000 1174.76734
7.65000 1133.77495
7.75000 1113.51540
7.85000 1088.68937
7.95000 1068.23241
8.05000 1096.95795
8.15000 991.59170
8.25000 1007.96636
8.35000 964.71045
8.45000 940.02509
8.55000 929.21029
8.65000 899.50616
8.75000 895.63215
8.85000 854.77284
8.95000 879.36496
9.05000 818.02503
9.15000 822.92920
9.25000 792.30500
9.35000 748.00832
9.45000 794.84005
9.55000 766.67106
9.65000 699.04819
9.75000 711.32133
9.85000 693.17815
9.95000 685.61231
10.05000 674.64660
10.15000 667.88227
10.25000 613.98928
10.35000 614.77976
10.45000 612.83412
10.55000 643.54751
10.65000 578.66273
10.75000 600.83796
10.85000 593.89089
10.95000 560.34821
11.05000 593.99110
11.15000 546.54708
11.25000 537.04313
11.35000 563.83556
11.45000 532.35726
11.55000 504.69080
11.65000 472.19601
11.75000 495.61925
11.85000 484.07302
11.95000 458.66118
12.05000 479.63976
12.15000 435.37162
12.25000 438.21635
12.35000 439.78227
12.45000 448.15811
12.55000 414.20239
12.65000 420.13770
12.75000 428.62683
12.85000 406.35714
12.95000 378.88899
13.05000 386.83912
13.15000 389.15584
13.25000 383.49890
13.35000 383.22354
13.45000 363.56437
13.55000 381.41850
13.65000 324.38079
13.75000 385.05703
13.85000 344.73483
13.95000 331.29146
14.05000 332.56015
14.15000 328.99889
14.25000 328.45198
14.35000 333.58996
14.45000 322.27947
14.55000 279.36135
14.65000 290.55745
14.75000 292.05145
14.85000 277.30245
14.95000 290.41016
15.05000 274.89893
15.15000 293.83140
15.25000 263.24431
15.35000 252.76626
15.45000 257.84091
15.55000 259.00201
15.65000 237.18776
15.75000 244.18975
15.85000 245.14553
15.95000 237.43947
16.05000 239.47124
16.15000 264.65829
16.25000 219.23974
16.35000 226.88587
16.45000 217.11154
16.55000 216.13435
16.65000 205.36049
16.75000 191.98949
16.85000 209.50547
16.95000 191.34811
17.05000 202.83735
17.15000 213.42834
17.25000 188.25625
17.35000 182.18309
17.45000 191.18482
17.55000 185.63015
17.65000 180.10400
17.75000 183.12807
17.85000 259.19400
17.95000 166.91952
18.05000 172.25967
18.15000 160.63052
18.25000 175.70788
18.35000 162.44070
18.45000 159.59336
18.55000 181.64323
18.65000 147.06768
18.75000 152.10149
18.85000 149.30040
18.95000 160.29344
19.05000 138.44697
19.15000 143.57962
19.25000 140.89530
19.35000 143.07875
19.45000 134.51148
19.55000 136.58889
19.65000 156.39002
19.75000 137.30837
19.85000 134.52841
19.95000 144.07796
