0.05000 3488.36578
0.15000 6298.29881
0.25000 7922.18911
0.35000 8793.56266
0.45000 9124.51564
0.55000 9433.30104
0.65000 9025.75602
0.75000 8838.24894
0.85000 8443.74792
0.95000 8116.35899
1.05000 7795.69298
1.15000 7554.58901
1.25000 7208.63665
1.35000 6837.52715
1.45000 6418.58888
1.55000 6275.72269
1.65000 5833.86294
1.75000 5651.89954
1.85000 5582.65112
1.95000 5201.14738
2.05000 5113.64279
2.15000 4858.41599
2.25000 4628.46030
2.35000 4470.74308
2.45000 4202.43308
2.55000 4240.15162
2.65000 3986.77544
2.75000 3863.01619
2.85000 3789.00433
2.95000 3586.61903
3.05000 3489.82385
3.15000 3405.08417
3.25000 3320.25215
3.35000 3224.69104
3.45000 3119.76481
3.55000 3059.25292
3.65000 2898.69980
3.75000 2846.83140
3.85000 2737.13796
3.95000 2690.02554
4.05000 2559.29157
4.15000 2574.85929
4.25000 2426.85478
4.35000 2389.19202
4.45000 2358.83235
4.55000 2274.29823
4.65000 2225.80335
4.75000 2162.14680
4.85000 2078.67109
4.95000 2040.01142
5.05000 2020.60201
5.15000 1941.76294
5.25000 1933.68203
5.35000 1860.68756
5.45000 1786.21889
5.55000 1776.33319
5.65000 1676.72619
5.75000 1700.40908
5.85000 1697.60832
5.95000 1586.40601
6.05000 1548.85181
6.15000 1527.14750
6.25000 1473.02560
6.35000 1428.72332
6.45000 1400.22333
6.55000 1372.19341
6.65000 1333.78294
6.75000 1315.40191
6.85000 1299.09685
6.95000 1261.28681
7.05000 1188.84919
7.15000 1192.08577
7.25000 1164.24258
7.35000 1147.54613
7.45000 1124.87512
7.55000 1043.05683
7.65000 1063.79631
7.75000 1033.71405
7.85000 1013.48804
7.95000 965.94977
8.05000 930.46505
8.15000 912.90670
8.25000 914.78722
8.35000 907.52004
8.45000 820.15897
8.55000 869.35421
8.65000 858.48231
8.75000 824.64039
8.85000 788.77257
8.95000 834.32658
9.05000 769.00816
9.15000 776.84234
9.25000 720.07647
9.35000 716.84167
9.45000 703.18107
9.55000 685.05800
9.65000 665.16359
9.75000 694.60140
9.85000 642.46086
9.95000 642.84802
10.05000 601.30702
10.15000 591.79180
10.25000 588.88958
10.35000 571.78116
10.45000 573.16368
10.55000 554.67377
10.65000 549.50490
10.75000 550.59592
10.85000 504.77999
10.95000 510.85539
11.05000 490.14681
11.15000 491.78705
11.25000 465.51076
11.35000 478.67908
11.45000 475.53204
11.55000 453.04496
11.65000 456.43250
11.75000 447.69466
11.85000 431.93119
11.95000 434.50550
12.05000 407.48346
12.15000 399.60424
12.25000 400.70612
12.35000 392.07677
12.45000 385.59956
12.55000 385.59824
12.65000 372.10936
12.75000 357.15868
12.85000 372.09193
12.95000 334.05502
13.05000 364.12639
13.15000 356.90068
13.25000 334.66971
13.35000 334.04041
13.45000 320.66530
13.55000 305.75757
13.65000 311.92194
13.75000 296.43872
13.85000 291.97215
13.95000 289.39117
14.05000 313.33226
14.15000 253.49316
14.25000 265.08958
14.35000 269.44120
14.45000 258.43615
14.55000 238.86717
14.65000 262.08587
14.75000 224.62510
14.85000 243.54453
14.95000 230.51832
15.05000 223.92379
15.15000 226.36666
15.25000 215.66670
15.35000 220.28540
15.45000 216.77751
15.55000 210.95822
15.65000 191.76901
15.75000 217.25014
15.85000 222.35305
15.95000 205.32600
16.05000 207.60107
16.15000 194.11522
16.25000 184.43193
16.35000 183.29866
16.45000 200.50079
16.55000 187.34199
16.65000 178.36251
16.75000 184.12548
16.85000 198.00891
16.95000 168.74035
17.05000 172.14010
17.15000 174.49180
17.25000 164.65631
17.35000 170.53099
17.45000 164.45848
17.55000 166.81754
17.65000 161.68347
17.75000 160.07901
17.85000 146.97913
17.95000 157.42988
18.05000 143.87011
18.15000 162.49368
18.25000 153.54474
18.35000 152.08538
18.45000 144.93208
18.55000 150.59361
18.65000 129.71860
18.75000 131.99283
18.85000 143.92340
18.95000 142.30746
19.05000 144.27080
19.15000 135.07256
19.25000 132.89858
19.35000 140.30419
19.45000 138.52790
19.55000 138.97782
19.65000 151.71019
19.75000 130.41354
19.85000 122.53273
19.95000 124.57072
