0.05000 -2063.14337 513.50935 -79220.51924 2168.52883 2092.38435 378634.17195
0.15000 -6057.74496 35.14101 12136.29219 2768.41978 2130.52385 502718.92929
0.25000 -8704.16918 32.38467 -6643.31951 2609.55436 2337.94459 444379.34610
0.35000 -10018.65744 158.08968 5820.33049 2287.44667 1912.09750 368280.41118
0.45000 -10376.04086 31.36196 -15418.29853 2315.14955 2035.66413 436956.13896
0.55000 -10801.34479 39.39435 2421.59381 2190.56402 1958.73325 398870.75889
0.65000 -10922.55247 -33.58887 -8241.22305 2196.44272 2059.77342 395275.29848
0.75000 -10872.19288 56.83009 -5439.79886 2105.03810 1914.75203 373730.81514
0.85000 -10796.31603 38.87810 -295.01543 1997.84304 1978.45687 346165.67523
0.95000 -10770.80578 21.25659 -8954.47842 1902.22029 2029.67508 348213.47866
1.05000 -10664.48824 48.18997 -1046.09325 1806.43721 2000.85840 307798.25062
1.15000 -10490.44753 34.40594 -4346.41422 1697.95192 2025.35732 289044.36158
1.25000 -10251.76669 15.10480 -7999.95828 1653.30954 2051.50544 276303.25421
1.35000 -10155.48109 38.12932 -3606.38405 1532.35522 2046.64199 255344.06648
1.45000 -10001.60146 72.34677 -663.74110 1305.66986 2069.47613 252989.43109
1.55000 -9870.84248 83.26110 -1681.88896 1268.18998 2019.95823 248147.72588
1.65000 -9698.14267 62.65614 131.76578 1196.04019 2027.72056 237171.95972
1.75000 -9526.36684 55.02424 -965.86783 1112.68264 1951.57225 215967.43735
1.85000 -9343.84359 33.70656 -3496.45178 1109.81087 1925.71066 215734.70451
1.95000 -9173.34878 44.13190 3458.26988 1028.19170 1913.17930 201698.34153
2.05000 -8980.73628 0.54260 1733.96314 982.61611 1864.87795 208119.36640
2.15000 -8829.79287 1.79526 -2798.43232 913.86086 1856.65000 188964.19244
2.25000 -8660.50837 61.63719 -266.80006 945.00983 1855.83907 175907.38019
2.35000 -8547.77012 27.51222 -3335.84898 832.02608 1759.05927 169317.47002
2.45000 -8438.84611 52.13512 -346.78702 782.45422 1739.24138 160115.09725
2.55000 -8343.79878 38.86156 227.13171 747.25512 1708.58398 159550.74421
2.65000 -8256.60873 22.38383 -2140.33373 700.79906 1657.20990 149248.28627
2.75000 -8142.42085 40.44394 -2748.00047 663.74543 1610.61331 151976.99174
2.85000 -8032.72436 61.63199 -2616.82304 641.21424 1567.03477 136085.41378
2.95000 -7997.85927 63.33534 -424.91488 737.60572 1568.61536 125572.50350
3.05000 -7957.78328 46.95612 1315.47247 680.24555 1506.73142 115277.07725
3.15000 -7927.73602 57.60045 416.30769 665.70317 1450.13454 117038.09213
3.25000 -7863.86218 42.58744 -3.99833 702.27558 1426.02621 111634.89151
3.35000 -7813.35882 20.11951 -1938.52853 555.97275 1346.33565 113660.23873
3.45000 -7732.07142 22.08755 785.24303 586.57454 1315.82727 109974.20146
3.55000 -7695.75043 13.30090 -758.24178 584.79192 1317.51421 102154.73010
3.65000 -7661.97189 24.63860 -2383.49236 624.17438 1321.55438 100783.77774
3.75000 -7615.05100 11.04010 222.35330 565.51287 1202.74598 91602.38416
3.85000 -7593.65692 27.72890 -757.53823 613.42396 1163.37803 83099.86540
3.95000 -7570.67805 -1.88845 -655.37010 584.78959 1101.45155 83804.22298
4.05000 -7529.91586 -5.76610 -397.13553 606.86677 1080.99434 82201.62642
4.15000 -7499.78834 -24.04017 -586.86895 626.39834 1064.25591 72297.66590
4.25000 -7463.82912 -23.91731 274.90523 599.25710 973.61248 72164.75998
4.35000 -7432.49205 -17.44544 1121.69244 637.06233 985.34137 72491.62162
4.45000 -7384.41735 -7.13625 145.57159 586.13118 889.30540 64685.39620
4.55000 -7354.25385 -1.88934 805.39688 557.18148 910.47955 63325.80105
4.65000 -7280.71339 -14.62677 -1492.22823 589.67179 846.76628 57230.26902
4.75000 -7237.06685 -11.93651 -313.68470 575.84191 800.22726 58279.76756
4.85000 -7196.66001 -22.35955 -858.79726 580.31913 837.46001 55555.09399
4.95000 -7126.96198 0.45953 -431.17787 553.90879 747.13582 49445.69054
5.05000 -7088.61778 11.62545 -252.18306 542.52816 733.61999 49712.64248
5.15000 -7046.24359 7.93898 -699.48689 547.60907 690.56712 51695.58374
5.25000 -7004.16533 15.13638 -642.09039 562.74640 664.07214 43373.27470
5.35000 -6932.35454 7.11073 162.75004 555.93529 620.36574 51850.64483
5.45000 -6887.19342 20.65771 -283.82405 616.04065 611.29791 39563.47888
5.55000 -6836.22355 29.23611 -490.19248 540.44536 613.46993 37606.29322
5.65000 -6779.25647 28.17756 -1205.97819 583.25780 586.86631 37988.66161
5.75000 -6733.96611 41.43475 -401.63040 564.93403 536.20642 35543.56757
5.85000 -6673.97121 32.09721 141.27534 536.53398 535.07364 58691.23552
5.95000 -6604.61881 20.31466 357.03265 506.48718 496.20474 35807.45552
6.05000 -6533.33285 20.40150 -900.61966 498.85151 468.96395 29630.96538
6.15000 -6467.70657 36.85564 -979.52655 498.02754 454.59706 34933.93619
6.25000 -6400.50211 33.80309 365.96271 463.33787 404.53311 35960.34337
6.35000 -6337.67437 29.81949 544.90346 471.20007 395.99311 29728.16175
6.45000 -6260.10737 32.00642 -328.38134 443.43714 381.65520 29108.41350
6.55000 -6191.33107 36.22980 -954.45017 429.93699 384.41707 27437.09318
6.65000 -6138.17584 32.23816 -1105.42254 413.03816 366.92133 52485.75116
6.75000 -6069.79523 30.40680 65.75769 388.25719 349.92341 25448.28108
6.85000 -5993.47335 37.48035 -266.61991 376.52763 341.73232 23884.05971
6.95000 -5941.43565 31.44160 -383.76389 364.48280 301.14906 22505.73494
7.05000 -5891.22966 29.96527 -192.40465 398.10632 314.82805 23171.48183
7.15000 -5839.35402 28.28870 293.98648 358.04673 292.62201 22561.27053
7.25000 -5776.83347 28.06993 -743.08517 336.92859 281.85631 40042.19518
7.35000 -5719.83759 36.64895 -28.18003 312.65436 270.98588 19495.04501
7.45000 -5670.35357 31.77221 529.78781 305.51566 277.59955 24563.15902
7.55000 -5620.69345 35.25777 -775.62128 299.87041 273.58526 52504.38114
7.65000 -5570.72860 28.69121 -176.09639 286.68484 252.26672 20763.33373
7.75000 -5528.88987 28.74917 315.23852 296.19494 269.55055 20972.65056
7.85000 -5482.14006 26.50099 267.78365 283.84427 254.91889 17953.27370
7.95000 -5432.39747 33.95922 170.91214 272.10332 254.27711 17650.33066
8.05000 -5379.79531 23.86686 449.83257 276.71360 246.64931 26879.96372
8.15000 -5337.19592 28.52448 801.19442 263.44226 230.53331 50160.45892
8.25000 -5289.28411 27.66848 18.60555 244.72703 227.31434 14849.26777
8.35000 -5236.44998 18.46500 151.96854 259.59763 283.90511 16048.84255
8.45000 -5190.58288 27.68857 140.22995 245.67281 244.66404 13827.59269
8.55000 -5133.87372 26.06959 248.98043 249.40787 209.57633 15491.49706
8.65000 -5084.56289 19.37457 247.67222 225.25811 330.18196 14807.28946
8.75000 -5027.86614 25.62207 93.04126 219.67885 216.99359 15665.42657
8.85000 -4973.47610 24.35720 -661.59205 237.33161 190.25422 15168.89429
8.95000 -4922.42736 25.71922 254.43411 203.48755 187.88687 13101.65228
9.05000 -4877.86221 20.61456 -55.42156 220.58834 200.30657 13714.03672
9.15000 -4839.41182 21.03238 573.39993 216.24899 167.97040 14260.85248
9.25000 -4784.54760 23.50262 -200.42291 208.03201 202.39489 12019.42902
9.35000 -4733.22234 18.02996 -53.41952 212.70827 182.80186 11802.41747
9.45000 -4684.96626 20.41946 -1.91141 206.97888 187.75293 16836.14993
9.55000 -4641.02002 21.73679 639.94185 192.80833 157.26278 32297.40843
9.65000 -4597.55268 20.67423 107.06739 177.99559 156.15399 10957.63896
9.75000 -4540.73746 21.27227 439.12746 281.33510 189.64252 10269.49126
9.85000 -4513.15865 22.57826 -18.25256 176.78918 138.31673 10046.47224
9.95000 -4464.12757 18.89490 -98.69216 209.45066 189.17184 9699.07550
10.05000 -4412.46217 17.99398 -148.75000 201.06754 214.43745 9238.22110
10.15000 -4372.56752 20.46800 -132.85013 173.14405 130.02476 9961.40857
10.25000 -4338.75303 22.19138 160.34653 185.93170 136.88125 9386.31594
10.35000 -4300.50550 21.07967 -154.44679 196.13248 165.75696 7858.84225
10.45000 -4256.08935 18.09886 -282.01421 169.81632 122.93226 7938.88822
10.55000 -4220.80258 17.55007 -481.57832 160.28835 120.73957 8350.37160
10.65000 -4182.44603 16.63235 -210.86853 197.85474 135.57548 9292.37294
10.75000 -4142.53253 19.48143 -474.42956 181.96770 200.18546 8521.00528
10.85000 -4111.22023 19.60306 5.72120 178.63678 136.79126 7083.78192
10.95000 -4078.19735 16.68461 -16.43701 156.73422 201.25001 7861.77137
11.05000 -4042.33805 12.93239 -50.32886 169.30423 147.35136 7216.26355
11.15000 -4011.94730 15.95758 -137.71647 180.32896 180.80918 7181.27277
11.25000 -3981.44773 11.16647 -158.08694 177.91981 154.00670 7009.13660
11.35000 -3950.79816 11.43188 -241.69177 118.13737 169.63553 5995.69583
11.45000 -3923.87399 11.23932 -332.17314 128.43713 117.53456 6886.70790
11.55000 -3888.80112 17.00296 122.80977 150.08777 141.86318 6003.27045
11.65000 -3862.67578 14.03629 -118.27043 121.87132 111.44212 6074.53726
11.75000 -3830.98787 15.30517 -251.74023 178.27741 170.48836 6613.51778
11.85000 -3796.54459 14.50358 -94.61394 128.46371 124.45156 6275.76988
11.95000 -3773.56411 15.98579 -153.56675 140.58131 183.36178 6149.32435
12.05000 -3746.49763 13.72224 -118.92855 110.63038 95.39827 5059.09777
12.15000 -3725.72235 10.32432 -56.01850 96.30750 89.21112 5136.21007
12.25000 -3694.39109 14.01259 -68.01855 103.03371 99.14188 4362.85567
12.35000 -3671.39323 10.35156 -38.99978 119.69292 102.32529 4509.48057
12.45000 -3639.23262 13.67197 -177.47619 112.36614 114.22728 4747.56644
12.55000 -3612.21141 11.83416 38.95263 133.84516 137.86798 7130.58345
12.65000 -3585.43895 14.13132 24.14839 91.60003 134.59549 4496.24693
12.75000 -3561.07182 12.17133 32.28698 90.78710 104.13324 4760.62209
12.85000 -3534.04262 10.80600 -117.83517 79.73990 82.86282 4247.80258
12.95000 -3508.94122 8.74696 -11.68073 80.60486 99.00569 4005.56213
13.05000 -3475.32360 8.95630 86.02667 101.64739 82.69587 3896.52274
13.15000 -3448.50283 14.57229 5.80864 146.61826 100.20988 3366.56805
13.25000 -3426.05752 7.75793 -120.58505 109.68470 116.26450 3631.59503
13.35000 -3395.29287 7.60780 29.72660 115.48982 118.58760 4264.77413
13.45000 -3383.07147 7.55311 35.85258 140.15493 117.19251 3332.99690
13.55000 -3354.58242 11.15172 -122.61378 76.09010 102.23245 3646.64697
13.65000 -3323.45633 7.26140 -145.16114 107.26608 85.54526 3430.26138
13.75000 -3300.45310 10.81025 -176.85897 90.19628 132.47778 3185.53275
13.85000 -3274.97744 4.90176 0.38955 79.76695 110.35210 2637.22842
13.95000 -3249.15844 5.92778 -12.72771 119.36464 88.94369 3010.30501
14.05000 -3221.10353 9.34892 -48.04233 187.83335 71.32030 2202.33009
14.15000 -3201.86911 8.51042 -56.82760 75.87206 92.54091 3117.82524
14.25000 -3175.51473 9.42730 -222.06006 60.59572 60.29895 2897.90107
14.35000 -3154.75344 8.70394 -163.69988 95.96208 108.99503 2797.82120
14.45000 -3130.36643 5.90455 67.42807 86.61702 155.87839 2592.00189
14.55000 -3110.70416 13.55146 -53.88297 165.26056 140.97840 2491.27762
14.65000 -3085.46076 5.42716 80.55872 61.69834 50.67253 2539.34458
14.75000 -3060.95265 6.63160 -49.40561 61.38376 63.00003 2580.67053
14.85000 -3045.19241 8.06801 -44.82093 131.03679 116.50302 2759.03794
14.95000 -3020.52559 8.58508 4.81533 62.98669 54.88655 1770.45722
15.05000 -3002.80926 7.24344 88.38213 128.68153 109.66653 2287.64941
15.15000 -2976.18045 11.43697 -149.22482 76.16240 89.15218 3737.85325
15.25000 -2952.32193 9.29022 -40.24077 51.22748 57.74299 1947.80328
15.35000 -2941.30466 3.81872 54.94835 133.43564 106.59562 2104.53435
15.45000 -2919.22819 1.26405 2.24726 91.49992 117.85348 2613.77545
15.55000 -2892.79764 10.93365 44.48857 68.31537 105.10965 1830.74798
15.65000 -2876.11673 8.50932 47.06379 55.25655 57.74180 1912.29319
15.75000 -2851.26313 2.20102 -167.04623 119.45089 107.65573 2188.38575
15.85000 -2839.73182 1.57421 87.30402 77.15900 72.15630 2358.97529
15.95000 -2824.21231 1.98713 45.71881 78.27227 95.72267 2161.94664
16.05000 -2796.89434 8.44868 -180.02575 156.05976 124.14243 2128.45197
16.15000 -2783.62350 3.30714 78.89701 102.48496 68.02261 2259.03835
16.25000 -2759.78594 11.65959 118.62320 61.38236 67.80547 2225.07871
16.35000 -2744.70922 7.26495 -39.30641 53.72747 53.92046 2097.84182
16.45000 -2729.55662 3.75738 -45.38256 63.82418 89.51869 2376.48073
16.55000 -2716.57106 7.22840 -181.47362 140.65729 76.10158 2152.10832
16.65000 -2689.92838 1.52064 20.26710 152.74896 83.62751 1511.64470
16.75000 -2670.77152 8.16207 -71.47129 57.79825 52.78000 1640.48293
16.85000 -2656.50034 7.66727 104.80027 45.68117 46.64470 2003.39152
16.95000 -2640.10876 7.35569 98.52621 60.39432 44.35439 1596.73303
17.05000 -2621.82691 6.73647 136.76002 81.98578 63.79693 1519.86230
17.15000 -2601.22293 8.85782 109.06263 44.46676 53.00735 1705.24580
17.25000 -2580.36151 4.55806 68.50614 128.28306 52.62193 1245.84215
17.35000 -2573.40877 5.73557 125.94657 58.18506 101.80381 1209.87183
17.45000 -2556.18412 3.29048 162.74932 45.67029 35.97840 1806.98063
17.55000 -2540.33229 7.24471 -32.09318 57.85656 53.30676 2281.35764
17.65000 -2519.14914 6.17676 163.98214 68.51471 44.20895 1210.69330
17.75000 -2511.98203 11.66418 114.79516 109.05974 98.45786 1041.73833
17.85000 -2490.05517 3.56023 148.66629 40.01268 49.24173 1211.71169
17.95000 -2470.83380 3.79649 -41.02898 64.69075 96.13365 1393.11744
18.05000 -2456.24377 4.76074 45.86932 55.30444 39.23021 1261.60243
18.15000 -2440.68490 5.41125 96.58091 49.50523 43.60664 1236.77466
18.25000 -2431.24701 4.20271 49.81738 41.86753 46.94890 1588.34520
18.35000 -2409.23799 2.42235 2.35056 100.12634 65.92573 1228.87291
18.45000 -2403.80713 1.82562 -1.54284 85.58005 37.24957 1301.48795
18.55000 -2385.67660 4.88816 89.55063 33.38134 31.43675 1223.70210
18.65000 -2371.56514 4.76377 16.32311 37.46203 34.86396 885.13362
18.75000 -2360.41101 11.15475 -57.67702 51.36447 43.40769 833.07181
18.85000 -2342.62169 3.29070 -91.77743 53.41108 28.69112 1327.37565
18.95000 -2333.60264 1.63978 57.11816 31.62815 31.18071 1419.42770
19.05000 -2315.45475 7.77221 -17.24564 43.98878 45.57938 943.44990
19.15000 -2307.64090 6.28735 -38.00217 30.60962 27.90837 1099.45691
19.25000 -2310.22134 12.86087 73.78156 220.96233 168.36035 685.27982
19.35000 -2275.21841 6.29299 63.08582 31.35738 36.56695 989.62239
19.45000 -2273.55782 -2.29414 65.71679 59.39616 112.27882 875.58563
19.55000 -2247.91450 6.77405 100.17070 52.69727 72.06150 1654.12759
19.65000 -2242.79016 2.50166 65.41370 32.29609 27.55682 761.95655
19.75000 -2230.57474 3.40892 34.78968 44.90780 43.32540 967.67663
19.85000 -2225.75575 11.60446 98.37708 71.60181 88.27259 1078.39843
19.95000 -2204.55084 5.87224 -31.65262 36.34306 32.11879 1427.66536
