0.05000 -619.22063 -49.45832 445.63241 1088.37200 1128.81651 1196.73762
0.15000 -1750.00802 26.67559 -204.42502 1038.59737 872.60575 1917.13202
0.25000 -2428.23550 53.12741 178.13436 950.81971 868.66140 2962.21682
0.35000 -2958.71412 57.60958 -48.10380 985.95992 695.86126 3777.43493
0.45000 -3359.52429 87.86536 -232.72654 1072.24893 586.23875 4261.83705
0.55000 -3680.72571 98.86946 -237.67936 1165.82493 595.41629 4791.83329
0.65000 -4130.93950 72.85834 -308.88305 1211.22279 562.97282 5008.17741
0.75000 -4302.66089 71.25546 -271.75394 1304.06784 516.75027 5590.68098
0.85000 -4598.22708 79.82512 81.82248 1242.58756 501.31238 5567.05612
0.95000 -4821.66421 99.37391 -227.50398 1216.87755 474.96174 5762.42282
1.05000 -5042.64315 79.09559 -74.04258 1190.60370 455.86909 5874.46094
1.15000 -5244.20106 91.50574 62.28127 1164.23122 430.80043 5799.61324
1.25000 -5417.64005 85.01132 5.37437 1140.79764 433.29461 5737.52891
1.35000 -5572.64833 86.04468 100.39800 1150.40677 423.88956 5799.63850
1.45000 -5769.49671 97.67465 -71.70828 1165.84616 412.98263 5689.98090
1.55000 -5916.03544 91.46817 32.40247 1117.17290 412.70910 5633.38771
1.65000 -6055.22956 100.51627 95.48786 1068.41281 406.45279 5537.13979
1.75000 -6174.94875 89.97371 -76.08150 1031.68913 382.78540 5353.59421
1.85000 -6215.04138 84.37310 -160.70998 1024.75334 378.72665 5376.94908
1.95000 -6318.81811 93.80253 -139.93443 1002.82274 370.54236 5241.74576
2.05000 -6400.14417 85.15740 -56.72300 935.99063 364.00184 5129.72340
2.15000 -6473.86881 88.40291 24.40628 886.37130 351.11509 5003.91520
2.25000 -6540.08963 94.50522 -125.99731 881.30483 350.08648 4871.21014
2.35000 -6608.49914 88.20917 -100.13969 878.63196 332.40437 4756.70554
2.45000 -6633.65733 88.19381 -58.51432 872.57587 322.74786 4698.03448
2.55000 -6694.75879 93.64908 -82.71559 793.28915 322.51566 4544.02098
2.65000 -6750.75018 91.01262 69.95396 754.28769 316.10725 4425.81285
2.75000 -6798.53402 93.04382 -43.62171 743.46140 297.95223 4321.54010
2.85000 -6845.91735 93.19206 -7.24935 735.74458 298.47734 4240.05677
2.95000 -6884.08127 87.89006 -18.62070 693.27304 290.79150 4110.20279
3.05000 -6881.79407 90.84628 -149.18188 709.19997 286.60091 4019.51374
3.15000 -6924.84702 87.13421 -70.28772 634.98813 277.78644 3864.79381
3.25000 -6916.69796 93.92876 43.18941 652.71849 273.16902 3788.17202
3.35000 -6901.24165 92.94324 70.67572 647.56585 271.69902 3743.43293
3.45000 -6879.97452 91.92091 -20.63736 603.76303 263.24047 3645.27391
3.55000 -6888.88526 90.65580 53.93881 592.77123 257.46400 3525.99706
3.65000 -6873.88735 95.35004 45.30420 569.85294 263.23594 3444.81123
3.75000 -6863.26511 86.36435 158.57714 562.15467 254.06822 3365.46831
3.85000 -6821.31132 90.94904 99.35802 524.14785 245.57739 3329.13390
3.95000 -6806.38944 87.82782 94.09907 511.31290 242.18244 3224.86100
4.05000 -6787.47752 91.95580 35.57327 508.48023 235.39746 3132.10886
4.15000 -6778.02598 88.97892 9.42332 479.87461 235.22045 3069.47523
4.25000 -6742.23355 90.49563 57.14916 467.49390 228.78713 3008.12416
4.35000 -6718.04468 83.25132 -22.91671 454.51652 230.42172 2898.49134
4.45000 -6684.47618 84.14481 69.25905 453.17420 222.20642 2860.01686
4.55000 -6653.29019 84.67890 32.52649 451.00233 215.84714 2792.19490
4.65000 -6627.54186 82.78411 5.05394 433.81987 215.76531 2714.66924
4.75000 -6615.21192 81.64985 62.39792 430.83169 212.69772 2644.28774
4.85000 -6582.93848 82.75984 13.59049 408.39962 199.43839 2566.64503
4.95000 -6519.43604 77.23609 84.04085 409.89151 201.58072 2564.61506
5.05000 -6492.56718 79.75943 88.31387 375.62234 196.65733 2460.12654
5.15000 -6466.08077 77.20524 74.11622 362.27587 196.48576 2377.62733
5.25000 -6423.45258 78.13885 100.96314 365.77681 188.34110 2338.79882
5.35000 -6369.03906 74.15594 20.80083 362.53214 184.04453 2315.87102
5.45000 -6329.92702 73.77116 10.18199 332.39079 177.81670 2244.72637
5.55000 -6289.40404 72.46793 13.58651 330.41401 178.29622 2198.71110
5.65000 -6245.95490 71.38507 46.88197 311.47479 172.70185 2151.34252
5.75000 -6196.73475 71.60997 8.87132 326.82253 172.43098 2094.84723
5.85000 -6156.62221 72.16710 19.65270 311.23687 170.04207 2040.10895
5.95000 -6124.43441 67.26509 61.68348 293.96515 176.71799 1994.23563
6.05000 -6077.78941 68.64644 38.35104 290.71096 162.98499 1964.20338
6.15000 -6044.70348 67.73133 26.33765 301.75942 163.35646 1909.19724
6.25000 -6014.98250 67.21085 20.15149 312.12657 165.45206 1879.62628
6.35000 -5973.91210 65.50548 6.84667 283.62614 157.35967 1834.55623
6.45000 -5934.06782 65.26482 -8.42311 278.92402 162.44678 1794.74144
6.55000 -5888.10413 63.19804 37.65735 269.36693 145.87118 1748.93962
6.65000 -5836.96859 63.70928 -19.87585 268.13981 150.97182 1734.13911
6.75000 -5808.26496 59.22128 -40.84866 252.57707 150.40531 1660.12173
6.85000 -5762.14248 61.94753 21.83292 269.04682 144.35727 1641.56251
6.95000 -5728.33452 57.29599 -11.50191 245.98530 145.75971 1585.62175
7.05000 -5679.11774 55.58337 -12.84935 250.72098 144.46711 1574.37041
7.15000 -5643.79597 55.56040 -41.62613 251.63746 143.51082 1514.35820
7.25000 -5610.61761 55.78830 -27.10332 246.01170 143.02016 1481.69973
7.35000 -5563.31389 54.12144 -12.92068 233.51796 135.65099 1457.40507
7.45000 -5520.57865 54.15300 -35.33518 226.42048 136.20371 1405.19717
7.55000 -5465.04601 53.81127 -30.46841 235.14079 133.13678 1415.70772
7.65000 -5428.00142 56.47943 -32.31685 225.20981 126.55273 1350.63968
7.75000 -5373.60380 51.95812 -27.24799 226.34147 129.06207 1334.31537
7.85000 -5331.94535 50.31492 -31.53637 210.21705 130.92490 1308.47698
7.95000 -5288.70479 49.61442 25.69706 203.81796 129.58908 1282.19079
8.05000 -5254.44770 49.16396 -45.73571 197.07269 132.50096 1223.55089
8.15000 -5200.60764 46.98577 -41.35205 210.05476 126.79532 1223.15483
8.25000 -5152.16141 45.72652 -0.34141 189.59802 125.91055 1193.28371
8.35000 -5103.27867 48.90757 -1.60300 176.97746 126.67910 1169.68064
8.45000 -5060.05286 47.08513 -26.51006 172.95324 119.40859 1138.49544
8.55000 -5010.56021 47.82638 -21.97551 183.80425 124.90666 1125.83592
8.65000 -4970.57013 41.24833 -0.73512 179.25858 119.22170 1100.32035
8.75000 -4934.67673 44.78437 -23.93532 168.14794 129.77315 1069.90718
8.85000 -4896.23353 43.22104 15.21692 163.35824 115.73868 1044.66482
8.95000 -4851.63289 45.36376 -14.62491 164.58589 117.15051 1022.17991
9.05000 -4811.95583 46.03883 -26.07789 167.66118 117.41307 1007.43909
9.15000 -4772.44159 44.47842 -12.22867 150.55792 108.64734 971.19320
9.25000 -4732.05641 43.07590 6.19043 146.46606 108.13269 955.26700
9.35000 -4696.58437 42.78865 -26.28593 163.32728 111.00933 939.56809
9.45000 -4656.53403 45.37638 -0.88665 153.15137 111.43449 905.56817
9.55000 -4623.25031 43.22325 4.79811 144.55482 107.10257 889.43961
9.65000 -4593.62901 42.99196 -8.03102 138.06296 108.92164 864.61345
9.75000 -4556.29175 41.22396 2.23534 140.48143 104.77231 837.63140
9.85000 -4521.45670 42.29963 5.00469 146.24189 105.62526 846.95515
9.95000 -4489.34419 42.28268 19.98319 144.65692 102.58194 806.86993
10.05000 -4448.40629 40.96801 -4.17990 145.89933 100.45864 801.50596
10.15000 -4413.39815 37.14715 34.98162 138.59507 96.33228 791.23057
10.25000 -4373.81572 42.53718 29.49578 144.87423 99.84915 781.11728
10.35000 -4343.98245 38.68027 27.26258 133.37485 96.32754 759.52153
10.45000 -4309.25647 36.57163 35.61998 132.91492 87.10311 739.94078
10.55000 -4267.88598 37.16013 13.66855 125.85174 89.62730 731.59238
10.65000 -4232.19532 34.87807 22.13835 131.42655 94.15619 708.87926
10.75000 -4188.81605 34.79629 11.40289 122.25738 96.45498 711.27320
10.85000 -4159.64247 30.53370 2.64345 122.34304 87.50785 689.66587
10.95000 -4117.07725 34.56159 43.28891 120.39872 88.88682 684.49564
11.05000 -4085.30354 33.29907 12.73818 111.25490 79.07420 662.76334
11.15000 -4049.61405 33.59299 9.95866 108.81428 87.42771 644.04636
11.25000 -4010.00555 32.39340 10.61192 124.47723 82.32797 635.97179
11.35000 -3972.45846 31.34931 15.48356 113.32524 90.56811 621.14604
11.45000 -3943.12117 30.96505 3.37998 102.28293 86.52817 609.76929
11.55000 -3910.07074 32.59164 -15.08454 97.32824 79.67896 589.68099
11.65000 -3871.05685 31.97609 -6.96364 96.54371 80.70812 583.01250
11.75000 -3836.01445 30.87467 -11.25878 95.06131 79.37663 569.40477
11.85000 -3803.29270 29.35392 -20.44661 98.12295 88.40048 568.87315
11.95000 -3769.56244 30.62668 5.19415 91.16715 78.36799 557.88936
12.05000 -3741.75291 28.98095 -8.14370 92.31760 78.81613 542.06489
12.15000 -3713.73490 30.43262 -3.94124 92.45580 79.27336 528.19234
12.25000 -3684.53833 28.40691 -14.45603 90.14481 71.55252 518.36337
12.35000 -3658.81000 31.23503 -10.61261 90.92939 79.73273 509.37198
12.45000 -3637.51382 29.15475 5.25540 95.67206 76.12014 502.30524
12.55000 -3610.13482 32.55190 -14.08821 95.56677 70.27194 484.11815
12.65000 -3587.84726 31.97505 -15.55956 96.64646 74.96711 491.24698
12.75000 -3566.20795 30.56008 -9.88647 93.65253 77.75915 478.25741
12.85000 -3544.83244 31.23599 8.65538 91.97111 76.44845 455.35039
12.95000 -3523.48789 29.16266 1.08955 86.72271 76.10970 460.12275
13.05000 -3502.11837 27.51357 -8.20835 91.68619 70.98329 449.89807
13.15000 -3481.80075 29.61039 -10.98744 86.17887 71.05711 442.17557
13.25000 -3463.94921 29.07687 -0.36581 85.99116 70.25382 427.67951
13.35000 -3445.78504 28.01663 -14.62676 91.73218 73.39377 421.19548
13.45000 -3419.21504 30.64070 -2.54385 90.83301 75.32470 424.63512
13.55000 -3402.82301 28.43593 13.55039 88.50030 75.48894 405.06064
13.65000 -3379.68318 28.81443 6.00734 85.41833 67.29981 403.37305
13.75000 -3356.16247 28.44358 -1.02447 81.11107 63.91628 392.22770
13.85000 -3331.29869 24.07518 0.71037 89.18834 74.41820 395.75504
13.95000 -3314.73786 26.11490 -0.88379 88.72304 67.82424 381.03397
14.05000 -3292.29759 26.63649 -1.23277 81.05333 61.45307 375.69506
14.15000 -3268.18410 24.47584 -4.29313 82.84412 73.12723 369.79253
14.25000 -3242.85118 27.15768 3.02700 83.43606 69.10820 363.49066
14.35000 -3220.19017 25.59134 4.12670 77.61417 66.48539 353.77023
14.45000 -3195.69024 27.81082 -14.16381 80.77721 62.10438 351.75046
14.55000 -3171.52517 25.96984 -4.85645 76.56677 59.45281 342.90790
14.65000 -3145.59514 27.62106 -14.66582 72.68995 51.32907 346.46996
14.75000 -3122.82293 25.65636 -10.85757 79.89373 57.82365 327.34482
14.85000 -3097.33600 26.17125 -14.87908 74.61846 64.70735 323.77740
14.95000 -3075.27770 25.64019 -15.49393 80.22568 65.01647 313.79172
15.05000 -3049.88079 21.89360 -36.76659 67.86392 59.85070 310.33075
15.15000 -3028.17126 22.83421 -26.00887 70.70291 64.55968 300.82959
15.25000 -3007.42907 20.87220 -25.91616 64.30263 55.33411 295.06668
15.35000 -2986.18166 23.36063 -17.05480 74.70401 66.68624 291.62045
15.45000 -2961.17067 22.85811 -31.48044 68.67564 68.66521 278.66871
15.55000 -2939.44391 18.11073 -15.67459 72.31577 76.85509 269.96341
15.65000 -2919.77914 24.43509 -14.09514 67.27492 56.57754 266.12985
15.75000 -2896.73365 23.74900 -20.85232 58.08440 59.12577 263.22439
15.85000 -2873.92022 24.21938 -14.99370 70.05644 51.84158 266.20351
15.95000 -2852.04383 23.58753 -10.04335 70.80217 50.77905 249.09145
16.05000 -2838.31678 23.36470 -21.90373 62.92168 55.36063 242.61327
16.15000 -2817.53778 18.59674 -10.98220 59.84998 55.07811 252.48372
16.25000 -2794.21261 21.71500 -11.18667 68.10237 63.09500 239.88355
16.35000 -2781.29760 19.25780 -2.47793 64.51299 51.98147 235.71994
16.45000 -2758.40461 21.53011 -7.39792 64.19016 54.35443 233.09289
16.55000 -2736.86207 20.22278 -6.98744 68.03185 45.75698 220.01044
16.65000 -2718.22099 21.26736 -8.14082 56.88093 44.71985 221.86804
16.75000 -2699.57889 20.41341 -4.71196 61.87593 52.58387 225.02019
16.85000 -2679.19576 19.79839 1.59122 54.42134 49.73527 223.00418
16.95000 -2661.74522 18.28760 5.97684 57.37653 48.51433 211.13338
17.05000 -2639.46594 19.12838 -4.70065 52.03142 51.71096 202.26068
17.15000 -2620.76763 16.20811 2.69151 55.31229 68.60257 204.56551
17.25000 -2605.55231 19.62976 8.79755 54.75092 46.72807 200.27745
17.35000 -2583.01338 19.24285 -2.39661 42.59793 50.84224 198.80401
17.45000 -2569.51567 20.53248 2.35236 57.52818 48.81662 190.03356
17.55000 -2551.51756 19.79282 1.78991 56.69266 39.29644 191.47192
17.65000 -2532.42954 19.23633 10.86472 48.15531 56.65245 190.88108
17.75000 -2517.13102 19.18471 10.41265 71.60645 55.64138 185.24526
17.85000 -2504.41228 17.64109 27.92372 45.86206 37.10060 172.45103
17.95000 -2481.67590 16.67249 11.39200 42.95060 33.51352 175.10022
18.05000 -2467.23145 21.31683 2.62938 52.11434 54.66058 174.03977
18.15000 -2450.77676 20.07316 3.67965 36.12952 32.02929 170.33657
18.25000 -2434.20984 17.40907 16.25398 48.64905 38.09181 173.39532
18.35000 -2420.30974 20.74423 14.28767 50.36910 50.41572 164.85833
18.45000 -2405.54615 19.52849 3.57194 44.61805 38.02577 171.57789
18.55000 -2387.32628 15.78697 5.06391 51.18865 49.20395 165.57845
18.65000 -2372.44185 18.90349 3.81388 34.73198 37.62390 154.97237
18.75000 -2357.45963 17.91027 -0.59738 41.19962 37.62077 155.85329
18.85000 -2344.84874 15.31391 -7.94951 59.81891 63.03164 160.70854
18.95000 -2330.94024 16.66063 -6.10078 43.52737 60.11802 164.36736
19.05000 -2319.03647 15.92085 6.21078 48.78528 40.24830 154.55098
19.15000 -2304.58665 18.60892 -2.73253 53.60507 45.91920 157.57244
19.25000 -2294.29909 18.82920 -2.64060 56.87556 50.09753 152.19795
19.35000 -2278.06851 18.78069 -13.18587 38.62317 32.17877 158.20949
19.45000 -2263.14370 18.30695 -14.76279 38.32164 38.65162 164.48748
19.55000 -2254.34635 16.68865 -11.42722 53.76527 50.81707 149.94730
19.65000 -2242.30134 18.56010 -18.79817 39.69273 46.37640 143.02524
19.75000 -2227.77082 16.84158 -12.25610 66.61836 54.17078 149.92284
19.85000 -2220.43969 16.82829 -15.57478 40.01008 42.86583 141.26157
19.95000 -2207.44291 16.86309 -20.98382 48.53127 45.91787 149.05100
