0.05000 -1849.48747 218.37145 73681.23989 1176.30638 741.80275 472847.05519
0.15000 -3343.03735 -18.39781 17831.69100 1296.61972 908.72924 313216.91859
0.25000 -5023.22447 47.62737 12210.64161 1339.14077 923.13386 431063.57243
0.35000 -6338.69098 35.57414 9188.81279 1363.16051 831.03472 382679.96268
0.45000 -7060.57368 71.64614 2612.73874 1522.68761 813.21172 406496.80842
0.55000 -7730.99255 20.67824 6687.10849 1577.33010 754.67881 355531.06388
0.65000 -8135.73443 33.37661 -232.14849 1560.59981 627.58837 298243.92922
0.75000 -8311.38317 37.80823 -1312.74543 1548.94468 592.34349 328581.57812
0.85000 -8574.37910 56.64140 -8294.58184 1555.45365 532.96992 312745.33582
0.95000 -8628.28687 46.03119 -3047.93755 1550.99040 486.36055 277800.69227
1.05000 -8696.79111 41.10922 7909.07004 1472.88694 458.00823 287659.23424
1.15000 -8717.51029 42.19465 4216.90482 1348.58457 443.91310 261024.85790
1.25000 -8713.89416 41.88328 2847.66670 1232.13401 420.15229 241249.25790
1.35000 -8767.61267 53.93963 -1464.42278 1198.46634 384.45754 259025.71898
1.45000 -8760.82058 48.39779 1527.19436 1119.37483 367.23425 208767.52043
1.55000 -8713.74913 48.77712 -1112.04544 1000.57969 340.50049 210489.34088
1.65000 -8739.84677 43.29833 -4971.33783 932.92391 336.06098 209330.32819
1.75000 -8678.48707 50.27960 -873.07080 845.82815 334.26178 205142.88411
1.85000 -8669.47021 46.31005 -3056.02967 758.25374 315.35688 223007.08294
1.95000 -8649.44569 51.06364 2394.57765 693.39857 319.74656 194226.84194
2.05000 -8643.18278 46.53047 1872.35610 616.72720 314.16933 185950.00987
2.15000 -8642.56615 49.49194 -1413.08349 557.24947 308.46569 172417.70429
2.25000 -8619.98447 44.71923 -2815.60478 522.61089 306.94980 169695.31238
2.35000 -8565.84973 48.42247 334.47689 500.23424 295.94882 155873.52741
2.45000 -8516.31847 45.74435 2171.92338 466.30957 296.01815 146591.65854
2.55000 -8486.53121 43.03009 71.97765 433.37155 289.15427 139790.44973
2.65000 -8453.56631 40.78649 -1526.68805 409.97065 281.83938 146434.39361
2.75000 -8409.67055 45.31664 311.83587 377.74209 273.12074 134299.38186
2.85000 -8358.24596 43.48346 2119.11792 370.28813 262.67054 130457.54060
2.95000 -8305.29361 46.88838 -3452.95267 343.87457 253.94018 131265.77633
3.05000 -8253.43341 45.81622 797.06898 307.31696 255.31356 120239.64120
3.15000 -8202.73859 47.19201 243.04590 290.89469 246.01461 108915.99905
3.25000 -8146.07117 44.29571 351.90481 277.32152 229.81325 113749.36682
3.35000 -8055.83119 43.67220 160.83346 272.72653 225.39648 112245.27873
3.45000 -7986.10098 40.73741 -15.26376 268.58918 225.93910 110752.56703
3.55000 -7922.92624 46.25741 1104.14521 258.01603 218.15707 107994.43125
3.65000 -7842.40217 41.23346 808.45744 234.91683 208.72394 96807.92320
3.75000 -7755.66255 35.83621 231.55212 236.93935 208.72326 99493.38681
3.85000 -7677.68801 36.38199 2383.02027 243.28164 209.58511 90211.39825
3.95000 -7604.23961 34.06581 317.01478 229.06790 202.49162 91213.98235
4.05000 -7538.65433 39.90358 -431.09285 232.32619 196.58005 81697.89330
4.15000 -7461.66557 31.08647 1863.83579 232.01464 193.61945 85453.08088
4.25000 -7391.99460 29.61857 1425.60954 224.08931 185.67125 76443.31546
4.35000 -7320.09433 31.86699 1351.67634 211.66927 186.62790 87736.82321
4.45000 -7256.31848 35.26892 472.09765 212.38600 180.15135 72144.14648
4.55000 -7213.08478 29.17615 866.60260 210.00694 191.32696 76370.61699
4.65000 -7166.18943 32.64288 496.26258 195.58834 183.25739 72351.92242
4.75000 -7117.46313 31.67376 1630.79787 187.83745 175.72673 63058.10686
4.85000 -7061.08717 29.82191 1028.41247 190.51067 177.39686 66249.25188
4.95000 -7011.89307 33.66420 -573.53608 187.47020 175.07125 61641.84776
5.05000 -6962.02456 26.61277 -407.58093 181.79438 166.31094 60052.60299
5.15000 -6910.36105 27.57200 -259.38320 182.50916 170.41567 71765.99456
5.25000 -6871.15616 28.60231 -280.47544 179.51473 173.94151 61615.13391
5.35000 -6820.38582 30.08383 -1432.80489 172.45450 166.46628 56401.94555
5.45000 -6764.74194 28.14517 -471.21874 168.24976 159.52912 48312.54039
5.55000 -6713.91847 25.32548 -1497.25355 162.32472 154.69359 51868.36902
5.65000 -6656.23136 24.61908 -766.98684 158.54634 147.98904 50759.15350
5.75000 -6604.01925 22.33495 1170.50419 161.51471 149.51032 71097.46082
5.85000 -6538.99810 21.74134 97.32551 166.62708 147.03164 50381.15624
5.95000 -6488.88007 23.52677 -744.77198 172.30948 149.78026 50581.16837
6.05000 -6433.16796 24.38949 -866.26487 165.39834 147.20808 72865.53376
6.15000 -6367.39510 24.48545 -110.96356 165.04743 134.03211 38925.47926
6.25000 -6308.99565 23.47915 -502.45042 165.29359 141.94592 41440.55469
6.35000 -6253.46307 23.34561 423.75891 164.18306 143.64887 33994.02090
6.45000 -6200.21457 22.21064 -325.66450 163.78206 144.25716 36419.07811
6.55000 -6145.20736 18.67160 24.31306 161.18447 140.20509 43373.87511
6.65000 -6099.82373 17.80061 -1136.42240 159.76801 136.09560 35946.64518
6.75000 -6044.36404 18.31203 -739.13702 158.07094 129.02842 37358.66624
6.85000 -5987.35881 19.21747 -614.31056 154.93518 132.39316 45193.55770
6.95000 -5927.49036 18.02040 -247.14653 157.29339 126.86939 31765.00534
7.05000 -5868.91942 18.62209 -357.87703 149.06001 133.92533 25714.32747
7.15000 -5819.79699 18.41921 -336.01798 147.29722 134.25577 49424.99951
7.25000 -5765.72853 19.68239 -220.47162 148.53502 126.86196 32866.35867
7.35000 -5709.50173 22.07523 -539.85300 136.14216 128.24151 28236.14564
7.45000 -5658.32149 16.93459 -745.45489 137.63569 125.60320 32052.22948
7.55000 -5614.45412 15.83730 -296.45691 135.09104 121.32986 37722.92869
7.65000 -5562.01781 18.45278 -167.55715 126.83661 118.74833 26302.15382
7.75000 -5513.28688 16.29486 27.95374 128.65359 119.91427 43098.79450
7.85000 -5457.99682 14.96018 -674.91861 129.14535 116.97598 23060.32963
7.95000 -5414.59910 13.94246 -230.50445 125.48809 115.01914 21633.22137
8.05000 -5367.30204 16.67344 -174.20841 124.14797 115.37945 28483.60784
8.15000 -5327.40784 13.07156 108.43039 123.83025 111.79953 31262.87538
8.25000 -5281.98891 14.84440 -584.55099 125.03841 114.70013 22255.47613
8.35000 -5236.52952 16.13496 79.23831 118.04285 106.46333 22321.69537
8.45000 -5190.36469 12.81811 202.93554 115.29392 109.62268 20675.67443
8.55000 -5145.97110 13.65208 437.75452 112.62658 103.64938 41405.86698
8.65000 -5100.96836 13.75208 -41.01197 111.69758 105.96130 19223.44141
8.75000 -5055.46039 14.80101 -48.29158 109.97258 109.37355 18830.86245
8.85000 -5013.36668 15.62418 -236.67815 112.72737 105.51955 18014.25156
8.95000 -4975.76596 12.91267 435.22513 108.04314 100.16440 39757.04242
9.05000 -4934.76008 13.05822 66.41587 114.58417 103.39372 16143.85181
9.15000 -4890.13634 12.44268 -445.74876 110.00187 101.34449 20784.95941
9.25000 -4847.87348 12.53500 -99.17241 110.21407 98.14076 14301.74431
9.35000 -4804.34354 13.80363 11.23310 113.62918 102.25295 13404.05900
9.45000 -4761.66537 14.14791 195.58597 103.68225 97.25118 30341.35112
9.55000 -4727.07209 15.26324 -272.62353 108.62614 102.05711 13652.78712
9.65000 -4685.77710 12.40644 77.73061 109.94387 98.66072 15462.13387
9.75000 -4654.81368 12.87891 -331.81985 113.79288 105.62415 13781.71587
9.85000 -4616.55365 12.21463 -385.91759 104.00721 94.34180 15412.45403
9.95000 -4583.45546 13.67965 -209.56688 101.13304 90.58359 12768.40830
10.05000 -4543.35908 12.99103 -274.40213 100.03177 96.14293 13457.94587
10.15000 -4504.10507 13.38644 -378.96596 99.07964 93.91014 13983.78463
10.25000 -4465.27875 10.50727 -618.78452 97.50546 85.91281 13161.50355
10.35000 -4426.48366 9.79823 -314.05926 97.13005 84.26715 10929.50315
10.45000 -4382.93718 10.84069 67.57887 92.61175 86.13237 10784.98072
10.55000 -4345.79710 8.40859 -187.53397 95.64745 84.44515 11874.83983
10.65000 -4311.39025 10.81264 -6.70738 93.64250 83.49374 9801.75790
10.75000 -4273.76185 8.91350 -93.16638 94.23799 86.31930 10286.67000
10.85000 -4236.47852 8.63057 -436.85012 92.89161 89.43260 9717.82938
10.95000 -4203.74225 7.44507 -142.94602 93.82351 82.70871 8933.20408
11.05000 -4172.04013 6.81246 -314.80687 82.71336 78.72208 11155.24010
11.15000 -4137.84343 8.25693 -255.16721 87.51839 85.60683 8666.58992
11.25000 -4102.97026 9.16925 -504.12395 78.34512 72.02613 9166.45957
11.35000 -4072.83024 7.63222 -314.31470 81.81919 88.40509 10459.66657
11.45000 -4038.17903 6.78538 -369.73228 83.56234 82.61349 8729.39236
11.55000 -4010.76008 7.45487 -315.92844 82.10924 82.01383 7939.29044
11.65000 -3981.44354 8.31973 -60.35598 86.83626 82.87730 8076.39453
11.75000 -3955.95201 7.51492 43.67658 81.79481 81.56968 6790.74179
11.85000 -3918.73197 7.62107 -322.41001 80.86362 76.78851 6810.36309
11.95000 -3889.41487 6.19633 -172.84198 78.99893 74.93335 7464.07977
12.05000 -3861.31311 3.50584 82.09470 79.54417 73.15913 6847.33122
12.15000 -3829.59295 6.67557 -141.82984 81.94934 69.35097 7244.93609
12.25000 -3803.75404 10.41431 -202.16207 81.94141 70.97587 7640.49822
12.35000 -3772.87755 8.55104 80.64045 69.22918 68.64317 6861.27490
12.45000 -3744.65480 6.40402 -305.09539 72.58749 70.62768 6359.00685
12.55000 -3717.74573 7.46155 -104.32618 74.72597 78.98554 7617.86465
12.65000 -3691.48795 8.98548 -131.72659 75.12568 69.51014 5325.17327
12.75000 -3659.31236 6.39934 50.48743 75.06748 76.88967 6796.41509
12.85000 -3633.18518 4.93703 -101.17673 69.98228 77.56907 5608.33039
12.95000 -3602.81514 7.34994 -216.87925 75.83526 70.70320 5436.98372
13.05000 -3577.13552 6.08597 -96.94764 75.69383 68.59729 6165.86903
13.15000 -3549.38366 5.77821 -154.38672 72.29621 79.36061 4760.93453
13.25000 -3520.56520 5.10422 -209.99638 64.38724 65.99461 4930.73910
13.35000 -3492.58306 5.79232 227.11541 66.58318 65.96065 5628.08571
13.45000 -3461.42924 5.70865 -290.84553 65.06813 69.04666 6163.84517
13.55000 -3436.48603 3.21013 21.37171 66.44890 62.57233 4359.52069
13.65000 -3416.07299 6.14933 -204.80290 77.42571 65.32549 4627.48124
13.75000 -3385.92359 6.75654 -9.94597 71.35066 76.05668 5845.79542
13.85000 -3364.54497 7.86268 -58.20641 73.15195 72.28721 4479.41063
13.95000 -3340.26830 6.47568 -12.78462 67.34288 63.88897 4110.30135
14.05000 -3316.43273 3.51419 -275.00034 68.54845 60.95246 4294.31232
14.15000 -3295.51039 6.91129 -65.93069 63.15127 65.07526 3647.25022
14.25000 -3276.10264 6.16703 -177.64395 56.85342 55.00505 3732.02519
14.35000 -3249.92501 2.86874 -218.48106 65.64663 66.18016 3525.79418
14.45000 -3232.36533 6.61951 -102.03703 60.63340 59.88847 3481.31882
14.55000 -3204.99070 7.38492 -125.20888 56.33309 58.86456 3517.89858
14.65000 -3186.24958 4.43832 29.51560 64.39924 62.10683 3235.17895
14.75000 -3165.14002 8.40468 -179.12020 64.74464 62.56236 3328.59877
14.85000 -3139.06234 3.93569 -124.48144 58.61193 60.27162 3966.43486
14.95000 -3117.51766 3.60393 -155.18068 59.85528 57.06351 3659.43212
15.05000 -3092.68523 2.39004 111.42766 62.39293 61.51037 2806.41533
15.15000 -3072.98345 6.29262 -155.58750 66.15962 68.08525 4360.03454
15.25000 -3051.06967 6.27466 -84.29921 57.81427 56.69398 2870.37852
15.35000 -3029.18850 4.23176 -138.84837 58.65364 51.54958 2969.39593
15.45000 -3002.04277 4.57476 -71.24749 56.60535 51.39086 2423.09598
15.55000 -2981.58931 2.51310 -17.67276 48.97672 45.75955 3351.08648
15.65000 -2959.86900 4.83215 38.57200 50.13667 56.40436 3249.53682
15.75000 -2940.14685 1.78489 -90.55766 49.40314 55.91139 3679.98445
15.85000 -2916.43194 7.25759 50.18116 58.06177 45.40068 2441.27242
15.95000 -2898.42366 4.66417 -58.57883 59.80847 51.92508 2701.96941
16.05000 -2881.37815 4.67354 -149.58939 52.19073 45.65310 2579.05649
16.15000 -2859.71780 5.67637 -139.63712 56.42922 52.02809 2578.79743
16.25000 -2839.97418 5.43821 -185.97373 55.66939 57.86742 2603.80457
16.35000 -2818.37181 3.30952 -65.72626 60.66448 56.20365 2288.01987
16.45000 -2802.10020 3.34537 -4.55965 57.05866 42.08211 2433.30489
16.55000 -2783.26568 3.94544 -74.51783 48.44194 44.40427 2515.61305
16.65000 -2764.39405 5.65359 -26.96697 50.83932 45.18525 1399.61907
16.75000 -2748.72166 3.40467 -54.75748 53.33822 44.03623 2532.36298
16.85000 -2733.16582 5.45888 -49.50749 71.52308 55.07069 1672.77681
16.95000 -2717.64536 3.67013 101.05006 47.48416 57.38498 1966.34304
17.05000 -2701.37383 0.38417 51.89553 49.90023 56.29002 2112.00169
17.15000 -2685.03371 6.49516 82.94029 58.28022 56.92326 2356.11641
17.25000 -2668.85768 5.55812 20.56643 45.24471 44.63017 1565.57565
17.35000 -2654.01443 3.54387 -71.24983 47.03997 51.87110 2210.58714
17.45000 -2632.56155 6.32463 -1.00501 60.43210 42.00444 2013.15070
17.55000 -2620.90738 3.64920 -62.56043 40.18792 49.96738 1690.48553
17.65000 -2610.31664 3.55356 -65.54773 53.54589 57.82339 1610.25810
17.75000 -2586.25161 2.74379 -82.94690 57.50826 35.50032 1677.59754
17.85000 -2572.88201 5.19625 -64.06955 40.23888 35.96728 2418.34976
17.95000 -2555.03401 3.92655 72.27339 58.14135 49.54369 2009.56271
18.05000 -2541.72271 4.84119 16.03788 60.03852 58.51159 1393.55061
18.15000 -2523.13996 4.99457 101.63727 46.20588 40.13238 2749.40008
18.25000 -2510.34194 2.78195 -59.59759 49.81645 40.79779 1247.91981
18.35000 -2489.90169 1.84296 -115.59323 53.30033 55.13812 1489.74362
18.45000 -2480.80878 3.15472 98.67576 60.56065 54.61792 1496.50507
18.55000 -2462.03119 2.66106 -34.84334 49.63956 58.60986 1237.63928
18.65000 -2450.57183 5.17370 -28.78895 53.54424 42.02186 1326.34121
18.75000 -2435.74089 1.62789 -131.20731 42.79530 43.34677 1321.44645
18.85000 -2416.75333 8.01630 -17.59392 65.65813 48.94991 1062.72558
18.95000 -2404.16466 4.80665 -20.04074 46.34023 59.08781 1614.26989
19.05000 -2385.95400 0.69399 119.74537 52.16131 40.24588 1224.59209
19.15000 -2373.50164 4.23628 -41.37744 57.19161 42.58716 999.75652
19.25000 -2358.15659 6.13115 -8.71303 40.68566 32.70612 740.94540
19.35000 -2341.60816 4.81988 53.58969 47.45929 51.09217 1049.48493
19.45000 -2328.90231 6.22940 -67.18528 33.05751 38.56719 1316.75022
19.55000 -2311.96878 7.21078 -67.16226 36.81700 49.38572 986.40510
19.65000 -2303.48471 8.04977 -17.13660 32.07398 33.92037 1450.43580
19.75000 -2291.20269 9.05618 57.21635 37.03891 43.15063 877.60892
19.85000 -2276.95548 9.23789 -57.33745 31.55533 29.79737 911.51328
19.95000 -2261.32999 14.24231 14.81398 49.75644 42.57721 982.23139
