0.12500 0.00224
0.37500 0.01657
0.62500 0.06955
0.87500 0.11377
1.12500 0.15329
1.37500 0.21831
1.62500 0.25123
1.87500 0.29537
2.12500 0.32447
2.37500 0.35810
2.62500 0.39128
2.87500 0.43674
3.12500 0.44911
3.37500 0.46798
3.62500 0.51290
3.87500 0.51524
4.12500 0.52730
4.37500 0.54295
4.62500 0.55820
4.87500 0.57419
5.12500 0.60680
5.37500 0.59403
5.62500 0.61655
5.87500 0.60566
6.12500 0.60971
6.37500 0.61726
6.62500 0.59882
6.87500 0.59157
7.12500 0.54289
7.37500 0.51494
7.62500 0.49203
7.87500 0.49946
8.12500 0.42823
8.37500 0.41483
8.62500 0.41660
8.87500 0.38313
9.12500 0.37106
9.37500 0.35133
9.62500 0.33623
9.87500 0.33544
10.12500 0.35377
10.37500 0.29972
10.62500 0.31518
10.87500 0.27617
11.12500 0.24387
11.37500 0.20594
11.62500 0.17789
11.87500 0.12966
12.12500 0.11701
12.37500 0.10234
12.62500 0.10190
12.87500 0.07036
13.12500 0.06840
13.37500 0.05532
13.62500 0.07125
13.87500 0.05522
14.12500 0.09030
14.37500 0.08675
14.62500 0.08087
14.87500 0.01442
15.12500 0.08059
15.37500 0.07195
15.62500 0.06218
15.87500 0.10618
16.12500 0.06165
16.37500 0.08253
16.62500 0.05839
16.87500 0.04425
17.12500 0.05138
17.37500 0.07772
17.62500 0.10684
17.87500 0.05377
18.12500 0.07415
18.37500 0.04968
18.62500 0.09939
18.87500 0.14050
19.12500 0.09368
19.37500 0.12361
19.62500 0.12111
19.87500 0.11382
