0.12500 0.00510
0.37500 0.02102
0.62500 0.01115
0.87500 0.01181
1.12500 0.03703
1.37500 0.05195
1.62500 0.05950
1.87500 0.06757
2.12500 0.09404
2.37500 0.10819
2.62500 0.12901
2.87500 0.13702
3.12500 0.14254
3.37500 0.14445
3.62500 0.14669
3.87500 0.14244
4.12500 0.14742
4.37500 0.13717
4.62500 0.14081
4.87500 0.12025
5.12500 0.12098
5.37500 0.10908
5.62500 0.08502
5.87500 0.05868
6.12500 0.05442
6.37500 0.02631
6.62500 0.02971
6.87500 0.03021
7.12500 0.02730
7.37500 0.03371
7.62500 0.05086
7.87500 0.04732
8.12500 0.06539
8.37500 0.07463
8.62500 0.05492
8.87500 0.05930
9.12500 0.06601
9.37500 0.04219
9.62500 0.03871
9.87500 0.03779
10.12500 0.03674
10.37500 0.03150
10.62500 0.02308
10.87500 0.02582
11.12500 0.03325
11.37500 0.04117
11.62500 0.05488
11.87500 0.04753
12.12500 0.06695
12.37500 0.05484
12.62500 0.04606
12.87500 0.07933
13.12500 0.06217
13.37500 0.04921
13.62500 0.03805
13.87500 0.03816
14.12500 0.05220
14.37500 0.02884
14.62500 0.04255
14.87500 0.04580
15.12500 0.02273
15.37500 0.03052
15.62500 0.04804
15.87500 0.04057
16.12500 0.03740
16.37500 0.04796
16.62500 0.06327
16.87500 0.05235
17.12500 0.03672
17.37500 0.04278
17.62500 0.04382
17.87500 0.03629
18.12500 0.03843
18.37500 0.04617
18.62500 0.04394
18.87500 0.03552
19.12500 0.03017
19.37500 0.02803
19.62500 0.04966
19.87500 0.05006
