0.05000 -21145.50034 1537.62595 6549.05941 17572.22866 14833.95293 19812.35638
0.15000 -30976.69219 -861.66898 1942.75304 11802.20726 9782.40344 26576.79907
0.25000 -31177.11440 423.00737 1574.98317 10944.21502 7228.07141 29253.15643
0.35000 -29968.82523 139.97297 699.45177 10117.66489 5810.59726 27040.79980
0.45000 -27757.76799 91.80400 1177.95268 9486.68170 5405.21549 25121.84006
0.55000 -26064.87872 -5.93646 181.67283 8515.75894 5157.39557 22891.81039
0.65000 -24494.79645 248.60989 77.35476 7839.65972 4744.17922 21122.32528
0.75000 -22970.73434 60.89239 105.88901 7341.93659 4358.94673 19518.79847
0.85000 -21386.18889 121.26761 467.07061 6559.17456 4064.39750 18205.07907
0.95000 -20134.02761 90.22310 -134.96204 6083.07353 3903.81858 16788.81349
1.05000 -19238.93897 91.28247 -291.56841 5476.61666 3663.99935 15410.03703
1.15000 -18271.92116 -23.12414 -457.97663 5053.09744 3590.19347 14363.68058
1.25000 -17188.72568 36.47271 -259.19466 4692.72688 3482.07748 13598.27289
1.35000 -16429.89090 53.27881 -51.20851 4471.87233 3310.53307 12883.34528
1.45000 -15859.74856 127.54757 -674.50476 4009.21038 3110.53153 11902.50737
1.55000 -15381.01784 56.88139 -222.17884 3727.36821 3046.55290 11129.04945
1.65000 -14847.30767 30.58302 -734.51002 3576.94317 2953.14662 10489.01485
1.75000 -14189.24292 -78.56976 -316.59630 3468.65468 2815.53148 10230.91158
1.85000 -13770.22576 -30.29639 -106.38548 3306.48298 2776.15432 9632.19997
1.95000 -13540.03946 10.65463 -40.74027 2920.50990 2659.87142 9022.97402
2.05000 -12959.95206 14.52041 -0.03842 2870.30819 2500.06156 8749.48814
2.15000 -12585.17339 -2.20649 -202.06754 2791.97397 2471.72071 8391.89924
2.25000 -12290.29523 18.30071 191.24096 2595.68813 2334.63297 7878.62609
2.35000 -11871.43467 17.65121 -138.58010 2487.77563 2355.91066 7726.62827
2.45000 -11623.87535 -55.06253 -257.41613 2393.52542 2220.85820 7308.19427
2.55000 -11295.84550 -32.23110 -317.39358 2203.40499 2119.84437 7110.28338
2.65000 -11101.80183 38.08478 -232.97783 2068.55884 2068.51301 6753.04412
2.75000 -10873.99609 5.96776 -183.76664 2120.60451 2021.56435 6488.82403
2.85000 -10571.17682 -3.38014 214.91214 1962.28572 1903.34555 6338.46395
2.95000 -10364.56639 -57.43977 37.42923 1836.42399 1888.57963 6085.48867
3.05000 -10153.22596 66.24066 -107.80943 1774.87920 1776.05350 5929.58904
3.15000 -9829.93879 -56.26459 221.34238 1739.03469 1666.38843 5710.99762
3.25000 -9656.58188 -34.37669 -137.25628 1601.88831 1611.59729 5576.00782
3.35000 -9482.24519 -15.99284 104.72545 1595.45163 1573.43935 5391.28842
3.45000 -9335.74824 -58.48511 178.90103 1481.88570 1630.23064 5157.97482
3.55000 -9138.91289 41.45650 -1.21206 1464.74367 1694.67914 5043.56624
3.65000 -8963.91879 -12.37195 -316.48430 1399.84200 1432.65344 4901.50353
3.75000 -8785.90179 -17.61919 71.19091 1390.09710 1384.49344 4785.34589
3.85000 -8618.50225 -26.16554 -20.37920 1336.72132 1391.28365 4684.58579
3.95000 -8488.11026 -18.84937 -67.47368 1189.16288 1269.12191 4535.78779
4.05000 -8372.35522 -31.46846 -31.25312 1444.36007 1355.66961 4426.95466
4.15000 -8280.82269 -2.02950 -43.23321 1146.53983 1208.67786 4208.37483
4.25000 -8122.47332 -11.68535 185.24978 1086.43421 1218.38893 4229.54366
4.35000 -7950.48194 48.75819 -147.73623 1154.84807 1162.32540 4078.33011
4.45000 -7847.35021 9.21976 -44.93032 1085.78280 1287.32048 3967.64845
4.55000 -7698.09104 -14.85860 112.50606 1006.73159 1141.16883 3807.11781
4.65000 -7661.40558 -8.48133 -111.64007 957.29588 1247.71711 3668.82258
4.75000 -7485.26405 5.54863 118.17517 1147.39069 1100.61732 3633.94890
4.85000 -7384.96942 -13.94729 9.46402 918.80712 1031.61257 3492.40478
4.95000 -7274.39384 -2.65574 176.36456 851.85721 912.85427 3390.89369
5.05000 -7183.59113 25.41462 57.92291 773.26680 921.97876 3248.27089
5.15000 -7054.65184 26.30989 8.40510 870.73767 978.05524 3222.21075
5.25000 -6993.43992 -22.93673 -57.13454 1064.67477 902.11047 2977.74819
5.35000 -6865.11372 -42.62884 -155.73347 898.19483 1222.56586 2986.51237
5.45000 -6779.10697 -8.12017 -168.30986 644.35732 790.10824 2888.95020
5.55000 -6695.71316 19.05674 -14.17779 794.28819 929.80023 2854.95919
5.65000 -6589.93862 3.67114 48.67938 585.39210 789.76891 2694.44371
5.75000 -6531.79340 -10.97414 -15.18558 757.23909 1010.78600 2594.15984
5.85000 -6433.67285 21.02172 -0.26733 530.40150 729.38459 2439.11649
5.95000 -6348.31917 -8.78915 29.52849 526.35313 728.26124 2421.75728
6.05000 -6293.07573 -0.53605 23.45421 517.21749 694.92499 2269.64964
6.15000 -6197.61389 33.06191 -100.88681 517.06115 658.79534 2230.95129
6.25000 -6156.24027 -22.91267 -109.38746 470.30205 641.91922 2205.69798
6.35000 -6067.24369 -7.44927 18.27493 484.57484 628.99867 2093.59937
6.45000 -6019.91286 6.54092 -8.61534 442.02651 609.97251 2055.71030
6.55000 -5964.33091 0.12081 8.23652 407.33095 585.82479 1911.67514
6.65000 -5890.12344 -0.30411 35.87815 579.34549 819.03916 1987.29251
6.75000 -5841.65772 -31.03032 40.81325 485.86379 606.43744 1843.87463
6.85000 -5766.18830 -46.31502 1.68747 484.23011 610.78554 1785.55768
6.95000 -5717.95715 -9.38958 2.15773 451.25332 637.61354 1743.54584
7.05000 -5665.95002 8.74206 79.69538 842.06849 588.11806 1648.06191
7.15000 -5649.97895 -24.15073 59.60379 402.97651 628.85505 1608.95730
7.25000 -5595.22138 -7.45910 140.22807 397.79419 510.86779 1529.77750
7.35000 -5561.55192 -24.88840 89.24221 439.68719 504.75831 1453.43418
7.45000 -5532.98202 -28.34833 30.31303 453.99617 507.94586 1397.54453
7.55000 -5500.25159 -21.31633 88.13430 451.09442 568.68955 1377.29762
7.65000 -5440.24423 19.43815 110.26000 386.78642 734.99553 1395.99036
7.75000 -5421.57013 -9.60279 87.18137 449.84253 690.03340 1359.97693
7.85000 -5418.29961 2.41705 127.99315 455.52038 528.57927 1269.38218
7.95000 -5351.24150 -14.45445 129.34812 444.67635 422.72947 1257.23637
8.05000 -5330.90398 -7.73031 83.21042 470.41901 508.78593 1180.17577
8.15000 -5288.76952 3.51295 129.10078 465.24595 388.24446 1194.63926
8.25000 -5259.91758 -7.31925 85.58563 416.26212 401.68205 1139.25434
8.35000 -5196.16860 8.68882 148.87916 473.85782 375.18801 1114.84608
8.45000 -5171.77147 -5.59253 35.58701 450.18218 423.81041 1167.08076
8.55000 -5112.56406 6.12779 120.48827 446.57466 458.64127 1093.74381
8.65000 -5067.64464 -1.54528 85.92416 374.37105 324.31647 1048.59160
8.75000 -5025.28089 -4.77086 116.71055 429.12965 577.25181 1255.06813
8.85000 -4974.31387 2.86976 65.05458 555.24212 367.95613 1023.91867
8.95000 -4923.37963 -19.95563 95.53018 430.63363 432.28310 1006.75483
9.05000 -4908.29985 -11.66013 54.80884 377.86904 333.31042 983.31886
9.15000 -4865.94771 9.54919 99.21228 385.47663 325.74900 928.08609
9.25000 -4822.13946 12.05389 118.33506 345.59296 300.50674 900.56592
9.35000 -4784.69011 20.09234 58.15024 369.74170 314.36640 903.19208
9.45000 -4745.33503 -17.50867 35.76243 530.48016 635.60563 896.02536
9.55000 -4700.75548 19.25671 53.02105 378.48425 377.75971 842.82774
9.65000 -4655.61310 18.07037 54.34137 305.56138 318.03841 869.70839
9.75000 -4627.60434 14.47305 80.58064 322.63153 246.29103 814.56337
9.85000 -4604.30193 3.51873 55.12222 302.38691 282.15717 780.92395
9.95000 -4552.12920 6.56576 42.92492 268.54240 215.23868 767.60165
10.05000 -4520.83887 -11.73764 -2.17764 276.57546 287.49899 777.78012
10.15000 -4485.21634 -15.33614 0.42796 297.72500 506.48485 966.31537
10.25000 -4449.77749 9.77836 34.19513 283.56097 288.44117 756.53582
10.35000 -4402.61131 7.83030 30.00285 252.05950 307.58617 715.31772
10.45000 -4370.24241 13.17330 29.48549 244.25333 238.34648 691.59111
10.55000 -4320.40950 11.46328 1.27772 272.60563 225.62693 698.65103
10.65000 -4254.48744 -21.93931 18.38644 732.65685 870.79620 661.34553
10.75000 -4261.41133 18.11417 -4.78061 465.60757 319.13049 670.43983
10.85000 -4215.32814 5.66455 4.93887 313.01857 198.12006 650.36863
10.95000 -4165.71710 12.12213 -1.65785 253.17993 179.60435 648.11454
11.05000 -4132.23813 -6.01071 -10.94500 328.64134 256.71863 655.13515
11.15000 -4102.36244 17.98437 -24.17270 372.69214 399.01064 602.97071
11.25000 -4080.94842 12.56572 21.41457 296.55778 264.96177 606.48521
11.35000 -4024.93829 9.93149 31.76282 247.50381 169.95709 593.92984
11.45000 -4004.35081 8.11417 32.01467 200.85738 164.92640 554.22004
11.55000 -3976.19748 -18.69929 -2.84629 306.25552 416.43876 769.26887
11.65000 -3929.48204 -3.72364 33.40612 610.34846 369.26058 1035.64824
11.75000 -3915.09189 7.26562 -18.80996 203.00817 204.21314 600.68486
11.85000 -3894.52395 13.45381 36.74399 284.48505 158.52570 553.53094
11.95000 -3851.61036 3.32480 5.80288 166.33667 156.46981 529.35903
12.05000 -3819.50426 0.98099 0.47997 208.05657 202.01113 567.32768
12.15000 -3790.36081 -5.52467 9.72081 343.85158 248.04293 540.59467
12.25000 -3763.29665 11.98142 -29.72539 215.30152 170.57076 561.79568
12.35000 -3752.37381 -9.15409 0.64216 206.17457 237.18745 509.54652
12.45000 -3712.34825 1.85800 5.99951 162.04819 134.76293 488.21805
12.55000 -3693.10313 -4.63146 12.26874 183.81334 149.11042 499.79039
12.65000 -3660.26536 3.33858 19.25076 145.49925 120.39972 469.56884
12.75000 -3637.85374 -3.44256 -10.62407 144.61239 141.11450 491.50520
12.85000 -3604.39300 5.43763 51.73479 255.15652 155.74748 453.59892
12.95000 -3595.17059 -6.40323 7.33595 136.93583 183.28954 414.83094
13.05000 -3545.72499 9.52384 18.36114 190.32591 179.22621 447.27726
13.15000 -3526.17846 8.90860 19.29990 134.37919 206.45989 446.16924
13.25000 -3512.53871 -3.66127 16.19318 196.64850 207.79241 441.33747
13.35000 -3485.36904 5.46856 -7.14389 135.94368 113.38345 419.30861
13.45000 -3471.52329 -8.37602 3.87744 227.28840 283.48349 432.41589
13.55000 -3435.17211 13.47571 -18.90640 195.07217 357.89079 416.89256
13.65000 -3412.60661 0.86317 1.90055 195.88549 192.66607 537.13189
13.75000 -3375.89649 7.44077 2.91042 142.54464 150.39162 381.49255
13.85000 -3353.85494 7.32488 -22.66851 142.05605 110.05534 401.81509
13.95000 -3326.86739 -4.38293 33.38953 155.44143 127.57431 391.22006
14.05000 -3310.44033 2.73659 41.38906 123.42119 96.18164 381.44489
14.15000 -3287.02909 5.76977 -6.31558 186.95354 124.61594 375.61613
14.25000 -3264.23492 2.49435 28.05970 160.96310 128.51366 350.61477
14.35000 -3232.79438 -2.54870 -1.06680 121.65173 151.64093 345.77123
14.45000 -3211.80574 7.86645 28.07554 139.94185 136.15541 362.70451
14.55000 -3181.49701 17.43262 3.36852 164.37507 281.52611 372.69515
14.65000 -3178.35061 0.68585 11.81990 114.91035 104.83701 355.50743
14.75000 -3116.97312 -37.12076 45.13985 809.08362 713.47027 448.37634
14.85000 -3123.42377 -8.92407 3.84674 124.03070 183.34282 322.22253
14.95000 -3118.13842 5.22759 -28.36087 124.33228 111.53898 324.28948
15.05000 -3081.92252 22.71729 24.29663 249.67877 319.73877 318.70103
15.15000 -3061.95648 2.26777 12.37871 118.37300 89.86869 328.13871
15.25000 -3040.45841 5.35749 -2.27891 121.79343 112.89242 310.20376
15.35000 -3028.25245 -0.98058 0.05182 114.47760 89.95880 305.03530
15.45000 -3016.37581 3.85349 9.85176 127.33315 92.30592 299.52898
15.55000 -2993.01039 6.01990 2.58191 154.43294 69.29221 302.18634
15.65000 -2968.29929 3.33998 -24.37686 177.99322 124.65493 305.98811
15.75000 -2946.76923 9.16395 -15.52304 93.44521 70.28498 284.14117
15.85000 -2924.56463 2.37474 -16.66292 108.41135 77.89170 277.00595
15.95000 -2902.76956 3.01997 -25.39450 119.14693 87.55566 293.64208
16.05000 -2882.06161 5.83182 -24.23770 151.21443 194.16373 334.09290
16.15000 -2855.17886 4.54457 -22.83971 132.88472 92.58407 261.69983
16.25000 -2852.86087 0.37715 -7.74327 90.81467 67.26169 267.05340
16.35000 -2828.52041 -0.35796 -30.36719 120.47373 68.63431 262.52726
16.45000 -2836.98064 20.64206 -8.42905 253.37231 287.66220 290.54922
16.55000 -2800.64128 4.10665 -18.60600 88.28863 71.50384 261.68705
16.65000 -2783.13349 8.93526 -14.25267 101.33754 73.94938 261.08829
16.75000 -2768.79527 1.82630 -44.59896 111.62896 129.00668 274.16802
16.85000 -2749.85854 -0.03837 -30.74368 132.47098 95.63816 258.48442
16.95000 -2731.59282 -5.16217 -4.57361 128.54815 146.00560 255.44946
17.05000 -2694.01464 28.58454 -51.21269 596.69422 291.12178 563.74750
17.15000 -2707.25367 -3.64432 -2.91644 117.35795 96.01006 246.74504
17.25000 -2691.37268 4.06278 -20.11897 141.12555 124.07505 394.37117
17.35000 -2673.87246 5.97382 -14.38250 90.36330 80.20715 231.51683
17.45000 -2644.37169 5.26156 -5.42581 102.18609 58.94236 243.19454
17.55000 -2640.15966 8.26233 -16.02160 81.07972 64.25259 235.36471
17.65000 -2625.66586 4.17223 -14.98478 116.50277 56.35746 241.84672
17.75000 -2618.77367 1.59173 -3.52456 103.66401 84.31303 224.24924
17.85000 -2600.29654 5.78024 -20.78664 98.49436 98.17189 226.41003
17.95000 -2591.87669 11.89714 -14.80948 83.77963 58.66274 220.33147
18.05000 -2564.10250 10.96755 5.30596 82.34152 150.32079 249.39173
18.15000 -2551.31236 2.23882 -26.99875 61.80741 55.28112 202.95148
18.25000 -2529.12745 5.34806 -20.71330 96.57048 58.86952 214.86226
18.35000 -2511.18384 3.60900 1.68634 199.01926 110.72284 264.62542
18.45000 -2505.48143 8.74589 -34.62004 134.72786 96.76718 217.71994
18.55000 -2501.57066 6.75006 -19.37663 86.41986 66.74758 195.39871
18.65000 -2478.63984 7.50897 -6.52680 75.43903 58.51777 208.97928
18.75000 -2467.71151 2.70081 -7.11929 62.59190 74.98716 239.76997
18.85000 -2434.78218 9.63050 -12.08433 74.18803 49.55152 188.48565
18.95000 -2432.27594 4.89402 -16.30379 55.40461 71.10238 182.51719
19.05000 -2417.75084 7.20240 -28.89470 82.01739 65.17364 204.89840
19.15000 -2397.92651 11.60755 -26.04803 56.41449 68.91654 182.80869
19.25000 -2389.55247 1.26080 -17.55883 107.08779 174.68204 198.53380
19.35000 -2367.25160 3.82682 1.09029 66.47939 93.42174 188.46013
19.45000 -2360.56947 5.20516 -13.54276 57.04600 51.43827 187.61452
19.55000 -2352.43175 17.00895 -2.28975 56.31312 96.28552 224.17853
19.65000 -2337.19581 1.86820 -26.97509 58.68143 72.06443 193.22731
19.75000 -2324.07234 0.50535 -16.25796 53.59673 49.21848 181.45317
19.85000 -2314.18997 9.78727 -21.58499 74.98992 115.73449 151.47757
19.95000 -2300.33830 3.27860 -21.88223 60.11235 62.02591 178.46898
