0.120000 -1.431560
0.380000 1.372470
0.620000 2.926320
0.880000 -1.301510
1.120000 -2.870470
1.380000 -2.574940
1.620000 -2.276610
1.880000 -2.917980
2.120000 -2.641070
2.380000 -2.651930
2.620000 -2.962970
2.880000 -3.042710
3.120000 2.825780
3.380000 2.884480
3.620000 1.409320
3.880000 0.049140
4.120000 -0.297790
4.380000 -0.684640
4.620000 -0.865830
4.880000 -1.660980
5.120000 -1.113330
5.380000 1.925760
5.620000 -2.873340
5.880000 -1.582360
6.120000 -1.586330
6.380000 -0.719760
6.620000 -1.714530
6.880000 -2.359440
7.120000 -2.161860
7.380000 -2.725000
7.620000 -2.838480
7.880000 -2.544860
8.120000 2.993020
8.380000 2.925440
8.620000 -2.308410
8.880000 3.017770
9.120000 3.097310
9.380000 3.075650
9.620000 2.909100
9.880000 2.223510
10.120000 2.074750
10.380000 2.113000
10.620000 1.651020
10.880000 0.851170
11.120000 0.547040
11.380000 -0.242630
11.620000 0.390430
11.880000 0.502010
12.120000 -1.244560
12.380000 -2.118300
12.620000 -1.612880
12.880000 -1.748380
13.120000 -1.952430
13.380000 -2.400770
13.620000 -2.362410
13.880000 -2.841370
14.120000 2.904540
14.380000 -2.712930
14.620000 3.035380
14.880000 -1.318760
