0.05000 2541.50070
0.15000 5090.97444
0.25000 7481.99311
0.35000 8079.43847
0.45000 8459.04328
0.55000 8822.79014
0.65000 9064.29958
0.75000 8675.48154
0.85000 8121.48092
0.95000 7958.75042
1.05000 7357.32311
1.15000 7036.93216
1.25000 6777.18904
1.35000 6488.45982
1.45000 6124.67826
1.55000 5825.67587
1.65000 5646.74980
1.75000 5376.83554
1.85000 5133.41602
1.95000 4924.94315
2.05000 4704.77508
2.15000 4537.35440
2.25000 4418.52908
2.35000 4111.13419
2.45000 4045.36991
2.55000 3830.07337
2.65000 3763.74217
2.75000 3582.78197
2.85000 3495.21872
2.95000 3290.01419
3.05000 3170.55829
3.15000 3125.49181
3.25000 3004.03773
3.35000 2962.67669
3.45000 2799.31676
3.55000 2709.49253
3.65000 2656.09318
3.75000 2603.76511
3.85000 2445.67065
3.95000 2433.28394
4.05000 2343.08349
4.15000 2284.93245
4.25000 2253.25988
4.35000 2184.23049
4.45000 2147.97206
4.55000 2059.57494
4.65000 1957.66291
4.75000 1934.89589
4.85000 1867.69070
4.95000 1853.14442
5.05000 1756.32633
5.15000 1731.65768
5.25000 1664.36820
5.35000 1592.13571
5.45000 1542.14813
5.55000 1504.27193
5.65000 1457.82260
5.75000 1432.27675
5.85000 1409.43365
5.95000 1325.63580
6.05000 1313.96261
6.15000 1257.69103
6.25000 1236.77689
6.35000 1202.75110
6.45000 1157.87518
6.55000 1139.87372
6.65000 1124.12388
6.75000 1059.66949
6.85000 1068.20502
6.95000 1019.59516
7.05000 976.33018
7.15000 953.44175
7.25000 921.62621
7.35000 899.06156
7.45000 899.25135
7.55000 851.10807
7.65000 867.27880
7.75000 828.99897
7.85000 803.71990
7.95000 792.81600
8.05000 782.42354
8.15000 759.57419
8.25000 721.92876
8.35000 705.54238
8.45000 697.30221
8.55000 649.60141
8.65000 652.40200
8.75000 633.32120
8.85000 619.12822
8.95000 632.07840
9.05000 597.41324
9.15000 565.69041
9.25000 558.76357
9.35000 540.42769
9.45000 514.02242
9.55000 497.75007
9.65000 501.47348
9.75000 495.18792
9.85000 489.35308
9.95000 458.85849
10.05000 459.41583
10.15000 454.47104
10.25000 425.93468
10.35000 431.73861
10.45000 410.13206
10.55000 387.85789
10.65000 404.32980
10.75000 369.13798
10.85000 378.69881
10.95000 365.36279
11.05000 342.66813
11.15000 334.80833
11.25000 337.73703
11.35000 332.02311
11.45000 304.10910
11.55000 296.35767
11.65000 298.44596
11.75000 293.13452
11.85000 285.55925
11.95000 287.18558
12.05000 276.78847
12.15000 270.08500
12.25000 263.91038
12.35000 273.43817
12.45000 248.45694
12.55000 268.84495
12.65000 237.14302
12.75000 243.65583
12.85000 233.47011
12.95000 271.65792
13.05000 225.92982
13.15000 213.70598
13.25000 211.69198
13.35000 195.26497
13.45000 205.17094
13.55000 198.41439
13.65000 213.93376
13.75000 175.55548
13.85000 190.56745
13.95000 182.84481
14.05000 173.30451
14.15000 176.03589
14.25000 175.86138
14.35000 166.38911
14.45000 145.36783
14.55000 162.10415
14.65000 153.01218
14.75000 155.15816
14.85000 145.50572
14.95000 138.88948
15.05000 133.54101
15.15000 134.83529
15.25000 138.53174
15.35000 126.43459
15.45000 124.61926
15.55000 125.62765
15.65000 138.07447
15.75000 119.28253
15.85000 116.06061
15.95000 129.93421
16.05000 135.05728
16.15000 127.57832
16.25000 137.87894
16.35000 131.58643
16.45000 128.89694
16.55000 105.70491
16.65000 119.11640
16.75000 116.19734
16.85000 116.41699
16.95000 110.60019
17.05000 115.10439
17.15000 119.94752
17.25000 107.91575
17.35000 125.20123
17.45000 109.81517
17.55000 99.83079
17.65000 107.30395
17.75000 95.01949
17.85000 96.13621
17.95000 89.17339
18.05000 81.35311
18.15000 84.26761
18.25000 73.91162
18.35000 87.30148
18.45000 81.33843
18.55000 98.12374
18.65000 73.85146
18.75000 84.31445
18.85000 96.06298
18.95000 88.63328
19.05000 73.21398
19.15000 76.81298
19.25000 60.93020
19.35000 58.23265
19.45000 61.09098
19.55000 70.19862
19.65000 82.05364
19.75000 60.88061
19.85000 60.33033
19.95000 71.91040
