0.05000 -4282.49239 387.34837 5820.76095 5908.83614 5653.25078 8156.83118
0.15000 -7644.84252 -26.68000 4180.65788 7025.29917 6671.85067 11332.81937
0.25000 -11460.69520 395.75836 2813.80837 6257.73101 5980.80193 14049.91714
0.35000 -14097.45391 83.39035 1443.87308 6613.42799 5856.75111 14382.54049
0.45000 -14421.19869 225.38920 1109.88191 6044.26827 5319.01875 15920.10640
0.55000 -14778.49488 56.25923 30.27396 5531.22862 4861.08199 15369.19177
0.65000 -14616.34655 9.53647 -372.55717 5133.89809 4620.47082 14716.62735
0.75000 -14132.96946 130.35466 -179.64193 4725.61340 4367.21787 14145.93252
0.85000 -13908.89365 187.87245 575.21625 4248.93079 4210.02600 13192.03861
0.95000 -13477.23772 102.24450 697.06984 4068.00073 4032.58056 12729.79295
1.05000 -13346.94377 1.29928 -132.43331 3957.71654 4054.81119 12252.28311
1.15000 -13090.72796 153.99099 -156.24769 3681.20866 3838.48719 11536.54093
1.25000 -12941.30341 66.69641 -400.36991 3455.20346 3818.42209 10807.62092
1.35000 -12599.51166 -39.08317 178.24120 3294.03454 3678.26201 10401.32745
1.45000 -12346.90461 -118.01044 -42.45550 3148.75738 3697.40593 9943.99264
1.55000 -12143.51803 -74.32805 -135.24666 2960.89093 3579.79544 9484.50053
1.65000 -11892.73231 73.61628 184.08664 2807.36353 3538.36795 9065.88738
1.75000 -11766.36491 -29.53186 -137.09588 2702.51128 3366.27872 8551.10928
1.85000 -11488.39629 -99.52108 35.28679 2561.83033 3355.19519 8325.34819
1.95000 -11315.45542 150.63789 -199.24306 2337.79747 3221.22560 7930.77880
2.05000 -11086.28929 39.46529 -134.76859 2214.34675 3169.07219 7609.22616
2.15000 -10858.14414 -72.91697 -7.13210 2035.06429 3033.15141 7343.87404
2.25000 -10684.84948 -72.27818 -86.02187 1953.70836 2993.59621 7187.40756
2.35000 -10585.37198 -34.25776 112.76351 1745.33492 2900.23450 6692.88502
2.45000 -10351.51644 76.41540 -101.99213 1827.27137 2872.66834 6640.86956
2.55000 -10203.46154 -67.17874 -138.16697 1699.48418 2789.52799 6310.60850
2.65000 -9980.29231 6.61883 -63.79086 1603.09603 2667.90190 6050.26263
2.75000 -9730.55285 79.18757 -229.49063 1500.17030 2583.06324 5876.25155
2.85000 -9485.00448 111.15519 -144.67078 1391.43733 2541.66292 5741.69223
2.95000 -9388.18439 50.11601 -194.86037 1308.22985 2531.69770 5493.23168
3.05000 -9160.53388 22.04508 12.85019 1276.34173 2438.49684 5381.25346
3.15000 -9071.34921 66.97425 -156.21153 1177.03978 2357.50598 5057.49992
3.25000 -8862.40086 -6.38995 2.23698 1132.53370 2330.23609 5037.44471
3.35000 -8761.99521 48.92241 47.74695 1145.76492 2323.92468 4839.91158
3.45000 -8604.35196 -78.13004 -45.24099 1101.91715 2215.01482 4734.95914
3.55000 -8470.84013 9.19550 70.32589 989.87240 2207.54328 4574.54673
3.65000 -8331.63944 -34.78775 -9.97757 1080.84419 2158.37854 4398.63202
3.75000 -8222.05905 37.08021 -88.79300 955.58538 2083.11682 4266.27309
3.85000 -8121.04332 28.56780 -88.06456 921.15561 2066.11663 3992.89403
3.95000 -8052.46767 -23.01992 -146.28353 860.58280 2027.13958 3984.55065
4.05000 -7968.01073 24.45955 -76.80486 817.60486 1983.70102 3768.66655
4.15000 -7827.78303 23.76665 -36.95915 822.46962 1944.88956 3769.86229
4.25000 -7718.49355 36.62745 1.38343 792.06942 1883.63600 3616.73947
4.35000 -7641.24554 33.34939 -32.55421 850.29670 1782.59877 3594.45131
4.45000 -7538.65683 46.22021 41.62364 815.63220 1777.82686 3369.29462
4.55000 -7385.80485 10.90406 -86.26743 774.69467 1692.03867 3320.61653
4.65000 -7307.21510 9.70147 -62.21338 855.42335 1599.74246 3163.40121
4.75000 -7233.97608 14.34119 -66.99305 847.67398 1570.65341 3126.96851
4.85000 -7184.12601 -2.34085 -94.61415 810.29717 1551.28236 3016.15194
4.95000 -7118.68663 -9.73742 -94.09471 711.94387 1466.85058 2874.86569
5.05000 -7051.04463 -30.13529 139.87706 808.51280 1455.47464 2882.61435
5.15000 -6954.85161 18.96078 -52.64727 710.35338 1406.04150 2765.55316
5.25000 -6888.74638 -33.24728 2.07534 782.47897 1366.33131 2678.63861
5.35000 -6824.81083 -20.10529 -42.04965 879.54623 1354.43031 2665.69294
5.45000 -6739.91842 54.20864 -30.99608 722.80156 1209.34365 2542.52638
5.55000 -6686.64775 -69.52804 13.95352 752.14929 1212.70474 2468.32190
5.65000 -6656.98151 7.89217 49.54394 729.84374 1200.63064 2466.39382
5.75000 -6620.68283 22.94200 -57.91529 728.51778 1113.81093 2355.66818
5.85000 -6558.97588 -19.52212 -80.45318 810.88206 1055.53139 2286.75575
5.95000 -6496.45651 -1.13301 -40.33731 758.01539 1014.54844 2201.77768
6.05000 -6446.98463 -31.79649 26.66736 809.90076 998.84308 2094.85467
6.15000 -6407.59233 29.34328 65.86984 786.89502 977.83090 2021.38084
6.25000 -6393.63295 7.39229 8.02439 829.23800 896.49116 2086.78019
6.35000 -6379.41016 -44.55166 -70.29063 871.12108 950.52391 1989.73188
6.45000 -6329.51627 3.73990 -49.18445 844.52799 841.68634 1917.52417
6.55000 -6298.47644 -14.26984 63.04369 863.41706 847.18515 1882.07928
6.65000 -6269.41470 -8.99750 35.61888 861.02254 736.84065 1759.58616
6.75000 -6211.42454 17.71165 -55.29064 860.07648 754.53619 1780.44149
6.85000 -6107.16906 0.83820 -14.99869 782.36596 714.94008 1688.32357
6.95000 -6055.50089 28.93519 41.18112 799.76776 623.80585 1645.31029
7.05000 -6002.61148 5.64066 38.15126 739.80247 629.21407 1587.34211
7.15000 -5939.07489 3.40442 74.53498 708.94860 578.77818 1518.16682
7.25000 -5859.59140 -3.01708 104.64404 709.69297 594.73723 1541.25545
7.35000 -5807.33654 17.17961 1.11928 674.32115 540.89207 1443.59767
7.45000 -5771.22840 19.45616 69.56610 740.95731 522.50873 1420.67414
7.55000 -5702.76108 -8.23967 41.35480 633.42488 513.24315 1342.45135
7.65000 -5628.31426 2.02192 41.08103 594.35961 459.30114 1318.17580
7.75000 -5582.34861 27.67659 67.82186 524.30684 434.61762 1293.34121
7.85000 -5529.44717 12.84172 32.09477 529.54346 409.25222 1231.11723
7.95000 -5449.02286 9.29137 49.78380 490.05777 389.92319 1201.66884
8.05000 -5381.29777 2.55760 51.78540 498.83258 461.85995 1214.63719
8.15000 -5339.64716 13.78431 52.29046 506.10172 397.91145 1187.13585
8.25000 -5310.70344 20.16014 76.76072 466.52581 370.81997 1097.77138
8.35000 -5253.76423 18.61401 78.72664 440.89142 378.12775 1094.53746
8.45000 -5207.53073 17.68474 11.68728 424.14433 333.42878 1072.44161
8.55000 -5136.45741 26.33851 78.42614 472.25226 320.28094 1055.61506
8.65000 -5108.58157 19.73084 33.93865 391.62038 332.58360 1061.62287
8.75000 -5060.47915 9.49693 85.00591 394.55375 330.11113 1005.17621
8.85000 -5006.41026 22.57842 41.46986 365.22970 311.55110 954.15071
8.95000 -4961.78963 31.75661 19.68980 434.26762 307.06699 955.53659
9.05000 -4924.08071 17.57666 44.93627 403.11636 285.54388 953.86898
9.15000 -4882.36334 26.82097 -15.83873 359.65150 278.30676 932.90507
9.25000 -4806.88142 10.02508 13.91143 357.36513 286.95813 918.87818
9.35000 -4779.90382 28.69145 31.50696 341.47288 332.09320 859.37005
9.45000 -4745.72430 12.88144 -23.22829 319.95954 283.65283 887.25357
9.55000 -4708.40508 32.60652 35.77738 327.54303 351.53833 849.00603
9.65000 -4668.47508 13.55558 -1.29878 303.80978 232.83674 830.67936
9.75000 -4634.37430 29.19855 -3.03419 337.03253 257.03504 769.06004
9.85000 -4582.06823 21.73618 -22.00483 307.13760 271.74488 796.11546
9.95000 -4542.36014 24.66190 -12.50200 301.22861 222.31518 760.26823
10.05000 -4501.37664 9.85270 -6.20464 307.53023 242.17137 766.96120
10.15000 -4470.78767 31.19107 -21.25082 270.73770 196.94029 726.47452
10.25000 -4422.48930 27.80852 -38.54359 277.60556 411.30945 778.63902
10.35000 -4390.70687 27.04364 -53.94663 305.05540 283.41602 762.35174
10.45000 -4336.19723 15.35389 -36.91936 308.22371 267.94883 676.78307
10.55000 -4297.89654 5.10031 -31.47192 271.36258 206.78620 688.00766
10.65000 -4259.22186 6.21484 -23.39716 274.33393 254.86200 673.91876
10.75000 -4218.63515 29.08116 -50.48537 349.67163 216.96312 705.47579
10.85000 -4182.72584 26.26578 -38.91014 268.09695 259.95335 667.74487
10.95000 -4135.37281 19.03331 -43.05567 265.97178 180.19105 634.60348
11.05000 -4105.95753 12.65139 -50.57922 259.87050 179.23852 630.72494
11.15000 -4075.59521 15.15208 -61.58429 242.91431 195.79395 609.54601
11.25000 -4041.63863 11.27922 -42.92692 276.87679 215.29476 631.98476
11.35000 -3998.15851 21.29509 -86.99435 289.93691 252.53053 648.39175
11.45000 -3957.02249 24.90319 -43.57635 224.13008 227.35283 590.77846
11.55000 -3944.18569 7.99781 -38.58793 211.02220 227.88185 585.83179
11.65000 -3907.16434 10.62784 -22.50722 285.25462 160.98390 591.56221
11.75000 -3872.18277 8.48507 -28.82484 236.60358 161.62934 574.56754
11.85000 -3847.66848 9.81531 -46.98707 197.39684 149.47676 568.26173
11.95000 -3810.03008 16.67100 -49.06532 186.50065 157.85366 550.17127
12.05000 -3773.57236 13.54342 -85.31123 304.03676 216.31256 557.89057
12.15000 -3767.74171 15.78842 -45.03260 231.48447 171.36898 551.80301
12.25000 -3733.64308 15.61885 -35.47802 187.28544 140.80967 538.15132
12.35000 -3703.58270 14.88756 -84.12425 200.82773 154.23504 528.69744
12.45000 -3677.88718 9.11595 -52.58245 174.36918 127.38627 495.77771
12.55000 -3650.73237 17.65317 -36.38860 165.88697 138.42694 549.23208
12.65000 -3618.46752 24.53521 -53.16041 194.04269 139.67249 477.48149
12.75000 -3589.52623 14.59473 -62.23529 218.26432 161.22319 483.91056
12.85000 -3572.11279 8.93285 -75.70041 207.28217 127.11985 474.62285
12.95000 -3537.78340 9.12988 -71.04210 181.53012 145.02744 482.16518
13.05000 -3516.55919 17.21370 -61.85559 181.71589 169.64692 468.57617
13.15000 -3504.56439 13.82521 -75.61523 186.29398 105.21269 451.28542
13.25000 -3462.53025 18.49034 -74.79375 171.73510 130.88398 477.67585
13.35000 -3449.31939 17.96959 -67.70133 144.12567 112.74375 459.06264
13.45000 -3432.06405 11.38598 -77.50612 240.49073 143.83755 475.16669
13.55000 -3415.30566 16.55819 -71.66454 151.31422 113.73728 428.03525
13.65000 -3395.24705 11.24430 -108.77289 168.77257 152.33306 418.86369
13.75000 -3372.88151 34.54127 -57.59685 165.89081 460.03894 446.23382
13.85000 -3339.80305 18.27326 -66.05285 149.17016 161.16294 424.73795
13.95000 -3328.01313 18.27162 -68.66986 163.58583 107.56555 416.35549
14.05000 -3311.09504 21.29426 -75.97820 152.52690 118.82359 408.63624
14.15000 -3304.12394 15.57031 -32.93588 164.82025 152.52491 399.17392
14.25000 -3275.90981 18.11646 -67.75424 111.72725 148.15921 394.88818
14.35000 -3256.38929 12.90463 -84.25674 142.45568 217.47745 401.63250
14.45000 -3235.69334 19.52287 -79.67913 121.89613 87.97822 371.85340
14.55000 -3219.27071 15.59266 -71.27942 115.30705 81.53663 354.84522
14.65000 -3189.97280 13.82284 -77.28859 119.89516 116.22378 355.37021
14.75000 -3180.44416 18.91412 -62.41740 116.29223 99.30046 352.53717
14.85000 -3166.75654 16.88502 -76.03940 139.91373 101.17974 351.36389
14.95000 -3142.46123 16.55880 -75.29937 112.90489 75.44085 355.96318
15.05000 -3118.73133 19.51471 -81.85661 93.22767 73.05869 325.35568
15.15000 -3090.38713 9.77067 -51.28828 98.61695 90.66671 335.56893
15.25000 -3087.98971 6.90441 -57.29650 99.10963 97.37554 309.68524
15.35000 -3045.19942 6.50198 -73.10698 241.27656 190.35959 326.84269
15.45000 -3047.19922 16.48483 -37.04366 89.52858 97.88938 302.81752
15.55000 -3027.61896 12.14625 -50.48964 85.84512 72.12125 300.25846
15.65000 -3006.30115 7.89927 -68.59327 94.31043 97.76417 309.69176
15.75000 -2980.65206 16.90258 -70.72700 179.63840 129.17361 330.71312
15.85000 -2961.73480 10.25710 -68.43393 115.67886 125.01361 311.59766
15.95000 -2943.57964 21.93589 -70.01176 78.72146 98.05787 288.94914
16.05000 -2916.99998 15.21401 -42.94264 205.36725 140.74515 466.68886
16.15000 -2896.87278 11.70963 -41.68990 125.37947 93.85469 286.77797
16.25000 -2880.29339 15.35424 -68.52794 105.30884 67.00972 273.87519
16.35000 -2866.38230 19.18103 -52.00327 89.23890 133.95286 264.03589
16.45000 -2842.55206 12.46605 -50.34761 112.46991 92.46922 266.88648
16.55000 -2825.19398 13.32378 -61.05289 82.99032 92.53278 258.71744
16.65000 -2795.76675 4.44958 -40.65157 189.10723 229.58376 275.47918
16.75000 -2785.06473 8.43056 -35.31862 80.37373 68.89293 254.22315
16.85000 -2765.19764 3.08409 -57.10471 117.03160 133.47614 272.79171
16.95000 -2752.25278 10.77959 -60.02173 67.38497 63.36037 231.27858
17.05000 -2740.52751 5.14164 -47.43042 81.30800 87.09748 252.07380
17.15000 -2707.71182 6.32465 -33.52520 130.18332 131.72348 252.51999
17.25000 -2705.05316 10.76042 -34.81628 77.30046 65.53348 230.90217
17.35000 -2674.15717 2.68166 -65.76583 164.84685 126.65781 252.78313
17.45000 -2661.69347 10.17967 -32.35450 74.69458 75.35900 222.71817
17.55000 -2642.64338 3.41708 -58.00038 65.25560 68.96795 206.53774
17.65000 -2634.02479 6.12231 -12.46342 60.85126 96.73881 224.05822
17.75000 -2604.64359 10.49598 -48.65704 89.30264 63.96776 211.95414
17.85000 -2593.30247 -27.50303 -6.34559 199.84833 499.41531 292.92547
17.95000 -2578.96516 11.14226 -33.84658 58.31213 49.22729 190.70366
18.05000 -2565.51756 12.10710 -31.74941 58.86720 61.68687 180.26839
18.15000 -2549.50064 3.78716 -54.38146 47.43308 76.61081 189.57321
18.25000 -2525.81992 17.79352 -20.50142 109.08818 77.84333 190.17481
18.35000 -2501.05674 7.20449 -41.75088 86.63857 57.55702 219.57502
18.45000 -2495.47706 10.37620 -25.97375 60.84450 43.86633 200.80975
18.55000 -2480.76501 8.88672 -40.70596 63.25717 64.15744 183.33644
18.65000 -2461.31085 6.49190 -20.68384 54.84957 62.44148 176.86244
18.75000 -2466.80356 5.06286 -34.17930 123.40532 64.29636 217.18015
18.85000 -2442.72594 14.91413 -38.35975 61.71497 80.31673 185.88890
18.95000 -2427.28809 0.40040 -23.32857 71.12395 53.57950 187.81591
19.05000 -2405.73448 12.18133 -29.60347 66.19854 95.18497 192.36228
19.15000 -2396.65658 4.89297 -31.20459 60.24968 79.49105 181.74418
19.25000 -2380.16236 9.72776 9.97410 198.10214 128.68022 196.83483
19.35000 -2368.48751 9.14855 -19.53836 54.77889 38.97039 163.58893
19.45000 -2359.87255 11.52106 -12.11994 59.90518 53.54821 162.93922
19.55000 -2335.79828 9.78369 -18.46871 48.32207 50.65151 164.74017
19.65000 -2318.79388 -2.89886 -8.07292 59.20609 75.36094 226.32310
19.75000 -2307.70512 9.43366 -34.88847 49.84128 40.47987 146.05855
19.85000 -2303.04895 5.58324 -10.05210 63.45628 105.29273 156.14054
19.95000 -2282.31673 17.28663 -36.13630 41.67318 52.75280 154.29422
