0.1875 1.08921 18.35586 -0.93815 131.75732 129.40717 125.26692
0.5625 1.05159 47.30079 -0.35479 123.22085 112.12266 107.17488
0.9375 -0.118 67.33683 -0.15603 117.48769 101.0127 94.91724
1.3125 0.69055 79.41817 -0.87373 110.85864 93.28374 87.14388
1.6875 0.59853 85.85753 0.44167 103.08369 86.88309 81.05326
2.0625 -0.10252 93.18392 0.07854 98.26573 82.01457 76.31257
2.4375 0.27025 101.31775 -0.06233 90.74016 77.06633 71.32359
2.8125 -1.24101 111.45584 -0.17164 85.26959 74.59414 67.06656
3.1875 -0.11903 124.1263 -0.4982 79.2234 69.76966 63.41254
3.5625 0.65064 136.513 1.07873 73.65798 67.09555 58.44632
3.9375 -0.65269 151.39318 1.0982 67.85588 62.69016 53.61003
4.3125 -0.22634 163.34654 0.71245 62.47745 57.22295 48.28898
4.6875 0.90598 172.05171 0.98331 56.40924 50.61943 44.52077
5.0625 0.11986 177.94154 0.44954 50.73795 45.20985 42.06333
5.4375 0.30575 182.3263 0.3752 46.4284 41.12163 39.34442
5.8125 -0.19951 187.19712 0.41192 44.02711 37.82819 37.50107
6.1875 -0.17604 190.97678 0.16912 41.78009 35.3936 36.1496
6.5625 -0.57701 194.74906 0.08176 40.47843 32.7982 34.24442
6.9375 -1.06397 197.443 -0.53813 38.8953 31.26397 32.91826
7.3125 -0.76195 199.65859 -0.88553 37.7824 30.34415 32.12504
7.6875 -0.27711 201.60146 -0.89304 36.31275 28.97734 30.60186
8.0625 -0.10867 202.84214 -0.07522 35.13892 27.83496 29.52711
8.4375 0.2974 204.30354 -0.21061 34.5244 26.60162 29.10689
8.8125 -0.4846 205.259 -0.31481 33.84247 26.38976 27.54128
9.1875 0.01668 206.49943 -0.40702 32.79023 25.28926 26.78059
9.5625 -0.44196 207.53676 0.28328 32.18084 25.04001 26.15878
9.9375 -0.19 208.53248 0.39947 31.14866 24.9134 25.32972
10.3125 0.07835 210.12847 -0.30078 30.70438 23.9445 24.61385
10.6875 0.12975 211.04502 -0.04213 29.98797 23.4089 24.02106
11.0625 0.42454 211.90316 -0.55465 29.23248 22.08692 23.61681
11.4375 0.71129 212.35504 -0.36381 29.02113 20.85166 23.11895
11.8125 1.00587 212.64376 -0.2993 28.07141 20.14164 22.43957
12.1875 1.04063 212.40677 0.04578 27.41156 19.97466 21.82654
12.5625 0.76851 212.29391 -0.41382 26.66996 19.29158 20.92261
12.9375 0.99561 212.28722 0.01146 26.23484 19.41761 20.36391
13.3125 0.8532 212.69954 0.58814 25.05045 19.34368 19.79891
13.6875 0.56779 213.33247 0.3753 24.64686 18.98401 19.07188
14.0625 0.62571 213.69051 0.06464 24.34128 18.63163 18.63292
14.4375 0.14141 213.98699 0.18125 23.47236 18.27676 17.79556
14.8125 0.69147 214.83121 0.64618 23.39134 17.82047 17.59265
15.1875 0.08468 214.79135 0.56042 23.01015 16.982 17.38736
15.5625 0.28061 214.96159 0.29309 21.8163 16.23957 16.57948
15.9375 0.93247 214.62659 -0.26098 22.13032 15.71996 15.87967
16.3125 0.40083 213.8379 -0.57393 21.67108 15.26255 15.59471
16.6875 0.03254 213.92659 -0.6705 20.48427 14.67306 15.31066
17.0625 0.11501 214.00685 -0.57035 20.00175 14.33838 14.55047
17.4375 -0.32794 213.34189 -0.33469 19.53097 14.3869 14.57623
17.8125 -0.03247 213.11118 -0.29556 18.82764 13.77721 14.50878
18.1875 -0.7713 213.63923 0.33581 18.74792 13.55004 13.88381
18.5625 0.02666 213.12693 0.28615 18.04556 13.33648 13.51035
18.9375 0.06194 212.75816 1.42424 17.21454 13.07636 13.2499
19.3125 -0.01567 212.98107 0.72389 16.40686 12.55076 12.71352
19.6875 0.06767 213.03734 1.12694 16.34182 12.07024 12.20634
20.0625 0.1108 212.15935 0.64624 15.78844 11.77309 12.21515
20.4375 0.32315 212.22358 1.04799 15.5597 11.3876 11.46678
20.8125 0.61854 212.23116 0.60876 15.31726 11.52116 11.40483
21.1875 1.30069 211.92976 -0.17625 14.76068 10.88392 11.69875
21.5625 0.67444 212.36133 -0.06855 14.37534 10.65773 11.20233
21.9375 1.21237 211.61818 -0.29683 14.41515 10.06425 11.27463
22.3125 1.42334 211.48901 -0.25886 14.21258 10.40503 11.15132
22.6875 0.7787 212.25027 0.54105 13.18328 9.78871 11.1033
23.0625 1.87955 211.10582 0.13114 13.00461 9.5489 10.63295
23.4375 1.48719 211.19604 0.45001 12.29507 9.43464 10.30154
23.8125 0.93698 211.21513 0.84502 12.05503 9.15422 9.58217
24.1875 1.16571 210.88816 0.46708 12.0186 8.69209 9.69242
24.5625 0.17279 211.04683 0.38057 12.22814 8.02867 9.14945
24.9375 0.36952 210.22474 0.14402 11.53414 7.99102 9.31435
25.3125 -0.77952 210.18258 0.26958 11.56761 8.10434 9.1035
25.6875 -1.30334 209.79105 0.33128 11.32564 7.90717 8.67457
26.0625 -0.46388 209.13143 0.0244 12.02785 7.8906 9.03574
26.4375 0.20014 209.36263 -0.54323 11.29612 7.47896 8.86461
26.8125 -2.21274 209.11103 -0.05227 10.98887 6.65657 8.73584
27.1875 -0.44821 208.37124 0.80211 10.67141 6.81241 8.03125
27.5625 -0.69511 208.02743 1.34456 10.63591 6.2479 8.704
27.9375 -1.37867 207.82076 1.29974 9.88267 6.64957 7.64812
28.3125 -0.39536 207.31672 2.36394 9.81354 6.71796 8.15136
28.6875 -1.26502 207.00079 1.60816 10.59243 6.84748 7.57202
29.0625 -0.91906 206.53474 2.17548 9.46263 6.32801 7.08523
29.4375 -0.65621 206.55515 1.85271 9.74229 5.74696 6.72839
29.8125 0.53308 206.8528 1.14161 9.33292 6.07047 6.77974
