0.05000 11035.99898
0.15000 20266.61285
0.25000 22318.10197
0.35000 20200.18933
0.45000 17279.27947
0.55000 16180.68926
0.65000 14221.55824
0.75000 12933.24677
0.85000 12313.96829
0.95000 11150.47748
1.05000 10211.69114
1.15000 9482.82948
1.25000 8830.80656
1.35000 8510.83177
1.45000 7774.83155
1.55000 7611.19888
1.65000 7124.81029
1.75000 6775.72972
1.85000 6590.49990
1.95000 6284.00182
2.05000 5991.24239
2.15000 5936.83460
2.25000 5550.18780
2.35000 5331.74308
2.45000 5144.25037
2.55000 4935.17245
2.65000 4716.91565
2.75000 4611.96548
2.85000 4423.18461
2.95000 4154.30743
3.05000 4005.27833
3.15000 3856.63329
3.25000 3772.55243
3.35000 3635.47488
3.45000 3426.38289
3.55000 3282.59966
3.65000 3239.96406
3.75000 3148.69468
3.85000 3004.75815
3.95000 2888.21396
4.05000 2871.55786
4.15000 2810.16306
4.25000 2772.47991
4.35000 2608.88713
4.45000 2524.84926
4.55000 2469.64259
4.65000 2399.71528
4.75000 2320.44639
4.85000 2292.13962
4.95000 2224.34451
5.05000 2150.97324
5.15000 2096.00399
5.25000 2049.73661
5.35000 1976.09868
5.45000 1884.87386
5.55000 1849.73686
5.65000 1836.15793
5.75000 1803.31817
5.85000 1683.64856
5.95000 1636.97745
6.05000 1579.05955
6.15000 1557.14602
6.25000 1513.24543
6.35000 1461.56178
6.45000 1438.63708
6.55000 1390.22494
6.65000 1360.80484
6.75000 1302.61473
6.85000 1302.17210
6.95000 1238.42348
7.05000 1236.37037
7.15000 1190.75876
7.25000 1144.42313
7.35000 1130.03867
7.45000 1121.02306
7.55000 1052.66256
7.65000 1035.63156
7.75000 1025.69197
7.85000 1026.55587
7.95000 1001.32315
8.05000 971.09436
8.15000 910.01315
8.25000 897.36235
8.35000 900.57035
8.45000 853.29500
8.55000 850.86312
8.65000 827.12608
8.75000 820.85032
8.85000 772.44290
8.95000 804.97712
9.05000 753.70467
9.15000 763.05296
9.25000 734.40112
9.35000 716.02759
9.45000 713.43630
9.55000 674.12268
9.65000 665.10847
9.75000 650.34008
9.85000 635.81694
9.95000 622.15997
10.05000 625.76503
10.15000 607.54458
10.25000 621.86949
10.35000 591.81943
10.45000 581.36219
10.55000 566.76746
10.65000 561.41564
10.75000 575.38015
10.85000 554.92300
10.95000 536.35679
11.05000 515.38988
11.15000 515.06459
11.25000 494.40224
11.35000 510.09239
11.45000 470.22858
11.55000 487.80591
11.65000 473.59024
11.75000 462.51251
11.85000 464.05519
11.95000 431.52784
12.05000 420.47755
12.15000 424.58166
12.25000 440.47529
12.35000 427.42367
12.45000 400.21020
12.55000 391.24404
12.65000 397.05564
12.75000 374.30420
12.85000 378.08493
12.95000 367.75895
13.05000 363.85177
13.15000 372.70704
13.25000 359.07766
13.35000 339.51276
13.45000 329.51381
13.55000 325.43585
13.65000 327.72955
13.75000 328.59011
13.85000 314.77995
13.95000 309.42599
14.05000 285.20171
14.15000 290.36378
14.25000 289.30949
14.35000 281.69664
14.45000 274.56956
14.55000 274.20140
14.65000 251.41994
14.75000 277.02264
14.85000 265.72483
14.95000 258.60821
15.05000 245.27154
15.15000 232.95974
15.25000 261.31135
15.35000 228.44448
15.45000 223.10669
15.55000 237.46595
15.65000 207.95308
15.75000 224.44905
15.85000 218.34044
15.95000 207.25234
16.05000 207.72983
16.15000 214.73964
16.25000 203.19321
16.35000 202.13654
16.45000 207.46097
16.55000 183.17875
16.65000 185.54125
16.75000 190.87161
16.85000 186.89595
16.95000 163.71372
17.05000 185.40272
17.15000 166.54111
17.25000 174.80194
17.35000 171.59650
17.45000 172.50142
17.55000 167.45216
17.65000 171.34008
17.75000 171.21285
17.85000 167.08028
17.95000 155.42399
18.05000 164.47370
18.15000 153.95973
18.25000 168.23449
18.35000 148.86957
18.45000 152.20062
18.55000 134.54242
18.65000 154.95203
18.75000 138.94916
18.85000 150.37044
18.95000 127.80995
19.05000 130.68743
19.15000 145.85998
19.25000 111.71295
19.35000 123.15934
19.45000 138.40094
19.55000 134.40047
19.65000 134.43608
19.75000 146.88071
19.85000 109.40629
19.95000 122.92429
