0.12500 0.02739
0.37500 0.01613
0.62500 0.01890
0.87500 0.00324
1.12500 0.00460
1.37500 0.00986
1.62500 0.00736
1.87500 0.03272
2.12500 0.02309
2.37500 0.01045
2.62500 0.00447
2.87500 0.01719
3.12500 0.02238
3.37500 0.03592
3.62500 0.01384
3.87500 0.01073
4.12500 0.01210
4.37500 0.01205
4.62500 0.02064
4.87500 0.00971
5.12500 0.00665
5.37500 0.00139
5.62500 0.03127
5.87500 0.01882
6.12500 0.01537
6.37500 0.01666
6.62500 0.02883
6.87500 0.03554
7.12500 0.01671
7.37500 0.01783
7.62500 0.01112
7.87500 0.02174
8.12500 0.01315
8.37500 0.02490
8.62500 0.01710
8.87500 0.02584
9.12500 0.01122
9.37500 0.02297
9.62500 0.01026
9.87500 0.01742
10.12500 0.02836
10.37500 0.01769
10.62500 0.00994
10.87500 0.01423
11.12500 0.02333
11.37500 0.02338
11.62500 0.00594
11.87500 0.01636
12.12500 0.03859
12.37500 0.02841
12.62500 0.04815
12.87500 0.03135
13.12500 0.03369
13.37500 0.00688
13.62500 0.03177
13.87500 0.02755
14.12500 0.02809
14.37500 0.04742
14.62500 0.04866
14.87500 0.09927
15.12500 0.03059
15.37500 0.03473
15.62500 0.04289
15.87500 0.05118
16.12500 0.04274
16.37500 0.05555
16.62500 0.05320
16.87500 0.03812
17.12500 0.01171
17.37500 0.03518
17.62500 0.02750
17.87500 0.07096
18.12500 0.11713
18.37500 0.07859
18.62500 0.05152
18.87500 0.02673
19.12500 0.12155
19.37500 0.11547
19.62500 0.09534
19.87500 0.02545
