0.05000 -1805.23895 -72.63964 552.29962 1464.29823 1215.10602 3072.13881
0.15000 -4465.90142 79.26375 -98.34637 2606.56299 1954.34624 5852.70131
0.25000 -6889.36552 37.83926 340.53308 3023.97663 2667.85597 8354.94311
0.35000 -8297.29927 73.29838 482.59719 3213.56089 2943.80016 9886.86210
0.45000 -9197.02610 139.04633 -17.99281 3315.68293 3110.47072 10795.97936
0.55000 -9730.14696 94.83323 60.22004 3473.20593 3254.65764 11452.42580
0.65000 -10219.77757 40.15740 90.83005 3578.53694 3373.83915 11568.01582
0.75000 -10466.27119 133.26378 236.71919 3581.36417 3513.02932 11604.48377
0.85000 -10633.65925 53.97222 -217.20923 3485.73648 3532.63315 11407.51633
0.95000 -10918.82561 70.44941 -4.38820 3384.48202 3622.54275 11040.37214
1.05000 -10948.07190 155.45357 220.79576 3144.87650 3602.22064 10719.21454
1.15000 -10922.85013 29.40562 239.23819 2948.87022 3574.66072 10358.33808
1.25000 -11047.86219 88.21252 -26.73238 2716.09431 3522.16320 9935.65929
1.35000 -11117.31636 131.24073 -178.78933 2563.00929 3430.75475 9478.76265
1.45000 -11093.69445 93.72169 54.68078 2389.17368 3312.29735 9168.36611
1.55000 -11094.66486 53.64942 207.07729 2210.86412 3239.79428 8693.71745
1.65000 -11038.56816 114.56603 143.07065 2102.38684 3092.63628 8396.53628
1.75000 -11029.33334 50.03276 53.23032 1990.77897 2965.50928 8008.45405
1.85000 -10996.46841 109.94221 40.27141 1886.16758 2853.42553 7602.09925
1.95000 -10911.94236 89.81858 -100.77966 1828.00447 2737.38334 7342.52752
2.05000 -10786.71266 102.37132 -56.18822 1754.91764 2605.31173 7029.12360
2.15000 -10676.96488 116.53832 85.64249 1693.32475 2491.85621 6721.58316
2.25000 -10605.12173 140.62608 -84.77627 1572.98979 2390.43314 6455.31823
2.35000 -10483.83046 161.84217 -35.56977 1544.21926 2270.57609 6199.49850
2.45000 -10324.11624 83.28248 44.92735 1487.09900 2196.01395 5980.78084
2.55000 -10210.33222 130.35490 -3.33990 1414.53109 2094.79774 5679.82403
2.65000 -10081.43689 112.02849 -37.84575 1377.60135 1995.94329 5447.01600
2.75000 -9907.83742 82.99951 -78.05788 1346.97726 1900.74773 5268.71725
2.85000 -9763.37881 101.41282 -154.65816 1275.85314 1811.25619 5038.47440
2.95000 -9588.71262 74.07211 -95.71732 1230.59052 1717.99650 4849.63596
3.05000 -9459.11024 71.62749 -17.80084 1166.18674 1658.05732 4659.88008
3.15000 -9294.60628 75.42799 118.49662 1132.61260 1562.54898 4513.62738
3.25000 -9143.91448 67.05241 -38.41034 1073.11933 1506.87000 4311.29921
3.35000 -8985.33504 23.15930 -57.82149 1037.33269 1419.12876 4183.14035
3.45000 -8840.66940 48.03217 -33.29004 1003.76866 1370.19567 4016.93919
3.55000 -8703.68861 21.16697 35.42527 958.98384 1300.79809 3829.97326
3.65000 -8540.88240 23.74605 -96.87437 921.56465 1233.11431 3721.71051
3.75000 -8411.30375 1.48824 32.17455 863.16105 1181.77994 3590.50290
3.85000 -8293.31421 -5.77558 -85.70696 871.20639 1126.59903 3452.43186
3.95000 -8174.49690 -27.34148 0.83536 821.74086 1086.49927 3299.77830
4.05000 -8056.86446 -69.46331 -157.69575 817.41702 1034.70278 3131.80496
4.15000 -7910.55433 -103.19780 -23.26044 797.34560 967.77459 3034.05860
4.25000 -7817.28291 -96.67157 -99.88100 777.36720 935.46005 2911.72912
4.35000 -7686.53409 -98.31266 -102.21757 763.57425 886.06565 2792.18633
4.45000 -7526.49694 -100.87573 -117.67485 767.25403 821.01476 2720.27792
4.55000 -7417.32623 -93.97932 -112.67594 735.95802 783.43269 2621.83886
4.65000 -7285.50829 -110.85248 -76.22749 715.58604 737.40789 2549.89726
4.75000 -7135.87803 -100.15807 -67.45400 710.42058 709.77839 2460.79676
4.85000 -7028.81145 -109.66067 -31.80801 673.95741 669.75782 2348.03814
4.95000 -6929.81876 -99.52065 -31.63573 666.00810 631.18364 2261.67077
5.05000 -6797.10675 -94.39919 -39.17262 668.22569 599.33480 2185.31579
5.15000 -6685.85891 -89.07643 -69.94981 656.44083 574.16259 2122.33249
5.25000 -6578.38570 -76.25214 -76.68365 648.03860 547.65457 2076.13863
5.35000 -6489.17334 -58.90603 -44.77819 626.39448 519.05954 1985.86982
5.45000 -6376.57471 -53.07158 -43.30038 621.14457 499.73484 1926.52357
5.55000 -6297.61861 -44.14854 -7.19790 602.53107 482.53965 1851.32225
5.65000 -6200.02391 -23.85504 -32.71872 603.29667 458.55274 1801.95088
5.75000 -6117.61060 -23.39346 -24.19513 589.66919 438.37691 1757.35136
5.85000 -6055.43572 -17.77522 11.75617 581.03826 421.07339 1682.81394
5.95000 -5986.62229 -6.40788 14.83504 575.87965 402.98494 1635.41026
6.05000 -5904.54718 2.50836 10.41135 556.37548 379.33274 1604.92472
6.15000 -5851.74861 -1.28225 -15.74664 545.31013 365.20478 1565.64538
6.25000 -5784.36536 8.72529 -8.14413 536.15166 354.84868 1497.65094
6.35000 -5725.57459 11.49366 -10.82404 520.18380 340.15085 1456.07537
6.45000 -5668.16458 14.81878 8.97471 505.18309 331.22830 1407.10791
6.55000 -5615.85978 23.36936 20.90145 484.79542 315.54728 1392.60475
6.65000 -5576.96651 27.95518 -1.74888 459.67362 308.72441 1340.60315
6.75000 -5542.14253 28.94760 21.02413 446.25713 305.05942 1310.89138
6.85000 -5490.64488 33.08073 17.66787 432.18630 294.21486 1276.71252
6.95000 -5451.37057 25.71302 6.44374 394.14145 286.53316 1267.33247
7.05000 -5410.93325 28.54206 -13.15497 388.39436 275.97068 1233.45973
7.15000 -5363.36505 32.89571 8.83430 357.40863 275.76917 1173.10760
7.25000 -5335.56162 28.19722 -11.83160 340.22664 263.43381 1165.64394
7.35000 -5302.20324 37.73560 -0.80547 326.52240 266.28175 1137.01060
7.45000 -5270.71078 33.08021 -3.06823 302.13578 250.06239 1120.49298
7.55000 -5229.30485 37.32449 0.73082 282.80628 246.00278 1090.93896
7.65000 -5206.99318 24.46722 16.16633 277.31658 241.80575 1037.65308
7.75000 -5157.99303 26.42483 30.60941 272.38700 236.34259 1024.64587
7.85000 -5124.40064 22.66769 3.56033 265.48390 229.92114 1018.99617
7.95000 -5076.81604 29.01719 15.26911 262.42082 220.59429 987.55129
8.05000 -5030.83476 29.27079 12.95693 249.91554 214.90816 959.51529
8.15000 -4979.54815 24.13263 0.22104 249.14113 204.76209 935.33142
8.25000 -4931.65084 21.53441 5.23029 234.38363 200.91737 918.12374
8.35000 -4892.16788 23.15302 9.20944 228.28500 199.37063 905.10604
8.45000 -4838.63058 21.01527 22.58320 224.44649 200.62223 882.89738
8.55000 -4796.09449 26.38879 6.59046 224.05416 193.79228 859.91929
8.65000 -4763.80916 19.52272 22.46489 221.20217 185.57673 834.92621
8.75000 -4718.93467 21.77354 -1.04281 219.54715 184.83380 825.70409
8.85000 -4685.90515 17.16531 16.70124 217.82507 176.68766 809.17209
8.95000 -4634.45452 17.00272 23.29454 230.77174 166.10734 800.64496
9.05000 -4594.58776 21.42537 13.16653 217.26223 158.03638 779.03551
9.15000 -4563.48122 15.70466 36.67681 204.51437 156.15090 759.16475
9.25000 -4519.34023 17.36179 20.69886 200.94366 148.00982 749.98647
9.35000 -4484.25822 17.62940 20.98252 202.48146 145.14585 728.40445
9.45000 -4445.87999 13.23970 8.59235 197.73839 138.14725 698.93771
9.55000 -4420.17898 18.14536 22.27907 199.91212 140.58182 699.64831
9.65000 -4380.67720 14.55764 21.57703 191.87380 134.34837 692.74545
9.75000 -4349.56055 10.41754 10.80603 192.12652 127.82925 666.76392
9.85000 -4312.77595 13.54637 -7.00763 185.52181 125.93194 660.23143
9.95000 -4281.93838 19.47088 21.94389 178.14867 118.29779 642.32276
10.05000 -4243.66318 12.62964 -3.22237 175.16931 112.35850 634.68829
10.15000 -4215.20139 15.39968 1.59576 172.95409 109.78817 621.84264
10.25000 -4186.68976 15.11197 18.32960 166.69074 107.04035 597.33348
10.35000 -4155.01917 10.69648 14.15939 156.78315 103.46324 579.69984
10.45000 -4125.51768 14.44027 28.33918 158.48490 96.83400 573.43801
10.55000 -4095.04581 11.47294 7.63863 156.61016 110.68557 577.17747
10.65000 -4063.80508 11.57696 12.41173 148.27273 102.18875 558.82158
10.75000 -4041.22566 12.78645 16.84078 140.51368 95.82202 543.63007
10.85000 -4010.18262 13.89901 5.93535 147.93858 91.81478 552.30086
10.95000 -3974.84869 11.89782 -0.32976 136.11302 94.49560 521.91447
11.05000 -3949.02721 10.17212 -4.25855 136.23064 93.82389 524.12415
11.15000 -3928.94710 11.73968 7.00764 131.03615 93.46530 497.08158
11.25000 -3900.06543 11.02564 -24.60742 130.45575 93.53377 496.43704
11.35000 -3874.82247 8.31128 -6.79278 126.61332 90.86042 484.28024
11.45000 -3843.24274 11.42121 -2.85033 116.91600 86.07786 478.34362
11.55000 -3815.97280 10.25677 -6.05117 119.65966 91.70886 470.20954
11.65000 -3790.72633 14.07549 -16.61103 114.28371 85.22185 454.88343
11.75000 -3759.72997 9.41363 -4.88065 126.48696 90.87007 457.24598
11.85000 -3741.76293 10.45984 -14.49887 105.45421 82.59598 436.50599
11.95000 -3711.28522 8.10953 -16.58208 98.15182 79.68798 432.53941
12.05000 -3687.90404 13.35947 -20.83409 99.62533 78.19815 413.75959
12.15000 -3660.80474 9.92266 -5.19663 99.24116 81.74806 417.48029
12.25000 -3635.41523 7.64720 -12.00356 98.41784 75.07204 398.43583
12.35000 -3613.87819 5.93186 -21.14213 93.64470 75.09016 390.27665
12.45000 -3583.78864 8.07333 -23.07388 92.87085 76.00981 388.25939
12.55000 -3562.79150 9.31054 -24.41475 92.28348 69.76111 373.28117
12.65000 -3533.20844 7.87299 -15.29877 90.61893 71.97681 381.08116
12.75000 -3512.19980 9.95767 -2.31920 89.91687 74.02411 372.12324
12.85000 -3483.48732 9.48867 -6.27677 79.69973 64.53971 358.58744
12.95000 -3462.11528 8.33655 -14.87845 74.79440 67.68132 350.45963
13.05000 -3435.13886 9.87230 -27.03032 81.20356 72.56651 340.83097
13.15000 -3417.57657 8.94340 -14.45183 83.70044 70.00427 334.94647
13.25000 -3392.71412 8.36682 -19.96833 83.64889 72.32963 330.65041
13.35000 -3372.03925 7.16915 -29.06033 76.29104 72.29604 327.18604
13.45000 -3347.03789 7.71247 -4.63162 80.40149 59.68303 313.06366
13.55000 -3322.59391 8.11079 -23.75357 71.19710 61.23478 311.66857
13.65000 -3296.31333 10.56093 -3.82717 75.18987 59.21811 301.47384
13.75000 -3276.91840 7.84002 -6.84288 78.44195 63.82893 288.60517
13.85000 -3252.64179 8.08215 -7.21057 78.46794 58.49288 293.01295
13.95000 -3225.92989 9.29928 -9.24712 79.86283 59.88662 284.87340
14.05000 -3203.66114 7.45115 -10.15643 72.78660 66.71006 278.36260
14.15000 -3177.10584 9.55938 -13.59221 80.88415 68.33075 274.21949
14.25000 -3157.46845 5.17971 -34.92351 69.62176 63.35832 273.63068
14.35000 -3145.24089 9.22110 -11.63070 72.37949 66.29085 258.67220
14.45000 -3119.74212 9.55943 -19.24760 62.56827 62.69432 255.95191
14.55000 -3097.59984 5.37086 -0.57915 58.57465 48.86588 236.14985
14.65000 -3074.82254 4.21219 -14.84784 71.26455 53.37468 240.86315
14.75000 -3053.12535 6.14631 -12.01811 79.08506 61.91106 240.79825
14.85000 -3032.29861 7.65582 -26.25481 73.16886 54.01826 228.99233
14.95000 -3010.68478 5.90479 -16.42711 56.41455 45.84222 223.80069
15.05000 -2991.68521 5.61467 -15.22603 73.38482 57.91155 219.87391
15.15000 -2971.72924 5.40464 -8.79980 65.75065 64.55622 213.05961
15.25000 -2956.17183 9.00397 -28.44006 64.05561 58.38532 211.06597
15.35000 -2934.59867 5.92741 -20.99582 64.01749 58.87986 213.80375
15.45000 -2913.31836 2.23890 -5.84749 61.67317 54.84182 201.27712
15.55000 -2904.11646 7.86875 -3.85144 64.91322 50.96895 192.39581
15.65000 -2876.37632 4.75253 -26.85342 63.95525 55.16883 189.91576
15.75000 -2855.58098 2.67910 -16.77734 43.38605 46.62614 182.29957
15.85000 -2834.63849 9.39768 -15.92810 74.26461 55.31749 195.59542
15.95000 -2818.46412 3.15924 -18.40814 67.24120 64.37292 188.77042
16.05000 -2795.94210 7.18619 -25.23515 51.23940 52.35620 181.75050
16.15000 -2785.26057 3.80544 -25.71916 70.92953 57.64252 172.57475
16.25000 -2761.85722 8.23412 -15.69896 61.66545 49.98568 170.85263
16.35000 -2741.59618 9.21641 -7.77747 60.10568 53.33813 169.21001
16.45000 -2724.11903 2.45060 -15.30907 55.57833 45.10600 160.19175
16.55000 -2703.99812 5.58987 -26.03011 53.86827 51.50840 155.63900
16.65000 -2684.09950 7.30287 -11.61392 63.43023 38.96839 156.25564
16.75000 -2671.64410 9.24794 3.06371 64.66775 61.97009 159.99866
16.85000 -2648.32488 3.91217 2.01613 51.87078 39.51948 153.15541
16.95000 -2629.30224 4.75456 6.29258 49.13988 41.11294 150.24836
17.05000 -2612.48421 4.10674 -2.42526 63.55939 40.99435 144.80199
17.15000 -2601.07830 -0.23781 1.24546 76.12375 66.25053 147.85989
17.25000 -2577.89709 5.59090 1.92586 62.07160 60.03066 149.64428
17.35000 -2564.37501 5.12195 1.60506 52.62637 49.36549 129.56517
17.45000 -2544.07921 0.44188 7.98643 67.83302 60.44389 145.51803
17.55000 -2532.79118 7.07040 1.37576 41.66713 57.11966 130.37540
17.65000 -2519.95036 2.62349 14.68140 52.46548 53.91802 133.80019
17.75000 -2501.59585 3.91676 15.71880 36.96027 34.35919 125.61579
17.85000 -2483.04215 4.39661 7.68272 47.11041 40.31947 136.10975
17.95000 -2469.90219 1.59049 3.13992 45.12945 51.54547 119.05164
18.05000 -2453.56193 4.78104 5.54358 43.54709 34.99119 122.11668
18.15000 -2436.93693 5.75973 7.39302 46.67369 30.51453 120.25844
18.25000 -2422.63640 1.98844 14.00910 62.35625 50.83873 124.08898
18.35000 -2404.17852 4.02364 7.21859 61.01740 42.42038 117.60582
18.45000 -2387.63631 5.77033 12.41897 50.61719 38.24435 109.84683
18.55000 -2376.03466 2.66472 18.05218 55.80359 37.95034 109.92423
18.65000 -2364.42571 7.86619 22.82737 55.94559 46.64850 109.60952
18.75000 -2345.30331 7.55102 10.16819 66.82289 68.50814 113.12961
18.85000 -2333.96766 5.68741 8.69320 67.06562 47.46321 112.95448
18.95000 -2327.52701 10.23977 21.65081 51.22446 41.59587 116.80426
19.05000 -2308.20892 13.18035 13.36412 44.44563 37.15094 111.80984
19.15000 -2294.71535 8.36171 4.69085 37.65185 30.61849 95.71590
19.25000 -2281.33419 9.00280 3.67633 46.90413 41.95157 103.59562
19.35000 -2267.59450 14.67639 -9.11698 54.99968 32.54371 105.90244
19.45000 -2254.64906 10.70854 0.91134 35.63009 32.50477 99.57097
19.55000 -2242.01480 13.35435 -9.69672 56.79434 41.72630 111.41367
19.65000 -2229.36917 8.43519 1.62677 34.76155 40.74074 102.14521
19.75000 -2219.62957 15.32409 -4.52330 44.80912 37.18900 96.72818
19.85000 -2208.07610 11.07611 -12.34583 33.69229 40.33239 97.44911
19.95000 -2193.32953 12.10975 -2.84011 29.17057 50.99904 101.22693
