0.05000 -121728.80834 12681.03104 25466.86158 156896.84894 265477.54725 4846945.25958
0.15000 -236913.39011 2067.19570 -79734.31398 80808.03428 144594.06042 3801576.81217
0.25000 -171354.33969 180.57271 -2667.55938 46856.05954 50803.79903 3051296.63251
0.35000 -122674.43533 223.24330 18942.74182 24551.12577 25045.67071 2392790.01385
0.45000 -94477.96651 63.44960 42811.71102 14946.57566 14452.25021 2135795.11596
0.55000 -75778.63878 264.68806 15038.02582 9942.22554 9447.46471 1892446.61582
0.65000 -63187.56508 74.10473 -5545.05738 7245.28003 6564.58210 1512119.08446
0.75000 -53747.29979 135.13063 -5185.99598 6096.21795 5094.03909 1459699.31200
0.85000 -46641.97703 85.45285 25045.58389 4353.11131 3845.00668 1276624.84038
0.95000 -41008.50446 34.51342 19916.59527 3549.32510 3231.73583 1082816.03647
1.05000 -36690.18839 8.27727 3098.12653 3343.53243 3390.40569 991512.19836
1.15000 -32943.78694 52.00079 -6953.70156 3498.04052 2245.76368 852287.71445
1.25000 -29930.61841 13.11606 6349.15263 2217.10320 1972.16939 763111.73070
1.35000 -27549.69390 16.80841 -5322.82602 1837.51928 1856.73954 685790.94980
1.45000 -25428.11989 43.82852 10309.82134 1715.39525 1394.87839 647585.40913
1.55000 -23527.01889 1.47134 1415.34609 3504.27272 1941.50942 625091.28030
1.65000 -21961.68516 11.31923 -6362.11088 1377.58462 1224.06076 531402.80843
1.75000 -20526.24150 5.87633 -5825.40667 1198.99574 1390.23878 491279.89701
1.85000 -19275.02464 6.98446 -2487.78331 1673.71314 1070.87283 434858.35096
1.95000 -18188.48959 -19.74937 7218.34828 1257.88630 897.69108 412334.47221
2.05000 -17198.89591 -21.43640 3594.14694 1336.92459 1177.09445 389475.31482
2.15000 -16297.68656 -12.25096 3349.33743 1180.57433 896.73662 328046.68501
2.25000 -15497.58729 -10.43696 1621.52765 924.82403 1497.27728 311248.70797
2.35000 -14751.01187 3.51374 3580.01746 898.38375 951.36193 302511.01310
2.45000 -14061.84073 -18.45788 3057.92402 1035.35796 1278.94169 276737.76905
2.55000 -13461.97056 -7.30684 3021.04945 891.69189 917.55706 287386.56206
2.65000 -12955.01664 4.13057 1629.72974 1317.59832 1525.47233 251870.04018
2.75000 -12442.91800 -14.56960 2879.35834 684.12964 756.46801 239927.84727
2.85000 -11957.54188 -1.28228 1794.96205 595.39036 637.29874 231137.42283
2.95000 -11499.21279 -36.89717 730.14705 1293.83715 2413.33143 211511.50329
3.05000 -11133.72508 -12.79651 1568.29059 878.01898 652.42042 206259.98987
3.15000 -10774.82528 -6.91406 2157.66269 814.82618 907.70408 221031.02113
3.25000 -10409.98514 0.10852 411.82991 869.05488 789.84340 183570.59048
3.35000 -10090.58558 -12.28098 -46.74009 1126.13681 880.54730 182542.54744
3.45000 -9696.37965 -3.61518 3386.25223 3878.18703 676.26912 161542.15381
3.55000 -9488.53652 6.29721 -3289.74392 722.83371 695.64211 157599.29554
3.65000 -9239.19593 8.44573 -1820.20469 782.71521 574.37325 142852.77252
3.75000 -9000.78896 14.48451 537.21247 574.40988 603.31569 133361.31706
3.85000 -8821.88756 -6.45992 -1286.41725 1667.28928 820.63403 131157.42271
3.95000 -8603.03317 6.79138 -756.56510 539.18982 514.37708 113286.27409
4.05000 -8425.89194 32.43742 -677.13059 568.03999 2272.67235 116196.38482
4.15000 -8278.87623 2.94146 -3848.94315 568.99701 460.28883 91403.42368
4.25000 -8156.52526 -37.51994 -938.45643 1751.20083 2368.79272 91213.41385
4.35000 -8001.70715 5.76729 2406.38996 600.77825 755.99276 85690.57330
4.45000 -7886.27214 0.95695 -2320.11932 567.64825 532.98201 134393.62375
4.55000 -7772.67484 3.93231 1095.01489 521.32945 401.91523 78152.62986
4.65000 -7687.28126 -16.23523 108.62253 1165.95102 826.48197 72757.00990
4.75000 -7605.83352 -5.03218 -327.39016 742.84129 716.06133 70352.07851
4.85000 -7531.34863 1.00437 304.17665 435.12259 666.18185 66890.50701
4.95000 -7451.92882 7.01704 -5.39669 930.29113 1200.34469 62644.40323
5.05000 -7375.13873 6.45562 -584.60966 462.01334 411.43863 56231.52421
5.15000 -7310.54996 -15.71925 -250.63522 603.60168 1896.13686 60382.99300
5.25000 -7246.12629 5.85731 425.53565 484.93069 584.15732 54105.51617
5.35000 -7182.34092 10.01739 -776.71431 517.57446 538.67693 57544.47688
5.45000 -7126.94586 2.17394 1267.16280 513.98746 515.75578 51453.58744
5.55000 -7064.31396 15.42304 476.23437 543.22215 554.39376 55335.10294
5.65000 -7009.93559 19.97959 6.90332 605.09798 676.69752 47559.86788
5.75000 -6951.01413 -0.58177 30.20789 698.39096 954.24077 43379.88915
5.85000 -6879.11421 -4.91626 97.17662 514.13465 517.33570 44282.40031
5.95000 -6813.22246 7.97351 69.14622 364.59310 353.72408 40325.40300
6.05000 -6745.85866 -2.38507 658.50093 483.43158 344.31210 38617.73009
6.15000 -6698.72456 2.76333 1161.69482 347.14495 311.44629 44156.72202
6.25000 -6634.48662 5.92439 571.94200 316.00064 347.99367 36906.26932
6.35000 -6567.07447 7.31592 -80.39696 410.68458 575.84212 35931.26622
6.45000 -6487.81589 6.22296 -434.52304 466.72573 361.89817 33296.40289
6.55000 -6427.78002 -1.33468 651.48275 364.35346 532.49720 31225.43813
6.65000 -6410.82367 9.59666 82.44340 2859.52649 444.46536 36655.94166
6.75000 -6313.45091 4.69941 236.66643 380.71857 337.79772 32701.28649
6.85000 -6240.45762 14.96660 127.83984 437.03634 375.50549 29827.14328
6.95000 -6177.81629 11.06255 -457.56157 363.22614 295.75542 28153.03187
7.05000 -6123.69809 14.38213 -570.83015 406.42565 445.72088 29871.77268
7.15000 -6055.16485 4.10387 93.85363 374.41106 350.07472 38233.75375
7.25000 -5988.02007 13.55359 -149.30255 443.52551 299.87745 24448.33927
7.35000 -5931.20581 5.27862 74.84412 305.44759 223.46137 27587.69919
7.45000 -5858.05005 7.62982 380.86201 315.46778 207.83884 24733.61967
7.55000 -5797.40310 10.72238 -476.97344 300.86545 346.15655 23037.58240
7.65000 -5738.68977 8.30882 -596.78838 410.72362 344.53383 76815.93668
7.75000 -5671.35279 9.68481 338.58148 494.50897 345.69072 25191.78801
7.85000 -5610.31735 12.92706 -701.53058 355.05109 293.01634 21192.67059
7.95000 -5550.80042 -2.44523 -50.12881 271.03872 335.02143 22463.83986
8.05000 -5503.90978 7.15103 -157.01907 563.61518 304.47624 23827.15965
8.15000 -5436.77353 10.80348 25.73084 399.05509 406.23053 23270.98124
8.25000 -5392.78447 5.51301 -116.89873 233.33139 179.48543 17797.87189
8.35000 -5340.27831 3.83915 243.43150 364.24152 288.49226 30945.87048
8.45000 -5285.09031 5.18729 -249.12036 238.19650 224.20970 18774.15228
8.55000 -5244.52854 4.69199 -735.26974 206.12693 214.56078 18500.09810
8.65000 -5185.32405 5.39194 787.00911 230.83248 202.22975 47521.68697
8.75000 -5132.78838 3.60897 1084.81908 210.36920 279.45645 73514.59390
8.85000 -5084.00490 -0.74068 9.09295 182.23817 244.73726 16999.70052
8.95000 -5029.50933 3.67840 468.35950 172.28856 163.18624 18491.42047
9.05000 -4993.91343 10.21220 68.90814 200.63369 262.59795 16146.84334
9.15000 -4937.82755 -1.48996 -591.37204 277.44646 406.20922 31883.46916
9.25000 -4890.80952 0.45748 282.79882 449.59447 327.28060 15443.14342
9.35000 -4851.71595 -1.80448 26.59759 140.89824 151.20476 14747.63871
9.45000 -4798.16384 0.56493 78.19698 529.05269 386.47201 14864.48661
9.55000 -4763.14898 7.98640 239.48807 162.32449 184.28013 14314.80506
9.65000 -4724.59159 0.74538 -29.54721 242.93260 153.64255 14256.27042
9.75000 -4684.17070 -1.07272 365.56940 244.29077 243.03909 14930.30080
9.85000 -4640.72684 -1.12468 99.61896 192.76938 160.23920 14316.18554
9.95000 -4600.17746 -10.04502 -91.52615 168.11538 261.44717 11918.35720
10.05000 -4559.43195 3.15264 -441.48738 138.80136 149.50769 16905.01286
10.15000 -4513.21695 -1.36895 398.37449 235.76149 179.38169 13389.56118
10.25000 -4478.34799 -5.66575 -138.03547 205.41103 357.40808 13289.46909
10.35000 -4444.72278 -0.58328 -60.57553 207.24469 220.62039 14073.16476
10.45000 -4400.69462 2.23563 152.64556 422.76254 203.33994 12054.71429
10.55000 -4364.18052 -2.53031 -237.51789 159.94700 176.84082 11352.03489
10.65000 -4328.73567 0.69368 144.03918 199.38459 155.51179 12030.01466
10.75000 -4295.65961 0.51740 470.88085 274.99489 195.37859 16147.92445
10.85000 -4247.22496 11.38169 6.64220 458.35926 603.89358 12632.34108
10.95000 -4224.78735 0.82267 -1107.13633 125.64337 144.92482 54531.85678
11.05000 -4193.69973 -3.52915 -79.97548 204.60098 273.04770 10737.46745
11.15000 -4126.93380 -6.50520 239.83244 1263.64137 465.89600 11966.27277
11.25000 -4120.00569 -1.61368 -119.79556 200.66469 198.37457 11106.35321
11.35000 -4090.54840 -4.72920 266.04454 213.17723 152.03607 9130.96828
11.45000 -4045.67027 0.99310 -19.33623 575.95926 250.05146 10230.85188
11.55000 -4021.53907 -3.94298 -144.40404 164.59806 158.37748 9838.44836
11.65000 -3997.44437 1.45740 134.98666 200.06278 245.31197 9745.68596
11.75000 -3972.65772 -2.40678 -67.91522 243.83465 192.79623 11115.10878
11.85000 -3935.44659 5.47554 172.01723 186.18885 325.27350 9989.72106
11.95000 -3913.55038 -11.20825 70.89166 279.54468 262.28616 9516.59578
12.05000 -3866.15930 1.81016 17.41986 134.94286 131.15789 9260.82421
12.15000 -3843.42477 -7.31186 -49.18931 190.24107 183.49711 7778.27251
12.25000 -3812.28524 -0.41133 272.35196 127.41904 123.53863 7754.81044
12.35000 -3784.38213 -5.14989 -124.43017 99.80072 150.31428 7022.01779
12.45000 -3755.42640 -1.32986 -263.65969 111.97694 99.79332 6949.27232
12.55000 -3729.56901 1.95683 311.42543 103.20959 99.49937 9207.92935
12.65000 -3704.60674 0.60789 -271.89555 269.30496 382.52804 7391.57314
12.75000 -3678.51753 -0.15099 375.05348 123.41351 153.36856 6771.67853
12.85000 -3639.76029 -4.24690 7.53030 106.71972 110.96000 6698.46303
12.95000 -3617.32825 -5.42206 -5.66001 153.27310 151.16203 7368.15297
13.05000 -3584.17605 -0.22515 193.88476 182.86393 100.61185 6962.56344
13.15000 -3561.08682 -0.41753 -433.29549 191.89387 186.52563 5784.90604
13.25000 -3536.45763 -0.42166 -7.78139 94.46620 99.56960 6041.80814
13.35000 -3511.28587 4.63258 60.54216 183.10165 129.46581 5574.70451
13.45000 -3478.02923 2.96798 164.56037 149.57056 142.46652 5714.08441
13.55000 -3450.69802 1.22828 109.87312 100.38980 141.41216 4360.23118
13.65000 -3428.85920 4.13326 222.24641 104.69311 113.45640 4995.14103
13.75000 -3400.37461 5.06445 -181.67968 99.28589 97.39968 5022.21698
13.85000 -3371.17651 1.21260 -20.88491 109.40682 130.90821 4531.68475
13.95000 -3345.35513 6.10253 25.71693 126.03143 112.70030 4401.03598
14.05000 -3321.12662 4.79114 -27.24153 141.95057 145.45847 4780.12815
14.15000 -3288.51515 5.39214 -12.96576 110.70432 108.97285 3813.82334
14.25000 -3266.65641 4.95128 -68.03431 118.24317 96.60435 5444.70152
14.35000 -3243.20708 -5.38082 85.10300 188.54099 273.61024 4710.58203
14.45000 -3225.74571 5.62366 -229.51489 102.01272 96.72221 4608.98616
14.55000 -3201.17824 3.83182 63.55273 86.51794 93.64203 3892.94047
14.65000 -3179.55930 0.47656 -74.27663 83.24829 88.83610 4236.82663
14.75000 -3184.10135 -147.07637 -101.83174 1253.73103 4351.42162 4163.39439
14.85000 -3135.44212 4.81369 64.20015 84.87219 99.76705 3502.68548
14.95000 -3102.97712 1.57119 13.27199 83.16984 89.81478 3459.24544
15.05000 -3084.00084 -1.62623 68.97883 86.61032 89.65456 3165.85099
15.15000 -3060.16357 -0.25539 90.45848 93.90413 89.45176 3753.47681
15.25000 -3039.14658 1.29983 -193.39306 99.51589 100.33061 3167.94709
15.35000 -3024.78947 0.52532 -66.95144 97.51609 104.41461 5063.70212
15.45000 -2991.48789 2.81585 35.61979 110.33319 103.12988 3674.07522
15.55000 -2974.77000 2.73190 -49.84990 144.36130 123.16458 2261.95519
15.65000 -2984.42554 -9.54901 -18.65309 918.30795 178.43686 3383.83002
15.75000 -2927.68470 5.85870 53.23622 144.84995 136.32405 3515.65838
15.85000 -2916.48728 1.85649 92.12218 105.49642 92.10681 3638.86946
15.95000 -2896.30517 0.36214 87.48188 81.45474 85.63047 2798.33141
16.05000 -2878.31495 7.50343 34.82538 112.14753 249.26568 2998.74822
16.15000 -2855.05498 1.98872 217.42186 82.69572 90.46650 3295.30634
16.25000 -2833.58477 7.60198 5.49809 100.82572 120.52797 2765.65507
16.35000 -2821.25251 -2.26476 3.56283 79.40094 97.58857 2808.68630
16.45000 -2807.42919 -2.77697 -64.87429 163.05189 86.93427 2433.77947
16.55000 -2774.99705 -2.49331 -40.86424 88.63997 77.92368 1824.28511
16.65000 -2757.17411 -2.88824 55.77797 78.66056 84.42906 1979.54584
16.75000 -2738.42277 -2.48355 -80.63972 111.78968 132.80248 4428.95613
16.85000 -2729.30604 -1.99144 -261.51258 77.91164 78.89542 2564.24939
16.95000 -2708.33401 -4.27566 -66.71100 76.20941 78.34452 2278.57001
17.05000 -2697.86442 -0.11249 199.37051 71.32733 133.29318 3106.66314
17.15000 -2678.32064 -1.73734 54.55176 78.11106 78.89459 2132.81424
17.25000 -2662.25835 -2.02697 207.02882 83.80813 81.77156 2254.10778
17.35000 -2648.52438 -1.71675 216.36521 104.35709 96.73198 2058.96072
17.45000 -2626.64326 -6.00934 -12.64816 88.03593 82.94203 1861.72872
17.55000 -2599.80083 -15.82046 148.29681 180.81159 202.35325 2774.29382
17.65000 -2591.46115 5.34848 107.40095 81.31469 82.81174 2666.29627
17.75000 -2572.16476 3.92831 31.03860 96.34130 97.88261 1965.86341
17.85000 -2553.82070 -6.70262 100.72979 84.14495 103.86340 1845.01295
17.95000 -2546.32313 4.20591 -150.66090 76.27450 74.08583 2702.62297
18.05000 -2521.74798 6.46693 187.59718 74.82009 102.50773 2450.23596
18.15000 -2512.14715 2.55034 63.86053 76.50834 76.40911 1958.62751
18.25000 -2494.71134 -9.01598 -20.71505 127.56356 172.90515 1801.23169
18.35000 -2478.23103 11.01573 211.42223 123.68470 105.82346 3842.80602
18.45000 -2459.30218 5.78846 -54.91371 76.24155 79.21696 1537.73583
18.55000 -2452.23525 3.49336 -97.25892 171.90147 102.75788 2038.00300
18.65000 -2425.02849 -0.11360 20.91867 81.63272 93.83243 1861.19929
18.75000 -2411.63434 2.37790 42.63946 93.87566 91.45731 1856.48448
18.85000 -2399.26914 11.66567 9.45308 78.01425 84.89293 1816.98989
18.95000 -2386.26165 12.18279 40.24700 104.00051 104.86199 1854.11568
19.05000 -2368.82577 8.85273 -250.31345 78.05716 101.92579 2204.23205
19.15000 -2343.09446 8.95914 -315.88708 83.38312 86.55009 2026.60390
19.25000 -2322.86839 -0.02307 -84.19609 107.85304 100.81889 1216.02762
19.35000 -2316.64461 0.33129 38.53092 208.65674 91.53425 1426.43999
19.45000 -2319.19595 -4.90483 1.45858 87.63700 76.67195 2535.09406
19.55000 -2297.97343 -0.50939 -47.30921 83.86905 69.40638 1591.11097
19.65000 -2279.30500 -3.56019 54.98759 80.25355 67.76420 2135.91466
19.75000 -2279.77282 -3.02615 346.99939 83.60467 70.40080 2306.50941
19.85000 -2251.22578 7.22009 33.69993 80.12857 75.59805 2357.27952
19.95000 -2246.34148 -4.77408 -101.70262 73.94789 71.44866 1450.04564
