0.05000 -171.20733 755.11600 22208.44700 3858.72218 2715.23839 454049.15887
0.15000 -4547.35385 -377.08403 -12334.00894 2718.55282 3095.98358 381025.59121
0.25000 -7794.79753 602.68479 86902.62550 3599.53103 4527.76630 595703.44748
0.35000 -8917.71293 21.56646 -14540.74872 2418.91599 2274.86508 493460.51852
0.45000 -9789.59585 -74.21489 8474.38511 3916.30137 2962.02613 464997.58925
0.55000 -10750.24953 -180.51455 -13767.89984 3846.25954 2786.32395 425869.57602
0.65000 -10977.30241 23.44675 -2968.32059 2842.68439 1949.83463 420150.69580
0.75000 -10989.34798 -70.85055 2280.29681 2081.92715 1590.00017 375739.69622
0.85000 -11097.07014 62.20096 -1199.19889 2262.55271 1865.25494 382521.79596
0.95000 -11004.93596 28.33517 8666.52700 2335.94962 2197.15381 381897.71754
1.05000 -10741.80770 -57.28220 6359.96593 2752.37298 1685.24477 467304.90536
1.15000 -10509.12499 -68.87751 -3823.76774 1862.29051 1498.08182 310734.31116
1.25000 -10310.44162 15.05941 -854.20389 1619.01975 1227.57344 316326.80981
1.35000 -10112.29478 -20.14352 -15766.82932 2862.93487 2152.92298 344605.01527
1.45000 -9958.81237 -2.40726 -7012.30076 1569.72548 1363.36495 278490.96763
1.55000 -9771.85877 29.74167 -12286.48431 1695.31252 2003.30502 316075.36666
1.65000 -9545.67978 -41.96046 2687.91354 1402.67078 1519.43838 272721.21766
1.75000 -9384.24447 -30.16017 -4089.97046 1516.64326 1484.31702 236350.60019
1.85000 -9265.26183 -23.48800 -1957.33782 1292.74779 1123.13060 263379.51759
1.95000 -9162.63441 24.15126 4003.67358 1162.41383 1522.22349 246813.65999
2.05000 -9064.23597 38.69012 3830.58536 1187.46007 1143.24451 263098.74235
2.15000 -8920.95669 -25.32762 2120.67305 952.80859 903.52947 190656.25953
2.25000 -8795.68272 -49.49293 1377.03920 1478.31236 1519.08415 215235.92075
2.35000 -8696.83987 -17.88964 -4133.04280 1581.56423 1361.99908 183783.26280
2.45000 -8618.48652 35.02859 5921.18702 992.90896 1043.70084 214238.36027
2.55000 -8480.81765 -4.22607 3981.49038 1069.31523 1056.96448 209069.20783
2.65000 -8474.72969 -43.62456 3161.04345 1179.81108 978.44470 192601.57730
2.75000 -8390.36470 -16.83038 -5075.73229 880.15135 915.82857 199865.99560
2.85000 -8321.70562 -22.65018 3459.52314 1281.01314 920.67527 174070.87298
2.95000 -8177.32135 8.82032 3685.10400 1380.29817 796.14935 183314.34101
3.05000 -8122.40389 -4.65658 2911.54853 988.63551 923.83769 153440.64525
3.15000 -8079.82950 -17.21041 2502.76662 1017.16174 810.05559 151016.27882
3.25000 -8027.30533 -17.34931 -4919.93267 763.45376 833.35075 146942.74321
3.35000 -8003.86338 15.49607 999.89467 848.06432 732.42472 151856.11881
3.45000 -7886.79474 20.53799 -546.01996 802.93460 813.64754 135995.24791
3.55000 -7831.31568 42.00458 7383.63295 778.56931 757.32318 124244.56224
3.65000 -7841.96048 23.77664 3319.53794 731.15156 872.44455 145757.44831
3.75000 -7757.40907 18.53961 7569.17049 720.54904 645.49322 129930.67035
3.85000 -7704.92439 33.37687 1955.36742 792.48446 826.87811 127602.76940
3.95000 -7691.11984 22.22487 -2595.75523 990.33701 606.57347 116938.94331
4.05000 -7593.23533 3.83138 3505.72813 961.31232 697.28236 101205.18951
4.15000 -7537.12854 32.47771 -2855.84756 804.71153 624.94176 112527.77168
4.25000 -7461.13250 24.30346 2926.49945 685.68489 736.90998 108397.95968
4.35000 -7404.44541 2.00364 58.62110 865.84416 541.77332 105165.82645
4.45000 -7315.02061 7.66110 2542.10955 757.63582 552.60805 116627.82046
4.55000 -7291.25984 17.90799 -120.23915 701.15522 726.10509 90683.62061
4.65000 -7238.71507 26.17647 -2886.14894 1309.03766 669.07148 86145.63196
4.75000 -7151.22785 14.47159 404.74148 535.47769 449.49163 97762.38545
4.85000 -7086.47135 14.84366 3959.65634 542.77721 464.83716 87853.68654
4.95000 -7037.17121 -6.28444 -470.61202 568.44970 956.19916 76834.29480
5.05000 -6979.03092 7.41615 1924.11849 523.21630 797.52539 91329.70087
5.15000 -6928.88801 23.49494 -279.36097 699.46302 689.57657 71049.03062
5.25000 -6861.54350 13.13512 3904.21897 629.52411 521.68603 90434.26059
5.35000 -6814.98267 20.90500 288.73100 509.19082 388.33320 69680.44394
5.45000 -6750.89053 22.76432 -947.01586 497.39844 421.32846 66144.15230
5.55000 -6719.70170 11.98026 113.63341 510.73056 427.42910 69417.88762
5.65000 -6659.29486 11.03360 -1879.69934 865.98227 596.34109 74767.84784
5.75000 -6604.50605 12.48840 1732.20378 522.51574 490.29270 60932.62913
5.85000 -6558.61051 18.03995 -602.62919 456.26283 495.87629 57895.87354
5.95000 -6512.69229 1.58812 -3492.06706 391.26803 576.36981 62037.60524
6.05000 -6470.16208 14.44228 -1762.23019 371.36718 332.39182 53540.01506
6.15000 -6418.93068 9.08421 1273.11412 877.62840 605.91528 61903.40511
6.25000 -6410.85029 33.65463 -29.64781 404.20454 358.45947 50821.27387
6.35000 -6352.54340 18.74723 1148.56084 311.03291 347.42221 49954.09344
6.45000 -6296.01667 20.32268 -1237.15182 323.62951 416.18672 61409.90183
6.55000 -6245.17265 23.01140 2876.13249 394.16324 359.51968 55183.61253
6.65000 -6187.00311 10.65850 -624.05618 658.49576 389.22799 44222.14148
6.75000 -6145.31628 9.91328 1254.19608 386.85121 349.44609 55378.64787
6.85000 -6098.53643 -2.53744 616.17541 540.00018 631.81258 41214.68961
6.95000 -6036.92138 6.48604 4189.53465 288.25240 388.06101 60942.88530
7.05000 -5978.49520 2.20398 1602.46633 364.65804 381.73237 48493.05443
7.15000 -5906.76361 19.64901 -451.38508 317.65266 354.62297 62310.17007
7.25000 -5852.64650 15.08554 -628.44145 353.64313 377.48389 58269.19632
7.35000 -5794.67037 9.70764 -664.13870 367.02366 316.63152 35826.11118
7.45000 -5742.30761 2.84767 -1307.88441 349.55367 287.78714 37985.05086
7.55000 -5688.05939 11.73691 -515.17071 273.61840 250.50152 40967.61372
7.65000 -5625.42318 10.64005 239.02731 379.64344 361.56740 43637.16534
7.75000 -5626.44815 19.63216 -333.00697 1495.79557 696.08906 39186.71678
7.85000 -5532.50550 18.75561 -715.28053 306.83313 246.26271 34678.28466
7.95000 -5480.98920 9.34220 -508.08031 250.08736 238.48807 45869.91581
8.05000 -5441.24030 4.48240 -461.22696 218.38312 253.86732 34079.24450
8.15000 -5391.88735 3.45764 -150.67620 324.46211 291.14177 27554.79090
8.25000 -5342.39287 4.88173 -420.36454 266.51479 259.96715 26305.11744
8.35000 -5306.90456 4.42209 -357.53137 356.22945 258.83014 30260.71830
8.45000 -5261.62776 20.52659 470.44968 331.40747 446.59253 22464.18142
8.55000 -5222.98942 17.36320 -349.61911 299.81285 284.16742 26160.81348
8.65000 -5166.41712 16.35594 -333.30092 194.05604 232.32924 23449.27296
8.75000 -5114.76902 9.41595 611.66045 365.04286 307.69968 25122.25057
8.85000 -5079.77580 0.37706 411.80853 314.26225 269.67627 25870.23483
8.95000 -5035.78254 4.64065 -496.29659 379.35722 356.56037 28997.37325
9.05000 -4986.62768 5.72781 250.25028 225.77396 242.84520 22735.01058
9.15000 -4959.51116 5.55760 -1726.16252 277.07752 383.12504 44444.49464
9.25000 -4918.38103 8.21474 -969.07330 214.52868 252.01272 22214.28072
9.35000 -4879.25422 7.17282 44.28277 211.39175 249.97161 19454.25386
9.45000 -4837.80209 -4.75155 -625.91638 251.78438 323.29312 18421.52792
9.55000 -4807.46171 -3.77505 -498.81752 482.01109 338.76350 25885.74853
9.65000 -4763.57688 -1.17086 88.57583 224.78409 227.56911 20046.17786
9.75000 -4729.64472 13.00027 -1107.59955 209.91641 238.19005 20877.73378
9.85000 -4694.03868 4.40690 -405.12919 211.13591 295.27181 17350.48883
9.95000 -4653.01035 -3.21413 -263.73713 207.30599 407.72090 23059.35042
10.05000 -4635.04537 7.90753 -118.13307 207.36165 191.47750 14763.14976
10.15000 -4582.42796 5.07831 584.09448 276.70186 205.18469 18783.95184
10.25000 -4551.00155 10.74376 -599.63914 216.41366 191.05434 20664.25198
10.35000 -4514.71326 9.65968 502.76307 292.64231 188.44838 14001.17102
10.45000 -4492.21501 10.41684 -779.98162 188.66871 174.73755 14426.86978
10.55000 -4442.56632 8.03339 -358.52612 243.12529 242.82572 15906.77066
10.65000 -4418.34277 5.42080 -666.24242 267.53023 175.39755 15632.90618
10.75000 -4389.85810 10.89621 561.54657 206.98779 178.78608 11954.78760
10.85000 -4348.78949 6.15679 -1000.94978 301.99875 439.83581 18836.61539
10.95000 -4321.85101 9.21300 -539.46647 259.92985 295.30500 14387.33824
11.05000 -4283.73610 4.07626 -5.81015 230.55558 169.54478 12937.32517
11.15000 -4259.77868 10.85439 244.67240 197.66095 146.56456 21535.71842
11.25000 -4219.36266 5.51793 49.19728 134.00279 148.99804 15158.97838
11.35000 -4186.54707 6.54178 628.53042 150.60867 168.24217 14174.08928
11.45000 -4151.47995 8.50090 464.74097 180.10351 175.44340 13888.84266
11.55000 -4108.50144 0.31883 224.72971 201.00333 163.33746 16290.15239
11.65000 -4095.23090 9.61897 219.42594 183.99671 163.41295 12405.91422
11.75000 -4047.42561 6.62240 994.75827 181.90667 189.74820 13994.35448
11.85000 -4019.39776 10.10321 187.08023 209.75849 163.47576 8636.45122
11.95000 -3995.26360 1.90856 171.81515 193.36856 178.91666 9839.21213
12.05000 -3965.58797 -3.48535 157.95321 208.33405 237.68727 10400.42569
12.15000 -3935.16244 4.37559 406.63520 146.79661 153.42074 13113.27647
12.25000 -3905.84831 -2.70098 331.78337 137.06957 191.47378 10088.94270
12.35000 -3875.11827 12.55212 -498.41689 231.57260 150.53463 10192.14371
12.45000 -3837.15336 -0.88770 28.53629 195.69684 206.10023 8093.52932
12.55000 -3825.06942 7.33415 -390.73265 147.43779 168.92008 8918.30797
12.65000 -3793.87606 4.31636 -204.04447 163.76585 149.17037 10055.86837
12.75000 -3769.20928 16.55120 89.14587 152.69597 177.08572 7025.01926
12.85000 -3750.22314 2.08479 -313.55568 144.18619 111.09639 7786.90539
12.95000 -3726.68507 3.20815 -374.00935 186.37267 129.16995 13275.51615
13.05000 -3696.07178 9.41845 -508.82164 355.50258 191.09982 8174.13406
13.15000 -3664.12191 2.59376 -234.73305 235.14446 122.97530 8398.28479
13.25000 -3646.85204 10.30712 -76.74641 181.45803 140.87333 9562.60649
13.35000 -3614.92225 -6.48110 276.01259 122.29923 218.58063 7660.26332
13.45000 -3592.67350 -2.23226 -77.50487 115.74201 164.05360 7492.29646
13.55000 -3560.31447 -0.61761 -361.77145 202.81462 267.02568 8148.84555
13.65000 -3548.74232 7.24430 -30.89677 166.20100 176.67792 7017.61339
13.75000 -3515.42360 9.68082 -141.21279 123.39217 93.03321 8629.75420
13.85000 -3493.06430 8.36856 891.20863 133.28988 142.04038 11697.18169
13.95000 -3476.07709 7.08794 184.28614 129.12372 121.34467 5868.65428
14.05000 -3449.45689 7.24333 -357.45130 90.23839 96.53454 7941.66324
14.15000 -3421.33112 2.61293 98.40798 124.43657 91.90146 5789.86971
14.25000 -3393.90145 9.26097 -151.96612 156.85043 168.36027 6396.54240
14.35000 -3370.79504 4.54987 -514.75808 87.57797 73.75416 6375.01473
14.45000 -3344.40244 2.08714 -19.59847 105.34719 114.70472 5391.63207
14.55000 -3317.91697 5.61462 174.11536 88.93366 105.21384 5378.25413
14.65000 -3290.57264 5.51208 -224.80667 131.54552 107.45085 5774.46703
14.75000 -3279.18294 2.03454 -9.35697 145.01288 111.00354 4990.79290
14.85000 -3242.73448 8.89036 320.81957 107.09964 83.78342 8765.92812
14.95000 -3227.12544 3.89062 -186.76545 104.14302 90.70168 5109.44812
15.05000 -3194.66747 7.98302 -165.00830 84.63515 83.20768 6823.86838
15.15000 -3170.41216 2.76420 257.70905 128.38944 116.40974 6396.86182
15.25000 -3161.63338 3.84615 -204.04587 156.13679 124.17657 5122.12850
15.35000 -3129.53446 6.68608 13.36851 109.45557 76.31351 4498.81826
15.45000 -3115.89433 11.23433 137.87077 116.13741 87.32624 3441.25509
15.55000 -3097.83654 -3.34995 -41.73720 190.61801 173.67035 4493.51600
15.65000 -3073.49442 3.22447 182.18760 113.79076 114.01409 5617.11264
15.75000 -3054.94601 13.19714 116.31384 112.02953 103.07583 4427.54306
15.85000 -3033.56851 7.30996 80.64087 82.31334 99.79361 4990.36252
15.95000 -3014.72576 13.89244 41.12195 110.74208 123.49613 3609.06602
16.05000 -2982.19182 -0.03553 379.47070 264.59206 95.71897 6029.22617
16.15000 -2970.64801 1.60909 220.90765 91.69599 88.01291 3363.31567
16.25000 -2962.33293 3.47751 244.09768 109.86636 95.71187 9065.66168
16.35000 -2929.91276 7.20864 -82.54399 70.83470 100.59908 4881.87006
16.45000 -2927.99978 9.58127 -182.22225 122.55805 134.67033 3938.54262
16.55000 -2902.83262 -0.06234 -95.17736 85.10252 85.76335 4742.74817
16.65000 -2890.51998 4.05839 -271.62288 85.93318 77.69016 3581.58746
16.75000 -2867.96949 -1.77368 -95.56385 114.21283 101.69123 3675.20440
16.85000 -2841.93403 8.70608 -315.86339 89.50701 134.54453 3355.19180
16.95000 -2831.22937 0.98174 -128.11768 248.99924 127.61385 3163.50748
17.05000 -2802.94162 2.06869 -132.46138 144.25836 89.17432 3371.33820
17.15000 -2785.40605 3.88939 -8.35876 125.65387 91.94551 2644.83457
17.25000 -2772.37560 7.00898 -524.64480 60.48533 56.08485 5402.35338
17.35000 -2753.90533 2.89816 -197.01838 55.99777 49.06927 3588.88642
17.45000 -2729.83150 2.00402 -485.91331 76.40224 58.22909 5498.35095
17.55000 -2714.02669 5.33781 346.72543 69.25570 64.84415 4189.04726
17.65000 -2698.41948 7.16161 -245.70016 77.44984 77.39589 2684.65504
17.75000 -2680.76559 1.09388 26.25835 68.11821 74.34444 4852.50893
17.85000 -2662.59235 4.40526 -203.51727 83.60102 134.11397 2998.09398
17.95000 -2637.79144 1.03241 -149.69691 126.57591 122.33466 3019.14223
18.05000 -2623.05834 5.64087 -314.53533 62.83788 116.54752 2411.21826
18.15000 -2612.32250 -0.46420 83.45766 62.72183 54.52658 2545.46894
18.25000 -2580.83177 -1.02006 -85.21642 85.42201 64.12747 2568.36437
18.35000 -2568.60676 -5.56929 -84.37758 68.42896 83.98442 1632.03991
18.45000 -2555.09826 2.88188 -67.30366 64.15636 57.00435 2715.56814
18.55000 -2555.31465 12.78762 -64.19259 173.97608 103.01603 2539.74866
18.65000 -2516.19531 -3.12250 -265.15871 89.54787 64.90268 2231.95850
18.75000 -2504.32041 -1.60767 -261.16636 51.68031 45.12661 2470.34009
18.85000 -2495.34756 9.99641 91.24581 69.95521 80.47026 2556.50852
18.95000 -2475.53486 3.52243 -109.15525 103.41875 56.14504 2028.77639
19.05000 -2463.39938 8.57003 45.11752 59.94240 145.74102 1682.54970
19.15000 -2452.94049 3.86874 58.11181 95.76253 111.11148 2472.18336
19.25000 -2427.36916 0.14109 -90.70467 72.39618 94.77776 1734.06079
19.35000 -2418.42163 10.88749 -222.86316 88.95098 93.23885 1731.42333
19.45000 -2426.68806 0.63762 13.88353 142.89970 115.67904 1986.29708
19.55000 -2402.06445 1.26156 141.21748 60.48222 46.03211 1668.94123
19.65000 -2391.41955 -1.17304 112.83753 77.28218 69.75342 1366.34841
19.75000 -2372.45833 -1.86169 30.86967 58.84545 64.17656 1663.08246
19.85000 -2356.84715 1.45552 -0.46811 47.65515 50.23216 2153.72072
19.95000 -2354.22321 -6.15308 -71.11831 127.83009 58.99308 1981.60745
