0.05000 4440.51223
0.15000 6566.12373
0.25000 8219.90578
0.35000 8688.12369
0.45000 9203.30396
0.55000 9284.36652
0.65000 9108.11056
0.75000 9147.01962
0.85000 9022.61716
0.95000 8840.44154
1.05000 8602.92100
1.15000 8257.15889
1.25000 7989.16215
1.35000 7783.16712
1.45000 7469.15070
1.55000 7296.59283
1.65000 7030.57783
1.75000 6762.12340
1.85000 6651.20571
1.95000 6377.63821
2.05000 6059.48263
2.15000 5952.15712
2.25000 5699.68265
2.35000 5587.50186
2.45000 5418.24609
2.55000 5221.62259
2.65000 5027.72865
2.75000 4887.63097
2.85000 4847.03437
2.95000 4653.73250
3.05000 4454.25774
3.15000 4463.07942
3.25000 4226.44345
3.35000 4198.67592
3.45000 4090.25485
3.55000 3918.20140
3.65000 3815.58672
3.75000 3670.14130
3.85000 3605.65171
3.95000 3467.92116
4.05000 3371.29804
4.15000 3236.82022
4.25000 3087.48190
4.35000 3019.63391
4.45000 2923.78714
4.55000 2786.65511
4.65000 2721.43553
4.75000 2657.57914
4.85000 2585.08861
4.95000 2480.64894
5.05000 2425.48715
5.15000 2347.56008
5.25000 2268.34428
5.35000 2236.64822
5.45000 2119.70254
5.55000 2091.14544
5.65000 2025.52009
5.75000 1935.52261
5.85000 1902.16742
5.95000 1762.74464
6.05000 1718.76967
6.15000 1652.09097
6.25000 1595.72823
6.35000 1535.19673
6.45000 1472.85253
6.55000 1436.04191
6.65000 1360.26966
6.75000 1323.93677
6.85000 1290.86879
6.95000 1248.33363
7.05000 1203.94056
7.15000 1171.68187
7.25000 1144.40466
7.35000 1108.54368
7.45000 1088.95557
7.55000 1068.59835
7.65000 1049.08805
7.75000 1003.19201
7.85000 994.76159
7.95000 966.28455
8.05000 951.63415
8.15000 907.88312
8.25000 917.07206
8.35000 894.76211
8.45000 860.44764
8.55000 861.34330
8.65000 839.72287
8.75000 818.59223
8.85000 798.40724
8.95000 774.09854
9.05000 768.67161
9.15000 726.92890
9.25000 723.60058
9.35000 698.05304
9.45000 681.85009
9.55000 675.80571
9.65000 650.62548
9.75000 643.10402
9.85000 633.64968
9.95000 619.21781
10.05000 587.26826
10.15000 591.80287
10.25000 575.15292
10.35000 552.64364
10.45000 546.80689
10.55000 534.69040
10.65000 527.61968
10.75000 507.36780
10.85000 491.72172
10.95000 482.58578
11.05000 484.87851
11.15000 459.54836
11.25000 458.17970
11.35000 452.33109
11.45000 446.62304
11.55000 436.05910
11.65000 429.81569
11.75000 415.19472
11.85000 410.34757
11.95000 409.97946
12.05000 404.83575
12.15000 388.69947
12.25000 367.54602
12.35000 363.98208
12.45000 368.83436
12.55000 358.61140
12.65000 350.74611
12.75000 331.54764
12.85000 323.52586
12.95000 330.92260
13.05000 319.50746
13.15000 316.08411
13.25000 303.05213
13.35000 308.29755
13.45000 307.25826
13.55000 298.81885
13.65000 292.97137
13.75000 305.83675
13.85000 280.07724
13.95000 278.12971
14.05000 271.12327
14.15000 275.44795
14.25000 267.77183
14.35000 263.36709
14.45000 255.49191
14.55000 261.53136
14.65000 248.25696
14.75000 244.68532
14.85000 245.49101
14.95000 241.01454
15.05000 241.42684
15.15000 233.42108
15.25000 235.61415
15.35000 237.83987
15.45000 224.93793
15.55000 234.35061
15.65000 217.72253
15.75000 225.67913
15.85000 219.77717
15.95000 220.34306
16.05000 210.00441
16.15000 207.45713
16.25000 191.18753
16.35000 203.66821
16.45000 187.67124
16.55000 188.02241
16.65000 190.61927
16.75000 189.58983
16.85000 185.07299
16.95000 177.07625
17.05000 175.17174
17.15000 179.11991
17.25000 171.70917
17.35000 163.90119
17.45000 162.40283
17.55000 168.40543
17.65000 153.94101
17.75000 152.61702
17.85000 150.43555
17.95000 145.86452
18.05000 142.22500
18.15000 142.01130
18.25000 140.31136
18.35000 135.55087
18.45000 142.01953
18.55000 128.67586
18.65000 136.99919
18.75000 125.31080
18.85000 131.06941
18.95000 125.92603
19.05000 115.18328
19.15000 121.15949
19.25000 121.15988
19.35000 112.84511
19.45000 110.68940
19.55000 109.01800
19.65000 107.88950
19.75000 108.55034
19.85000 100.90365
19.95000 108.53499
