0.05000 -483.50457 206.06763 186.07739 809.09390 710.20517 1408.50005
0.15000 -1807.50135 -31.20407 -724.72853 1357.22927 1072.17327 3209.65567
0.25000 -2982.36793 -106.40076 -110.37653 1718.80841 1335.05676 4408.31911
0.35000 -4126.26404 27.75542 -159.42026 1852.40027 1550.07575 5617.92398
0.45000 -5032.53848 -19.99743 -29.85346 2202.74791 1754.70186 6542.61642
0.55000 -5610.45175 10.40731 -71.59436 2262.77298 1948.72573 7114.92826
0.65000 -6117.75283 86.74146 -306.04398 2394.96228 2105.26425 7584.51711
0.75000 -6459.11556 53.71981 73.19206 2378.01551 2247.74245 7977.26458
0.85000 -6808.55770 -7.03503 61.03183 2376.05594 2405.23992 7842.69303
0.95000 -7074.99466 71.44776 -96.45832 2397.77448 2493.14611 8051.86553
1.05000 -7385.91395 16.33258 131.19774 2368.02812 2592.91565 7763.71470
1.15000 -7524.91029 6.75823 -108.43379 2334.16254 2630.18114 7796.27380
1.25000 -7612.20482 70.33126 10.27541 2333.24339 2674.85244 7646.20543
1.35000 -7663.03949 40.97582 121.01522 2221.05037 2730.74272 7511.40377
1.45000 -7778.21895 92.47714 177.54701 2183.26911 2714.85413 7288.53740
1.55000 -7863.98501 45.01067 87.39359 2067.47264 2750.19313 7079.77825
1.65000 -7852.02736 48.93153 119.51846 1983.64476 2755.07333 6972.67280
1.75000 -7864.79447 112.62040 61.32457 1884.17963 2794.07932 6726.81665
1.85000 -7917.47203 -55.46223 -27.35755 1840.77580 2791.25290 6473.67619
1.95000 -7907.52205 33.03783 -102.05986 1738.97886 2782.90479 6380.11897
2.05000 -7937.96496 82.16374 -57.61481 1637.14581 2787.01760 6137.00466
2.15000 -7894.44667 31.67842 67.51430 1563.48547 2754.59703 6042.49889
2.25000 -7818.68221 78.11420 162.56468 1473.57187 2752.33728 5930.78380
2.35000 -7839.13633 81.28659 91.61665 1335.86303 2746.63504 5705.30745
2.45000 -7843.08585 -5.50580 -35.47862 1309.86431 2702.05226 5607.09213
2.55000 -7778.26386 16.15754 -21.75952 1234.21426 2660.19238 5468.81556
2.65000 -7713.59733 38.20305 -106.92024 1160.26640 2634.86396 5276.74591
2.75000 -7634.59367 15.79758 108.46746 1160.24140 2578.30378 5215.77184
2.85000 -7604.32659 -50.35162 64.70497 1051.63078 2541.65823 5053.51622
2.95000 -7551.00006 -88.38796 41.07930 991.49018 2527.34659 4952.98525
3.05000 -7483.07849 -43.58813 69.28889 958.46687 2497.98656 4856.92993
3.15000 -7434.19415 -16.30606 41.36270 876.75075 2419.06613 4659.87921
3.25000 -7336.60306 -70.65327 26.95788 846.48075 2386.00669 4607.84300
3.35000 -7257.71371 -17.37612 -60.69836 806.91648 2320.30120 4599.25802
3.45000 -7272.50774 -7.57803 -39.98841 748.56151 2308.38581 4401.56625
3.55000 -7226.91541 38.01808 -45.12523 702.79508 2250.80308 4342.38888
3.65000 -7193.16034 -41.95948 -61.29979 681.25975 2229.96555 4196.17950
3.75000 -7138.28612 -31.78992 -15.89963 685.81215 2169.39606 4090.39787
3.85000 -7084.77398 -65.46943 24.57728 650.82406 2091.06990 3988.25282
3.95000 -7023.85297 8.28683 -38.76439 628.30839 2055.05673 3895.01477
4.05000 -6957.74798 -55.35133 -12.49964 622.14154 1976.83824 3820.84607
4.15000 -6885.81054 0.99097 -59.46474 625.78678 1921.16967 3723.40915
4.25000 -6861.51767 -77.99904 -118.33488 590.10878 1884.80398 3625.51712
4.35000 -6793.95857 -56.38039 -50.90928 591.93312 1842.65939 3554.20096
4.45000 -6740.31623 -69.63823 6.54104 582.67586 1755.97722 3437.90240
4.55000 -6696.09652 -68.67300 -51.68505 590.02122 1704.06160 3376.81771
4.65000 -6667.54181 -29.76905 -100.70628 607.44133 1670.47756 3261.80499
4.75000 -6615.23621 -46.60289 -64.16241 629.63584 1593.43894 3188.05185
4.85000 -6564.69203 -36.20692 -148.65036 646.78997 1532.45300 3133.57675
4.95000 -6516.77367 -33.51060 -82.75749 646.39539 1495.85346 3017.02604
5.05000 -6470.23093 -16.00306 -11.34804 662.14995 1433.02752 2918.09566
5.15000 -6413.04658 -21.43280 -8.86898 679.35426 1374.68153 2890.33172
5.25000 -6355.84957 -21.24143 -12.41038 667.85790 1316.96403 2805.29055
5.35000 -6309.82142 -23.01883 -120.20728 670.48477 1265.80744 2719.72130
5.45000 -6296.07422 -6.67039 -64.59287 681.70115 1228.06485 2623.87165
5.55000 -6267.35541 26.40828 -92.96247 697.76488 1180.47709 2583.78137
5.65000 -6251.06732 23.50064 -49.92091 701.90090 1130.96652 2521.43126
5.75000 -6204.57026 27.83296 -86.26068 694.20304 1088.28325 2474.93024
5.85000 -6181.71881 22.91545 -74.41741 697.29766 1039.19517 2391.28070
5.95000 -6160.02188 8.01401 -52.72080 699.88209 996.08962 2351.31799
6.05000 -6168.03558 29.81716 -32.66682 724.38880 957.63352 2289.45996
6.15000 -6139.04503 38.68770 -44.78451 744.40828 912.81353 2199.55613
6.25000 -6136.66030 1.45971 -46.93992 758.28845 869.84918 2178.26515
6.35000 -6120.93039 -6.68918 -41.84893 787.04767 823.89197 2096.09762
6.45000 -6081.40881 8.87113 1.40702 790.56204 788.26499 2031.30270
6.55000 -6061.84380 4.63902 -58.40045 792.89220 751.38798 1940.48170
6.65000 -6024.78915 -1.80600 12.26656 801.62125 698.93684 1897.21705
6.75000 -5959.41758 17.96246 -0.94641 775.15179 657.42823 1833.31576
6.85000 -5923.71027 3.81203 17.93694 748.77352 620.72952 1777.76822
6.95000 -5886.74871 9.28085 38.83639 726.61020 593.32522 1757.98570
7.05000 -5843.62303 4.28703 8.55824 699.06029 565.89429 1703.85181
7.15000 -5795.17494 -2.19571 35.81632 671.43182 532.63807 1635.62941
7.25000 -5743.58278 -3.45763 59.11819 646.77000 502.60725 1609.95928
7.35000 -5679.89167 9.54834 36.25374 611.40162 478.89743 1565.66076
7.45000 -5637.59826 -3.13242 48.56423 585.73927 456.11036 1515.59480
7.55000 -5598.85659 12.63612 35.05637 574.04399 434.29193 1489.82608
7.65000 -5535.32565 6.83836 57.65359 537.82236 418.37460 1447.86351
7.75000 -5492.63709 3.86502 13.61980 519.97312 393.89601 1396.33412
7.85000 -5447.89288 15.21454 36.95347 502.09212 375.16147 1357.97430
7.95000 -5416.16574 22.59354 37.74701 489.92025 360.08134 1343.55517
8.05000 -5358.04708 12.87149 28.06905 462.72544 342.40058 1306.39398
8.15000 -5316.07110 12.56964 -18.29579 449.86141 329.03346 1277.63879
8.25000 -5256.67467 20.16592 2.07182 430.92046 310.31805 1231.14232
8.35000 -5210.89537 18.38648 47.81457 400.06138 301.29594 1227.19911
8.45000 -5172.32203 15.98861 28.84025 398.87440 286.87063 1190.02158
8.55000 -5136.96051 21.19588 18.91389 379.62411 273.60816 1170.47353
8.65000 -5094.16507 14.34546 -0.13582 360.93871 266.96331 1122.79637
8.75000 -5047.25065 21.90430 35.82586 344.61011 257.01521 1104.45017
8.85000 -5011.53141 15.98143 32.21151 328.80970 245.19793 1093.63357
8.95000 -4977.85598 18.66652 7.08779 322.63945 241.19105 1051.62906
9.05000 -4938.49349 14.33458 16.84285 300.41158 230.68115 1035.28647
9.15000 -4906.24292 16.28372 -11.28855 287.92045 224.89974 1010.88843
9.25000 -4870.17590 21.83030 -14.45692 288.60387 217.40956 986.31639
9.35000 -4833.39065 13.77367 13.19858 272.25701 211.78817 975.17844
9.45000 -4808.37090 12.19432 11.47066 268.24840 205.54051 945.03782
9.55000 -4764.42539 15.40638 5.90507 259.35122 197.90337 928.84021
9.65000 -4732.17994 6.03598 -2.83672 246.51740 190.67182 914.61222
9.75000 -4702.24651 10.71043 -2.86570 251.33555 182.23914 890.83432
9.85000 -4663.55950 4.42557 31.16467 234.75146 180.83988 853.69512
9.95000 -4615.40826 7.81110 20.04494 227.05686 174.80050 852.26149
10.05000 -4588.08573 3.70983 -11.00015 225.57569 170.84240 832.66113
10.15000 -4551.09475 8.18833 9.22190 220.41254 161.34254 810.99741
10.25000 -4516.93161 1.69867 1.53311 217.45629 160.33063 812.58240
10.35000 -4481.40483 4.53317 11.82653 208.85023 155.31474 779.07097
10.45000 -4446.54243 1.51837 19.33975 201.33220 152.06074 756.28858
10.55000 -4400.19102 6.23446 -4.06732 197.11177 149.12615 748.14844
10.65000 -4365.67403 3.69579 17.81187 196.33211 143.27792 733.30902
10.75000 -4343.74155 1.79511 24.33585 196.51471 143.81342 717.50331
10.85000 -4300.46916 3.21585 12.41497 192.58494 139.67094 710.39721
10.95000 -4268.49074 0.67557 -6.41006 188.15114 140.42758 688.72794
11.05000 -4235.36249 4.28368 13.86374 179.36018 131.47175 684.90927
11.15000 -4198.41943 3.84809 -3.74867 175.61737 129.04393 654.22813
11.25000 -4163.27309 2.35759 27.24455 173.21700 124.03927 642.99034
11.35000 -4132.38929 0.86141 19.20512 176.61008 130.80509 632.38369
11.45000 -4098.54872 4.45393 -1.84802 171.76588 119.68847 625.36717
11.55000 -4070.13811 7.45863 27.39672 170.25653 117.25166 601.17159
11.65000 -4038.18430 2.13967 30.43649 169.22065 114.06554 600.83646
11.75000 -4002.58896 -1.93468 22.30401 166.94275 108.08716 587.54500
11.85000 -3970.10332 6.72234 43.48315 165.58987 111.06997 567.19568
11.95000 -3940.05038 5.97932 19.47334 159.93969 103.88099 556.68756
12.05000 -3906.78506 1.68265 3.74464 159.52394 100.60015 558.73549
12.15000 -3880.06572 4.07803 22.07787 154.88741 98.17539 536.21552
12.25000 -3845.33791 5.82926 20.88665 156.55637 102.55464 533.38575
12.35000 -3810.59854 5.64076 10.35208 147.95791 101.54791 512.02297
12.45000 -3784.64756 -0.78997 22.97937 146.85160 94.88349 515.07425
12.55000 -3758.59670 2.71063 25.26493 144.53704 91.43181 502.75375
12.65000 -3728.31966 4.06521 10.34120 147.78046 94.98318 502.14409
12.75000 -3697.26622 4.86097 14.67431 138.44526 86.16641 484.57256
12.85000 -3661.23785 5.89268 23.43342 142.92499 92.20717 473.26832
12.95000 -3641.03759 1.30168 19.64809 137.93783 85.14801 471.05945
13.05000 -3613.82114 6.80991 -4.77952 133.89009 83.79935 465.99524
13.15000 -3578.50188 5.24728 7.47063 131.89550 78.23467 448.76704
13.25000 -3554.97145 1.34758 11.95033 126.51590 79.35087 435.65021
13.35000 -3536.89710 5.27480 -10.14644 125.05011 85.91751 428.75562
13.45000 -3508.61171 5.26761 25.67641 120.95804 75.63118 426.67720
13.55000 -3487.48514 3.78153 20.25577 118.42550 82.20599 428.29645
13.65000 -3457.63985 4.00626 5.93678 118.09807 75.62763 415.56985
13.75000 -3436.18502 4.54009 -3.54623 118.96915 74.16780 406.60789
13.85000 -3409.75992 2.70293 17.74670 116.05041 75.34871 408.36881
13.95000 -3386.20381 1.34067 -9.99339 114.91123 72.08284 403.73730
14.05000 -3358.12304 3.90363 9.32845 111.51076 71.67937 396.99800
14.15000 -3334.09678 1.81272 -4.58617 107.86838 70.59943 392.54697
14.25000 -3312.76947 4.39358 9.08524 107.51848 65.58684 388.41377
14.35000 -3290.28468 4.70875 8.14429 99.69373 74.24956 376.98745
14.45000 -3273.42575 3.24127 3.60903 101.84681 67.04970 362.44614
14.55000 -3253.80574 3.62662 -0.27981 102.98629 63.67976 364.58281
14.65000 -3226.11681 3.64880 16.54195 99.91963 76.14269 358.96144
14.75000 -3211.18919 4.54448 9.91735 93.63888 58.90971 342.05690
14.85000 -3183.94826 4.18471 16.89898 86.52210 54.98239 344.87902
14.95000 -3166.07247 4.66529 4.88015 88.71213 66.75479 346.61205
15.05000 -3142.46900 4.50269 2.23888 78.56944 55.20482 337.99440
15.15000 -3124.20482 0.38427 13.38286 77.98166 58.67368 326.76303
15.25000 -3103.04425 1.49395 16.76607 84.00517 62.97499 328.46990
15.35000 -3085.15635 3.97295 7.61444 76.87084 57.54380 307.37660
15.45000 -3063.56592 2.73661 25.02478 80.43871 58.97006 317.81350
15.55000 -3039.73907 4.76021 18.59903 79.24606 66.54315 315.16324
15.65000 -3021.68570 3.68763 16.05322 71.82658 51.53786 303.08414
15.75000 -3001.59651 4.06586 15.68510 69.04607 54.33112 295.81182
15.85000 -2986.09808 2.68603 14.04710 71.16386 58.07623 289.44731
15.95000 -2958.97655 0.10503 13.78319 69.91533 59.77161 292.18691
16.05000 -2942.62368 1.62130 -5.83748 61.49207 52.22753 283.56721
16.15000 -2924.01131 4.09081 18.43376 63.80292 55.45379 271.77261
16.25000 -2909.59333 2.09821 20.58693 59.54109 54.83451 279.80807
16.35000 -2892.51630 4.28173 16.74233 62.57448 55.80856 271.38010
16.45000 -2876.66086 5.49389 43.11060 67.78822 54.20151 267.00657
16.55000 -2856.77796 2.09995 38.23825 64.60619 56.20127 258.76028
16.65000 -2845.81487 1.82991 21.05250 62.31791 54.17350 250.37960
16.75000 -2824.74121 0.51489 20.12421 58.13564 44.77696 246.72538
16.85000 -2806.83875 5.48467 10.33997 63.99431 60.97724 244.73665
16.95000 -2788.96536 1.43474 31.08480 56.36882 47.77641 240.52750
17.05000 -2772.51002 2.96026 9.21212 49.73404 49.29794 238.23528
17.15000 -2757.21329 2.69244 21.19871 48.91043 50.64313 234.15200
17.25000 -2740.98554 2.44192 18.52731 53.07326 54.24049 221.80100
17.35000 -2724.48754 1.85912 16.29035 51.66911 43.45037 223.44651
17.45000 -2706.53315 2.26183 20.09589 56.80864 48.23947 218.00297
17.55000 -2689.04233 1.44374 22.64300 60.80845 44.39110 219.98857
17.65000 -2674.38442 0.71308 24.43179 50.76310 46.00830 214.82087
17.75000 -2656.59238 3.41396 19.67362 59.65526 58.92269 213.67323
17.85000 -2643.34162 3.23729 17.52338 55.48586 47.10171 199.95335
17.95000 -2628.25513 2.99740 8.84163 57.32465 51.63748 199.57717
18.05000 -2611.29676 -0.29240 17.72059 51.70031 48.12318 200.15910
18.15000 -2594.63952 3.45423 9.75748 47.70673 51.47103 196.91168
18.25000 -2578.74575 -0.68106 24.75400 66.43599 47.44612 198.03228
18.35000 -2566.45398 2.89425 9.45652 49.37191 44.58860 185.37458
18.45000 -2547.66324 3.35818 15.61460 49.92102 43.98747 182.01119
18.55000 -2529.85867 1.23854 7.92744 54.62324 41.01857 184.93227
18.65000 -2519.09385 2.86102 23.90291 49.14246 50.47774 183.45377
18.75000 -2501.86936 0.01676 15.03828 47.96858 42.82286 174.02425
18.85000 -2491.21657 -1.11981 19.38158 40.19697 50.53196 169.74907
18.95000 -2469.70376 2.40790 19.66242 56.67054 49.05355 172.76281
19.05000 -2458.12386 2.18709 12.15720 49.59249 36.37853 176.82510
19.15000 -2442.95727 2.05586 16.77982 47.48480 41.58549 167.91553
19.25000 -2429.66337 2.61964 20.53476 41.10304 39.27112 165.82133
19.35000 -2414.22722 0.48261 31.22145 46.32367 45.59927 165.19321
19.45000 -2400.72203 5.50087 27.33405 53.18683 49.37143 157.11584
19.55000 -2390.56516 1.86560 34.35494 49.10653 54.07117 157.22127
19.65000 -2378.98813 1.58926 22.05184 45.75226 64.36871 155.50991
19.75000 -2364.26299 3.71479 29.89813 51.13299 47.73546 145.69980
19.85000 -2344.87169 -1.86733 21.97976 57.91118 47.61367 143.62361
19.95000 -2335.85278 0.82432 30.62848 46.72785 41.06440 148.67145
