0.12500 0.02161
0.37500 0.03792
0.62500 0.07321
0.87500 0.13186
1.12500 0.18998
1.37500 0.22690
1.62500 0.26566
1.87500 0.30914
2.12500 0.33703
2.37500 0.38818
2.62500 0.40589
2.87500 0.43242
3.12500 0.45459
3.37500 0.49810
3.62500 0.49882
3.87500 0.52492
4.12500 0.54924
4.37500 0.57323
4.62500 0.58252
4.87500 0.58055
5.12500 0.58270
5.37500 0.57247
5.62500 0.58178
5.87500 0.58025
6.12500 0.54819
6.37500 0.52283
6.62500 0.51127
6.87500 0.48080
7.12500 0.45341
7.37500 0.41473
7.62500 0.36701
7.87500 0.35045
8.12500 0.31568
8.37500 0.29156
8.62500 0.27092
8.87500 0.25829
9.12500 0.20812
9.37500 0.21522
9.62500 0.16858
9.87500 0.11374
10.12500 0.09920
10.37500 0.07371
10.62500 0.06919
10.87500 0.04887
11.12500 0.05321
11.37500 0.03706
11.62500 0.02948
11.87500 0.06294
12.12500 0.05093
12.37500 0.02548
12.62500 0.04840
12.87500 0.04274
13.12500 0.08867
13.37500 0.08490
13.62500 0.06212
13.87500 0.10113
14.12500 0.04910
14.37500 0.05837
14.62500 0.04823
14.87500 0.06987
15.12500 0.06636
15.37500 0.07343
15.62500 0.06315
15.87500 0.05332
16.12500 0.08148
16.37500 0.03014
16.62500 0.04075
16.87500 0.12401
17.12500 0.12011
17.37500 0.14305
17.62500 0.16239
17.87500 0.18301
18.12500 0.20796
18.37500 0.17845
18.62500 0.18505
18.87500 0.24834
19.12500 0.24793
19.37500 0.21429
19.62500 0.28806
19.87500 0.26392
