0.2 -0.10298 17.89234 0.04011 71.22704 71.30884 70.06283
0.6 0.87308 40.10443 0.09455 68.57089 68.81291 66.18433
1.0 1.06912 62.54271 -0.4228 65.44985 65.50835 62.8664
1.4 0.71405 82.5213 0.38729 61.89819 61.87334 59.55262
1.8 0.4978 98.24711 -1.04493 59.57374 59.06013 56.66069
2.2 0.82634 112.57564 -0.70027 56.41699 55.65782 54.3871
2.6 0.54722 124.32692 -0.46536 54.20084 52.34307 51.43988
3.0 0.40504 134.33176 -0.59233 52.62202 50.11791 49.49621
3.4 0.57594 143.64701 -0.37875 50.09934 47.77767 47.51772
3.8 0.70188 151.84017 0.15748 48.65032 45.67089 44.93856
4.2 0.26928 159.4196 0.19699 46.43944 43.08534 42.74714
4.6 0.30176 165.79446 -0.354 44.64405 40.06672 40.58821
5.0 0.42616 171.52438 0.10217 43.19626 37.78166 39.00824
5.4 0.65395 176.34738 0.16752 41.10727 36.34002 37.26724
5.8 0.58274 181.50777 0.09451 39.83476 34.55403 35.62789
6.2 0.27231 185.9381 0.23695 38.42056 32.85535 34.17571
6.6 -0.36775 188.73623 0.55326 36.92655 30.73501 32.65256
7.0 0.24611 191.10405 0.4458 36.10826 29.10043 31.42479
7.4 0.13598 193.86354 0.5967 34.67974 28.3516 29.96531
7.8 -0.47087 196.66064 0.68616 32.99097 26.84408 28.45396
8.2 -0.20573 199.60798 0.85856 31.94189 25.28831 27.19682
8.6 -0.1272 201.61369 0.56679 31.03161 24.39931 25.91109
9.0 -0.33461 202.58038 0.19778 29.82841 23.2476 25.03562
9.4 0.31604 203.60848 -0.22599 28.91113 22.47874 24.1888
9.8 -0.28413 204.25727 -0.03572 27.67614 21.85362 22.89643
10.2 0.19347 206.00615 0.1589 26.90046 21.04522 22.19296
10.6 0.29493 207.55988 0.46023 25.62857 20.53745 21.37376
11.0 0.52678 208.30785 0.75616 24.76688 19.36359 20.44469
11.4 0.72901 208.4076 0.56532 24.18431 18.46921 19.77141
11.8 1.0306 209.01244 0.45807 23.72046 18.15404 18.77494
12.2 0.17915 209.80056 -0.00534 22.65066 18.10902 18.09038
12.6 0.68601 211.01075 -0.53317 22.04434 17.4175 17.54191
13.0 1.09245 210.79497 -0.63621 21.33096 16.20919 16.7099
13.4 0.21426 210.78442 -0.91575 20.86052 15.37536 16.34591
13.8 0.37559 210.96087 -0.74534 20.039 14.68821 15.8006
14.2 -0.05896 211.53345 -0.28756 19.28506 15.28811 14.89068
14.6 0.73595 212.76377 -0.15654 18.29765 14.53795 14.48437
15.0 1.44556 213.38843 0.26294 17.48557 13.40893 13.88236
15.4 1.30108 212.85598 -0.0761 17.16514 12.83597 13.47961
15.8 1.0965 212.32767 -0.7692 16.7228 12.25281 13.01174
16.2 0.28689 212.00174 -0.9713 16.87168 11.9035 12.63681
16.6 -0.83478 211.38276 -0.93499 15.88002 11.65374 12.54379
17.0 -0.52255 211.99927 -0.34881 15.50724 11.50925 11.95331
17.4 0.36909 212.11834 -0.33009 14.7051 11.09145 11.55383
17.8 0.55622 211.96816 -0.29087 13.9891 10.85469 10.99838
18.2 0.82204 212.03088 0.271 13.49567 10.95381 10.58551
18.6 1.50175 212.20183 0.5647 13.33322 10.70963 10.26215
19.0 1.52296 213.20461 0.67129 13.22514 10.17542 10.19521
19.4 1.90308 212.54685 1.58061 12.79171 9.40169 9.90544
19.8 1.01218 211.88148 1.26365 12.50143 8.76768 9.54309
