0.125 -0.000 0.000 0.001
0.375 -0.001 -0.002 0.033
0.625 -0.006 -0.005 0.185
0.875 -0.005 0.004 0.519
1.125 -0.003 -0.013 1.074
1.375 0.007 -0.009 1.840
1.625 0.000 -0.030 2.829
1.875 0.024 0.000 3.932
2.125 -0.004 -0.042 5.125
2.375 -0.027 -0.023 6.453
2.625 -0.005 -0.063 7.724
2.875 0.037 -0.063 9.140
3.125 0.002 -0.053 10.230
3.375 -0.003 -0.107 11.934
3.625 0.015 -0.091 13.536
3.875 0.006 -0.160 14.769
4.125 -0.009 -0.093 16.174
4.375 -0.002 -0.046 17.317
4.625 -0.037 -0.060 18.389
4.875 0.005 -0.113 19.150
5.125 -0.027 -0.102 20.372
5.375 -0.022 -0.115 21.321
5.625 -0.041 -0.088 21.991
5.875 0.030 -0.072 22.675
6.125 -0.028 -0.094 23.818
6.375 -0.055 -0.099 24.309
6.625 -0.143 -0.122 24.625
6.875 -0.086 -0.088 25.123
7.125 -0.028 -0.103 25.777
7.375 -0.070 -0.132 26.713
7.625 -0.046 -0.112 27.288
7.875 -0.072 -0.153 27.447
8.125 -0.054 -0.101 27.320
8.375 -0.039 -0.051 27.003
8.625 -0.053 -0.100 26.786
8.875 -0.033 -0.098 26.266
9.125 -0.067 -0.105 25.528
9.375 -0.091 -0.092 25.401
9.625 -0.086 -0.104 25.166
9.875 -0.092 -0.068 25.239
10.125 -0.074 -0.090 25.977
10.375 -0.062 -0.126 25.896
10.625 -0.059 -0.118 25.799
10.875 -0.074 -0.142 25.524
11.125 -0.089 -0.134 24.392
11.375 -0.031 -0.131 22.788
11.625 -0.014 -0.101 21.364
11.875 0.010 -0.080 20.199
12.125 -0.013 -0.061 19.227
12.375 0.034 -0.106 18.683
12.625 0.038 -0.115 18.687
12.875 0.060 -0.091 19.281
13.125 0.062 -0.090 20.418
13.375 0.041 -0.075 19.835
13.625 0.084 -0.096 19.181
13.875 0.083 -0.068 18.041
14.125 0.069 -0.082 17.227
14.375 0.051 -0.043 15.697
14.625 0.057 -0.044 14.454
14.875 0.065 -0.062 13.726
