0.12500 0.01190
0.37500 0.05647
0.62500 0.10506
0.87500 0.16412
1.12500 0.21413
1.37500 0.25591
1.62500 0.27065
1.87500 0.29747
2.12500 0.32248
2.37500 0.35226
2.62500 0.36448
2.87500 0.39072
3.12500 0.40116
3.37500 0.41926
3.62500 0.42993
3.87500 0.41096
4.12500 0.39889
4.37500 0.38438
4.62500 0.36100
4.87500 0.32484
5.12500 0.27105
5.37500 0.20167
5.62500 0.15244
5.87500 0.08665
6.12500 0.05259
6.37500 0.03442
6.62500 0.04570
6.87500 0.05220
7.12500 0.05480
7.37500 0.06054
7.62500 0.05480
7.87500 0.05020
8.12500 0.04006
8.37500 0.04319
8.62500 0.01711
8.87500 0.02556
9.12500 0.02964
9.37500 0.03239
9.62500 0.03428
9.87500 0.06085
10.12500 0.05204
10.37500 0.05793
10.62500 0.05839
10.87500 0.05267
11.12500 0.06865
11.37500 0.07166
11.62500 0.06307
11.87500 0.06814
12.12500 0.04699
12.37500 0.03675
12.62500 0.04236
12.87500 0.05457
13.12500 0.09095
13.37500 0.09029
13.62500 0.10438
13.87500 0.11008
14.12500 0.11126
14.37500 0.11261
14.62500 0.09782
14.87500 0.09295
