0.125 -0.001 0.000 0.002
0.375 -0.001 0.002 0.047
0.625 0.004 0.002 0.224
0.875 -0.004 0.005 0.602
1.125 -0.002 -0.042 1.237
1.375 0.007 -0.028 1.973
1.625 -0.020 -0.008 2.767
1.875 -0.015 -0.022 3.760
2.125 0.020 -0.008 4.685
2.375 -0.012 -0.012 5.787
2.625 -0.035 -0.051 7.050
2.875 -0.023 -0.043 8.681
3.125 -0.023 -0.018 10.437
3.375 -0.078 -0.017 12.107
3.625 -0.048 -0.046 13.553
3.875 -0.045 -0.080 15.068
4.125 0.020 -0.006 16.199
4.375 -0.004 0.010 17.411
4.625 -0.094 -0.010 18.507
4.875 -0.025 -0.013 19.505
5.125 -0.002 0.056 20.940
5.375 -0.069 0.040 22.220
5.625 -0.074 0.042 22.865
5.875 -0.085 0.053 23.880
6.125 -0.036 0.058 24.340
6.375 -0.018 0.003 24.841
6.625 -0.027 0.084 24.781
6.875 -0.081 0.026 25.139
7.125 -0.075 0.057 25.428
7.375 -0.068 0.036 25.661
7.625 -0.102 0.078 25.813
7.875 -0.091 0.022 26.119
8.125 -0.092 0.088 26.021
8.375 -0.086 0.052 25.757
8.625 -0.087 -0.010 25.966
8.875 -0.110 0.042 25.792
9.125 -0.095 0.044 25.691
9.375 -0.071 0.062 26.368
9.625 -0.053 0.023 25.476
9.875 -0.054 0.079 25.046
10.125 -0.103 0.070 24.456
10.375 -0.065 0.059 23.459
10.625 -0.088 0.053 23.285
10.875 -0.113 0.064 22.723
11.125 -0.115 0.036 22.206
11.375 -0.104 0.009 21.925
11.625 -0.085 0.054 21.171
11.875 -0.072 0.030 21.631
12.125 -0.062 -0.009 21.167
12.375 -0.065 -0.028 20.160
12.625 -0.057 0.050 19.852
12.875 -0.079 -0.015 18.771
13.125 -0.042 0.002 18.665
13.375 -0.049 -0.032 17.755
13.625 0.002 -0.011 15.706
13.875 -0.022 -0.006 15.087
14.125 -0.010 -0.028 15.128
14.375 0.010 0.002 14.360
14.625 -0.012 -0.014 13.696
14.875 0.013 0.012 13.386
