0.120000 -2.562500
0.380000 -1.740810
0.620000 -1.576280
0.880000 -1.449810
1.120000 -1.198310
1.380000 -1.515380
1.620000 -1.408350
1.880000 -1.346100
2.120000 -1.340070
2.380000 -1.287710
2.620000 -1.306420
2.880000 -1.134660
3.120000 -1.132410
3.380000 -0.973870
3.620000 -1.003390
3.880000 -1.184060
4.120000 -1.178740
4.380000 -0.987680
4.620000 -0.945700
4.880000 -1.349920
5.120000 -1.181330
5.380000 -0.885700
5.620000 -2.046020
5.880000 -1.265230
6.120000 -1.059190
6.380000 -1.051470
6.620000 -1.382410
6.880000 0.659990
7.120000 1.237580
7.380000 -0.136200
7.620000 -0.062150
7.880000 0.773960
8.120000 2.659400
8.380000 0.612100
8.620000 0.617940
8.880000 1.190720
9.120000 -0.203930
9.380000 -0.425940
9.620000 -0.249380
9.880000 -0.052140
10.120000 -0.709110
10.380000 -1.349260
10.620000 -2.149590
10.880000 -2.020010
11.120000 3.006740
11.380000 -2.881930
11.620000 2.248620
11.880000 2.316180
12.120000 3.014740
12.380000 2.899760
12.620000 2.307890
12.880000 1.637470
13.120000 -2.787420
13.380000 -2.942630
13.620000 -1.607670
13.880000 0.382930
14.120000 -0.545830
14.380000 3.109260
14.620000 -0.868320
14.880000 -1.001710
