0.120000 2.380820
0.380000 1.860580
0.620000 1.827010
0.880000 1.855350
1.120000 1.822580
1.380000 1.822300
1.620000 1.834720
1.880000 1.816780
2.120000 1.806290
2.380000 1.805710
2.620000 1.833150
2.880000 1.848600
3.120000 1.845210
3.380000 1.834400
3.620000 1.831720
3.880000 1.865080
4.120000 1.847610
4.380000 1.853470
4.620000 1.849780
4.880000 1.839810
5.120000 1.873680
5.380000 1.869030
5.620000 1.855160
5.880000 1.871020
6.120000 1.890230
6.380000 1.893640
6.620000 1.897710
6.880000 1.874700
7.120000 1.898060
7.380000 1.917250
7.620000 1.915410
7.880000 1.877950
8.120000 1.887090
8.380000 1.890370
8.620000 1.862360
8.880000 1.884200
9.120000 1.855760
9.380000 1.867960
9.620000 1.840130
9.880000 1.841920
10.120000 1.822970
10.380000 1.744070
10.620000 1.759120
10.880000 1.638890
11.120000 1.442450
11.380000 1.303380
11.620000 1.599330
11.880000 0.806640
12.120000 -1.531650
12.380000 -2.572560
12.620000 -2.119140
12.880000 -1.389240
13.120000 -2.290680
13.380000 -1.429740
13.620000 -1.506170
13.880000 2.491810
14.120000 1.860290
14.380000 1.667790
14.620000 1.705790
14.880000 1.742920
