0.120000 -2.114530
0.380000 -1.346880
0.620000 -1.111260
0.880000 -1.214260
1.120000 -1.187140
1.380000 -1.230130
1.620000 -1.205410
1.880000 -1.153810
2.120000 -1.213630
2.380000 -1.236040
2.620000 -1.221310
2.880000 -1.221040
3.120000 -1.116790
3.380000 -1.117500
3.620000 -1.095910
3.880000 -1.094580
4.120000 -1.092860
4.380000 -1.148630
4.620000 -1.148020
4.880000 -1.140290
5.120000 -1.328990
5.380000 -1.269010
5.620000 -1.400100
5.880000 -1.478990
6.120000 -1.556620
6.380000 -1.802900
6.620000 -1.756710
6.880000 -2.064950
7.120000 -1.775530
7.380000 -2.066300
7.620000 -2.097260
7.880000 -2.150670
8.120000 -2.336110
8.380000 -2.860570
8.620000 -3.074020
8.880000 2.939770
9.120000 2.583510
9.380000 2.059050
9.620000 2.079600
9.880000 1.545940
10.120000 1.426600
10.380000 1.769640
10.620000 2.629010
10.880000 1.504030
11.120000 2.198710
11.380000 2.344130
11.620000 2.521430
11.880000 -3.058540
12.120000 2.978560
12.380000 2.322650
12.620000 2.644660
12.880000 -2.998870
13.120000 2.796190
13.380000 2.682740
13.620000 3.014110
13.880000 -3.030150
14.120000 1.887180
14.380000 2.515980
14.620000 2.616820
14.880000 2.064720
15.120000 2.324030
15.380000 2.066300
15.620000 0.903100
15.880000 1.500090
16.120000 0.989360
16.380000 0.343750
16.620000 1.061760
16.880000 1.400560
17.120000 0.872580
17.380000 1.011530
17.620000 0.452990
17.880000 0.723670
18.120000 1.401610
18.380000 0.092300
18.620000 -0.778950
18.880000 -0.527500
19.120000 -2.104320
19.380000 -1.433680
19.620000 -1.572370
19.880000 -2.159480
