0.05000 -2169.07250 863.17263 121258.48015 423.73198 2086.73000 110119.41257
0.15000 184.78197 -707.68307 -601336.47849 2517.52032 2844.14015 2932000.43903
0.25000 -928.09775 -273.82375 -86886.33258 2867.75202 2173.80190 397018.98016
0.35000 -340.46869 279.40727 -5783.09714 2647.22690 2675.03118 1011753.90743
0.45000 -497.55208 -124.09912 -81720.51423 2536.39849 2824.83711 1134302.02500
0.55000 -573.16610 71.40531 29771.36150 2366.61520 2789.94722 1399014.27104
0.65000 -612.89477 -339.35719 27629.80592 2308.45487 2869.54392 818317.98365
0.75000 -915.14994 -84.87406 -163211.75725 2110.35261 2791.99443 2125791.00653
0.85000 -1152.85615 75.30295 24070.23389 2108.58207 2694.96838 983046.93282
0.95000 -1491.27078 111.03216 18544.26769 1907.15198 2588.63496 973839.76384
1.05000 -1616.63458 48.96501 -21245.65812 1804.04201 2664.96759 1238803.87594
1.15000 -1839.77330 138.44710 94384.90475 1626.82076 2581.34942 1912349.85899
1.25000 -2326.99884 -64.22737 -73031.23918 1323.48459 2461.50930 1624197.37048
1.35000 -2531.63285 -13.17300 137802.89787 1041.56850 2344.16331 1759751.76755
1.45000 -2893.71973 -45.99168 28667.16657 998.81986 2265.04554 1612745.60403
1.55000 -3086.21493 -73.32442 -40886.19213 747.14787 2160.37425 1319662.70346
1.65000 -3213.22970 39.14509 107319.97636 732.37368 2089.73665 1677099.23121
1.75000 -3406.56203 -136.42170 -46414.39856 583.72929 1945.33768 1283614.91763
1.85000 -3480.95272 -70.78850 -10625.86120 574.63632 1883.98466 1498187.03431
1.95000 -3594.69385 19.46420 -112515.27263 569.07183 1789.81213 1961134.00758
2.05000 -3633.01594 35.36966 -15350.24388 420.52056 1714.94241 1729697.96411
2.15000 -3733.39627 -19.43775 75604.68710 545.83812 1577.57594 2125165.15526
2.25000 -3789.84531 -11.67216 -21329.65586 500.22773 1552.93349 1870997.34773
2.35000 -3827.82995 -23.26746 -12967.33045 443.06801 1443.78215 1788316.15003
2.45000 -3888.18813 21.94322 43910.17747 412.88474 1390.07782 1875108.81006
2.55000 -3877.74958 -16.43441 -16717.90238 488.15389 1364.64553 1808432.31406
2.65000 -3889.15122 -8.08477 57429.99070 349.23211 1301.15912 2067736.66766
2.75000 -3900.27794 -7.25093 136372.28083 309.39723 1220.95151 2144198.05418
2.85000 -3899.15303 -6.88772 -2376.09820 385.68815 1227.49362 1961403.63487
2.95000 -3922.76974 -38.61401 26282.15692 451.56094 1168.92131 2268760.30225
3.05000 -3920.86935 39.38537 -73547.02827 369.35219 1131.13296 2046402.53845
3.15000 -3915.31306 -6.27560 -53094.79990 315.20645 1075.62646 2013020.65691
3.25000 -3918.25486 -35.09157 -96849.03230 393.19244 1049.81861 2039515.68549
3.35000 -3900.22071 -5.72755 52320.51860 277.05146 999.40022 2276710.15578
3.45000 -3911.63112 -7.74010 101414.01889 351.71719 990.27781 2253039.89525
3.55000 -3902.97719 25.40271 -56497.33173 303.61216 936.70244 2355497.63997
3.65000 -3904.63741 27.52954 -50844.95817 358.74658 906.31336 2036777.48970
3.75000 -3889.82709 -20.30782 13145.83424 357.87150 916.36459 2008562.28641
3.85000 -3890.42934 -25.52636 -79586.39370 241.23008 846.85616 2521233.93332
3.95000 -3881.34463 35.62322 108600.81306 293.48704 830.42314 2221731.53818
4.05000 -3870.11931 14.37077 -11857.64282 367.69846 801.83194 2361705.52544
4.15000 -3866.33552 21.66389 2410.43698 308.32084 836.03279 1879754.39119
4.25000 -3850.46418 12.12474 -6494.35894 303.23740 794.37467 2250843.69767
4.35000 -3846.63161 -6.96384 3495.83962 300.33796 744.00809 2403421.03682
4.45000 -3825.94723 -19.58882 -35385.79167 261.56005 752.16065 2146745.88676
4.55000 -3821.71946 17.90760 -32823.96379 319.01219 708.18055 1978572.07847
4.65000 -3806.31723 1.41348 4343.31964 314.10937 703.11571 2186102.74519
4.75000 -3792.16536 9.26778 39170.28899 317.27239 675.38329 2161065.04676
4.85000 -3774.98625 -5.14854 36785.66546 282.08240 643.64839 2192288.85057
4.95000 -3765.44328 -5.18497 -31278.20817 321.51871 651.47336 2538431.32401
5.05000 -3736.29188 -7.06859 71269.92569 243.54956 645.35911 2171566.98455
5.15000 -3725.55447 -2.59310 -58141.79700 294.11272 638.66273 2029872.00862
5.25000 -3706.12253 -9.56057 19725.07372 238.24610 629.41642 2104083.01140
5.35000 -3691.83444 9.97271 7025.15194 264.78373 573.92489 2248362.64271
5.45000 -3672.73944 -15.09810 -339.55135 271.25351 568.85491 2199414.04696
5.55000 -3668.54799 4.08603 17501.63690 232.42599 582.93795 2157572.09906
5.65000 -3647.40045 3.12671 -41965.06220 230.42574 552.56935 2119896.55478
5.75000 -3638.62310 -13.36763 76970.30179 278.67436 526.21728 2284603.42663
5.85000 -3616.69000 6.26580 -18835.66398 239.31665 516.46889 2145768.38319
5.95000 -3607.46733 5.96667 -39492.73815 232.59261 505.71362 2253233.37410
6.05000 -3593.72121 -0.45889 48466.19913 236.63870 507.83606 2187525.35596
6.15000 -3570.92512 -5.23073 30309.36354 228.60792 492.01532 2253008.25702
6.25000 -3562.87413 -13.13483 -24950.42843 288.00177 482.02688 2223406.63102
6.35000 -3546.24393 2.78108 -3710.39665 232.47056 460.65426 2339387.34884
6.45000 -3526.78549 -7.97794 40362.37834 256.13593 463.67940 2130444.58986
6.55000 -3508.17052 -2.24820 19011.92315 233.35291 464.84166 2217710.54368
6.65000 -3488.02243 9.00646 -45604.74980 234.91611 456.52027 2461822.03151
6.75000 -3467.30797 7.21372 13322.76176 222.94565 445.95799 2375634.59778
6.85000 -3458.70157 -0.91917 18395.60981 199.26289 430.69537 2037656.19785
6.95000 -3434.95353 10.62560 -60367.14905 277.04587 415.65178 2108683.73542
7.05000 -3418.05898 -10.20358 38969.03298 203.38874 403.39201 2415007.52983
7.15000 -3408.16618 -14.30320 -16634.21673 198.86366 403.86798 2240185.75817
7.25000 -3383.39492 8.62913 -69707.43223 248.60942 407.56315 2314649.81962
7.35000 -3373.94499 -6.96352 57988.72612 217.69700 379.76307 2125315.30607
7.45000 -3359.18080 1.99796 112353.41715 264.64979 396.86053 2059983.75010
7.55000 -3336.19085 0.80995 8182.71279 201.06153 367.53361 2369591.28866
7.65000 -3326.15259 1.59282 81344.53958 186.68435 380.85353 2463485.01781
7.75000 -3299.99218 8.07099 -80552.48708 174.67764 381.94959 2414694.72353
7.85000 -3291.59901 -3.71743 -4090.03215 172.84506 350.62310 2408585.25992
7.95000 -3266.13296 -2.62633 -60135.58247 185.35838 337.01242 2429812.87906
8.05000 -3260.35223 -0.56704 8220.48676 266.87826 351.40845 2143226.40047
8.15000 -3232.77049 5.23336 74078.77370 230.10823 351.99549 2122644.62534
8.25000 -3226.54614 -1.31954 -42672.67308 176.84723 341.67791 2389915.11013
8.35000 -3203.94652 -5.84541 22881.33541 162.63322 313.32132 2152909.28545
8.45000 -3187.93810 -5.86705 -103180.75024 191.74192 312.10552 2034450.04098
8.55000 -3171.24136 7.46790 -59756.57839 192.23289 307.53150 2411413.69662
8.65000 -3155.76362 8.16744 22399.48087 189.02902 315.10276 2226768.12376
8.75000 -3131.70490 -7.84379 2746.07688 177.92450 302.97504 2354951.93763
8.85000 -3116.70276 -9.44239 -6495.06272 186.58380 309.17920 2321744.24589
8.95000 -3095.20217 0.68664 2780.56945 209.48333 301.90379 2178637.05388
9.05000 -3084.03266 5.96214 58992.97283 194.74210 288.70567 2029311.35690
9.15000 -3064.76687 -1.59261 -5323.22439 218.13511 291.87627 2079966.85579
9.25000 -3051.54376 -5.05860 27425.45608 210.74092 293.61959 2071999.89514
9.35000 -3033.54396 -0.20409 110029.82605 173.75959 278.06425 2308734.16371
9.45000 -3014.23551 -0.96813 27548.55358 175.10041 274.17267 2186577.19684
9.55000 -3002.63327 2.88496 -25011.98362 163.34100 278.79733 2160628.18173
9.65000 -2991.62995 2.90080 -44765.74613 168.26528 291.88428 2026637.16475
9.75000 -2966.97805 -2.17091 11900.96770 158.09853 292.32854 2384192.01700
9.85000 -2952.25338 -2.82129 55381.29981 150.85349 292.23221 2359483.82290
9.95000 -2939.14663 2.44300 48628.73888 209.83451 270.19659 2268607.56948
10.05000 -2917.11865 -9.38174 3586.49318 158.81325 254.44608 2092001.64722
10.15000 -2906.68752 -6.14488 -36396.71108 137.73435 235.78713 2121740.61958
10.25000 -2894.47476 5.32773 -16939.36053 161.73712 235.76517 2048069.44338
10.35000 -2876.57893 1.10307 -11138.55620 178.09105 231.10065 2336840.14790
10.45000 -2862.53182 1.16678 -17133.76842 146.21555 236.58175 2133261.88190
10.55000 -2845.40578 6.62042 34610.00370 216.88979 246.76899 2261422.63890
10.65000 -2828.61706 -4.42530 76642.84794 185.65013 247.97558 2078318.01397
10.75000 -2817.31462 -3.05214 13900.23094 152.65437 220.69298 2003198.64341
10.85000 -2797.75894 6.83302 1685.94693 157.31651 233.21238 2206969.26581
10.95000 -2789.93751 -4.34478 5589.94661 143.01100 249.81966 2129359.40175
11.05000 -2769.64852 1.68624 58064.28025 152.09586 215.77040 2406904.82304
11.15000 -2753.99817 1.25629 4079.43393 132.81250 206.61090 2077048.07984
11.25000 -2744.01749 4.80936 -14119.39140 132.37129 214.37021 2225990.35759
11.35000 -2727.70517 -0.33205 36283.51911 159.88961 219.48673 2121309.23367
11.45000 -2709.05830 -1.73134 58551.81888 153.83435 202.93443 2123200.07158
11.55000 -2703.58491 -7.83315 -70794.42123 150.01247 202.15702 2180905.07678
11.65000 -2682.59155 -0.70257 16944.11861 124.61646 246.75452 2037731.59547
11.75000 -2675.27880 8.66002 34579.32976 143.87263 193.32952 2172882.81221
11.85000 -2661.07739 -5.73198 -5823.59337 134.46877 195.68142 2254039.45159
11.95000 -2641.33459 1.79147 20932.94285 137.15490 203.70460 1852602.72493
12.05000 -2630.31948 -4.59561 73174.33167 120.57718 179.17538 2271575.92873
12.15000 -2617.63934 4.15807 -26968.26635 185.83023 193.06643 2215819.00668
12.25000 -2603.18744 3.79083 15918.26079 182.93593 203.58453 2013505.88622
12.35000 -2595.73226 0.39595 39894.62945 137.63629 183.98088 2270771.18680
12.45000 -2582.03704 3.09456 8381.40908 124.14564 182.31634 1937701.62993
12.55000 -2563.41164 -2.90762 -35502.34052 147.25014 230.23895 2051718.94511
12.65000 -2557.44085 2.64367 -37417.26952 132.44548 228.79802 2010286.25557
12.75000 -2538.39250 4.56715 -7404.56255 176.68832 193.71907 2019916.27760
12.85000 -2533.17990 0.66888 44950.18519 200.18385 185.07472 2083349.20568
12.95000 -2515.91310 4.19433 25834.64407 120.94656 175.20903 2084577.39544
13.05000 -2504.34226 -4.73569 -6055.64935 189.27240 186.05011 2162035.18880
13.15000 -2490.68677 -0.33749 42824.87802 143.11125 216.00211 1948932.16113
13.25000 -2477.94603 -2.71183 -51916.16468 142.81380 162.29255 2141393.94685
13.35000 -2470.33088 -0.01848 8584.80274 125.02750 166.87981 2001973.04640
13.45000 -2457.17187 -0.52391 -30815.08245 179.74348 177.42746 1866037.94203
13.55000 -2444.20028 2.52932 39726.12534 174.24158 151.33129 1923762.71414
13.65000 -2433.29710 -4.33005 12996.23760 120.30600 150.90479 1994237.87662
13.75000 -2419.06398 -4.57671 -13432.94250 100.36789 146.58228 2133445.93209
13.85000 -2410.65757 2.39499 1461.51352 102.55113 140.64695 2079069.23882
13.95000 -2398.41640 -1.79372 -58678.68640 122.60583 147.25307 2113428.07769
14.05000 -2385.37710 2.33214 15711.96986 110.60002 145.25543 1936632.90014
14.15000 -2373.20955 -3.01034 6116.95520 120.68930 204.53153 2038648.04008
14.25000 -2361.71547 -0.62408 64628.47621 120.99199 164.80312 2002557.91279
14.35000 -2352.33508 1.27749 -21492.53949 128.68120 141.01424 2049206.88151
14.45000 -2339.24449 -0.14916 -21616.92353 109.92220 171.53044 1940914.12355
14.55000 -2326.65944 2.79201 71769.55178 105.94156 145.83722 1925240.12047
14.65000 -2318.20412 1.05340 3920.90314 96.16475 136.39620 1956243.69119
14.75000 -2309.50315 -2.92075 7.21919 121.53282 189.21771 2059166.63982
14.85000 -2299.30728 1.94629 6336.08546 146.75482 158.91059 1974501.84020
14.95000 -2284.00025 1.40224 14671.76694 126.96844 177.95505 1906774.80823
15.05000 -2273.45665 1.59405 131.81475 105.37002 130.24590 2012748.44732
15.15000 -2267.17182 -0.85841 57505.80882 111.31220 129.40817 1897838.01119
15.25000 -2258.56511 -1.61665 -2299.09923 101.42717 137.68918 1876947.60462
15.35000 -2242.92707 -2.40166 -57846.17802 103.91160 153.15560 1983305.41102
15.45000 -2234.51351 0.79866 15768.42452 98.76767 121.80969 1781631.46532
15.55000 -2221.88928 -1.48696 -19136.90129 112.23080 134.38825 1975718.80348
15.65000 -2214.34902 -3.43369 -29783.17706 99.60540 123.04740 1972093.46206
15.75000 -2203.31490 -2.16178 36440.14424 86.64445 124.49096 1958890.31715
15.85000 -2192.96664 0.60327 -554.09930 98.08514 113.90302 2027856.10455
15.95000 -2184.25254 0.35136 -7829.04490 102.28577 117.79843 1870209.74675
16.05000 -2173.51074 4.00415 -28711.72103 126.19892 161.21695 2077981.18562
16.15000 -2165.08517 -2.59477 -25107.21047 103.13621 122.92414 1811069.68562
16.25000 -2153.19991 -0.88304 16849.88979 142.49858 170.40708 1948338.83400
16.35000 -2142.20889 5.68742 -36311.31991 127.47651 156.40565 1883063.22719
16.45000 -2132.23220 0.28295 -31520.82688 108.18574 131.34482 1711921.58267
16.55000 -2125.64946 0.34014 52542.62479 110.45515 108.77939 1695320.21770
16.65000 -2116.33212 5.28254 -32941.20350 81.78528 108.45422 1853030.47763
16.75000 -2105.73555 0.85765 -2396.83123 85.08574 110.12663 1797185.26819
16.85000 -2096.03937 1.55450 -57721.19344 96.87916 157.99970 1876889.17711
16.95000 -2088.57766 1.36503 -61887.40279 93.70936 117.80841 1996063.32932
17.05000 -2077.93642 1.39711 7305.88720 101.27137 106.98552 2054536.36201
17.15000 -2068.11176 0.07285 22709.04532 95.39492 139.75803 1918866.61294
17.25000 -2059.53861 1.97828 -25324.59680 76.43922 100.84474 1811851.93351
17.35000 -2047.70831 0.19987 -10074.40836 98.20372 133.43829 1608614.07582
17.45000 -2039.98133 -0.89127 3751.75602 91.05424 107.21958 1749302.94714
17.55000 -2031.47262 3.65765 23708.23841 101.01748 112.02304 1852323.20132
17.65000 -2022.49277 0.04314 -1602.60016 94.57183 99.75567 1919422.10675
17.75000 -2013.39153 0.16531 -1030.90168 82.62342 122.44612 2000665.85783
17.85000 -2006.20754 -0.15048 -41725.97671 83.48451 95.77767 1984902.51549
17.95000 -1996.42124 -0.26375 27815.51087 75.37402 103.69159 1928671.36726
18.05000 -1985.63874 3.79632 47831.06377 70.44960 90.41854 1887335.42353
18.15000 -1978.65638 -1.74545 10212.85019 80.42027 93.55545 1820173.29405
18.25000 -1970.61407 -0.54622 -35163.36232 108.57623 92.71183 1870078.13384
18.35000 -1962.06883 -3.26709 16444.52488 84.08154 99.25113 1948919.30982
18.45000 -1958.08480 -3.04606 31913.23015 125.15489 171.99433 1909867.95485
18.55000 -1939.33752 -0.25206 -18763.36120 110.54516 93.72106 1868080.74994
18.65000 -1934.65553 -1.42581 -1852.27682 116.24841 88.49068 1848230.11246
18.75000 -1927.36423 0.18985 42224.50849 80.39508 87.52916 1733325.38774
18.85000 -1917.66095 1.21227 121.14539 99.32809 97.35155 1899104.27431
18.95000 -1907.74324 1.36405 -3940.78118 74.72565 85.52277 1745005.32325
19.05000 -1900.94843 -0.05083 29729.38838 120.72694 100.57478 1765163.54652
19.15000 -1891.89525 -1.74198 -1638.72205 75.13489 84.69380 1909212.37871
19.25000 -1885.60286 -3.38001 17823.91087 106.91799 125.09036 1673894.38220
19.35000 -1878.84590 2.07247 13772.64631 115.57841 129.36159 1939998.87512
19.45000 -1870.42198 -0.23508 -20512.25181 181.11427 114.27377 1689983.60165
19.55000 -1863.64996 -1.15315 40352.92518 66.31074 83.75217 2033015.37886
19.65000 -1853.13753 1.37306 9360.50316 63.78834 83.93749 1717175.09891
19.75000 -1846.58536 0.13329 -26515.69639 82.94068 86.02550 1733923.52872
19.85000 -1840.05786 -0.41564 12398.06695 81.31370 83.57149 1637407.19936
19.95000 -1830.60240 -3.00596 -20778.13802 71.95984 78.11834 1630164.96441
