0.1875 0.94169 20.5115 0.55136 99.20992 98.80722 84.91755
0.5625 0.26813 44.05934 0.76174 96.58101 90.08707 80.9065
0.9375 -0.07031 64.65805 -0.06168 90.70873 82.03659 75.65769
1.3125 0.86619 79.21922 0.09838 84.34918 75.74634 70.86909
1.6875 0.28168 90.64996 0.37844 77.72501 72.17807 67.12601
2.0625 1.15043 103.35784 0.0177 73.0849 69.10781 64.00559
2.4375 -0.40055 118.82865 0.7044 68.48351 65.80256 61.04126
2.8125 -0.46383 133.04597 0.96043 64.21327 61.09289 56.8215
3.1875 -0.4438 143.7392 0.35778 60.43415 55.90445 53.38644
3.5625 0.05925 151.97813 0.60815 56.50523 50.96711 50.45086
3.9375 -0.1446 158.04684 0.13442 53.72835 47.44149 47.8477
4.3125 -0.12208 164.24674 0.54509 50.90943 44.37751 45.59862
4.6875 -0.31272 169.28589 0.08599 49.16197 42.29158 43.4179
5.0625 -0.5921 174.14916 0.23366 47.43615 39.56116 41.63313
5.4375 -0.58543 177.84031 0.56426 45.89375 38.47003 39.88067
5.8125 -0.28885 181.81322 0.05844 44.18776 36.14438 38.00708
6.1875 -0.71425 184.46421 0.67183 42.64899 35.42164 37.1881
6.5625 -0.33446 187.56838 -0.09271 41.18031 33.95431 35.26374
6.9375 -0.33247 190.71757 0.45084 39.65227 32.72432 33.8167
7.3125 -0.28148 193.41724 0.37744 38.46931 31.67308 32.57524
7.6875 -0.45417 195.81063 0.01831 37.12156 30.87711 31.84568
8.0625 -0.82255 198.45341 -0.07494 35.85154 29.40009 30.19828
8.4375 -0.52394 200.12393 0.09743 34.48817 28.32506 29.14174
8.8125 0.16172 201.68358 0.26826 33.73834 27.21494 27.84977
9.1875 -0.70512 204.10648 -0.24349 32.9122 26.49696 26.91509
9.5625 -0.82449 205.46015 -0.27248 32.08695 25.76747 25.95326
9.9375 -0.34872 206.80041 -0.52761 31.332 24.80156 25.00181
10.3125 -0.47261 208.27877 -0.70284 30.11424 23.75046 24.11949
10.6875 -0.46352 209.26274 -0.70675 29.6123 22.49608 23.7833
11.0625 -0.48967 209.64297 -0.92529 28.97172 21.86499 23.02927
11.4375 0.33471 210.08355 -1.29171 28.07855 20.5188 21.87938
11.8125 -0.68479 209.69878 -1.04083 27.35596 20.18543 21.31241
12.1875 -0.55162 210.04859 -1.17434 26.43492 19.94874 20.79442
12.5625 -0.63671 210.26494 -1.30413 25.6893 19.96419 19.75303
12.9375 -0.60924 210.77114 -1.30116 24.58006 19.25262 19.08209
13.3125 0.27845 211.62191 -0.93883 24.34314 19.40012 18.43052
13.6875 0.49554 212.33765 -0.84208 23.50755 18.57508 17.95111
14.0625 0.32262 213.24665 -0.77652 23.01868 17.88817 17.4257
14.4375 1.39553 214.17401 -0.35595 21.60931 16.88361 16.93983
14.8125 0.12545 213.6229 0.30281 21.5151 16.46529 16.47476
15.1875 0.49803 213.80344 0.21247 20.71118 15.85423 16.07856
15.5625 -0.05393 214.12279 -0.13127 20.63958 15.42485 15.48705
15.9375 -0.58558 214.07812 -0.31483 19.8047 14.79218 15.10275
16.3125 -0.76119 213.86914 -0.28974 19.18054 14.68925 14.21507
16.6875 -1.17292 213.56603 -0.22135 19.07614 13.80421 14.39648
17.0625 -0.98988 213.61715 -0.11466 18.30624 13.19211 13.58552
17.4375 -0.15626 212.83914 0.12292 18.37892 13.48111 13.29356
17.8125 -0.89496 213.76046 -0.04022 17.82109 12.83408 12.69227
18.1875 -1.00018 213.53893 0.16422 17.41218 12.81802 12.32066
18.5625 -0.63427 213.22307 -0.11223 17.04138 12.05322 11.76436
18.9375 -1.13551 213.33433 -0.15745 16.0693 11.66895 11.53037
19.3125 -0.74388 212.41374 -0.53699 15.5187 11.29397 11.44129
19.6875 -0.44464 212.08671 -0.89749 15.29818 11.10869 10.84253
20.0625 -0.43171 211.86478 -0.89224 15.26175 10.74786 10.36504
20.4375 -0.14867 211.49295 -0.59206 14.40337 10.61854 10.35961
20.8125 -0.25642 211.66346 -0.38953 14.6906 10.56671 10.11434
21.1875 0.32496 211.62229 -0.83573 14.13207 10.64791 9.76975
21.5625 -0.34408 211.51344 -0.08378 13.59369 9.80744 9.44623
21.9375 0.1433 211.08281 -0.07333 13.37233 9.36876 9.91486
22.3125 -0.07286 211.01641 0.01279 12.80713 8.68104 9.20097
22.6875 -0.54639 210.62105 -0.0005 12.71134 9.06005 8.9566
23.0625 -0.3272 210.29875 -1.11551 11.77489 8.54443 8.93154
23.4375 -0.65133 209.88267 -0.63268 11.8844 8.45918 8.47895
23.8125 -0.24744 209.52833 -1.69229 11.3614 8.81694 8.82566
24.1875 0.39543 209.32535 -1.47646 11.07864 7.86956 8.24816
24.5625 -0.14022 209.25233 -1.36535 10.88633 7.74612 8.38436
24.9375 -0.2912 209.35504 -1.54484 10.87874 7.94138 7.92979
25.3125 1.00798 208.28652 -1.17684 10.43917 7.91997 8.0072
25.6875 1.04793 208.28029 -1.30045 11.11756 7.0701 7.98548
26.0625 1.00679 208.62512 -1.65416 9.79869 7.09178 8.03541
26.4375 0.2186 207.97656 -2.03947 9.90998 7.12049 7.67985
26.8125 1.61814 208.12477 -1.43267 9.35715 6.97872 7.81981
27.1875 1.22583 207.35548 -1.87539 9.60435 6.1553 8.1321
27.5625 0.47308 206.73858 -2.27153 9.33961 6.94164 6.69885
27.9375 0.73191 206.73345 -1.52812 9.8144 6.51739 6.81301
28.3125 1.38 207.80337 -1.13944 8.98615 6.50042 6.90289
28.6875 1.62112 207.10018 -0.88044 8.74448 6.12192 7.19176
29.0625 1.30864 207.10189 -0.97609 8.49833 5.49713 6.4345
29.4375 1.15075 206.31587 -0.32261 8.72971 5.52005 7.01215
29.8125 0.82359 205.64053 -1.27081 8.50702 6.10764 6.19333
