0.125 0.000 0.000 0.000
0.375 -0.000 -0.000 0.000
0.625 -0.000 0.000 -0.000
0.875 -0.000 0.001 0.000
1.125 0.001 -0.000 0.000
1.375 0.001 -0.003 -0.002
1.625 0.000 -0.000 0.005
1.875 0.000 0.003 0.007
2.125 -0.001 -0.005 0.006
2.375 0.004 -0.005 0.003
2.625 0.007 0.011 -0.001
2.875 -0.005 0.009 0.006
3.125 0.003 -0.003 0.003
3.375 -0.010 0.012 0.023
3.625 0.011 -0.006 -0.012
3.875 0.011 -0.017 0.005
4.125 -0.004 0.007 -0.001
4.375 0.018 0.005 0.001
4.625 -0.006 0.004 -0.003
4.875 -0.026 -0.032 0.015
5.125 0.044 0.005 0.017
5.375 -0.008 -0.007 -0.010
5.625 -0.005 0.021 0.025
5.875 0.015 0.005 -0.003
6.125 -0.055 -0.030 0.014
6.375 -0.003 0.021 0.035
6.625 0.015 -0.014 0.022
6.875 0.004 -0.004 0.019
7.125 0.012 0.024 0.039
7.375 0.036 0.062 -0.049
7.625 -0.018 0.004 0.004
7.875 0.017 -0.021 0.017
8.125 0.054 0.008 -0.021
8.375 0.024 0.021 0.022
8.625 0.037 -0.032 -0.035
8.875 -0.019 -0.043 -0.011
9.125 -0.003 0.034 -0.046
9.375 0.018 0.026 -0.004
9.625 -0.013 -0.001 0.043
9.875 0.070 0.005 0.017
10.125 -0.041 -0.012 0.015
10.375 0.060 0.012 0.035
10.625 -0.100 0.038 0.077
10.875 0.079 -0.023 -0.035
11.125 -0.017 -0.094 0.046
11.375 0.069 -0.002 0.030
11.625 0.059 0.074 0.005
11.875 0.044 0.028 0.024
12.125 0.075 0.044 0.051
12.375 0.015 -0.045 -0.000
12.625 -0.054 0.035 0.048
12.875 0.045 0.052 -0.085
13.125 -0.011 -0.016 0.005
13.375 0.016 -0.030 -0.033
13.625 -0.026 -0.016 0.020
13.875 -0.034 0.013 0.052
14.125 -0.118 -0.044 -0.058
14.375 0.026 0.065 0.009
14.625 -0.031 -0.089 -0.002
14.875 0.009 -0.043 0.053
