0.125 -0.000 -0.000 0.001
0.375 -0.000 -0.002 0.019
0.625 0.004 -0.004 0.104
0.875 -0.004 0.003 0.325
1.125 0.001 -0.016 0.745
1.375 0.031 0.011 1.318
1.625 0.022 -0.011 2.077
1.875 0.020 -0.002 3.085
2.125 0.035 -0.022 4.146
2.375 0.022 0.012 5.547
2.625 0.032 -0.021 6.880
2.875 0.022 -0.027 8.431
3.125 0.061 -0.018 10.011
3.375 -0.008 -0.013 11.253
3.625 0.086 -0.056 12.688
3.875 0.013 -0.058 13.723
4.125 0.116 -0.060 15.074
4.375 0.062 -0.032 16.135
4.625 0.042 -0.095 17.364
4.875 0.083 -0.066 18.430
5.125 0.026 0.038 19.753
5.375 0.021 -0.008 20.855
5.625 0.007 -0.048 21.600
5.875 0.025 -0.036 22.055
6.125 0.043 -0.066 22.821
6.375 0.075 -0.068 23.473
6.625 0.031 -0.065 24.005
6.875 0.027 0.013 24.140
7.125 0.105 -0.002 24.559
7.375 0.032 -0.031 25.504
7.625 0.053 -0.015 25.731
7.875 0.012 0.007 26.193
8.125 0.016 0.043 26.914
8.375 0.057 0.016 27.534
8.625 0.008 0.005 27.639
8.875 0.011 0.032 27.351
9.125 0.022 0.032 26.748
9.375 -0.029 0.014 25.506
9.625 -0.017 -0.001 24.244
9.875 0.040 -0.053 24.136
10.125 -0.050 -0.078 24.416
10.375 -0.032 -0.045 25.085
10.625 -0.017 -0.034 25.570
10.875 0.014 -0.077 26.754
11.125 -0.009 -0.027 26.877
11.375 -0.008 -0.090 26.776
11.625 0.027 -0.083 26.684
11.875 0.052 -0.078 26.055
12.125 0.014 -0.023 24.696
12.375 0.005 -0.055 23.171
12.625 0.003 -0.051 21.496
12.875 0.010 -0.076 19.582
13.125 0.028 -0.022 18.652
13.375 0.034 -0.054 17.538
13.625 0.030 -0.042 16.635
13.875 0.046 -0.025 16.165
14.125 0.048 -0.060 16.681
14.375 0.043 -0.010 16.209
14.625 0.027 -0.055 16.199
14.875 0.024 -0.017 15.211
