0.12500 0.03259
0.37500 0.01110
0.62500 0.00237
0.87500 0.04168
1.12500 0.05010
1.37500 0.08209
1.62500 0.09404
1.87500 0.10436
2.12500 0.11915
2.37500 0.11497
2.62500 0.11416
2.87500 0.10648
3.12500 0.11072
3.37500 0.09545
3.62500 0.09965
3.87500 0.08155
4.12500 0.06956
4.37500 0.05501
4.62500 0.03656
4.87500 0.02655
5.12500 0.03446
5.37500 0.02552
5.62500 0.03285
5.87500 0.02092
6.12500 0.02462
6.37500 0.03103
6.62500 0.02816
6.87500 0.02505
7.12500 0.03086
7.37500 0.02349
7.62500 0.04118
7.87500 0.03161
8.12500 0.03843
8.37500 0.02625
8.62500 0.02343
8.87500 0.00877
9.12500 0.01993
9.37500 0.02953
9.62500 0.02905
9.87500 0.02823
10.12500 0.04449
10.37500 0.03870
10.62500 0.03803
10.87500 0.04302
11.12500 0.04236
11.37500 0.04853
11.62500 0.02272
11.87500 0.00979
12.12500 0.01681
12.37500 0.02410
12.62500 0.02307
12.87500 0.01634
13.12500 0.02949
13.37500 0.03527
13.62500 0.04612
13.87500 0.02775
14.12500 0.02563
14.37500 0.00966
14.62500 0.02663
14.87500 0.00434
15.12500 0.02665
15.37500 0.01349
15.62500 0.00999
15.87500 0.01567
16.12500 0.03142
16.37500 0.03399
16.62500 0.01646
16.87500 0.02455
17.12500 0.05112
17.37500 0.03140
17.62500 0.03568
17.87500 0.04055
18.12500 0.03679
18.37500 0.00701
18.62500 0.03480
18.87500 0.04603
19.12500 0.04775
19.37500 0.05124
19.62500 0.04195
19.87500 0.03813
