0.120000 -2.460710
0.380000 -0.837860
0.620000 0.072240
0.880000 0.036930
1.120000 0.090980
1.380000 -1.472670
1.620000 -1.921100
1.880000 -2.178950
2.120000 -2.305960
2.380000 -2.357040
2.620000 2.855530
2.880000 2.283530
3.120000 1.837750
3.380000 1.580830
3.620000 1.133380
3.880000 1.283750
4.120000 0.624140
4.380000 0.073140
4.620000 -0.419330
4.880000 -0.380030
5.120000 -0.566440
5.380000 -0.738640
5.620000 -0.714530
5.880000 -1.161790
6.120000 -1.977660
6.380000 -1.247560
6.620000 -1.184400
6.880000 1.103820
7.120000 -2.745460
7.380000 1.657560
7.620000 2.775170
7.880000 2.543470
8.120000 -2.875060
8.380000 -0.407620
8.620000 -2.593220
8.880000 -0.364650
9.120000 0.293560
9.380000 0.441250
9.620000 0.674030
9.880000 0.407000
10.120000 -0.322270
10.380000 -0.985550
10.620000 -0.992990
10.880000 -1.213410
11.120000 -1.769670
11.380000 -1.902870
11.620000 -2.216540
11.880000 -2.261810
12.120000 -2.426480
12.380000 -3.058140
12.620000 -2.182100
12.880000 2.445660
13.120000 -1.242180
13.380000 2.744710
13.620000 2.675430
13.880000 3.123330
14.120000 2.741450
14.380000 2.242430
14.620000 2.913310
14.880000 1.992850
