0.12500 0.01906
0.37500 0.06278
0.62500 0.10179
0.87500 0.16357
1.12500 0.21705
1.37500 0.24178
1.62500 0.29914
1.87500 0.31756
2.12500 0.35035
2.37500 0.37792
2.62500 0.42487
2.87500 0.46338
3.12500 0.45461
3.37500 0.47314
3.62500 0.48805
3.87500 0.47832
4.12500 0.47473
4.37500 0.45064
4.62500 0.40594
4.87500 0.32248
5.12500 0.30744
5.37500 0.23154
5.62500 0.25281
5.87500 0.22254
6.12500 0.22224
6.37500 0.19417
6.62500 0.16633
6.87500 0.16432
7.12500 0.15185
7.37500 0.12206
7.62500 0.10220
7.87500 0.10669
8.12500 0.07859
8.37500 0.07866
8.62500 0.08239
8.87500 0.05844
9.12500 0.05882
9.37500 0.05853
9.62500 0.04995
9.87500 0.08408
10.12500 0.04805
10.37500 0.04781
10.62500 0.07191
10.87500 0.06326
11.12500 0.07096
11.37500 0.07157
11.62500 0.07439
11.87500 0.07243
12.12500 0.11030
12.37500 0.08101
12.62500 0.10019
12.87500 0.09836
13.12500 0.06325
13.37500 0.09783
13.62500 0.12937
13.87500 0.11122
14.12500 0.10870
14.37500 0.08002
14.62500 0.08699
14.87500 0.18086
15.12500 0.11056
15.37500 0.08673
15.62500 0.11524
15.87500 0.08341
16.12500 0.07649
16.37500 0.09019
16.62500 0.11274
16.87500 0.06923
17.12500 0.06765
17.37500 0.09283
17.62500 0.05937
17.87500 0.03834
18.12500 0.07377
18.37500 0.05523
18.62500 0.06580
18.87500 0.06531
19.12500 0.09621
19.37500 0.01174
19.62500 0.08748
19.87500 0.06032
