0.05000 4615.59989
0.15000 4871.38500
0.25000 5655.61897
0.35000 7109.08356
0.45000 8086.04804
0.55000 8707.53156
0.65000 8848.62778
0.75000 8734.33923
0.85000 8629.67217
0.95000 8366.74362
1.05000 8083.17752
1.15000 7929.12332
1.25000 7525.15646
1.35000 7157.46170
1.45000 6943.49894
1.55000 6725.43107
1.65000 6600.25971
1.75000 6248.17726
1.85000 6040.03770
1.95000 5820.63421
2.05000 5638.07158
2.15000 5426.99448
2.25000 5195.53583
2.35000 5069.75536
2.45000 4817.20696
2.55000 4771.19732
2.65000 4575.31261
2.75000 4465.22535
2.85000 4339.71831
2.95000 4077.46639
3.05000 4038.04923
3.15000 3827.73900
3.25000 3667.80179
3.35000 3673.25466
3.45000 3418.78307
3.55000 3359.61800
3.65000 3274.21586
3.75000 3168.89209
3.85000 2998.40911
3.95000 2927.76606
4.05000 2822.95029
4.15000 2805.13063
4.25000 2672.21210
4.35000 2610.39373
4.45000 2495.66084
4.55000 2441.94815
4.65000 2309.40907
4.75000 2278.56578
4.85000 2207.35544
4.95000 2174.64106
5.05000 2101.11820
5.15000 2011.02036
5.25000 1985.76052
5.35000 1890.15068
5.45000 1819.68436
5.55000 1747.83316
5.65000 1710.77297
5.75000 1600.42598
5.85000 1575.17631
5.95000 1514.10968
6.05000 1491.71982
6.15000 1408.78933
6.25000 1371.03727
6.35000 1318.76200
6.45000 1247.22046
6.55000 1209.93842
6.65000 1156.04833
6.75000 1111.82739
6.85000 1095.41715
6.95000 1071.99575
7.05000 1053.29055
7.15000 1024.40168
7.25000 977.64219
7.35000 964.61469
7.45000 928.87167
7.55000 882.70156
7.65000 873.42441
7.75000 868.06216
7.85000 827.24550
7.95000 810.52070
8.05000 770.16216
8.15000 741.39820
8.25000 749.46226
8.35000 714.51350
8.45000 665.25912
8.55000 682.56506
8.65000 658.06926
8.75000 632.51502
8.85000 609.05014
8.95000 582.84188
9.05000 575.31538
9.15000 564.66252
9.25000 552.32769
9.35000 540.49830
9.45000 499.43083
9.55000 522.40459
9.65000 496.68882
9.75000 483.76645
9.85000 459.36929
9.95000 466.04935
10.05000 451.63764
10.15000 481.15209
10.25000 420.83660
10.35000 417.23237
10.45000 416.33891
10.55000 427.22850
10.65000 417.25731
10.75000 400.46572
10.85000 392.65745
10.95000 397.70372
11.05000 397.68589
11.15000 411.86527
11.25000 376.47577
11.35000 366.37640
11.45000 370.84621
11.55000 364.99276
11.65000 354.63499
11.75000 352.27774
11.85000 334.23142
11.95000 335.39278
12.05000 341.10060
12.15000 337.48308
12.25000 320.48364
12.35000 320.23998
12.45000 300.03990
12.55000 313.19095
12.65000 285.06796
12.75000 284.39597
12.85000 287.06029
12.95000 273.64371
13.05000 295.58365
13.15000 302.63346
13.25000 262.72140
13.35000 277.06135
13.45000 242.92205
13.55000 255.87076
13.65000 251.46179
13.75000 237.74961
13.85000 261.84403
13.95000 240.44165
14.05000 221.70001
14.15000 219.26572
14.25000 219.06886
14.35000 206.65697
14.45000 205.54425
14.55000 197.28013
14.65000 193.45850
14.75000 184.32417
14.85000 179.47822
14.95000 176.81974
15.05000 174.45007
15.15000 156.15796
15.25000 167.51065
15.35000 161.53116
15.45000 162.38301
15.55000 145.85851
15.65000 168.06648
15.75000 147.24472
15.85000 150.12794
15.95000 154.13105
16.05000 150.03049
16.15000 142.20043
16.25000 148.00870
16.35000 133.88760
16.45000 126.97895
16.55000 131.48375
16.65000 118.05677
16.75000 130.89475
16.85000 142.81042
16.95000 133.77870
17.05000 129.91726
17.15000 113.96635
17.25000 139.49342
17.35000 122.05998
17.45000 134.70270
17.55000 123.75798
17.65000 122.09023
17.75000 128.77745
17.85000 145.53346
17.95000 118.48106
18.05000 112.31628
18.15000 92.62027
18.25000 121.02798
18.35000 112.98798
18.45000 108.36613
18.55000 118.37641
18.65000 110.77388
18.75000 93.74123
18.85000 95.72199
18.95000 117.62292
19.05000 94.47450
19.15000 120.84328
19.25000 139.13242
19.35000 98.31430
19.45000 100.23540
19.55000 91.81164
19.65000 102.31954
19.75000 97.99796
19.85000 90.93913
19.95000 103.87442
