0.05000 -1884.28432 313.07745 2855.49625 2331.33988 2093.21118 830367.75578
0.15000 -4645.86079 220.26604 39137.44858 2293.81726 2147.59764 905021.44013
0.25000 -6919.58360 185.90535 6546.91196 2223.34400 2490.60225 796513.59086
0.35000 -9111.03832 181.54135 -28042.72487 2333.64871 2523.71062 822477.49459
0.45000 -10762.87135 100.13794 13329.34677 2401.21440 2750.65116 846084.41096
0.55000 -11943.81485 18.82611 8603.93416 2348.09349 2973.70654 725172.84559
0.65000 -12804.55208 81.21644 -5418.92949 2413.10088 3066.35614 686902.31950
0.75000 -13306.14928 79.94027 18149.47438 2360.29532 3214.33903 620905.39799
0.85000 -13646.04139 92.39256 -11885.65208 2255.14223 3237.82607 603273.78193
0.95000 -13749.39371 125.28367 8050.59100 2171.50613 3277.82766 579389.69184
1.05000 -13811.18171 30.92344 -3866.31190 2040.16059 3314.33827 549854.26582
1.15000 -13773.03986 1.21050 -1125.28970 1953.89770 3278.82726 518232.11382
1.25000 -13663.34674 33.59871 -9184.64453 1826.17194 3268.94158 484309.30468
1.35000 -13509.58222 49.33030 -1746.74511 1661.25067 3235.51325 479870.36583
1.45000 -13364.49019 73.94133 15.19796 1489.43397 3171.33661 422142.41387
1.55000 -13218.99554 115.71844 6972.23293 1309.99132 3102.69922 442742.63026
1.65000 -13009.82635 111.40089 -1276.32637 1184.10894 3076.18634 384861.17654
1.75000 -12741.60739 91.07371 -5236.98239 1092.36372 2995.99164 353974.88073
1.85000 -12542.52705 55.74706 -3585.62582 963.96157 2935.30935 350158.67507
1.95000 -12260.42296 94.78231 2797.87624 872.94558 2883.31794 317127.54369
2.05000 -12010.98665 33.81947 -804.56818 791.67306 2812.11574 331607.77056
2.15000 -11762.28207 70.24003 -4034.89267 709.93316 2758.91415 287872.75425
2.25000 -11527.13272 -5.11947 1017.89809 617.93634 2721.23684 284527.86635
2.35000 -11287.08461 12.62415 9216.82312 550.79514 2639.75997 308826.98766
2.45000 -11056.68712 71.46343 866.65759 502.68254 2593.15583 251389.47180
2.55000 -10827.94800 60.03218 -247.87002 475.84695 2513.57056 248333.85135
2.65000 -10607.32449 21.51688 -1565.68934 450.14737 2454.52025 239639.93705
2.75000 -10392.20472 30.02147 -2060.13442 414.23229 2416.65091 228441.51937
2.85000 -10179.19549 41.14857 3303.11221 386.64395 2348.49725 232924.38345
2.95000 -9976.48370 32.44891 -1705.73785 384.86930 2292.75226 190056.96406
3.05000 -9796.62140 141.88420 2148.93584 368.58632 2242.27795 203653.88504
3.15000 -9615.61596 64.15663 1501.89886 344.10837 2224.23317 181669.85490
3.25000 -9432.06246 95.25053 1327.01376 326.87218 2132.72970 177182.85096
3.35000 -9282.96749 36.71587 1646.41611 313.71912 2099.80324 161203.33861
3.45000 -9123.11398 44.77031 1248.50847 307.33882 2053.47657 167168.02771
3.55000 -8990.75250 93.87579 144.50127 316.48979 1989.13219 164576.12491
3.65000 -8834.16667 56.00929 1524.46100 315.32680 1952.14706 169989.07006
3.75000 -8702.85687 34.12835 531.76584 301.46414 1906.41514 137369.14409
3.85000 -8561.69306 15.82396 -3037.79376 304.88892 1854.12711 152555.11080
3.95000 -8453.53839 26.30512 1620.33753 305.84512 1832.48886 130397.41540
4.05000 -8350.90445 25.37420 2060.32539 316.10618 1788.37004 136320.12351
4.15000 -8247.65331 51.77630 -1165.22239 326.61767 1727.96128 124150.65137
4.25000 -8152.02687 94.06730 1721.03333 339.12148 1683.87351 135959.31454
4.35000 -8067.19963 9.92794 3453.58851 357.16277 1649.86474 121224.68112
4.45000 -7968.98091 66.67535 2469.21031 373.56170 1598.66344 124119.60455
4.55000 -7888.85174 79.95868 208.82247 378.93511 1554.13142 144111.43567
4.65000 -7807.54759 40.12187 253.95585 409.21982 1519.44567 131145.22495
4.75000 -7723.53217 45.22487 -2192.93490 438.57470 1476.41271 124924.68232
4.85000 -7642.78947 34.24243 1103.25055 474.70828 1411.21298 114361.37020
4.95000 -7574.59600 35.84405 -1401.82527 489.40554 1396.88221 121724.35964
5.05000 -7497.32429 60.48475 -1058.08271 526.15717 1307.05532 117110.61640
5.15000 -7432.82881 73.41148 637.77050 546.01315 1275.88227 120785.28643
5.25000 -7361.85882 68.24599 -177.59750 576.25576 1220.28579 122637.92639
5.35000 -7300.93787 56.87718 -1965.95285 604.22162 1182.82372 109450.04378
5.45000 -7223.87901 32.47868 -1365.55056 643.36194 1127.53555 113669.27718
5.55000 -7135.23848 60.44049 -1879.09665 675.80041 1086.75323 124633.13794
5.65000 -7028.69864 82.27700 -4617.68859 722.14959 1014.50875 116764.98949
5.75000 -6963.40347 53.65709 -1487.89503 727.85338 971.40659 103122.28855
5.85000 -6866.42002 89.38224 -1262.43706 757.61219 923.40465 104270.12895
5.95000 -6784.17400 98.62075 -4592.00425 778.15464 888.38898 104970.57158
6.05000 -6684.78373 96.36894 -1523.56622 793.57961 833.03424 105160.79219
6.15000 -6559.79134 74.26898 -3153.42735 791.00790 798.88386 91074.98369
6.25000 -6476.01826 118.28909 -1033.78102 810.30784 743.99834 91565.89532
6.35000 -6357.21911 119.17190 -3770.48769 788.82642 709.01125 92010.26711
6.45000 -6246.65850 111.79611 162.87564 784.70096 667.49716 80076.09193
6.55000 -6136.34801 118.19318 -3254.19919 770.49350 633.72655 86034.73559
6.65000 -6064.70373 106.60463 -1388.41830 762.58580 589.39838 82174.81234
6.75000 -5954.11805 116.21200 -751.56091 750.82064 552.63329 73804.99455
6.85000 -5871.66150 113.93709 -719.01445 742.90702 523.30297 75949.12737
6.95000 -5771.38616 106.06933 -2389.74592 717.13346 499.58491 91314.14078
7.05000 -5673.89749 101.57008 -2036.72228 705.21881 467.28785 62651.61027
7.15000 -5598.18661 104.69209 -2026.50348 677.81955 441.42320 59097.66830
7.25000 -5515.77887 95.23085 -646.11869 656.80868 412.93131 52294.86303
7.35000 -5433.49231 97.74897 103.28061 626.87961 392.96927 47233.21148
7.45000 -5372.89982 97.32466 -1575.51071 599.05440 376.64821 46183.25631
7.55000 -5308.94354 89.67518 660.42749 579.80851 354.45898 42057.15497
7.65000 -5245.33516 76.65761 -905.11319 557.34988 336.54839 40428.56350
7.75000 -5190.13663 85.00176 79.22964 528.31830 319.16854 43171.34250
7.85000 -5159.10023 75.50053 462.99370 520.44576 300.28014 43822.97523
7.95000 -5115.23014 76.29967 -153.89961 495.84157 288.10080 38876.91413
8.05000 -5056.52027 74.50502 186.21526 476.02692 268.42845 40141.02338
8.15000 -5011.86807 62.03099 -387.22265 453.43409 257.62092 36407.27627
8.25000 -4953.75204 59.26826 -867.42369 429.26406 247.83527 41644.29387
8.35000 -4917.25495 57.59186 283.82276 412.57118 238.39834 28599.28402
8.45000 -4882.16159 57.77417 -664.06402 396.05241 228.86690 30950.70157
8.55000 -4842.47953 48.52111 -334.05389 370.28691 226.43466 28237.44344
8.65000 -4798.98375 49.41798 21.69911 354.52484 216.78849 29164.48357
8.75000 -4777.86461 47.02171 336.92801 342.41197 210.22664 25978.79782
8.85000 -4737.32245 47.50616 -367.93362 323.37596 198.34986 29722.07880
8.95000 -4690.48855 46.59593 -163.65507 310.16586 197.24175 23998.23640
9.05000 -4659.31947 45.65022 -86.27665 292.73177 190.57725 21572.42097
9.15000 -4629.22021 46.09077 -379.17659 276.77487 183.61499 22242.24922
9.25000 -4594.16469 45.53202 138.85291 263.28595 179.99865 18768.82614
9.35000 -4560.50267 43.11083 -650.70342 250.49971 174.25848 21342.49058
9.45000 -4522.33416 40.83514 -80.38333 233.16823 169.17781 23568.07427
9.55000 -4501.97609 35.23117 -77.48939 223.16248 168.27256 20176.34503
9.65000 -4464.59025 33.04972 -176.47730 213.41916 161.93658 21766.56801
9.75000 -4425.26795 37.28193 -273.97538 203.19644 156.58752 22781.01480
9.85000 -4388.72438 29.78717 47.42928 191.91403 148.75240 28751.95002
9.95000 -4355.64243 35.48425 -508.90600 178.48935 142.20309 18728.72354
10.05000 -4326.06189 30.49154 -29.15934 166.37861 139.61424 18316.88671
10.15000 -4296.21787 29.06855 189.20802 162.93124 134.84219 18671.57527
10.25000 -4267.59694 28.87392 -446.78667 160.21114 131.45627 18381.50118
10.35000 -4231.21141 26.52144 -623.19310 156.65794 127.19232 15985.07382
10.45000 -4196.62769 24.24426 -702.81288 146.31167 125.98109 17358.29629
10.55000 -4163.19299 26.37579 200.98398 144.51570 122.31278 22502.41189
10.65000 -4133.17721 24.70437 68.15363 138.97935 117.49215 26299.70629
10.75000 -4102.87338 26.69337 -436.07288 134.79310 114.26305 16872.64054
10.85000 -4066.92052 24.01914 -461.88392 128.80678 110.36789 15389.23663
10.95000 -4043.40719 23.40101 -397.21618 128.64633 105.45212 15155.16961
11.05000 -4011.92662 21.20071 -401.91775 127.62522 105.60867 14122.98741
11.15000 -3981.81361 21.83799 -185.67427 128.61646 98.24070 14641.15610
11.25000 -3954.70192 24.57699 -320.01790 127.49495 95.69243 13560.18548
11.35000 -3922.73597 20.77715 -135.91900 126.48892 92.73086 11660.13613
11.45000 -3898.76229 23.08365 141.79579 126.25276 90.16163 12667.60585
11.55000 -3868.94249 23.62369 -284.03752 127.68706 86.61491 12608.69799
11.65000 -3843.21256 21.39202 -306.45464 126.72902 84.38511 13424.84811
11.75000 -3811.24365 23.83277 -361.87372 125.57559 81.42216 10546.63010
11.85000 -3785.95319 26.45870 -485.63575 124.46633 80.19338 10261.07742
11.95000 -3760.99200 26.05663 -179.42363 123.10330 75.50832 11480.53638
12.05000 -3736.20933 27.60816 -401.42061 120.12750 75.62790 10479.56129
12.15000 -3710.82776 24.87515 -500.26933 118.78766 71.90548 12293.38952
12.25000 -3690.31382 29.09699 -485.27844 118.12408 68.04183 10587.78250
12.35000 -3663.89485 28.06268 -122.25961 117.19623 67.12059 8684.13824
12.45000 -3638.71127 26.87766 -22.06595 113.54651 63.94620 10586.25135
12.55000 -3616.26607 28.05580 334.35329 110.75913 62.92230 12159.07078
12.65000 -3591.88468 28.04657 -291.27826 109.63852 61.77922 9235.87207
12.75000 -3570.37966 28.70990 -452.83425 106.36880 60.38707 11115.62692
12.85000 -3548.39091 27.58078 -359.70049 106.74456 57.82995 8109.12747
12.95000 -3526.86466 27.96228 -447.58385 103.19188 56.45732 9278.57874
13.05000 -3508.19025 28.14106 -221.44985 99.75329 54.79154 9899.31972
13.15000 -3485.41795 28.31784 -287.49496 96.91429 50.88390 8036.78232
13.25000 -3464.42605 27.80343 -20.64867 94.10461 50.78569 9210.60150
13.35000 -3444.09881 27.55830 -403.98961 89.43542 50.38964 7774.49812
13.45000 -3424.22085 27.67208 -228.80823 87.09334 48.53955 7072.41504
13.55000 -3406.59563 25.40806 -306.38575 84.48900 46.19147 11852.42547
13.65000 -3382.41355 24.74589 -145.62963 82.50017 45.44772 7593.79562
13.75000 -3363.10118 25.86439 -182.89779 82.73162 44.53953 7682.31461
13.85000 -3337.88110 25.68854 221.82697 78.28231 41.35031 6663.03378
13.95000 -3316.31027 24.67482 -157.78290 78.49905 42.86681 9416.30273
14.05000 -3292.51697 23.66251 31.65774 74.45572 40.30043 6736.03119
14.15000 -3270.50087 23.16524 111.35342 71.51390 38.91834 6466.36607
14.25000 -3248.29822 21.37906 -140.64577 65.81626 38.04746 5824.23362
14.35000 -3227.96633 22.77957 -51.61739 61.37338 37.92071 6907.73640
14.45000 -3200.13194 22.52826 -136.43176 61.40143 36.82990 5066.42512
14.55000 -3178.73361 23.09030 -14.51339 60.09483 37.81361 6592.42534
14.65000 -3156.82680 21.60608 234.97418 59.78586 36.29273 6022.78258
14.75000 -3135.52990 21.77509 123.70662 59.05688 36.34090 5867.01017
14.85000 -3110.24704 21.19555 -53.69113 57.50585 35.37886 5951.55648
14.95000 -3086.44453 20.19700 184.96744 56.97394 35.36722 5547.24950
15.05000 -3067.68409 20.13480 58.46901 54.17255 35.57309 6670.14398
15.15000 -3047.24473 20.03404 -178.26271 53.38211 34.92390 5974.01959
15.25000 -3025.92486 21.16782 -18.09062 52.56768 34.23975 5094.06538
15.35000 -3006.15344 18.87605 -58.09946 52.34781 34.90388 4596.55831
15.45000 -2989.28718 19.89492 -425.63398 48.92903 34.99253 7325.48225
15.55000 -2970.12042 19.75440 -164.83446 49.05909 34.95620 6429.43585
15.65000 -2950.01021 16.41490 -146.80510 47.85023 33.39006 5850.64388
15.75000 -2933.94423 19.40611 -140.73341 47.33916 33.98744 4591.86953
15.85000 -2916.55948 18.31438 -50.49682 49.06263 33.81588 4623.07039
15.95000 -2899.69923 17.86986 20.60123 47.90838 34.45784 4502.46638
16.05000 -2881.50854 18.55343 151.63259 46.33539 34.53673 5093.41172
16.15000 -2867.05600 18.09518 -120.93280 47.13130 34.76142 5552.77000
16.25000 -2850.62368 18.73065 322.65037 45.66794 32.82327 4785.24379
16.35000 -2834.74299 19.97996 129.25318 45.78950 33.63488 6461.56960
16.45000 -2816.18390 17.95920 -97.44292 46.92731 32.72662 4221.03426
16.55000 -2797.63031 16.58396 -44.45103 45.72441 33.15100 4408.54062
16.65000 -2782.75562 16.90689 22.98192 47.58662 32.20223 4426.60045
16.75000 -2765.96960 16.83794 81.27052 46.08494 33.64256 4789.19282
16.85000 -2753.64407 18.13922 71.86855 45.14807 32.04523 4479.68740
16.95000 -2733.51031 17.77691 148.08059 45.22334 32.25328 5357.00129
17.05000 -2720.55900 15.82026 66.37361 44.65465 31.52348 3769.19039
17.15000 -2704.48804 16.76593 40.88695 42.54214 33.17056 3903.56321
17.25000 -2686.67751 16.56831 -163.39311 41.90214 32.29830 3336.82127
17.35000 -2671.23868 15.51262 32.88654 41.69261 32.85613 3949.04288
17.45000 -2657.35428 14.20639 154.52639 40.71346 31.42627 4610.77224
17.55000 -2639.24083 15.78461 -31.72235 38.20490 33.33986 3637.06451
17.65000 -2624.81049 16.16781 130.57159 38.13124 32.64346 3689.89181
17.75000 -2611.15238 15.61114 126.67060 39.52626 32.72571 3842.88515
17.85000 -2593.61559 14.74802 325.20640 39.48439 30.95117 4862.61533
17.95000 -2578.67544 15.36007 -145.76192 39.37367 31.23030 3519.31627
18.05000 -2565.51953 12.98480 178.08138 39.31980 31.50460 3081.13155
18.15000 -2549.65963 13.78993 109.05317 37.67561 30.01898 3238.01036
18.25000 -2533.99657 13.52260 65.05878 38.88608 30.29793 3900.07642
18.35000 -2519.93375 13.64148 -20.33142 39.32498 30.77957 3340.71050
18.45000 -2505.92797 15.68384 30.34932 37.93570 30.67239 3136.22899
18.55000 -2492.95851 12.16126 166.62681 38.69740 30.21254 2930.89708
18.65000 -2476.59897 14.47352 -147.12130 38.09850 30.57572 4644.87658
18.75000 -2462.48221 14.26992 -0.57630 38.27925 30.01458 2855.35538
18.85000 -2447.84578 12.20433 85.86579 38.53616 28.85718 2986.67954
18.95000 -2433.08786 10.95099 107.26228 37.74644 29.64731 2981.95235
19.05000 -2418.99446 11.04689 -120.48551 37.57452 30.90664 2639.34531
19.15000 -2405.28893 10.42957 55.32329 38.28077 28.25422 2692.90048
19.25000 -2389.74456 11.90720 47.18519 36.24892 27.16729 2429.54583
19.35000 -2376.30874 10.84821 -22.46481 33.95651 29.19267 2788.46495
19.45000 -2360.03986 10.80442 98.38468 34.67383 29.47596 2694.24304
19.55000 -2344.96467 12.07952 -6.76305 36.31341 28.76795 2890.26656
19.65000 -2333.19260 12.56554 -3.77721 34.59969 29.88402 1772.54624
19.75000 -2322.58481 14.25791 16.52544 33.97429 28.39592 2431.12847
19.85000 -2305.55960 10.24679 70.53669 34.87707 28.79964 1805.04156
19.95000 -2296.99580 12.07684 -73.10870 34.51595 26.84641 1737.70052
