0.125 0.002 -0.002 0.002
0.375 0.004 0.005 0.078
0.625 -0.028 -0.039 0.357
0.875 -0.016 -0.047 0.919
1.125 -0.110 -0.068 1.715
1.375 -0.022 -0.066 2.606
1.625 -0.165 -0.168 3.346
1.875 -0.162 -0.137 4.209
2.125 -0.248 -0.130 4.720
2.375 -0.111 -0.153 5.402
2.625 -0.194 -0.190 5.808
2.875 -0.355 -0.324 6.464
3.125 -0.209 -0.231 6.911
3.375 -0.187 -0.142 7.093
3.625 -0.232 -0.221 7.726
3.875 -0.262 -0.196 8.203
4.125 -0.230 -0.219 8.632
4.375 -0.205 -0.246 9.077
4.625 -0.273 -0.270 9.983
4.875 -0.243 -0.302 10.997
5.125 -0.384 -0.335 12.167
5.375 -0.491 -0.465 13.473
5.625 -0.541 -0.412 14.053
5.875 -0.494 -0.507 15.851
6.125 -0.569 -0.602 18.404
6.375 -0.691 -0.633 20.121
6.625 -0.703 -0.673 21.354
6.875 -0.924 -0.763 23.243
7.125 -0.802 -0.834 24.250
7.375 -0.799 -0.712 24.634
7.625 -0.898 -0.689 25.236
7.875 -0.814 -0.790 24.538
8.125 -0.824 -0.775 24.449
8.375 -0.763 -0.764 23.992
8.625 -0.687 -0.863 23.950
8.875 -0.599 -0.818 23.076
9.125 -0.685 -0.677 22.662
9.375 -0.569 -0.750 22.992
9.625 -0.565 -0.724 22.283
9.875 -0.560 -0.719 22.823
10.125 -0.549 -0.630 21.754
10.375 -0.408 -0.677 21.841
10.625 -0.471 -0.641 20.996
10.875 -0.439 -0.507 20.742
11.125 -0.496 -0.572 20.570
11.375 -0.427 -0.502 20.435
11.625 -0.407 -0.473 19.778
11.875 -0.370 -0.433 18.923
12.125 -0.340 -0.475 19.514
12.375 -0.342 -0.399 18.478
12.625 -0.370 -0.363 18.463
12.875 -0.368 -0.365 17.092
13.125 -0.395 -0.406 18.217
13.375 -0.350 -0.374 17.646
13.625 -0.419 -0.481 17.920
13.875 -0.377 -0.463 17.616
14.125 -0.394 -0.435 17.734
14.375 -0.423 -0.455 17.409
14.625 -0.331 -0.494 17.508
14.875 -0.347 -0.485 17.032
15.125 -0.252 -0.489 16.618
15.375 -0.269 -0.425 17.000
15.625 -0.329 -0.431 16.471
15.875 -0.278 -0.326 15.013
16.125 -0.260 -0.368 14.937
16.375 -0.189 -0.309 13.557
16.625 -0.244 -0.292 13.825
16.875 -0.190 -0.264 12.167
17.125 -0.192 -0.230 11.408
17.375 -0.213 -0.228 11.330
17.625 -0.156 -0.208 11.057
17.875 -0.200 -0.199 9.740
18.125 -0.180 -0.197 8.697
18.375 -0.190 -0.154 8.010
18.625 -0.168 -0.140 7.521
18.875 -0.194 -0.152 6.508
19.125 -0.188 -0.137 6.550
19.375 -0.221 -0.162 6.891
19.625 -0.151 -0.127 5.438
19.875 -0.166 -0.160 5.959
