0.05000 3431.09244
0.15000 6870.25137
0.25000 8465.03092
0.35000 9308.42140
0.45000 9885.44638
0.55000 9977.75867
0.65000 10002.95773
0.75000 9806.93879
0.85000 9582.94701
0.95000 9261.25153
1.05000 8980.69632
1.15000 8672.77219
1.25000 8277.48726
1.35000 7998.44493
1.45000 7667.44171
1.55000 7353.74143
1.65000 7094.73542
1.75000 6878.58546
1.85000 6498.92322
1.95000 6310.66327
2.05000 6081.31715
2.15000 5842.00999
2.25000 5670.54679
2.35000 5443.90813
2.45000 5206.19231
2.55000 5122.96623
2.65000 4922.32947
2.75000 4777.24026
2.85000 4620.30382
2.95000 4467.68865
3.05000 4294.58408
3.15000 4141.53069
3.25000 3999.56770
3.35000 3912.14685
3.45000 3857.20720
3.55000 3705.55983
3.65000 3625.05468
3.75000 3466.97480
3.85000 3355.86279
3.95000 3328.13416
4.05000 3246.40096
4.15000 3118.78164
4.25000 3016.74162
4.35000 2938.57544
4.45000 2864.92650
4.55000 2813.21993
4.65000 2705.73616
4.75000 2631.06138
4.85000 2556.37245
4.95000 2455.64769
5.05000 2440.65375
5.15000 2328.46878
5.25000 2266.27999
5.35000 2170.79728
5.45000 2158.81506
5.55000 2058.09240
5.65000 1980.54016
5.75000 1942.75668
5.85000 1887.42066
5.95000 1805.87589
6.05000 1746.38505
6.15000 1690.78985
6.25000 1616.33748
6.35000 1557.69967
6.45000 1512.94772
6.55000 1448.15375
6.65000 1414.01544
6.75000 1349.73413
6.85000 1301.07374
6.95000 1255.99570
7.05000 1217.08948
7.15000 1167.24636
7.25000 1134.17022
7.35000 1101.73956
7.45000 1059.37978
7.55000 1059.09016
7.65000 1033.69077
7.75000 993.97276
7.85000 962.76872
7.95000 965.89980
8.05000 919.13436
8.15000 880.35766
8.25000 885.58990
8.35000 865.18793
8.45000 848.20109
8.55000 828.66752
8.65000 796.32586
8.75000 781.04898
8.85000 767.40229
8.95000 741.41194
9.05000 715.05320
9.15000 693.56743
9.25000 663.63916
9.35000 649.32080
9.45000 630.98119
9.55000 627.83473
9.65000 607.56701
9.75000 609.82708
9.85000 573.44423
9.95000 564.10484
10.05000 545.66576
10.15000 552.75641
10.25000 529.11949
10.35000 517.99515
10.45000 508.89191
10.55000 503.33140
10.65000 496.35615
10.75000 481.04004
10.85000 470.75637
10.95000 472.27018
11.05000 444.71993
11.15000 445.92566
11.25000 442.26416
11.35000 423.21605
11.45000 418.28358
11.55000 410.25457
11.65000 405.39513
11.75000 399.26644
11.85000 388.23831
11.95000 391.25995
12.05000 377.17446
12.15000 367.54512
12.25000 361.39048
12.35000 357.43781
12.45000 342.88440
12.55000 339.74459
12.65000 331.57373
12.75000 336.35367
12.85000 323.67559
12.95000 305.80701
13.05000 312.70705
13.15000 295.27122
13.25000 298.71379
13.35000 277.82578
13.45000 284.51330
13.55000 284.07870
13.65000 274.31505
13.75000 275.16210
13.85000 256.87080
13.95000 248.41794
14.05000 247.85545
14.15000 260.41718
14.25000 239.18768
14.35000 245.21727
14.45000 235.65350
14.55000 233.44611
14.65000 228.09248
14.75000 224.59511
14.85000 222.51839
14.95000 230.95455
15.05000 204.58526
15.15000 215.23887
15.25000 207.47145
15.35000 204.44386
15.45000 204.93002
15.55000 193.13496
15.65000 197.29361
15.75000 193.68148
15.85000 194.96488
15.95000 190.87396
16.05000 185.46138
16.15000 189.35211
16.25000 184.99676
16.35000 181.96466
16.45000 174.65965
16.55000 176.15325
16.65000 168.20745
16.75000 168.03612
16.85000 167.15839
16.95000 163.46776
17.05000 160.02084
17.15000 151.58709
17.25000 154.20050
17.35000 143.90446
17.45000 173.79363
17.55000 138.20084
17.65000 143.23336
17.75000 137.86718
17.85000 138.10491
17.95000 127.30230
18.05000 131.43412
18.15000 143.48106
18.25000 126.93540
18.35000 127.46023
18.45000 122.25014
18.55000 118.55292
18.65000 116.94757
18.75000 111.57871
18.85000 110.79979
18.95000 109.89390
19.05000 112.71193
19.15000 112.91417
19.25000 101.88880
19.35000 101.92636
19.45000 115.55048
19.55000 99.20929
19.65000 104.57635
19.75000 99.15665
19.85000 95.91337
19.95000 97.90421
