0.120000 -1.530010
0.380000 -2.258810
0.620000 -2.070770
0.880000 -2.366080
1.120000 -2.377860
1.380000 -2.348640
1.620000 -2.342010
1.880000 -2.307810
2.120000 -2.304480
2.380000 -2.263400
2.620000 -2.271230
2.880000 -2.274410
3.120000 -2.269390
3.380000 -2.274510
3.620000 -2.276720
3.880000 -2.321830
4.120000 -2.323460
4.380000 -2.356240
4.620000 -2.345780
4.880000 -2.326800
5.120000 -2.295180
5.380000 -2.328860
5.620000 -2.341360
5.880000 -2.404510
6.120000 -2.441090
6.380000 -2.516110
6.620000 -2.550950
6.880000 -2.770990
7.120000 -2.887210
7.380000 -3.023520
7.620000 -3.113610
7.880000 3.003240
8.120000 -2.955990
8.380000 2.968550
8.620000 -1.908610
8.880000 -0.309110
9.120000 -1.213890
9.380000 -1.158180
9.620000 -1.805270
9.880000 -1.897380
10.120000 -2.463200
10.380000 -2.377570
10.620000 -2.752010
10.880000 -3.026100
11.120000 -2.979490
11.380000 3.129190
11.620000 3.108860
11.880000 3.060610
12.120000 3.028020
12.380000 2.913760
12.620000 2.864890
12.880000 2.618430
13.120000 2.545280
13.380000 2.287640
13.620000 2.119030
13.880000 1.929710
14.120000 1.715660
14.380000 1.760350
14.620000 1.487740
14.880000 1.219340
