0.05000 1146.55809
0.15000 2007.04729
0.25000 3117.05223
0.35000 3680.39250
0.45000 4230.56287
0.55000 4603.16913
0.65000 4827.70347
0.75000 5052.57519
0.85000 5126.14605
0.95000 5211.93459
1.05000 5124.91673
1.15000 5130.19723
1.25000 5056.11743
1.35000 5044.49489
1.45000 4887.38653
1.55000 4901.42648
1.65000 4767.31171
1.75000 4600.05021
1.85000 4465.02999
1.95000 4393.31703
2.05000 4283.31309
2.15000 4171.88882
2.25000 4046.54469
2.35000 3996.64489
2.45000 3896.08764
2.55000 3798.13702
2.65000 3654.78085
2.75000 3570.28171
2.85000 3486.12298
2.95000 3420.54979
3.05000 3364.11306
3.15000 3258.91218
3.25000 3158.87247
3.35000 3080.73682
3.45000 2998.93144
3.55000 2938.01414
3.65000 2899.99569
3.75000 2791.63753
3.85000 2757.96593
3.95000 2666.18225
4.05000 2593.14338
4.15000 2547.33338
4.25000 2479.96791
4.35000 2417.02871
4.45000 2349.77221
4.55000 2332.01165
4.65000 2256.94768
4.75000 2211.05069
4.85000 2172.64044
4.95000 2084.82751
5.05000 2077.57906
5.15000 2004.57998
5.25000 1956.47602
5.35000 1890.52911
5.45000 1905.98187
5.55000 1827.56809
5.65000 1768.74983
5.75000 1715.30526
5.85000 1706.66997
5.95000 1674.03036
6.05000 1612.72883
6.15000 1578.93373
6.25000 1570.63709
6.35000 1505.97021
6.45000 1484.51410
6.55000 1465.81679
6.65000 1404.32723
6.75000 1409.44585
6.85000 1381.88300
6.95000 1332.13735
7.05000 1323.67015
7.15000 1269.98408
7.25000 1257.11088
7.35000 1230.58564
7.45000 1204.17888
7.55000 1167.40500
7.65000 1154.06033
7.75000 1108.33155
7.85000 1091.96790
7.95000 1065.76212
8.05000 1069.64221
8.15000 1029.37803
8.25000 1006.32769
8.35000 964.78442
8.45000 961.97537
8.55000 949.29204
8.65000 918.58668
8.75000 893.92529
8.85000 873.61684
8.95000 855.44585
9.05000 825.92638
9.15000 817.26679
9.25000 801.46216
9.35000 779.50041
9.45000 760.61460
9.55000 740.93387
9.65000 719.68299
9.75000 704.62836
9.85000 691.15088
9.95000 665.96458
10.05000 667.11146
10.15000 643.59322
10.25000 627.12346
10.35000 619.17808
10.45000 624.42269
10.55000 591.28484
10.65000 581.45024
10.75000 571.89935
10.85000 554.25785
10.95000 551.36840
11.05000 534.31646
11.15000 530.87381
11.25000 528.47496
11.35000 509.92945
11.45000 496.79782
11.55000 497.75684
11.65000 484.33733
11.75000 462.94949
11.85000 465.42587
11.95000 462.83658
12.05000 452.67990
12.15000 443.93604
12.25000 440.30697
12.35000 425.59029
12.45000 421.34931
12.55000 403.93022
12.65000 414.44405
12.75000 403.03635
12.85000 386.91752
12.95000 384.20510
13.05000 377.65843
13.15000 366.66848
13.25000 354.96983
13.35000 359.13230
13.45000 344.29148
13.55000 335.86911
13.65000 334.43466
13.75000 328.08696
13.85000 318.73053
13.95000 322.28036
14.05000 315.35376
14.15000 305.12071
14.25000 307.32420
14.35000 297.59899
14.45000 291.33389
14.55000 288.74471
14.65000 287.19664
14.75000 282.34337
14.85000 271.19500
14.95000 277.74512
15.05000 260.60919
15.15000 263.77203
15.25000 260.55127
15.35000 253.61700
15.45000 247.36026
15.55000 243.81788
15.65000 232.94679
15.75000 233.90065
15.85000 236.51402
15.95000 228.87666
16.05000 224.12921
16.15000 216.81553
16.25000 204.98630
16.35000 210.31704
16.45000 202.31879
16.55000 202.25170
16.65000 196.55325
16.75000 187.46351
16.85000 184.53510
16.95000 182.88348
17.05000 176.43445
17.15000 165.02324
17.25000 166.14897
17.35000 165.84972
17.45000 162.66376
17.55000 162.97245
17.65000 152.87254
17.75000 148.14127
17.85000 151.73252
17.95000 145.04620
18.05000 145.61746
18.15000 134.30215
18.25000 135.70272
18.35000 138.71227
18.45000 132.18709
18.55000 128.74553
18.65000 125.49377
18.75000 119.70322
18.85000 125.80878
18.95000 119.57377
19.05000 124.27345
19.15000 120.45979
19.25000 114.41792
19.35000 115.22037
19.45000 111.47472
19.55000 109.87352
19.65000 111.41888
19.75000 112.94776
19.85000 105.65595
19.95000 102.38829
