0.05000 1538.73981 -649.28155 -863921.79911 2007.19638 1076.88886 916878.88223
0.15000 -922.35816 -768.78446 -15548.15994 2070.16708 909.61698 216271.32493
0.25000 -605.32641 -82.66495 180575.55607 2358.48958 1230.84849 931070.94396
0.35000 -881.53226 194.55152 -73243.32668 2848.49780 960.04065 876839.13823
0.45000 -991.58638 -126.27320 299263.01571 2917.53504 1104.76692 1459547.51859
0.55000 -724.89107 103.73374 -70495.12568 2665.60824 1106.68531 1325106.92669
0.65000 -736.15010 36.31815 15588.41814 2490.53219 1250.63978 1039793.29390
0.75000 -686.15660 44.19492 131684.16057 2567.13362 1288.77476 1137103.31105
0.85000 -987.00866 -9.37786 -25113.73544 2473.99619 1266.13776 868577.81455
0.95000 -953.93887 105.55548 23998.39145 2353.23728 1345.22848 1602264.89052
1.05000 -1202.79507 -50.08709 51362.19169 2247.13998 1361.79815 1334129.72052
1.15000 -1451.90030 -96.64372 -30220.25299 1984.19595 1471.06665 1360818.38010
1.25000 -1676.21578 129.31178 8435.08785 1905.07022 1444.29165 1453898.96951
1.35000 -1934.01218 -20.55269 61645.25963 1566.19318 1496.98402 1476179.57663
1.45000 -2297.38861 73.30322 110739.19341 1113.00278 1500.12985 1662760.40754
1.55000 -2701.14477 -29.00832 -21965.70217 891.02093 1397.39609 1269126.82645
1.65000 -3008.23219 -45.93357 26664.53357 679.49125 1255.03350 1082968.42937
1.75000 -3192.93566 0.38984 -63533.19663 533.54621 1229.65534 1526347.39497
1.85000 -3383.32568 -61.67187 76981.64765 462.57930 1107.24171 1807384.58377
1.95000 -3512.87492 38.35104 14397.65740 416.01868 1047.51062 1856721.34227
2.05000 -3618.97397 -9.19431 -72217.58520 368.40029 961.89720 1612181.58972
2.15000 -3708.62064 -15.49087 -62959.98963 313.69254 909.04563 2130036.11304
2.25000 -3758.40647 -15.39759 8541.62653 288.42830 847.28257 1900398.50836
2.35000 -3835.14376 17.31687 -22740.75378 271.06740 818.99873 1910531.39704
2.45000 -3858.80111 -11.26411 99638.84285 247.81690 744.23178 1692225.57526
2.55000 -3897.14801 4.79535 -43783.75466 225.90383 712.07745 1939611.57039
2.65000 -3910.72360 -38.63024 59361.70585 216.70736 690.65819 1613829.33245
2.75000 -3958.39057 27.35983 -25608.35981 232.07093 656.24661 2208815.52525
2.85000 -3973.09043 0.79340 -85279.19144 236.37177 617.75778 2023169.34093
2.95000 -3977.74927 9.92430 103122.72390 225.51402 600.94253 2041250.34129
3.05000 -3987.53557 -10.90341 7217.08878 227.59396 571.87726 1931426.38013
3.15000 -3985.56466 -22.39356 -14391.22377 231.01101 547.85998 1650694.91209
3.25000 -3985.02646 -17.10492 42383.44976 229.77023 532.12166 2158043.07908
3.35000 -3978.80667 20.17461 81230.44085 225.71900 505.10774 2221114.76622
3.45000 -3974.99190 1.20433 43664.06778 226.86052 492.11527 1986605.32470
3.55000 -3975.10097 5.38440 -3532.95414 236.65399 460.45987 2620928.50630
3.65000 -3965.75799 -6.62427 -87927.29882 235.23759 442.57134 2358733.60242
3.75000 -3951.37816 -2.62281 -120250.70002 234.95127 434.15077 2111772.54114
3.85000 -3949.56527 -1.96910 -3869.53801 239.19416 416.71120 2474621.42866
3.95000 -3934.67628 -12.17179 -15947.47599 232.76339 397.63101 2128042.13628
4.05000 -3926.55147 -1.29421 -59852.13624 227.60435 384.69811 2499594.88904
4.15000 -3913.94092 -0.46015 94906.93548 238.23605 373.69795 2367307.25178
4.25000 -3899.85301 -3.97248 -7540.12675 237.80906 368.47939 2293052.77157
4.35000 -3873.13393 5.75426 31903.48489 228.62631 347.31564 2464274.11358
4.45000 -3849.37066 -13.29341 -47272.07188 223.14410 334.71811 2176953.44214
4.55000 -3844.36889 9.41520 -36238.60603 222.32876 324.73347 2129128.67209
4.65000 -3815.55442 -15.56843 -35161.35597 218.61258 321.95978 2319863.46711
4.75000 -3807.68608 4.76289 -138228.19212 224.15532 304.59661 2270923.58312
4.85000 -3787.78536 -1.74293 18887.02662 217.58933 307.92737 2270408.84187
4.95000 -3752.08154 5.29662 -68101.00283 202.82422 295.03199 2157122.68655
5.05000 -3750.06898 -2.54585 23094.01376 204.78809 291.30999 2644314.42629
5.15000 -3721.17986 -3.34175 -82466.65189 196.78066 275.57032 2411179.92070
5.25000 -3704.02674 0.20003 40291.48592 199.72328 277.76684 2160234.50217
5.35000 -3695.33220 6.23622 -105381.21257 199.83441 271.76532 2366859.66590
5.45000 -3673.04816 6.51002 16465.02572 189.70604 257.32029 2285987.57332
5.55000 -3654.32289 2.43502 -18796.74338 189.94838 257.08517 2207939.09678
5.65000 -3645.06199 1.76698 -59907.51377 186.95825 246.96165 2265732.69388
5.75000 -3621.46589 2.46637 -48743.25127 184.40940 243.42999 2161077.61972
5.85000 -3612.89587 4.92784 -32427.02026 184.87802 241.83922 2136110.96702
5.95000 -3589.03297 -0.06616 49165.31210 188.67861 232.91313 2540176.23602
6.05000 -3574.85631 -0.48587 74660.51937 179.81068 230.88790 2398050.90901
6.15000 -3548.22535 4.02568 65339.68962 183.94086 221.25735 2186770.56920
6.25000 -3534.14238 0.85109 -72286.79678 178.01613 220.34538 2101020.29395
6.35000 -3519.68208 2.77819 13834.56554 172.36202 216.13704 2396870.78614
6.45000 -3501.11426 0.13888 20783.27650 172.10772 209.76694 2205602.33703
6.55000 -3493.11412 1.93764 18192.99839 171.57077 209.24505 2144168.52490
6.65000 -3480.34849 -1.56196 -49262.48918 168.39981 203.11397 2185749.31232
6.75000 -3465.55734 -3.84551 267.91429 171.57445 199.78630 2276002.45473
6.85000 -3440.03873 -0.67154 73227.03614 169.92378 192.13751 2208364.34537
6.95000 -3427.22173 -1.24945 -48123.88944 166.68162 192.78694 2084101.15137
7.05000 -3407.41427 0.62651 -19626.12155 168.21390 184.42566 2595288.84392
7.15000 -3395.26251 -2.09957 39762.45000 168.90312 189.32973 2415438.80871
7.25000 -3379.79264 5.71816 50098.87806 160.62655 181.79637 2311824.44072
7.35000 -3368.73510 0.29916 -17479.07723 166.76801 181.44679 2011501.63552
7.45000 -3344.66642 -2.08788 25143.25117 164.27687 176.28974 2290415.90458
7.55000 -3334.45457 -6.07976 56447.36509 163.13044 174.64370 2188222.23035
7.65000 -3319.68560 1.38192 -77259.71150 161.32976 170.09546 2212625.14421
7.75000 -3293.34634 -0.48601 24977.57008 156.80578 163.56004 2334306.58536
7.85000 -3279.01979 -0.36173 10694.18936 155.17215 165.88725 2137923.59375
7.95000 -3262.77937 -2.25785 117536.39322 153.76939 162.29598 2202157.25947
8.05000 -3246.65597 -4.67499 11754.25044 148.86762 160.81566 2095993.81219
8.15000 -3229.16318 3.84982 -15968.02072 146.69626 156.67579 2365128.99171
8.25000 -3215.80009 -2.08395 9556.98707 147.92891 154.45170 2224640.92546
8.35000 -3201.78135 2.78100 1014.66240 149.74165 154.41407 2215469.41834
8.45000 -3187.56781 0.55938 208.37737 150.20380 151.93682 2348489.47673
8.55000 -3169.04825 -0.87553 33250.03792 147.87289 148.43853 2154344.57792
8.65000 -3152.27209 7.02773 -105952.81147 147.88420 144.32330 2297220.63267
8.75000 -3139.33725 0.70716 8531.61569 148.27815 144.03302 2207038.76675
8.85000 -3122.64944 -1.16855 4717.62560 147.13983 142.53352 2366248.22854
8.95000 -3104.19433 1.12409 53349.43690 143.46291 139.43738 2327024.95792
9.05000 -3089.86888 0.68541 27255.48215 146.67246 137.91524 2448815.53425
9.15000 -3070.12508 -1.69357 62174.27673 142.13779 136.72991 2461056.83317
9.25000 -3052.68660 -3.44621 -26649.23642 141.28049 134.38989 2287866.51016
9.35000 -3041.46295 -2.07718 73254.74429 141.68201 130.67166 2227626.43382
9.45000 -3025.16521 -1.74198 22323.34931 139.72505 126.91242 2162174.98261
9.55000 -3006.88774 4.08770 -46331.60583 140.58207 127.63476 2105176.43737
9.65000 -2991.14943 -1.04428 -30170.77783 139.29771 125.16699 2130997.26419
9.75000 -2980.04357 -2.13996 97132.66902 136.43580 125.50847 2234032.68980
9.85000 -2962.15657 1.61184 29950.02214 139.76669 121.48134 2492570.43757
9.95000 -2951.64962 -0.14647 52194.21933 137.59792 119.84810 2066969.18161
10.05000 -2931.78120 -0.15977 -19891.87752 138.81720 120.45479 2027989.50574
10.15000 -2922.59247 0.38377 -32178.82592 139.38295 115.84713 2301936.61603
10.25000 -2907.28196 -0.48163 66771.08604 136.22773 115.50050 2518028.58002
10.35000 -2891.23556 -0.51455 -8439.50294 136.01548 115.45417 1974551.98669
10.45000 -2880.19405 3.87603 -2055.50846 137.63781 114.46932 2347769.12321
10.55000 -2863.25642 -2.57015 -25327.93924 133.26201 109.69167 2146410.47401
10.65000 -2849.24217 -2.58054 -1946.22650 137.05977 110.85966 2217452.94178
10.75000 -2836.82491 -0.72460 -9685.30469 135.80720 107.29692 2288917.89469
10.85000 -2819.50895 -0.81690 -19323.18199 135.10554 106.03083 2114309.98281
10.95000 -2811.16726 -0.77908 -77233.77356 134.04019 104.55009 2379789.12071
11.05000 -2786.26299 0.05232 -14080.85358 133.79025 102.74299 2097538.25129
11.15000 -2774.96678 1.10404 80254.78688 134.67707 101.75020 2089228.75073
11.25000 -2763.21970 1.03242 59832.73936 131.93047 101.00652 2246851.19225
11.35000 -2751.70046 0.15709 29826.40469 131.47093 100.10721 2085253.67545
11.45000 -2731.58455 -3.71776 19296.33232 130.22451 100.18802 2187080.45570
11.55000 -2715.92335 3.43026 5313.57422 130.81408 97.50773 2259856.63958
11.65000 -2708.79397 -1.05150 -13429.37991 132.28642 96.73355 2129609.92869
11.75000 -2697.06980 -0.24076 16617.98249 129.80020 94.51707 2394369.76915
11.85000 -2677.00184 0.02401 47225.31224 127.45386 92.99399 2271299.95803
11.95000 -2666.87022 1.17338 23740.26165 126.75792 93.69866 1872607.33102
12.05000 -2655.84316 -1.10557 35206.39062 126.30187 92.42512 2069077.80870
12.15000 -2640.16370 1.82482 -71054.09043 129.26344 90.24491 2036350.06012
12.25000 -2625.68812 1.11756 64893.72728 125.34298 88.47112 2110771.18473
12.35000 -2612.34930 2.25096 -42470.70335 124.04734 88.53185 2214139.93507
12.45000 -2603.06761 0.93871 -47241.06723 121.72540 89.11527 2049639.01417
12.55000 -2587.72488 0.43379 16951.45016 122.97241 87.20877 2024842.75711
12.65000 -2576.38647 0.73980 9661.23786 120.19607 85.49951 2152271.59401
12.75000 -2559.87133 -0.24685 -721.92295 118.54866 83.68792 2140405.68171
12.85000 -2551.94598 0.21698 8698.92160 115.84128 84.98949 2146713.95339
12.95000 -2535.77537 0.50422 -3325.29899 117.60890 81.78761 2115826.91786
13.05000 -2523.95296 -0.72845 37669.64599 117.40101 81.32808 2183076.70550
13.15000 -2515.75429 0.73149 421.45400 116.57062 80.70820 2232791.46009
13.25000 -2500.04479 -0.63767 7020.68405 113.63836 80.78158 2157748.94627
13.35000 -2489.51640 0.57846 53231.95597 115.30041 77.19225 2133626.60988
13.45000 -2475.52791 -1.18931 -72176.18821 112.58514 77.53069 2138777.24235
13.55000 -2469.94367 -0.04661 21690.78603 115.29119 78.56887 1997826.48869
13.65000 -2454.23038 -2.87843 -32250.87692 110.38699 77.89596 2077269.06391
13.75000 -2444.90733 -0.46596 50072.10920 111.09157 74.98752 1905469.40501
13.85000 -2433.21118 0.40305 -30256.90850 112.96263 73.02200 2154844.80456
13.95000 -2417.92035 0.67055 18181.96429 111.51017 72.10706 2171795.11946
14.05000 -2407.53871 1.94115 -71889.86869 112.31190 73.84362 2068865.54678
14.15000 -2397.30590 2.50209 -61403.56580 111.30119 70.53214 2184532.71462
14.25000 -2383.33392 1.50426 -16021.44972 108.81072 71.13835 2123106.02624
14.35000 -2370.88261 0.91451 4880.74412 107.52062 71.21832 2086701.90830
14.45000 -2359.99219 -0.69381 -4471.32936 105.49372 68.56885 2015147.87652
14.55000 -2353.25189 0.16012 -47129.40209 108.01478 69.57913 2120457.89466
14.65000 -2338.77488 -0.44706 -70221.37777 105.99967 68.78126 1905062.51526
14.75000 -2327.16844 0.15687 76717.87659 105.99760 67.23736 2057592.75119
14.85000 -2313.26126 0.57570 190.54255 102.65924 66.89963 2064434.63692
14.95000 -2308.09779 -2.00505 18809.57805 105.05309 66.67240 1953071.59862
15.05000 -2295.63491 -0.53470 -16736.86067 101.95741 66.73310 2066973.66184
15.15000 -2285.68968 1.86874 -12091.10828 102.89109 65.13839 1976063.98864
15.25000 -2273.75924 -2.38100 -28758.06921 101.39251 64.62299 2127011.72941
15.35000 -2263.86780 -0.55476 -52470.92183 100.35965 65.50874 1917291.46190
15.45000 -2252.19690 -0.24916 20371.73449 100.85888 63.50755 2155754.55493
15.55000 -2239.67006 1.10794 -8197.00026 99.29383 65.59355 1921280.68184
15.65000 -2232.10876 -2.62906 5371.15128 97.51366 62.74514 1996845.39272
15.75000 -2220.70500 -0.69661 34661.39432 97.18303 61.77757 1960018.35144
15.85000 -2210.30253 0.93379 -3250.27771 96.71630 60.68580 1859211.27810
15.95000 -2201.31674 2.03882 -40949.82350 95.09339 60.85957 1963347.54023
16.05000 -2188.88133 1.05295 -29509.48286 94.27878 58.21707 1865750.35741
16.15000 -2180.54992 0.66220 13325.26945 93.38331 59.75476 2029574.28127
16.25000 -2172.65894 -0.00401 20253.32684 94.63190 58.92006 1736995.79828
16.35000 -2162.20595 -0.92881 -8125.05125 92.49496 58.40112 2009643.21179
16.45000 -2148.92031 -0.15641 -58375.55798 93.35725 58.13874 1922785.92738
16.55000 -2142.37773 0.78892 15190.09938 90.59793 57.76052 1890664.79173
16.65000 -2132.83024 -1.26312 30367.69118 94.71920 57.70980 1829091.79949
16.75000 -2124.34384 -1.43027 24542.15837 92.72214 55.80939 1928907.69596
16.85000 -2115.18866 1.45223 17951.97019 91.21191 55.76965 2129710.06144
16.95000 -2104.83278 -0.09351 -28072.54176 90.14874 55.86100 1949367.39782
17.05000 -2095.06502 0.37684 37818.36811 89.06069 54.82156 2048376.12883
17.15000 -2084.55176 1.38971 -19888.77179 86.61555 54.89866 1742344.66740
17.25000 -2074.17993 0.71992 3780.51906 86.02316 53.00146 1878875.69599
17.35000 -2066.39414 -0.88336 37959.37092 86.65300 52.84487 1838123.87608
17.45000 -2054.78450 1.46527 1099.14193 87.35327 50.63943 1831205.98690
17.55000 -2050.60078 0.68721 24361.37762 83.66500 50.02137 2051748.86182
17.65000 -2035.80296 -1.02556 76086.85641 85.27241 52.85345 1904068.03981
17.75000 -2028.57240 0.12413 -57833.97122 85.70095 50.42801 1930537.02756
17.85000 -2019.68934 -0.02564 -28926.29761 85.92435 50.16943 1800697.02550
17.95000 -2010.76113 0.79412 -28172.27361 83.18535 50.29618 1662926.52440
18.05000 -2003.15802 1.86399 6991.60227 81.45585 47.79593 1911334.06153
18.15000 -1992.94983 1.78853 2585.25211 82.70604 48.81835 1900028.27397
18.25000 -1984.22080 -1.42317 10559.35278 81.44093 47.41520 1769049.96277
18.35000 -1973.23152 0.44071 7733.47062 81.39797 48.83938 1728750.86179
18.45000 -1964.73214 -0.81366 -28075.98168 79.80433 48.35993 1831042.53975
18.55000 -1958.74081 -0.65096 -25261.73991 79.05479 47.99018 1882240.63898
18.65000 -1943.69457 0.44193 -21231.35465 77.94154 46.49070 1716009.00794
18.75000 -1940.21717 -0.89641 3059.85161 78.75409 46.93350 1865973.96878
18.85000 -1931.41121 -0.15238 43350.06645 77.22194 47.05796 1755044.22549
18.95000 -1921.16826 -0.67135 -32518.55730 77.96240 46.78687 1736436.25912
19.05000 -1912.45519 0.70988 -7790.54224 77.74039 45.47987 1883512.08331
19.15000 -1904.25614 0.41389 -62659.07477 76.05816 45.25810 1955578.31786
19.25000 -1896.10779 -0.20204 47103.96477 75.15898 44.28721 1642812.10282
19.35000 -1890.22381 0.26985 -49617.67472 76.86277 44.43017 1652666.80200
19.45000 -1877.66281 -1.26216 40809.81765 74.73287 44.04200 1731873.49260
19.55000 -1868.32426 0.59027 -3199.22208 73.82241 41.80433 1917416.22819
19.65000 -1863.04090 0.43888 -4017.38905 74.39331 43.22975 1950766.85681
19.75000 -1855.88199 -0.04244 72333.44491 71.32024 43.09039 1672163.48737
19.85000 -1845.63733 0.71328 -24410.96516 73.62872 43.01918 1678886.81963
19.95000 -1839.45630 -0.77165 -7883.05281 72.41742 42.82166 1832494.91396
