0.2 -0.00985 20.10953 0.17588 108.26 105.24385 85.49062
0.6 -1.22834 43.81715 -0.07103 106.96434 97.78292 81.99392
1.0 -0.32599 63.97682 0.07146 105.19231 90.15883 78.11987
1.4 0.11466 76.49045 0.58143 102.64774 84.3217 73.45307
1.8 0.30825 85.89188 1.10187 98.35655 78.91078 67.69682
2.2 -0.10869 92.6941 0.97531 94.08618 74.42448 63.47623
2.6 -0.31699 100.59904 1.97364 88.49512 70.50859 60.18981
3.0 -0.99287 106.66742 0.7934 81.92379 66.68251 56.78706
3.4 -0.03384 114.7845 -0.69956 74.68091 64.3468 54.31512
3.8 0.31424 123.04055 -1.26081 67.48246 62.67129 51.3838
4.2 1.2455 134.16394 -1.8726 60.98297 61.57556 48.93468
4.6 1.84191 147.17799 -1.37005 55.39928 58.30524 45.81946
5.0 2.52555 160.4472 -1.89924 51.39579 52.71244 42.55731
5.4 2.15937 172.99603 -1.4392 47.8737 45.76846 39.22339
5.8 1.86676 181.27853 -0.75678 44.931 40.13933 36.04503
6.2 0.74107 184.62104 -0.7959 43.38967 34.7897 33.08274
6.6 0.57866 184.56375 -0.60883 41.68918 32.45166 30.55895
7.0 -0.04767 184.14705 -0.40558 41.03949 30.91809 27.99244
7.4 -0.13792 184.99455 -0.08306 40.27535 30.47857 26.80212
7.8 0.11142 187.08879 0.12766 39.92117 29.9121 25.42233
8.2 -0.32238 188.5179 -0.01892 39.17486 28.69883 24.54394
8.6 -0.15084 190.11968 -0.4203 38.1528 27.4415 23.70069
9.0 0.38589 191.4868 0.30717 36.40893 26.17932 22.67055
9.4 0.57774 192.5467 -0.01774 34.84126 25.79747 21.63912
9.8 1.32812 194.24342 0.1116 32.18312 25.56335 20.88787
10.2 0.77191 195.53307 0.07821 30.79004 24.56861 20.06396
10.6 0.62678 196.50294 0.72597 28.89388 24.32348 19.30326
11.0 0.72691 198.56391 0.83726 27.80538 24.31727 18.67557
11.4 0.44752 200.2873 0.7856 26.25986 23.05442 17.71203
11.8 -0.49441 202.15541 0.89627 25.72793 21.65875 17.22144
12.2 0.05097 203.54612 0.78814 25.32613 19.9594 16.62262
12.6 -0.42197 204.12189 0.8395 24.7625 17.6693 16.14437
13.0 -0.29689 203.16884 0.72882 23.80873 16.76533 15.94096
13.4 0.1721 203.0487 0.72658 22.95025 16.00196 15.32836
13.8 0.627 201.68218 0.53686 21.95808 15.81836 14.71103
14.2 0.45631 201.48062 0.28637 21.13796 15.81371 14.32848
14.6 0.49474 201.71254 0.12962 20.07564 15.83963 13.28351
15.0 0.27232 202.12379 0.1337 18.75554 15.78999 12.74154
15.4 0.77057 202.76326 -0.4155 18.16468 15.56355 12.31257
15.8 -0.11335 204.18501 -1.11671 16.89152 15.3111 11.99847
16.2 -0.57587 205.65714 -1.10247 15.35221 14.53519 12.3136
16.6 -0.1548 206.44308 -1.58007 14.98345 12.86376 12.20144
17.0 -0.62604 206.31106 -1.35838 15.22249 11.7027 12.176
17.4 0.39747 206.04485 -1.06597 14.90737 11.64776 11.86108
17.8 -0.94873 205.9049 -0.98202 15.12842 10.57272 12.07725
18.2 -0.32393 206.03969 -0.38105 14.4245 9.66844 11.74957
18.6 -0.36564 205.76027 -0.50855 13.79154 9.31615 11.52568
19.0 0.08407 205.48177 0.29921 12.81516 9.40867 11.11269
19.4 0.26114 205.46954 0.30466 12.30541 9.23129 10.47957
19.8 0.88552 204.92373 0.47728 11.83948 8.94731 9.86193
