0.120000 2.367770
0.380000 1.183180
0.620000 1.293390
0.880000 1.242030
1.120000 1.262530
1.380000 1.266690
1.620000 1.272680
1.880000 1.264720
2.120000 1.287220
2.380000 1.234150
2.620000 1.210870
2.880000 1.183120
3.120000 1.161430
3.380000 1.200620
3.620000 1.170030
3.880000 1.186010
4.120000 1.173380
4.380000 1.160540
4.620000 1.221710
4.880000 1.248000
5.120000 1.291530
5.380000 1.334490
5.620000 1.399130
5.880000 1.414510
6.120000 1.486730
6.380000 1.617490
6.620000 1.621310
6.880000 1.707830
7.120000 1.677370
7.380000 1.738340
7.620000 1.692480
7.880000 1.733000
8.120000 1.806890
8.380000 1.809590
8.620000 1.915880
8.880000 1.576700
9.120000 1.877290
9.380000 2.184360
9.620000 2.535250
9.880000 2.573590
10.120000 2.728550
10.380000 2.582400
10.620000 2.757510
10.880000 2.562980
11.120000 1.937650
11.380000 2.999270
11.620000 2.220930
11.880000 2.171730
12.120000 1.777210
12.380000 1.302440
12.620000 1.993450
12.880000 1.893690
13.120000 1.624370
13.380000 1.480630
13.620000 0.832370
13.880000 1.161720
14.120000 0.673210
14.380000 0.162430
14.620000 -0.037600
14.880000 -0.173200
