0.1875 1.00121 17.46557 -1.55675 100.40616 99.06332 89.73485
0.5625 0.84104 42.21922 0.6846 98.73201 93.03334 83.39996
0.9375 -1.59485 63.3546 0.22206 92.86854 87.01869 76.65416
1.3125 -0.30153 78.92784 -0.07569 87.81126 78.95569 72.32788
1.6875 -1.44011 91.89593 0.65722 82.24046 73.69431 68.42857
2.0625 0.3067 103.70866 0.17451 77.86256 71.08527 64.94489
2.4375 -1.74716 114.11129 1.07242 73.6268 67.49065 60.57302
2.8125 0.13225 129.62532 1.65193 69.2998 62.85639 56.08
3.1875 -0.32183 140.17956 1.05696 64.26061 58.14116 52.71127
3.5625 -0.59437 150.39375 -0.59374 60.35406 54.01859 49.31366
3.9375 1.25487 157.65897 -0.87625 56.11509 49.53099 46.84507
4.3125 1.26813 163.78273 -0.75953 51.82586 45.86319 43.7575
4.6875 0.67813 169.26968 0.53702 49.13796 42.92498 41.63729
5.0625 -0.17497 174.80091 0.35299 46.48884 41.39187 39.18634
5.4375 0.04236 180.64181 -0.09437 44.4863 39.1379 36.84743
5.8125 0.21554 184.93639 -0.08396 43.10633 36.9048 35.89387
6.1875 0.9283 188.62781 -0.1432 41.76212 35.2989 34.60617
6.5625 0.49305 190.8019 0.12975 39.69361 33.41735 33.58009
6.9375 1.2447 193.49422 -0.63154 38.5036 32.1035 31.9146
7.3125 1.93844 195.44187 -0.95169 36.93131 31.57462 30.51042
7.6875 2.458 198.42642 -0.61874 36.05588 29.44761 29.07167
8.0625 1.15094 200.23022 -0.74078 34.70477 27.98367 27.61913
8.4375 1.52232 201.92714 -0.31292 33.46526 27.23629 26.62117
8.8125 2.06524 203.53241 -0.32935 32.79653 26.826 25.93532
9.1875 1.22517 204.96017 -0.16496 31.8909 25.64891 24.77073
9.5625 0.95432 206.82783 0.81754 30.12858 24.63548 24.30017
9.9375 -0.03227 208.37072 1.76159 30.43558 23.38324 23.37371
10.3125 0.25769 209.37333 1.61562 28.76275 22.00735 22.71052
10.6875 -0.26713 209.46471 1.56561 28.59392 21.8403 22.38681
11.0625 0.119 210.06446 1.80919 27.4989 20.30539 21.74448
11.4375 -0.01921 209.81381 2.3383 27.07814 19.47729 20.67655
11.8125 -0.49258 209.88849 2.07595 26.20137 18.90472 20.26205
12.1875 0.23725 209.67334 1.0423 26.28456 18.57412 19.8687
12.5625 -0.11029 210.25576 0.29993 24.72387 18.57646 18.86453
12.9375 -0.76856 210.3391 0.11776 23.93161 18.52123 18.4507
13.3125 -1.10884 211.03764 -1.32608 23.28309 18.08408 17.52738
13.6875 -1.18565 211.27504 -1.73899 22.78222 17.33313 17.50941
14.0625 -1.98587 211.93868 -1.96755 21.39895 16.58322 16.52851
14.4375 -2.0246 212.27483 -2.15003 21.14525 15.92015 16.12189
14.8125 -1.93203 211.94737 -2.08699 21.07143 15.23914 15.57837
15.1875 -1.19297 212.4146 -1.85863 19.63388 14.54852 15.21686
15.5625 -2.5667 212.09299 -2.04073 18.77036 14.33165 14.06243
15.9375 -1.97017 211.90987 -1.45649 18.46291 13.00165 14.77512
16.3125 -1.87807 211.95719 -1.5877 18.71036 13.48879 14.51961
16.6875 -1.91402 211.85257 -1.97618 17.71088 12.68761 13.49615
17.0625 -1.353 211.4417 -3.126 17.16407 12.14765 13.00868
17.4375 -0.78124 211.26049 -2.5904 16.6967 12.44526 12.9038
17.8125 -0.60714 210.80805 -2.41745 16.59 11.59273 12.65342
18.1875 -1.07164 211.85867 -2.55797 15.4839 12.09823 11.86807
18.5625 0.07213 210.30219 -2.19093 15.78597 10.93173 12.37411
18.9375 -1.00515 210.63345 -2.03741 15.73412 11.02176 12.09189
19.3125 0.42195 210.36402 -2.05824 14.78925 10.05511 12.85113
19.6875 -1.15917 209.95493 -0.03501 14.99802 10.54618 12.75697
20.0625 -1.10507 210.26196 -0.86692 14.55704 10.08328 12.84163
20.4375 -1.76955 210.13992 -0.64103 14.60297 10.12299 11.93771
20.8125 -0.36581 209.22339 -1.74305 13.75028 10.29022 11.37758
21.1875 0.17061 209.2794 -0.69625 12.98731 8.78422 12.14613
21.5625 0.63634 208.98308 -1.70752 12.88089 9.31617 11.65863
21.9375 0.16253 208.52276 -0.93369 12.95546 9.33402 10.75037
22.3125 0.49613 208.37685 -1.59708 12.01012 9.86466 10.87073
22.6875 1.06664 207.93056 -1.34212 12.73655 9.07617 10.7679
23.0625 0.01486 207.91827 -1.16026 11.89304 8.58706 10.37315
23.4375 1.42053 208.42424 -1.59344 12.10769 8.6007 10.06076
23.8125 1.07192 206.46436 -1.06114 11.58284 8.36006 8.94449
24.1875 0.46763 207.50222 -2.19083 10.20006 7.49007 8.66141
24.5625 0.2193 207.1063 -0.61807 10.33803 8.48495 9.06298
24.9375 0.40206 208.38723 -2.11965 9.19909 7.06723 8.84955
25.3125 1.00206 207.01397 -3.04847 9.08418 6.84073 8.3796
25.6875 0.22954 208.71425 -3.8239 9.9537 7.41645 6.57291
26.0625 1.41024 207.24568 -3.99175 10.18348 6.29302 7.31516
26.4375 0.4415 206.76444 -3.59342 10.00462 6.21852 8.22533
26.8125 -1.20685 205.93567 -2.62802 10.07889 7.56663 7.01893
27.1875 0.01264 206.27574 -3.12329 10.19074 6.90236 7.35615
27.5625 -0.00395 205.54927 -1.60485 8.13899 6.42657 6.66253
27.9375 0.28275 206.68359 -0.88389 7.24567 5.07083 6.32785
28.3125 0.20424 206.52657 -2.12425 8.40011 5.96062 7.09176
28.6875 -0.84894 205.38178 -1.99241 8.24476 5.9984 8.14152
29.0625 -0.16117 204.26944 0.15504 9.37409 6.93808 6.96315
29.4375 0.23985 204.23106 -0.67815 8.92588 5.12222 7.57635
29.8125 -1.46349 204.06943 -0.02226 8.53998 5.46054 7.24408
