0.12500 0.01889
0.37500 0.07143
0.62500 0.15425
0.87500 0.22867
1.12500 0.28298
1.37500 0.31972
1.62500 0.35429
1.87500 0.38060
2.12500 0.40081
2.37500 0.42308
2.62500 0.43974
2.87500 0.46537
3.12500 0.46508
3.37500 0.47216
3.62500 0.49010
3.87500 0.49316
4.12500 0.48732
4.37500 0.46777
4.62500 0.44581
4.87500 0.38124
5.12500 0.30194
5.37500 0.23487
5.62500 0.19465
5.87500 0.15760
6.12500 0.13853
6.37500 0.11917
6.62500 0.11930
6.87500 0.12075
7.12500 0.11494
7.37500 0.10693
7.62500 0.12752
7.87500 0.11869
8.12500 0.09923
8.37500 0.09074
8.62500 0.06175
8.87500 0.05727
9.12500 0.04716
9.37500 0.01419
9.62500 0.02679
9.87500 0.01611
10.12500 0.03509
10.37500 0.03587
10.62500 0.03926
10.87500 0.06391
11.12500 0.06321
11.37500 0.08820
11.62500 0.09412
11.87500 0.09335
12.12500 0.08760
12.37500 0.12106
12.62500 0.09046
12.87500 0.09310
13.12500 0.09964
13.37500 0.09179
13.62500 0.10586
13.87500 0.13388
14.12500 0.13872
14.37500 0.17811
14.62500 0.22025
14.87500 0.23208
