0.1875 0.60989 16.23867 1.22543 74.19204 74.95198 71.51185
0.5625 -0.7232 35.26268 -1.63563 73.87425 74.18917 68.97794
0.9375 -0.66102 57.87055 -0.54552 71.699 71.00587 65.76218
1.3125 -0.78251 76.22604 -1.372 67.97321 66.6155 63.45193
1.6875 -0.06773 92.31466 -1.0208 64.97412 64.08457 60.4757
2.0625 -0.86756 105.03318 -0.23223 62.25788 59.91296 57.95885
2.4375 0.28489 116.51797 -0.22094 59.69915 57.39287 55.48678
2.8125 -0.20108 126.48785 0.27467 56.9511 54.71341 53.32262
3.1875 0.13587 135.88765 0.24426 54.29165 52.08901 51.21565
3.5625 0.43396 143.8927 0.94272 52.20296 49.62825 48.92889
3.9375 1.0654 150.99153 1.21587 50.12706 47.71505 46.7159
4.3125 0.54041 157.65136 0.18889 48.75556 44.83189 44.71605
4.6875 0.39791 163.51248 0.79915 47.06065 43.16039 42.7242
5.0625 0.1991 169.60708 0.22986 45.58416 41.10684 40.95157
5.4375 -0.47256 174.99377 0.53026 44.04618 39.419 39.41197
5.8125 -0.48051 180.15153 0.08418 42.35684 36.61579 37.66377
6.1875 -0.52159 183.64488 -0.11566 41.00042 34.69849 36.06959
6.5625 -0.28412 187.34049 -0.3781 39.70364 33.37343 34.89031
6.9375 -0.19529 190.0935 -0.21921 38.54162 32.08184 33.09247
7.3125 -0.24423 192.95253 -0.10087 37.27976 30.5401 32.11151
7.6875 0.14619 195.57354 -0.06779 36.20913 29.50535 30.71528
8.0625 0.06213 196.9913 0.13658 34.84651 28.58177 29.63414
8.4375 0.16822 198.96058 -0.24442 33.62717 27.52303 28.38044
8.8125 0.48356 201.33657 0.08998 32.57409 26.52565 27.16806
9.1875 0.04873 203.29091 0.10701 31.5687 25.77712 26.1782
9.5625 -0.15386 204.62319 0.31945 30.72687 25.38103 25.20619
9.9375 -0.13618 206.8756 -0.32384 29.69556 23.92664 24.44895
10.3125 0.00398 207.7037 -0.66799 28.74789 23.08527 23.33022
10.6875 -0.14058 209.27993 -0.80244 27.58592 22.41145 22.51058
11.0625 -0.45632 210.07153 -0.73096 26.63684 21.3248 21.66212
11.4375 -0.40566 210.85252 -0.56633 26.14145 20.03447 20.95293
11.8125 -0.72537 211.22098 -0.35122 25.45062 19.56244 20.16676
12.1875 -1.13066 211.48855 -0.12692 24.79164 19.12889 19.83047
12.5625 -1.07376 212.2476 0.22052 23.88158 18.35418 18.90394
12.9375 -0.95677 212.40507 0.47054 23.08003 17.41886 18.4489
13.3125 -0.81707 212.68557 0.60675 23.01186 17.05547 17.50583
13.6875 -0.65441 213.41214 0.58014 22.16941 16.46258 16.99176
14.0625 0.03702 213.32111 0.56694 21.07186 15.7835 16.36177
14.4375 0.0577 213.48529 0.72842 20.4008 15.35373 15.86748
14.8125 -0.22717 213.8949 0.2964 20.14105 14.69231 15.22989
15.1875 0.33409 213.74778 0.64309 19.69451 14.47777 14.77006
15.5625 -0.08324 213.51376 0.33448 18.78508 14.32888 14.61726
15.9375 0.03708 213.5793 0.50782 18.67544 14.10356 14.11755
16.3125 -0.25619 214.10256 0.1191 17.55134 13.53902 13.67338
16.6875 -0.3878 214.04665 -0.62981 17.4211 12.90562 13.17654
17.0625 -0.26617 213.90678 -0.48816 17.01748 12.58129 12.82917
17.4375 -0.47918 213.9644 -0.21305 16.22366 12.41742 12.48452
17.8125 -0.41828 213.85171 -0.2688 15.90857 12.04732 11.85869
18.1875 0.36121 214.60681 0.18116 15.64815 11.61823 11.41719
18.5625 -0.02857 213.86798 0.45043 15.4118 11.03209 11.23671
18.9375 -0.14372 213.53812 0.23712 14.81037 10.4774 10.86473
19.3125 -0.11884 212.73615 0.00166 14.61031 10.52379 10.64422
19.6875 -0.94807 212.51973 0.15011 14.06858 10.00591 10.63033
20.0625 -0.58744 212.76863 -0.04435 14.22544 10.80699 10.04536
20.4375 -0.63371 213.88068 -0.75731 13.25187 10.25217 9.8994
20.8125 0.05981 213.75297 -0.49083 12.82134 9.84987 9.29021
21.1875 0.54738 212.82052 -0.80289 12.84754 9.16296 9.20334
21.5625 0.08867 212.22744 -0.57572 12.39783 8.65365 8.99055
21.9375 0.27653 211.17377 -0.54439 11.95839 8.40964 8.70901
22.3125 -0.95909 211.26599 -0.31841 11.67954 8.91559 8.71362
22.6875 -1.76507 211.22191 -0.5754 11.88324 8.21002 8.51896
23.0625 -1.24891 210.79255 -0.15379 11.66843 8.65034 8.48723
23.4375 -1.44557 211.05469 -0.44253 11.27054 8.14622 7.36282
23.8125 -1.08572 211.04702 -0.19728 11.47694 8.36595 7.92774
24.1875 -1.11367 211.74316 -0.2141 10.39232 7.3755 7.56379
24.5625 0.01908 211.75102 -0.56066 10.22786 6.73064 7.26396
24.9375 0.15315 210.10531 -0.08358 10.07353 6.38979 6.9628
25.3125 0.52109 209.37391 -0.54472 9.49989 6.48362 7.03098
25.6875 -0.24101 209.15868 -0.53426 8.98677 6.54862 7.11765
26.0625 -0.20691 208.77039 -0.46748 9.48764 6.57246 6.71427
26.4375 -0.77719 209.12894 -0.4844 8.76886 6.53776 6.28428
26.8125 -1.20339 208.66265 -0.25883 8.36346 6.08537 6.29071
27.1875 -1.10471 208.93583 0.41071 8.64931 6.08296 5.92351
27.5625 -1.04942 208.64443 -0.07481 8.52829 5.83785 6.71263
27.9375 -0.40972 209.17218 -0.17879 8.63172 6.02582 5.90358
28.3125 0.25936 208.63232 -0.6199 8.0825 5.31796 5.97377
28.6875 0.18699 207.88479 0.22074 7.81003 5.52624 5.66973
29.0625 0.60647 206.63678 -0.65537 8.50639 5.37843 6.01798
29.4375 -0.05391 206.19068 -0.48208 7.73063 5.80601 5.91078
29.8125 0.29161 205.60008 0.13297 7.60183 6.11776 5.65343
