0.05000 -6099.67598 1928.00593 3084.67291 9830.49252 11016.27665 10566.79512
0.15000 -10151.42338 191.80966 1280.38682 7709.86444 8509.03064 13039.37449
0.25000 -11556.24523 346.69592 930.47399 6126.25510 6545.65071 13298.31448
0.35000 -12767.56169 101.47810 -24.64373 5780.94035 4810.82674 13453.11785
0.45000 -13028.83762 -50.37928 -310.55093 5218.44417 3782.56262 12958.85685
0.55000 -12480.36752 143.78585 86.06739 4498.19332 3157.61347 12170.01032
0.65000 -11913.35624 14.18956 -127.70200 4144.41128 2895.53243 11780.37249
0.75000 -11520.18203 27.93663 -92.75531 3801.44038 2580.97935 11007.15899
0.85000 -11056.81098 51.30723 385.58171 3602.09912 2291.87769 10511.24276
0.95000 -10914.23893 99.10823 -62.68029 3538.39405 2112.97885 10049.07428
1.05000 -10669.23927 16.86163 469.98277 3025.17161 2239.14586 9656.06589
1.15000 -10486.75181 31.37361 75.48509 2945.85995 2067.37548 9094.01233
1.25000 -10100.40403 41.96638 -31.05101 2775.56871 1872.24148 8948.87767
1.35000 -9917.82061 8.89373 93.20320 2571.36541 1869.75905 8340.75340
1.45000 -9785.66987 37.45940 78.92327 2299.26420 2106.36553 7982.76755
1.55000 -9698.95343 37.49491 96.72597 2108.60606 1787.88093 7455.20708
1.65000 -9443.18539 93.32571 22.19977 2092.73395 1721.30832 7284.82367
1.75000 -9327.69416 54.45274 222.93096 1877.70308 1704.94201 7082.85098
1.85000 -9156.14155 48.23409 -135.30543 1968.59858 1592.56049 6749.29985
1.95000 -9091.48117 101.23098 234.61706 1689.50745 1524.93707 6406.57776
2.05000 -9016.82624 69.61692 -90.63405 1661.15641 1537.53216 6136.16405
2.15000 -8907.39185 75.73913 -103.09586 1584.60816 1520.30440 5967.59095
2.25000 -8821.79049 66.53469 -7.25246 1432.66464 1428.78868 5792.08347
2.35000 -8689.61207 60.95389 37.49468 1385.31746 1416.42002 5511.82736
2.45000 -8596.62670 79.78309 -18.87587 1305.16325 1358.86582 5337.99867
2.55000 -8489.96138 21.71942 18.89614 1258.98343 1331.93728 5143.17692
2.65000 -8410.66155 24.14438 -210.98899 1222.49647 1563.82007 4973.89625
2.75000 -8384.75895 28.34367 -7.29719 1316.10738 1631.85498 4893.29830
2.85000 -8279.15465 67.90965 -207.62366 1080.43151 1416.90573 4678.55903
2.95000 -8236.76156 48.11508 -145.61346 1317.29898 1294.79978 4519.94280
3.05000 -8144.24205 82.80096 16.16009 1061.41748 1352.91765 4473.51070
3.15000 -8047.37419 10.61767 -96.17458 1044.61296 1392.01841 4309.41332
3.25000 -8035.08425 39.79055 -2.61632 837.88644 1229.12335 4135.51229
3.35000 -7989.20498 45.10018 -45.58402 960.78778 1137.74109 4129.60204
3.45000 -7934.15485 -30.03958 2.44889 1012.01861 1212.71500 3900.03116
3.55000 -7903.01977 -28.04202 -26.94644 926.63132 1226.70265 3865.46131
3.65000 -7860.72022 8.58696 75.80899 1102.35086 1232.00561 3680.24462
3.75000 -7834.50080 16.70990 -37.68932 848.05498 1050.21848 3567.92085
3.85000 -7817.67349 4.86151 5.61317 827.10663 973.96480 3593.75719
3.95000 -7776.82102 -17.02963 68.35685 883.57356 1104.17911 3380.14338
4.05000 -7701.41730 16.12362 22.79996 798.08793 1174.82190 3330.54207
4.15000 -7659.06483 10.03318 -53.79128 778.24734 882.66211 3206.94739
4.25000 -7576.96340 17.84013 2.08600 758.08322 940.35322 3137.32182
4.35000 -7563.44277 21.24972 -80.01911 1027.66729 1113.02936 3100.80110
4.45000 -7504.66276 34.47176 -78.13491 722.23543 833.75167 2991.71335
4.55000 -7488.04788 27.01434 -30.99409 757.26700 815.02403 2884.63723
4.65000 -7470.73484 28.84671 -7.13546 785.87751 814.25260 2781.19596
4.75000 -7392.41574 44.39871 12.60259 778.88901 684.56499 2727.58935
4.85000 -7341.80343 23.32881 -18.79815 805.84273 778.03808 2665.99065
4.95000 -7299.97836 28.77770 4.85184 754.83799 649.05713 2583.20114
5.05000 -7255.09936 20.45840 62.07888 726.00452 657.01741 2511.74312
5.15000 -7204.28468 29.11385 -30.25846 655.87409 602.49349 2435.24830
5.25000 -7157.48928 34.55575 -86.41513 683.23607 615.65442 2357.92611
5.35000 -7078.77696 19.69406 -119.86503 669.06642 553.83451 2251.20902
5.45000 -7006.50136 35.03008 -35.88820 625.18084 531.33550 2164.66618
5.55000 -6927.50165 51.27434 -4.01713 693.19278 510.69061 2132.63497
5.65000 -6870.23258 50.45217 -71.83702 628.21189 527.50887 2084.42953
5.75000 -6799.64980 36.81402 -29.48280 648.39299 467.75482 2055.58093
5.85000 -6695.68695 45.71096 -79.10721 550.25095 434.81635 1980.53813
5.95000 -6679.82072 33.36293 -71.21227 591.18358 436.98039 1965.67064
6.05000 -6578.22558 57.59573 37.77565 658.61982 451.94474 1868.52553
6.15000 -6531.38232 32.26666 -23.91014 545.86928 460.67945 1836.24913
6.25000 -6456.42296 19.08027 -65.75364 491.88146 423.99174 1781.02290
6.35000 -6401.13702 22.37361 26.01893 482.85889 425.21256 1724.92659
6.45000 -6337.39765 24.15835 -56.48640 465.89254 370.45927 1720.58180
6.55000 -6288.68647 32.93062 -18.66015 486.52958 436.91689 1688.91874
6.65000 -6237.59600 28.39432 67.17680 484.58667 389.83268 1636.28569
6.75000 -6172.72092 32.19403 22.76330 386.75975 354.64924 1546.14576
6.85000 -6120.31630 48.48163 -28.67349 511.94605 745.71400 1547.74062
6.95000 -6051.45524 38.90420 49.97236 412.03717 526.22921 1510.12000
7.05000 -5959.64411 1.69623 108.84343 840.96239 1133.68061 1590.93483
7.15000 -5952.46624 32.63091 63.65475 431.28641 356.05824 1400.61582
7.25000 -5872.64480 21.45163 59.04593 587.99506 381.86564 1480.31390
7.35000 -5844.97237 31.02996 69.46512 537.70331 356.63575 1337.63684
7.45000 -5786.65300 42.76667 94.42532 466.10342 340.13886 1337.41600
7.55000 -5717.92177 16.99045 116.05236 363.53397 300.86607 1303.80437
7.65000 -5678.61602 31.72243 82.87326 313.32195 270.03620 1245.24438
7.75000 -5623.28398 25.07214 46.99816 608.40268 491.61985 1256.64335
7.85000 -5555.20852 30.06591 85.62597 342.30319 297.57951 1214.09866
7.95000 -5500.69882 22.57961 71.32028 403.39250 363.50043 1185.61992
8.05000 -5461.89634 20.93155 74.99649 283.56621 251.91508 1147.58401
8.15000 -5385.92639 26.24518 116.62190 517.64076 376.74063 1144.71549
8.25000 -5350.83870 29.32238 56.74873 345.95660 571.59922 1133.65114
8.35000 -5303.05289 16.56185 92.40411 417.06959 230.40561 1089.33548
8.45000 -5258.52259 20.71267 -2.60331 304.01408 259.46766 1044.78298
8.55000 -5207.46178 18.86363 22.76986 311.39508 269.17638 1032.01615
8.65000 -5138.52028 14.01949 56.37612 351.36344 250.72946 1049.98605
8.75000 -5103.95464 28.88149 62.73432 296.12261 183.42838 996.27316
8.85000 -5071.91507 21.89660 -27.92691 320.35074 245.81497 992.02530
8.95000 -5020.35145 29.99120 3.53609 303.38716 299.62184 954.52632
9.05000 -4990.18279 16.30929 18.18653 316.75425 241.20994 917.74472
9.15000 -4934.64100 4.23631 31.54178 340.99978 307.80879 900.53038
9.25000 -4883.68042 33.07594 30.45530 328.78532 268.06703 944.90873
9.35000 -4865.51073 21.10004 -10.70209 254.48681 298.09730 869.54235
9.45000 -4805.83793 14.68230 11.41576 268.40503 230.79678 838.43738
9.55000 -4752.56173 17.60129 -43.50026 301.72375 258.90418 820.64108
9.65000 -4712.40146 25.34632 -10.87164 282.29183 233.44222 817.35695
9.75000 -4671.23882 20.53574 38.79847 261.94989 193.25062 806.16380
9.85000 -4628.43472 11.82162 -25.67280 306.97866 228.36766 776.32653
9.95000 -4586.18884 16.53618 3.17602 310.93244 225.81456 783.14550
10.05000 -4544.19748 28.01581 -18.68417 413.51515 349.08753 765.11129
10.15000 -4512.68135 23.59106 -37.50213 216.66711 217.62093 759.22038
10.25000 -4487.41722 18.96911 -32.33459 223.43657 183.85554 705.88863
10.35000 -4465.40492 -14.32042 -55.30558 526.45756 836.82757 696.33602
10.45000 -4425.83046 11.83357 27.98126 194.08581 233.19980 675.86589
10.55000 -4364.82132 31.69250 -40.58070 216.59145 264.20303 673.16484
10.65000 -4339.79580 17.63523 -26.39230 172.98904 201.87916 670.97147
10.75000 -4303.77984 16.67820 -9.67636 178.27519 221.46916 652.54528
10.85000 -4258.98680 21.08820 -21.23847 257.95516 231.26971 678.04557
10.95000 -4228.45017 16.51903 -32.99746 191.29721 130.46537 633.03135
11.05000 -4201.85115 17.54412 -10.59825 206.67009 161.17256 602.98272
11.15000 -4161.87593 17.33771 -9.48491 210.57626 186.76666 606.97947
11.25000 -4115.22946 10.41542 -34.46833 336.67764 207.79828 617.11184
11.35000 -4082.06020 8.43336 -16.98736 313.23148 185.15572 601.51876
11.45000 -4067.86375 -17.67559 0.04079 412.67541 914.33579 681.86398
11.55000 -4021.64838 29.78921 -26.64314 339.34395 393.65169 598.95864
11.65000 -4008.37375 9.71856 -9.51892 138.14080 141.02392 574.20618
11.75000 -3979.82643 17.20690 -15.79778 246.22152 128.00537 539.74029
11.85000 -3942.22825 21.69062 7.89689 150.26502 198.74001 538.83460
11.95000 -3919.93042 -0.00680 -15.99171 179.37397 197.42429 525.03202
12.05000 -3889.58065 25.43097 -12.21355 311.72317 178.81277 506.67687
12.15000 -3858.17338 3.62616 -28.42145 178.90189 131.79526 474.34963
12.25000 -3835.77657 20.06518 -26.06112 159.77924 152.83811 468.99797
12.35000 -3814.44706 15.06960 -12.19600 171.80483 195.21843 480.77514
12.45000 -3786.34038 9.69374 -7.45940 137.37037 121.82947 460.41847
12.55000 -3766.45552 7.31690 1.54974 277.75945 266.49139 478.44338
12.65000 -3727.54778 12.28043 -8.37020 122.33982 91.70062 459.50797
12.75000 -3688.74345 16.49504 -9.15028 169.28884 163.92892 453.37339
12.85000 -3673.93330 -25.23039 -4.01166 212.84413 914.08020 685.39794
12.95000 -3647.85760 4.23158 -42.97945 149.77296 125.86075 424.06590
13.05000 -3620.20143 21.04233 -16.18937 160.24505 191.91973 469.70871
13.15000 -3609.24557 5.57326 -27.36749 202.13798 199.42390 461.29384
13.25000 -3575.02589 8.38572 -34.56270 142.10562 139.36939 394.27949
13.35000 -3551.22050 4.20028 -31.80982 94.62810 106.48846 393.02941
13.45000 -3510.62198 7.34697 -34.50197 182.78991 105.41366 381.75223
13.55000 -3487.78218 13.61716 -21.53181 134.71756 126.43179 391.09202
13.65000 -3477.27860 15.43439 -48.22066 193.03530 194.05994 382.50344
13.75000 -3440.30144 12.65513 -33.42788 142.90495 232.08684 501.01955
13.85000 -3416.56344 7.29259 -24.80563 84.33477 90.00620 340.94809
13.95000 -3396.89331 12.01312 -48.57941 103.12917 84.95342 330.85991
14.05000 -3359.09378 9.62206 -28.46694 132.78917 106.31173 340.26089
14.15000 -3341.61663 15.03491 -57.79494 224.76100 136.67409 330.63830
14.25000 -3315.27186 4.77076 -17.05184 187.96570 117.73378 355.91445
14.35000 -3293.54620 16.45538 -40.97356 164.04165 112.61394 358.45715
14.45000 -3272.80868 14.08552 -38.78694 220.07053 110.05483 323.06718
14.55000 -3255.50782 10.77974 -47.91491 135.82464 123.73750 309.28515
14.65000 -3232.59925 17.11265 -54.19306 122.41066 165.41070 459.42030
14.75000 -3197.16949 19.60714 -34.06100 161.86338 97.26102 304.07178
14.85000 -3189.89056 14.89324 -36.50845 100.71665 193.08519 335.66108
14.95000 -3157.45692 26.81529 -56.89460 123.61271 220.32987 320.98078
15.05000 -3129.03025 0.49053 -32.04956 103.29222 103.90713 283.01279
15.15000 -3111.62481 13.78224 -47.14192 76.57186 85.94176 252.50614
15.25000 -3082.24181 2.12694 -24.24071 84.06900 77.43055 281.95956
15.35000 -3063.47788 5.65486 -32.55520 96.49549 102.93720 254.59417
15.45000 -3061.41004 6.67341 -3.31426 100.74394 93.88314 262.84999
15.55000 -3033.00235 20.65829 -38.11524 93.27919 112.58875 277.14409
15.65000 -3008.29201 12.49134 -40.26855 70.01121 115.93893 260.06183
15.75000 -2982.41767 8.61977 -39.21811 73.78265 70.58299 257.90542
15.85000 -2964.10028 6.57309 -32.41282 76.82408 57.64172 230.00948
15.95000 -2925.39660 10.27561 -15.78731 201.23682 70.21337 237.10383
16.05000 -2913.55059 12.57257 -43.84462 63.01287 66.57767 243.91717
16.15000 -2896.22512 14.75132 -69.38811 72.30751 72.70142 299.17574
16.25000 -2862.32421 -0.92231 -32.36523 80.23269 70.58642 239.22692
16.35000 -2860.14972 13.17335 -56.32684 74.23940 88.60950 213.98832
16.45000 -2822.38013 7.27436 -49.87766 188.42797 79.06833 215.58315
16.55000 -2821.20910 9.33449 -29.92056 88.99709 88.30104 220.34143
16.65000 -2800.38584 5.02191 -29.70463 510.40468 268.24184 225.68213
16.75000 -2784.04994 6.37737 -36.49888 84.24459 70.25555 233.56334
16.85000 -2754.02545 0.54152 -33.27624 81.79276 60.24985 209.81185
16.95000 -2740.80674 9.44128 -42.85325 70.84476 85.88241 240.99263
17.05000 -2714.40865 6.02244 -70.47851 76.14513 72.97879 195.80778
17.15000 -2696.84255 -1.52118 -11.14975 67.45506 69.88471 202.89115
17.25000 -2681.71744 4.84212 -66.59608 109.13548 76.42686 233.32962
17.35000 -2664.52045 2.64639 -37.93696 58.69826 58.91912 202.69803
17.45000 -2654.61104 8.56073 -69.20901 69.41610 71.47725 205.89440
17.55000 -2639.45156 3.92083 -69.84993 49.67707 52.92775 185.72088
17.65000 -2616.85512 -1.29597 -70.27331 98.51573 131.10841 212.51903
17.75000 -2604.89564 1.61406 -76.69816 54.33754 50.47323 190.37724
17.85000 -2609.36941 -0.69802 -48.20318 117.56925 89.13794 181.73845
17.95000 -2573.05115 -2.37419 -71.90062 117.41303 99.76316 198.18978
18.05000 -2564.19552 2.13320 -66.55282 68.54114 74.55293 186.73720
18.15000 -2540.88781 9.14347 -30.70098 113.72716 92.12917 234.18134
18.25000 -2541.85110 3.55746 -69.80740 113.67065 86.37590 188.12283
18.35000 -2508.65255 0.52667 -67.88703 92.57977 87.77953 249.78420
18.45000 -2492.82406 -1.72921 -47.98179 67.12076 53.66360 185.12300
18.55000 -2483.59986 2.60145 -68.21885 90.98227 49.41889 219.59339
18.65000 -2463.48160 5.30613 -44.10656 51.64128 46.30455 194.45794
18.75000 -2460.28201 -3.86944 -42.84345 69.67601 93.25979 221.59554
18.85000 -2427.47764 6.27317 -94.09416 492.56818 185.24238 555.28619
18.95000 -2428.15624 3.73621 -31.83382 139.73956 68.18015 192.87245
19.05000 -2411.30687 14.52315 -50.20755 106.99578 137.49596 210.66381
19.15000 -2390.85205 -9.77591 -29.34382 82.31235 124.53235 197.89878
19.25000 -2383.94446 9.37839 -39.72345 63.68080 61.57918 156.67237
19.35000 -2363.52951 4.64590 -41.48227 162.29906 72.23779 174.30962
19.45000 -2359.96503 3.32414 -25.03826 54.43217 45.29402 159.43698
19.55000 -2350.43114 1.14835 -28.83088 45.79792 38.62602 163.40438
19.65000 -2335.74332 -8.04409 -29.63522 81.90407 182.86875 223.42453
19.75000 -2305.56391 1.12682 -37.49661 63.48819 66.74909 162.28679
19.85000 -2304.50819 6.55731 -19.72933 72.85448 68.97671 143.47724
19.95000 -2297.17131 -0.75913 -30.15436 63.91904 57.12038 156.83721
