0.05000 55053.89111 -2447.11782 67997.32558 212284.68096 210975.28736 97390.75371
0.15000 -41825.11130 -5544.74541 34928.32879 189784.09180 255384.37980 233297.07064
0.25000 -126254.03205 1584.83556 523.80023 114777.16812 106661.42692 147491.43380
0.35000 -91012.37408 179.21002 -3046.58744 53184.71527 43945.46475 80052.50588
0.45000 -68080.02750 196.14353 -2305.99901 31798.09981 24336.69676 57111.13812
0.55000 -55263.49429 250.98322 -2289.29987 22260.60690 16768.27445 44833.13703
0.65000 -45994.65511 -174.62170 -2455.89416 17693.29804 11346.64032 36716.18653
0.75000 -39890.88769 73.85738 -1233.31456 13816.51440 8315.90268 31325.62751
0.85000 -35018.39638 33.64080 -1543.67284 11645.28148 6289.54044 26703.76585
0.95000 -30880.17551 138.53290 -659.93203 9727.83838 5857.31218 23436.18318
1.05000 -27946.59133 45.56526 -8.13194 8251.81020 5433.39785 20659.39441
1.15000 -25297.95798 -111.93105 -111.56513 10596.03854 5660.24741 18917.53635
1.25000 -23415.09643 17.97194 -95.03901 7858.22189 3585.91292 17041.37250
1.35000 -21611.21267 8.62150 -259.49682 5740.00947 2768.01359 15076.39634
1.45000 -20204.12982 30.69521 -72.19723 5354.53252 2774.47354 13981.84815
1.55000 -19104.56744 41.12907 -513.28086 4270.99110 2186.91820 12422.06926
1.65000 -18056.47419 -48.27397 -247.18018 6361.20800 6540.23267 11554.28858
1.75000 -16932.65795 -1.30972 -418.82494 3875.57594 1977.27816 10613.93576
1.85000 -16242.91244 2.32642 -309.50273 3148.85815 1439.57773 9640.08753
1.95000 -15270.22979 -90.82766 15.14270 3471.23877 5750.03082 9313.58056
2.05000 -14756.06934 147.63255 -134.80408 5758.09227 6101.61536 9748.30497
2.15000 -14240.49216 8.57285 -104.52632 2603.87451 1247.34252 8031.05820
2.25000 -13672.44435 11.79604 39.99731 2456.32745 1193.34631 7563.82085
2.35000 -13313.30919 102.27064 -42.15934 2335.17601 2842.89659 7044.05819
2.45000 -12803.36360 0.12927 -96.37562 2275.28926 1268.75700 6909.87636
2.55000 -12489.18714 70.16608 -201.52986 2301.43099 2873.69304 6782.79126
2.65000 -12103.61497 -3.34557 -191.60947 1792.53319 848.33490 6025.87523
2.75000 -11875.66628 -23.89094 -109.41557 1789.02917 987.95840 5657.32365
2.85000 -11636.75191 -0.22948 -93.43760 3224.73410 1715.25731 5593.70150
2.95000 -11307.00954 -11.41742 -41.43961 1575.87237 936.85130 5194.35791
3.05000 -11137.28882 -0.70162 -169.99395 1559.86852 970.40506 4861.02134
3.15000 -10860.36602 0.36933 -158.69806 1344.71560 1042.49098 4641.80605
3.25000 -10598.39704 88.06037 -241.01771 4515.52243 4059.30484 4498.18104
3.35000 -10496.66270 12.13969 -226.04565 1244.28423 678.54881 4195.55548
3.45000 -10259.49261 30.86899 79.92645 1414.38637 876.25948 5546.08869
3.55000 -10119.19099 9.83689 150.30837 1267.08997 711.38321 4015.60466
3.65000 -9924.55102 1.06205 66.03828 1128.55642 650.64122 3699.37697
3.75000 -9798.49150 9.00083 -154.76817 1353.53805 972.11861 3640.63511
3.85000 -9600.36318 21.09758 -86.09793 952.44661 817.62656 3458.04604
3.95000 -9462.28849 -2.56211 -15.41610 1057.18038 731.73256 3238.62575
4.05000 -9290.50099 10.52063 53.11059 908.52034 522.73459 3140.66074
4.15000 -9157.30923 12.78975 -26.47835 934.32819 839.79817 3141.06773
4.25000 -9023.83051 4.10436 49.27667 864.17289 475.48827 2936.89124
4.35000 -8920.89122 13.02687 88.69214 864.99227 475.33991 2809.58572
4.45000 -8830.83193 21.27428 106.95595 2212.04889 681.94978 2965.99127
4.55000 -8638.18660 -6.73364 82.62152 835.32816 1295.13422 2634.84596
4.65000 -8494.76101 -2.72538 -29.40448 740.03759 459.19617 2586.25567
4.75000 -8421.55120 13.23831 -20.82950 706.70118 384.44383 2633.97099
4.85000 -8311.69882 11.91828 -63.11548 602.09777 435.22212 2309.03288
4.95000 -8136.83535 9.15878 24.44942 649.75863 360.33188 2303.64341
5.05000 -8005.35094 0.75398 18.60657 1219.58834 1099.13211 2301.94031
5.15000 -7859.52327 52.56063 61.49698 3615.05312 1300.87835 2230.95774
5.25000 -7820.25888 8.36747 -32.17954 560.30615 478.40183 2091.82533
5.35000 -7708.54741 16.39334 11.20879 522.60980 494.20719 1992.55829
5.45000 -7607.22549 14.60302 34.94358 608.05239 483.11316 1935.86791
5.55000 -7486.00647 17.67188 15.39031 846.98585 504.38800 1971.73502
5.65000 -7402.19008 15.25477 -41.48223 519.87437 386.72555 1790.67312
5.75000 -7293.80557 18.19517 -8.62964 443.44714 324.00842 1818.20997
5.85000 -7195.85736 -0.49937 -31.24110 431.96322 383.42039 1710.47820
5.95000 -7132.73446 -2.09947 35.96161 1370.03812 783.05445 1976.58411
6.05000 -7014.96308 11.97575 -59.08577 442.53283 427.30275 1638.22028
6.15000 -6923.17076 12.29112 25.63574 612.44941 441.29523 1621.77721
6.25000 -6841.01913 11.62473 -52.36627 467.59426 577.06685 1629.83596
6.35000 -6738.47441 10.79748 -14.06953 375.37910 489.13251 1525.07934
6.45000 -6669.25681 14.11607 -91.69092 432.27891 630.11166 1485.59678
6.55000 -6578.82899 29.57239 -24.22203 447.44688 444.00773 1454.80799
6.65000 -6475.08415 0.06543 -33.42890 564.43781 643.89719 1631.61893
6.75000 -6435.33355 15.12749 -68.20138 486.89048 261.14489 1360.77743
6.85000 -6326.94315 -1.22906 -71.88014 427.26269 333.49901 1383.63976
6.95000 -6273.97506 8.80193 -39.84184 518.80727 544.71303 1278.80905
7.05000 -6182.56395 9.82112 -37.49487 419.93113 450.71400 1503.20116
7.15000 -6225.80600 46.02314 7.26172 4090.26917 1180.98728 3054.20243
7.25000 -6020.99915 8.00369 -18.27081 376.99957 278.74988 1202.58864
7.35000 -5949.56025 -0.62390 -89.49792 404.50535 355.80326 1241.59426
7.45000 -5883.76509 3.73561 -105.12587 336.61894 277.76257 1164.63973
7.55000 -5804.93230 14.02001 -58.49156 402.40922 223.14164 1143.85283
7.65000 -5741.09573 9.14679 -80.93732 1521.52769 716.21996 1110.42017
7.75000 -5701.38632 1.73484 -27.36029 315.90821 255.38090 1039.75806
7.85000 -5623.97380 21.68579 -120.80030 317.29680 260.32741 1074.97464
7.95000 -5586.04667 9.39409 -83.87707 331.91103 337.54293 1049.22224
8.05000 -5507.08591 0.69563 -55.32780 403.05885 387.80883 1028.62970
8.15000 -5486.55738 5.67381 -66.49063 285.02428 235.21589 1004.67004
8.25000 -5427.05313 -48.72507 -123.97084 1044.01632 1517.60038 1217.18934
8.35000 -5386.94358 -76.69092 34.60153 663.63271 2995.84121 3231.58618
8.45000 -5300.55595 1.48969 -121.23690 276.37083 243.25048 951.95693
8.55000 -5255.35930 21.54595 -67.78637 322.97322 826.43431 1869.64901
8.65000 -5219.98945 -1.87817 -75.32714 450.63100 344.29387 909.13290
8.75000 -5171.34735 -3.45125 -113.21735 336.31659 340.88701 920.31872
8.85000 -5042.62109 139.52613 -308.71859 2398.64888 4549.22221 7006.69893
8.95000 -5065.72001 7.30352 -142.13117 293.66569 326.71583 853.98778
9.05000 -5010.80659 -13.11098 -93.69669 291.47495 256.32519 822.34613
9.15000 -4971.45885 -10.92052 -85.17438 286.23248 305.17773 806.87573
9.25000 -4907.31909 -14.34301 -69.24644 349.16263 948.97106 1000.85343
9.35000 -4869.79129 -7.19264 -79.19931 304.67864 203.03831 798.34575
9.45000 -4832.76508 -3.77724 -96.39187 275.20537 184.63344 762.42497
9.55000 -4795.55547 -1.08033 -85.19705 290.84111 164.92926 755.66641
9.65000 -4752.08332 8.13693 -62.29601 305.07544 222.22051 730.66142
9.75000 -4715.78565 5.39481 -53.62274 212.43758 166.35994 702.11595
9.85000 -4646.45017 -2.95490 -105.81751 448.01606 232.23053 720.04567
9.95000 -4620.20061 10.88859 -78.23430 233.19891 257.57427 718.43321
10.05000 -4581.57941 -5.72479 -36.44564 255.03761 272.63437 696.87195
10.15000 -4555.74227 -4.79395 -106.67287 283.18318 159.29996 657.04526
10.25000 -4521.16918 -43.00046 -41.37283 382.64599 590.82559 659.20608
10.35000 -4425.50874 -33.99846 -127.56303 835.67673 918.53812 1574.25734
10.45000 -4428.72683 -14.67167 -105.38811 218.12262 521.67369 672.60098
10.55000 -4383.49358 14.89974 -46.91939 239.80748 195.90732 619.13889
10.65000 -4367.26992 3.54464 -87.67987 293.96718 179.51161 594.12076
10.75000 -4308.22877 9.49009 -90.68790 206.67016 143.27602 593.61068
10.85000 -4274.21052 -4.51770 -71.24641 163.00618 238.11289 616.06940
10.95000 -4265.97572 3.12171 -72.77407 297.11585 211.44095 548.06074
11.05000 -4187.72119 -5.08214 -68.31046 496.84588 320.79461 564.04578
11.15000 -4179.77347 3.18150 -91.61606 191.18159 148.81028 525.90776
11.25000 -4141.29669 1.99201 -69.27701 209.93987 144.12995 555.37015
11.35000 -4081.95883 -0.29768 -66.70579 197.52186 163.37810 555.92661
11.45000 -4055.00412 -7.87691 -103.96417 180.90345 203.12628 525.45684
11.55000 -4012.65260 6.61959 -106.14204 368.69450 280.01482 497.64830
11.65000 -3977.86424 -6.68054 -66.16301 170.23184 271.40358 511.71807
11.75000 -3936.19341 1.77623 -74.52675 164.36610 161.19921 495.60537
11.85000 -3910.94053 2.78134 -86.28009 150.44187 121.52134 499.40218
11.95000 -3881.29001 14.14408 -71.84770 164.80734 159.99059 472.48679
12.05000 -3842.31997 10.08189 -99.38233 155.91657 133.80300 481.56255
12.15000 -3843.54027 -22.80764 -129.79760 642.58085 499.10917 457.12392
12.25000 -3787.81577 -0.92510 -125.40021 160.92778 114.09376 458.62627
12.35000 -3752.08529 -0.80673 -86.20144 116.75938 116.21828 429.47817
12.45000 -3730.44660 3.62681 -129.01131 118.85066 113.49616 417.22974
12.55000 -3695.90965 -6.01557 -113.33263 141.56618 139.09694 400.65655
12.65000 -3672.42100 -7.65676 -143.64082 125.97695 100.02873 393.48254
12.75000 -3618.55826 -0.96763 -118.75678 137.94599 122.12577 431.66108
12.85000 -3598.02308 -2.24603 -132.90516 119.97238 129.83654 410.53038
12.95000 -3597.79670 -2.28532 -133.82767 351.17304 113.43038 406.63755
13.05000 -3541.89078 -1.19326 -109.22812 139.43636 172.85269 387.65384
13.15000 -3510.55288 0.00085 -92.08285 200.32090 108.53606 369.88387
13.25000 -3495.75198 -11.59043 -129.84146 153.37265 146.81496 392.89637
13.35000 -3454.66382 4.54894 -98.95927 148.27584 136.77731 360.05091
13.45000 -3447.46086 -4.70287 -122.47256 293.79188 108.78359 382.90310
13.55000 -3412.04684 0.71674 -93.64952 101.90772 96.90991 335.85719
13.65000 -3375.39046 7.46272 -90.73518 108.88564 143.38987 358.96741
13.75000 -3342.26903 -3.01568 -51.50617 146.99104 117.50439 359.75568
13.85000 -3328.69819 -31.63115 -94.57168 114.42100 499.20250 312.79084
13.95000 -3305.39314 -0.34542 -88.68771 122.16098 119.92496 323.81780
14.05000 -3284.81691 3.23228 -100.40768 152.90397 106.82987 324.83841
14.15000 -3259.81860 2.11831 -63.88913 116.23187 109.31926 296.42623
14.25000 -3231.45734 1.53806 -69.46283 89.07365 94.79418 301.34151
14.35000 -3216.14111 -6.96256 -80.71119 113.25597 202.08927 326.40414
14.45000 -3183.10680 1.53817 -77.94095 205.00912 122.47559 349.21447
14.55000 -3178.82097 2.97152 -84.09385 194.90444 94.36155 359.90953
14.65000 -3166.72539 0.06363 -102.54113 399.98718 161.07950 422.18425
14.75000 -3112.30252 3.00612 -81.70330 139.01379 133.45095 303.62610
14.85000 -3091.25911 9.81154 -93.48222 97.09636 87.14759 293.79966
14.95000 -3078.98563 -1.55777 -100.69286 147.59844 208.71294 325.86865
15.05000 -3059.27369 2.61276 -95.32881 172.91647 146.96440 283.98108
15.15000 -3033.02530 3.09644 -61.62300 119.92658 149.38866 297.82810
15.25000 -3006.46534 17.07226 -59.61479 95.14228 101.76168 286.00247
15.35000 -2996.99031 -0.36670 -72.95099 135.54373 84.00676 263.53742
15.45000 -3106.81372 -82.18153 -64.65420 2036.55431 1469.24795 316.81997
15.55000 -2954.23221 11.73749 -64.17287 94.84221 98.37575 290.00172
15.65000 -2935.26009 7.61977 -81.00327 97.54849 86.20189 249.56202
15.75000 -2913.14845 19.81001 -78.71436 135.39790 94.94070 289.76891
15.85000 -2901.31956 16.50275 -80.20867 94.67581 91.43577 246.12559
15.95000 -2868.41999 24.79519 -95.99965 97.98978 81.85752 243.04228
16.05000 -2853.20523 -0.78879 -86.14286 94.80305 73.97586 254.28451
16.15000 -2833.10587 5.32968 -95.36141 92.65129 125.82156 254.91737
16.25000 -2813.20885 4.55626 -107.18901 91.66506 80.62193 225.69103
16.35000 -2818.60129 37.02007 -82.09051 220.67757 338.78137 265.18581
16.45000 -2771.91728 11.22127 -35.08170 135.30115 130.49550 317.65851
16.55000 -2764.55667 9.60834 -67.67705 92.81516 132.16510 224.00893
16.65000 -2736.16307 12.85806 -70.32092 100.94742 84.68101 218.25540
16.75000 -2706.75580 -1.14039 -115.32002 88.14470 84.97069 220.80339
16.85000 -2702.83665 8.85362 -67.60203 106.48826 83.99214 221.07784
16.95000 -2657.89726 6.08744 -89.35802 166.45765 120.48265 268.06202
17.05000 -2671.21198 0.99381 -59.05176 131.66307 75.33303 230.36938
17.15000 -2650.71000 6.97706 -68.02806 94.03536 78.22881 227.49152
17.25000 -2623.65883 -4.69071 -92.99108 105.06503 121.63050 232.34725
17.35000 -2619.77874 5.43716 -87.81726 125.66739 83.53358 198.74342
17.45000 -2584.11106 1.50508 -70.88856 82.41679 83.43669 205.69804
17.55000 -2572.13606 13.18236 -75.02696 83.43595 87.10478 220.34723
17.65000 -2539.42461 -10.31165 -51.12479 265.70015 117.71337 290.49158
17.75000 -2541.24323 -1.62781 -93.71750 84.32345 78.25778 193.89366
17.85000 -2545.82572 -5.71228 -86.63681 194.49927 108.06670 205.21707
17.95000 -2504.10767 35.23709 -47.33913 94.27016 105.32776 223.51935
18.05000 -2507.93427 5.77003 -79.02247 85.27051 73.54369 190.24182
18.15000 -2467.18525 10.33849 -64.41744 76.68820 78.74272 165.65470
18.25000 -2465.32359 2.71241 -90.14250 84.85411 63.71630 167.28773
18.35000 -2464.77558 -1.48323 -77.94194 116.72302 75.97815 160.63005
18.45000 -2424.15987 -3.16405 -105.72629 74.78223 67.92750 186.31776
18.55000 -2411.31226 -14.67238 -72.48534 91.37114 117.75585 194.56764
18.65000 -2405.68449 7.03879 -57.44095 78.18565 72.23721 178.28253
18.75000 -2384.84154 -2.21723 -65.52406 91.60108 73.38594 177.18288
18.85000 -2365.76464 -6.42535 -92.24135 78.09559 84.57840 167.17057
18.95000 -2335.41593 -296.00879 -322.84777 223.80203 2339.89067 1889.41361
19.05000 -2355.37632 -8.64869 -108.60129 70.39650 74.59304 144.38047
19.15000 -2345.68090 -11.79411 -112.62018 67.63147 108.27079 187.94969
19.25000 -2332.99287 -13.58040 -82.92193 67.76864 75.63674 179.00899
19.35000 -2312.93166 -9.45180 -130.19620 77.55957 86.84766 155.79636
19.45000 -2303.57455 12.23105 -70.53673 70.71026 62.67159 155.00423
19.55000 -2285.56193 5.98755 -65.64884 83.30978 55.79346 166.78066
19.65000 -2268.20415 -5.55574 -59.64888 110.93735 73.42082 145.67605
19.75000 -2270.66842 -12.98192 -29.64518 70.56198 68.59377 140.22564
19.85000 -2233.54605 9.78853 -77.29945 111.02936 83.45494 170.95693
19.95000 -2214.66497 10.74858 -51.02102 97.69497 79.96401 144.53535
