0.05000 -1517.58605 21.83990 18030.81429 1087.20433 949.65588 401300.01510
0.15000 -2854.14923 51.23524 125329.52060 1115.63299 904.85477 710411.24267
0.25000 -3970.04546 26.91711 -3297.36208 1135.68183 751.81905 345039.03939
0.35000 -5212.53078 90.20548 -20044.07218 1242.89326 715.90243 372193.38093
0.45000 -6218.57413 76.49044 27178.72387 1280.35246 644.60232 422195.69531
0.55000 -6911.85235 91.33567 -8081.04612 1342.74166 591.20046 311904.72696
0.65000 -7331.59414 60.68884 -5397.87385 1338.01247 579.39111 353669.49064
0.75000 -7581.53092 96.04389 -3704.79116 1374.05531 568.69673 331407.02653
0.85000 -7783.43449 93.95539 -1523.01516 1409.27215 557.86382 311183.31590
0.95000 -7921.27431 87.42854 4015.76979 1424.92257 518.24728 337979.79277
1.05000 -8040.82396 96.06087 970.65349 1423.02091 501.42840 314828.20805
1.15000 -8137.48273 105.82798 2713.81146 1321.34962 507.38632 293518.15982
1.25000 -8232.13589 106.03250 3091.44822 1230.47227 497.90031 316668.63489
1.35000 -8349.46054 112.38168 3927.80189 1158.57326 498.46839 276756.75962
1.45000 -8323.15010 107.46147 -749.97766 1065.94219 490.98023 276999.60147
1.55000 -8315.09283 113.17702 3324.34862 987.51075 504.14847 230895.09343
1.65000 -8351.22218 113.26947 -1853.39113 929.17480 503.74006 244551.59435
1.75000 -8359.35690 103.95440 1957.74502 863.39916 503.15675 231895.99208
1.85000 -8360.51479 112.82772 5048.30014 813.27618 503.26030 241656.46274
1.95000 -8333.82719 104.02044 -2228.13580 772.21184 495.15420 233378.42463
2.05000 -8316.72924 97.20387 -2280.69298 729.55848 500.15798 208498.37753
2.15000 -8268.16563 104.75067 3384.97469 682.46636 495.45933 201853.54385
2.25000 -8216.85062 113.80538 2704.50067 634.03093 507.52251 204573.92346
2.35000 -8150.32858 88.12873 -2833.68423 600.46582 496.04764 191483.54814
2.45000 -8093.68253 93.36047 2498.11037 560.28293 494.24945 178359.77683
2.55000 -8035.47076 94.44240 1350.82055 503.77293 500.56263 182716.66700
2.65000 -8023.53900 111.86554 2902.27085 453.42305 500.92633 154942.55897
2.75000 -8007.65235 86.40428 -4390.31859 404.88762 493.29921 161226.43318
2.85000 -7982.69172 98.96299 1485.78278 362.96073 485.48674 169156.48580
2.95000 -7928.26120 94.39057 -680.53334 336.19826 475.79360 159045.79617
3.05000 -7889.44731 92.98482 857.53771 305.60422 466.21673 146110.18747
3.15000 -7855.06740 96.82132 367.69293 276.27278 456.96381 136813.18791
3.25000 -7810.55205 94.79304 -37.67345 264.23516 444.57378 130478.29006
3.35000 -7756.88622 91.10695 -2409.32446 252.52356 434.61021 135058.71149
3.45000 -7703.37442 92.33230 -916.13659 238.30180 424.37295 128159.77737
3.55000 -7637.73079 92.14008 -571.97526 237.99533 412.21858 126138.48070
3.65000 -7580.10487 80.87884 -1523.71206 236.23107 405.37565 112235.65120
3.75000 -7533.90840 80.83400 508.32054 229.52866 391.49628 114934.79350
3.85000 -7485.86280 79.10269 2706.22616 224.72388 379.41816 115267.84409
3.95000 -7429.10369 76.55071 -2405.50364 220.73044 368.74288 107047.04522
4.05000 -7372.89446 73.25390 -2251.98101 224.01807 358.96932 114033.43052
4.15000 -7321.27390 70.34901 1988.88323 221.82745 352.50922 99511.56241
4.25000 -7283.03982 68.86069 -955.18134 212.32588 340.11232 92525.39171
4.35000 -7225.41004 65.91706 2374.74409 214.02346 326.46108 94606.88184
4.45000 -7178.65479 68.20746 8.01892 210.75662 317.54923 82747.11538
4.55000 -7125.29955 62.02461 1013.69910 213.28755 306.68660 88661.19480
4.65000 -7060.56387 57.97825 -165.50257 216.99484 296.85860 79957.26515
4.75000 -7005.12929 58.01068 -1044.65376 213.67135 290.48219 77474.95243
4.85000 -6936.68867 49.39795 -607.00357 204.49317 279.84817 83474.41229
4.95000 -6883.72089 50.00301 -1416.90924 201.08832 269.10564 70189.08080
5.05000 -6831.54036 54.52703 1397.21374 196.03448 264.26099 68573.26652
5.15000 -6776.99373 46.58450 -220.47857 197.07975 252.57721 87584.22318
5.25000 -6717.37836 46.98994 -1334.54926 193.41496 244.56938 66819.61306
5.35000 -6667.59987 48.26927 -783.82754 192.24768 236.09637 66099.55710
5.45000 -6618.51226 50.87924 640.39541 184.71772 228.76333 53964.52591
5.55000 -6564.18602 48.27346 -1600.37749 189.92976 219.92521 83971.85180
5.65000 -6511.99791 45.41122 909.83791 197.06891 212.55511 57173.31577
5.75000 -6462.67950 44.88058 1565.14201 198.24271 204.48676 130664.78929
5.85000 -6415.77541 45.81609 221.42104 208.81089 196.78857 56094.15473
5.95000 -6364.68763 51.91583 553.74400 210.92510 193.69657 51801.42860
6.05000 -6314.34647 51.31059 -155.82677 205.03235 182.38223 53439.12739
6.15000 -6260.33814 44.41599 1669.92936 198.15773 174.78491 46844.85531
6.25000 -6206.12676 45.16995 634.92153 195.60222 167.25651 62532.15777
6.35000 -6157.71925 47.39289 -503.05984 192.16024 161.00336 43913.55957
6.45000 -6105.94011 45.52183 -103.45699 182.54268 156.24666 43827.38044
6.55000 -6062.39067 46.37484 -674.71113 181.45743 151.56507 51606.70795
6.65000 -6015.78996 46.27655 1775.25222 184.52886 147.23019 86163.73354
6.75000 -5963.89407 44.35137 759.15934 178.46344 140.12134 43452.42348
6.85000 -5919.83461 45.57967 -157.46222 172.81434 135.64153 34676.66661
6.95000 -5869.33461 46.28653 861.01803 163.65854 135.93822 39123.20737
7.05000 -5824.04559 46.38450 -434.65996 155.95769 131.08959 35611.62772
7.15000 -5774.88402 42.51486 912.47505 152.45161 127.00445 34276.38390
7.25000 -5724.00761 39.48673 -515.32387 149.94451 124.77318 33363.20094
7.35000 -5680.93378 42.25276 -557.40085 145.42182 119.72495 34031.67560
7.45000 -5628.91584 40.92149 -238.65996 141.68448 117.55992 32596.25796
7.55000 -5581.26048 37.49143 169.79759 137.54496 114.70493 32324.32744
7.65000 -5546.14948 37.30491 -634.55740 138.65933 113.20658 40958.99313
7.75000 -5499.14417 40.50080 -66.55667 139.87411 109.22977 28438.72473
7.85000 -5453.61570 37.39364 -104.30136 140.26264 105.03241 30483.49655
7.95000 -5403.04425 37.13184 53.95769 139.05630 100.14189 28917.37700
8.05000 -5362.68413 37.48394 196.60076 136.99105 98.31185 27467.07167
8.15000 -5317.14988 36.32726 -370.44510 135.24979 98.52374 28046.56449
8.25000 -5277.09919 33.86693 207.24933 133.10346 96.20618 25339.80051
8.35000 -5233.28937 36.35039 -165.51870 133.20880 93.11543 22727.25888
8.45000 -5195.09802 38.33474 -216.80456 133.15021 93.54264 25954.05112
8.55000 -5156.49707 33.70822 241.41893 127.41632 91.79803 24493.76494
8.65000 -5113.56126 33.60565 -36.65905 122.93868 89.94566 22385.23804
8.75000 -5070.45360 32.99977 508.93852 119.09110 88.26349 21178.46684
8.85000 -5029.83025 34.38922 -311.78387 122.22840 82.32235 24583.06422
8.95000 -4983.24693 32.49289 -133.70425 117.52491 79.81980 19535.45591
9.05000 -4942.41722 32.15506 -1506.25153 114.36259 79.67921 61111.67819
9.15000 -4896.15428 32.24891 -189.67239 112.68556 80.79362 19644.09525
9.25000 -4849.27910 32.78552 1188.06149 115.69546 77.77893 74640.37171
9.35000 -4815.48613 33.59274 -214.14062 111.79019 73.10528 17323.18111
9.45000 -4775.06829 32.21330 -758.97327 108.54441 73.99531 20345.24143
9.55000 -4743.23583 35.37863 108.11770 109.28073 77.05663 19204.81058
9.65000 -4708.00260 34.84388 -872.88739 109.47574 73.44616 44232.86547
9.75000 -4671.62374 39.93115 -272.84413 100.70534 73.36697 16237.47034
9.85000 -4633.98760 42.63441 -21.47870 95.77589 72.11926 15977.75532
9.95000 -4600.44019 47.09825 169.69827 91.81988 71.01044 19120.05262
10.05000 -4568.70165 51.32923 -0.08657 87.74333 66.49642 15775.46995
10.15000 -4533.37427 53.90512 10.35134 84.32865 67.37347 18236.57519
10.25000 -4502.26529 53.74899 237.89501 86.67105 67.21002 14075.59996
10.35000 -4466.73112 54.46454 -37.21748 84.36463 65.86208 12681.22517
10.45000 -4435.67615 57.56779 255.16809 81.97287 64.09013 11504.91698
10.55000 -4402.60009 54.46861 -182.69811 80.49979 61.80565 12629.33281
10.65000 -4371.33046 53.30829 -293.00911 79.09963 63.89615 12140.33497
10.75000 -4337.89356 54.30097 111.38618 78.54000 62.11391 14387.70944
10.85000 -4302.70635 53.48509 -70.18656 76.46725 60.61697 11187.50668
10.95000 -4266.40678 51.79905 -42.98233 72.42428 59.33097 13630.83341
11.05000 -4229.32414 49.28742 -189.29715 70.21074 59.75582 10856.20921
11.15000 -4194.52192 50.72929 -537.03874 70.47636 59.00225 22112.65189
11.25000 -4157.87837 49.92794 556.42171 70.30991 57.76783 43458.89826
11.35000 -4124.91348 47.15586 565.20162 70.87274 58.11881 20649.34884
11.45000 -4090.96150 48.24865 366.36578 71.89103 54.30455 10798.93626
11.55000 -4057.00825 49.48150 -22.21566 69.66281 55.00007 10352.80570
11.65000 -4024.44277 46.02672 180.38809 72.48088 57.00098 8952.87496
11.75000 -3994.22699 45.53438 199.61302 68.75198 54.55808 10095.01627
11.85000 -3961.51230 44.07848 -121.63883 67.75858 56.87642 9302.51854
11.95000 -3930.45652 43.57052 75.42257 67.85433 55.07117 8627.14997
12.05000 -3899.72814 43.19067 75.70503 65.63447 53.41003 8409.99731
12.15000 -3869.24154 42.40529 -348.99208 63.51076 56.26554 8403.59983
12.25000 -3836.37525 41.61885 -258.35589 61.84964 53.70672 8075.57874
12.35000 -3808.48540 42.95556 153.97328 60.19765 51.05274 9502.79940
12.45000 -3777.76584 42.61347 137.58357 62.11943 51.34898 8081.12196
12.55000 -3750.74724 39.39804 -129.82720 62.72450 53.78460 7307.01553
12.65000 -3721.66975 40.59326 -181.62955 60.17642 52.89930 7609.52735
12.75000 -3695.33037 40.29896 105.23019 56.54264 51.17007 6276.08895
12.85000 -3667.01309 39.19613 -246.18704 58.98308 51.14392 7908.82248
12.95000 -3638.39859 39.44145 175.36689 58.17541 47.59292 8150.65607
13.05000 -3612.06660 37.59830 121.45703 54.09846 47.15676 7380.55813
13.15000 -3587.22112 36.64311 118.80349 55.76235 47.45637 6171.39454
13.25000 -3561.05770 36.53669 80.34940 55.82259 48.91687 6079.91536
13.35000 -3538.49274 36.31151 63.90772 54.57830 47.44573 5468.50000
13.45000 -3515.55537 34.80268 17.12661 55.06917 47.75280 6680.30021
13.55000 -3491.30205 34.91939 -15.05988 50.59900 48.58515 5440.16803
13.65000 -3462.84064 32.52177 10.87759 50.36156 47.61414 5879.32777
13.75000 -3438.91993 33.78657 -34.24126 51.57891 46.84775 4745.57947
13.85000 -3411.23298 34.83228 -152.99196 51.48393 46.61609 5351.35428
13.95000 -3387.84677 32.95040 -166.29553 52.40504 45.44274 5063.24170
14.05000 -3364.62507 32.16143 -73.68393 48.82840 46.26939 5560.93598
14.15000 -3340.03057 31.19232 41.97352 49.32286 42.99272 5235.36857
14.25000 -3316.45902 32.36500 -173.51905 47.24062 43.13218 5893.83758
14.35000 -3294.75218 32.39056 -236.53901 49.83806 44.55194 5025.11597
14.45000 -3273.34515 31.65315 49.35583 48.01548 44.38879 4312.85089
14.55000 -3249.46311 31.93503 89.22754 49.63574 44.78034 4974.45504
14.65000 -3226.69909 30.96088 67.00799 48.86234 42.19667 4544.16965
14.75000 -3205.49217 27.98905 12.13588 50.20269 44.26357 4417.98444
14.85000 -3181.06756 26.88987 -181.05044 51.38018 45.77618 4870.57242
14.95000 -3161.57148 31.94798 60.61813 50.06101 44.26288 3636.76637
15.05000 -3141.14640 30.97278 -114.18914 47.53262 41.51581 3770.81493
15.15000 -3116.90040 28.69731 82.44975 45.89958 38.68161 4172.23524
15.25000 -3100.64830 28.65256 -154.26256 48.18172 38.58360 3462.62068
15.35000 -3082.97932 26.82913 -23.71138 50.66384 41.63689 3872.18180
15.45000 -3056.90684 28.42548 50.17411 50.96215 41.15820 3430.84114
15.55000 -3039.23915 26.21538 -130.16677 46.11517 38.50404 3817.48805
15.65000 -3016.57144 26.37317 122.34107 46.92512 36.75301 4552.56583
15.75000 -2998.01767 26.35072 44.89691 45.13066 39.63634 3562.98251
15.85000 -2979.86231 24.77226 -24.75305 45.99035 38.11100 3323.42718
15.95000 -2957.21290 24.52293 -60.75124 45.48734 38.23674 3129.96489
16.05000 -2940.38625 24.20115 -29.56891 43.12089 37.59918 3222.44247
16.15000 -2920.86243 24.62113 -13.71503 42.18403 36.35164 2932.24694
16.25000 -2899.57397 24.73447 -125.48685 41.82082 36.06353 3336.71179
16.35000 -2881.90736 23.63491 -69.24586 40.28410 37.29432 3887.72832
16.45000 -2860.97844 22.55776 -38.28755 39.94569 35.57743 3053.04337
16.55000 -2841.17775 24.94371 -53.94123 39.26369 39.42185 3419.20836
16.65000 -2823.88427 22.65201 125.54638 39.88675 37.24624 3008.27162
16.75000 -2805.37408 24.98322 75.40090 38.32499 36.37538 5324.07709
16.85000 -2788.05711 20.29214 83.32233 41.07922 35.39018 2072.54613
16.95000 -2765.30036 23.91008 -118.80267 37.07009 34.56866 2753.83428
17.05000 -2751.43734 20.81552 120.00463 36.75119 32.97128 2999.27778
17.15000 -2733.88864 19.82911 49.44150 38.04194 36.27716 2744.27988
17.25000 -2714.96016 20.24433 51.88967 38.84718 35.53613 2304.32724
17.35000 -2701.64052 20.90072 22.65756 36.71816 35.26077 2151.52391
17.45000 -2684.04262 21.54784 82.58891 38.80275 36.85822 2864.80916
17.55000 -2665.47690 20.86001 5.88417 40.12942 31.37732 2804.74089
17.65000 -2649.01245 19.82396 133.57925 36.89945 35.02969 2636.01614
17.75000 -2633.71632 18.37670 -61.21819 36.47640 33.92914 2365.37417
17.85000 -2617.41245 18.25003 14.70819 35.27617 33.68852 2346.55187
17.95000 -2599.44550 22.62208 180.85896 41.66904 31.32368 2426.70459
18.05000 -2581.15022 21.61883 19.78494 36.07001 33.53798 2127.76988
18.15000 -2566.06471 20.59220 84.23855 35.58554 33.18156 2262.86734
18.25000 -2546.89862 17.84829 47.23562 35.35596 34.13661 2175.84457
18.35000 -2533.07503 19.08718 -16.98627 35.56577 34.67219 1851.02545
18.45000 -2514.46240 17.43534 -161.10813 34.42974 35.90348 1817.55771
18.55000 -2503.71289 18.43072 -29.96089 34.89195 33.47801 2188.14093
18.65000 -2490.93160 18.49640 -58.81555 38.24409 35.52162 2600.13948
18.75000 -2469.94093 15.29344 11.70136 35.78448 35.43857 1973.00413
18.85000 -2459.78243 18.36781 74.85131 36.21110 30.72053 1733.08271
18.95000 -2448.25128 19.49437 30.59521 34.22183 35.04071 1961.48543
19.05000 -2434.25800 17.78834 -64.20287 32.97380 29.79758 1646.61855
19.15000 -2417.76812 15.75144 37.73249 33.77973 33.86380 2037.26468
19.25000 -2402.98235 16.72817 -87.91209 34.57540 32.23294 1877.84457
19.35000 -2390.38607 14.75723 101.65934 30.96217 31.90632 2536.61556
19.45000 -2375.65849 16.98025 73.99353 30.09216 31.76597 1125.93101
19.55000 -2359.76772 16.55936 -32.14192 33.80630 33.56566 1471.39559
19.65000 -2346.00420 14.51330 -64.65869 31.59998 30.53407 1459.99396
19.75000 -2333.33843 14.47954 89.51865 35.89351 28.16346 2077.97002
19.85000 -2316.73892 14.75774 -23.62658 29.94519 33.40442 1555.90247
19.95000 -2308.55792 14.06974 -4.81468 28.14140 30.35461 1525.12951
