0.125 -0.002 -0.005 0.001
0.375 -0.000 0.000 0.096
0.625 -0.001 0.035 0.425
0.875 0.000 0.033 1.051
1.125 0.002 -0.039 1.796
1.375 0.058 -0.037 2.628
1.625 0.044 0.006 3.434
1.875 0.060 -0.059 4.340
2.125 0.006 -0.094 4.940
2.375 -0.009 -0.040 5.454
2.625 0.068 -0.099 6.148
2.875 -0.016 -0.097 6.655
3.125 0.035 -0.089 7.059
3.375 0.049 -0.087 7.350
3.625 -0.006 -0.261 7.914
3.875 0.148 -0.133 8.532
4.125 0.040 -0.199 8.945
4.375 0.030 -0.215 9.612
4.625 0.080 -0.184 9.804
4.875 0.061 -0.278 10.931
5.125 0.061 -0.325 11.568
5.375 0.100 -0.036 12.344
5.625 0.026 -0.058 13.502
5.875 -0.038 -0.161 14.501
6.125 -0.037 -0.086 15.723
6.375 -0.028 -0.133 16.929
6.625 0.009 -0.248 19.303
6.875 0.111 -0.045 20.246
7.125 0.032 -0.122 22.784
7.375 -0.022 -0.092 22.906
7.625 0.025 -0.085 23.681
7.875 -0.086 -0.117 23.017
8.125 -0.094 -0.112 22.953
8.375 -0.141 -0.021 22.605
8.625 -0.051 -0.080 21.410
8.875 -0.047 -0.055 20.717
9.125 -0.024 -0.066 20.065
9.375 -0.151 -0.018 20.341
9.625 -0.163 0.020 20.004
9.875 -0.218 -0.037 19.866
10.125 -0.162 -0.051 19.897
10.375 -0.122 -0.037 19.115
10.625 -0.135 -0.055 18.918
10.875 -0.184 -0.065 19.119
11.125 -0.224 -0.087 18.814
11.375 -0.187 -0.032 17.633
11.625 -0.210 -0.069 17.704
11.875 -0.188 -0.073 17.622
12.125 -0.185 -0.113 17.129
12.375 -0.229 -0.189 15.979
12.625 -0.175 -0.216 16.059
12.875 -0.145 -0.184 15.757
13.125 -0.191 -0.186 15.309
13.375 -0.242 -0.153 16.237
13.625 -0.167 -0.149 14.689
13.875 -0.210 -0.140 15.028
14.125 -0.133 -0.205 15.881
14.375 -0.245 -0.206 15.850
14.625 -0.091 -0.242 15.376
14.875 -0.210 -0.204 16.121
15.125 -0.259 -0.203 15.447
15.375 -0.212 -0.196 15.882
15.625 -0.197 -0.231 15.044
15.875 -0.231 -0.174 15.201
16.125 -0.194 -0.188 14.393
16.375 -0.207 -0.219 14.218
16.625 -0.181 -0.180 13.894
16.875 -0.122 -0.145 14.386
17.125 -0.211 -0.155 13.496
17.375 -0.201 -0.190 13.125
17.625 -0.195 -0.213 12.263
17.875 -0.081 -0.103 10.950
18.125 -0.109 -0.158 10.444
18.375 -0.069 -0.154 10.320
18.625 -0.068 -0.114 10.460
18.875 -0.095 -0.142 8.903
19.125 -0.082 -0.102 8.539
19.375 -0.052 -0.051 7.483
19.625 -0.053 -0.048 6.856
19.875 -0.089 -0.036 6.674
