0.05000 6589.63872
0.15000 10075.73378
0.25000 13030.16045
0.35000 14585.03686
0.45000 14835.35890
0.55000 14964.58074
0.65000 14356.65874
0.75000 13737.75844
0.85000 13002.42664
0.95000 12218.89777
1.05000 11614.66296
1.15000 10960.95100
1.25000 10290.39710
1.35000 9669.98459
1.45000 9060.32376
1.55000 8638.83750
1.65000 8149.81142
1.75000 7765.73110
1.85000 7269.71639
1.95000 7011.53050
2.05000 6723.95476
2.15000 6431.62442
2.25000 6166.43144
2.35000 5823.20778
2.45000 5630.76305
2.55000 5402.24230
2.65000 5194.16806
2.75000 4945.75059
2.85000 4690.50527
2.95000 4610.72782
3.05000 4430.56031
3.15000 4258.18980
3.25000 4082.74864
3.35000 3955.61490
3.45000 3785.09000
3.55000 3701.91687
3.65000 3542.66851
3.75000 3399.17949
3.85000 3340.82817
3.95000 3223.15409
4.05000 3050.85355
4.15000 2979.27967
4.25000 2837.52654
4.35000 2792.79394
4.45000 2659.55157
4.55000 2595.12709
4.65000 2445.11614
4.75000 2402.01582
4.85000 2307.05044
4.95000 2194.98023
5.05000 2109.33311
5.15000 2041.29040
5.25000 1942.47726
5.35000 1873.81431
5.45000 1798.12232
5.55000 1708.60980
5.65000 1673.73419
5.75000 1619.32065
5.85000 1556.28594
5.95000 1503.53869
6.05000 1480.71646
6.15000 1417.52242
6.25000 1357.16800
6.35000 1328.11950
6.45000 1289.55543
6.55000 1242.26255
6.65000 1266.96338
6.75000 1202.68437
6.85000 1160.22574
6.95000 1153.60359
7.05000 1112.02438
7.15000 1063.34113
7.25000 1055.85624
7.35000 1000.76931
7.45000 986.12923
7.55000 941.71195
7.65000 915.24552
7.75000 888.35781
7.85000 858.97408
7.95000 837.00072
8.05000 804.18659
8.15000 787.79670
8.25000 751.27505
8.35000 733.77429
8.45000 702.48020
8.55000 686.37744
8.65000 671.17618
8.75000 643.31482
8.85000 641.89855
8.95000 619.53830
9.05000 597.56452
9.15000 599.67268
9.25000 585.69349
9.35000 559.47933
9.45000 555.91770
9.55000 535.53145
9.65000 514.31433
9.75000 502.66522
9.85000 500.35729
9.95000 479.70690
10.05000 477.08943
10.15000 467.82140
10.25000 448.33523
10.35000 445.92607
10.45000 434.45186
10.55000 413.07380
10.65000 418.83402
10.75000 412.56293
10.85000 406.47664
10.95000 390.77994
11.05000 378.21628
11.15000 376.61536
11.25000 360.01359
11.35000 361.73502
11.45000 358.21773
11.55000 350.07100
11.65000 333.21908
11.75000 337.96641
11.85000 319.13646
11.95000 326.47267
12.05000 316.33169
12.15000 310.55057
12.25000 305.76885
12.35000 304.10851
12.45000 289.48345
12.55000 289.37339
12.65000 281.59051
12.75000 282.39040
12.85000 263.83142
12.95000 264.86397
13.05000 247.23256
13.15000 254.59029
13.25000 249.87103
13.35000 241.09485
13.45000 239.29431
13.55000 226.34585
13.65000 226.38275
13.75000 221.45842
13.85000 220.88418
13.95000 218.93117
14.05000 210.11692
14.15000 210.96439
14.25000 212.40844
14.35000 203.49907
14.45000 199.20049
14.55000 202.00953
14.65000 188.05601
14.75000 191.75053
14.85000 188.87648
14.95000 184.81017
15.05000 182.32196
15.15000 173.61866
15.25000 173.89587
15.35000 171.07172
15.45000 166.29357
15.55000 170.30120
15.65000 166.41251
15.75000 166.59253
15.85000 154.80964
15.95000 158.24273
16.05000 150.69030
16.15000 158.83348
16.25000 151.65544
16.35000 147.49852
16.45000 145.59997
16.55000 151.09147
16.65000 143.53134
16.75000 145.03193
16.85000 145.38034
16.95000 138.31619
17.05000 137.79021
17.15000 142.63417
17.25000 139.88733
17.35000 147.42256
17.45000 131.36198
17.55000 132.34789
17.65000 132.92993
17.75000 128.23330
17.85000 123.49864
17.95000 117.99032
18.05000 122.76626
18.15000 124.93664
18.25000 114.89932
18.35000 118.18712
18.45000 112.31534
18.55000 107.36410
18.65000 137.67936
18.75000 102.73310
18.85000 106.12279
18.95000 131.05859
19.05000 99.46086
19.15000 116.98275
19.25000 112.50740
19.35000 104.24117
19.45000 108.23486
19.55000 92.98019
19.65000 107.56122
19.75000 96.91330
19.85000 88.37852
19.95000 99.23599
