0.05000 -3837.14831 -247.60592 149492.45113 2938.04528 2142.12921 1317138.29813
0.15000 -7897.32526 148.98942 -45773.20663 2956.32032 2619.26918 1227320.31812
0.25000 -11521.04077 259.49029 -45096.37195 3018.74810 3077.94593 1250283.51556
0.35000 -14147.75172 261.56337 -11668.09300 3133.39206 3478.79817 1103845.47228
0.45000 -16360.78156 137.92122 11088.89368 3310.14235 3761.26920 1131828.23424
0.55000 -17822.93975 120.16278 218.00903 3291.10253 4054.51507 994889.25459
0.65000 -18460.56448 138.02837 -12026.42779 3200.80261 4256.60860 1030388.57412
0.75000 -18688.60630 145.10097 -6707.25225 3045.00432 4365.77870 926872.06340
0.85000 -18574.34977 144.25443 22074.08439 2813.58345 4449.47695 860338.82997
0.95000 -18406.05289 89.64030 -6692.20516 2501.74502 4425.93711 836264.28210
1.05000 -18078.27715 152.38928 6795.07992 2209.49542 4428.50936 758400.84503
1.15000 -17689.68298 117.21027 -6489.74925 1928.98429 4340.05337 708330.38088
1.25000 -17237.49901 247.42858 -5023.50170 1706.02157 4268.23484 647098.32480
1.35000 -16745.73391 141.69962 -4251.39031 1485.81103 4178.06976 642113.48306
1.45000 -16293.19740 200.12922 4737.53850 1285.79183 4070.54843 579844.48777
1.55000 -15814.12981 229.96415 -3546.39745 1129.28057 3987.27552 555444.15951
1.65000 -15369.44160 273.83351 1893.31936 975.25818 3863.76225 506089.13795
1.75000 -14948.91183 299.72026 -8589.63566 817.18786 3757.49814 492239.07337
1.85000 -14553.48289 215.14884 -2249.81844 682.65297 3684.92920 461171.03237
1.95000 -14182.48819 152.39175 -6320.56352 564.84026 3537.72112 442739.13500
2.05000 -13822.31310 172.59608 3327.18037 466.55587 3444.05581 416705.39295
2.15000 -13454.35293 221.01055 1278.95907 407.18466 3314.79779 378562.56606
2.25000 -13107.77450 128.03210 -7062.28345 375.23144 3203.58444 368977.77536
2.35000 -12756.42651 58.82348 -2590.30631 356.73578 3089.22570 340094.39051
2.45000 -12443.40815 124.68715 -2338.46038 338.02686 3007.00708 330285.37862
2.55000 -12165.38745 145.64686 -1877.66581 315.22716 2895.65385 302942.31265
2.65000 -11906.67592 147.47873 1435.25773 321.71212 2802.29422 285060.04898
2.75000 -11620.20647 122.42578 -2016.90158 342.98668 2666.14913 278205.78527
2.85000 -11342.49382 159.54430 -1381.79905 358.15377 2592.18709 257685.87962
2.95000 -11098.92617 104.78823 -212.43642 355.12404 2514.56764 225576.90531
3.05000 -10876.04061 91.34539 4947.64368 380.28152 2420.51436 235007.56092
3.15000 -10657.51690 84.06735 3185.67769 387.25765 2321.48756 226061.03903
3.25000 -10441.35686 82.95697 717.06027 397.15905 2254.15548 213844.43735
3.35000 -10243.71473 75.81618 1999.33614 421.24697 2161.57576 203501.28695
3.45000 -10048.75837 85.63625 602.68393 444.12199 2078.30329 205469.93114
3.55000 -9873.00366 19.04867 2548.36108 444.68842 2013.69245 190519.78503
3.65000 -9692.34720 67.37368 -2047.57294 441.91112 1956.09647 180678.88747
3.75000 -9509.24373 65.50740 275.35262 460.29742 1864.86960 177532.99992
3.85000 -9354.63291 70.20691 1197.20122 474.57802 1805.08862 158392.27342
3.95000 -9204.68535 76.72605 -508.95257 489.01429 1741.93794 162898.24990
4.05000 -9045.73562 77.14711 -155.12109 515.38635 1652.14804 139997.34153
4.15000 -8904.82265 12.20721 2823.60235 521.47833 1594.91714 151012.34753
4.25000 -8763.14938 66.45033 2203.38083 544.90106 1536.37993 153401.23422
4.35000 -8610.42298 40.89246 1399.81804 571.36531 1462.06465 125975.92678
4.45000 -8464.23668 76.59880 784.39250 590.24696 1394.82236 132862.83544
4.55000 -8329.07085 71.16585 -490.51596 593.60917 1333.40092 128798.91022
4.65000 -8164.84579 44.81048 87.43949 602.19525 1269.65134 132207.38458
4.75000 -8027.98431 15.09205 -1290.40530 607.73641 1224.00365 117483.75171
4.85000 -7855.62204 35.52291 -148.37539 628.39134 1153.11045 109951.79281
4.95000 -7717.42929 41.62776 -2848.65154 634.34478 1093.44474 107792.35778
5.05000 -7553.83177 60.83290 1915.04814 645.94917 1055.04801 111182.43889
5.15000 -7430.06383 44.61712 1614.52756 644.87416 1002.75654 109887.45708
5.25000 -7252.23111 40.26067 -1183.16623 647.20556 957.46229 106884.45091
5.35000 -7101.37927 46.50608 -240.95819 651.38341 898.04656 103804.72110
5.45000 -6953.93959 18.04699 1488.42607 637.82502 852.54236 128867.99175
5.55000 -6818.77871 17.32321 -610.15412 631.97555 804.70124 98942.10559
5.65000 -6670.70642 20.94016 62.42995 614.63248 769.55669 107098.24946
5.75000 -6505.08839 33.07656 1710.06082 593.30842 732.01660 90193.34172
5.85000 -6383.36005 44.61755 2521.16077 550.38012 700.14196 105533.41891
5.95000 -6250.35684 43.00003 815.15178 538.56602 661.01276 95508.20464
6.05000 -6159.72678 8.29125 581.99960 515.37181 635.87721 84715.05097
6.15000 -6037.66375 27.22852 -165.70436 489.50268 624.05944 94569.67848
6.25000 -5931.49515 27.62291 486.67502 459.36124 602.79506 77263.54256
6.35000 -5848.88488 -6.51666 1293.15732 444.63641 571.25582 75964.95435
6.45000 -5782.83447 3.69245 1676.76688 422.03261 558.80845 67338.39311
6.55000 -5693.23279 -5.33633 868.16356 407.06081 538.15397 64106.75392
6.65000 -5637.59167 -1.52712 1731.16165 392.02930 519.62297 62211.14948
6.75000 -5573.64723 11.97162 2500.31790 377.28108 504.45573 66306.12475
6.85000 -5519.94864 4.91734 246.70582 370.90040 489.13393 60362.49115
6.95000 -5471.37109 7.77934 1698.37475 368.69381 473.71225 54770.52505
7.05000 -5419.91260 -9.98725 749.83412 355.91337 459.83683 50697.74140
7.15000 -5385.08467 0.47438 75.60102 351.02570 445.43508 47996.61463
7.25000 -5344.98852 -7.35090 -89.46811 354.17762 432.66307 44274.71841
7.35000 -5321.67837 13.02252 1171.34626 354.61752 423.92334 71508.21448
7.45000 -5282.88175 12.83394 568.66716 372.26493 401.34338 35833.67747
7.55000 -5252.34191 14.59046 566.94858 384.95630 391.66845 38011.22420
7.65000 -5211.17571 19.40281 696.56927 389.07286 375.82630 31587.81630
7.75000 -5174.28566 30.86799 394.73272 389.96763 366.25841 35155.19531
7.85000 -5145.67287 31.54657 -204.48509 395.19698 352.07823 29052.02345
7.95000 -5103.34323 40.00652 739.33293 394.31177 337.43939 28995.26950
8.05000 -5065.29598 38.97217 445.21640 389.48219 322.99644 26351.58184
8.15000 -5030.12435 48.21145 -56.80396 394.04023 308.69963 25456.78268
8.25000 -4981.66268 56.81635 178.13260 391.76988 296.33112 29307.90138
8.35000 -4921.44592 59.74574 572.83761 381.33585 282.56769 26191.11060
8.45000 -4882.04696 53.86414 983.87272 376.48951 272.99963 25427.54282
8.55000 -4828.32894 57.36611 558.88385 357.28422 262.30639 22252.66669
8.65000 -4784.23386 67.58602 254.43896 346.21429 254.23673 20334.52201
8.75000 -4716.04851 69.46338 -159.35597 335.16009 238.97985 25847.84558
8.85000 -4682.85353 69.56779 158.48611 322.86010 225.96971 19001.10180
8.95000 -4625.84602 67.63290 378.92948 301.67722 218.73345 19182.25490
9.05000 -4591.16288 67.02068 662.92465 292.17646 213.42457 19173.98722
9.15000 -4547.65999 63.91595 534.40673 285.78456 203.81219 19357.37683
9.25000 -4492.71843 64.25919 135.68267 273.62822 198.90589 21781.32276
9.35000 -4453.10868 62.42527 33.51200 260.57788 189.61377 18631.36480
9.45000 -4414.73052 67.43832 222.02995 245.17543 181.32083 15796.10243
9.55000 -4376.08151 58.28962 -298.13018 235.82913 172.63325 17255.82095
9.65000 -4340.65709 59.72897 -333.61238 229.87808 166.48559 16096.67273
9.75000 -4301.57115 64.03378 127.15605 219.78083 158.56720 14717.43471
9.85000 -4271.38847 65.32332 -137.66055 214.64139 154.25083 17603.78358
9.95000 -4226.61652 58.82282 -62.06997 197.37664 152.97088 13355.65880
10.05000 -4206.81471 59.28369 6.68740 193.68894 144.06390 13825.76762
10.15000 -4172.53183 58.39228 116.07654 183.41936 139.83743 13399.55736
10.25000 -4143.38183 55.69060 -366.72215 174.60012 137.47060 12220.32605
10.35000 -4112.36110 55.95527 -121.79237 168.11755 132.63698 13380.29657
10.45000 -4085.87942 55.16474 -462.44710 160.19618 127.83755 11939.92327
10.55000 -4053.74171 55.06553 -192.83382 152.22275 127.35427 8923.33379
10.65000 -4021.23311 54.60654 -7.74708 144.55945 122.67963 10476.82944
10.75000 -3989.47164 48.87162 -1250.61421 139.19898 119.22081 63606.80818
10.85000 -3967.43554 48.24213 0.27191 135.81598 114.91377 9407.57673
10.95000 -3934.69547 48.34099 82.39746 126.56997 110.66889 8288.00228
11.05000 -3902.73926 49.49364 134.65217 122.58839 111.15050 9518.80793
11.15000 -3875.14675 47.31989 -127.96210 118.24982 107.60685 7793.55099
11.25000 -3851.23570 45.23496 22.25396 115.63421 105.83196 7757.75370
11.35000 -3817.87795 46.07266 137.20473 110.63622 105.19405 8342.89248
11.45000 -3798.17458 44.34976 4.74153 107.32766 100.64002 10740.41587
11.55000 -3761.57741 47.94586 -151.37836 106.06525 97.58444 7696.41423
11.65000 -3738.39627 48.81522 77.19595 99.67053 97.90274 5998.10873
11.75000 -3713.54865 42.78451 85.43578 94.58440 97.37883 11193.78326
11.85000 -3685.67220 43.34802 62.39596 92.88004 90.49409 6799.45164
11.95000 -3661.06540 40.81489 -117.20162 94.08305 91.79132 6804.12867
12.05000 -3635.81026 39.98420 36.88707 91.23821 89.35971 7406.65547
12.15000 -3605.52396 36.62735 -44.24910 92.75272 87.38701 7810.71732
12.25000 -3585.07315 36.33575 106.45052 87.77317 83.64447 5701.91326
12.35000 -3550.59931 39.44715 346.63943 85.73775 85.12948 5385.17668
12.45000 -3527.60887 34.96370 55.57848 85.33775 82.82381 7057.96731
12.55000 -3501.66708 37.51319 -3.54005 83.04956 80.75327 8175.06950
12.65000 -3476.56203 34.89719 -232.18259 80.40154 76.91409 5915.74661
12.75000 -3447.84125 38.09616 178.76225 82.30431 78.44283 5582.58305
12.85000 -3425.95294 34.87159 136.89045 78.37679 77.46013 5570.58075
12.95000 -3398.45798 35.34027 78.86283 77.41929 72.50297 7213.01240
13.05000 -3371.37561 35.56192 369.71094 76.92561 74.15522 7069.35265
13.15000 -3346.67970 32.58496 134.81124 73.84592 70.94481 5206.39761
13.25000 -3323.75428 34.55092 304.05102 74.59451 70.02051 5401.54899
13.35000 -3300.23626 35.85134 -301.27936 69.88626 71.11043 5181.01933
13.45000 -3283.04554 38.58468 -28.60817 72.23729 68.77606 4831.41577
13.55000 -3262.45083 32.22605 -60.32311 69.85939 67.79369 6030.52518
13.65000 -3240.86300 33.49364 199.35047 68.63352 65.54787 5485.13665
13.75000 -3219.28519 32.27443 94.68867 66.99862 63.84293 4931.61928
13.85000 -3201.48517 33.47235 -73.19955 64.08425 64.51006 6841.57861
13.95000 -3179.53628 32.27981 146.82373 65.44522 64.23398 5258.55381
14.05000 -3158.19951 31.34957 -33.59941 65.36252 61.10752 4283.56680
14.15000 -3134.40797 34.56236 -122.83915 65.89588 62.17085 4951.34215
14.25000 -3116.08405 31.73244 -99.57691 65.84510 59.86179 3764.20393
14.35000 -3096.29220 32.82736 -345.62567 67.35268 61.45845 4863.92361
14.45000 -3080.73525 27.93423 -127.42988 61.32715 60.96456 4453.41884
14.55000 -3057.41600 27.65521 -381.02329 64.68262 60.73177 4853.29148
14.65000 -3036.59250 29.12956 -198.07276 62.76792 58.60346 4979.08907
14.75000 -3021.33635 29.41260 -6.52067 62.04724 57.95898 3861.43137
14.85000 -2998.60147 26.72917 7.11740 57.70705 55.77640 4139.28590
14.95000 -2980.06872 27.24922 -200.63006 59.42348 55.82243 4907.31312
15.05000 -2959.78717 25.58236 -115.88559 60.42482 55.16920 3471.57617
15.15000 -2944.25073 27.07750 171.10056 59.93791 54.77058 3833.44637
15.25000 -2921.08425 27.53923 -204.50170 58.64732 54.01992 5131.65852
15.35000 -2905.66928 26.85980 36.38389 57.64526 52.70301 5649.82651
15.45000 -2886.68815 26.66764 -37.16803 55.74981 52.11637 4427.95941
15.55000 -2867.32752 24.92606 67.64961 55.83121 53.34451 4047.61937
15.65000 -2846.32412 26.21220 -98.60990 56.06669 49.10964 3230.39761
15.75000 -2827.00147 25.66474 -399.37793 59.16186 51.24362 4214.15977
15.85000 -2811.32961 25.16148 -176.09257 61.31102 50.31628 3883.97889
15.95000 -2794.36174 27.87461 84.80299 57.89889 48.10795 3764.09785
16.05000 -2774.92955 27.93817 40.47282 55.78545 50.47438 5938.46271
16.15000 -2755.21552 27.09200 -98.15005 55.10325 47.65684 5560.40126
16.25000 -2742.33831 28.58118 -153.40328 54.60972 47.93981 2913.13236
16.35000 -2722.58502 28.09890 82.99494 51.12671 40.63056 4646.64052
16.45000 -2708.49465 27.31915 -304.90310 54.09930 43.97965 4293.27105
16.55000 -2689.20741 27.15767 -31.92987 58.25538 47.22385 2997.47457
16.65000 -2674.26835 30.61050 -236.56230 55.27919 42.66316 4337.42135
16.75000 -2653.19219 27.78648 -16.72305 56.21393 39.90501 3178.26984
16.85000 -2639.27033 29.09075 -31.87826 54.15458 41.97856 3612.85078
16.95000 -2623.83655 28.12708 134.42370 52.97795 44.13818 3569.13424
17.05000 -2605.73890 29.34011 28.42798 53.49187 41.71227 3405.71325
17.15000 -2591.72115 26.96037 250.99182 50.92872 42.14171 3160.33865
17.25000 -2572.28952 22.94499 -88.03034 53.60868 41.26112 2462.36375
17.35000 -2561.70313 25.65786 -35.10343 51.80552 43.27121 3945.75316
17.45000 -2541.19797 25.69131 97.88970 51.07500 41.52180 2275.67120
17.55000 -2532.31955 26.53802 31.57836 52.58662 40.04698 2034.15419
17.65000 -2510.36918 26.80432 265.27807 53.27834 43.46193 3635.57006
17.75000 -2500.61106 23.34683 202.16222 50.00069 38.01526 2911.53324
17.85000 -2485.56848 24.48452 -59.82746 47.52541 39.54467 2738.67099
17.95000 -2470.99829 22.00963 -200.37695 46.15952 36.02321 2499.09509
18.05000 -2453.03167 23.94184 -40.79246 49.70794 39.00551 2439.48866
18.15000 -2435.18225 22.06922 32.26882 45.20660 34.50220 1881.20914
18.25000 -2421.78597 22.83689 220.30298 49.55122 34.98990 2434.59977
18.35000 -2407.30785 20.96896 74.20382 45.45908 31.33099 1729.09904
18.45000 -2393.91234 20.84531 132.22472 45.83054 33.20490 2037.95175
18.55000 -2378.71811 23.11280 133.19324 51.37157 40.53934 1703.83963
18.65000 -2369.50940 17.92286 206.40366 47.51568 37.22864 2370.17854
18.75000 -2346.37880 20.58595 102.45491 41.73598 33.78281 1706.86665
18.85000 -2334.97634 19.76329 147.45320 40.92359 37.41327 1656.87826
18.95000 -2321.68923 22.45264 52.03050 41.37925 36.47585 1376.17123
19.05000 -2304.81854 25.03150 103.87424 42.87235 36.72436 1967.44365
19.15000 -2292.19663 18.66313 24.91776 36.27030 34.37305 1451.94900
19.25000 -2280.99766 21.11903 -7.58488 38.14640 33.60007 1815.79831
19.35000 -2265.57402 18.24820 -30.32220 35.79254 29.79879 2939.38017
19.45000 -2256.36904 25.41637 159.70817 38.04836 31.28695 1515.89465
19.55000 -2244.64808 17.55814 52.40238 37.19381 30.72869 1187.77944
19.65000 -2227.69566 21.65314 -35.28609 38.26165 27.58030 1289.39588
19.75000 -2216.14348 18.81720 32.03434 34.75536 28.57348 878.07432
19.85000 -2209.17936 20.21255 -54.19617 39.04269 31.46551 1216.02278
19.95000 -2191.75157 20.60959 -290.56077 35.91816 30.23261 1308.94626
