0.12500 0.03142
0.37500 0.01330
0.62500 0.05344
0.87500 0.02204
1.12500 0.04527
1.37500 0.06000
1.62500 0.07324
1.87500 0.06836
2.12500 0.06344
2.37500 0.06550
2.62500 0.06968
2.87500 0.04574
3.12500 0.03146
3.37500 0.04224
3.62500 0.04466
3.87500 0.03941
4.12500 0.04510
4.37500 0.05425
4.62500 0.01903
4.87500 0.03686
5.12500 0.04025
5.37500 0.04157
5.62500 0.03347
5.87500 0.04513
6.12500 0.03323
6.37500 0.03874
6.62500 0.06729
6.87500 0.01649
7.12500 0.03424
7.37500 0.03421
7.62500 0.01313
7.87500 0.04544
8.12500 0.02684
8.37500 0.01135
8.62500 0.00886
8.87500 0.00842
9.12500 0.03219
9.37500 0.03785
9.62500 0.03163
9.87500 0.05289
10.12500 0.06947
10.37500 0.06678
10.62500 0.05948
10.87500 0.07448
11.12500 0.09372
11.37500 0.05987
11.62500 0.05928
11.87500 0.02697
12.12500 0.04938
12.37500 0.02374
12.62500 0.03205
12.87500 0.04759
13.12500 0.03207
13.37500 0.01913
13.62500 0.05562
13.87500 0.05049
14.12500 0.03487
14.37500 0.08468
14.62500 0.03826
14.87500 0.04028
15.12500 0.03194
15.37500 0.02691
15.62500 0.02225
15.87500 0.01975
16.12500 0.04410
16.37500 0.04567
16.62500 0.06627
16.87500 0.07149
17.12500 0.03346
17.37500 0.05225
17.62500 0.07535
17.87500 0.00303
18.12500 0.04471
18.37500 0.04797
18.62500 0.02100
18.87500 0.07337
19.12500 0.02570
19.37500 0.08855
19.62500 0.05718
19.87500 0.10769
