0.05000 -1740.46094 462.23038 1063.83025 2126.29606 3242.03558 3018.26465
0.15000 -3232.72680 402.75703 1045.42530 2428.90519 2355.48826 3843.89906
0.25000 -4134.00650 162.54974 1045.03768 2021.49753 2393.67429 4982.35916
0.35000 -4294.13260 -67.24713 459.34402 2244.43813 1608.05166 4953.19425
0.45000 -4536.49552 -12.32374 193.64346 2056.33046 1194.21604 5499.14951
0.55000 -4898.62567 42.06874 375.50944 1782.57462 1431.67151 5768.49586
0.65000 -5115.15438 -27.33938 330.66246 2003.92162 1723.54694 5983.46298
0.75000 -5420.12987 -14.55801 59.12771 1873.95583 1020.98349 6356.03355
0.85000 -5605.79053 28.38468 94.34503 1908.84006 1063.55418 6365.60691
0.95000 -5765.40191 12.03275 -160.16649 1908.82188 1006.11734 6427.33992
1.05000 -6041.08676 27.47054 109.68485 1564.49357 853.38201 6300.10522
1.15000 -6183.00241 17.88580 -15.36582 1540.93572 773.31062 6244.72781
1.25000 -6292.14759 9.34830 -80.12786 1597.81397 964.14075 6181.68141
1.35000 -6374.08488 -2.31213 -199.23740 1553.62853 845.67071 6010.74640
1.45000 -6438.43198 16.99124 289.72925 1521.36938 722.37830 5929.43738
1.55000 -6567.28753 -1.22442 34.15414 1456.70394 933.83274 5769.04935
1.65000 -6625.15552 6.33399 -25.52692 1340.09387 685.40476 5663.31565
1.75000 -6711.16867 2.98960 -9.64165 1339.88955 774.59895 5437.40980
1.85000 -6759.67626 28.76876 138.00328 1236.65751 617.26410 5308.12236
1.95000 -6810.99396 7.47330 60.90762 1206.06018 745.34564 5183.95817
2.05000 -6839.23470 11.94565 -81.35769 1154.54200 869.54234 5079.68674
2.15000 -6870.29502 9.90572 -17.89240 1108.82714 808.06307 4861.89403
2.25000 -6858.92587 -8.19865 81.14340 1089.61063 834.97620 4782.00760
2.35000 -6894.14922 10.09630 34.77127 951.47472 708.70352 4614.88781
2.45000 -6836.30714 4.48404 163.30657 1038.91013 569.09697 4519.71243
2.55000 -6852.00228 19.83525 60.90970 924.19470 609.27395 4409.04095
2.65000 -6834.17961 13.02891 234.46316 951.58562 593.03847 4343.73446
2.75000 -6854.75711 19.31107 191.85881 973.34061 690.43959 4235.96091
2.85000 -6895.61023 9.88217 105.26130 857.07468 494.11471 4089.37278
2.95000 -6886.92052 0.91768 190.59125 976.32514 692.07381 4063.32354
3.05000 -6922.89887 6.02689 244.80777 959.73054 592.53911 3912.04310
3.15000 -6900.45727 13.24700 241.70051 892.11283 593.02749 3877.73718
3.25000 -6922.21244 5.06543 254.62075 815.16826 619.00233 3755.57911
3.35000 -6916.75250 -0.53052 237.38808 768.19230 546.47754 3666.95815
3.45000 -6895.69403 3.16213 194.28349 866.58662 454.78225 3586.77348
3.55000 -6876.74809 12.29242 129.07208 753.92383 599.39465 3546.99108
3.65000 -6871.64404 5.42781 116.36407 769.33075 495.68437 3404.06511
3.75000 -6881.67113 -2.74715 86.17229 674.33482 475.40137 3298.99736
3.85000 -6851.84201 6.23995 46.84637 679.14154 375.17208 3232.76900
3.95000 -6842.43672 6.66361 6.87757 743.26289 566.21095 3135.69314
4.05000 -6810.08965 14.99478 62.12323 785.02956 508.35315 3104.27148
4.15000 -6751.68906 4.76307 -44.88857 622.55125 405.69049 3043.43012
4.25000 -6710.04081 7.82148 -15.20317 610.93614 491.21184 2931.14100
4.35000 -6669.79368 12.13359 -36.82790 558.40264 498.55724 2843.50626
4.45000 -6602.42850 10.39169 -59.91605 571.71835 426.84390 2755.30326
4.55000 -6562.94827 -0.10139 -41.37687 537.24501 414.91158 2701.53709
4.65000 -6519.21530 20.90673 -119.08981 593.82951 479.52525 2642.68091
4.75000 -6482.96790 12.22811 -107.76949 545.54447 509.17664 2672.92580
4.85000 -6432.09809 12.78415 -115.42340 509.25690 435.71595 2487.15696
4.95000 -6397.83908 4.49988 -183.80242 479.99311 336.87291 2453.16936
5.05000 -6351.61479 7.28829 -102.73937 433.34855 320.33534 2407.36836
5.15000 -6302.33198 7.79887 -189.31602 522.73846 365.88599 2354.79419
5.25000 -6251.19550 6.62213 -159.76615 486.58928 390.13774 2332.52603
5.35000 -6230.81294 6.39347 -153.52045 401.55080 346.25025 2229.59902
5.45000 -6189.39571 5.65622 -196.56688 411.06787 301.15627 2174.28482
5.55000 -6138.21373 2.07270 -156.87250 452.29220 451.33016 2130.04516
5.65000 -6093.10297 1.19412 -130.81608 385.48321 332.92236 2114.18106
5.75000 -6055.93149 1.90767 -170.15172 453.16876 351.78507 2052.03830
5.85000 -6024.68429 1.04132 -69.29636 453.26704 449.03820 2023.00650
5.95000 -6002.56767 0.58437 -119.43765 424.83404 466.28519 2016.87194
6.05000 -5962.78492 6.07168 -186.18375 400.82444 362.00622 1951.53923
6.15000 -5931.94441 7.50113 -159.95635 358.86361 293.56747 1883.41644
6.25000 -5894.40325 -7.40284 -152.06955 375.70202 497.63587 1857.03611
6.35000 -5865.79578 4.63060 -111.95725 342.32992 295.51639 1789.18287
6.45000 -5843.31450 -0.50156 -111.26223 366.92292 277.33629 1771.10578
6.55000 -5811.27695 6.49063 -147.04789 307.64389 247.65609 1718.55318
6.65000 -5786.70654 0.63988 -136.78599 333.62759 280.32847 1688.84463
6.75000 -5747.73300 7.58329 -127.90356 413.00806 403.15289 1669.49060
6.85000 -5713.43766 -1.27952 -134.19500 290.15988 267.06748 1625.06181
6.95000 -5674.94791 10.46744 -86.32018 530.40970 485.66727 1599.54366
7.05000 -5637.72123 8.68903 -72.68465 341.13942 352.43428 1561.51973
7.15000 -5602.00607 -0.97459 -97.96486 416.50756 364.17966 1542.44704
7.25000 -5566.94220 9.74824 -88.65568 310.42075 304.48747 1493.72555
7.35000 -5528.11709 2.06416 -53.20672 369.58055 359.04670 1450.92177
7.45000 -5493.52591 -2.41681 -33.59131 309.10186 441.25767 1436.04750
7.55000 -5458.25608 -2.71436 -51.18012 341.95824 303.91201 1372.16365
7.65000 -5415.82174 1.28514 -60.26574 286.51315 286.43463 1360.87516
7.75000 -5380.24401 7.24405 -22.89666 481.48864 330.34595 1344.61068
7.85000 -5336.76021 -1.87299 -66.45090 278.36294 242.08709 1310.67099
7.95000 -5294.62768 0.88240 -24.18552 328.54750 305.38061 1302.83168
8.05000 -5252.22105 6.99071 -8.86013 401.47113 255.80322 1298.05887
8.15000 -5215.06940 0.71079 6.01940 285.21789 244.55002 1243.84392
8.25000 -5172.17233 2.84543 -19.28195 291.93398 248.13365 1194.68527
8.35000 -5137.92723 7.40348 5.47488 237.24024 248.77615 1139.26929
8.45000 -5100.27160 -0.25261 -28.75393 225.89547 216.44303 1165.35020
8.55000 -5053.21759 0.76667 -21.14171 298.25126 403.70772 1192.92602
8.65000 -5019.20776 1.69653 -15.77131 289.09196 268.43265 1160.68599
8.75000 -4985.53634 2.25235 16.43233 237.60808 180.67507 1049.78225
8.85000 -4941.28336 4.11591 -1.85097 277.63828 185.39832 1046.68622
8.95000 -4904.87894 -2.67011 -19.34420 417.59216 299.38575 1043.00906
9.05000 -4865.89062 0.60721 2.30935 199.85408 204.48476 995.94280
9.15000 -4818.40795 0.85728 -9.98086 231.07254 165.58290 977.03994
9.25000 -4780.87393 1.60678 11.17670 192.34145 169.85779 952.26353
9.35000 -4734.93958 -0.16325 21.73527 195.35899 208.60781 941.61456
9.45000 -4696.66451 4.25879 31.74393 203.85544 173.14315 915.68619
9.55000 -4658.74109 2.12938 28.47955 193.25716 158.06657 904.93331
9.65000 -4619.73862 0.97931 22.94620 183.69825 188.17338 870.22703
9.75000 -4585.32378 -1.67650 23.62315 468.23497 459.61042 889.38876
9.85000 -4549.41165 5.65029 15.34018 185.43947 208.24223 841.36712
9.95000 -4505.57940 1.27618 36.59095 199.90625 250.45558 844.37194
10.05000 -4479.25178 3.62917 27.03362 228.35060 160.12704 810.51081
10.15000 -4446.81296 3.20509 8.52788 227.99986 158.33501 803.30899
10.25000 -4407.59634 1.91680 30.34081 188.98066 175.88268 776.08768
10.35000 -4376.46013 9.87779 -2.72102 352.83740 545.47043 788.66877
10.45000 -4346.58092 4.47933 10.64147 240.82599 170.32106 772.56618
10.55000 -4311.55055 0.89710 25.35484 192.26689 185.50337 735.27974
10.65000 -4282.24748 3.53349 37.30374 175.96504 264.26570 717.42405
10.75000 -4249.42383 1.96074 5.75243 192.89929 113.90403 697.99391
10.85000 -4217.90424 4.84760 43.66978 189.36659 220.13810 692.96820
10.95000 -4183.36684 4.63246 29.18484 141.50924 131.88859 692.15308
11.05000 -4153.62988 2.78011 7.99605 207.39980 191.91481 734.69207
11.15000 -4122.10734 3.83121 -0.92625 213.30428 112.89471 650.24405
11.25000 -4096.53213 1.00054 34.24851 182.87772 209.47601 638.96875
11.35000 -4070.41198 0.88132 19.53239 203.83113 141.26889 639.54302
11.45000 -4041.92012 -1.37776 36.92074 244.05818 208.04095 688.65432
11.55000 -4006.75359 4.68710 32.12255 158.19709 192.86371 608.10725
11.65000 -3976.96646 3.67653 16.12078 138.06418 163.76023 588.90905
11.75000 -3939.43275 1.98869 3.35560 191.24167 122.94899 585.51824
11.85000 -3919.10837 1.56542 21.06017 165.95247 130.60486 568.78165
11.95000 -3885.41202 1.69478 18.34764 225.36326 207.01970 603.09429
12.05000 -3857.61566 -0.25776 11.71210 164.23287 134.65205 556.54192
12.15000 -3830.61125 1.95716 22.94176 192.90349 232.73378 547.02672
12.25000 -3800.65949 1.06122 16.28862 195.44119 177.50661 543.90587
12.35000 -3773.22063 -3.93265 20.33844 107.78301 211.52627 526.21910
12.45000 -3750.41226 -0.39780 39.44596 261.00581 273.76341 519.11650
12.55000 -3731.29511 4.24787 13.28598 399.39592 321.38777 507.51308
12.65000 -3690.15334 2.52999 28.45773 158.77371 220.70076 509.43447
12.75000 -3673.96696 0.92655 28.67347 153.02797 163.87526 507.86209
12.85000 -3646.40983 4.18161 25.25079 101.17514 110.00375 468.06030
12.95000 -3618.24916 -1.00312 33.31027 110.98944 109.14499 476.60223
13.05000 -3586.76648 0.57518 16.61033 140.37951 213.26326 524.89418
13.15000 -3570.52058 5.89640 17.89615 114.78272 266.18750 566.88013
13.25000 -3541.37029 5.83819 29.77550 185.89529 229.22324 441.51092
13.35000 -3515.55272 2.31547 21.14975 99.54782 92.57645 436.73101
13.45000 -3493.64400 0.97493 36.74349 99.46483 113.70025 432.90533
13.55000 -3470.68169 2.28869 24.20916 175.27925 93.38822 477.75911
13.65000 -3455.25478 3.22776 21.84991 249.50646 184.21937 432.05998
13.75000 -3427.05849 0.89970 24.48177 108.39709 91.19140 409.76465
13.85000 -3404.99830 0.84270 15.36064 159.45370 138.13753 425.67475
13.95000 -3385.11831 -1.14721 35.81505 128.98558 148.98218 395.73294
14.05000 -3362.58161 -0.79917 36.87165 91.72191 136.49444 385.89539
14.15000 -3337.20296 1.64303 20.52066 96.67025 135.30456 399.72476
14.25000 -3312.61486 1.21523 12.39323 98.30888 133.61013 371.82274
14.35000 -3293.83245 -1.07825 23.02138 117.95182 184.17256 401.36032
14.45000 -3272.86543 1.89448 21.52263 112.67074 91.08694 357.73072
14.55000 -3254.77051 -3.98779 5.26372 127.16177 125.37465 416.92152
14.65000 -3225.02524 0.31425 10.86277 138.80895 71.80475 351.59369
14.75000 -3211.11417 5.81499 12.66427 179.24483 100.96229 351.84158
14.85000 -3174.92496 6.00023 3.76947 626.41634 204.60770 564.74380
14.95000 -3165.14410 1.08699 9.50136 97.27469 67.02847 329.73067
15.05000 -3142.97319 -1.76239 14.96572 117.29422 130.82664 420.17299
15.15000 -3125.57120 1.82690 21.06560 85.36881 79.45729 314.22156
15.25000 -3099.98077 3.82309 28.19034 152.86169 206.45243 314.57434
15.35000 -3075.94935 0.80945 11.91536 110.11409 91.63559 311.60083
15.45000 -3062.23088 -0.48580 24.76429 124.25539 81.92386 307.98681
15.55000 -3039.50498 0.87913 19.14536 116.42584 156.06948 381.69332
15.65000 -3020.07171 -3.00660 30.45696 84.09480 94.78557 322.14758
15.75000 -3014.09572 -3.63146 21.78764 669.82436 259.54588 289.58597
15.85000 -2978.57782 0.41500 4.26157 75.70930 58.08996 274.97309
15.95000 -2957.24030 -4.31963 27.25790 97.73846 104.35730 283.37254
16.05000 -2938.08135 2.23912 13.00907 61.58629 73.74996 269.99400
16.15000 -2920.38795 -1.52503 4.48749 68.25641 68.56013 265.07740
16.25000 -2899.80250 0.56330 22.28145 173.40861 80.50422 275.56476
16.35000 -2878.62472 1.17066 22.30427 89.50267 59.11582 247.78833
16.45000 -2862.96586 2.44826 7.01767 50.16147 49.79238 252.43723
16.55000 -2842.93397 -1.88514 12.84142 181.88446 120.51431 263.95234
16.65000 -2827.85357 -0.56025 25.58784 83.49214 55.81162 240.06721
16.75000 -2810.58169 -1.61424 12.57660 66.53961 81.20340 234.33137
16.85000 -2792.95146 1.03650 18.68354 60.77206 85.46231 234.60384
16.95000 -2776.25125 2.24567 7.36743 61.09753 61.72250 231.26942
17.05000 -2759.11657 -1.63189 6.94371 69.05120 63.33970 228.95418
17.15000 -2741.02257 1.38659 7.06182 68.88161 46.20773 218.15579
17.25000 -2718.70981 3.62252 9.31970 102.37427 81.12426 240.91944
17.35000 -2697.69502 2.63191 9.92034 156.32548 132.56282 231.98580
17.45000 -2688.32972 1.87830 23.06602 98.33801 106.61842 236.93629
17.55000 -2672.16969 -0.28669 9.20486 90.19796 56.06495 207.69931
17.65000 -2651.04678 1.62156 27.43422 58.56934 63.27044 206.61147
17.75000 -2635.28508 -0.81418 19.12642 125.17520 51.63970 211.38723
17.85000 -2620.76042 3.85209 3.64378 53.17921 62.32792 202.44255
17.95000 -2606.43096 1.61248 22.63050 56.28536 136.34191 304.35076
18.05000 -2589.07762 -0.58372 21.81467 111.00456 90.53537 192.65544
18.15000 -2571.68187 4.10318 17.88077 71.30820 98.69096 199.60674
18.25000 -2556.97636 0.56411 24.42368 86.51916 77.87034 214.30626
18.35000 -2542.19115 1.37260 13.22042 57.08396 82.57871 191.29579
18.45000 -2528.70291 0.89655 17.28896 57.99508 36.39430 178.86020
18.55000 -2509.96380 -0.65927 14.53854 48.29655 68.89665 172.90113
18.65000 -2493.30078 4.37183 8.31687 55.61204 64.21515 177.85804
18.75000 -2485.46945 0.54002 21.78724 122.65892 56.88818 218.18284
18.85000 -2468.82156 1.40268 13.87917 57.43465 44.40709 166.01192
18.95000 -2449.48567 -3.27523 7.44175 53.07200 40.72957 166.01330
19.05000 -2434.16381 -0.93784 12.83248 56.71445 34.30445 158.17107
19.15000 -2427.60553 0.98097 8.19561 132.72147 57.43990 154.33302
19.25000 -2408.56114 2.51525 12.18463 44.32555 51.69806 165.58628
19.35000 -2389.28200 -0.13326 10.77093 43.13024 43.48585 150.28719
19.45000 -2380.20534 3.05522 -1.00176 41.29633 44.49238 161.63784
19.55000 -2365.08015 2.34426 12.52260 35.90742 42.56761 141.74851
19.65000 -2348.55983 0.95912 17.50846 53.83064 45.16592 143.28318
19.75000 -2336.96605 -0.96952 15.82566 59.10544 33.80313 140.88309
19.85000 -2322.59257 1.04912 3.92566 57.47097 37.13562 140.93610
19.95000 -2304.93077 0.07163 10.48854 34.11234 33.28614 138.11546
