0.450000 -2.592050
1.350000 -2.542870
2.250000 -2.531460
3.150000 -2.577140
4.050000 -2.675240
4.950000 -2.762830
5.850000 -2.817650
6.750000 -2.672390
7.650000 -2.669950
8.550000 -3.110810
9.450000 2.743010
10.350000 2.321710
11.250000 2.780010
12.150000 2.394840
13.050000 2.429260
13.950000 1.425030
14.850000 1.354180
15.750000 1.165490
16.650000 2.057120
17.550000 0.947000
