0.2 1.71155 20.19682 -0.69608 112.68782 111.16373 88.40658
0.6 -0.24312 39.502 -0.59957 112.0147 106.6485 87.00096
1.0 -1.1086 62.90889 -0.14233 112.64383 99.41566 84.17496
1.4 -0.476 74.56189 -0.38292 110.4212 92.64878 80.97422
1.8 -1.15689 84.05172 -0.08052 107.64513 87.84556 77.95631
2.2 -1.21107 93.06317 -0.88849 104.01083 84.78891 73.67303
2.6 -1.72616 100.00728 -1.96876 99.42362 82.74274 71.19428
3.0 -1.21491 105.38454 -1.39126 95.79736 79.63467 67.33393
3.4 -2.71903 112.33654 -1.12066 91.72878 77.29828 64.47787
3.8 -1.90649 119.2244 0.46137 88.16169 74.49579 62.16252
4.2 -3.207 128.68345 1.51415 83.57824 70.23734 58.44069
4.6 -2.80134 134.47838 0.84556 79.07147 66.15934 54.91673
5.0 -3.46076 139.74175 0.91314 73.58819 63.1209 51.78644
5.4 -5.58737 143.85287 1.04651 68.39604 61.688 48.08615
5.8 -8.09464 150.19482 0.36833 63.75447 61.12148 45.98839
6.2 -8.76377 159.63927 1.5043 59.68769 59.25681 43.70548
6.6 -7.56049 169.69936 2.3345 55.58837 55.60367 41.48997
7.0 -6.51492 179.19733 1.10391 51.20694 49.60735 40.68384
7.4 -5.13859 186.22596 0.10876 48.25584 44.00852 37.81318
7.8 -4.10928 190.14783 0.3399 46.12427 39.60926 35.47361
8.2 -4.11513 192.87463 0.16905 42.50604 36.63134 33.79723
8.6 -3.29855 194.0979 0.10083 40.56414 34.29182 32.11136
9.0 -1.8052 194.02785 -0.26294 39.14196 33.81715 29.87765
9.4 -0.69657 195.52323 -0.21578 37.90587 33.38558 28.36342
9.8 0.78673 196.10761 0.32063 37.52883 32.1138 26.67472
10.2 1.47233 196.85098 -0.22474 36.79696 31.23317 25.55314
10.6 1.72064 198.00031 0.30699 36.14721 30.22952 24.24743
11.0 1.71813 200.2703 0.25478 35.89877 27.64091 23.16564
11.4 1.74487 201.83205 -0.12202 35.39936 25.05998 22.25388
11.8 1.60981 202.84315 0.42204 34.06269 23.67715 21.6978
12.2 1.58017 203.31257 0.4316 32.28625 22.84055 20.82317
12.6 1.22679 202.85686 0.55901 30.65844 22.82519 20.06917
13.0 0.74266 203.04539 0.03354 29.34289 23.25896 19.51921
13.4 0.68578 203.69888 -0.03967 28.09064 23.1893 18.5265
13.8 -0.79605 204.50531 -0.35278 26.36945 23.12615 17.99816
14.2 -1.31548 206.63609 -0.19905 25.20445 22.8925 17.42443
14.6 -0.75336 208.60783 -0.4543 23.80429 21.26588 17.0764
15.0 -0.66074 210.12954 0.03933 22.57184 19.80752 16.76311
15.4 -0.51241 211.24869 -0.40118 21.53873 18.22455 15.85762
15.8 0.21123 211.74439 0.24905 21.02979 17.29034 15.64171
16.2 0.06248 212.34764 0.58343 20.54852 16.12495 15.04107
16.6 0.0013 212.75754 0.49364 20.03652 16.13468 15.13219
17.0 0.41327 213.64232 0.24448 19.96002 14.8548 14.50186
17.4 0.12492 213.20475 0.07626 19.90025 14.20005 14.4216
17.8 0.36136 213.13598 -0.40566 19.61774 13.07591 13.77815
18.2 -0.49307 212.18562 -0.29287 19.29924 12.27249 13.51832
18.6 -0.4891 211.39539 0.33716 18.48828 11.85215 13.05535
19.0 -0.73912 210.36892 0.04029 18.38563 11.87135 12.66663
19.4 -1.84245 209.65191 0.09583 17.4955 12.0551 12.41703
19.8 -0.96313 209.11862 -0.22302 16.82708 12.17168 11.57118
