0.125 0.000 -0.000 0.001
0.375 -0.001 0.005 0.024
0.625 -0.008 -0.001 0.138
0.875 -0.004 0.006 0.400
1.125 -0.005 0.013 0.846
1.375 -0.011 0.021 1.479
1.625 -0.020 0.036 2.348
1.875 -0.011 -0.007 3.277
2.125 -0.003 0.043 4.423
2.375 -0.014 0.054 5.561
2.625 -0.051 0.023 6.667
2.875 -0.023 0.034 7.936
3.125 -0.036 0.065 9.308
3.375 -0.047 0.097 10.742
3.625 -0.049 0.079 12.051
3.875 -0.077 0.103 13.427
4.125 -0.091 0.050 14.306
4.375 -0.086 0.033 15.437
4.625 -0.087 0.109 16.715
4.875 -0.129 0.016 18.136
5.125 -0.131 0.044 19.364
5.375 -0.038 0.087 20.619
5.625 -0.087 0.064 21.336
5.875 -0.132 0.062 22.745
6.125 -0.127 0.037 23.794
6.375 -0.108 0.071 24.627
6.625 -0.105 0.057 25.713
6.875 -0.032 0.095 25.780
7.125 -0.097 0.128 26.176
7.375 -0.098 0.004 26.472
7.625 -0.113 0.087 26.766
7.875 -0.070 0.079 26.968
8.125 -0.109 0.151 26.981
8.375 -0.091 0.048 26.934
8.625 -0.128 0.125 27.360
8.875 -0.089 0.165 27.358
9.125 -0.098 0.123 26.975
9.375 -0.123 0.104 26.943
9.625 -0.151 0.054 26.545
9.875 -0.110 0.122 25.850
10.125 -0.113 0.146 25.098
10.375 -0.122 0.145 24.505
10.625 -0.176 0.087 24.149
10.875 -0.123 0.110 23.428
11.125 -0.185 0.105 23.256
11.375 -0.156 0.124 23.319
11.625 -0.190 0.118 22.689
11.875 -0.193 0.043 23.164
12.125 -0.187 0.053 22.059
12.375 -0.218 0.035 22.116
12.625 -0.185 0.019 21.516
12.875 -0.150 -0.005 21.025
13.125 -0.156 -0.013 20.650
13.375 -0.126 -0.032 20.117
13.625 -0.092 -0.052 20.049
13.875 -0.103 -0.080 19.827
14.125 -0.071 -0.053 19.311
14.375 -0.059 -0.048 18.502
14.625 -0.061 -0.043 18.517
14.875 -0.048 0.014 18.078
15.125 -0.025 0.027 17.713
15.375 -0.053 0.024 17.321
15.625 0.009 0.056 16.459
15.875 -0.054 0.044 16.217
16.125 -0.052 0.044 15.502
16.375 -0.052 0.068 14.345
16.625 -0.057 0.061 13.169
16.875 -0.074 0.047 12.369
17.125 -0.051 0.041 12.021
17.375 -0.055 0.029 11.278
17.625 -0.085 0.042 11.871
17.875 -0.073 0.047 12.291
18.125 -0.107 -0.000 12.451
18.375 -0.099 0.029 12.181
18.625 -0.121 0.017 11.784
18.875 -0.088 0.010 11.087
19.125 -0.075 0.010 10.665
19.375 -0.052 -0.019 9.374
19.625 -0.055 -0.002 8.521
19.875 -0.052 -0.005 7.668
