0.120000 -0.455200
0.380000 -0.258830
0.620000 2.760700
0.880000 2.797970
1.120000 2.349360
1.380000 2.821820
1.620000 0.167630
1.880000 0.120720
2.120000 -0.194640
2.380000 -0.662940
2.620000 0.183510
2.880000 -0.068480
3.120000 -2.309560
3.380000 3.043910
3.620000 2.825220
3.880000 3.027430
4.120000 2.183440
4.380000 2.739790
4.620000 2.714950
4.880000 2.119840
5.120000 -3.035750
5.380000 1.552070
5.620000 -2.375430
5.880000 -1.698570
6.120000 2.729660
6.380000 2.517890
6.620000 2.612300
6.880000 -2.781020
7.120000 -0.093190
7.380000 -0.457300
7.620000 -0.403360
7.880000 -0.545910
8.120000 -0.876090
8.380000 -0.929160
8.620000 -0.961030
8.880000 -1.968920
9.120000 -1.282640
9.380000 -1.860870
9.620000 -1.475190
9.880000 -1.173010
10.120000 -1.285560
10.380000 -1.202090
10.620000 -0.306950
10.880000 0.399480
11.120000 -0.017060
11.380000 1.128230
11.620000 1.301610
11.880000 1.345980
12.120000 2.302050
12.380000 0.654520
12.620000 1.169310
12.880000 0.288900
13.120000 0.773320
13.380000 0.845890
13.620000 0.560770
13.880000 0.016250
14.120000 -0.228110
14.380000 -0.358110
14.620000 -0.966140
14.880000 -1.287850
