0.05000 -44.77016 -119.56222 -1805.36967 1035.28184 1414.89929 1278.45905
0.15000 -1592.42570 -131.09619 -624.63670 1424.58501 1270.91919 2647.54234
0.25000 -2659.46982 -19.01622 -417.79539 1593.60609 1564.76185 3708.58424
0.35000 -3593.87882 33.71288 -421.07089 1494.40089 1193.29540 4407.40121
0.45000 -4193.47742 30.48280 -24.37892 1598.36393 1170.84211 4969.57960
0.55000 -4518.86475 40.58750 -88.73984 1473.71106 966.97351 5510.51842
0.65000 -4718.49120 24.87077 23.98973 1439.72069 888.29410 5582.42817
0.75000 -4906.14379 28.20263 88.37211 1416.68795 856.38669 5849.92679
0.85000 -4998.09267 48.55257 -3.80890 1410.62887 802.67865 6045.04687
0.95000 -5149.38475 6.01469 49.63752 1358.01264 757.44020 6010.75729
1.05000 -5362.95250 38.25259 271.37175 1285.92161 710.67667 5979.50163
1.15000 -5488.63698 43.39779 0.26023 1289.77233 697.05387 6045.16188
1.25000 -5648.30557 39.40486 153.94720 1294.56135 680.94232 5967.93921
1.35000 -5839.97813 55.03022 -9.73474 1251.84239 662.41821 5852.32434
1.45000 -5973.98711 45.98200 126.29795 1249.25346 590.69177 5753.56845
1.55000 -6068.58974 47.77586 54.37979 1245.90389 558.57745 5693.59355
1.65000 -6173.83620 58.83134 -40.82560 1180.55665 556.58527 5595.65575
1.75000 -6285.56821 46.01891 87.20212 1149.00261 572.50083 5408.79005
1.85000 -6408.27845 50.01575 4.50817 1076.51924 522.70817 5234.90699
1.95000 -6436.15466 48.15834 35.36718 1040.33628 527.65686 5193.40929
2.05000 -6475.09697 54.86257 -58.37281 1058.90803 537.82709 5050.17855
2.15000 -6536.22487 57.79859 30.44387 977.26191 499.12075 4995.86139
2.25000 -6589.70784 41.90194 -26.82430 961.86127 487.55695 4811.34116
2.35000 -6622.24588 41.04623 133.44154 951.06302 499.54362 4701.25379
2.45000 -6714.23809 45.15433 95.45021 897.64045 488.70967 4608.29010
2.55000 -6765.61790 40.21603 116.40655 876.32347 476.48085 4458.70548
2.65000 -6814.91092 33.69004 -76.63524 850.42960 457.21347 4336.98794
2.75000 -6858.76637 23.06681 18.63023 820.44254 462.84748 4263.97305
2.85000 -6898.09074 30.97459 -26.17456 800.94696 450.86454 4152.27240
2.95000 -6904.58964 32.89759 79.26723 782.80394 437.51775 4090.55843
3.05000 -6926.95240 34.47841 74.31664 703.94719 440.95758 3902.56168
3.15000 -6933.01011 33.77382 -8.48136 701.26223 414.05127 3859.73703
3.25000 -6926.95612 34.34454 61.62305 718.85478 420.98079 3762.00343
3.35000 -6938.95404 25.03555 49.53189 674.67860 396.77906 3685.60059
3.45000 -6949.87749 29.50680 16.27968 666.92480 390.36722 3612.59311
3.55000 -6945.68858 27.32117 -16.00157 628.85775 382.13473 3499.95554
3.65000 -6911.07934 32.51527 23.89310 604.47246 356.44353 3427.62887
3.75000 -6887.28597 20.07263 24.36088 583.47423 358.26233 3294.68877
3.85000 -6856.73445 29.92221 13.55480 568.11892 365.14894 3242.25744
3.95000 -6828.71585 33.53159 87.14044 543.27826 332.67880 3161.45067
4.05000 -6816.75234 35.45791 10.84351 535.14323 337.16826 3075.41827
4.15000 -6783.75044 38.76631 3.51633 542.25383 330.59439 3025.19177
4.25000 -6752.52488 22.89261 -73.24005 501.57022 330.96103 2908.65501
4.35000 -6722.51758 33.02146 -13.91323 485.11812 317.24492 2871.97756
4.45000 -6689.16083 27.32097 112.16043 494.07993 332.42936 2792.41371
4.55000 -6654.35068 33.05624 20.92501 459.74948 286.17312 2721.45353
4.65000 -6627.22018 28.48505 -9.88511 462.74249 295.19701 2653.06552
4.75000 -6583.05044 30.01951 -35.57189 449.76124 303.18064 2601.31505
4.85000 -6550.12048 21.98276 -4.52810 448.64392 304.24760 2553.65211
4.95000 -6509.82808 25.92627 -36.30305 436.67146 287.83354 2504.54738
5.05000 -6478.47160 25.78098 -22.04519 421.02251 281.01272 2433.10893
5.15000 -6443.32186 22.81583 -3.19759 417.04918 264.09941 2386.37077
5.25000 -6417.47448 27.66038 8.00058 399.26738 274.43558 2308.72670
5.35000 -6381.20561 24.61328 -4.46834 380.89905 260.40182 2276.01372
5.45000 -6343.10546 25.76519 -31.66973 391.04373 272.08346 2224.71730
5.55000 -6328.10608 26.59664 31.78071 394.22055 271.70270 2150.55414
5.65000 -6279.51770 24.73015 -23.91925 403.74537 237.13128 2138.60928
5.75000 -6246.00046 22.43380 2.03311 396.85406 253.16558 2069.75514
5.85000 -6202.38995 22.69604 58.48739 374.00558 253.92730 2050.08475
5.95000 -6169.23424 27.14987 -8.29954 366.71913 254.02534 2009.71235
6.05000 -6134.58456 20.35431 6.70462 354.76937 235.29950 1935.06125
6.15000 -6096.59965 22.30160 19.87638 346.52889 241.47006 1889.21644
6.25000 -6051.01976 19.58890 -10.05423 348.58873 242.58759 1850.63411
6.35000 -6004.65541 23.90573 -39.32698 329.77007 229.98646 1801.38250
6.45000 -5960.58451 20.09952 7.06457 325.81229 212.26229 1768.05596
6.55000 -5909.41544 18.18607 -16.88963 317.47364 253.61601 1735.53081
6.65000 -5860.08862 20.34778 -8.42842 314.73703 227.53553 1707.26676
6.75000 -5810.53560 18.47061 -61.28401 306.54584 193.87111 1636.46555
6.85000 -5768.36306 18.80614 0.38984 294.50308 224.06231 1611.18635
6.95000 -5719.56985 12.94109 -16.42795 308.54135 234.22291 1565.54962
7.05000 -5692.98343 18.85105 -27.79437 296.44170 230.04332 1531.41858
7.15000 -5640.23355 17.36621 -22.59114 280.60302 198.53519 1521.79960
7.25000 -5596.20654 18.96601 -36.25741 266.41989 192.67053 1472.38249
7.35000 -5555.25510 16.81968 -8.05498 280.99512 188.24339 1448.76042
7.45000 -5520.90680 21.93074 -20.63515 266.70173 174.44673 1419.47781
7.55000 -5475.04097 16.43570 15.64631 274.39706 171.25388 1391.79787
7.65000 -5433.82054 15.60787 -53.71103 246.70982 198.48557 1374.62515
7.75000 -5401.95203 13.66102 3.09450 260.75146 195.79406 1324.64727
7.85000 -5359.81617 15.34853 -16.06030 258.58136 180.99686 1310.74874
7.95000 -5323.62365 14.59591 -6.38901 267.37585 179.44008 1272.19324
8.05000 -5281.72959 15.71370 -13.78868 235.16900 178.87752 1239.55007
8.15000 -5234.74483 17.43921 -7.82940 223.56056 177.23799 1229.56589
8.25000 -5197.62450 17.31252 -12.23349 236.15176 192.34094 1198.55545
8.35000 -5158.31598 11.92246 -11.69183 221.39369 170.71870 1194.59350
8.45000 -5119.13482 14.39856 -15.58751 235.49143 193.30465 1156.50597
8.55000 -5073.45752 14.51966 -16.78740 217.31423 151.49401 1124.03972
8.65000 -5040.51262 13.45994 -20.51135 213.12026 173.81090 1096.94374
8.75000 -4996.27319 11.31824 -19.94226 216.06816 193.73712 1085.34320
8.85000 -4958.04279 16.85887 2.53411 212.91829 158.18696 1069.17969
8.95000 -4928.31939 13.14773 -30.30731 216.81815 173.83385 1033.29816
9.05000 -4888.89849 10.17224 3.55393 189.23077 156.47699 1019.19988
9.15000 -4849.64982 11.57644 -30.60396 196.26393 171.67114 1001.09676
9.25000 -4816.41330 15.80399 -26.48559 193.17555 162.12397 982.17851
9.35000 -4783.40111 11.91052 -20.89128 185.80987 164.52372 953.10754
9.45000 -4752.60593 8.92587 -18.50468 191.23902 182.48609 928.58847
9.55000 -4711.65091 14.71689 1.24948 199.99135 161.38513 916.51329
9.65000 -4677.51885 12.98442 -36.69846 164.90792 151.23415 891.68235
9.75000 -4632.75165 9.50113 -24.57439 193.57361 190.39477 877.33914
9.85000 -4602.91087 10.27663 -35.19608 175.92916 143.49327 850.28444
9.95000 -4571.03689 9.69944 -28.08832 211.29401 161.31200 843.96484
10.05000 -4532.49330 10.05079 -29.90087 199.60871 166.23067 834.79575
10.15000 -4494.46153 9.98610 -55.53269 197.72432 151.87338 815.01583
10.25000 -4457.01791 10.88365 -42.00602 160.43716 133.75898 805.15692
10.35000 -4424.61789 11.87736 -12.84276 149.59890 140.48488 773.72074
10.45000 -4387.13188 12.83512 -30.85481 178.62642 156.62651 769.64507
10.55000 -4356.34766 8.58836 -32.57481 200.96499 148.90354 750.80624
10.65000 -4321.93313 11.36117 -32.44428 158.16716 151.64402 745.86315
10.75000 -4297.74925 8.54399 -44.34183 173.75783 141.21959 725.43653
10.85000 -4263.87765 11.95627 -24.96918 165.13757 110.47927 698.10717
10.95000 -4229.95771 8.93933 -27.26215 148.30478 112.05029 703.97392
11.05000 -4201.85104 13.69041 -29.88117 163.07133 115.49712 677.86791
11.15000 -4171.21514 11.24188 -28.78383 170.79246 126.62848 672.13454
11.25000 -4137.90253 8.21361 -24.61149 129.98342 124.79610 662.01533
11.35000 -4110.90503 8.63956 -45.17529 159.75830 154.19123 656.23355
11.45000 -4076.49629 7.76451 -33.04243 148.96657 135.77209 628.78519
11.55000 -4048.19996 6.27465 -17.33815 128.96024 120.32948 612.15862
11.65000 -4023.21103 11.02774 -25.87630 141.57100 124.35363 611.91969
11.75000 -3993.50291 9.57059 -11.56887 121.65170 96.87561 584.30095
11.85000 -3962.64450 7.46996 -23.18330 147.04422 109.52516 581.91688
11.95000 -3939.31688 10.59877 -14.76556 112.91189 108.21980 564.29115
12.05000 -3915.17534 9.05423 -20.75639 132.93238 156.72199 557.70857
12.15000 -3882.44877 7.27475 -33.18514 121.15484 94.97090 556.19217
12.25000 -3858.97724 7.13510 -27.69365 140.85296 149.89639 542.43876
12.35000 -3830.38278 4.57259 -37.15717 172.08924 129.27792 545.44876
12.45000 -3805.60649 8.48158 -20.62310 137.60004 157.23332 518.98549
12.55000 -3775.63155 7.45693 -19.39542 104.09763 83.88910 506.72499
12.65000 -3739.48877 10.06636 -8.25818 160.43646 103.41894 504.69717
12.75000 -3714.42537 8.21659 -31.41246 124.50670 106.16421 498.03059
12.85000 -3693.95068 7.84097 -8.32910 114.91848 83.83166 483.27963
12.95000 -3669.08353 8.52381 -22.49226 113.52966 113.55627 471.41737
13.05000 -3644.17429 4.88294 -23.69909 177.60960 104.38499 471.86604
13.15000 -3614.90687 5.92279 -11.59819 112.10341 110.55846 452.68302
13.25000 -3596.89991 6.29849 -14.45501 125.40263 130.10430 448.15204
13.35000 -3568.03179 8.81759 -16.52218 134.04950 107.90681 438.08674
13.45000 -3544.38562 6.22367 -17.06062 110.94701 83.46751 424.83727
13.55000 -3521.65383 6.87559 -24.65009 111.24612 93.37954 419.03288
13.65000 -3495.57458 6.89487 -28.88003 168.38724 112.59923 429.69031
13.75000 -3463.80560 5.39032 -19.27031 101.15418 82.48700 400.62128
13.85000 -3448.59684 6.36286 -23.18958 138.68931 91.16098 402.46462
13.95000 -3424.25188 5.82306 -13.77637 151.68613 89.35371 389.13309
14.05000 -3404.53468 7.63907 -4.93961 112.80449 137.76703 381.50443
14.15000 -3379.62804 5.44631 -5.08325 91.94580 78.36365 377.35338
14.25000 -3358.40630 6.57033 -9.12456 84.15783 96.45709 373.08271
14.35000 -3334.39763 4.84884 -4.18999 89.15771 87.57881 357.49404
14.45000 -3312.68199 4.64448 -2.74004 115.99116 92.47358 355.59363
14.55000 -3288.00807 7.72547 -10.85338 92.33957 105.89649 350.09985
14.65000 -3266.91036 1.11855 -15.08191 126.82366 174.23909 365.02150
14.75000 -3246.28014 4.10510 -3.19179 91.09501 82.89149 340.98612
14.85000 -3223.37352 4.78157 -4.44824 73.20744 73.90105 328.81015
14.95000 -3204.17217 6.23695 -9.20432 113.61738 78.55973 337.89572
15.05000 -3178.45794 8.36186 18.06353 103.90711 93.62259 331.09268
15.15000 -3162.01109 6.57975 -5.76547 101.44873 94.40939 312.66259
15.25000 -3134.51421 10.51376 2.54782 73.01679 163.83826 318.11988
15.35000 -3114.40121 3.34378 8.11073 107.27518 72.03737 310.59361
15.45000 -3093.68264 7.12688 6.42191 96.36216 131.86284 299.48046
15.55000 -3072.59832 7.61236 -4.51273 71.33538 61.99318 289.80550
15.65000 -3048.27000 3.57028 -1.31784 90.76312 75.84962 292.92062
15.75000 -3022.13326 3.06275 6.57428 76.03391 76.20398 286.16319
15.85000 -3002.08103 6.14560 -6.97284 62.96227 56.17430 272.73094
15.95000 -2987.29762 -1.57999 -6.20647 154.70195 146.43704 289.60402
16.05000 -2961.50003 3.70472 -11.57159 70.13133 68.07300 281.53469
16.15000 -2937.40869 4.19058 -4.69947 68.25699 64.97346 268.35408
16.25000 -2919.37633 6.09583 -0.61218 71.88319 72.33014 261.94878
16.35000 -2900.91984 1.36012 0.32378 66.27081 124.49073 264.21678
16.45000 -2879.56722 5.09892 0.44509 64.33891 63.19721 257.01310
16.55000 -2862.93978 0.74597 10.14002 74.21233 124.46529 258.78873
16.65000 -2845.28623 -0.20512 1.87108 99.64080 113.83521 250.35572
16.75000 -2826.23350 5.51930 -8.38500 75.34351 49.29708 253.44334
16.85000 -2805.63428 5.00516 6.76525 76.97298 96.62293 237.66772
16.95000 -2789.77864 5.24905 7.52002 58.24583 62.77868 230.77213
17.05000 -2773.69266 5.59294 3.01794 60.26210 85.87434 226.46936
17.15000 -2756.54684 1.12942 8.98390 60.02699 68.50859 217.13330
17.25000 -2739.88150 2.67635 -2.08300 81.60452 56.18051 246.25053
17.35000 -2723.95287 6.37042 8.19594 68.12812 58.85563 218.19725
17.45000 -2700.62944 5.53060 -7.05270 102.63182 83.01017 216.37518
17.55000 -2691.92188 4.32625 -5.23343 66.12356 80.62239 211.32465
17.65000 -2672.37045 5.70782 -15.47567 52.86464 61.39999 212.36218
17.75000 -2656.46860 4.17523 -5.82357 49.35760 40.93129 194.61166
17.85000 -2641.45694 2.99693 -5.22662 58.35407 44.21991 214.32361
17.95000 -2624.34254 3.64722 -12.14978 54.93882 59.40558 194.62860
18.05000 -2608.43026 6.25903 -13.99926 65.24052 79.00741 194.88442
18.15000 -2591.12218 2.33405 0.27803 45.21199 43.03533 189.90351
18.25000 -2570.83060 7.79093 -1.82859 48.39996 89.65074 188.91383
18.35000 -2554.62335 9.90559 -5.92740 62.34577 184.72163 196.21025
18.45000 -2543.23837 -0.20567 -10.68032 72.21674 73.28600 178.37087
18.55000 -2526.72841 2.14512 -7.60216 58.21517 51.12409 188.05687
18.65000 -2507.65511 3.93871 -12.08012 48.38308 39.47638 169.21448
18.75000 -2487.55630 4.46333 -7.40497 182.35652 87.39535 180.57173
18.85000 -2480.22723 10.22852 -14.84087 145.29044 172.65941 265.12590
18.95000 -2466.61325 3.20115 -15.64865 46.67405 45.69939 164.63991
19.05000 -2448.01828 3.52153 -8.74333 42.67365 43.61347 167.43495
19.15000 -2436.92993 1.73092 -8.39640 41.83530 36.82183 153.00646
19.25000 -2417.73470 2.90005 -14.38157 69.06461 39.14121 153.59018
19.35000 -2409.24479 1.46008 -15.32112 51.30088 58.57567 158.09768
19.45000 -2393.62049 3.54083 5.08599 45.84321 32.06804 141.33362
19.55000 -2376.65918 6.00369 -6.70201 41.29680 55.01628 147.98692
19.65000 -2367.00062 1.97997 -10.97718 69.50805 60.90023 159.06795
19.75000 -2346.90840 -2.47867 3.44367 162.65144 113.22817 207.97429
19.85000 -2340.87602 5.37028 -6.39062 47.90403 40.55775 138.06813
19.95000 -2325.85627 5.43759 -9.50003 73.29996 48.97672 153.06163
