0.05000 2592.48091
0.15000 4881.28274
0.25000 5904.92361
0.35000 6400.33126
0.45000 6966.35726
0.55000 7298.61588
0.65000 7275.94835
0.75000 7219.92185
0.85000 7182.39349
0.95000 7021.64493
1.05000 6871.80544
1.15000 6615.42652
1.25000 6464.14475
1.35000 6319.12838
1.45000 6137.86996
1.55000 5905.36526
1.65000 5662.40363
1.75000 5488.79957
1.85000 5382.30388
1.95000 5157.10849
2.05000 5020.91323
2.15000 4844.18757
2.25000 4765.40516
2.35000 4564.46676
2.45000 4484.78129
2.55000 4295.72486
2.65000 4212.95886
2.75000 4090.61852
2.85000 3992.05065
2.95000 3865.59067
3.05000 3866.37585
3.15000 3628.00761
3.25000 3651.68320
3.35000 3578.09543
3.45000 3444.42303
3.55000 3393.04538
3.65000 3324.88755
3.75000 3266.11053
3.85000 3204.83544
3.95000 3122.82924
4.05000 3019.33308
4.15000 2992.33671
4.25000 2912.30591
4.35000 2804.64351
4.45000 2829.22728
4.55000 2708.78832
4.65000 2630.08883
4.75000 2612.45277
4.85000 2563.97219
4.95000 2528.87810
5.05000 2474.20304
5.15000 2369.06196
5.25000 2323.62206
5.35000 2252.71678
5.45000 2207.99778
5.55000 2156.03422
5.65000 2109.01334
5.75000 2049.17901
5.85000 1994.99429
5.95000 1973.59579
6.05000 1924.50920
6.15000 1870.20606
6.25000 1787.69187
6.35000 1750.55958
6.45000 1697.54553
6.55000 1654.31266
6.65000 1600.12681
6.75000 1544.56945
6.85000 1495.88503
6.95000 1450.02580
7.05000 1388.66550
7.15000 1348.52737
7.25000 1308.54252
7.35000 1284.24549
7.45000 1255.45585
7.55000 1190.49164
7.65000 1172.62641
7.75000 1140.73159
7.85000 1098.01851
7.95000 1078.74059
8.05000 1032.42102
8.15000 1025.41216
8.25000 977.20808
8.35000 946.50692
8.45000 920.15337
8.55000 907.49108
8.65000 884.54275
8.75000 866.98101
8.85000 858.04928
8.95000 814.43343
9.05000 816.11624
9.15000 788.61399
9.25000 780.27242
9.35000 754.00473
9.45000 741.19127
9.55000 703.15964
9.65000 725.71482
9.75000 698.78395
9.85000 668.34442
9.95000 663.05221
10.05000 663.97833
10.15000 629.94864
10.25000 626.75443
10.35000 607.68479
10.45000 590.83298
10.55000 580.43624
10.65000 581.31038
10.75000 555.63557
10.85000 550.95916
10.95000 537.45114
11.05000 529.14726
11.15000 509.99345
11.25000 503.26233
11.35000 491.44113
11.45000 493.11707
11.55000 483.11821
11.65000 459.79953
11.75000 463.15250
11.85000 452.82719
11.95000 426.52335
12.05000 413.36242
12.15000 419.28052
12.25000 407.82299
12.35000 406.38002
12.45000 401.04569
12.55000 377.34872
12.65000 385.75472
12.75000 367.82100
12.85000 363.34862
12.95000 350.03459
13.05000 353.35174
13.15000 340.63327
13.25000 345.49181
13.35000 352.53157
13.45000 330.37441
13.55000 321.91087
13.65000 334.09519
13.75000 325.56196
13.85000 309.26141
13.95000 315.82474
14.05000 302.22118
14.15000 297.02242
14.25000 295.41827
14.35000 296.09394
14.45000 290.83350
14.55000 274.84822
14.65000 271.62799
14.75000 268.63417
14.85000 270.23012
14.95000 261.82470
15.05000 257.61287
15.15000 247.52582
15.25000 259.37129
15.35000 243.55902
15.45000 242.33483
15.55000 232.24275
15.65000 226.22007
15.75000 215.22952
15.85000 221.60175
15.95000 217.72048
16.05000 214.15732
16.15000 205.88786
16.25000 207.70463
16.35000 194.51260
16.45000 196.99384
16.55000 186.18761
16.65000 191.67024
16.75000 187.82178
16.85000 191.93107
16.95000 188.49196
17.05000 180.98545
17.15000 178.66316
17.25000 172.52355
17.35000 171.46866
17.45000 166.03803
17.55000 159.64477
17.65000 161.49225
17.75000 161.43035
17.85000 160.58966
17.95000 149.87881
18.05000 153.32299
18.15000 156.60517
18.25000 143.27983
18.35000 137.05312
18.45000 137.77465
18.55000 139.36269
18.65000 136.10230
18.75000 133.36989
18.85000 126.70184
18.95000 125.91318
19.05000 125.75710
19.15000 124.56966
19.25000 125.92490
19.35000 116.27332
19.45000 125.12178
19.55000 128.99112
19.65000 119.99895
19.75000 109.15482
19.85000 110.69242
19.95000 111.63669
