0.120000 1.082160
0.380000 -0.937750
0.620000 -0.756320
0.880000 -0.860420
1.120000 -0.892360
1.380000 -0.961030
1.620000 -0.895040
1.880000 -0.961600
2.120000 -0.911650
2.380000 -0.950140
2.620000 -0.936560
2.880000 -0.942420
3.120000 -0.935460
3.380000 -0.986040
3.620000 -0.971340
3.880000 -0.977990
4.120000 -0.971480
4.380000 -0.937770
4.620000 -0.953460
4.880000 -0.985500
5.120000 -1.049270
5.380000 -1.196620
5.620000 -1.205760
5.880000 -1.242470
6.120000 -1.291490
6.380000 -1.029440
6.620000 -1.116830
6.880000 -1.265240
7.120000 -1.236870
7.380000 -1.446950
7.620000 -1.859840
7.880000 -2.013610
8.120000 -2.160770
8.380000 -2.628220
8.620000 -2.842420
8.880000 -2.389670
9.120000 -1.980650
9.380000 -3.097850
9.620000 -2.856650
9.880000 -2.961810
10.120000 2.530720
10.380000 2.686140
10.620000 2.599580
10.880000 2.345530
11.120000 2.447800
11.380000 2.429190
11.620000 2.485590
11.880000 2.493460
12.120000 2.375360
12.380000 2.430450
12.620000 2.048420
12.880000 1.546240
13.120000 1.807700
13.380000 1.739000
13.620000 1.782490
13.880000 1.318640
14.120000 0.464920
14.380000 -1.225000
14.620000 2.082310
14.880000 -0.605830
15.120000 -3.045500
15.380000 2.648550
15.620000 -2.513540
15.880000 3.008220
16.120000 2.962700
16.380000 2.362040
16.620000 2.693680
16.880000 2.268120
17.120000 1.505440
17.380000 1.669670
17.620000 1.307040
17.880000 1.034390
18.120000 0.355960
18.380000 0.569320
18.620000 0.865560
18.880000 0.002180
19.120000 0.202870
19.380000 0.094840
19.620000 -0.663650
19.880000 -0.597470
