0.05000 2123.67077
0.15000 3562.25842
0.25000 4998.04672
0.35000 5730.59147
0.45000 6183.82986
0.55000 6190.96107
0.65000 6305.05969
0.75000 6343.00379
0.85000 6331.26924
0.95000 6182.92585
1.05000 6051.98581
1.15000 5848.49153
1.25000 5728.91848
1.35000 5647.78544
1.45000 5369.19952
1.55000 5307.63938
1.65000 5179.82875
1.75000 5067.89341
1.85000 4876.78193
1.95000 4738.72158
2.05000 4639.01076
2.15000 4441.41553
2.25000 4324.88219
2.35000 4216.03075
2.45000 4147.79494
2.55000 4012.53173
2.65000 3873.48317
2.75000 3810.09728
2.85000 3726.67421
2.95000 3610.07132
3.05000 3615.01049
3.15000 3456.83671
3.25000 3382.60089
3.35000 3287.82652
3.45000 3168.30554
3.55000 3106.56849
3.65000 3063.93027
3.75000 3008.98262
3.85000 2945.94772
3.95000 2866.53963
4.05000 2757.46693
4.15000 2721.78563
4.25000 2671.86232
4.35000 2586.36458
4.45000 2530.56586
4.55000 2484.12486
4.65000 2386.75040
4.75000 2349.23898
4.85000 2304.36244
4.95000 2236.44886
5.05000 2164.20486
5.15000 2114.17087
5.25000 2067.26485
5.35000 2013.49403
5.45000 1951.35529
5.55000 1901.51973
5.65000 1841.92459
5.75000 1805.55060
5.85000 1754.13519
5.95000 1689.97975
6.05000 1677.34638
6.15000 1616.01052
6.25000 1592.81630
6.35000 1525.76298
6.45000 1508.24973
6.55000 1432.70955
6.65000 1450.21440
6.75000 1379.42731
6.85000 1369.42900
6.95000 1320.18794
7.05000 1292.51240
7.15000 1270.62442
7.25000 1230.90820
7.35000 1213.96606
7.45000 1168.12795
7.55000 1138.25069
7.65000 1098.83870
7.75000 1078.83327
7.85000 1046.81455
7.95000 1023.42403
8.05000 996.51393
8.15000 980.24792
8.25000 957.11273
8.35000 935.23272
8.45000 901.90996
8.55000 891.39757
8.65000 870.42411
8.75000 835.69034
8.85000 835.23201
8.95000 795.06274
9.05000 793.33227
9.15000 785.45613
9.25000 764.24875
9.35000 750.40014
9.45000 739.64635
9.55000 711.40356
9.65000 700.74389
9.75000 693.33267
9.85000 674.44130
9.95000 656.91834
10.05000 653.81527
10.15000 627.37349
10.25000 608.72149
10.35000 600.93229
10.45000 592.75672
10.55000 576.27824
10.65000 561.00269
10.75000 564.90343
10.85000 552.80312
10.95000 529.89570
11.05000 504.84175
11.15000 513.06887
11.25000 496.42237
11.35000 493.82340
11.45000 478.11475
11.55000 462.59731
11.65000 463.57225
11.75000 448.82267
11.85000 445.60232
11.95000 439.59054
12.05000 427.00870
12.15000 417.63818
12.25000 408.53534
12.35000 409.60327
12.45000 404.63195
12.55000 389.05716
12.65000 385.50529
12.75000 385.42947
12.85000 371.74016
12.95000 372.54728
13.05000 358.05632
13.15000 366.06186
13.25000 355.36633
13.35000 339.73487
13.45000 324.51787
13.55000 325.94225
13.65000 325.58512
13.75000 314.24687
13.85000 312.90713
13.95000 308.38129
14.05000 309.33931
14.15000 290.28884
14.25000 288.28843
14.35000 283.68496
14.45000 274.22817
14.55000 264.47022
14.65000 271.45965
14.75000 271.36918
14.85000 256.80047
14.95000 255.04508
15.05000 242.04017
15.15000 240.82021
15.25000 243.35318
15.35000 236.77914
15.45000 231.37769
15.55000 230.77016
15.65000 210.52918
15.75000 224.34702
15.85000 212.10318
15.95000 212.21920
16.05000 191.44357
16.15000 201.74100
16.25000 197.14501
16.35000 188.84093
16.45000 197.69276
16.55000 180.87373
16.65000 184.17222
16.75000 185.36307
16.85000 180.00498
16.95000 174.28844
17.05000 169.14773
17.15000 176.93203
17.25000 166.91961
17.35000 158.90288
17.45000 156.05437
17.55000 159.29162
17.65000 155.70047
17.75000 151.85712
17.85000 145.59285
17.95000 138.59840
18.05000 137.52167
18.15000 129.85047
18.25000 151.81501
18.35000 133.56994
18.45000 125.03406
18.55000 129.59043
18.65000 132.91654
18.75000 144.69794
18.85000 121.02811
18.95000 119.55283
19.05000 119.66573
19.15000 115.66900
19.25000 111.51400
19.35000 117.35028
19.45000 121.79716
19.55000 110.53153
19.65000 107.81046
19.75000 106.52047
19.85000 101.70416
19.95000 110.90743
