0.125 0.001 -0.003 0.010
0.375 -0.004 -0.000 0.196
0.625 -0.051 -0.016 0.735
0.875 -0.041 -0.042 1.381
1.125 -0.034 -0.050 2.012
1.375 -0.034 -0.059 2.496
1.625 -0.078 -0.082 3.061
1.875 -0.085 -0.141 3.459
2.125 -0.090 -0.065 3.874
2.375 -0.116 -0.111 4.239
2.625 -0.066 -0.079 4.594
2.875 -0.118 -0.105 4.819
3.125 -0.115 -0.179 5.089
3.375 -0.170 -0.131 5.453
3.625 -0.115 -0.162 5.897
3.875 -0.148 -0.142 6.106
4.125 -0.158 -0.200 6.330
4.375 -0.169 -0.183 6.703
4.625 -0.098 -0.164 7.173
4.875 -0.121 -0.197 7.605
5.125 -0.121 -0.199 8.177
5.375 -0.101 -0.174 8.750
5.625 -0.122 -0.211 9.691
5.875 -0.118 -0.237 10.520
6.125 -0.006 -0.122 11.459
6.375 -0.055 -0.222 12.569
6.625 -0.080 -0.228 13.464
6.875 -0.007 -0.270 14.666
7.125 -0.047 -0.312 16.235
7.375 -0.057 -0.344 17.891
7.625 -0.055 -0.326 18.461
7.875 -0.081 -0.368 19.298
8.125 -0.045 -0.285 20.233
8.375 -0.043 -0.289 19.882
8.625 -0.044 -0.295 20.256
8.875 -0.059 -0.323 20.866
9.125 -0.113 -0.298 20.970
9.375 -0.120 -0.278 21.818
9.625 -0.110 -0.258 21.676
9.875 -0.132 -0.292 22.049
10.125 -0.129 -0.240 21.610
10.375 -0.192 -0.312 21.961
10.625 -0.185 -0.312 22.031
10.875 -0.211 -0.300 22.069
11.125 -0.206 -0.311 22.251
11.375 -0.189 -0.309 22.306
11.625 -0.223 -0.281 22.733
11.875 -0.175 -0.292 22.567
12.125 -0.170 -0.327 22.993
12.375 -0.214 -0.295 23.698
12.625 -0.215 -0.306 23.426
12.875 -0.234 -0.378 23.611
13.125 -0.207 -0.299 23.307
13.375 -0.255 -0.304 23.608
13.625 -0.259 -0.339 23.371
13.875 -0.211 -0.281 22.911
14.125 -0.235 -0.328 22.949
14.375 -0.155 -0.329 22.879
14.625 -0.216 -0.335 23.099
14.875 -0.207 -0.349 22.589
