0.12500 0.05423
0.37500 0.01637
0.62500 0.00579
0.87500 0.00997
1.12500 0.04245
1.37500 0.04422
1.62500 0.05064
1.87500 0.04523
2.12500 0.06080
2.37500 0.05389
2.62500 0.04481
2.87500 0.07286
3.12500 0.05716
3.37500 0.06663
3.62500 0.06357
3.87500 0.04223
4.12500 0.03515
4.37500 0.03546
4.62500 0.02399
4.87500 0.02467
5.12500 0.02317
5.37500 0.01096
5.62500 0.01193
5.87500 0.01434
6.12500 0.01788
6.37500 0.02494
6.62500 0.03559
6.87500 0.03456
7.12500 0.03566
7.37500 0.04702
7.62500 0.05803
7.87500 0.01786
8.12500 0.03842
8.37500 0.01289
8.62500 0.04751
8.87500 0.04836
9.12500 0.05768
9.37500 0.07007
9.62500 0.03246
9.87500 0.05726
10.12500 0.02754
10.37500 0.05710
10.62500 0.02038
10.87500 0.00754
11.12500 0.05141
11.37500 0.01485
11.62500 0.02855
11.87500 0.03635
12.12500 0.02618
12.37500 0.03065
12.62500 0.01873
12.87500 0.03098
13.12500 0.01691
13.37500 0.04401
13.62500 0.07329
13.87500 0.02454
14.12500 0.05123
14.37500 0.06045
14.62500 0.04891
14.87500 0.06292
