0.125 0.001 0.000 0.003
0.375 0.001 -0.005 0.066
0.625 -0.011 0.008 0.372
0.875 0.012 0.012 1.002
1.125 -0.006 -0.005 1.946
1.375 0.045 -0.034 3.180
1.625 -0.042 0.020 4.570
1.875 0.001 -0.015 5.984
2.125 0.024 -0.000 7.414
2.375 0.016 -0.080 9.170
2.625 -0.052 -0.009 10.854
2.875 -0.036 -0.049 12.671
3.125 -0.005 0.001 14.599
3.375 0.026 -0.001 16.735
3.625 0.001 -0.052 17.899
3.875 0.063 -0.094 18.420
4.125 0.121 -0.026 18.766
4.375 0.146 -0.070 18.999
4.625 0.063 0.001 19.776
4.875 0.094 -0.021 20.623
5.125 0.101 0.031 21.535
5.375 0.032 -0.018 22.601
5.625 0.070 -0.014 23.342
5.875 0.014 -0.008 24.180
6.125 0.117 0.001 25.743
6.375 0.092 -0.032 26.108
6.625 0.047 -0.035 25.605
6.875 0.069 0.020 25.978
7.125 0.115 0.029 25.575
7.375 0.055 -0.012 25.128
7.625 0.109 0.027 24.419
7.875 0.036 -0.041 23.741
8.125 0.046 0.021 22.767
8.375 0.072 0.002 21.882
8.625 0.036 0.051 22.395
8.875 0.035 -0.028 21.022
9.125 0.025 -0.110 20.851
9.375 0.084 -0.072 19.855
9.625 0.087 -0.008 19.998
9.875 0.071 -0.017 18.945
10.125 0.029 -0.018 18.253
10.375 0.034 -0.020 18.510
10.625 0.043 -0.021 17.237
10.875 0.010 0.018 16.395
11.125 0.010 -0.020 16.342
11.375 0.034 0.016 16.590
11.625 0.048 -0.004 15.470
11.875 0.046 0.026 14.793
12.125 0.033 -0.002 13.989
12.375 0.025 0.003 13.041
12.625 0.026 -0.020 12.755
12.875 0.060 -0.007 12.555
13.125 0.036 -0.006 12.760
13.375 0.040 -0.015 11.533
13.625 0.052 -0.026 11.549
13.875 -0.010 -0.008 10.547
14.125 0.034 -0.021 10.244
14.375 -0.005 0.007 9.815
14.625 0.003 -0.039 8.305
14.875 0.020 -0.003 8.953
15.125 0.003 -0.011 8.227
15.375 0.009 -0.003 7.145
15.625 -0.009 -0.013 7.449
15.875 0.017 -0.007 6.375
16.125 0.026 0.009 6.264
16.375 0.012 0.012 5.927
16.625 0.006 -0.017 5.686
16.875 0.010 -0.005 5.359
17.125 0.016 0.003 4.603
17.375 0.005 -0.001 4.654
17.625 0.006 -0.010 3.901
17.875 -0.008 -0.005 4.334
18.125 -0.000 -0.011 4.228
18.375 0.003 0.002 3.778
18.625 0.015 0.014 3.832
18.875 0.007 0.004 3.253
19.125 -0.004 0.004 3.571
19.375 0.010 -0.003 3.054
19.625 0.002 0.004 2.744
19.875 0.002 -0.006 2.321
