0.10 1.13052 1.13234
1.00 1.13007 1.11670
2.00 1.13278 1.13213
3.00 1.11427 1.13086
4.00 1.09603 1.11816
5.00 1.05988 1.13191
6.00 1.04705 1.12408
7.00 0.97684 1.17959
8.00 0.95164 1.09154
9.00 0.90314 1.04482
10.00 0.92129 1.07391
11.00 0.90185 1.06990
12.00 0.91984 1.07204
