0.12500 0.00820
0.37500 0.01314
0.62500 0.02117
0.87500 0.03754
1.12500 0.04315
1.37500 0.05424
1.62500 0.06796
1.87500 0.08472
2.12500 0.08844
2.37500 0.09424
2.62500 0.11484
2.87500 0.12688
3.12500 0.13050
3.37500 0.12419
3.62500 0.13230
3.87500 0.12622
4.12500 0.10335
4.37500 0.09801
4.62500 0.08463
4.87500 0.07577
5.12500 0.06685
5.37500 0.07062
5.62500 0.06549
5.87500 0.07679
6.12500 0.06245
6.37500 0.06435
6.62500 0.06772
6.87500 0.05708
7.12500 0.05164
7.37500 0.03395
7.62500 0.05399
7.87500 0.05640
8.12500 0.04019
8.37500 0.04719
8.62500 0.03374
8.87500 0.02307
9.12500 0.03833
9.37500 0.04292
9.62500 0.03414
9.87500 0.04835
10.12500 0.04978
10.37500 0.04977
10.62500 0.04335
10.87500 0.04767
11.12500 0.04592
11.37500 0.04166
11.62500 0.04662
11.87500 0.03480
12.12500 0.04139
12.37500 0.04144
12.62500 0.03839
12.87500 0.04219
13.12500 0.04949
13.37500 0.03354
13.62500 0.05608
13.87500 0.02380
14.12500 0.04694
14.37500 0.03125
14.62500 0.03919
14.87500 0.04009
