0.05000 -201704.19287 4099.43220 -16080.75657 129107.97995 166432.21121 205772.31931
0.15000 -117804.09606 -398.57708 383.84564 49564.90969 30639.70951 95604.23507
0.25000 -73458.54224 244.01401 812.57831 25235.09600 13674.92955 59837.43589
0.35000 -55454.49455 111.28740 246.26313 17100.89583 7913.91978 43826.76651
0.45000 -45070.71185 32.64926 1151.78271 13368.79448 5753.48524 35287.97689
0.55000 -38210.36567 157.63672 859.52224 11057.12518 4668.55910 29154.33688
0.65000 -33275.55789 0.02709 207.58751 9397.30155 5356.07761 25390.12766
0.75000 -29350.72011 50.47576 295.75600 7868.67006 4501.52652 21971.85996
0.85000 -26589.91559 105.20510 276.45996 6886.04823 3306.77970 19214.32700
0.95000 -24499.54964 66.12729 240.40330 5975.88680 3221.46661 17040.38025
1.05000 -22604.33273 84.71252 312.82347 5218.07321 2973.93973 15459.24547
1.15000 -20930.82461 50.81273 129.81007 4750.20174 2784.17847 14071.15627
1.25000 -19602.85029 53.90609 54.42790 4334.73096 3480.65342 12812.29797
1.35000 -18321.46518 37.34138 -105.89023 3921.12890 2301.52191 11729.46235
1.45000 -17317.88224 30.54371 -42.94079 3640.00166 2481.69103 10962.53308
1.55000 -16440.39378 115.14346 156.73601 3354.62930 2378.26844 10440.66184
1.65000 -15585.08328 39.97967 -11.91922 3068.52801 1999.89872 9453.01916
1.75000 -14741.28611 36.76412 -185.78898 2880.79703 1894.82204 9181.28427
1.85000 -14037.48077 -18.13201 -58.27949 2661.34093 2098.23682 8406.22672
1.95000 -13409.25989 -19.52492 -51.97940 2327.35356 1820.19386 7985.83527
2.05000 -12836.60664 19.47343 -44.02350 2134.25692 1672.41355 7495.23200
2.15000 -12279.73934 -9.93475 11.14049 2053.93502 1583.41682 7166.86716
2.25000 -11806.04284 25.69188 -44.13833 1944.06997 1556.13174 6878.45287
2.35000 -11405.64092 38.23257 -54.98125 1653.43146 1433.31121 6450.02295
2.45000 -10997.34915 1.76980 -135.30535 1575.05939 1412.61597 6154.38146
2.55000 -10613.50240 29.29436 -181.97135 1639.60786 1342.22458 5965.36233
2.65000 -10293.17763 -1.34037 13.62784 1321.07951 1287.55776 5594.36202
2.75000 -9999.77368 14.01156 11.82347 1378.08081 1386.28687 5361.46933
2.85000 -9698.28026 16.49341 -2.52322 1147.68046 1336.10942 5271.05747
2.95000 -9409.34515 19.69870 -89.76109 1148.72673 1232.95703 4900.52362
3.05000 -9172.10667 11.93513 -70.36230 905.90796 1328.64311 4667.62472
3.15000 -8955.17586 -28.94316 -31.90678 1404.74498 1848.87797 4397.00683
3.25000 -8742.57125 4.46386 -79.67898 1285.46569 1076.55344 4304.20084
3.35000 -8571.84733 8.40475 -25.97853 705.56618 1021.63550 3910.97633
3.45000 -8392.27018 -25.55878 -33.19868 708.32707 1047.46066 3731.48959
3.55000 -8250.73418 -3.52552 5.16388 679.09524 995.30120 3527.86859
3.65000 -8115.25394 -21.33073 25.12788 727.96024 1013.87421 3340.09479
3.75000 -7960.73112 -28.76648 63.88287 607.37542 977.98565 3230.34317
3.85000 -7845.02798 -23.29873 -70.10901 723.49613 936.50224 3021.56696
3.95000 -7747.16602 -14.40944 -56.75296 662.15926 901.91878 2960.84013
4.05000 -7642.90753 -22.02242 6.84353 642.78377 883.76655 2826.55517
4.15000 -7601.91094 8.16815 21.77822 770.27957 915.12665 2777.81037
4.25000 -7542.04682 -7.66034 33.87537 648.60031 801.13588 2664.81521
4.35000 -7468.81720 -9.75018 23.50104 614.95297 809.65817 2576.56055
4.45000 -7400.29855 9.24681 8.68237 668.19084 800.12545 2535.47116
4.55000 -7327.62232 -5.05977 -21.91097 627.27629 760.17150 2481.11247
4.65000 -7275.63851 2.13655 -10.77183 677.32381 695.34077 2400.23828
4.75000 -7235.80122 2.32705 -68.25546 657.23326 654.05971 2319.39724
4.85000 -7160.74209 5.30112 -13.73017 949.71122 737.01250 2285.17108
4.95000 -7125.63030 12.32101 -17.58351 789.43915 1082.31380 2291.05287
5.05000 -7068.29087 16.65425 17.45028 746.34152 604.53813 2174.89757
5.15000 -7014.30458 4.03764 -53.13087 636.59267 559.46886 2109.81843
5.25000 -6962.52713 18.16272 -45.24143 729.53876 650.66078 2086.65170
5.35000 -6930.16328 13.56576 -42.38307 598.32886 528.54188 1990.67463
5.45000 -6887.21022 13.32442 -32.41671 610.57442 664.72080 1998.76180
5.55000 -6836.85768 8.04510 -4.65699 560.00109 535.82555 1888.34893
5.65000 -6775.60524 14.23474 -30.41825 568.46000 465.58359 1858.63402
5.75000 -6728.33437 5.35009 24.94579 533.22698 430.81906 1785.02232
5.85000 -6664.41886 14.47718 -13.44125 603.13636 526.52150 1768.97587
5.95000 -6594.28993 9.21407 -37.42153 467.30737 355.33572 1687.20254
6.05000 -6525.68171 17.17290 -47.64016 486.62591 410.55915 1669.12435
6.15000 -6465.51624 0.54151 -19.23459 466.94751 395.58052 1621.54191
6.25000 -6401.53193 7.54345 11.27916 455.45860 382.97026 1565.65966
6.35000 -6335.90616 7.52432 -22.25445 606.31950 363.77825 1509.48411
6.45000 -6279.46316 9.75919 -37.63379 443.57484 390.07474 1475.42140
6.55000 -6223.80837 13.63883 -20.22059 570.45541 435.29684 1449.60213
6.65000 -6148.85140 1.09616 -9.74737 500.94332 464.01520 1419.15370
6.75000 -6080.57178 15.91178 -26.80810 434.64790 298.20539 1341.75120
6.85000 -6016.39185 14.11310 -69.79681 382.20314 343.72670 1326.58428
6.95000 -5966.96134 5.65152 -34.28207 800.50194 1079.61086 1604.12514
7.05000 -5899.09337 13.83562 -14.04941 331.83233 250.41137 1240.40549
7.15000 -5830.99157 12.30867 -11.36433 341.45360 314.81399 1209.50572
7.25000 -5783.29503 8.55918 -34.33102 364.63071 348.04948 1193.06387
7.35000 -5703.77944 18.77869 -10.53610 577.81853 611.38998 1197.46155
7.45000 -5665.29406 13.33790 -39.81644 368.31561 285.21747 1170.56044
7.55000 -5607.11372 17.56917 -22.22353 303.03614 351.02662 1131.89850
7.65000 -5542.99859 10.12618 -14.97060 391.45828 440.29341 1074.63450
7.75000 -5493.34365 14.88951 -24.55795 343.99622 448.34100 1152.07736
7.85000 -5438.06752 16.98755 7.05190 323.46015 337.69236 1010.96971
7.95000 -5385.22270 17.43355 -18.98437 294.36986 226.88582 1001.35162
8.05000 -5341.42321 12.68045 -13.39991 263.32594 202.70075 951.96487
8.15000 -5291.78152 13.81507 20.35511 249.58902 183.80241 942.52045
8.25000 -5238.64586 19.63633 14.02818 259.63597 193.08435 938.82088
8.35000 -5193.09436 10.92366 -11.24434 252.29478 192.29578 917.02097
8.45000 -5142.54982 8.32760 3.13490 257.84883 256.18530 909.69497
8.55000 -5104.69098 10.63947 -4.56454 410.42461 234.83248 884.37613
8.65000 -5055.04753 11.43579 -22.11707 220.85828 187.36093 846.03836
8.75000 -5005.93066 11.32774 9.49762 497.24912 338.46747 854.37650
8.85000 -4967.87690 16.28693 -10.68128 216.23414 181.89551 817.19507
8.95000 -4920.21903 13.34479 -7.15853 223.09901 165.78043 895.26170
9.05000 -4884.02182 10.02800 -3.39457 196.93073 175.59588 795.66032
9.15000 -4840.52679 11.18333 -12.22099 217.52301 140.78220 763.65330
9.25000 -4799.62089 12.15119 -43.39959 188.07179 176.07443 752.80489
9.35000 -4760.26174 11.84986 -23.85844 186.06490 318.14232 772.84603
9.45000 -4718.61060 13.61799 -13.03976 249.60902 168.49262 869.47315
9.55000 -4684.52022 12.70416 -24.20139 172.44843 129.45813 702.91680
9.65000 -4644.49670 12.53629 -22.63798 318.68930 396.70244 729.31485
9.75000 -4614.01262 6.89572 -23.51838 180.91933 180.39159 681.90572
9.85000 -4571.91971 12.84110 -18.07975 188.51232 206.85305 664.18528
9.95000 -4533.34949 11.09720 -24.74328 179.29473 117.56911 646.33201
10.05000 -4491.10536 11.86131 -39.14457 197.23760 133.02142 654.24224
10.15000 -4466.62409 6.51897 -33.74002 411.53789 419.60705 624.19688
10.25000 -4422.61771 5.74154 -37.10369 210.65256 308.31455 614.79122
10.35000 -4386.18243 8.85114 -47.43823 173.31560 137.76756 607.32515
10.45000 -4357.26822 15.33656 -43.24110 202.67660 251.36746 582.64113
10.55000 -4309.67987 12.09570 -32.79719 215.56150 125.35113 578.78249
10.65000 -4277.77343 1.58219 -13.54305 291.73870 280.72760 583.08907
10.75000 -4249.10830 11.31571 -19.81859 159.27474 154.92161 545.10823
10.85000 -4224.55341 6.42105 -20.85875 158.80653 120.83293 540.71578
10.95000 -4185.71033 9.04350 -36.11472 385.94503 211.71144 547.45337
11.05000 -4156.04286 9.17753 -30.43815 133.71814 128.00121 519.57046
11.15000 -4157.81031 22.18365 -32.62412 1547.64945 947.02617 557.88692
11.25000 -4096.68207 13.68435 -28.77108 117.31690 115.26516 496.85120
11.35000 -4061.52983 8.41368 -29.22970 122.39789 106.59058 475.68871
11.45000 -4015.37795 8.13898 -37.09265 256.69461 155.66229 479.40748
11.55000 -3989.05987 2.78762 -29.55915 169.37163 227.14124 457.62318
11.65000 -3958.45179 6.53775 -23.26253 128.82060 135.97131 439.76152
11.75000 -3922.73525 5.59372 -22.65364 180.59197 137.36656 442.35195
11.85000 -3890.09213 8.82971 -11.53876 126.86324 126.83170 428.21087
11.95000 -3862.85570 3.54722 3.80190 114.67893 124.14497 422.56453
12.05000 -3830.91337 3.52573 3.30215 248.48230 116.53605 442.74072
12.15000 -3799.63332 5.06733 9.52178 108.14456 122.38902 408.77467
12.25000 -3768.97719 9.78136 1.99163 170.13017 124.81865 436.77750
12.35000 -3735.46817 4.43691 17.12583 144.34802 97.01104 380.09552
12.45000 -3703.64640 4.01055 18.35744 102.42762 90.86118 367.85746
12.55000 -3673.87999 4.92028 12.35046 100.77094 100.05685 359.13056
12.65000 -3644.59052 0.55714 14.75786 136.91453 119.46729 374.22881
12.75000 -3614.58185 3.68836 19.05509 120.57388 137.96120 368.33587
12.85000 -3611.05632 -6.39754 10.66286 742.21698 441.07052 356.65843
12.95000 -3568.53881 0.76647 16.76585 199.38212 298.36740 360.28153
13.05000 -3533.53717 5.60223 19.66844 143.85204 122.84733 330.78209
13.15000 -3511.28374 4.42027 10.53475 80.39417 96.93959 318.78687
13.25000 -3479.08880 2.55847 6.16553 82.42792 101.58729 311.38508
13.35000 -3453.44718 2.91349 8.15856 70.37790 78.37598 300.89777
13.45000 -3424.02185 -8.58175 25.96022 93.54868 383.42579 412.55189
13.55000 -3403.97562 1.85309 15.43441 77.58785 90.69722 281.80840
13.65000 -3373.93558 2.87064 14.22473 83.55507 99.27621 276.42518
13.75000 -3346.16863 4.73744 4.62970 84.84473 78.91635 286.49056
13.85000 -3326.47422 8.35328 18.84599 65.29599 86.96182 264.94122
13.95000 -3302.56904 6.50894 2.85822 66.12050 74.42236 267.93996
14.05000 -3273.33665 3.12574 3.33423 61.65609 61.49957 255.45242
14.15000 -3252.67584 5.86508 5.63876 92.13574 93.21726 254.33076
14.25000 -3224.10405 1.48494 -2.39109 80.30699 99.30330 256.49652
14.35000 -3205.20253 6.13522 -7.25933 277.43457 64.58571 269.07690
14.45000 -3177.51065 3.54350 -2.95281 73.18655 64.86091 243.41534
14.55000 -3145.37085 0.14134 -11.19915 238.12754 187.38431 285.60698
14.65000 -3120.85720 20.49771 -17.60958 211.51753 413.72947 254.20826
14.75000 -3103.22612 -0.07886 -23.33965 70.42731 156.53390 232.14816
14.85000 -3091.07759 0.36143 -3.39738 91.29354 95.07684 237.90350
14.95000 -3063.07118 0.06969 -12.65424 53.17387 71.57441 231.36844
15.05000 -3041.61861 1.62710 -18.05318 64.60872 163.74011 204.42461
15.15000 -3020.11294 5.19667 0.09080 76.33671 60.85541 224.43398
15.25000 -3000.63487 4.27019 -14.63252 2330.29734 1072.69107 2561.49486
15.35000 -2986.68920 7.71062 -25.52168 240.25094 66.98664 204.71953
15.45000 -2956.85760 5.82752 -18.38883 64.40149 69.12715 193.78365
15.55000 -2935.81390 6.08654 -23.31543 69.31011 98.23995 197.17256
15.65000 -2903.52153 4.54503 -7.12921 261.01734 53.69779 243.00367
15.75000 -2888.55276 5.64923 -14.97602 78.77825 60.50372 195.60782
15.85000 -2878.12534 4.64285 -13.96488 45.20841 49.79162 180.62801
15.95000 -2862.19407 6.44185 -16.68673 53.52367 54.27649 179.71685
16.05000 -2837.12485 2.40170 -7.07004 61.76316 46.74215 183.13523
16.15000 -2817.18605 -2.88635 -9.10981 51.59693 98.04212 179.88873
16.25000 -2792.01280 10.07854 -16.80912 89.84307 133.12710 176.19367
16.35000 -2778.04725 -3.50060 -12.45097 82.11017 145.40898 190.33659
16.45000 -2758.33628 9.10329 -17.41952 86.86973 106.55994 168.01328
16.55000 -2741.48367 0.23559 -9.95648 57.49791 120.57705 166.87501
16.65000 -2720.46190 6.27455 -14.21778 102.07562 125.41139 223.71873
16.75000 -2709.86628 7.65013 -9.17980 76.43603 70.89718 160.58910
16.85000 -2690.47754 -3.57796 -14.58559 66.63389 67.26909 150.61675
16.95000 -2672.49334 -2.19254 -18.94286 66.69394 64.18195 179.11908
17.05000 -2652.35925 4.10024 -10.08521 62.77692 123.21516 161.12053
17.15000 -2635.21474 -1.56034 -2.93287 50.41781 60.73987 148.35665
17.25000 -2624.85667 4.80254 -4.91729 51.40776 53.18329 142.51366
17.35000 -2608.88146 3.06147 -16.13224 43.34349 49.89715 137.82292
17.45000 -2595.93482 10.96320 -19.36985 84.10904 117.57680 145.96983
17.55000 -2517.18836 -97.29942 40.27789 1111.69362 2050.84697 821.24278
17.65000 -2562.14574 3.17373 -5.90491 57.37304 54.42296 136.23510
17.75000 -2536.02792 2.52084 -17.73303 114.79833 115.66430 379.04781
17.85000 -2517.33549 7.14070 -5.23144 79.76119 131.37798 171.27955
17.95000 -2510.81849 3.84923 -11.17408 42.92342 62.52979 154.44298
18.05000 -2484.07470 -4.58987 -19.33848 92.25063 158.27635 144.41181
18.15000 -2476.83622 1.09135 -11.32494 52.03383 43.47495 133.73225
18.25000 -2460.29539 0.01110 -19.79187 38.91774 45.60893 126.62307
18.35000 -2448.95035 -2.37663 -7.09901 79.17591 62.31662 132.17677
18.45000 -2429.93510 1.85470 -14.25750 70.72847 43.77273 132.77263
18.55000 -2418.58689 -7.93807 11.33101 67.06444 84.95267 174.32859
18.65000 -2400.32442 3.58025 -7.11825 58.65395 36.64844 141.71689
18.75000 -2393.80963 4.34740 -20.28577 59.86369 53.46681 128.61628
18.85000 -2375.83266 1.87056 -11.74691 44.94317 49.63979 111.56565
18.95000 -2359.88233 -0.44355 -22.59928 53.86538 86.15317 127.13687
19.05000 -2349.35503 1.44179 -14.68410 35.25101 37.12895 115.29437
19.15000 -2332.24285 -6.48950 -20.72002 34.60093 91.00354 114.47159
19.25000 -2316.00219 8.34654 -2.36414 62.27622 82.55328 121.26517
19.35000 -2311.28629 0.24442 -33.84232 39.43950 32.75020 126.24837
19.45000 -2285.12072 16.57365 -18.10285 132.32981 153.09524 138.22509
19.55000 -2282.30089 1.20638 -21.86395 45.79448 41.64161 118.19783
19.65000 -2265.82606 1.91220 -11.07388 84.58799 65.65136 128.43874
19.75000 -2256.52801 1.92597 -39.75357 71.35627 58.88116 132.19453
19.85000 -2238.79001 -0.23219 -25.27054 40.27823 29.97809 100.37106
19.95000 -2233.13127 -10.66046 -35.67311 85.80188 147.56963 272.27339
