0.2 1.47034 200.61903 0.06867
0.41 1.36217 174.76841 0.06366
0.61 1.19824 141.57274 0.05716
0.82 1.33908 146.69252 0.05228
1.02 1.38401 138.26956 0.0458
1.22 1.45329 134.2444 0.04161
1.43 1.56956 133.75155 0.03779
1.63 1.48162 125.07707 0.03587
1.84 1.4454 118.09926 0.03363
2.04 1.45519 114.49408 0.03157
2.24 1.4768 113.33539 0.0298
2.45 1.47124 105.63953 0.02731
2.65 1.54628 106.71699 0.0256
2.86 1.46444 97.15666 0.02403
3.06 1.53727 95.50599 0.0219
3.26 1.50561 90.02855 0.02042
3.47 1.60286 91.70375 0.01935
3.67 1.51639 85.47251 0.01845
3.88 1.60485 86.03051 0.01727
4.08 1.55109 81.03374 0.01637
4.28 1.55049 78.0483 0.01558
4.49 1.55964 76.91437 0.01466
4.69 1.56835 74.84867 0.01414
4.9 1.62486 73.54158 0.01315
5.1 1.6237 70.30404 0.01229
5.3 1.66482 69.84061 0.01173
5.51 1.65864 68.40407 0.01127
5.71 1.60156 62.72007 0.01053
5.92 1.842 69.55044 0.01001
6.12 1.62404 58.62504 0.00938
6.32 1.81283 60.95452 0.00861
6.53 1.9418 63.0345 0.00811
6.73 1.83349 57.29033 0.00776
6.94 1.82282 55.39665 0.00732
7.14 1.99807 58.73938 0.00703
7.34 1.823 52.14826 0.00666
7.55 2.00851 54.47695 0.00617
7.75 2.00985 51.85508 0.00579
7.96 2.12976 52.33095 0.00539
8.16 2.05689 48.71243 0.00516
8.36 2.20406 50.24932 0.00481
8.57 2.20889 47.63819 0.00453
8.77 2.34579 48.31294 0.00425
8.98 2.29226 46.49062 0.00408
9.18 2.23278 44.98254 0.00388
9.38 2.34007 43.95364 0.00368
9.59 2.3091 43.43479 0.00358
9.79 2.44389 44.74926 0.00338
10.0 2.43308 41.38524 0.00314
