0.26 0.31684 37.30055 0.05557
0.51 0.98541 110.59753 0.05108
0.77 1.23685 132.50855 0.04654
1.02 1.29552 134.61415 0.04321
1.28 1.34534 135.40651 0.04015
1.54 1.29181 124.18489 0.03694
1.79 1.33875 122.21998 0.03377
2.05 1.2881 114.13484 0.03155
2.31 1.32306 110.03561 0.02859
2.56 1.30843 103.82599 0.02626
2.82 1.30838 99.51651 0.02432
3.08 1.29422 93.10075 0.02222
3.33 1.35485 94.0375 0.02059
3.59 1.30394 86.17041 0.01901
3.84 1.33622 84.02705 0.01742
4.1 1.36452 80.72028 0.01584
4.36 1.36711 78.85183 0.01483
4.61 1.37656 74.95285 0.01361
4.87 1.4427 75.01744 0.01249
5.12 1.40037 69.88144 0.01157
5.38 1.44137 68.18579 0.0106
5.64 1.48254 67.65367 0.00989
5.89 1.47732 63.33109 0.00898
6.15 1.60002 64.16399 0.00818
6.41 1.54194 59.23137 0.00752
6.66 1.65317 59.8558 0.00688
6.92 1.61847 57.51828 0.00644
7.17 1.62888 54.25762 0.00591
7.43 1.7225 55.60091 0.00546
7.69 1.6979 51.76692 0.00502
7.94 1.84008 52.12663 0.00459
8.2 1.80904 49.57558 0.00424
8.46 1.82113 48.41774 0.00398
8.71 1.93106 48.56778 0.00362
8.97 1.8708 44.65794 0.00333
9.22 2.06666 47.053 0.00307
9.48 2.08126 43.55151 0.00275
9.74 2.09706 42.27946 0.0025
9.99 2.19742 42.35851 0.00237
