0.125 0.000 -0.004 0.022
0.375 -0.008 -0.010 0.209
0.625 -0.007 -0.013 0.582
0.875 -0.017 -0.011 0.999
1.125 0.011 -0.023 1.405
1.375 -0.006 -0.036 1.850
1.625 -0.001 -0.013 2.334
1.875 -0.012 -0.030 2.831
2.125 -0.013 -0.054 3.461
2.375 -0.033 -0.035 4.247
2.625 -0.058 -0.084 5.159
2.875 -0.038 -0.096 6.246
3.125 -0.082 -0.111 7.625
3.375 -0.123 -0.128 9.032
3.625 -0.130 -0.140 10.754
3.875 -0.099 -0.182 12.297
4.125 -0.181 -0.211 13.993
4.375 -0.141 -0.180 15.460
4.625 -0.257 -0.243 16.765
4.875 -0.231 -0.236 18.080
5.125 -0.167 -0.230 18.852
5.375 -0.246 -0.306 20.232
5.625 -0.307 -0.280 20.929
5.875 -0.262 -0.310 21.786
6.125 -0.279 -0.332 22.498
6.375 -0.252 -0.413 23.312
6.625 -0.285 -0.349 23.776
6.875 -0.264 -0.390 24.488
7.125 -0.248 -0.355 24.846
7.375 -0.244 -0.382 24.921
7.625 -0.287 -0.411 25.444
7.875 -0.256 -0.380 25.166
8.125 -0.110 -0.338 24.492
8.375 -0.174 -0.362 25.106
8.625 -0.198 -0.353 24.523
8.875 -0.263 -0.406 24.753
9.125 -0.221 -0.280 24.645
9.375 -0.214 -0.327 24.874
9.625 -0.125 -0.241 24.545
9.875 -0.140 -0.295 25.046
10.125 -0.179 -0.312 25.088
10.375 -0.192 -0.186 24.771
10.625 -0.213 -0.266 24.773
10.875 -0.187 -0.246 24.714
11.125 -0.120 -0.228 24.413
11.375 -0.192 -0.241 24.036
11.625 -0.225 -0.179 23.506
11.875 -0.178 -0.152 22.906
12.125 -0.194 -0.143 22.981
12.375 -0.189 -0.195 22.407
12.625 -0.186 -0.193 21.764
12.875 -0.236 -0.139 21.977
13.125 -0.181 -0.121 21.081
13.375 -0.213 -0.143 20.374
13.625 -0.169 -0.171 20.093
13.875 -0.195 -0.167 19.236
14.125 -0.203 -0.175 18.428
14.375 -0.189 -0.142 18.180
14.625 -0.189 -0.146 17.969
14.875 -0.150 -0.206 17.229
