0.05000 -1402.10070 235.40040 -172.68785 1160.77530 1077.40788 1853.72421
0.15000 -2240.32010 8.16059 768.05642 1785.82964 1578.91361 3388.47841
0.25000 -3658.51800 19.22701 70.32821 1748.62010 1390.41688 4120.98386
0.35000 -3998.95658 -11.73327 248.69226 1692.73448 1180.20115 4800.80472
0.45000 -4278.39028 -25.05250 205.66887 1461.05814 1008.73483 5094.60107
0.55000 -4336.09091 23.65086 133.32351 1445.71607 937.69344 5496.60889
0.65000 -4452.09756 -18.87850 118.14812 1444.72453 832.25749 5777.96106
0.75000 -4616.27576 20.58158 22.18637 1331.64080 785.92201 5945.54866
0.85000 -4813.16470 -8.35016 155.04648 1301.71289 736.49453 5953.78980
0.95000 -5014.80635 18.50000 139.27583 1315.56915 705.79971 5921.95795
1.05000 -5180.47859 8.21100 -88.26001 1306.86198 689.42946 6039.64095
1.15000 -5368.74505 2.10551 101.84831 1282.87522 677.95623 5965.79783
1.25000 -5552.14741 -6.39812 82.87248 1271.64696 594.26515 6004.30182
1.35000 -5709.61401 11.34012 -15.23636 1240.90615 576.37303 5916.01348
1.45000 -5895.94508 2.56595 -182.10124 1209.73603 598.72163 5749.97528
1.55000 -6018.77947 20.89684 56.63327 1190.66388 535.20861 5628.58390
1.65000 -6133.40780 11.01345 -49.67752 1162.86659 538.25614 5490.30372
1.75000 -6176.93118 -10.86694 -110.19912 1168.03863 481.24805 5424.54400
1.85000 -6250.66868 13.28742 -44.04207 1066.78940 493.45454 5292.89445
1.95000 -6353.83643 13.97167 18.67944 1056.87533 491.55380 5154.09684
2.05000 -6468.54780 -7.49507 -93.11248 1007.47254 461.92975 5036.43785
2.15000 -6479.94251 0.59864 12.77368 991.41779 433.32739 4988.28615
2.25000 -6560.11436 12.93364 -18.97358 925.59415 425.95078 4816.60039
2.35000 -6634.53921 2.46113 104.38234 904.89208 419.71768 4682.79958
2.45000 -6655.02749 -0.49064 1.97635 868.96030 434.47662 4612.88572
2.55000 -6752.50220 3.06263 -103.18438 857.60909 430.89234 4457.18199
2.65000 -6817.02490 4.31128 -20.18484 857.10459 415.95778 4387.62211
2.75000 -6868.82195 2.60565 -37.65325 806.97413 404.44718 4287.53175
2.85000 -6903.34357 0.71639 -0.30889 788.02901 397.72532 4153.20391
2.95000 -6902.72755 7.59897 0.10801 738.84309 359.98237 4033.11109
3.05000 -6911.36754 0.29791 -15.88542 746.20599 372.01865 3962.33419
3.15000 -6921.43482 5.08524 -24.34996 705.52154 366.19431 3873.97760
3.25000 -6919.44966 4.16378 51.39925 706.66784 370.98307 3779.78997
3.35000 -6934.98322 -1.41017 -18.22432 686.25621 371.24087 3706.74058
3.45000 -6943.88927 1.74784 9.33515 676.51365 376.14023 3615.37102
3.55000 -6938.20014 -1.10437 33.82634 606.18540 338.52164 3500.51356
3.65000 -6932.01755 0.62051 -2.77232 605.14363 370.37574 3423.95413
3.75000 -6922.99736 0.30198 -6.34260 590.15169 345.72206 3328.59415
3.85000 -6905.96477 6.97517 -15.53030 589.01509 331.22360 3256.40102
3.95000 -6892.34204 0.70730 -56.12592 570.20328 338.77834 3211.69007
4.05000 -6879.75781 2.18252 -38.33412 531.63022 305.33674 3096.30198
4.15000 -6826.45101 -4.04652 5.14196 534.39839 300.75708 3058.23575
4.25000 -6818.15438 2.54553 -82.72842 500.73115 320.52526 2970.08205
4.35000 -6807.61032 4.58020 -72.35377 499.94564 308.28540 2884.74182
4.45000 -6758.41198 1.11336 0.43913 488.96462 326.41147 2837.38162
4.55000 -6729.84139 4.91594 -19.74696 482.95862 306.82522 2768.13538
4.65000 -6702.74891 0.69756 -17.15393 453.81946 293.74346 2690.33384
4.75000 -6665.77748 0.17713 0.57780 452.60383 290.83841 2617.60815
4.85000 -6633.27554 1.66418 -22.11862 459.37184 279.56427 2547.78122
4.95000 -6599.35724 -2.75431 -1.41489 455.71590 300.93476 2497.12329
5.05000 -6555.36091 -1.80154 -49.37116 436.69655 266.89831 2441.94596
5.15000 -6518.24769 0.88207 1.75964 423.11800 264.14490 2412.52912
5.25000 -6484.89786 4.42633 -19.92582 412.03131 277.12356 2343.31317
5.35000 -6438.64617 2.49287 -25.68752 388.20242 259.67567 2284.78620
5.45000 -6387.21918 0.50156 -56.62103 379.91818 246.32763 2232.06898
5.55000 -6356.36542 6.35169 -85.74081 405.22783 277.47420 2171.26294
5.65000 -6320.50890 4.01020 -3.94889 398.24176 274.60535 2148.93471
5.75000 -6296.42651 3.68058 -30.87937 368.19241 234.49720 2097.74014
5.85000 -6266.97336 -4.43469 -8.85752 339.87136 236.06233 2011.02526
5.95000 -6224.11160 3.15956 -51.13338 359.94829 242.38602 1993.12456
6.05000 -6181.75382 0.70697 2.53339 349.92595 244.22262 1956.38122
6.15000 -6133.89096 1.66069 12.94259 343.32660 224.38480 1904.72056
6.25000 -6104.54255 5.15759 -32.64424 326.14471 221.40281 1856.23424
6.35000 -6061.55579 0.99478 -23.10535 329.23371 220.60993 1802.96907
6.45000 -6020.01727 2.49019 13.87409 334.13124 229.57705 1756.78836
6.55000 -5972.70692 2.40319 9.13074 317.76610 204.03625 1732.58478
6.65000 -5931.97955 4.18961 35.26439 322.00918 222.67062 1699.89865
6.75000 -5883.27506 3.75391 -3.29499 334.81950 215.89813 1657.69390
6.85000 -5841.99960 6.63235 34.28777 295.03772 233.48407 1610.83120
6.95000 -5797.80729 2.82055 32.96555 314.27998 209.82231 1585.27655
7.05000 -5744.47398 8.35467 23.98572 294.54890 191.80113 1532.49453
7.15000 -5703.09794 1.49340 33.13211 288.95375 213.46834 1512.22659
7.25000 -5660.92284 3.19049 26.08563 293.57485 182.29158 1488.05415
7.35000 -5609.02395 3.28352 34.86244 273.29189 193.06326 1454.83545
7.45000 -5572.07194 5.46653 36.99234 282.55719 218.16287 1406.67694
7.55000 -5527.70132 -0.89538 5.28852 280.32142 181.58888 1379.61708
7.65000 -5483.99678 7.23457 34.85962 253.13464 177.95648 1357.85637
7.75000 -5438.47512 1.59511 38.86207 243.38987 171.60821 1331.86978
7.85000 -5389.06235 2.14477 30.68740 241.55024 168.71745 1285.41998
7.95000 -5349.71907 1.28193 3.36982 232.81757 186.52138 1251.19690
8.05000 -5302.61779 2.57127 33.90830 267.42973 177.21726 1232.88859
8.15000 -5265.06032 0.92526 46.31331 218.61259 168.72577 1212.52107
8.25000 -5227.90449 2.58680 31.38250 230.25819 172.00050 1188.53035
8.35000 -5187.69399 0.78958 3.91962 231.50582 157.38982 1167.56016
8.45000 -5150.82071 1.71486 47.47806 234.09785 194.81587 1134.98835
8.55000 -5111.66922 1.42546 17.31756 225.10350 187.74123 1115.14006
8.65000 -5069.43620 5.30825 63.43764 218.11206 169.87287 1115.17264
8.75000 -5035.03887 0.25122 5.95442 211.33342 158.97380 1060.25062
8.85000 -4992.74461 -0.70669 29.30713 213.65436 175.88950 1041.91816
8.95000 -4944.37955 -0.30836 52.87373 220.18256 180.85587 1028.83753
9.05000 -4907.23987 1.56718 29.17726 212.95385 171.34233 1019.15705
9.15000 -4861.42035 2.16553 21.00629 194.41424 145.87044 978.59992
9.25000 -4821.73392 4.32658 21.94207 182.58626 174.42808 961.91610
9.35000 -4776.78218 1.68438 47.64227 203.04378 158.10402 942.67220
9.45000 -4732.88685 0.20581 6.17255 231.40081 181.88454 934.85295
9.55000 -4702.29638 4.68553 26.42387 177.16248 146.77637 910.90905
9.65000 -4657.21771 4.29909 21.77028 162.18116 155.69190 891.62255
9.75000 -4616.97950 -0.37235 -16.97520 180.24868 173.21648 883.28403
9.85000 -4582.85093 0.35699 0.01403 171.04427 148.73232 856.84673
9.95000 -4548.31694 1.99040 3.91744 196.35720 128.43930 822.42151
10.05000 -4517.79407 4.91264 33.95687 192.66909 189.31595 811.38244
10.15000 -4476.08135 -1.24543 -9.33047 172.25440 128.47243 795.27142
10.25000 -4447.40357 2.05870 0.40409 179.79474 138.47210 789.27853
10.35000 -4425.95741 3.98462 -30.98076 175.85295 152.50764 765.12595
10.45000 -4389.83621 4.73901 -9.85978 191.94477 157.87365 760.82880
10.55000 -4369.15938 -1.15409 -7.71653 168.41537 163.22991 738.70012
10.65000 -4345.99287 3.61022 -0.44118 182.12835 161.94261 736.43202
10.75000 -4318.00042 0.49881 -35.44556 152.38756 118.49311 710.06667
10.85000 -4296.09315 5.71743 -9.86209 160.12945 140.65468 707.10981
10.95000 -4265.44581 1.52918 -2.69919 187.08307 110.13963 696.71050
11.05000 -4236.09093 0.46534 -19.24875 160.74516 133.80586 673.08376
11.15000 -4214.19154 3.93146 -6.57775 187.12854 174.38244 653.98526
11.25000 -4182.01653 3.61070 -11.90265 152.09252 145.46900 654.46217
11.35000 -4158.14964 2.62865 -8.10784 149.85437 108.61488 622.55610
11.45000 -4129.20759 4.54777 -26.61028 151.17972 111.03270 618.11492
11.55000 -4090.83248 -4.74187 -2.71562 202.24571 149.69061 610.50996
11.65000 -4059.73096 3.77579 -8.79232 148.85084 107.64312 595.44345
11.75000 -4025.27153 -0.25055 -8.26510 152.68357 102.11096 593.84601
11.85000 -3997.19507 -0.16954 -13.72322 148.82060 125.72815 570.70985
11.95000 -3960.63918 1.09421 -14.86256 157.46427 116.18728 570.32946
12.05000 -3938.52946 3.56018 -14.71910 134.12743 110.38863 541.07066
12.15000 -3905.61166 -1.18451 -19.60951 118.71946 95.80968 544.59260
12.25000 -3869.70241 3.10879 1.75814 137.11160 119.22309 539.98612
12.35000 -3841.08690 0.93965 -10.95170 128.54515 145.66377 517.42280
12.45000 -3802.33479 -0.42260 -15.98904 139.28967 106.79793 526.05417
12.55000 -3776.66108 2.91761 -27.17085 110.60098 105.73524 496.63319
12.65000 -3741.70337 3.24182 -28.64084 131.70196 149.63308 501.81581
12.75000 -3715.64104 7.54506 -20.93672 105.33808 111.00797 487.58269
12.85000 -3684.19353 7.51421 -31.85422 121.35482 95.26658 464.94448
12.95000 -3656.74562 6.88587 -49.57053 113.71870 106.01235 454.58407
13.05000 -3625.70216 11.68645 -27.72160 151.62666 101.85398 451.71456
13.15000 -3591.23382 10.34672 -21.94150 97.91222 78.95647 444.49528
13.25000 -3563.14987 7.92879 -40.41413 82.31238 84.86604 434.01185
13.35000 -3534.47430 7.19593 -32.40865 95.08820 82.70380 428.39904
13.45000 -3509.65565 4.96595 -24.72887 79.46825 97.69915 411.75817
13.55000 -3480.02291 7.54506 -23.80291 97.40898 86.44938 402.28286
13.65000 -3453.00205 8.83475 -19.24929 111.54154 91.30394 405.73009
13.75000 -3429.21054 8.81480 -6.08265 70.79535 77.24675 387.96174
13.85000 -3404.16492 9.46120 -11.64218 123.63367 94.87769 393.38007
13.95000 -3382.88368 11.52341 -2.04652 82.66534 74.71049 365.87382
14.05000 -3353.80822 9.40639 2.22165 99.47017 82.21482 372.41469
14.15000 -3337.96739 9.55312 -7.25831 128.39364 100.84885 376.34939
14.25000 -3319.68331 10.22988 3.98878 90.75042 78.12567 366.27042
14.35000 -3299.75177 9.56032 4.43850 85.84270 78.11423 358.41034
14.45000 -3284.19405 10.84661 -0.74908 79.64822 82.72429 341.20043
14.55000 -3260.75823 11.01101 16.14625 70.25561 68.86934 341.98997
14.65000 -3241.51000 7.34477 16.02058 76.47040 88.09829 333.38236
14.75000 -3217.29488 4.26909 32.56562 78.37623 71.53246 343.31303
14.85000 -3203.62785 6.46637 19.63070 67.63998 84.48582 327.43431
14.95000 -3182.16909 9.93653 20.64211 99.67107 86.19806 322.82447
15.05000 -3162.21289 6.08535 24.94155 74.78348 68.61561 316.09389
15.15000 -3138.28296 8.46686 33.78847 133.91732 105.20865 318.16967
15.25000 -3125.49191 6.91282 47.88537 81.67756 92.68925 309.41309
15.35000 -3103.81245 8.68692 40.50624 72.80369 64.47545 301.04514
15.45000 -3084.56147 8.25207 50.56433 65.99971 54.41023 293.58756
15.55000 -3065.29640 6.63414 44.78425 73.64269 59.05063 292.83553
15.65000 -3044.44087 6.15371 60.63101 67.10822 55.20384 282.96287
15.75000 -3023.86114 9.18866 40.52933 74.50021 55.97009 275.36154
15.85000 -2998.47861 7.12136 51.47191 63.76080 61.80031 277.23929
15.95000 -2978.53333 7.09055 47.23486 71.25268 67.80166 270.94279
16.05000 -2961.07388 6.23113 41.76041 71.89483 79.84315 263.65181
16.15000 -2941.85517 6.24271 46.92736 60.93208 60.35429 267.51425
16.25000 -2923.22331 7.04027 47.22488 61.99918 70.31275 257.50847
16.35000 -2901.97687 3.61431 54.93359 131.41741 98.70760 257.22795
16.45000 -2884.71656 8.27994 44.90501 71.08167 59.78501 274.63452
16.55000 -2868.81705 7.41935 30.25743 49.46718 64.45571 241.14145
16.65000 -2849.90297 7.49483 36.91623 66.08766 73.87528 257.05067
16.75000 -2834.63717 7.62371 26.54673 68.27667 66.54094 239.88073
16.85000 -2816.81070 8.00080 20.69435 60.91115 93.33662 259.75698
16.95000 -2801.62001 6.97835 23.55660 69.02787 52.66752 231.89399
17.05000 -2784.93976 5.54648 30.96555 65.52457 78.32731 231.67984
17.15000 -2770.04639 6.00900 34.22573 56.51451 53.57636 226.77496
17.25000 -2748.38654 6.33579 15.19422 59.20402 67.57978 219.68911
17.35000 -2727.99586 4.63252 15.33340 140.54876 88.50553 242.22590
17.45000 -2715.45964 4.28826 11.70600 78.31388 88.75878 222.57423
17.55000 -2703.64980 7.38966 11.46979 55.83302 54.37493 213.25645
17.65000 -2683.10584 8.83499 10.72944 109.55096 47.98353 209.49588
17.75000 -2667.77188 5.55902 -6.53159 45.13439 42.14028 198.78332
17.85000 -2651.86764 6.30361 1.72285 54.10846 55.01409 192.87505
17.95000 -2636.14894 5.65452 9.32986 43.16860 71.58827 202.21423
18.05000 -2619.47430 5.53151 4.98461 65.70934 47.67876 191.89618
18.15000 -2605.36015 7.09358 1.36336 48.26876 48.71527 185.39713
18.25000 -2588.20443 4.26793 -1.47876 71.41178 56.71869 187.34944
18.35000 -2576.25699 8.89617 4.29749 49.06095 51.85166 184.06028
18.45000 -2555.41440 6.11535 2.78996 48.84573 42.91236 169.95723
18.55000 -2534.74123 4.40422 -2.56200 80.58173 39.14234 177.83927
18.65000 -2524.35725 6.08917 17.98638 78.11787 38.84901 174.75375
18.75000 -2508.56641 6.78181 2.54593 55.74570 73.79774 171.31717
18.85000 -2485.37989 -2.23970 -0.54548 109.86945 85.27593 176.72156
18.95000 -2473.07786 6.67797 0.44281 81.55102 41.84488 148.71870
19.05000 -2460.59473 8.25887 -0.45105 48.11112 47.04359 150.52651
19.15000 -2445.47017 5.13109 15.49598 34.88298 30.59218 151.09866
19.25000 -2434.20226 2.68424 2.51026 53.47668 64.87692 156.78300
19.35000 -2415.15561 2.43201 0.73119 59.65115 64.95480 154.71559
19.45000 -2397.63330 6.19120 -9.80491 48.80423 52.13758 147.11395
19.55000 -2388.58087 5.66099 -4.98653 52.27169 46.26400 144.32299
19.65000 -2372.18695 4.00270 15.69722 41.61990 28.92091 136.37022
19.75000 -2356.81561 7.01315 7.17330 54.06764 55.97761 139.79128
19.85000 -2344.76223 2.57573 6.93731 53.95964 60.22733 140.38981
19.95000 -2336.27779 5.95331 14.26393 49.73585 44.58205 133.05290
