0.12500 0.02432
0.37500 0.01773
0.62500 0.03361
0.87500 0.06073
1.12500 0.05905
1.37500 0.08496
1.62500 0.09687
1.87500 0.08922
2.12500 0.08462
2.37500 0.08808
2.62500 0.06346
2.87500 0.06720
3.12500 0.06013
3.37500 0.05971
3.62500 0.07071
3.87500 0.05003
4.12500 0.05003
4.37500 0.04888
4.62500 0.05583
4.87500 0.04639
5.12500 0.03851
5.37500 0.02718
5.62500 0.03012
5.87500 0.03781
6.12500 0.03371
6.37500 0.03324
6.62500 0.04484
6.87500 0.04753
7.12500 0.03614
7.37500 0.03260
7.62500 0.04197
7.87500 0.03475
8.12500 0.02882
8.37500 0.02291
8.62500 0.02029
8.87500 0.01210
9.12500 0.01257
9.37500 0.01291
9.62500 0.01279
9.87500 0.01391
10.12500 0.01052
10.37500 0.00438
10.62500 0.03900
10.87500 0.01985
11.12500 0.01942
11.37500 0.01974
11.62500 0.01076
11.87500 0.02479
12.12500 0.02531
12.37500 0.01547
12.62500 0.04271
12.87500 0.02844
13.12500 0.02721
13.37500 0.02730
13.62500 0.01609
13.87500 0.02232
14.12500 0.00924
14.37500 0.01416
14.62500 0.02679
14.87500 0.01569
