0.2 -0.04108 18.39919 -0.12771 104.02413 102.99783 89.01323
0.6 0.62328 39.42978 -0.29858 102.59281 97.02198 87.94875
1.0 0.50403 57.1182 0.7555 101.08914 89.85997 83.77694
1.4 -0.13077 68.84418 0.93492 98.92121 85.32369 80.27447
1.8 0.7948 80.83208 -0.85681 98.82889 82.15864 77.59436
2.2 0.65005 91.15733 -0.00887 97.02073 78.82847 73.98903
2.6 1.17523 101.04654 0.07032 94.78511 75.12426 70.31557
3.0 0.0224 107.27536 0.16476 91.10862 71.67444 65.69918
3.4 0.84435 111.02957 1.87439 86.61781 68.44311 61.81187
3.8 0.81263 117.31132 1.47697 82.50885 66.21037 58.66134
4.2 1.3292 124.85111 1.50704 79.83515 64.3097 55.89801
4.6 2.66487 131.23227 0.03906 74.57827 63.22785 52.97849
5.0 2.57813 138.33201 -0.00896 68.46124 61.19413 49.44596
5.4 3.21402 145.93437 -0.84609 62.46157 59.02275 46.87018
5.8 2.33372 155.9953 -0.18774 57.5828 54.45527 44.54598
6.2 0.75667 164.52895 -0.84069 52.7557 49.04503 42.17529
6.6 0.76046 172.0328 -1.1938 48.83309 44.6064 38.88029
7.0 0.15381 178.02145 -1.01853 45.51773 41.45776 36.27181
7.4 0.16926 183.90945 -0.98136 42.28584 38.42336 33.33029
7.8 -0.15122 189.64578 -0.25448 40.11519 34.75687 31.2135
8.2 0.59105 193.07816 0.04408 37.77175 31.7084 29.19769
8.6 -0.25473 195.02436 -0.05674 36.83234 28.84893 27.87341
9.0 -0.54068 195.53789 -0.11175 35.20375 27.31549 26.8553
9.4 -0.97895 196.43761 0.20985 33.84634 26.83451 25.74481
9.8 -1.28065 197.73996 -0.21638 32.8777 26.12021 24.82257
10.2 -1.39309 200.03318 0.50366 32.13796 24.73684 23.38729
10.6 -1.27622 202.05338 0.40497 31.01646 23.6398 22.48703
11.0 -0.56022 202.97992 0.18576 29.28309 22.49637 21.34533
11.4 0.24831 203.53083 0.20821 28.40593 21.76785 20.54863
11.8 0.91164 204.498 0.59129 27.08927 21.21113 19.54892
12.2 0.2858 204.86064 0.27693 25.82922 20.73777 18.85801
12.6 0.85083 206.32378 -0.22026 25.04492 20.44095 18.44623
13.0 1.13695 207.20356 -0.03881 23.9503 20.39433 17.93567
13.4 0.50249 208.49788 -0.10194 23.40185 19.68552 17.40651
13.8 0.43343 209.62412 -0.58976 22.29895 18.1904 17.16355
14.2 0.13189 210.07935 -0.96248 21.73689 17.67098 16.19696
14.6 -0.02837 211.19969 -1.10867 21.08285 16.36979 15.896
15.0 -0.49411 211.20457 -1.19129 20.58209 15.27763 15.9421
15.4 -0.24733 211.267 -1.06206 20.05058 14.45387 15.45862
15.8 -0.60297 210.86387 -0.89639 20.00361 13.70993 15.0759
16.2 -1.07977 210.41027 -0.65388 19.47839 12.86912 14.65299
16.6 -0.46404 209.71925 -0.38165 18.95429 12.75078 14.0473
17.0 0.05768 209.19475 -0.10334 18.56238 12.36825 13.82221
17.4 -0.24 208.32369 -0.38262 18.26352 12.65362 13.24178
17.8 0.13557 208.12127 -0.28985 17.35497 12.94074 13.00984
18.2 -0.38528 208.06991 -0.05895 16.69647 12.84863 12.47888
18.6 -0.04628 207.96032 0.12945 15.95007 13.09229 11.89995
19.0 0.48644 208.05731 -0.05417 15.40939 13.14336 11.42172
19.4 0.09569 209.35993 -0.05348 14.77508 12.23011 11.42404
19.8 -0.10592 209.85137 0.01011 14.7257 12.10243 10.93736
