0.2 2.00442 20.71409 0.89114 68.61379 68.11075 64.56773
0.6 1.60956 42.94883 -0.59054 65.53433 66.39291 62.34983
1.0 4.12776 67.77946 -0.12557 63.15528 62.82637 61.67978
1.4 2.04091 88.5429 -0.02883 60.26335 57.25129 56.27554
1.8 1.02343 105.34718 0.67123 57.13508 52.3706 53.2234
2.2 -0.38457 118.89698 1.50861 54.15599 48.29845 50.5753
2.6 -1.86833 130.87505 1.43648 51.98124 44.85364 47.1331
3.0 -1.78846 141.15328 1.97892 48.71954 42.45296 44.36029
3.4 -0.81318 149.38398 1.59592 46.92962 39.89709 41.91967
3.8 -0.57748 156.18861 2.43137 45.30896 37.70961 39.73951
4.2 -0.57192 162.13391 1.11062 42.28038 36.12135 38.21935
4.6 -1.10387 168.07455 0.59472 40.7799 34.47024 36.06718
5.0 -0.34461 173.40996 0.21811 38.75757 33.63282 34.12162
5.4 0.8883 179.55049 -0.89952 36.77321 31.76806 32.24412
5.8 0.39295 182.73811 -1.3428 34.93623 29.55159 30.47912
6.2 0.52758 185.94335 -1.4821 33.66087 27.62123 29.08288
6.6 -0.24249 188.50168 -2.00194 33.28371 27.37866 27.33468
7.0 -0.74561 191.35191 -1.5531 31.32406 25.79963 25.66501
7.4 -0.89424 194.15416 -1.17312 29.60186 24.26848 24.69496
7.8 -0.14873 196.49362 -0.85869 28.43105 22.97315 23.48128
8.2 -0.99207 197.85038 -1.21246 27.15698 21.41805 22.28717
8.6 -0.66729 198.56476 -1.30831 26.45263 20.35303 21.01876
9.0 -2.17869 199.51205 -0.75441 25.29132 19.33843 20.3489
9.4 -1.96027 200.34153 -0.87404 24.66955 19.07241 19.25315
9.8 -1.42169 201.56191 -0.46105 23.02671 17.99548 18.32228
10.2 -0.70786 202.74194 -0.50811 21.99463 17.10025 17.58947
10.6 0.77218 203.81115 0.48624 20.95945 16.17201 16.90769
11.0 0.8728 204.12653 1.19793 20.38207 15.65504 16.33653
11.4 0.8778 205.06398 1.53332 18.95607 14.82388 15.30202
11.8 1.76008 205.67821 1.63438 18.6814 14.94629 14.91915
12.2 1.69997 205.43487 0.53736 18.31973 14.73208 14.38481
12.6 2.03382 206.61596 -0.73873 17.20926 14.642 13.66175
13.0 1.95148 207.87712 -2.92965 16.41782 13.49859 13.18945
13.4 1.52497 208.06888 -3.51778 15.74978 12.30674 12.57598
13.8 1.36881 207.84365 -4.09297 16.03944 12.35918 12.4239
14.2 1.07219 208.50946 -3.88506 14.56996 11.25779 11.09016
14.6 0.92842 208.39429 -2.83968 14.57194 10.49939 10.73165
15.0 0.74899 208.06815 -2.68697 13.62165 10.3211 10.0706
15.4 -1.22819 209.55216 -0.9803 12.94591 9.20127 10.00921
15.8 -2.36034 209.09184 -0.36298 12.55293 9.21048 10.12414
16.2 -1.98234 209.17559 -0.72636 11.53629 8.30077 9.3943
16.6 -1.06818 209.31351 -0.29104 11.97999 7.93569 8.92099
17.0 -0.5861 208.85188 -0.94098 11.53754 8.35929 8.49942
17.4 0.34872 207.87912 -1.16585 11.20484 8.66742 8.28195
17.8 -0.40922 207.75802 -1.10315 10.50838 8.96799 8.12641
18.2 -0.20733 208.30881 -1.96589 9.53531 8.21458 7.69536
18.6 -1.75836 208.4207 -1.36723 9.79491 7.31573 7.68742
19.0 -2.70871 208.2003 -1.69643 10.33773 6.71817 8.31396
19.4 -1.37937 207.77726 -0.66809 9.40244 7.25986 7.01948
19.8 -1.17273 208.43739 -0.72067 9.6251 5.78562 6.79978
