0.05000 -1935.35161 -767.32296 -26447.89628 1339.81072 2124.37311 202662.86960
0.15000 -3004.97381 212.47374 -35050.45259 1331.30008 1241.24037 431544.08916
0.25000 -4103.84910 -2.02279 -23406.50784 1448.85291 1290.40865 418847.75607
0.35000 -5367.30884 40.58741 -22063.55979 1547.71854 1062.98196 341480.52834
0.45000 -6099.87856 -1.99218 -7327.66454 1435.41009 968.93010 348548.07112
0.55000 -6660.26841 37.72368 -7428.61540 1508.51230 964.58648 330693.81299
0.65000 -6999.67843 -6.22017 2044.42703 1557.58064 803.37494 341027.82329
0.75000 -7266.93545 -5.74115 -2130.08413 1512.82842 781.45510 372699.09298
0.85000 -7542.55147 11.81321 -4198.60621 1448.58929 781.49695 335176.31316
0.95000 -7714.17127 13.99775 -10354.98625 1378.82896 670.76303 354901.86078
1.05000 -7778.51315 3.33889 -3493.60077 1360.83942 680.92425 342399.04132
1.15000 -7820.47979 22.01960 -3853.26410 1378.84793 674.28830 302843.72916
1.25000 -7893.19681 -1.75935 110.83205 1370.22404 681.97502 296795.69258
1.35000 -7906.28543 22.79249 6795.96372 1239.71079 633.26987 275520.38637
1.45000 -7897.36730 23.91006 7029.41889 1212.15581 610.45296 263570.57502
1.55000 -7943.69364 12.24914 1625.11541 1143.82869 599.27201 245530.95222
1.65000 -7941.56555 10.64296 -185.77587 1092.30810 612.35006 274474.30798
1.75000 -7980.28823 13.89350 -315.64996 984.88249 618.96917 245262.83302
1.85000 -7962.85814 17.18679 -2907.85337 954.37918 591.70840 214754.11052
1.95000 -7898.33549 2.53273 -5125.25156 907.31552 587.16965 213085.77251
2.05000 -7900.00921 14.24412 5071.56872 821.64790 587.44937 233763.59208
2.15000 -7842.26151 10.40137 -1104.06544 774.78975 566.58579 209067.15073
2.25000 -7852.55150 20.31943 624.07693 722.74708 555.85568 189405.45765
2.35000 -7866.92547 10.09486 -3656.91558 688.21011 543.69170 191484.12654
2.45000 -7856.65628 15.86583 954.47802 616.56331 532.79922 195762.40233
2.55000 -7808.75682 25.10953 1444.83105 564.35967 501.82744 182113.12539
2.65000 -7791.67578 9.43601 1030.97764 588.94167 527.38480 177426.82854
2.75000 -7781.37884 3.02409 115.09113 513.27007 493.20999 159928.67932
2.85000 -7718.63443 6.10549 -1059.01345 496.36836 486.83608 153547.87556
2.95000 -7683.35809 9.95541 -2386.85981 497.95424 466.54428 158369.89481
3.05000 -7676.11036 4.43161 -632.59056 463.53392 461.66103 156103.98149
3.15000 -7622.69245 7.82990 662.77427 455.28667 436.49310 145195.09307
3.25000 -7580.25224 7.14507 -1139.98623 443.98123 434.42012 135940.49771
3.35000 -7540.24238 7.15704 1226.87715 438.51301 415.03110 137764.45761
3.45000 -7503.33584 9.04128 -400.11754 405.84486 412.64405 123959.95202
3.55000 -7446.04931 11.36844 137.77317 395.00920 401.98215 129586.84214
3.65000 -7420.16696 7.37750 5.66283 381.38575 398.20079 117470.34116
3.75000 -7379.71178 13.19783 181.41849 371.97182 376.36112 112561.64659
3.85000 -7329.48875 3.02570 -188.35378 352.17982 378.37664 112851.28886
3.95000 -7276.69345 6.89984 -530.16220 339.99767 374.12572 114310.49874
4.05000 -7227.15296 11.01050 -1719.37467 359.14829 361.53043 99725.26207
4.15000 -7202.55514 8.46019 -55.63468 336.91533 354.41296 110793.67164
4.25000 -7153.31831 11.77139 1536.59535 313.52327 338.59961 121830.91424
4.35000 -7120.95904 12.95241 -290.07395 339.48794 346.71074 87142.62517
4.45000 -7090.19186 12.06854 -2651.49353 306.74258 330.85696 94761.63189
4.55000 -7021.74312 7.96022 -1407.64689 328.33423 337.09397 88377.13816
4.65000 -6973.77991 11.87545 10.26905 295.91920 315.04822 81457.48381
4.75000 -6907.12901 12.39031 884.84068 323.71439 314.59317 77331.72007
4.85000 -6864.06505 12.61273 -638.82318 307.01837 323.80999 102116.51909
4.95000 -6808.08970 7.43709 -630.24609 290.05060 292.52184 75782.67271
5.05000 -6766.25687 7.31876 -229.55698 313.69212 309.85107 76559.13580
5.15000 -6708.84413 17.55554 -162.10294 279.74746 298.48039 81435.23166
5.25000 -6665.45423 13.59316 -30.20417 276.82197 274.87232 66860.06870
5.35000 -6617.96424 13.13012 -805.92237 287.73997 286.38954 76177.57793
5.45000 -6573.47180 13.40571 17.13163 297.55506 287.56307 98406.44418
5.55000 -6525.28406 8.90547 -494.85200 278.76995 282.86490 74164.57635
5.65000 -6494.11279 11.00645 -30.64605 281.23728 279.14419 86590.63014
5.75000 -6454.79202 6.76154 795.28508 274.59501 276.33934 64001.33822
5.85000 -6426.66088 7.16617 -729.23025 269.73678 282.29336 58442.19699
5.95000 -6379.70180 9.70587 -1036.03193 306.91168 283.82080 78656.68373
6.05000 -6338.91667 4.39316 160.86853 257.27515 229.79398 85878.68573
6.15000 -6298.52517 9.53506 251.79255 262.83183 241.76095 55239.93614
6.25000 -6252.30357 9.06598 1746.75841 274.69236 231.11937 72727.48841
6.35000 -6190.94172 3.90723 349.82915 242.43222 217.97114 56186.57187
6.45000 -6143.72657 7.05346 -135.69334 270.30047 221.75790 50595.15994
6.55000 -6100.03512 6.28363 361.18924 258.31827 241.95307 50527.87784
6.65000 -6046.03417 4.91456 79.24406 232.10384 209.88438 70497.62650
6.75000 -6005.29307 8.51119 909.05120 239.19740 236.19759 46986.68606
6.85000 -5947.33659 3.11674 -547.40855 244.55291 202.68218 42782.66902
6.95000 -5897.94692 2.99456 358.32490 243.88389 249.18542 43776.21045
7.05000 -5852.28286 3.14407 -1382.45634 247.50259 218.47224 46090.54893
7.15000 -5805.50491 6.92064 431.89210 238.36080 220.08518 43470.59253
7.25000 -5752.56420 5.41633 491.42969 229.56489 207.28253 36988.13824
7.35000 -5707.95538 3.53172 654.83161 250.08202 220.61638 40116.97193
7.45000 -5662.88797 1.48436 490.54779 206.56114 217.36222 34409.99296
7.55000 -5611.69934 3.08117 -442.88488 211.71294 169.85359 39271.71404
7.65000 -5568.23642 3.04465 -80.46677 220.99975 180.13587 46789.82275
7.75000 -5515.39675 0.75348 253.47993 204.79546 212.40813 34169.60380
7.85000 -5463.77302 4.55903 227.04186 211.70546 174.00412 30812.91908
7.95000 -5411.84936 6.15888 -208.94230 191.53759 160.98401 31362.16315
8.05000 -5363.53339 2.80329 981.62386 189.48847 201.35228 32524.14081
8.15000 -5322.56372 2.12290 144.10778 206.25735 183.80921 31634.57751
8.25000 -5276.87985 3.25296 61.97798 168.63361 182.82161 29218.83056
8.35000 -5234.95460 0.93916 -34.85547 174.13172 155.23484 27584.12894
8.45000 -5187.79584 3.65189 495.83085 162.38151 161.10683 24768.75445
8.55000 -5142.98397 5.88137 439.35973 184.47432 157.85057 28774.95605
8.65000 -5107.00274 5.13964 260.82239 187.45998 215.11437 22973.95618
8.75000 -5068.84755 2.03913 840.73015 208.29311 178.07622 28361.14305
8.85000 -5035.66643 1.06423 -255.28146 171.25635 178.02632 24589.47178
8.95000 -4997.36221 5.96090 -67.59445 189.56355 175.48449 21577.58533
9.05000 -4955.32527 0.98774 -313.75014 165.98014 155.64787 22626.62136
9.15000 -4918.05870 0.10300 393.71104 166.33832 156.21312 25084.64005
9.25000 -4875.41310 2.06764 741.46945 169.52940 165.51629 27754.11917
9.35000 -4840.13964 2.75933 -66.54661 167.68607 146.05515 23843.84324
9.45000 -4804.92298 3.51497 -300.10985 168.84667 143.70334 20555.49588
9.55000 -4773.51169 5.42930 9.53870 158.12121 158.21014 19986.62931
9.65000 -4731.60859 0.96829 189.60076 164.11327 160.03882 18110.98314
9.75000 -4697.44898 2.67104 122.95940 142.09071 135.12816 20481.62069
9.85000 -4658.34265 3.92819 126.54562 168.55199 148.78483 18418.78251
9.95000 -4625.24016 3.18693 185.19482 150.14837 133.34626 19978.77569
10.05000 -4587.74625 0.06039 -179.16194 183.53631 139.13976 18793.10039
10.15000 -4556.98096 1.67218 316.21842 151.13290 151.94332 18347.40778
10.25000 -4512.19471 4.72057 102.02023 147.05940 148.09847 15804.21986
10.35000 -4479.84264 4.14420 -216.88831 137.83998 153.26769 14219.99183
10.45000 -4442.10504 2.77589 -65.20189 134.26407 134.09246 15931.91264
10.55000 -4405.42984 6.61831 284.26419 137.30556 132.20439 14812.63508
10.65000 -4366.23034 3.93836 -1043.04713 178.71456 143.70081 33290.43519
10.75000 -4330.01162 6.29795 53.84158 160.32369 134.96545 15208.90185
10.85000 -4292.50489 1.27254 49.39508 153.47796 120.57526 14765.94550
10.95000 -4257.24184 5.11732 237.50565 161.07176 117.73792 14616.91392
11.05000 -4225.21828 1.48737 117.98743 159.72871 137.44451 13784.91919
11.15000 -4191.90712 5.33363 -210.25678 171.66228 145.79090 14410.73591
11.25000 -4159.38661 2.49136 -34.47608 136.76613 120.05143 11321.98298
11.35000 -4128.81221 3.38042 477.33757 151.96654 143.82781 33868.15970
11.45000 -4097.09451 0.76664 -74.44028 130.38614 111.80129 10765.73648
11.55000 -4065.75138 3.04973 -510.52857 158.04401 105.02390 10629.82589
11.65000 -4032.06778 7.67874 -112.18939 143.28067 151.22349 9861.02267
11.75000 -4006.41015 1.14958 -624.66511 134.15449 119.56279 10945.97922
11.85000 -3974.41554 3.59938 -98.15398 126.60255 98.40743 10420.06728
11.95000 -3950.39866 3.66800 158.10388 143.09230 118.83378 12287.99236
12.05000 -3917.25453 2.32220 74.33654 155.29923 101.70897 10274.80372
12.15000 -3888.52125 4.31622 -595.48440 113.01847 96.73443 11454.68475
12.25000 -3864.01017 7.09530 45.21142 142.85660 159.05069 11265.48059
12.35000 -3836.10036 5.98472 92.67645 109.18978 95.41423 63459.05131
12.45000 -3805.41393 3.98042 396.37278 137.17615 112.39982 31599.78915
12.55000 -3783.15564 6.42672 -504.68563 109.14506 94.38656 9739.42495
12.65000 -3753.03936 8.02165 -110.75191 123.25444 98.20147 9421.55097
12.75000 -3728.50235 7.57019 -151.66593 133.93398 116.75392 8215.20160
12.85000 -3698.43829 8.16869 46.52621 101.87103 100.19641 9736.24412
12.95000 -3672.55361 12.88251 86.07336 120.31343 101.97315 7521.66270
13.05000 -3652.05617 12.32770 -238.41814 97.79709 109.71679 8284.92230
13.15000 -3626.43701 10.61341 -57.78953 124.08793 128.99873 8475.66166
13.25000 -3603.14195 8.94003 -88.60861 85.27661 82.05085 7350.33339
13.35000 -3579.53689 10.15264 -428.27456 84.21652 79.74998 6251.27191
13.45000 -3552.09722 5.97542 -296.82867 116.88360 148.84601 6886.61449
13.55000 -3530.89620 12.05292 -74.89798 75.24924 75.82229 6675.64266
13.65000 -3505.32000 7.76583 -448.02550 90.04984 94.55086 14546.93988
13.75000 -3477.50893 10.54624 -253.82563 98.19407 98.54226 6868.51437
13.85000 -3457.21109 11.49627 -40.68686 95.10559 78.75132 6293.94024
13.95000 -3429.38572 7.76846 -27.51084 85.87288 82.81027 6452.70567
14.05000 -3407.30644 9.80602 -298.45710 77.02604 70.98198 6031.48244
14.15000 -3381.19330 7.68596 -64.68784 98.30751 94.04812 7141.71141
14.25000 -3360.72385 8.75604 -140.97593 116.66171 94.44959 5300.23659
14.35000 -3334.75832 9.94490 -51.80865 85.54270 75.17035 7809.15236
14.45000 -3311.49465 10.93289 -198.21219 70.32045 64.47653 6880.47094
14.55000 -3287.67694 14.24675 -65.26073 69.80921 71.53303 6526.34664
14.65000 -3265.56064 10.78710 -288.29613 69.58857 65.44903 5280.73079
14.75000 -3242.71044 10.85435 -118.08562 82.12910 70.10670 5771.67302
14.85000 -3219.06556 7.45743 -168.94434 134.01170 95.42251 4575.29038
14.95000 -3198.19452 9.92027 -346.42836 63.05554 67.23431 5016.36597
15.05000 -3177.66853 9.09362 -98.55513 64.23540 68.34430 4777.62870
15.15000 -3154.10124 9.03716 -171.65096 100.65954 89.03570 4704.49912
15.25000 -3132.91489 5.93842 -54.85154 128.85692 131.90045 5044.41668
15.35000 -3113.67114 10.01438 -107.81201 70.43216 84.50009 5156.91802
15.45000 -3091.42401 8.10780 -137.82733 94.81937 66.02602 5851.14438
15.55000 -3070.61823 10.76549 -22.83887 74.50899 69.87072 4810.56419
15.65000 -3047.38264 6.68450 -90.73794 86.65872 74.64244 4030.29310
15.75000 -3027.31617 9.54308 123.47300 70.17358 73.73897 4351.71775
15.85000 -3006.40214 7.68591 -49.03711 105.88348 65.68552 5737.79313
15.95000 -2985.21577 6.30402 -281.57850 63.50945 61.19536 4461.00925
16.05000 -2963.29952 10.16985 -134.24130 81.11750 96.69244 4137.62690
16.15000 -2948.27390 9.33912 170.55675 65.88563 53.23048 4331.63434
16.25000 -2927.68250 5.04886 -112.28371 58.57194 65.41360 3253.81285
16.35000 -2909.40274 8.80572 -310.85553 54.03573 54.55657 3060.75593
16.45000 -2886.74972 9.55203 90.15052 54.81455 53.02183 3604.98764
16.55000 -2872.04594 4.89138 122.96220 60.62884 61.70593 3313.24518
16.65000 -2851.52642 7.24278 -279.92476 72.92939 63.84084 4930.11293
16.75000 -2832.22936 5.22377 56.71144 74.30669 73.47431 3366.37415
16.85000 -2813.02963 9.00837 -185.60807 73.22227 68.49847 3136.68968
16.95000 -2796.88931 8.32854 52.59374 64.68875 56.64677 3404.14978
17.05000 -2781.55994 7.36815 -113.74008 60.73098 65.10808 3361.88150
17.15000 -2760.61179 8.99391 -68.99005 97.85826 85.10851 3817.02584
17.25000 -2744.62491 2.70134 -44.06043 56.60782 59.77541 3787.30394
17.35000 -2726.79512 7.07233 -14.64831 52.28181 65.17267 3105.69397
17.45000 -2712.33311 6.86321 -61.98795 68.57941 69.10952 2908.91988
17.55000 -2691.58843 9.85814 27.82910 84.70810 78.88603 3594.09039
17.65000 -2682.71551 7.09726 -49.33882 46.84737 51.07476 3204.62936
17.75000 -2664.87678 8.16721 -19.52646 51.62890 56.49516 2414.13531
17.85000 -2645.65312 2.83085 -88.83315 84.59479 100.17248 2328.97447
17.95000 -2629.37295 3.25601 -203.21127 46.37274 43.49155 3213.52908
18.05000 -2615.57113 8.46036 -54.96459 59.52707 57.09274 2154.93270
18.15000 -2599.85074 8.99498 182.44084 58.38433 49.11745 3090.87215
18.25000 -2580.45546 7.43688 -69.90836 44.23200 49.85976 2637.69991
18.35000 -2564.95929 5.32303 7.59587 46.36055 41.65222 2131.37409
18.45000 -2549.89911 6.36956 -109.24116 43.76403 56.83365 2934.37792
18.55000 -2531.91664 8.24069 -71.61941 70.80341 56.39495 2600.84852
18.65000 -2518.30395 5.41379 -253.64110 43.48324 54.36215 2565.77663
18.75000 -2494.41617 9.84606 -128.76966 211.46905 59.27162 2358.05049
18.85000 -2488.35174 8.87732 33.10136 50.59372 49.89059 1815.37476
18.95000 -2474.10672 4.91488 -30.42531 64.91574 44.58025 2441.61935
19.05000 -2455.60629 10.27731 17.33266 49.98393 112.26702 2763.12937
19.15000 -2442.85860 4.96394 -15.15499 49.13886 49.22489 1972.42246
19.25000 -2428.82999 7.55155 -153.56731 39.78101 48.81680 2293.62778
19.35000 -2414.42173 4.84475 31.31705 59.44595 47.86426 1859.24642
19.45000 -2397.55971 7.71670 7.54061 44.68674 57.80338 1620.80993
19.55000 -2384.13466 4.02032 -93.69163 61.70242 63.45159 1948.23426
19.65000 -2369.47461 5.44926 73.20827 77.88079 97.12816 1392.08157
19.75000 -2357.33341 9.44772 -19.16163 44.67097 92.59685 1812.17373
19.85000 -2349.73834 7.42074 25.36346 63.50756 67.59384 1615.82392
19.95000 -2335.69296 3.45586 10.37017 29.54105 39.11827 1447.53109
