0.05000 4828.41153
0.15000 7136.85197
0.25000 10464.47268
0.35000 11824.68219
0.45000 12673.54634
0.55000 12751.45442
0.65000 12602.24155
0.75000 12232.98230
0.85000 11686.71645
0.95000 11244.24093
1.05000 10826.60865
1.15000 10314.17249
1.25000 9850.72161
1.35000 9205.92210
1.45000 8940.22454
1.55000 8536.90992
1.65000 8167.17853
1.75000 7903.74439
1.85000 7571.40531
1.95000 7112.59927
2.05000 6738.13683
2.15000 6570.15268
2.25000 6158.46792
2.35000 6018.12563
2.45000 5947.55027
2.55000 5604.06135
2.65000 5479.63358
2.75000 5276.13847
2.85000 5098.15406
2.95000 4971.62015
3.05000 4711.71312
3.15000 4585.91295
3.25000 4506.69991
3.35000 4339.67722
3.45000 4133.51300
3.55000 4130.68892
3.65000 3966.35423
3.75000 3824.27586
3.85000 3676.80709
3.95000 3657.91455
4.05000 3472.87484
4.15000 3383.82145
4.25000 3128.83249
4.35000 3192.45070
4.45000 3139.25447
4.55000 2882.69635
4.65000 2827.84593
4.75000 2673.70754
4.85000 2634.97764
4.95000 2388.61967
5.05000 2373.20585
5.15000 2238.13504
5.25000 2235.58060
5.35000 2104.85875
5.45000 2005.83127
5.55000 1823.01652
5.65000 1824.13842
5.75000 1775.43377
5.85000 1680.02915
5.95000 1670.12367
6.05000 1598.93830
6.15000 1550.34167
6.25000 1495.61455
6.35000 1465.97371
6.45000 1470.75502
6.55000 1446.00802
6.65000 1403.64817
6.75000 1326.00813
6.85000 1328.72234
6.95000 1289.27211
7.05000 1242.89707
7.15000 1231.86877
7.25000 1201.33484
7.35000 1153.25683
7.45000 1150.92465
7.55000 1104.27261
7.65000 1027.83278
7.75000 1013.72580
7.85000 1012.75770
7.95000 1010.95795
8.05000 981.37853
8.15000 932.60924
8.25000 924.01407
8.35000 916.77107
8.45000 868.31231
8.55000 866.88343
8.65000 825.39946
8.75000 842.38414
8.85000 811.91909
8.95000 772.27815
9.05000 758.79460
9.15000 731.19857
9.25000 700.96401
9.35000 704.00692
9.45000 683.51256
9.55000 658.85523
9.65000 700.34783
9.75000 632.88808
9.85000 655.97723
9.95000 629.99114
10.05000 638.04945
10.15000 621.57296
10.25000 577.18744
10.35000 587.00789
10.45000 572.87930
10.55000 551.22887
10.65000 568.45760
10.75000 567.85797
10.85000 538.68777
10.95000 531.20853
11.05000 524.52637
11.15000 498.17362
11.25000 501.14700
11.35000 472.87107
11.45000 460.64710
11.55000 460.21849
11.65000 463.05574
11.75000 458.57724
11.85000 451.01352
11.95000 462.95240
12.05000 425.99606
12.15000 418.15805
12.25000 428.48339
12.35000 417.85624
12.45000 421.54354
12.55000 410.81473
12.65000 381.78718
12.75000 390.10890
12.85000 383.68227
12.95000 386.16105
13.05000 379.58245
13.15000 380.09734
13.25000 368.37754
13.35000 370.80819
13.45000 352.61041
13.55000 345.00086
13.65000 327.51389
13.75000 330.11521
13.85000 336.54485
13.95000 327.46215
14.05000 327.09179
14.15000 299.05594
14.25000 320.21325
14.35000 305.59461
14.45000 310.46066
14.55000 293.80099
14.65000 284.96870
14.75000 300.06967
14.85000 284.12521
14.95000 276.75181
15.05000 277.45505
15.15000 266.43743
15.25000 298.50720
15.35000 268.79269
15.45000 251.84899
15.55000 242.48491
15.65000 245.38903
15.75000 252.71416
15.85000 236.13977
15.95000 232.24734
16.05000 214.85662
16.15000 230.45124
16.25000 225.87143
16.35000 215.11239
16.45000 204.31463
16.55000 213.11187
16.65000 195.95656
16.75000 207.56999
16.85000 201.38005
16.95000 209.18635
17.05000 201.50786
17.15000 202.27916
17.25000 182.75802
17.35000 182.35735
17.45000 218.94736
17.55000 186.65700
17.65000 174.74142
17.75000 170.70325
17.85000 161.29767
17.95000 160.29964
18.05000 163.35500
18.15000 146.96888
18.25000 172.22956
18.35000 159.14303
18.45000 154.29291
18.55000 148.78027
18.65000 143.03246
18.75000 172.56426
18.85000 144.50855
18.95000 141.87774
19.05000 134.72934
19.15000 132.32299
19.25000 152.98813
19.35000 148.87640
19.45000 134.41753
19.55000 129.37378
19.65000 138.06688
19.75000 128.41369
19.85000 136.95608
19.95000 126.41403
