0.1875 2.78949 13.1472 0.45022 137.86545 135.56343 123.33816
0.5625 1.18851 36.37143 1.68466 134.92656 126.39858 110.479
0.9375 -0.17496 57.50902 -1.1053 129.64647 113.52668 101.84319
1.3125 -0.79344 70.39729 -0.08917 125.69993 104.89288 93.16146
1.6875 -0.45726 78.54635 -0.699 122.18745 98.54301 88.16011
2.0625 -1.11196 86.48336 0.04194 117.06373 93.05944 83.07282
2.4375 -1.8999 91.40524 0.9427 113.12857 87.22364 78.44022
2.8125 -1.74505 97.35108 -0.88609 107.22803 82.96043 74.55857
3.1875 -0.45358 102.05832 1.54409 101.78258 80.26946 71.1964
3.5625 -1.59824 105.52369 1.39959 96.49791 77.76256 68.3031
3.9375 -0.6695 111.73716 1.26456 93.01599 74.91187 66.12103
4.3125 0.26727 117.67432 0.61145 87.55429 72.36307 62.56091
4.6875 -2.25299 127.46216 1.1685 81.29012 69.95777 60.24353
5.0625 0.1477 134.28098 -1.25513 77.58784 68.3026 57.14864
5.4375 -0.66851 144.5012 0.0001 71.90771 66.69657 52.03909
5.8125 1.34558 153.53775 -0.28018 65.22741 63.3876 50.16064
6.1875 1.28184 164.77904 -1.45246 60.20636 59.85974 45.92969
6.5625 2.95865 175.33264 -1.327 55.10735 54.72512 41.82311
6.9375 2.2488 181.84141 -2.03341 50.37288 50.67026 37.46711
7.3125 1.63902 185.92477 -1.47732 47.13642 45.45932 35.37078
7.6875 0.50512 189.08897 -1.26857 43.56944 40.32508 32.83356
8.0625 -0.13809 193.44643 -1.63079 40.42716 37.12744 31.40416
8.4375 0.26523 197.19483 -0.45938 38.56984 33.65277 30.25391
8.8125 -0.28382 201.09985 -0.21187 37.43588 31.02853 28.86681
9.1875 -0.46219 203.38191 -0.46785 36.49619 29.34368 27.10348
9.5625 -0.10728 204.26424 -0.19631 35.0241 27.18644 26.48086
9.9375 0.545 205.70418 0.73592 34.24539 26.89605 25.14399
10.3125 -0.03676 206.64464 1.53632 33.70328 24.73633 24.43298
10.6875 0.75122 205.84094 1.18613 32.81746 24.11192 23.80284
11.0625 0.74685 205.53295 1.15369 32.06663 23.99195 23.40678
11.4375 0.84114 206.74764 0.77922 30.1742 23.59554 21.98938
11.8125 -0.07074 207.31072 1.80403 29.28153 22.85766 21.93604
12.1875 -0.83107 207.83157 2.3198 28.59042 22.77645 21.31949
12.5625 0.48973 208.09177 1.2841 27.34231 22.31103 20.38809
12.9375 0.89421 208.97049 1.43092 27.90489 21.78282 20.14925
13.3125 0.98186 210.80009 1.92342 26.82741 20.71892 19.79037
13.6875 -0.18048 210.41063 1.10857 26.16722 19.70087 19.34152
14.0625 1.1036 210.73146 0.31579 25.47475 19.94084 18.80969
14.4375 0.44393 211.83861 -0.19234 25.22796 20.06267 18.77483
14.8125 0.25155 212.31218 -0.85299 24.38793 18.92198 17.96008
15.1875 -1.3645 211.84124 -2.08152 24.51683 17.92623 18.31686
15.5625 1.08692 212.13223 -0.82042 24.48644 16.81408 18.18345
15.9375 -0.4094 211.67224 -2.00279 24.66681 15.65965 17.86854
16.3125 -0.88007 210.28141 -1.49188 24.3053 15.85093 16.65326
16.6875 -1.31804 209.83582 -1.05976 22.8036 15.39518 16.6952
17.0625 -0.37758 210.14329 -1.77337 22.7773 13.82054 16.56538
17.4375 -0.13039 209.17672 -0.68528 22.93569 13.76022 15.94522
17.8125 -0.08725 207.45247 -1.34493 22.00283 13.91702 16.26167
18.1875 1.47405 206.66701 -1.17717 21.60982 15.20896 15.4927
18.5625 0.30015 206.35633 -0.00759 20.28708 14.85189 14.5243
18.9375 0.43463 205.4159 -0.27812 19.37614 15.13014 15.01961
19.3125 0.47095 206.15173 1.03541 19.32645 15.70938 14.20314
19.6875 1.06155 205.66686 0.84696 18.93499 15.22602 14.69258
20.0625 0.87615 207.52048 0.11368 18.28997 15.00157 14.23506
20.4375 1.61977 207.25429 0.59708 17.17634 13.64006 12.30073
20.8125 0.27633 207.60551 0.70784 17.39798 13.50214 13.05018
21.1875 0.94198 208.23366 0.57277 16.95528 12.88009 12.74279
21.5625 0.5404 206.93436 -0.1731 16.99219 13.47155 12.53757
21.9375 3.0725 208.40324 -1.55521 16.68075 12.71642 12.26461
22.3125 2.89891 207.58738 0.34266 16.03274 12.96951 10.91516
22.6875 2.49594 207.6161 -0.24235 15.84179 11.19983 11.18323
23.0625 1.64883 209.20152 -0.1637 16.39331 11.48358 9.80293
23.4375 1.31473 206.72052 -0.35853 15.89784 11.44882 11.26788
23.8125 2.42312 207.49596 -0.54069 15.55718 9.95563 10.22676
24.1875 0.57573 205.53883 0.57808 15.77238 9.78966 10.44285
24.5625 1.04338 205.17623 0.11392 15.98188 9.69837 9.32615
24.9375 1.4007 205.91365 0.48946 13.52985 10.10965 9.90923
25.3125 0.38146 206.34893 -0.85993 15.28211 10.54093 9.11256
25.6875 -0.50229 206.80256 -0.4655 13.66658 10.12173 10.66812
26.0625 -1.79829 207.19547 -1.33497 12.86884 9.80869 9.70453
26.4375 -1.92808 205.44503 0.05656 14.58913 9.7393 11.15249
26.8125 -0.71176 205.5512 0.07929 12.91228 8.75353 10.05868
27.1875 2.42609 205.48925 -1.09704 13.43511 8.67676 10.29206
27.5625 0.33046 206.47886 -0.27662 12.42867 8.70314 9.42086
27.9375 -1.76087 204.22659 -2.3918 11.09451 9.01212 10.96168
28.3125 1.71582 202.61168 -1.35947 10.92654 8.58353 9.76568
28.6875 0.32298 205.27911 0.58836 10.87655 9.13535 9.73937
29.0625 1.85573 206.00218 -0.23318 11.22311 8.83698 9.34012
29.4375 0.66966 204.10529 -0.19341 12.52238 8.00726 10.62561
29.8125 1.82064 203.50485 -1.0387 12.34921 6.58207 8.7288
