0.05000 11949.11469
0.15000 23526.86083
0.25000 25975.23838
0.35000 25594.99999
0.45000 23499.97163
0.55000 21766.70350
0.65000 20187.81090
0.75000 18655.57539
0.85000 17105.71572
0.95000 15368.16293
1.05000 14429.59366
1.15000 13540.20364
1.25000 12405.28885
1.35000 11732.64801
1.45000 11022.23618
1.55000 10340.68118
1.65000 9557.48435
1.75000 9143.67453
1.85000 8736.22893
1.95000 8343.78175
2.05000 7921.44955
2.15000 7298.80482
2.25000 7006.27393
2.35000 6817.86926
2.45000 6378.47817
2.55000 6282.89725
2.65000 5954.51279
2.75000 5667.66730
2.85000 5561.23436
2.95000 5401.05477
3.05000 5101.97470
3.15000 4942.79152
3.25000 4847.49639
3.35000 4717.04187
3.45000 4573.28152
3.55000 4357.43205
3.65000 4213.15721
3.75000 4033.91302
3.85000 3932.45896
3.95000 3874.02907
4.05000 3689.66288
4.15000 3632.56554
4.25000 3547.75703
4.35000 3384.19476
4.45000 3367.23083
4.55000 3284.68503
4.65000 3187.01353
4.75000 3014.58118
4.85000 3043.06992
4.95000 2876.68933
5.05000 2838.34341
5.15000 2696.16565
5.25000 2729.05679
5.35000 2631.34841
5.45000 2529.84945
5.55000 2436.53156
5.65000 2456.64717
5.75000 2369.19502
5.85000 2330.16297
5.95000 2292.55557
6.05000 2140.83501
6.15000 2062.26885
6.25000 2104.86711
6.35000 1994.55409
6.45000 1814.76576
6.55000 1874.46073
6.65000 1737.79189
6.75000 1730.44963
6.85000 1665.01586
6.95000 1641.83594
7.05000 1513.62231
7.15000 1497.23340
7.25000 1431.60891
7.35000 1412.47098
7.45000 1370.37853
7.55000 1358.80163
7.65000 1318.45900
7.75000 1271.90472
7.85000 1202.31436
7.95000 1209.67607
8.05000 1146.40897
8.15000 1092.34456
8.25000 1090.36299
8.35000 1059.08248
8.45000 1057.30842
8.55000 976.18916
8.65000 931.63161
8.75000 871.56917
8.85000 878.87415
8.95000 844.37178
9.05000 811.31286
9.15000 847.62958
9.25000 817.39383
9.35000 787.08587
9.45000 760.46603
9.55000 729.33990
9.65000 739.92944
9.75000 716.99072
9.85000 660.61935
9.95000 676.30176
10.05000 639.08433
10.15000 655.54747
10.25000 640.38845
10.35000 627.15238
10.45000 611.56423
10.55000 605.76126
10.65000 593.57502
10.75000 576.69879
10.85000 562.39115
10.95000 553.61221
11.05000 550.02938
11.15000 532.33664
11.25000 564.30207
11.35000 493.26807
11.45000 502.37172
11.55000 487.97738
11.65000 474.90784
11.75000 473.99230
11.85000 450.38265
11.95000 450.54824
12.05000 486.94197
12.15000 444.60613
12.25000 429.40038
12.35000 408.83037
12.45000 466.47259
12.55000 396.11441
12.65000 393.32483
12.75000 379.81008
12.85000 382.88601
12.95000 382.36335
13.05000 381.96485
13.15000 372.28337
13.25000 362.82299
13.35000 370.59644
13.45000 353.40175
13.55000 364.48189
13.65000 326.81591
13.75000 345.27514
13.85000 342.04987
13.95000 308.95358
14.05000 353.05527
14.15000 328.24905
14.25000 327.91823
14.35000 322.78110
14.45000 332.51023
14.55000 305.98717
14.65000 286.86294
14.75000 285.18031
14.85000 288.11853
14.95000 294.17057
15.05000 282.79475
15.15000 294.92395
15.25000 294.41213
15.35000 269.41785
15.45000 295.74663
15.55000 251.77756
15.65000 238.06779
15.75000 272.90655
15.85000 256.28740
15.95000 255.48096
16.05000 235.23735
16.15000 243.92539
16.25000 239.23371
16.35000 235.78891
16.45000 255.49283
16.55000 217.42631
16.65000 224.02081
16.75000 211.64413
16.85000 229.23318
16.95000 206.11085
17.05000 216.57523
17.15000 228.26549
17.25000 224.72014
17.35000 217.31547
17.45000 218.78873
17.55000 198.90283
17.65000 197.71324
17.75000 186.57105
17.85000 190.59615
17.95000 185.10005
18.05000 210.53087
18.15000 185.50909
18.25000 174.42567
18.35000 186.85346
18.45000 190.07534
18.55000 180.90100
18.65000 168.02260
18.75000 173.42589
18.85000 167.84980
18.95000 158.35246
19.05000 162.65773
19.15000 178.22673
19.25000 158.79886
19.35000 155.11977
19.45000 162.60835
19.55000 150.70075
19.65000 161.53611
19.75000 150.62402
19.85000 154.79520
19.95000 157.59860
