0.05000 60068.84337
0.15000 158563.10206
0.25000 120084.02935
0.35000 69692.76870
0.45000 49390.25338
0.55000 38036.36577
0.65000 31283.55382
0.75000 26017.45877
0.85000 22620.80258
0.95000 19597.90775
1.05000 17253.15574
1.15000 15673.39674
1.25000 13864.97886
1.35000 12785.17840
1.45000 11304.75153
1.55000 10643.53801
1.65000 9659.37298
1.75000 8849.92749
1.85000 8330.97680
1.95000 7471.50224
2.05000 7237.49497
2.15000 6719.58056
2.25000 6294.14993
2.35000 5780.91709
2.45000 5484.99882
2.55000 5256.94771
2.65000 4898.31869
2.75000 4662.27280
2.85000 4498.24906
2.95000 4287.24468
3.05000 4036.55304
3.15000 3776.38729
3.25000 3661.00991
3.35000 3508.98527
3.45000 3371.92853
3.55000 3160.73361
3.65000 3046.49148
3.75000 2892.66878
3.85000 2777.00556
3.95000 2738.78890
4.05000 2674.05848
4.15000 2571.24843
4.25000 2504.35819
4.35000 2357.69854
4.45000 2290.64254
4.55000 2216.77781
4.65000 2128.48602
4.75000 2073.73945
4.85000 2024.47762
4.95000 1921.75428
5.05000 1860.98815
5.15000 1769.31276
5.25000 1730.56022
5.35000 1690.12709
5.45000 1668.35946
5.55000 1577.28496
5.65000 1568.98686
5.75000 1495.13935
5.85000 1451.36744
5.95000 1467.59363
6.05000 1390.66832
6.15000 1315.19581
6.25000 1359.29604
6.35000 1231.19318
6.45000 1281.17122
6.55000 1162.45537
6.65000 1148.21392
6.75000 1129.91040
6.85000 1107.70373
6.95000 1085.21813
7.05000 1052.05415
7.15000 1056.07193
7.25000 1018.06422
7.35000 983.12048
7.45000 963.54777
7.55000 938.95178
7.65000 953.90286
7.75000 885.38934
7.85000 884.72458
7.95000 891.51032
8.05000 866.98838
8.15000 815.01966
8.25000 864.80063
8.35000 795.44675
8.45000 787.87035
8.55000 776.41540
8.65000 743.41981
8.75000 756.01638
8.85000 726.90381
8.95000 749.15301
9.05000 690.61665
9.15000 676.86586
9.25000 654.65589
9.35000 642.42995
9.45000 642.03356
9.55000 625.10373
9.65000 594.32571
9.75000 590.35812
9.85000 603.46857
9.95000 586.78897
10.05000 557.18023
10.15000 545.79834
10.25000 554.84072
10.35000 538.46558
10.45000 529.04324
10.55000 522.72027
10.65000 478.57728
10.75000 476.08233
10.85000 495.51236
10.95000 483.37076
11.05000 458.39874
11.15000 437.06671
11.25000 423.60494
11.35000 413.81819
11.45000 440.46076
11.55000 414.73237
11.65000 406.84866
11.75000 414.23324
11.85000 350.83204
11.95000 351.86265
12.05000 357.36452
12.15000 358.32479
12.25000 351.78604
12.35000 342.64880
12.45000 354.89497
12.55000 327.61171
12.65000 323.20763
12.75000 336.67828
12.85000 330.65190
12.95000 299.56898
13.05000 298.88621
13.15000 302.68150
13.25000 293.26446
13.35000 297.69243
13.45000 281.77074
13.55000 299.75032
13.65000 293.60056
13.75000 291.03248
13.85000 270.14773
13.95000 241.94495
14.05000 282.26637
14.15000 221.70017
14.25000 241.27646
14.35000 245.50867
14.45000 244.79482
14.55000 268.05860
14.65000 257.65203
14.75000 234.03484
14.85000 216.91474
14.95000 241.53364
15.05000 228.98250
15.15000 216.16113
15.25000 225.07745
15.35000 229.68307
15.45000 218.51292
15.55000 220.81469
15.65000 210.03719
15.75000 213.89533
15.85000 208.44389
15.95000 223.69354
16.05000 221.37489
16.15000 205.45680
16.25000 219.03817
16.35000 188.22934
16.45000 194.31283
16.55000 184.46666
16.65000 202.68741
16.75000 207.31154
16.85000 191.41921
16.95000 185.12491
17.05000 190.91193
17.15000 192.47001
17.25000 190.52398
17.35000 194.61679
17.45000 174.33704
17.55000 179.13827
17.65000 178.96815
17.75000 147.58042
17.85000 175.62924
17.95000 152.87555
18.05000 138.68348
18.15000 149.63521
18.25000 147.23902
18.35000 151.58072
18.45000 143.88929
18.55000 134.17065
18.65000 154.77504
18.75000 133.67748
18.85000 142.28453
18.95000 152.92123
19.05000 125.84772
19.15000 124.55824
19.25000 139.26886
19.35000 182.75562
19.45000 145.04828
19.55000 145.38818
19.65000 107.70702
19.75000 142.29916
19.85000 188.39384
19.95000 134.76858
