0.12500 0.01008
0.37500 0.05084
0.62500 0.10265
0.87500 0.12890
1.12500 0.19579
1.37500 0.24699
1.62500 0.29988
1.87500 0.33810
2.12500 0.36534
2.37500 0.37106
2.62500 0.38369
2.87500 0.35964
3.12500 0.34419
3.37500 0.32721
3.62500 0.29807
3.87500 0.27829
4.12500 0.25957
4.37500 0.24513
4.62500 0.21846
4.87500 0.21280
5.12500 0.17253
5.37500 0.15839
5.62500 0.13876
5.87500 0.11617
6.12500 0.11043
6.37500 0.10642
6.62500 0.10833
6.87500 0.10441
7.12500 0.10731
7.37500 0.10471
7.62500 0.08938
7.87500 0.10542
8.12500 0.11084
8.37500 0.09720
8.62500 0.09585
8.87500 0.10194
9.12500 0.09512
9.37500 0.09696
9.62500 0.05875
9.87500 0.05506
10.12500 0.04333
10.37500 0.05345
10.62500 0.04757
10.87500 0.05794
11.12500 0.06602
11.37500 0.06947
11.62500 0.05141
11.87500 0.04771
12.12500 0.05402
12.37500 0.02843
12.62500 0.01850
12.87500 0.01115
13.12500 0.03020
13.37500 0.03092
13.62500 0.05390
13.87500 0.03307
14.12500 0.03287
14.37500 0.04425
14.62500 0.05287
14.87500 0.03558
