0.120000 -2.198890
0.380000 1.919710
0.620000 0.412780
0.880000 -1.878520
1.120000 -1.295880
1.380000 -1.370810
1.620000 -1.158300
1.880000 -1.317460
2.120000 -1.342500
2.380000 -1.587870
2.620000 -1.758080
2.880000 -1.867800
3.120000 -1.889090
3.380000 -2.113380
3.620000 -2.235340
3.880000 -2.446430
4.120000 -2.575890
4.380000 -2.650490
4.620000 -2.847250
4.880000 -3.120590
5.120000 3.035450
5.380000 2.758960
5.620000 2.410220
5.880000 2.491930
6.120000 2.286250
6.380000 1.782670
6.620000 0.247430
6.880000 -2.275040
7.120000 -2.352630
7.380000 -2.021490
7.620000 -2.454690
7.880000 -2.016070
8.120000 -2.295470
8.380000 -2.341240
8.620000 -2.813500
8.880000 -2.374320
9.120000 -1.942670
9.380000 2.872620
9.620000 3.099350
9.880000 3.022940
10.120000 -2.949060
10.380000 2.723620
10.620000 3.038300
10.880000 -2.556000
11.120000 -2.624570
11.380000 -2.876950
11.620000 2.812250
11.880000 -2.866510
12.120000 2.429850
12.380000 2.028600
12.620000 1.805970
12.880000 2.006790
13.120000 1.781260
13.380000 1.820850
13.620000 0.376660
13.880000 -0.164840
14.120000 -2.835290
14.380000 0.802680
14.620000 -1.807450
14.880000 1.041650
