0.1875 1.09291 20.38622 0.06238 116.03971 112.88216 102.76661
0.5625 -0.92919 42.94791 0.59434 107.66415 100.67273 91.59351
0.9375 0.42939 62.05502 -0.49396 99.3441 89.12011 80.01937
1.3125 -0.32786 77.31027 -0.04887 92.71752 81.27177 73.24671
1.6875 0.16645 88.21584 -0.5949 85.17145 75.64934 68.04685
2.0625 -0.43563 101.28352 1.22646 78.11494 72.22505 64.2124
2.4375 0.00263 115.42651 0.83641 73.48671 68.93566 60.40882
2.8125 0.79007 128.47364 0.57787 68.50245 63.75664 56.25996
3.1875 0.88637 141.92874 -0.90398 63.99799 58.68397 51.39763
3.5625 0.8088 152.27828 -0.33672 58.34413 53.5276 47.33103
3.9375 -0.14201 161.71658 -1.16644 53.40622 46.67979 44.30914
4.3125 -0.70258 165.70115 -0.44221 50.19006 43.4274 41.65371
4.6875 -1.0336 171.22855 -0.81101 46.46439 41.15724 38.56774
5.0625 -1.10813 176.93615 -0.32955 44.59514 37.50415 36.41332
5.4375 -0.01494 180.14498 -1.0401 42.56423 35.51273 34.4034
5.8125 0.80345 183.628 -1.10732 41.22847 34.29847 32.55563
6.1875 1.38428 186.84407 -1.22677 39.3743 32.5728 31.26374
6.5625 1.73246 188.90528 -0.57953 38.32044 31.61848 29.65872
6.9375 3.07672 191.72991 0.00185 36.58911 30.52528 28.42839
7.3125 1.24057 193.02533 0.37192 36.33055 29.41449 27.18774
7.6875 1.27389 195.55447 0.7094 34.61985 28.76141 26.16039
8.0625 0.81639 197.36233 1.07261 33.31562 27.29957 25.46477
8.4375 -0.03984 199.66369 1.24925 32.16884 26.13141 24.02468
8.8125 -0.48999 201.11636 1.93122 30.41786 25.69554 23.14942
9.1875 -1.36035 203.54742 1.57149 29.41914 22.8085 21.91095
9.5625 -1.2043 204.19264 1.33972 29.1344 22.23646 21.32402
9.9375 -0.473 205.15832 1.8174 28.43918 20.86935 21.32476
10.3125 0.78952 204.84625 2.70043 27.69789 20.2821 20.98886
10.6875 0.22821 204.89279 2.88112 27.07687 19.18049 20.05296
11.0625 -0.15299 204.52517 2.02091 26.54066 19.20078 19.44667
11.4375 -0.30929 203.36736 2.12428 24.77018 19.07315 19.12489
11.8125 0.20193 203.67726 1.34685 23.75872 18.57308 18.70636
12.1875 0.13704 203.9297 -0.47798 23.39337 17.71747 17.92189
12.5625 0.19234 205.05509 -1.0107 22.99443 17.05252 17.56775
12.9375 0.42429 204.45474 -1.24909 22.14422 17.08934 17.07576
13.3125 -1.37643 205.32525 -1.15028 20.67403 16.26445 16.12128
13.6875 -0.78975 207.05009 -0.86386 20.18878 15.61589 15.18061
14.0625 0.55499 207.24907 -0.50654 19.55975 15.18749 14.86599
14.4375 2.30915 206.93715 -0.32299 19.9699 14.31245 14.66024
14.8125 1.80263 206.90432 -0.94233 19.17619 14.14425 14.0676
15.1875 1.40582 206.2655 -1.18274 19.91334 13.8062 14.11409
15.5625 1.42769 206.03013 -0.15888 17.89137 13.67232 14.51563
15.9375 3.24307 206.22428 -1.01175 18.01299 12.20861 13.5466
16.3125 1.332 205.68972 -1.87077 16.7094 13.05689 13.58592
16.6875 1.61215 206.51296 -2.15304 16.81672 12.57859 13.9419
17.0625 2.24226 205.52303 -0.32023 15.86936 12.41249 13.80033
17.4375 0.89157 207.08247 -2.40635 14.89272 11.47888 13.39926
17.8125 -0.42488 207.72675 -1.15678 14.50615 11.26699 13.06072
18.1875 2.15777 207.14663 -1.48814 14.38861 11.04681 13.13884
18.5625 0.53492 208.3379 -0.30556 13.84622 10.16549 12.27107
18.9375 1.69898 207.62877 -0.37742 13.26272 9.49418 12.00163
19.3125 2.03418 207.02632 0.41685 13.15258 9.90337 10.931
19.6875 -0.31993 207.15219 -1.8748 13.5421 9.78918 10.80693
20.0625 -0.04537 205.45984 -0.04057 13.44204 10.57745 9.90391
20.4375 1.32234 206.38865 -3.2176 11.86637 10.5929 9.8321
20.8125 -0.22427 207.13874 -1.6665 12.51692 9.82234 9.20483
21.1875 -1.57813 208.52345 -1.54853 11.75547 7.7845 8.05698
21.5625 -1.77487 206.48243 -1.39045 10.31548 7.59447 7.8419
21.9375 -4.04013 206.78225 -2.64701 11.79957 7.44645 7.82808
22.3125 -3.79619 206.76671 -2.20691 9.73983 7.03653 7.41109
22.6875 -0.56813 206.45161 -3.82756 12.55899 6.84834 9.00631
23.0625 -2.37184 206.78552 -2.70604 11.51678 5.99531 6.80918
23.4375 -1.89065 204.67047 -2.32877 9.49739 6.32892 6.72208
23.8125 -1.13036 203.2439 -2.94949 9.16833 8.08586 6.84488
24.1875 1.87114 204.52955 -5.64886 12.10021 6.34061 7.47574
24.5625 1.97651 205.29165 -4.30221 10.24148 6.61717 6.26132
24.9375 1.3676 204.75096 -6.29981 10.58625 7.56472 5.62234
25.3125 -0.53072 203.15733 -4.64372 9.91339 7.4122 6.55138
25.6875 -2.57416 204.85293 -4.47055 9.21096 8.01745 7.55497
26.0625 -0.53902 204.41918 -2.08687 8.1543 6.99005 5.27002
26.4375 -2.01475 205.48795 0.06874 9.98461 6.61979 7.13166
26.8125 -2.10348 200.56008 -3.05636 11.05819 8.11031 6.52592
27.1875 -5.74183 204.70074 1.03175 10.17306 6.50945 5.48944
27.5625 -1.7738 204.56214 0.98913 8.43647 5.61482 5.73948
27.9375 0.12252 200.56175 -1.72582 8.44427 5.4146 5.30668
28.3125 -0.16106 199.89894 0.29377 6.03374 6.49336 4.96104
28.6875 -0.88379 200.69512 -2.39252 9.39407 6.36332 4.1084
29.0625 -3.93101 203.786 -0.08999 8.14984 5.94909 5.98392
29.4375 -1.31342 203.99936 2.00038 8.25937 5.6037 5.35822
29.8125 -0.44428 202.36611 -2.02872 7.49308 9.97729 3.20122
