0.05000 -6212.91525 -461.23434 -135823.06295 7242.79176 7078.16772 1390186.00287
0.15000 -11069.67880 -49.56959 -36155.50126 5574.36978 7156.54581 1443285.45949
0.25000 -14935.38289 231.94779 -10479.97191 4451.40245 6519.65077 1431687.24833
0.35000 -17948.20084 113.94236 -18673.74845 3323.91452 5843.73813 1492271.43833
0.45000 -19099.92776 19.57720 -17588.26113 3154.07457 5098.83332 1386976.02445
0.55000 -19224.66892 -2.50584 -2875.09586 3058.83865 4727.07349 1330684.06277
0.65000 -19131.15586 7.94842 8085.62454 3039.08311 4551.19869 1315975.68841
0.75000 -18952.91722 103.36378 -10519.81873 2838.46243 4398.29583 1309634.63654
0.85000 -18455.22809 73.56893 6514.09594 2632.77490 4367.34326 1284166.73981
0.95000 -17978.91630 122.89641 -410.65962 2435.61682 4236.65617 1181778.41897
1.05000 -17578.47725 57.77316 -7553.27856 2217.99506 4122.39549 1209390.39384
1.15000 -17087.94500 71.06466 1373.08431 1991.97884 4106.78905 1065334.73955
1.25000 -16545.10406 92.86699 3244.16373 1826.24503 3941.22877 1091307.25325
1.35000 -16070.41463 92.71277 -6714.20273 1582.29428 3870.23270 964709.30521
1.45000 -15642.41494 33.10999 6452.76439 1458.67773 3746.55348 927036.94331
1.55000 -15225.59151 102.99069 -258.42808 1323.68916 3636.54425 865571.56665
1.65000 -14770.11550 9.50817 -4468.16824 1194.50857 3515.05654 828006.28280
1.75000 -14342.45454 55.31675 -4684.95176 1135.42325 3421.25493 781272.05490
1.85000 -13942.85371 11.57604 2207.01787 1048.45850 3288.90051 737218.07611
1.95000 -13603.52322 48.83911 -1251.56648 927.83095 3215.45786 746537.94234
2.05000 -13320.60856 16.47755 12331.96432 871.16600 3085.55799 705587.81727
2.15000 -13046.30012 4.59101 -6034.82804 846.24974 2993.99497 639505.42655
2.25000 -12752.44544 2.74179 2169.26345 758.34838 2859.54174 621352.23834
2.35000 -12475.99318 75.06171 6117.89357 780.25554 2798.97003 601946.23683
2.45000 -12188.57133 47.87032 17114.25349 695.72221 2668.61943 582742.82490
2.55000 -11926.28941 52.17784 8417.91775 727.63481 2612.47014 537947.77732
2.65000 -11690.09281 30.01865 -3624.97964 691.35615 2505.12893 502140.89273
2.75000 -11442.62477 19.96657 -3657.49579 685.80108 2443.46318 483853.64125
2.85000 -11211.91220 26.01931 5782.55752 658.32845 2357.81274 472377.73717
2.95000 -10986.88205 -13.90395 5508.24696 663.73049 2258.62925 439604.03790
3.05000 -10790.04952 13.54780 -3731.71253 665.31698 2174.62301 434986.15939
3.15000 -10586.00571 10.81578 -503.73255 597.38915 2117.16573 406071.29234
3.25000 -10356.40950 -11.13433 3694.44117 594.37419 2046.32101 392967.91583
3.35000 -10168.70925 -34.84360 1252.97191 697.08901 1989.78282 375445.24864
3.45000 -9977.84769 38.54511 1567.26293 638.37921 1901.43364 349421.23698
3.55000 -9813.67400 35.32489 -1010.46839 632.48452 1823.60131 332904.79103
3.65000 -9627.89622 32.63917 -5106.23471 666.60375 1769.31850 328494.28755
3.75000 -9437.48208 44.31716 592.24210 577.16141 1727.98583 316629.30170
3.85000 -9298.12548 7.57898 184.33807 687.40373 1653.88755 299587.34796
3.95000 -9119.65047 11.69817 -3909.27555 637.48400 1591.99945 291822.55886
4.05000 -8978.00290 30.12733 -1390.61382 694.51911 1550.34618 272090.28416
4.15000 -8789.53674 1.58558 1434.25333 665.55048 1508.79862 277911.24579
4.25000 -8674.44051 33.96819 3507.09434 656.38311 1448.80569 244344.76739
4.35000 -8533.20719 34.22309 853.59264 708.66567 1427.92710 256324.28100
4.45000 -8374.27774 16.58756 5352.90173 623.58925 1328.90820 233246.81471
4.55000 -8215.13375 21.61909 -6296.38341 594.81646 1320.72869 243169.55765
4.65000 -8066.96889 23.60179 433.09298 573.23108 1236.94267 229168.68210
4.75000 -7924.72253 59.61216 3287.51072 572.33321 1181.71131 210424.81668
4.85000 -7802.68455 16.62454 4187.71925 549.63713 1191.13633 203838.91651
4.95000 -7676.86020 17.96905 -1911.54099 658.94289 1133.86477 202285.16426
5.05000 -7553.88145 19.74294 2313.78662 558.01377 1079.35051 196218.60956
5.15000 -7427.84722 13.93706 -5272.39766 573.50201 1033.73202 185786.66083
5.25000 -7310.58362 29.56257 2100.71536 540.65662 994.29197 172855.79254
5.35000 -7178.61669 -3.29143 298.81074 564.29792 963.98793 166038.66127
5.45000 -7060.74584 11.92072 3714.56770 520.81420 927.87657 172509.55211
5.55000 -6929.34479 -5.98902 5094.86721 512.14360 896.78784 153258.33127
5.65000 -6837.10582 27.10937 2899.30712 477.81671 866.75492 153096.56681
5.75000 -6715.94336 14.12166 2951.30182 522.74496 845.93614 157127.13538
5.85000 -6610.96372 30.14004 -587.19988 470.65920 803.34326 147376.04794
5.95000 -6489.74452 19.50488 4424.35966 494.44712 773.36095 129931.97795
6.05000 -6403.48059 39.88786 587.04799 548.80447 743.78666 122662.72392
6.15000 -6298.99666 4.82655 2349.42879 452.98073 734.36717 114681.57372
6.25000 -6194.78168 14.48351 5446.96564 491.92997 703.47266 110360.73675
6.35000 -6122.15344 36.73670 2264.19339 494.22935 711.19539 105594.54105
6.45000 -6010.69051 20.43598 1451.30973 419.59320 657.31606 103533.75862
6.55000 -5936.78331 13.93748 2826.26530 418.78114 638.74297 93545.83719
6.65000 -5852.28468 6.81432 4903.29732 433.16854 635.36667 89039.20220
6.75000 -5781.34554 5.44084 4415.77728 427.19599 605.67433 99269.04467
6.85000 -5706.05049 -2.10121 1973.67737 426.65598 613.60650 76266.78845
6.95000 -5622.77399 -0.41318 3116.96280 374.02488 567.44664 71739.63658
7.05000 -5541.02735 3.52586 3324.74563 381.98004 569.72978 67824.60823
7.15000 -5488.40903 19.42201 3603.83521 392.54902 568.19061 65549.93118
7.25000 -5429.80570 -10.36871 3177.00692 351.69779 541.55066 57224.05115
7.35000 -5380.43862 0.14823 4574.43648 364.32014 565.93897 54407.50568
7.45000 -5339.94889 2.42131 3168.40578 401.92319 532.64878 59347.88716
7.55000 -5280.06261 10.01106 2474.41233 352.74950 514.61324 46460.85940
7.65000 -5245.45342 -3.63958 3337.79678 358.57850 508.02171 43086.59556
7.75000 -5220.80587 0.70600 3220.88521 354.34978 491.62649 43053.32400
7.85000 -5186.64064 -9.43103 1713.20528 378.84976 480.69425 37034.61551
7.95000 -5159.32286 0.18954 2386.22255 363.39552 480.13497 65586.46707
8.05000 -5133.42190 -16.25288 1781.49268 367.45801 465.80633 50507.35920
8.15000 -5103.37856 -16.71046 2212.94504 369.08815 452.60293 36147.76039
8.25000 -5076.69649 -8.39954 2031.30096 364.23748 440.79986 29310.16446
8.35000 -5057.48156 -17.57377 2444.20422 368.39803 427.47301 29322.71598
8.45000 -5053.81776 -12.94428 1300.43538 405.08683 420.74493 30193.92475
8.55000 -5011.69686 -16.23062 1916.11270 414.39053 415.55685 26736.90342
8.65000 -4984.82036 -16.89907 1175.74181 419.23012 399.23175 23720.49022
8.75000 -4964.21366 -8.38129 1039.92548 411.88023 371.43289 26855.72110
8.85000 -4910.35388 -3.33281 503.61335 426.02645 378.60388 25415.47192
8.95000 -4871.08495 -11.90090 425.81180 428.60645 349.41456 24258.96082
9.05000 -4825.09559 -14.64207 957.15758 412.09989 344.63131 22976.67841
9.15000 -4767.36153 -0.97814 438.39218 417.62534 320.43118 20872.06613
9.25000 -4735.00834 5.69139 1005.17663 405.83166 321.18610 20414.08373
9.35000 -4674.80652 5.62024 812.02012 377.74001 305.61887 20620.10858
9.45000 -4632.72106 4.31927 496.96421 379.88414 292.68955 18933.83731
9.55000 -4589.28469 11.02310 358.65363 370.58872 269.43655 20913.78605
9.65000 -4529.51874 4.44611 1008.48277 376.00310 274.79033 17676.06099
9.75000 -4486.86514 16.95307 873.14219 348.89384 252.13907 17978.63858
9.85000 -4445.58149 10.49876 1219.60208 325.92544 261.11851 17204.67407
9.95000 -4396.65811 15.65394 631.05991 341.49089 274.55819 17486.37614
10.05000 -4359.42690 10.89472 592.79923 306.59395 229.36101 14787.48668
10.15000 -4312.03096 11.58929 221.68900 304.65033 216.63509 19096.39532
10.25000 -4272.41169 2.35605 356.34856 295.46361 201.08383 14136.22662
10.35000 -4233.71966 10.47623 611.99701 284.76003 225.64355 15266.27651
10.45000 -4188.79380 2.85776 584.98492 268.77095 240.40451 13789.79750
10.55000 -4152.30547 6.28983 579.95144 267.66130 194.58941 12331.69568
10.65000 -4108.75756 5.68985 468.36288 253.31317 179.44162 12379.03929
10.75000 -4075.69343 12.69341 312.94097 265.65426 168.54831 11430.94888
10.85000 -4042.57431 12.57037 687.08343 233.57585 182.39749 11702.43769
10.95000 -4006.32084 4.13741 563.38134 218.25618 160.28025 23710.37917
11.05000 -3969.63592 8.90597 395.11597 225.60858 179.98317 11474.97827
11.15000 -3948.88485 11.29609 139.79657 229.68272 190.75358 10051.49599
11.25000 -3910.96393 10.41835 126.86975 201.17671 167.07513 11136.21984
11.35000 -3878.65711 10.98914 422.23758 202.44950 152.61390 9392.04283
11.45000 -3846.87869 14.10798 170.50244 190.75562 151.10084 8576.75312
11.55000 -3825.74377 5.77588 341.06755 194.62874 177.22501 7868.55415
11.65000 -3794.93488 10.29236 66.20288 185.99739 147.08087 7172.06230
11.75000 -3757.53071 9.46151 74.39036 171.24768 166.10991 7359.68503
11.85000 -3738.46539 11.87977 118.42729 167.30555 127.53790 8079.20013
11.95000 -3706.36482 14.40531 616.98069 165.92738 132.80631 7166.37475
12.05000 -3675.93234 15.28792 273.18836 222.08370 129.00301 7427.17726
12.15000 -3641.13751 5.84792 190.59267 158.64766 131.23060 6719.13038
12.25000 -3618.15823 18.92261 203.97990 169.05796 134.24368 7311.50316
12.35000 -3599.62883 14.13285 285.09798 155.77518 130.84022 6700.96570
12.45000 -3573.13602 12.13627 84.26985 150.88452 131.42732 6002.53133
12.55000 -3538.60303 17.64955 -170.09323 132.91439 115.39176 8025.96181
12.65000 -3509.82808 9.34663 268.99426 139.98122 118.60187 5643.80821
12.75000 -3485.80216 7.39688 377.05946 135.49615 146.51367 10382.49917
12.85000 -3460.98032 13.33431 89.78120 141.48732 126.79309 5852.62430
12.95000 -3433.77161 8.96740 140.45790 123.93278 128.08388 5085.60550
13.05000 -3406.97759 10.31751 35.06874 122.47637 121.54181 7592.23676
13.15000 -3383.23928 9.98735 379.99989 127.66993 148.68678 7999.27732
13.25000 -3352.62383 14.54813 -39.71797 129.56622 159.83191 6124.16747
13.35000 -3336.13251 10.78492 100.71238 124.54919 100.17929 6372.78017
13.45000 -3312.84472 11.56144 40.49530 118.63053 108.28417 6254.89323
13.55000 -3286.77603 14.08746 264.97751 133.28946 100.93185 5875.01465
13.65000 -3270.01717 5.43197 260.24846 147.61292 241.48926 5677.10001
13.75000 -3247.18308 8.47199 171.61257 142.96502 96.08142 6113.59783
13.85000 -3220.63492 9.21343 27.76366 146.32836 103.65840 5684.70343
13.95000 -3205.47260 13.52656 268.90874 113.10223 150.31672 6018.43022
14.05000 -3182.15427 3.38113 257.89305 232.96191 118.56024 5059.03329
14.15000 -3163.32398 10.88232 339.49824 122.95711 108.58227 4443.69191
14.25000 -3139.83372 13.16538 1.18477 207.66419 116.07513 4471.27147
14.35000 -3121.24878 -2.39072 170.44412 108.05240 245.34936 5944.79316
14.45000 -3098.08827 8.18757 422.54987 108.20594 74.56178 5394.64112
14.55000 -3094.89778 0.77142 168.94479 573.27612 225.94721 5787.66736
14.65000 -3060.00430 5.78244 375.21128 118.37005 80.60596 4982.20067
14.75000 -3033.72589 7.51271 369.09301 120.03728 107.20465 6016.66932
14.85000 -3017.39119 8.76260 -18.13479 184.62836 78.49997 5523.38469
14.95000 -2993.84573 9.99107 -63.24518 106.76588 93.03688 4191.68454
15.05000 -2975.47191 7.97881 55.76600 78.13043 76.22416 4956.49943
15.15000 -2959.92398 4.68620 246.55584 95.26464 87.55465 5696.51911
15.25000 -2937.29180 9.02651 15.77829 79.53442 57.92531 4224.68190
15.35000 -2920.86510 5.32484 156.20760 92.64246 95.65241 3953.63819
15.45000 -2894.68360 8.36181 -83.82458 96.94755 81.91099 3424.81583
15.55000 -2884.76777 7.55970 170.25025 74.46805 63.68406 4157.11725
15.65000 -2869.82329 4.61383 -64.87247 78.03473 69.76794 3254.52332
15.75000 -2848.91498 8.04030 181.25920 78.27433 65.00145 3690.37072
15.85000 -2825.93362 8.52504 79.40002 82.31426 73.43106 4032.45182
15.95000 -2802.08542 4.02684 5.04500 200.65848 126.07516 3321.09473
16.05000 -2790.51228 5.93297 -107.57126 92.35438 61.73572 3553.12949
16.15000 -2775.72309 5.75976 -106.82879 141.65577 114.06840 2906.28078
16.25000 -2753.70895 6.37360 65.46578 78.76400 86.21934 2913.35274
16.35000 -2738.25036 4.54962 -130.55806 81.03859 83.75180 4051.04185
16.45000 -2710.29239 5.45958 -70.61753 133.44163 61.43458 2927.19263
16.55000 -2702.12411 12.00330 116.54567 85.01666 98.59269 2916.66760
16.65000 -2685.14081 4.23461 115.52798 66.25607 49.42684 3048.59335
16.75000 -2670.68354 5.24399 211.72973 144.88230 56.18231 3115.55032
16.85000 -2642.24919 8.22072 -84.90281 56.53486 48.24176 3314.60593
16.95000 -2623.79624 5.71290 196.60297 72.61956 65.19810 2695.22689
17.05000 -2608.19877 5.06521 183.55582 67.42770 48.81497 3394.06671
17.15000 -2594.89490 5.77228 -45.78293 78.91725 46.62345 3349.07667
17.25000 -2570.52327 8.83095 120.58026 103.68880 86.21452 2717.74018
17.35000 -2562.79111 8.93538 -29.49342 54.49954 55.51272 3331.65055
17.45000 -2546.04276 7.44437 200.30828 87.17470 62.45024 3406.41829
17.55000 -2524.48305 8.07249 72.22714 82.14632 68.88407 2678.34796
17.65000 -2501.92077 6.41576 64.09022 228.97023 44.88441 2270.82114
17.75000 -2491.73520 9.72521 -41.56580 84.72032 58.49559 2279.35650
17.85000 -2480.79255 9.39824 215.88046 69.96791 62.01020 2325.84426
17.95000 -2459.94174 4.27954 67.88245 131.25611 80.51341 2706.86711
18.05000 -2451.59643 7.48781 18.60905 58.47482 66.29198 1891.61765
18.15000 -2434.22210 8.82351 4.43748 79.62854 78.77024 2336.23985
18.25000 -2421.93821 10.38470 48.18966 65.71075 54.13864 1973.29160
18.35000 -2406.83175 9.73532 0.91734 54.11893 40.80025 4015.92973
18.45000 -2393.99678 7.28754 109.79507 73.26556 54.17910 2858.75773
18.55000 -2382.57241 7.74426 74.49331 98.99588 103.85231 2769.61376
18.65000 -2365.36500 8.44130 40.22241 53.33170 37.05383 3176.81748
18.75000 -2359.49854 8.07541 -15.78996 88.46955 64.92521 3095.22341
18.85000 -2330.38337 6.29668 90.78054 151.79013 104.87993 2541.96374
18.95000 -2326.90809 2.93174 -328.01635 71.80166 74.97209 5793.37579
19.05000 -2313.18215 10.77049 158.41071 79.94574 65.59987 2426.51281
19.15000 -2305.49374 14.91058 -170.82657 83.59216 107.39738 2067.89496
19.25000 -2287.09046 6.00561 132.76230 62.11563 35.95372 2538.45257
19.35000 -2272.98304 8.92652 7.67973 81.40191 32.88371 1715.62251
19.45000 -2263.57569 12.11792 86.54856 41.55089 52.34782 2106.85594
19.55000 -2248.18626 2.89532 67.91847 69.91053 58.63625 2192.46796
19.65000 -2240.73867 2.20214 147.55834 79.98707 76.53501 1884.63889
19.75000 -2232.83149 9.15289 -137.83324 44.02911 35.09274 2518.64114
19.85000 -2218.85402 8.19166 29.64328 39.05552 32.61359 1729.47052
19.95000 -2204.49816 7.23637 -79.67642 40.65027 32.96086 1512.74771
