0.12500 0.02878
0.37500 0.01951
0.62500 0.05249
0.87500 0.08920
1.12500 0.09302
1.37500 0.13854
1.62500 0.14120
1.87500 0.16798
2.12500 0.15586
2.37500 0.18650
2.62500 0.17444
2.87500 0.17867
3.12500 0.17791
3.37500 0.20221
3.62500 0.16392
3.87500 0.17861
4.12500 0.17278
4.37500 0.17429
4.62500 0.14267
4.87500 0.15458
5.12500 0.11809
5.37500 0.10338
5.62500 0.08020
5.87500 0.06296
6.12500 0.05646
6.37500 0.05351
6.62500 0.03908
6.87500 0.04819
7.12500 0.06356
7.37500 0.05048
7.62500 0.05274
7.87500 0.04926
8.12500 0.05187
8.37500 0.08207
8.62500 0.03778
8.87500 0.03910
9.12500 0.01772
9.37500 0.05783
9.62500 0.03371
9.87500 0.05598
10.12500 0.02202
10.37500 0.02584
10.62500 0.03487
10.87500 0.03357
11.12500 0.00383
11.37500 0.01434
11.62500 0.03359
11.87500 0.01666
12.12500 0.03711
12.37500 0.02589
12.62500 0.05485
12.87500 0.04233
13.12500 0.06303
13.37500 0.06156
13.62500 0.04648
13.87500 0.04918
14.12500 0.03396
14.37500 0.01245
14.62500 0.06176
14.87500 0.06053
