0.12500 0.03126
0.37500 0.01792
0.62500 0.01911
0.87500 0.01336
1.12500 0.00844
1.37500 0.01551
1.62500 0.02896
1.87500 0.02076
2.12500 0.01852
2.37500 0.01804
2.62500 0.02792
2.87500 0.03122
3.12500 0.02420
3.37500 0.02545
3.62500 0.02338
3.87500 0.03095
4.12500 0.02236
4.37500 0.03074
4.62500 0.01750
4.87500 0.02333
5.12500 0.01018
5.37500 0.01961
5.62500 0.01244
5.87500 0.01182
6.12500 0.01534
6.37500 0.00452
6.62500 0.00715
6.87500 0.00928
7.12500 0.00562
7.37500 0.00305
7.62500 0.01279
7.87500 0.01816
8.12500 0.02112
8.37500 0.01556
8.62500 0.02632
8.87500 0.00280
9.12500 0.02686
9.37500 0.01451
9.62500 0.02224
9.87500 0.02913
10.12500 0.01039
10.37500 0.01293
10.62500 0.02616
10.87500 0.04163
11.12500 0.03727
11.37500 0.06115
11.62500 0.04049
11.87500 0.02458
12.12500 0.03405
12.37500 0.01587
12.62500 0.02027
12.87500 0.03435
13.12500 0.02933
13.37500 0.03654
13.62500 0.02465
13.87500 0.02368
14.12500 0.02427
14.37500 0.01981
14.62500 0.02014
14.87500 0.02029
