0.05000 10248.86835
0.15000 12333.27966
0.25000 15241.93844
0.35000 14914.23234
0.45000 14365.19228
0.55000 12945.20266
0.65000 12089.21291
0.75000 11171.94544
0.85000 10665.61262
0.95000 9667.72727
1.05000 9225.80017
1.15000 8752.91700
1.25000 8328.42012
1.35000 7895.71641
1.45000 7357.86363
1.55000 6960.60087
1.65000 6741.80136
1.75000 6422.23312
1.85000 6030.19522
1.95000 5877.33856
2.05000 5642.27142
2.15000 5380.28679
2.25000 5198.49427
2.35000 4993.14607
2.45000 4818.21319
2.55000 4573.19995
2.65000 4453.77160
2.75000 4276.39459
2.85000 4159.65367
2.95000 3934.83132
3.05000 3739.10885
3.15000 3606.59806
3.25000 3624.64582
3.35000 3492.82137
3.45000 3352.15112
3.55000 3288.41155
3.65000 3221.70931
3.75000 3098.86655
3.85000 3069.16111
3.95000 2918.54153
4.05000 2817.06883
4.15000 2724.29970
4.25000 2676.28772
4.35000 2574.87875
4.45000 2511.97083
4.55000 2443.72567
4.65000 2377.82636
4.75000 2351.53147
4.85000 2294.50157
4.95000 2170.84564
5.05000 2139.61681
5.15000 2046.21883
5.25000 2044.67151
5.35000 1925.88198
5.45000 1878.77242
5.55000 1848.85204
5.65000 1842.60681
5.75000 1759.92088
5.85000 1694.43857
5.95000 1606.55501
6.05000 1592.29681
6.15000 1551.89207
6.25000 1539.48471
6.35000 1480.87535
6.45000 1440.09265
6.55000 1441.01931
6.65000 1354.62517
6.75000 1338.46969
6.85000 1274.53190
6.95000 1244.99205
7.05000 1228.02336
7.15000 1256.49716
7.25000 1186.97333
7.35000 1181.73683
7.45000 1135.57060
7.55000 1088.95577
7.65000 1064.17957
7.75000 1047.06638
7.85000 969.16991
7.95000 980.27250
8.05000 957.97315
8.15000 947.21912
8.25000 903.41204
8.35000 898.59734
8.45000 847.30268
8.55000 835.08784
8.65000 814.06972
8.75000 811.30285
8.85000 770.57002
8.95000 760.41525
9.05000 761.15234
9.15000 720.86189
9.25000 752.89531
9.35000 702.68308
9.45000 667.75832
9.55000 673.70465
9.65000 670.83096
9.75000 670.85776
9.85000 635.84902
9.95000 617.83721
10.05000 606.31913
10.15000 584.62066
10.25000 595.32834
10.35000 587.74646
10.45000 565.14103
10.55000 568.51951
10.65000 561.50463
10.75000 535.04771
10.85000 542.89100
10.95000 556.48657
11.05000 535.93773
11.15000 521.91644
11.25000 476.01280
11.35000 465.86765
11.45000 464.65968
11.55000 465.21396
11.65000 454.56204
11.75000 457.24651
11.85000 450.79752
11.95000 437.99766
12.05000 425.98457
12.15000 412.31622
12.25000 394.51975
12.35000 416.62659
12.45000 399.21992
12.55000 398.08239
12.65000 384.17932
12.75000 362.35490
12.85000 358.06891
12.95000 409.21603
13.05000 335.41124
13.15000 317.05716
13.25000 336.59223
13.35000 333.59948
13.45000 311.60172
13.55000 310.65696
13.65000 328.13102
13.75000 301.89763
13.85000 295.72892
13.95000 279.87687
14.05000 290.70294
14.15000 294.99381
14.25000 269.37943
14.35000 285.76296
14.45000 266.75420
14.55000 277.81869
14.65000 254.29523
14.75000 252.13963
14.85000 243.90929
14.95000 228.18968
15.05000 238.66608
15.15000 229.47664
15.25000 213.99792
15.35000 210.55453
15.45000 224.90771
15.55000 223.72890
15.65000 221.24454
15.75000 231.66282
15.85000 193.51281
15.95000 204.48958
16.05000 201.19796
16.15000 177.96329
16.25000 185.79713
16.35000 196.67802
16.45000 180.54921
16.55000 214.83758
16.65000 194.03900
16.75000 182.86772
16.85000 169.45590
16.95000 194.00586
17.05000 171.10766
17.15000 161.70568
17.25000 178.56204
17.35000 170.38726
17.45000 167.23221
17.55000 177.70683
17.65000 152.05599
17.75000 152.12263
17.85000 137.79571
17.95000 152.89078
18.05000 138.74981
18.15000 163.07969
18.25000 148.79692
18.35000 141.61759
18.45000 144.16126
18.55000 143.56825
18.65000 135.82818
18.75000 134.65857
18.85000 148.29955
18.95000 144.03440
19.05000 123.03771
19.15000 141.47052
19.25000 138.28519
19.35000 139.74226
19.45000 131.94803
19.55000 124.08722
19.65000 135.15256
19.75000 135.57163
19.85000 125.85563
19.95000 137.71190
