0.120000 -1.468500
0.380000 2.103960
0.620000 2.015770
0.880000 1.511120
1.120000 1.612500
1.380000 1.647540
1.620000 1.615870
1.880000 1.688100
2.120000 1.692380
2.380000 1.649580
2.620000 1.627010
2.880000 1.668170
3.120000 1.649090
3.380000 1.672980
3.620000 1.684340
3.880000 1.675960
4.120000 1.697430
4.380000 1.624820
4.620000 1.615310
4.880000 1.569310
5.120000 1.547350
5.380000 1.512730
5.620000 1.448960
5.880000 1.451480
6.120000 1.367090
6.380000 1.346020
6.620000 1.280200
6.880000 1.197410
7.120000 1.427710
7.380000 1.446470
7.620000 1.220480
7.880000 1.530020
8.120000 1.432400
8.380000 1.478610
8.620000 1.201620
8.880000 1.484740
9.120000 1.644090
9.380000 1.427030
9.620000 1.454650
9.880000 1.301850
10.120000 1.098690
10.380000 1.031670
10.620000 1.183770
10.880000 1.016650
11.120000 0.696360
11.380000 0.644970
11.620000 0.687470
11.880000 0.742170
12.120000 1.009740
12.380000 0.543300
12.620000 0.478900
12.880000 0.330240
13.120000 0.132750
13.380000 -0.265980
13.620000 -0.830440
13.880000 -0.876190
14.120000 -1.133800
14.380000 -1.472280
14.620000 -1.537210
14.880000 -1.617480
