0.120000 -0.466530
0.380000 -0.692370
0.620000 -0.375480
0.880000 -0.352740
1.120000 -0.470620
1.380000 -0.458590
1.620000 -0.456920
1.880000 -0.415490
2.120000 -0.432410
2.380000 -0.407160
2.620000 -0.390120
2.880000 -0.372030
3.120000 -0.369000
3.380000 -0.296490
3.620000 -0.330210
3.880000 -0.340070
4.120000 -0.291520
4.380000 -0.257140
4.620000 -0.239830
4.880000 -0.225400
5.120000 -0.277960
5.380000 -0.329010
5.620000 -0.303700
5.880000 -0.387000
6.120000 -0.493030
6.380000 -0.447200
6.620000 -0.760410
6.880000 -0.681430
7.120000 -0.640160
7.380000 -0.709970
7.620000 -0.569600
7.880000 -0.350490
8.120000 -0.262720
8.380000 -0.352840
8.620000 -0.829890
8.880000 -0.321380
9.120000 -0.540870
9.380000 -0.372580
9.620000 -0.697710
9.880000 -0.546930
10.120000 -0.652750
10.380000 -1.218720
10.620000 -1.590890
10.880000 -1.029470
11.120000 -0.288960
11.380000 -1.065140
11.620000 -0.306780
11.880000 -0.899620
12.120000 -1.581400
12.380000 -1.343980
12.620000 -2.018300
12.880000 -0.524780
13.120000 2.977960
13.380000 2.632210
13.620000 2.715740
13.880000 2.360970
14.120000 2.453160
14.380000 2.530790
14.620000 2.372260
14.880000 2.080400
15.120000 1.901160
15.380000 -2.614050
15.620000 2.612440
15.880000 2.138180
16.120000 1.916550
16.380000 1.419250
16.620000 2.612770
16.880000 -2.715330
17.120000 0.242590
17.380000 -2.900490
17.620000 -0.821040
17.880000 -2.334010
18.120000 -2.752600
18.380000 2.051070
18.620000 1.531460
18.880000 2.906370
19.120000 2.775460
19.380000 2.795570
19.620000 0.367810
19.880000 2.854580
