0.120000 1.216170
0.380000 1.124390
0.620000 1.106250
0.880000 1.177500
1.120000 1.122700
1.380000 1.150580
1.620000 1.163490
1.880000 1.149840
2.120000 1.174780
2.380000 1.176630
2.620000 1.188710
2.880000 1.143850
3.120000 1.139070
3.380000 1.105740
3.620000 1.036220
3.880000 0.926940
4.120000 0.863540
4.380000 0.776360
4.620000 0.592710
4.880000 0.465360
5.120000 0.194420
5.380000 0.014500
5.620000 -0.150570
5.880000 -0.268860
6.120000 -0.262510
6.380000 -0.251240
6.620000 -0.101130
6.880000 0.419920
7.120000 0.831430
7.380000 1.131310
7.620000 1.269080
7.880000 1.417160
8.120000 1.610470
8.380000 1.618490
8.620000 1.517860
8.880000 0.985470
9.120000 0.796150
9.380000 0.541960
9.620000 0.380860
9.880000 0.302420
10.120000 0.234060
10.380000 0.236100
10.620000 0.266300
10.880000 -0.206560
11.120000 -0.198410
11.380000 -0.413740
11.620000 -0.629720
11.880000 -1.005920
12.120000 -0.954830
12.380000 -1.080970
12.620000 -1.352750
12.880000 -1.302130
13.120000 -1.443480
13.380000 -1.717520
13.620000 -1.806120
13.880000 -1.949200
14.120000 -1.789560
14.380000 -1.818490
14.620000 -1.138010
14.880000 -1.307380
