0.05000 20904.17556
0.15000 27051.83129
0.25000 28307.12010
0.35000 26209.84022
0.45000 22942.51944
0.55000 20341.28228
0.65000 18457.48859
0.75000 16957.12916
0.85000 15192.70956
0.95000 13828.26886
1.05000 12974.06153
1.15000 11891.32415
1.25000 11217.95271
1.35000 10032.87967
1.45000 9572.78836
1.55000 8821.52193
1.65000 8311.74721
1.75000 7767.52367
1.85000 7504.70461
1.95000 7214.96220
2.05000 6659.86087
2.15000 6344.52113
2.25000 6069.16413
2.35000 5772.76750
2.45000 5390.25242
2.55000 5239.16028
2.65000 5061.69315
2.75000 4805.54849
2.85000 4585.28614
2.95000 4543.30098
3.05000 4269.13054
3.15000 4093.88812
3.25000 3965.24934
3.35000 3834.44424
3.45000 3712.06943
3.55000 3519.05082
3.65000 3453.72664
3.75000 3272.15344
3.85000 3116.78671
3.95000 3046.20552
4.05000 2903.62966
4.15000 2773.03807
4.25000 2670.98727
4.35000 2542.66162
4.45000 2517.17847
4.55000 2329.67264
4.65000 2247.04166
4.75000 2250.62182
4.85000 2152.50005
4.95000 2088.54935
5.05000 1986.13197
5.15000 1922.62896
5.25000 1897.84283
5.35000 1833.16912
5.45000 1786.69121
5.55000 1703.45495
5.65000 1634.88527
5.75000 1633.11491
5.85000 1570.67460
5.95000 1519.25463
6.05000 1496.19818
6.15000 1436.97907
6.25000 1413.07769
6.35000 1363.85366
6.45000 1328.65217
6.55000 1303.99124
6.65000 1232.94844
6.75000 1213.39001
6.85000 1164.10761
6.95000 1140.07672
7.05000 1109.61546
7.15000 1096.04803
7.25000 1038.85644
7.35000 1006.03999
7.45000 1018.86246
7.55000 969.40318
7.65000 948.67834
7.75000 922.93543
7.85000 893.01038
7.95000 847.96406
8.05000 820.22019
8.15000 785.49959
8.25000 801.99119
8.35000 803.93355
8.45000 755.38202
8.55000 743.34672
8.65000 727.98320
8.75000 716.94507
8.85000 679.73368
8.95000 684.29618
9.05000 623.79643
9.15000 659.35437
9.25000 652.14761
9.35000 632.74545
9.45000 583.89919
9.55000 620.86774
9.65000 566.68316
9.75000 549.64200
9.85000 551.02011
9.95000 527.41948
10.05000 523.76310
10.15000 503.83827
10.25000 502.71828
10.35000 488.12406
10.45000 476.16171
10.55000 480.99108
10.65000 462.23725
10.75000 454.90794
10.85000 468.47725
10.95000 427.46721
11.05000 419.76023
11.15000 419.98666
11.25000 404.62890
11.35000 394.40767
11.45000 396.86637
11.55000 380.74002
11.65000 365.12542
11.75000 411.93371
11.85000 365.58842
11.95000 361.86744
12.05000 374.70676
12.15000 359.43491
12.25000 373.83382
12.35000 349.33694
12.45000 319.27872
12.55000 335.70649
12.65000 317.90193
12.75000 328.57543
12.85000 320.12823
12.95000 294.59812
13.05000 309.37088
13.15000 306.71836
13.25000 304.71247
13.35000 320.98088
13.45000 293.48878
13.55000 287.93247
13.65000 260.04493
13.75000 268.49236
13.85000 282.35821
13.95000 255.17505
14.05000 256.89595
14.15000 265.45649
14.25000 241.11814
14.35000 274.92039
14.45000 242.82260
14.55000 242.84956
14.65000 228.44372
14.75000 293.23771
14.85000 221.26618
14.95000 225.04823
15.05000 211.84948
15.15000 195.13424
15.25000 194.84961
15.35000 253.53518
15.45000 209.20624
15.55000 194.87242
15.65000 201.50716
15.75000 186.87505
15.85000 203.62612
15.95000 185.68839
16.05000 182.44363
16.15000 178.74808
16.25000 223.55823
16.35000 184.54348
16.45000 183.46524
16.55000 176.62877
16.65000 168.67775
16.75000 170.66245
16.85000 175.94359
16.95000 151.82649
17.05000 172.92934
17.15000 162.58832
17.25000 157.65969
17.35000 162.46853
17.45000 178.05767
17.55000 156.43803
17.65000 168.30309
17.75000 154.31860
17.85000 175.31409
17.95000 160.34262
18.05000 166.58999
18.15000 145.45399
18.25000 172.12117
18.35000 166.14390
18.45000 149.53492
18.55000 154.11555
18.65000 161.30390
18.75000 149.16923
18.85000 145.75605
18.95000 153.12185
19.05000 145.61130
19.15000 156.60504
19.25000 159.08300
19.35000 148.29002
19.45000 147.52026
19.55000 218.73628
19.65000 155.35964
19.75000 149.34771
19.85000 157.12663
19.95000 165.64196
