0.120000 -0.026220
0.380000 2.776760
0.620000 -2.837360
0.880000 2.669110
1.120000 2.865180
1.380000 2.842390
1.620000 2.526430
1.880000 2.773940
2.120000 2.750310
2.380000 2.735560
2.620000 2.716620
2.880000 2.423250
3.120000 2.263900
3.380000 1.914370
3.620000 1.665910
3.880000 1.698330
4.120000 1.632920
4.380000 2.053290
4.620000 2.034450
4.880000 2.508560
5.120000 2.536640
5.380000 3.008540
5.620000 2.762930
5.880000 2.547040
6.120000 2.301950
6.380000 2.211860
6.620000 2.077830
6.880000 1.869490
7.120000 1.869200
7.380000 1.296100
7.620000 0.617790
7.880000 0.910490
8.120000 0.342420
8.380000 1.206880
8.620000 1.240130
8.880000 0.045570
9.120000 0.105560
9.380000 -1.438870
9.620000 -0.971410
9.880000 -0.062150
10.120000 1.890820
10.380000 1.728440
10.620000 1.997820
10.880000 1.374510
11.120000 1.262450
11.380000 1.621280
11.620000 1.640590
11.880000 0.653200
12.120000 0.355450
12.380000 0.491460
12.620000 0.297290
12.880000 -0.188000
13.120000 -0.409500
13.380000 -1.294370
13.620000 -0.894620
13.880000 -1.614580
14.120000 -1.054880
14.380000 -2.844790
14.620000 2.709490
14.880000 1.747060
