0.120000 1.296720
0.380000 -0.494170
0.620000 0.035220
0.880000 0.274330
1.120000 -0.024950
1.380000 -0.043920
1.620000 0.020110
1.880000 0.068460
2.120000 0.008290
2.380000 -0.002560
2.620000 0.002450
2.880000 -0.002520
3.120000 -0.013110
3.380000 -0.000040
3.620000 -0.029400
3.880000 -0.066440
4.120000 -0.112040
4.380000 -0.069620
4.620000 -0.011420
4.880000 -0.029230
5.120000 0.012240
5.380000 -0.070080
5.620000 0.054510
5.880000 -0.021680
6.120000 0.097790
6.380000 0.015510
6.620000 0.084040
6.880000 0.149250
7.120000 0.214230
7.380000 0.100590
7.620000 -0.347490
7.880000 -0.338520
8.120000 -0.273990
8.380000 -0.120780
8.620000 0.243730
8.880000 0.113830
9.120000 0.015140
9.380000 -0.070580
9.620000 0.205860
9.880000 0.065230
10.120000 0.347080
10.380000 -0.009290
10.620000 -0.093490
10.880000 -0.011210
11.120000 -0.478690
11.380000 -0.835290
11.620000 -0.771280
11.880000 -2.672700
12.120000 -1.689610
12.380000 -2.332200
12.620000 -2.310100
12.880000 -2.592150
13.120000 -2.499000
13.380000 2.785130
13.620000 -2.713270
13.880000 2.392930
14.120000 -2.977870
14.380000 2.146480
14.620000 2.258200
14.880000 2.565460
15.120000 2.533800
15.380000 -2.867740
15.620000 -1.726480
15.880000 -2.355000
16.120000 -1.892760
16.380000 -1.982270
16.620000 -2.592880
16.880000 -2.594900
17.120000 -2.429070
17.380000 -2.489160
17.620000 -2.392950
17.880000 2.799990
18.120000 2.851900
18.380000 -2.777090
18.620000 1.537570
18.880000 2.885400
19.120000 2.639070
19.380000 -2.045750
19.620000 -2.154230
19.880000 2.504870
