0.05000 -8274.37118 321.29262 251455.41042 10031.84804 10915.21039 746458.86660
0.15000 -20934.10186 -354.24463 97866.74711 7809.53565 9902.59508 903111.46698
0.25000 -25378.63986 -39.18234 22744.71296 5733.32054 6899.06260 928005.79514
0.35000 -25783.93080 -6.32106 65293.59399 5379.94906 5799.24930 656775.37527
0.45000 -24392.99627 180.38284 2971.02728 4210.71222 4899.57073 680078.51511
0.55000 -22949.06193 -101.74605 -15089.73225 3837.83931 4276.60731 675755.96078
0.65000 -21442.58019 112.29553 -24681.78326 3123.44088 3838.97294 640372.84395
0.75000 -19827.69312 33.78704 -17925.06146 2929.26701 2750.35343 570135.76947
0.85000 -18680.66221 30.43110 -11165.48867 2412.00572 2765.85599 490186.01523
0.95000 -17618.21678 28.21319 13785.52511 2949.75037 2547.91352 509959.79410
1.05000 -16527.65254 32.87011 1301.04503 1784.14989 2458.12056 417101.14287
1.15000 -15542.66079 -17.55036 -4493.39113 2144.05062 2207.67747 439013.73148
1.25000 -14845.27365 74.07409 -13782.13618 1826.16803 2525.72268 378585.60808
1.35000 -14261.07211 65.00641 -7351.91447 1760.89693 2092.82576 390177.52380
1.45000 -13682.31181 43.12306 -4895.95065 1893.71206 2062.37091 323228.82155
1.55000 -13204.66630 100.92493 2175.62788 1492.65544 1871.55907 352031.20484
1.65000 -12702.72477 -51.43708 6829.21490 1398.79201 1999.54342 341986.33295
1.75000 -12275.77151 40.06049 -4924.20592 1294.87831 1859.65084 315655.85980
1.85000 -11777.20540 6.68821 -9096.66867 1093.72117 1753.02176 283176.52510
1.95000 -11415.51998 93.51553 -6223.21199 1510.65986 1674.88389 256778.71721
2.05000 -11115.47705 -6.39528 3659.92891 1414.42264 1813.25159 271381.63881
2.15000 -10763.16887 32.01019 4562.49305 1090.75320 1550.23121 267196.14678
2.25000 -10465.45179 33.05971 1637.77139 1050.65660 1582.14720 273708.48354
2.35000 -10263.21954 54.47627 6701.68100 943.35665 1544.27980 227459.54655
2.45000 -9994.25863 3.87739 3150.76954 937.77212 1504.54865 244100.66986
2.55000 -9750.33025 83.04254 5683.76991 882.87187 1346.88808 204068.67156
2.65000 -9565.43116 33.12524 618.39616 948.50947 1322.71496 222499.16256
2.75000 -9315.49759 6.76474 -9080.63413 874.66593 1279.62001 185619.81145
2.85000 -9139.59360 63.89150 6979.18661 1173.64550 1321.95582 215274.24095
2.95000 -8972.27274 78.45825 -3663.94495 856.32533 1292.73493 190089.89236
3.05000 -8836.94671 72.31937 2004.40057 803.82524 1233.96286 189609.13061
3.15000 -8669.74341 17.38463 -5001.89049 953.29810 1306.55618 177400.81270
3.25000 -8544.82899 -1.95764 415.97975 1176.89338 1210.85689 172751.64102
3.35000 -8504.21761 42.35203 -2031.09970 1335.36840 1148.28930 145768.88791
3.45000 -8334.20802 16.35872 3186.40675 956.85116 1123.35559 158812.11861
3.55000 -8256.06318 15.77986 -7542.66425 1168.76486 1481.73103 162603.83951
3.65000 -8165.63637 53.47923 -2728.19434 764.93810 1076.35177 125992.14685
3.75000 -8091.79264 19.31049 443.84629 1115.16105 1087.92116 130210.06762
3.85000 -8025.07482 45.50864 -5864.76482 785.76334 996.90700 119090.18889
3.95000 -7979.32112 8.41164 136.11994 748.77637 963.35340 116838.46689
4.05000 -7922.73747 33.67027 -104.60984 721.76092 854.42867 118387.57333
4.15000 -7862.42714 49.43563 -1931.68531 794.31810 937.88292 120863.80281
4.25000 -7786.27470 32.49010 -3814.96531 676.45964 755.29124 132457.96077
4.35000 -7702.50406 43.35856 1462.56132 782.04211 792.61440 101070.58698
4.45000 -7631.14943 11.05361 -3974.02352 667.71193 886.84493 102169.25812
4.55000 -7551.54992 16.54271 1854.49392 695.90119 722.62592 102341.49057
4.65000 -7496.51789 2.15357 -396.74479 806.84570 997.56905 109366.68626
4.75000 -7435.05232 10.47088 6503.43677 820.29429 654.32896 100407.61180
4.85000 -7394.28711 28.68846 365.61240 708.58916 708.19262 93719.18627
4.95000 -7337.57512 38.65033 14.72645 689.67760 821.48055 93043.51694
5.05000 -7283.61740 20.08894 -1444.28158 655.48705 563.12711 89730.77965
5.15000 -7245.90743 35.64116 937.62538 642.66916 650.77391 79098.27336
5.25000 -7194.84970 60.11220 2145.99466 864.74547 584.58441 81187.37357
5.35000 -7130.98457 19.94501 -2142.47650 609.67473 701.75082 73596.25597
5.45000 -7031.56304 20.04680 -2735.58234 582.87671 666.37464 70213.87952
5.55000 -7011.15584 26.04828 -634.39442 658.01444 468.01883 72807.26616
5.65000 -6917.04039 29.68785 -1911.20563 589.21174 543.81671 73730.24819
5.75000 -6882.97015 24.30491 2448.10387 488.45477 439.53636 64158.08132
5.85000 -6852.39421 36.35890 3473.60974 516.82905 425.74885 85504.09601
5.95000 -6776.56764 46.24015 947.93903 532.77948 539.90800 66465.77142
6.05000 -6731.25721 23.08856 -109.38309 515.78251 484.82481 67016.91446
6.15000 -6680.00502 35.71927 -518.50125 754.86859 474.03114 71235.81343
6.25000 -6600.67857 25.52451 1513.07352 540.14534 506.32639 54499.71767
6.35000 -6565.27535 35.39762 1105.52242 371.36836 375.50933 54171.87552
6.45000 -6508.32472 35.38824 -1685.79966 399.83402 396.06387 54201.39837
6.55000 -6479.24311 21.69010 1158.35843 597.98326 448.13528 45699.32354
6.65000 -6397.59897 27.14439 1765.94801 420.90395 454.41199 54468.64796
6.75000 -6377.54414 21.12706 -777.73256 768.22426 478.65618 51578.37040
6.85000 -6312.03675 25.90549 -266.77779 363.23057 363.55090 46184.82916
6.95000 -6245.28244 26.62207 469.23453 366.91852 330.01636 39406.45066
7.05000 -6196.29066 28.35013 2061.75318 353.77342 466.52182 40080.95551
7.15000 -6118.54146 30.73589 -1062.25214 376.54315 384.52251 40221.66555
7.25000 -6066.08206 19.14343 -1446.36763 381.42759 395.68244 45375.62247
7.35000 -6021.63532 33.92311 18.80323 347.11385 293.62939 38943.36447
7.45000 -5966.02356 23.07006 1379.00281 386.50372 352.33112 46246.97391
7.55000 -5907.76762 17.00591 -69.19747 751.87848 514.01812 35540.10830
7.65000 -5855.72527 17.81872 -1106.63806 323.13554 315.28201 49392.57316
7.75000 -5795.90195 25.90963 -932.13317 381.51938 312.26635 36463.55850
7.85000 -5752.15020 23.28083 1399.06218 284.99397 386.19994 37602.41122
7.95000 -5692.94796 4.86838 213.83240 303.26685 363.90935 43948.05251
8.05000 -5644.42911 26.12080 -1319.94563 301.00879 264.31037 31901.75825
8.15000 -5583.24160 22.18834 149.92250 438.20790 261.69920 29291.17820
8.25000 -5519.55475 20.53206 586.75685 658.56834 286.61539 36633.40752
8.35000 -5488.48962 28.16954 -320.66715 294.47690 283.93821 28998.19828
8.45000 -5426.00875 14.29507 92.12978 285.25429 228.81646 32968.07859
8.55000 -5367.31757 7.52129 681.10482 425.23564 336.58177 32492.81020
8.65000 -5332.96730 24.42280 1025.13590 291.92265 246.82794 31723.93385
8.75000 -5291.20102 25.70901 -988.03409 288.58038 262.92600 22153.83625
8.85000 -5249.31674 27.84392 728.13187 479.51319 346.73772 24548.32658
8.95000 -5168.31390 22.03685 191.62224 431.13876 283.38886 27959.90989
9.05000 -5141.24079 24.76694 -1261.54162 367.96368 281.55447 23303.92897
9.15000 -5084.13079 19.04843 -779.46258 211.11031 201.54568 25331.61061
9.25000 -5036.73547 27.82508 -369.73246 240.94420 263.74035 25590.55485
9.35000 -4990.36700 17.10339 -602.48838 236.06381 236.65689 29090.09614
9.45000 -4932.89176 21.26337 -772.16853 224.72170 235.82765 24463.55038
9.55000 -4894.45336 25.25252 1506.77280 333.29118 259.08354 24145.95090
9.65000 -4857.57946 12.54731 -469.10230 259.72591 263.34411 19223.06416
9.75000 -4808.21699 22.94280 -471.22053 172.47838 167.42190 17789.56554
9.85000 -4772.97419 5.60631 -512.67199 340.44642 326.33888 20417.45005
9.95000 -4746.88910 15.84393 663.44103 221.73763 206.67026 22756.96224
10.05000 -4668.40831 13.89022 249.23171 503.18306 365.37048 21112.00082
10.15000 -4651.48104 22.56680 -580.61119 215.96613 226.64177 19746.34311
10.25000 -4610.50098 18.87556 -502.71326 221.02157 230.52656 20927.10825
10.35000 -4581.02788 19.95224 -633.85124 193.35711 165.76853 23491.57728
10.45000 -4534.76593 17.49265 -283.39290 289.62387 183.16899 17029.63084
10.55000 -4510.78586 20.28922 39.73031 258.53342 247.53700 18449.66805
10.65000 -4475.19920 18.31613 998.20137 272.65970 342.42141 23208.58782
10.75000 -4440.34432 18.49201 436.71854 157.23716 157.99509 15817.99402
10.85000 -4401.72043 20.82626 93.64772 262.47738 183.75005 17471.44680
10.95000 -4365.72989 21.33328 -246.99417 184.96652 148.11402 15385.93349
11.05000 -4324.27175 13.88749 -336.61544 234.40798 181.25098 17054.63134
11.15000 -4306.80681 3.39186 -754.79315 222.98181 443.56284 12403.33861
11.25000 -4253.15229 13.41240 -288.84522 154.12567 164.49091 14670.17494
11.35000 -4215.89877 13.99285 -615.71981 357.38223 305.87061 14276.08311
11.45000 -4180.85849 13.17027 249.09361 152.40001 174.34798 16738.42320
11.55000 -4177.34730 5.95955 119.32780 328.34348 242.74186 12839.29101
11.65000 -4132.14751 9.17683 283.01545 133.01166 126.25011 13767.64054
11.75000 -4103.09074 9.09747 37.31607 347.67095 204.99022 18311.20002
11.85000 -4074.59382 12.99887 277.93623 184.23399 215.89405 12071.55763
11.95000 -4039.94658 7.54720 273.28574 161.10699 148.91890 14244.94459
12.05000 -4014.99224 10.06212 65.60099 147.40761 138.76734 11625.47884
12.15000 -3982.20774 16.05309 -562.07390 155.12949 169.44548 12793.60035
12.25000 -3948.65395 1.47016 311.48634 397.62537 403.70523 12693.50613
12.35000 -3930.17072 7.42424 -177.63356 152.38301 139.06467 11636.22464
12.45000 -3894.24999 14.93623 -722.62834 246.46768 223.98141 11971.24295
12.55000 -3886.49857 5.82224 19.58313 409.09140 466.01611 10271.57617
12.65000 -3825.32327 5.75668 -314.17853 203.63095 237.88651 9477.98880
12.75000 -3809.81502 10.28999 -466.69662 159.95526 114.22220 9507.01335
12.85000 -3785.51044 15.54604 -8.97338 179.79367 281.28769 9031.79601
12.95000 -3758.25535 10.84661 478.56199 116.74500 129.64683 10754.87207
13.05000 -3740.81818 10.60782 -57.76866 129.02056 153.76836 8887.06655
13.15000 -3695.81742 8.89549 458.80141 121.61898 124.88029 9409.28608
13.25000 -3678.65957 -5.63390 -323.76050 219.99710 314.96073 10659.19239
13.35000 -3637.96063 4.59746 41.24364 242.36595 177.24528 10690.75006
13.45000 -3609.72317 11.58613 -520.50855 132.02564 107.77176 9164.45894
13.55000 -3588.44802 7.97857 -285.56856 108.02461 95.93286 7433.31226
13.65000 -3549.59996 7.05950 317.16015 249.21312 186.65525 7843.95020
13.75000 -3534.13415 11.92996 -254.67806 131.12520 101.88978 8438.74164
13.85000 -3505.39482 12.63274 597.29964 144.42205 126.50624 9244.12913
13.95000 -3486.36214 5.31266 -388.61160 113.81321 106.70794 10025.24060
14.05000 -3463.38115 7.41795 350.31526 128.59424 146.54212 8365.04029
14.15000 -3434.13574 5.16042 -78.09349 127.53239 202.54540 8453.45421
14.25000 -3397.41359 11.78695 -243.46338 187.79406 230.31620 7224.83791
14.35000 -3381.64295 20.02283 -96.88215 204.57831 160.59623 6363.42310
14.45000 -3354.78664 3.95774 324.87628 120.03145 122.75224 5598.99044
14.55000 -3333.14853 7.71914 -68.50778 92.22567 98.98780 6363.25750
14.65000 -3311.17875 7.77661 434.02624 117.69909 82.64624 7683.33290
14.75000 -3286.31976 13.43141 -223.88717 87.67587 133.05883 7790.03727
14.85000 -3263.80535 6.59493 36.72807 91.81552 108.48646 5849.57427
14.95000 -3230.28537 11.57773 -51.48549 103.82440 288.24839 6101.82941
15.05000 -3214.55821 20.47937 -773.38124 128.41138 283.94801 7965.98566
15.15000 -3201.75611 8.28953 195.68403 87.49339 83.44429 5711.62682
15.25000 -3174.85691 6.10096 52.99762 153.60396 94.70049 4341.01650
15.35000 -3154.31247 4.04199 -56.65255 148.23204 141.64557 5460.07213
15.45000 -3134.40911 13.34070 189.81668 105.80598 106.35548 6854.46476
15.55000 -3110.60252 13.18761 335.90271 99.19568 80.96804 4842.18664
15.65000 -3085.27335 17.81171 -313.30001 203.12908 182.98208 5387.51534
15.75000 -3066.12586 9.34270 -230.07521 89.85474 69.50768 5032.62860
15.85000 -3048.23303 7.34795 173.78364 119.98526 191.81891 4578.25614
15.95000 -3018.34530 6.72934 -597.77761 99.02598 84.40176 6956.85668
16.05000 -2991.69257 8.57930 -20.99140 172.01019 166.39858 4719.40132
16.15000 -2984.07263 9.64294 93.45052 100.64271 81.84098 4166.55134
16.25000 -2961.74609 14.89489 88.74868 93.50220 66.02283 5736.14047
16.35000 -2936.92621 -0.88349 -399.67368 257.91372 132.18467 4841.18445
16.45000 -2922.42474 7.60143 -263.51519 94.66049 176.60885 5593.86954
16.55000 -2893.82253 7.16522 -169.90140 162.01805 80.35085 5061.60541
16.65000 -2899.79032 -3.44759 361.01158 685.74245 434.00088 6085.33118
16.75000 -2855.17381 12.62602 23.21107 157.31278 132.39806 6173.70207
16.85000 -2854.63653 0.29596 -20.90603 66.41065 116.76435 6506.20104
16.95000 -2834.79635 9.83018 -209.19109 64.72358 60.60764 5512.74528
17.05000 -2817.87450 9.21586 -87.15292 61.00210 72.46458 4051.67432
17.15000 -2802.63205 8.57780 128.39270 164.82595 108.44392 5961.29106
17.25000 -2770.90931 3.69910 173.91236 75.61330 56.68970 4209.30203
17.35000 -2768.62923 4.41403 -575.53109 76.79941 73.15637 4468.96149
17.45000 -2746.61417 10.12155 121.21438 61.85756 80.89093 3909.48631
17.55000 -2730.32207 -0.84111 -55.08460 93.63160 98.41189 3507.77944
17.65000 -2698.44831 4.15506 -108.23248 131.11546 71.28699 6465.82498
17.75000 -2699.34570 10.99792 -148.61732 96.68645 90.73945 3566.26171
17.85000 -2674.74800 6.26233 40.17188 113.88727 82.99764 2746.21498
17.95000 -2664.15543 6.16437 22.23821 89.35227 109.88595 2794.11732
18.05000 -2648.18679 1.70914 142.19377 66.09713 56.88779 4316.37076
18.15000 -2630.13186 9.27134 297.50590 59.51325 64.86317 4770.89053
18.25000 -2614.91704 11.55236 -176.63355 88.93760 84.61816 4520.75443
18.35000 -2605.81501 -4.36660 -175.67232 70.00883 88.19857 3181.30529
18.45000 -2576.60563 15.46179 -174.61583 126.74089 281.78773 2883.89658
18.55000 -2567.68282 4.30532 373.12234 59.29700 66.17145 3890.15283
18.65000 -2565.41423 16.45796 -61.95577 147.23170 246.61335 3826.85949
18.75000 -2538.48535 5.89808 -317.82538 63.61090 59.10391 3365.10572
18.85000 -2522.39691 6.84496 86.52709 55.55940 59.78658 2867.94035
18.95000 -2507.33746 -2.54509 196.55274 59.10494 117.85907 3834.33321
19.05000 -2497.51852 7.35094 -502.35428 67.73096 58.52891 5521.40837
19.15000 -2483.35155 13.73042 -145.70682 58.38438 80.18386 3246.58887
19.25000 -2467.65926 5.41276 7.74877 60.30990 48.14248 2043.59511
19.35000 -2441.34487 7.53542 146.29593 82.10554 75.52805 2094.53996
19.45000 -2445.39695 -3.62077 -234.26568 232.10750 124.50077 2427.69471
19.55000 -2411.89837 5.82608 -62.54010 54.74736 57.77783 2335.82784
19.65000 -2408.03894 1.37114 -107.87083 55.88135 127.85746 2216.41665
19.75000 -2401.42235 8.01617 -153.92150 135.35761 71.41869 2708.92916
19.85000 -2370.09749 -3.13378 -302.11198 87.61998 114.98155 3026.39791
19.95000 -2359.74687 1.39101 -252.93944 53.07053 46.83548 2777.53619
