0.2 0.33007 20.24496 -3.33691 68.63208 69.64353 67.99167
0.6 0.89047 44.87625 -2.44525 65.66249 66.72424 64.86117
1.0 0.1421 69.6929 -2.01242 62.69723 63.41723 60.20882
1.4 0.04203 90.60142 -1.55134 58.7416 58.82116 57.5669
1.8 -0.1936 107.70268 -1.11642 56.44946 55.28095 53.9162
2.2 0.4437 121.41365 -1.33656 53.50965 51.69206 51.59038
2.6 -0.43386 131.88037 -1.06979 51.07363 49.10597 49.04794
3.0 0.28211 141.67237 0.07613 49.13443 46.05369 46.35807
3.4 -0.03994 149.9319 -0.03911 46.62709 43.21246 44.04053
3.8 -0.04316 157.16394 0.83971 45.00327 40.01968 41.65353
4.2 0.37613 163.82029 0.58342 42.87639 37.66243 39.15546
4.6 -0.07371 170.04224 0.58911 40.76765 35.34935 37.32786
5.0 0.40962 175.32247 1.11027 39.36453 34.16405 35.48758
5.4 0.73747 180.54199 0.69578 37.90734 31.84287 34.00308
5.8 1.31248 183.77978 0.62853 36.58486 30.49946 32.34462
6.2 1.33487 187.40191 0.38759 35.56725 29.43887 31.08741
6.6 0.55535 190.43842 -0.01916 34.51861 28.04841 29.49733
7.0 1.0942 193.67838 -0.25812 33.2764 26.87584 28.19639
7.4 0.74971 196.05376 -0.1115 32.01262 25.9496 26.71656
7.8 0.78386 198.07348 -0.0273 30.37569 24.26081 25.74722
8.2 -0.17949 199.51792 0.09614 29.23078 22.53673 24.35717
8.6 -0.41291 201.09795 0.53083 28.12974 22.26253 23.29044
9.0 0.09006 203.53921 0.74449 27.16932 21.64605 21.91889
9.4 0.3443 204.89964 0.97517 25.59452 20.19966 20.78608
9.8 0.83339 205.6674 0.91799 24.76467 19.41346 20.17852
10.2 1.45766 207.14374 0.94953 23.80719 18.7386 19.15123
10.6 0.85806 207.72011 0.22513 22.76771 17.91367 18.38027
11.0 -0.16734 207.64565 0.09808 22.29292 16.86675 17.47702
11.4 -0.88358 207.35315 0.42113 21.6258 16.08145 16.94345
11.8 -1.77411 207.60082 0.36207 20.82647 15.56544 16.34228
12.2 -1.7908 209.04871 0.45754 20.29488 14.80517 15.51413
12.6 -0.13377 210.21465 0.48503 18.94655 14.61764 14.86883
13.0 1.58175 210.8867 0.76768 17.77257 13.6049 13.64579
13.4 2.52047 210.38549 0.73312 17.21748 13.09156 13.22129
13.8 1.93201 210.11946 0.22894 16.7259 13.46619 12.84817
14.2 1.13423 210.20348 0.21451 16.46547 12.74198 12.48418
14.6 -0.14531 210.20403 0.72108 16.19819 11.94577 12.16341
15.0 -1.12868 209.73426 1.03356 15.5259 11.46019 11.77261
15.4 -1.58874 210.01033 1.84533 14.7448 10.41026 11.21523
15.8 -1.00284 210.58059 2.34905 13.85947 10.08677 10.6278
16.2 0.1167 210.66305 2.19786 13.12115 9.41091 9.99148
16.6 0.61201 210.10422 1.78542 12.75377 9.66536 9.771
17.0 0.62401 210.16907 1.33166 12.05174 9.81004 9.47585
17.4 1.07378 211.0973 0.59973 11.85205 9.41291 9.28936
17.8 1.59886 211.05346 0.29995 11.79062 9.23559 8.79577
18.2 2.33947 210.9279 -0.33791 11.82824 8.79517 8.51463
18.6 2.71415 210.68227 0.04802 11.77054 8.63046 8.57521
19.0 0.97991 210.1684 -0.44179 11.61473 8.88411 8.57661
19.4 -0.33444 210.17346 -0.13172 10.74282 8.51281 7.97717
19.8 -2.28046 210.37136 -0.20335 10.17607 7.91782 7.87967
