0.12500 0.02707
0.37500 0.01689
0.62500 0.01660
0.87500 0.00538
1.12500 0.02335
1.37500 0.02635
1.62500 0.03189
1.87500 0.04183
2.12500 0.05363
2.37500 0.05301
2.62500 0.04768
2.87500 0.04357
3.12500 0.03677
3.37500 0.03823
3.62500 0.03984
3.87500 0.03197
4.12500 0.03636
4.37500 0.02720
4.62500 0.02328
4.87500 0.02163
5.12500 0.02764
5.37500 0.02634
5.62500 0.01458
5.87500 0.01681
6.12500 0.00984
6.37500 0.02063
6.62500 0.00803
6.87500 0.02344
7.12500 0.01916
7.37500 0.01060
7.62500 0.01822
7.87500 0.01618
8.12500 0.03167
8.37500 0.02217
8.62500 0.02937
8.87500 0.02245
9.12500 0.00401
9.37500 0.00122
9.62500 0.00367
9.87500 0.02818
10.12500 0.00652
10.37500 0.01042
10.62500 0.01132
10.87500 0.01025
11.12500 0.01569
11.37500 0.02228
11.62500 0.01168
11.87500 0.02735
12.12500 0.04903
12.37500 0.00590
12.62500 0.00826
12.87500 0.02500
13.12500 0.02906
13.37500 0.03940
13.62500 0.01740
13.87500 0.01973
14.12500 0.02837
14.37500 0.01835
14.62500 0.01474
14.87500 0.00949
