0.12500 0.01808
0.37500 0.02330
0.62500 0.07478
0.87500 0.14441
1.12500 0.21172
1.37500 0.28189
1.62500 0.31952
1.87500 0.36256
2.12500 0.39518
2.37500 0.42019
2.62500 0.43023
2.87500 0.46434
3.12500 0.47599
3.37500 0.50976
3.62500 0.53829
3.87500 0.54320
4.12500 0.56972
4.37500 0.58545
4.62500 0.60137
4.87500 0.60389
5.12500 0.60724
5.37500 0.61982
5.62500 0.61726
5.87500 0.61865
6.12500 0.60305
6.37500 0.59636
6.62500 0.58137
6.87500 0.56222
7.12500 0.52714
7.37500 0.50459
7.62500 0.46790
7.87500 0.42792
8.12500 0.39081
8.37500 0.31944
8.62500 0.22300
8.87500 0.16365
9.12500 0.15400
9.37500 0.12488
9.62500 0.10797
9.87500 0.12127
10.12500 0.11947
10.37500 0.14594
10.62500 0.15052
10.87500 0.16598
11.12500 0.20390
11.37500 0.22103
11.62500 0.22906
11.87500 0.26001
12.12500 0.27618
12.37500 0.29462
12.62500 0.27386
12.87500 0.25647
13.12500 0.24564
13.37500 0.19735
13.62500 0.17955
13.87500 0.14210
14.12500 0.12358
14.37500 0.10146
14.62500 0.07973
14.87500 0.08609
15.12500 0.06625
15.37500 0.06164
15.62500 0.02487
15.87500 0.09242
16.12500 0.08193
16.37500 0.07583
16.62500 0.08020
16.87500 0.10379
17.12500 0.10486
17.37500 0.10935
17.62500 0.07387
17.87500 0.09468
18.12500 0.06131
18.37500 0.09958
18.62500 0.07155
18.87500 0.08856
19.12500 0.08508
19.37500 0.03802
19.62500 0.07046
19.87500 0.05868
