0.12500 0.06624
0.37500 0.03977
0.62500 0.02619
0.87500 0.02337
1.12500 0.02335
1.37500 0.02158
1.62500 0.00947
1.87500 0.00676
2.12500 0.01174
2.37500 0.02984
2.62500 0.01049
2.87500 0.01936
3.12500 0.03423
3.37500 0.02834
3.62500 0.01498
3.87500 0.01987
4.12500 0.01500
4.37500 0.01440
4.62500 0.01882
4.87500 0.01012
5.12500 0.03170
5.37500 0.03083
5.62500 0.03267
5.87500 0.02091
6.12500 0.02481
6.37500 0.01592
6.62500 0.02324
6.87500 0.02739
7.12500 0.00967
7.37500 0.01411
7.62500 0.01373
7.87500 0.02502
8.12500 0.00637
8.37500 0.03261
8.62500 0.01650
8.87500 0.02880
9.12500 0.03215
9.37500 0.02497
9.62500 0.02798
9.87500 0.01770
10.12500 0.03339
10.37500 0.02401
10.62500 0.00169
10.87500 0.00535
11.12500 0.03752
11.37500 0.04761
11.62500 0.03221
11.87500 0.03437
12.12500 0.02899
12.37500 0.07796
12.62500 0.00570
12.87500 0.00953
13.12500 0.02359
13.37500 0.03114
13.62500 0.03634
13.87500 0.05177
14.12500 0.03197
14.37500 0.02714
14.62500 0.00545
14.87500 0.02025
15.12500 0.03916
15.37500 0.06900
15.62500 0.07352
15.87500 0.04845
16.12500 0.03805
16.37500 0.07771
16.62500 0.06888
16.87500 0.07204
17.12500 0.05693
17.37500 0.07758
17.62500 0.02526
17.87500 0.03822
18.12500 0.13412
18.37500 0.06653
18.62500 0.08616
18.87500 0.12793
19.12500 0.04337
19.37500 0.04238
19.62500 0.01032
19.87500 0.07871
