0.1875 2.03407 20.1637 0.92198 74.58306 73.99281 68.85813
0.5625 -0.15077 44.2404 1.17317 70.45714 72.42034 64.38746
0.9375 -0.98672 67.68603 0.75542 67.29013 68.0209 61.19294
1.3125 -1.72522 87.30006 0.46488 64.04416 61.73577 57.93211
1.6875 -2.2281 105.00492 -0.12168 59.97497 56.54466 54.71571
2.0625 -0.25219 118.85599 -0.31245 56.191 52.79949 51.33268
2.4375 -0.83522 128.69258 -0.25648 51.74969 49.08243 48.20849
2.8125 -1.85809 137.75156 0.77103 49.7001 46.90939 45.64876
3.1875 -1.89991 146.87352 1.47779 46.63486 43.55836 43.00844
3.5625 -1.19149 156.74805 0.10385 44.90632 40.33132 40.23831
3.9375 -0.272 162.29732 0.1814 42.63932 37.82646 37.81737
4.3125 0.52538 168.12345 0.40706 41.12453 35.32473 36.41807
4.6875 0.21389 173.62325 -1.2779 39.29128 33.71914 34.66594
5.0625 0.18056 177.72675 -0.6854 37.76711 32.56269 32.59246
5.4375 0.66183 180.98229 -1.86352 36.17113 30.53349 30.75395
5.8125 0.58141 185.44617 -0.68253 34.54477 29.42612 29.31435
6.1875 0.72016 188.43316 -0.43038 33.61001 28.37083 28.41582
6.5625 0.26417 191.82716 -0.53022 32.26707 26.51936 25.67751
6.9375 0.18404 194.53992 -0.47987 30.75838 24.79459 25.13122
7.3125 -1.01843 195.45803 -0.16466 30.07813 23.37364 23.71544
7.6875 -1.96881 196.78765 -0.76206 28.58089 22.34104 22.49325
8.0625 -1.43949 199.33732 -1.41416 27.11777 21.30371 22.02337
8.4375 -1.58063 201.11102 -0.97155 26.10209 20.08565 20.55809
8.8125 -0.3646 201.82223 -1.32891 25.10259 19.08228 20.22374
9.1875 0.5494 202.53 -0.34226 24.51354 18.61954 18.8817
9.5625 1.95203 203.80576 -0.56544 23.34 18.95195 18.21897
9.9375 1.6251 205.1949 -0.52041 21.89021 17.80245 17.04593
10.3125 1.93667 205.63915 -0.02766 22.19028 16.93744 16.47867
10.6875 0.8322 205.60437 0.32829 20.96073 15.90435 15.76721
11.0625 -0.51792 205.20103 1.0123 20.75146 15.27902 14.87302
11.4375 -1.45108 205.52491 1.34774 20.08979 14.5049 14.36884
11.8125 -1.15226 205.79283 1.9618 18.91936 14.31939 13.65814
12.1875 -1.26347 207.08932 2.10592 17.72898 13.12256 12.68964
12.5625 -0.92438 207.82029 1.75473 16.31695 12.27935 12.28665
12.9375 0.52981 207.39902 2.87642 16.69663 12.54552 11.64041
13.3125 0.54843 207.34626 2.49252 15.47934 12.11523 11.49897
13.6875 -0.02205 207.38318 2.68225 15.71138 10.97846 10.8361
14.0625 -0.60217 206.63422 2.77809 14.95545 10.43501 10.9896
14.4375 -1.56815 206.26845 2.1844 14.68975 10.03399 10.28492
14.8125 -2.05434 206.85656 2.098 13.69828 10.50524 10.14154
15.1875 -1.02694 207.30615 0.67974 13.22077 9.65584 9.31032
15.5625 -0.19823 206.63256 0.76377 12.02287 9.99172 9.03287
15.9375 1.00874 207.13989 0.13337 12.5339 8.30815 8.3728
16.3125 0.61011 206.66914 0.65085 11.91509 8.54278 8.71505
16.6875 1.78326 207.33289 0.27956 11.45437 8.84125 8.62395
17.0625 3.04468 207.882 0.47472 11.05514 10.49274 8.05088
17.4375 3.5403 207.71455 0.68234 10.7796 9.15003 7.93077
17.8125 3.805 208.05254 0.26442 11.07491 8.61822 7.67624
18.1875 1.02923 207.44921 0.965 10.77643 9.01074 7.23179
18.5625 0.213 208.30432 0.0532 9.33931 7.76655 6.9011
18.9375 -1.8423 208.43651 -0.13975 8.99602 7.33633 7.13584
19.3125 -1.69901 208.18335 -0.30843 8.4177 6.68881 7.46972
19.6875 -2.47412 208.23265 -1.2196 8.35091 5.4421 6.2036
20.0625 -1.96378 206.81589 -0.54563 9.53381 6.72599 6.93674
20.4375 -3.40057 207.94368 -1.40166 8.3899 5.43664 6.42297
20.8125 -2.35537 206.1009 -1.01016 8.91696 5.22474 5.91525
21.1875 -1.29943 206.52672 -1.28546 9.11067 5.04699 6.65388
21.5625 -3.31238 205.87652 -1.30724 7.87141 4.87398 5.86927
21.9375 -2.63287 204.93316 -0.56567 8.88541 5.27337 5.55174
22.3125 -2.03641 205.20359 -0.57058 7.83171 5.50981 5.79804
22.6875 -1.77549 204.78172 -1.21616 7.00728 4.91571 5.93739
23.0625 -0.63301 203.30635 -0.02512 6.8386 4.28027 4.74943
23.4375 -0.28673 202.48453 -1.29293 7.3093 4.9768 6.03889
23.8125 2.86392 204.04486 -0.96555 6.76331 5.36685 5.94854
24.1875 2.43059 203.64188 -2.25613 5.89225 5.74264 4.98176
24.5625 3.38265 202.0802 -1.545 7.55054 5.39533 4.37603
24.9375 4.60393 203.43754 -1.01775 7.83819 4.50863 4.78067
25.3125 4.47461 205.24436 0.03598 7.07089 4.70515 5.29564
25.6875 1.86227 204.49276 -0.26346 7.20245 5.17668 4.18309
26.0625 3.11275 205.94942 -1.45272 6.23178 5.36186 5.58241
26.4375 1.9727 206.54466 -0.08244 5.59947 4.97451 5.10134
26.8125 1.95619 203.21479 -0.76203 7.47869 4.01505 3.86184
27.1875 -0.85582 206.15568 -1.01967 4.90903 3.9591 4.39899
27.5625 0.54972 204.25059 0.91417 5.2306 4.05577 4.71182
27.9375 -1.15317 204.38234 2.1671 6.39585 4.17572 3.99886
28.3125 -0.88042 204.04985 0.31093 6.3946 3.25886 4.34659
28.6875 -0.8716 204.48669 2.28994 3.85144 3.12946 3.39946
29.0625 -1.3848 203.49461 -0.92539 5.09814 2.58817 2.81285
29.4375 -0.67873 203.35483 2.13716 5.35211 5.03232 4.85703
29.8125 0.1213 203.7973 -1.87786 6.97749 3.47401 1.98651
