0.120000 0.622550
0.380000 1.340060
0.620000 1.004890
0.880000 0.949720
1.120000 1.029250
1.380000 1.026500
1.620000 1.000050
1.880000 0.965530
2.120000 0.999280
2.380000 1.015650
2.620000 1.019960
2.880000 1.002870
3.120000 1.016720
3.380000 0.992510
3.620000 1.004670
3.880000 1.007430
4.120000 1.038680
4.380000 1.039280
4.620000 1.052690
4.880000 1.047130
5.120000 1.061290
5.380000 1.128830
5.620000 1.143810
5.880000 1.162380
6.120000 1.190060
6.380000 1.212560
6.620000 1.183500
6.880000 1.148510
7.120000 1.100350
7.380000 1.063160
7.620000 1.013790
7.880000 1.019230
8.120000 1.019130
8.380000 0.985960
8.620000 0.927510
8.880000 0.974700
9.120000 0.921260
9.380000 0.912620
9.620000 0.897870
9.880000 0.791610
10.120000 0.205950
10.380000 -0.048100
10.620000 -0.151390
10.880000 -0.147450
11.120000 -0.208940
11.380000 0.091730
11.620000 0.031700
11.880000 -0.082210
12.120000 0.481960
12.380000 0.917560
12.620000 1.159840
12.880000 1.038030
13.120000 1.283850
13.380000 1.199720
13.620000 0.844800
13.880000 0.879940
14.120000 0.659960
14.380000 0.536520
14.620000 0.264410
14.880000 0.231360
