0.05000 2962.41886
0.15000 5517.44282
0.25000 7252.32193
0.35000 9167.08416
0.45000 10392.68844
0.55000 10861.55484
0.65000 11051.69745
0.75000 10992.89481
0.85000 10719.35344
0.95000 10523.06117
1.05000 10057.77608
1.15000 9697.96643
1.25000 9272.68029
1.35000 8761.61138
1.45000 8495.94966
1.55000 7951.44722
1.65000 7582.45922
1.75000 7268.13155
1.85000 6925.71926
1.95000 6677.53462
2.05000 6335.17791
2.15000 6118.82005
2.25000 5874.69533
2.35000 5611.65444
2.45000 5396.28522
2.55000 5162.85477
2.65000 4920.09123
2.75000 4720.05390
2.85000 4597.77716
2.95000 4340.91427
3.05000 4195.29005
3.15000 4042.60397
3.25000 3953.58291
3.35000 3715.40066
3.45000 3632.29846
3.55000 3490.39034
3.65000 3373.98812
3.75000 3217.39114
3.85000 3066.93464
3.95000 3013.81090
4.05000 2887.04701
4.15000 2740.50237
4.25000 2613.34608
4.35000 2551.44490
4.45000 2433.47614
4.55000 2307.82337
4.65000 2280.53603
4.75000 2134.25067
4.85000 2077.62307
4.95000 1959.96087
5.05000 1910.46046
5.15000 1833.10597
5.25000 1735.67235
5.35000 1655.39543
5.45000 1636.21299
5.55000 1553.47555
5.65000 1507.09017
5.75000 1447.54433
5.85000 1429.96987
5.95000 1354.00418
6.05000 1308.31963
6.15000 1267.68354
6.25000 1239.06522
6.35000 1203.61453
6.45000 1162.17866
6.55000 1112.99484
6.65000 1107.60098
6.75000 1060.11621
6.85000 1033.23166
6.95000 1035.31193
7.05000 1001.06000
7.15000 972.11158
7.25000 956.10876
7.35000 918.17560
7.45000 892.94284
7.55000 885.87196
7.65000 877.10841
7.75000 838.69744
7.85000 820.23426
7.95000 790.05344
8.05000 778.87213
8.15000 762.08213
8.25000 759.41715
8.35000 738.82183
8.45000 736.77443
8.55000 715.22021
8.65000 703.75676
8.75000 687.58105
8.85000 670.91622
8.95000 664.53168
9.05000 648.64684
9.15000 625.39941
9.25000 631.48640
9.35000 608.27583
9.45000 600.05254
9.55000 586.96020
9.65000 572.88225
9.75000 567.14311
9.85000 555.80560
9.95000 539.87598
10.05000 520.13506
10.15000 521.80817
10.25000 511.21730
10.35000 496.47575
10.45000 490.75230
10.55000 483.06062
10.65000 472.80746
10.75000 457.60457
10.85000 448.74300
10.95000 437.38727
11.05000 421.54338
11.15000 410.08588
11.25000 415.47510
11.35000 398.07974
11.45000 392.09325
11.55000 381.83814
11.65000 380.06198
11.75000 370.96443
11.85000 354.83869
11.95000 348.96210
12.05000 343.90929
12.15000 327.16205
12.25000 337.71690
12.35000 327.73688
12.45000 328.30757
12.55000 317.57076
12.65000 307.47016
12.75000 298.14540
12.85000 297.69236
12.95000 294.55063
13.05000 294.43009
13.15000 283.00016
13.25000 285.73607
13.35000 272.20943
13.45000 265.32090
13.55000 267.13635
13.65000 254.75707
13.75000 261.23746
13.85000 250.01417
13.95000 247.24264
14.05000 245.10102
14.15000 240.54049
14.25000 240.68654
14.35000 229.17904
14.45000 220.06513
14.55000 219.44358
14.65000 217.08008
14.75000 218.76029
14.85000 220.65587
14.95000 207.90346
15.05000 204.45655
15.15000 199.87450
15.25000 195.96105
15.35000 194.89392
15.45000 187.55113
15.55000 183.50631
15.65000 183.39091
15.75000 171.30449
15.85000 171.01466
15.95000 171.58174
16.05000 164.52741
16.15000 163.11736
16.25000 157.52071
16.35000 152.94264
16.45000 158.93633
16.55000 154.09733
16.65000 150.59314
16.75000 143.66410
16.85000 145.02754
16.95000 138.23323
17.05000 149.74932
17.15000 135.04520
17.25000 137.01642
17.35000 131.58714
17.45000 132.18640
17.55000 122.86307
17.65000 137.43866
17.75000 124.71756
17.85000 127.28634
17.95000 123.86757
18.05000 112.14183
18.15000 122.96874
18.25000 117.87303
18.35000 111.22693
18.45000 118.36434
18.55000 111.25661
18.65000 108.50980
18.75000 110.79092
18.85000 112.20441
18.95000 108.32266
19.05000 103.14915
19.15000 107.75717
19.25000 98.32953
19.35000 95.20063
19.45000 93.16844
19.55000 98.37963
19.65000 93.35217
19.75000 93.00695
19.85000 89.35930
19.95000 83.41438
