0.12500 0.00761
0.37500 0.03331
0.62500 0.10330
0.87500 0.13823
1.12500 0.17578
1.37500 0.21983
1.62500 0.26665
1.87500 0.29662
2.12500 0.34126
2.37500 0.36710
2.62500 0.40448
2.87500 0.44753
3.12500 0.47273
3.37500 0.49064
3.62500 0.50925
3.87500 0.50410
4.12500 0.51200
4.37500 0.50874
4.62500 0.50564
4.87500 0.48605
5.12500 0.47302
5.37500 0.46134
5.62500 0.44274
5.87500 0.41546
6.12500 0.39376
6.37500 0.37639
6.62500 0.37832
6.87500 0.36447
7.12500 0.34713
7.37500 0.33477
7.62500 0.30880
7.87500 0.26707
8.12500 0.22838
8.37500 0.20268
8.62500 0.16995
8.87500 0.14425
9.12500 0.11354
9.37500 0.11904
9.62500 0.11622
9.87500 0.09520
10.12500 0.09780
10.37500 0.10882
10.62500 0.10057
10.87500 0.11005
11.12500 0.10847
11.37500 0.11414
11.62500 0.11035
11.87500 0.09786
12.12500 0.09276
12.37500 0.08560
12.62500 0.06782
12.87500 0.05312
13.12500 0.00394
13.37500 0.05294
13.62500 0.04301
13.87500 0.08048
14.12500 0.10367
14.37500 0.09993
14.62500 0.12714
14.87500 0.13048
