0.05000 -2772.89665 284.81787 -70352.27141 2484.23675 1934.86732 1085005.36810
0.15000 -5782.16531 -12.88744 12276.00421 2457.29327 2343.09788 752461.34450
0.25000 -9253.77724 193.63352 16812.58593 2651.50054 2669.38949 1032678.44815
0.35000 -11933.44151 37.54085 -26445.81352 2548.82154 2901.52772 770405.57627
0.45000 -13959.96048 -35.77597 -14316.22467 2399.20030 3058.59774 823708.01500
0.55000 -15308.59379 87.13710 6150.04108 2189.12094 3214.44207 679673.42273
0.65000 -16271.11396 83.84432 1785.43046 2118.79117 3273.31057 674733.89340
0.75000 -16778.11757 98.69788 7906.71556 2104.15345 3245.52020 611226.07564
0.85000 -16908.82437 -0.09243 2266.90382 2023.04056 3326.86590 606018.52292
0.95000 -16898.05059 68.42122 -1697.30780 1823.66152 3296.72101 519677.02358
1.05000 -16766.77378 25.87685 5478.80160 1564.54603 3264.76590 483886.39021
1.15000 -16452.46826 92.72217 14943.21476 1408.83644 3183.75857 450214.97656
1.25000 -16156.66568 184.29826 822.68257 1220.56323 3057.46545 434903.28255
1.35000 -15735.83764 116.00707 423.70300 1074.05836 3031.25302 396090.65662
1.45000 -15273.69592 38.50532 -1791.92550 939.20011 2956.30652 377599.75873
1.55000 -14801.31679 150.18258 -322.70189 863.89159 2803.72130 316815.35950
1.65000 -14385.73408 61.17527 8770.12385 780.26490 2702.06187 350086.82078
1.75000 -14003.44942 -18.34767 8332.94299 670.97400 2603.39409 300928.75492
1.85000 -13594.20626 33.66509 -703.10581 599.83561 2552.90409 278728.89314
1.95000 -13218.16917 -3.95887 -586.68497 534.58948 2480.97674 286574.07642
2.05000 -12865.77260 35.19215 4458.77868 477.94324 2368.12732 254470.53071
2.15000 -12516.33195 58.76356 -4202.94309 431.02299 2294.83354 234525.42389
2.25000 -12172.38398 107.30742 327.25532 422.94055 2193.74025 240630.42027
2.35000 -11819.88959 67.42964 -1655.18350 411.97327 2138.34730 201675.65440
2.45000 -11489.50858 38.33415 1424.40931 385.67271 2021.92841 198539.19125
2.55000 -11180.80760 88.03710 -7300.82371 352.57226 2015.24631 190989.64237
2.65000 -10915.39103 64.88340 -1238.70277 337.03133 1941.48640 175962.48037
2.75000 -10651.99661 61.42506 -971.14984 337.95369 1873.97736 159675.14861
2.85000 -10386.24043 -6.81596 -3274.46249 331.45242 1824.53453 162339.25587
2.95000 -10127.15639 5.01168 1288.68960 299.02900 1750.18719 166169.69807
3.05000 -9902.85197 47.14243 -450.42298 277.58387 1677.53043 147497.11633
3.15000 -9680.13647 -22.46579 1132.44796 270.14644 1658.05888 139376.10397
3.25000 -9464.79630 91.75284 988.42878 280.92161 1602.97032 141800.41612
3.35000 -9260.65274 44.51371 -109.87557 279.94370 1581.19146 125529.03470
3.45000 -9076.21797 56.93228 -612.76837 289.88646 1493.68080 122590.24278
3.55000 -8893.90116 86.92816 2695.93169 308.61413 1482.93065 129922.43683
3.65000 -8712.40811 76.59886 -2202.83899 326.71053 1385.00235 121699.07438
3.75000 -8549.46253 82.55583 3546.10071 323.75106 1369.60337 141830.11430
3.85000 -8387.06209 129.40996 -581.52119 323.20056 1334.85501 110655.74252
3.95000 -8238.40578 31.73273 2057.09070 346.51372 1286.26576 113542.61583
4.05000 -8072.21507 73.35503 1163.68454 347.20496 1259.48097 112901.97393
4.15000 -7960.62310 84.85243 -505.55206 353.32245 1214.51792 100741.44381
4.25000 -7811.47251 126.33361 -2462.03849 382.56713 1157.45013 93969.51135
4.35000 -7675.13318 59.86845 -4058.60441 374.01781 1147.05431 101481.04678
4.45000 -7526.12220 66.35889 -2289.70309 390.75930 1083.93472 112287.43732
4.55000 -7400.11537 113.83718 -4596.87454 392.67337 1065.01374 101127.69129
4.65000 -7263.94520 67.56256 -1363.72274 396.44850 1023.06406 101619.30734
4.75000 -7124.72995 83.98042 -3570.20893 400.93840 990.26119 108870.73659
4.85000 -7026.16836 51.65071 -1863.65015 410.31287 976.17049 95300.12924
4.95000 -6922.03883 62.44472 -3107.80415 409.50736 924.23296 86954.64001
5.05000 -6821.30711 54.41608 -1790.07457 419.25724 919.83613 84613.44494
5.15000 -6707.54531 46.60467 -670.69229 413.39126 872.38724 78963.99270
5.25000 -6608.55702 60.63757 -3082.83071 415.15505 857.40583 74259.00149
5.35000 -6518.17489 61.54202 -746.68541 419.92961 821.14551 75643.60500
5.45000 -6449.41033 75.52832 -5592.12109 416.83037 812.59213 82264.63272
5.55000 -6326.91203 79.95567 -5188.48975 419.26354 785.57621 59018.51348
5.65000 -6265.80108 57.56802 -4447.92402 406.82738 798.61933 60447.59365
5.75000 -6189.50522 66.66085 -3598.18983 411.41660 759.07007 61278.62841
5.85000 -6116.65474 50.92389 -6740.25678 403.33044 746.66024 60408.62320
5.95000 -6067.72653 22.39612 -5699.20068 419.35584 722.30672 55720.41437
6.05000 -5997.81459 62.06565 -6909.92176 401.36896 721.69528 49601.63380
6.15000 -5953.75048 52.40366 -4149.57890 391.40100 700.42322 47554.53811
6.25000 -5914.48540 41.55310 -5957.41960 385.56833 697.19452 51534.54698
6.35000 -5877.91752 27.80768 -5519.18220 388.78197 674.56100 43067.27288
6.45000 -5866.06198 25.28528 -5623.31544 410.21763 662.88831 48235.73789
6.55000 -5858.64467 38.51216 -4946.47807 437.44542 644.74599 36378.86861
6.65000 -5827.98770 40.92852 -4936.25485 467.53404 618.24105 40903.75229
6.75000 -5818.72491 22.59712 -3676.26485 495.60667 592.71373 35470.85914
6.85000 -5798.48750 34.79497 -4350.95093 524.98007 572.14516 31093.28524
6.95000 -5775.91146 34.05680 -3047.50465 556.90265 548.87533 33158.40283
7.05000 -5705.59022 24.27830 -4174.45097 578.55909 511.78541 28468.21962
7.15000 -5682.55059 37.70111 -3908.30532 579.23239 495.21486 32647.59751
7.25000 -5609.19655 54.00732 -2328.10346 575.07971 462.62036 26102.66082
7.35000 -5548.07821 53.87244 -2446.60880 574.20447 427.76795 27044.16289
7.45000 -5478.76360 59.75515 -2305.69587 552.89941 406.28126 23191.46015
7.55000 -5402.93498 68.21988 -3597.80319 533.41885 381.00773 27112.47756
7.65000 -5340.55350 46.85370 -2094.08448 506.67671 359.26400 23021.75430
7.75000 -5275.11552 57.18036 -2002.31082 476.53874 331.19599 22763.07036
7.85000 -5230.60319 49.43211 -2108.71661 446.35598 318.42498 25414.90561
7.95000 -5178.81990 77.71055 -2201.55277 426.47780 305.13531 22774.36620
8.05000 -5097.37375 58.01255 -1053.66718 403.65291 276.07254 20034.04080
8.15000 -5031.82240 62.08827 -2833.66493 393.76113 270.51613 21352.53045
8.25000 -5001.37370 53.10675 -2125.38455 377.93867 259.92050 20122.37029
8.35000 -4908.35475 66.67047 -2358.31506 342.66237 243.46150 20387.40980
8.45000 -4856.38560 64.01786 -1795.28062 326.54752 225.54971 19915.71326
8.55000 -4820.00807 53.65143 -801.69797 313.01495 221.11242 20458.96893
8.65000 -4772.55368 53.50913 -1185.29044 296.74515 217.37094 16367.98810
8.75000 -4712.94993 48.78642 -2222.92569 273.42721 204.44398 15005.33776
8.85000 -4662.82963 52.96088 -746.55557 266.02876 190.44089 20720.22295
8.95000 -4626.19190 47.35337 -1861.05246 256.40192 193.08338 12069.08340
9.05000 -4576.29407 52.43584 -1607.11427 244.48804 182.74632 14814.07105
9.15000 -4558.08066 44.11747 -946.06550 247.51194 177.21249 15422.43636
9.25000 -4505.34657 53.78863 -1604.72929 222.65138 170.30537 15505.27744
9.35000 -4471.44209 41.97444 -725.44716 210.61790 165.63506 11026.45909
9.45000 -4433.09640 47.32036 -682.90317 202.26617 159.53940 12385.43129
9.55000 -4407.02999 40.30019 -495.40728 199.46938 154.77336 11287.53117
9.65000 -4366.11449 43.16122 -756.97874 194.21589 145.92191 9890.93014
9.75000 -4332.51903 41.53925 -917.62438 185.29425 145.77684 10120.66148
9.85000 -4284.48197 38.42077 -510.86569 181.24128 137.44219 12029.42395
9.95000 -4244.75715 40.00798 -1042.28126 176.46464 133.05570 10164.27214
10.05000 -4203.39722 35.64608 -44.09641 167.50832 132.77332 9689.66851
10.15000 -4176.84033 41.83734 -507.41829 158.45699 132.33078 12060.85781
10.25000 -4143.29188 37.33895 -220.06933 158.08202 126.49024 8829.32453
10.35000 -4102.30605 36.35739 -412.42233 149.87602 126.08812 7944.03349
10.45000 -4075.68931 35.05480 -416.04448 148.57578 121.08919 7071.71084
10.55000 -4041.32595 31.69803 -421.73964 138.37124 118.98206 9996.44389
10.65000 -4008.18818 30.90009 9.77490 134.70612 113.65494 8637.03046
10.75000 -3991.16828 29.63387 -194.93799 127.43722 110.29732 8197.80988
10.85000 -3958.28425 35.76027 -9.07339 136.01486 114.20281 6774.94392
10.95000 -3929.56077 31.45179 104.03876 132.40617 112.27072 7672.04358
11.05000 -3891.79273 36.97073 -647.25792 132.69712 104.99671 10095.78080
11.15000 -3866.22906 33.47796 -146.55321 134.22669 103.68009 12153.51707
11.25000 -3826.24961 31.93555 64.02649 126.51000 99.98125 8356.12270
11.35000 -3803.06491 27.22694 -436.71324 124.31788 103.49638 7592.27200
11.45000 -3777.67562 33.44026 -591.37662 116.76745 98.98312 10005.83294
11.55000 -3742.77389 31.62186 12.91301 110.53552 100.15620 8700.43334
11.65000 -3713.01506 32.41715 109.71478 110.00219 97.55586 11444.17496
11.75000 -3701.23838 24.81594 204.81380 110.66264 100.52488 7517.21043
11.85000 -3666.45286 35.46712 589.91100 107.48350 95.83960 7214.41945
11.95000 -3644.34260 35.19115 389.31646 108.85093 92.45322 7042.54413
12.05000 -3616.00709 28.00105 294.12842 111.58733 91.04033 6213.57732
12.15000 -3580.83576 31.56660 344.18324 107.73659 89.47830 5853.72959
12.25000 -3556.94784 25.81972 -175.39643 116.12357 84.92681 6488.23142
12.35000 -3525.66151 30.80162 51.99551 104.81967 81.80141 10616.39523
12.45000 -3505.85822 20.17210 -194.05528 99.10113 80.84860 6992.76898
12.55000 -3466.45639 28.81272 -239.79890 98.89456 79.40392 8176.90338
12.65000 -3439.90834 26.16931 -631.11566 94.61941 75.83350 6205.07424
12.75000 -3417.90917 28.09955 150.36250 89.03409 75.50463 5080.54055
12.85000 -3394.08357 15.96715 96.14152 89.66242 73.99107 5462.29078
12.95000 -3362.73612 28.51706 185.02197 81.48036 75.58199 7184.35111
13.05000 -3336.55795 26.21137 -24.70399 86.84693 78.12090 6348.14968
13.15000 -3313.67271 22.17666 -13.73870 80.74842 72.47352 4427.94709
13.25000 -3279.67513 20.74248 -254.94708 79.38455 74.88939 4300.40950
13.35000 -3259.91780 25.96134 70.84773 85.26415 70.08629 6434.50530
13.45000 -3241.30580 15.67555 672.33463 89.06793 72.29004 11642.21979
13.55000 -3223.92532 20.81134 102.02516 85.16508 73.32568 6337.39406
13.65000 -3193.83106 24.51243 188.92071 88.12114 72.48016 4614.38888
13.75000 -3177.82315 18.05442 -395.29832 83.69654 74.85709 4419.22615
13.85000 -3143.82197 27.21905 149.97999 86.43635 65.28176 4593.03782
13.95000 -3123.55623 17.92942 141.85495 79.98308 61.20069 4450.18230
14.05000 -3096.03891 22.53851 -569.71612 83.49465 64.21432 5482.75356
14.15000 -3082.94825 21.18348 123.38830 82.26753 57.05711 5058.36749
14.25000 -3055.66100 21.41181 100.45817 80.64642 59.73920 4141.68119
14.35000 -3031.75712 20.82802 431.18903 86.83727 62.03463 4542.42137
14.45000 -3012.40511 19.83447 530.37529 83.33870 56.41471 3608.81101
14.55000 -2993.10489 28.65984 196.50589 80.85620 61.92301 4398.72814
14.65000 -2975.12086 18.88831 168.57209 82.73327 58.50480 3055.91411
14.75000 -2942.52389 21.23460 308.14358 83.65751 59.02538 3880.65055
14.85000 -2933.37129 24.96231 71.63669 76.42357 59.61503 3605.94176
14.95000 -2903.01117 20.70445 374.32377 72.81101 57.59432 3995.19614
15.05000 -2889.05296 22.36604 144.95598 77.40374 57.13450 2689.34877
15.15000 -2863.76272 25.85808 91.00706 73.53306 56.01736 4920.76175
15.25000 -2847.80545 19.17312 267.15851 75.53674 54.28403 3496.86490
15.35000 -2831.22810 25.29599 -172.56603 73.83381 53.67156 3951.66391
15.45000 -2807.28562 18.42230 -218.49173 69.81343 55.72115 4289.66691
15.55000 -2794.42084 24.21541 -110.75519 70.60365 53.69415 3222.03356
15.65000 -2773.01483 29.88983 157.77142 63.64817 53.17353 3625.03691
15.75000 -2758.84360 22.65002 385.28286 69.01466 52.09810 4084.31826
15.85000 -2740.21873 23.74020 231.38899 68.91018 53.88753 3775.63477
15.95000 -2725.24278 26.09058 -154.52151 66.70338 51.83654 3231.10803
16.05000 -2701.12496 22.00300 -344.87913 73.02845 49.10875 4379.42256
16.15000 -2690.84582 21.98378 22.39502 66.26344 48.12053 3647.96355
16.25000 -2664.53113 26.21704 158.47610 62.20410 54.32077 3037.32654
16.35000 -2662.59393 27.13841 -528.29877 65.38313 54.26472 3760.70869
16.45000 -2643.93079 27.11085 -236.26413 66.52542 43.60676 2660.04600
16.55000 -2630.52178 21.33465 -274.97579 63.33982 55.65044 2771.79887
16.65000 -2617.03434 26.74252 299.27223 60.93868 45.36685 3616.15101
16.75000 -2599.32936 20.11355 -121.54413 57.20388 50.29794 2824.67824
16.85000 -2587.29870 21.10707 -142.10981 53.20711 44.88059 3271.30655
16.95000 -2564.95667 19.69735 257.80210 52.56937 46.69279 5215.78926
17.05000 -2546.12040 20.32732 -140.85042 50.56149 40.89088 3786.40633
17.15000 -2538.68203 23.00638 25.17511 51.52310 46.53099 2526.85974
17.25000 -2519.71113 23.13831 -529.62913 55.34270 41.74938 3078.62010
17.35000 -2508.72727 15.92395 -396.69581 54.02116 52.89130 3647.34336
17.45000 -2494.71791 17.40378 -205.61138 43.21817 41.69257 3147.82233
17.55000 -2479.12013 22.68471 -52.49243 48.88410 44.76647 2347.18500
17.65000 -2464.32991 12.16917 -63.86314 42.33260 46.33914 2316.64430
17.75000 -2448.00728 17.76705 -85.68735 46.21440 45.38962 2979.87785
17.85000 -2437.83414 14.52846 -38.90848 37.82124 37.86929 1864.32544
17.95000 -2414.15590 18.40576 -292.11470 45.02916 39.10601 3499.31759
18.05000 -2403.00547 17.00276 9.51860 46.90777 44.20018 1807.53696
18.15000 -2388.11498 14.52112 221.59352 49.55621 34.67983 1599.54365
18.25000 -2369.74028 13.38244 -345.81890 49.21862 43.26388 2846.59217
18.35000 -2363.50852 18.87257 -98.74621 47.08028 40.21089 1520.25262
18.45000 -2350.73158 11.70162 -136.61545 52.14357 44.64313 1932.34673
18.55000 -2332.07672 14.10108 -200.21221 41.44258 38.41630 1920.16260
18.65000 -2319.00519 10.95530 -110.42609 44.10874 38.37789 1345.06072
18.75000 -2299.30291 25.08739 93.10293 47.39855 38.82094 1448.75146
18.85000 -2286.22406 14.99607 70.66830 50.95290 40.26637 2474.83304
18.95000 -2285.46385 16.31903 87.99547 42.93029 38.87428 1612.48037
19.05000 -2270.26086 8.64929 40.06232 38.58810 44.63169 925.17049
19.15000 -2248.31537 16.42899 -31.51780 45.75710 55.35903 1669.36211
19.25000 -2239.01329 21.74923 133.05616 54.60655 49.19835 1742.87324
19.35000 -2230.29886 4.39916 -171.81143 38.08788 52.36796 1140.75190
19.45000 -2216.28459 7.54581 75.71073 43.18913 39.26755 1397.34956
19.55000 -2212.82926 14.19460 31.31317 35.24297 41.82570 1425.93490
19.65000 -2191.71264 17.65645 168.24852 44.48444 40.90648 1647.97554
19.75000 -2179.18928 9.69866 -391.23105 41.43366 41.67268 2976.21725
19.85000 -2173.81354 15.26174 -162.77700 44.24801 40.87013 1399.97384
19.95000 -2160.17571 20.39764 55.69338 43.61092 45.05951 1059.21251
