0.125 0.001 -0.000 0.003
0.375 -0.000 0.003 0.051
0.625 -0.007 -0.007 0.287
0.875 0.011 -0.005 0.760
1.125 0.044 -0.070 1.484
1.375 0.031 -0.048 2.389
1.625 0.086 -0.085 3.219
1.875 0.094 -0.084 4.141
2.125 0.117 -0.045 4.895
2.375 0.113 -0.105 5.519
2.625 0.098 -0.123 6.117
2.875 0.118 -0.101 6.586
3.125 0.159 -0.012 6.808
3.375 0.168 -0.111 7.308
3.625 0.136 -0.147 7.359
3.875 0.205 -0.109 7.604
4.125 0.118 -0.172 7.815
4.375 0.187 -0.133 7.901
4.625 0.183 -0.148 8.209
4.875 0.145 -0.109 8.339
5.125 0.172 -0.154 8.508
5.375 0.238 -0.097 8.589
5.625 0.198 -0.195 8.859
5.875 0.228 -0.128 8.876
6.125 0.223 -0.210 9.531
6.375 0.184 -0.210 9.607
6.625 0.262 -0.161 10.387
6.875 0.213 -0.199 10.763
7.125 0.298 -0.145 11.157
7.375 0.240 -0.269 12.129
7.625 0.294 -0.236 13.168
7.875 0.407 -0.228 14.268
8.125 0.355 -0.224 15.423
8.375 0.365 -0.290 16.584
8.625 0.461 -0.312 18.457
8.875 0.469 -0.329 20.340
9.125 0.518 -0.312 22.056
9.375 0.564 -0.291 23.295
9.625 0.537 -0.410 24.445
9.875 0.561 -0.382 24.735
10.125 0.563 -0.432 23.890
10.375 0.523 -0.382 22.784
10.625 0.467 -0.407 22.098
10.875 0.490 -0.432 21.374
11.125 0.449 -0.464 20.621
11.375 0.398 -0.469 19.459
11.625 0.444 -0.432 19.510
11.875 0.505 -0.404 19.158
12.125 0.457 -0.436 18.932
12.375 0.465 -0.415 17.907
12.625 0.438 -0.375 17.203
12.875 0.473 -0.411 17.454
13.125 0.478 -0.354 16.562
13.375 0.486 -0.316 16.242
13.625 0.435 -0.323 15.669
13.875 0.436 -0.325 15.724
14.125 0.436 -0.266 15.344
14.375 0.439 -0.305 15.766
14.625 0.429 -0.270 15.177
14.875 0.420 -0.309 15.218
