0.125 -0.001 0.001 0.015
0.375 0.006 0.008 0.201
0.625 0.001 0.021 0.606
0.875 -0.016 0.034 1.084
1.125 0.002 0.041 1.622
1.375 0.001 0.045 2.062
1.625 -0.017 0.058 2.544
1.875 0.006 0.067 3.047
2.125 -0.031 0.034 3.856
2.375 -0.034 0.074 4.693
2.625 -0.066 0.117 5.724
2.875 -0.039 0.083 6.959
3.125 -0.005 0.126 8.521
3.375 -0.107 0.138 10.262
3.625 -0.109 0.170 11.971
3.875 -0.080 0.176 13.796
4.125 -0.087 0.155 15.168
4.375 -0.106 0.214 17.325
4.625 -0.109 0.237 18.711
4.875 -0.121 0.273 20.180
5.125 -0.183 0.290 21.297
5.375 -0.188 0.304 22.210
5.625 -0.181 0.308 22.904
5.875 -0.226 0.382 23.481
6.125 -0.188 0.421 24.017
6.375 -0.225 0.420 24.691
6.625 -0.259 0.347 25.220
6.875 -0.212 0.357 25.459
7.125 -0.291 0.344 26.078
7.375 -0.265 0.376 25.545
7.625 -0.315 0.357 26.020
7.875 -0.346 0.319 25.223
8.125 -0.344 0.356 25.305
8.375 -0.268 0.235 25.228
8.625 -0.333 0.334 25.033
8.875 -0.305 0.208 25.437
9.125 -0.330 0.280 25.495
9.375 -0.336 0.244 26.338
9.625 -0.342 0.185 25.905
9.875 -0.318 0.164 26.025
10.125 -0.256 0.189 25.714
10.375 -0.285 0.158 25.416
10.625 -0.265 0.107 24.792
10.875 -0.243 0.155 24.414
11.125 -0.228 0.171 23.540
11.375 -0.228 0.182 23.460
11.625 -0.124 0.170 21.910
11.875 -0.145 0.153 20.863
12.125 -0.162 0.166 20.518
12.375 -0.133 0.177 19.336
12.625 -0.099 0.235 18.390
12.875 -0.125 0.188 17.836
13.125 -0.116 0.191 17.245
13.375 -0.106 0.207 17.053
13.625 -0.090 0.233 16.663
13.875 -0.145 0.206 16.608
14.125 -0.148 0.233 16.749
14.375 -0.092 0.269 16.399
14.625 -0.134 0.260 16.182
14.875 -0.154 0.199 15.333
