0.05000 -2135.49504 72.52740 -228957.69773 3696.25047 1882.56296 1370251.58090
0.15000 -3611.01920 128.93492 -1686.80589 3429.91657 1885.85617 877114.84841
0.25000 -4958.21903 93.88395 -42843.54564 3230.58843 1986.80069 746577.76296
0.35000 -6353.22277 9.74818 -4610.58992 2780.32566 2067.29994 736994.89778
0.45000 -7644.71203 -65.43549 -17287.82310 2599.28505 2263.63265 711722.82876
0.55000 -8601.13417 48.21629 -12191.57833 2420.53783 2425.29152 699746.14988
0.65000 -9307.46599 40.51516 -19769.94927 2337.99030 2496.93102 686949.48319
0.75000 -9962.90906 20.98824 -25364.44671 2297.22877 2596.00634 636046.32733
0.85000 -10399.08159 116.75730 -16064.00839 2361.22491 2646.02021 648639.12455
0.95000 -10617.41124 30.48142 -24935.78503 2419.79225 2700.91399 700972.56647
1.05000 -10732.00611 59.92234 -6166.27118 2342.94199 2788.93433 635640.56391
1.15000 -10729.20152 82.86877 -9934.09685 2287.36450 2866.93236 609628.56697
1.25000 -10682.10794 28.77049 -19882.54545 2238.00648 2868.07098 570601.44861
1.35000 -10623.60663 134.04324 -5653.44014 2104.40994 2942.39705 529903.96054
1.45000 -10549.98279 122.29876 -4558.83085 2001.99932 2987.26192 542503.87844
1.55000 -10448.02802 55.69760 -870.15712 1866.90479 3017.97009 470237.91594
1.65000 -10345.35435 99.32232 3606.48988 1786.65738 3040.20442 449437.33433
1.75000 -10322.03060 36.45090 11836.22538 1661.99212 3025.76791 446648.42713
1.85000 -10263.53376 81.18027 12092.43965 1556.50308 3013.46672 430572.70773
1.95000 -10152.67351 52.45283 6275.61102 1440.19191 3022.64505 404149.77631
2.05000 -10089.27245 54.97165 14134.79346 1330.72641 3007.94881 406760.70309
2.15000 -10009.96187 157.96141 12457.80104 1219.68684 2986.23709 388575.86171
2.25000 -9879.95717 119.95533 18086.39340 1144.50005 2978.03569 371541.49444
2.35000 -9787.26403 87.12735 26715.87563 1059.51154 2945.34101 350260.12167
2.45000 -9715.37995 116.04149 17983.92970 966.06629 2926.07547 337736.10027
2.55000 -9617.24240 42.09621 21242.19173 887.11867 2923.05348 333025.00479
2.65000 -9523.01369 92.31791 16695.44655 817.85260 2854.73551 279218.90165
2.75000 -9409.52770 66.76807 23988.25520 746.99316 2822.54500 297248.61734
2.85000 -9311.37498 3.24689 16458.18049 703.52398 2795.87837 263937.13903
2.95000 -9190.71365 57.97172 19159.20542 664.32934 2757.96508 272680.75492
3.05000 -9065.04521 -16.17936 20101.83986 634.41168 2714.70902 261670.48820
3.15000 -8942.08781 -23.91367 21514.06712 617.47563 2673.98629 254480.38937
3.25000 -8799.01673 -24.71010 17566.31350 591.42796 2643.57452 231891.02608
3.35000 -8678.00763 7.39995 18650.60117 589.09878 2587.62490 232980.99375
3.45000 -8551.77094 -51.49014 16702.54371 566.54779 2539.56041 220495.00557
3.55000 -8456.83282 -1.78392 18818.37565 547.31360 2508.68777 201588.44951
3.65000 -8344.80231 -13.28964 13845.11082 539.53658 2458.72954 195639.65153
3.75000 -8254.01557 41.58237 15233.03176 520.66232 2442.25301 197929.97475
3.85000 -8180.76978 -5.92547 15954.38095 518.29242 2400.46916 181512.42250
3.95000 -8079.52548 26.57656 16531.12318 527.27548 2356.04223 175232.71801
4.05000 -8006.77543 75.58252 14694.64469 536.38394 2304.04841 172788.19510
4.15000 -7910.97985 -6.50322 13690.00933 561.56254 2202.22089 151876.96770
4.25000 -7837.75907 -22.68795 9957.37026 585.81721 2154.13781 147566.60356
4.35000 -7732.64966 -31.54680 8714.93605 607.58786 2106.30637 149181.94961
4.45000 -7667.90133 15.57864 9379.84006 633.61720 2050.82669 140961.71885
4.55000 -7562.92587 -51.73493 9524.26110 652.90507 1955.54812 135291.78133
4.65000 -7472.84577 -3.94490 4717.86658 668.08063 1863.49030 140998.35219
4.75000 -7391.74712 -29.54060 9416.68728 689.07657 1834.64307 117835.10972
4.85000 -7279.17202 -56.82875 7505.15337 720.37414 1719.36882 113133.34979
4.95000 -7197.06406 -87.71020 3625.46394 745.06173 1661.26379 115954.27703
5.05000 -7118.99491 -78.45116 4343.86509 762.05336 1634.33764 109055.74295
5.15000 -7033.27157 -70.99117 4447.73550 780.86520 1555.03144 97912.46666
5.25000 -6945.82226 -75.12133 3877.90893 793.76573 1481.36325 104470.51198
5.35000 -6886.18086 -64.63079 1273.76801 809.63380 1424.62343 109833.66795
5.45000 -6825.71653 -50.85227 1013.36892 826.20903 1374.11546 90822.28609
5.55000 -6755.65383 -54.42561 362.97440 846.74809 1306.84349 96846.26569
5.65000 -6671.51901 -35.67641 568.89110 870.40332 1241.25014 79680.10003
5.75000 -6590.22715 -23.06606 188.93075 876.70034 1175.19843 81386.84388
5.85000 -6524.80888 5.77866 1026.50823 866.20037 1125.28680 104583.62795
5.95000 -6453.34522 -8.11539 -157.38481 859.74712 1056.80901 85322.60960
6.05000 -6386.39206 25.07526 268.55500 850.80362 1008.58375 68068.96786
6.15000 -6302.93376 -11.36165 691.62516 837.11758 941.97082 67230.08713
6.25000 -6235.67378 9.58306 607.26968 816.00905 883.66697 64222.92204
6.35000 -6146.11567 6.66909 -888.53313 780.70523 838.05643 67062.92217
6.45000 -6093.69103 6.28673 -785.88126 759.05794 793.39007 64152.33229
6.55000 -6012.31964 -10.13211 -371.32401 728.51600 748.41998 67871.34371
6.65000 -5960.95870 17.13438 -1324.54499 723.32936 712.38082 60859.47777
6.75000 -5917.26732 0.94791 -258.99135 703.48291 676.65689 54302.64302
6.85000 -5854.71294 18.05393 -1012.44675 675.90774 640.28011 53157.65832
6.95000 -5787.15721 12.87226 -1603.73584 646.34514 606.37915 52975.99878
7.05000 -5738.11059 7.22849 -479.67938 613.60791 573.66435 51752.37490
7.15000 -5679.43168 16.52710 -1251.46872 588.36612 542.15536 51459.44106
7.25000 -5634.02956 9.03366 -1307.50214 560.19783 517.63605 49461.55566
7.35000 -5588.89547 8.39142 -1659.08492 535.47524 495.33496 42008.29887
7.45000 -5551.73276 21.52663 -1716.53714 519.80426 475.11869 42001.29828
7.55000 -5523.50516 10.36937 -1617.74160 503.46570 455.74768 57037.34535
7.65000 -5475.21145 19.99502 -632.24113 484.96800 434.02026 41721.90097
7.75000 -5453.28240 25.68805 -522.88136 480.55228 413.23529 49304.47583
7.85000 -5402.42674 22.83389 -1028.72016 473.14070 394.80635 53443.82968
7.95000 -5368.23109 20.49454 -241.56037 452.83057 377.91398 31955.45107
8.05000 -5341.86629 26.56527 -567.16038 447.96447 361.40795 38878.52552
8.15000 -5301.82418 38.40155 -1996.85850 441.20012 343.06363 90340.59778
8.25000 -5271.97019 36.75145 -804.41417 443.72616 324.34218 33542.62303
8.35000 -5230.95900 39.17569 -162.50597 440.47286 307.93261 29992.29422
8.45000 -5184.86601 35.50180 -594.44634 428.12179 294.68402 27361.89446
8.55000 -5140.51226 37.35967 -313.07252 415.01211 282.23572 26971.06854
8.65000 -5109.52911 33.52172 -568.69954 409.31591 267.91440 24548.62372
8.75000 -5058.64802 34.31801 -675.89628 401.07796 256.76940 23631.73413
8.85000 -5027.46111 29.66360 -310.85582 392.16172 242.64829 23405.21816
8.95000 -4983.90563 32.00397 -211.48239 382.71217 229.25547 31303.95533
9.05000 -4937.42978 33.18156 -712.78246 376.19770 217.09578 40468.97040
9.15000 -4900.99620 37.26221 123.31006 360.18392 210.59023 20628.34689
9.25000 -4853.83980 26.05749 -202.69016 349.53702 199.52988 23692.16543
9.35000 -4811.72133 32.23457 -520.68526 347.27342 188.88854 19395.70594
9.45000 -4776.31062 32.40956 17.67451 338.79611 180.02279 22584.51652
9.55000 -4722.72583 26.26414 86.09528 324.32606 171.13210 19585.28257
9.65000 -4685.44868 25.04103 -600.56851 313.64430 164.70563 19077.29545
9.75000 -4639.72218 26.92783 -451.08607 297.97137 158.91615 18099.94813
9.85000 -4613.16966 19.73760 716.48963 294.32288 151.46626 18284.36664
9.95000 -4570.26804 20.74660 392.70921 282.97766 142.79663 15982.83559
10.05000 -4529.52516 19.28480 8.49448 271.99838 137.88135 19402.23348
10.15000 -4486.66052 20.30291 300.73502 257.99904 132.06287 18751.14416
10.25000 -4452.07888 15.45130 262.08400 248.12737 125.40662 13650.81940
10.35000 -4410.38330 21.60038 135.54518 236.34206 120.02747 14870.85510
10.45000 -4376.46508 16.55525 -84.80519 224.70603 116.12818 14861.09729
10.55000 -4344.91725 14.75475 -376.87781 210.62281 110.93699 14659.33148
10.65000 -4310.20904 16.05570 528.16044 197.20417 107.06716 13571.77625
10.75000 -4270.35145 11.33458 366.31808 186.29856 102.47707 11520.28764
10.85000 -4236.72393 9.95107 34.87854 178.65842 99.28051 13786.47207
10.95000 -4201.50003 12.52260 153.02989 173.47929 93.61973 12385.84170
11.05000 -4171.74045 9.21125 56.88390 162.33842 93.53877 10531.82473
11.15000 -4136.37111 7.31438 -319.26384 153.47279 89.93584 22058.45277
11.25000 -4101.64159 7.54064 150.88323 146.90226 85.61188 10999.96959
11.35000 -4068.19657 3.60648 179.17027 141.63396 83.31091 11167.56629
11.45000 -4034.74789 8.09791 232.74516 140.08764 80.05545 11377.34735
11.55000 -4006.41122 5.12793 125.06595 137.15925 79.07793 11566.73231
11.65000 -3970.24456 5.18232 590.58524 131.87217 76.01823 11177.09353
11.75000 -3942.99751 5.42224 -81.10625 130.30811 73.78918 9020.87226
11.85000 -3903.98349 6.72467 -215.51815 124.00155 70.28155 11836.17382
11.95000 -3872.06905 5.17074 -232.23137 125.35411 69.46795 10545.63909
12.05000 -3837.11276 7.96324 378.56750 124.24415 68.26005 11089.22193
12.15000 -3808.95357 7.20883 -282.21470 125.24305 65.00147 9777.70000
12.25000 -3780.40972 6.66104 -28.55033 125.76161 62.17974 8132.84186
12.35000 -3751.12731 7.19487 -158.64707 128.31645 61.85206 10804.47832
12.45000 -3714.08637 10.89516 -280.88090 126.71563 59.08662 9717.12951
12.55000 -3685.06429 8.86810 -86.24479 127.14932 57.66710 8433.44176
12.65000 -3655.40045 7.18437 118.56016 124.87746 56.23456 9586.12685
12.75000 -3627.90509 7.45022 109.21045 119.77508 53.36841 8795.75402
12.85000 -3598.90329 8.89090 888.92823 120.25577 51.68575 49508.91533
12.95000 -3568.48217 9.42650 452.89895 115.67792 50.69806 10599.37157
13.05000 -3545.43129 9.74760 -477.39127 114.19425 49.32638 7540.20843
13.15000 -3514.41109 7.77743 63.87099 113.72509 48.26054 9404.32262
13.25000 -3487.69306 9.15097 -183.35194 109.41846 45.87539 8606.08842
13.35000 -3456.02678 8.27081 105.05316 106.24358 45.15881 7804.60231
13.45000 -3428.34731 7.30076 247.47090 100.83611 44.90268 7181.60727
13.55000 -3406.22147 8.17661 -285.31484 99.86609 43.03565 7679.42558
13.65000 -3378.31953 10.78603 -266.21534 97.30132 42.42548 7269.50111
13.75000 -3355.79799 10.27792 -27.41008 95.20940 41.39526 8123.51802
13.85000 -3328.43477 9.32619 -128.76790 91.10452 39.60885 8201.12365
13.95000 -3310.06706 7.60179 276.72341 88.02661 40.92345 8715.74253
14.05000 -3286.10723 7.44804 96.86615 83.77287 38.45347 7667.13645
14.15000 -3263.50904 8.55724 -170.04853 79.82255 38.08538 7951.43841
14.25000 -3241.04311 6.18893 354.01536 76.66195 37.66069 7545.84881
14.35000 -3220.05959 7.18708 24.26128 70.74600 37.95431 6010.39143
14.45000 -3200.17640 6.87874 157.07987 68.80490 35.60104 6471.68690
14.55000 -3179.19674 6.47425 -127.07128 65.84324 35.79701 6991.27674
14.65000 -3160.36806 6.96416 276.47947 66.01796 36.32196 6542.71110
14.75000 -3139.58424 7.86791 -47.14178 63.07755 35.31732 6514.34574
14.85000 -3122.33266 6.81615 272.15365 61.31099 35.45509 5179.58788
14.95000 -3100.69241 7.73627 290.70654 60.26445 35.70004 5565.16980
15.05000 -3084.35026 7.67713 -129.26747 60.14193 33.51798 7734.38708
15.15000 -3067.75899 6.77695 -143.02262 61.08428 33.48776 5905.19372
15.25000 -3048.09461 5.78567 -82.37650 58.65143 34.17043 4924.03106
15.35000 -3027.43897 7.01692 -221.55329 57.72989 32.37317 6035.78963
15.45000 -3009.30728 6.50670 -55.38780 55.27720 33.01436 4804.49640
15.55000 -2990.94439 8.54421 57.36181 53.33537 33.29340 4453.66638
15.65000 -2973.27601 5.47944 1.30493 51.88972 31.10457 5529.97581
15.75000 -2957.98862 5.88147 29.21422 49.47962 30.85124 4360.99956
15.85000 -2938.39909 6.02949 -39.64061 47.03477 31.74310 5835.96953
15.95000 -2920.28599 6.81333 -192.56988 46.43919 30.87947 4469.11100
16.05000 -2902.69531 4.50385 10.21595 44.10138 30.39348 4233.66029
16.15000 -2884.15094 6.06408 35.94621 42.32525 31.14966 3627.02830
16.25000 -2865.47572 5.89644 -65.08502 41.00708 29.88043 5703.49870
16.35000 -2848.42149 4.29252 44.45138 39.51116 30.22882 4252.71512
16.45000 -2831.78469 3.84405 43.96488 40.47774 29.99344 4281.01579
16.55000 -2812.44985 5.41041 152.44272 40.40974 29.62081 3688.89228
16.65000 -2793.89858 3.43809 80.83608 41.20463 28.51888 3809.89153
16.75000 -2780.39820 4.49583 212.47558 40.55882 28.05410 3309.00096
16.85000 -2762.95478 4.78400 -3.63521 40.00140 28.18267 3174.86858
16.95000 -2746.09597 4.35436 -163.07203 39.56467 28.65482 3340.77199
17.05000 -2728.19544 3.75574 -149.97476 36.60198 27.85146 3684.70794
17.15000 -2711.92801 4.04139 100.97509 37.19800 29.35031 2712.29625
17.25000 -2696.48611 3.86128 140.06582 36.12828 28.92123 2475.90941
17.35000 -2679.44035 4.26075 -199.32713 38.46245 26.52236 4520.98894
17.45000 -2663.80474 3.30397 -100.19063 36.60670 27.14119 3085.50095
17.55000 -2648.31072 3.40567 -37.68764 35.09510 25.88448 3072.24068
17.65000 -2632.21255 4.97473 71.42680 35.59425 27.88813 2725.06913
17.75000 -2616.06961 3.26454 -61.80786 35.66070 27.92931 3044.31657
17.85000 -2601.46449 4.77507 116.69899 34.42763 27.38630 3095.66521
17.95000 -2584.76417 4.84472 -3.52794 34.90040 27.18192 2328.26219
18.05000 -2570.16439 3.20072 -117.72833 36.34123 26.57172 2121.71385
18.15000 -2553.37910 4.49798 146.98777 34.36161 27.19031 3099.92919
18.25000 -2537.18999 2.96522 -111.48712 35.48058 27.46361 2835.49698
18.35000 -2524.05381 2.81637 -93.08822 36.31752 27.01478 2194.32294
18.45000 -2508.44894 3.06920 -61.73414 33.82678 28.02036 2404.75875
18.55000 -2493.25486 2.12385 21.82077 34.35854 25.96863 2117.80367
18.65000 -2478.80951 2.00543 54.98509 33.70269 26.57313 2093.67661
18.75000 -2464.14239 2.78988 -64.11484 34.14954 27.04503 2532.72312
18.85000 -2449.68398 0.17970 78.10442 35.17878 27.22398 2880.04894
18.95000 -2436.05886 2.12231 142.64504 32.27783 27.71819 2271.87451
19.05000 -2422.97632 2.47737 -143.78546 36.08362 26.83999 3323.72240
19.15000 -2406.65973 2.52737 40.19651 35.73892 26.17767 1893.31939
19.25000 -2391.96679 2.97138 32.58674 34.48525 25.91753 1910.59188
19.35000 -2379.02249 2.74658 11.87329 33.95631 24.29314 2253.35363
19.45000 -2362.98665 2.28701 -37.08235 34.03644 26.31358 1840.05028
19.55000 -2351.04638 -0.81318 138.60448 32.62837 26.29909 1759.62612
19.65000 -2335.94857 2.79487 -5.29562 33.03320 26.16272 1527.71126
19.75000 -2322.56752 1.02957 -39.26643 32.85599 25.72791 1835.88334
19.85000 -2307.96820 0.90266 85.61384 31.27189 25.20586 2487.21495
19.95000 -2296.62552 -1.27926 81.92106 31.02451 27.96012 1495.44966
