0.120000 -0.175430
0.380000 -2.205040
0.620000 -2.430730
0.880000 -2.512950
1.120000 -2.442130
1.380000 -2.487120
1.620000 -2.506080
1.880000 -2.482810
2.120000 -2.449510
2.380000 -2.463930
2.620000 -2.474150
2.880000 -2.522240
3.120000 -2.548800
3.380000 -2.491270
3.620000 -2.465470
3.880000 -2.575250
4.120000 -2.650120
4.380000 -2.684770
4.620000 -2.671150
4.880000 -2.752260
5.120000 -2.693850
5.380000 -2.702840
5.620000 -2.632680
5.880000 -2.734360
6.120000 -2.799470
6.380000 -2.884280
6.620000 -2.545080
6.880000 -2.952100
7.120000 -2.671330
7.380000 -2.747490
7.620000 3.051220
7.880000 -2.182260
8.120000 2.542350
8.380000 1.143590
8.620000 1.385290
8.880000 1.083740
9.120000 0.666860
9.380000 0.868780
9.620000 0.374910
9.880000 0.230170
10.120000 0.131280
10.380000 0.367210
10.620000 0.030880
10.880000 -0.538710
11.120000 -0.679260
11.380000 -0.204870
11.620000 -1.891720
11.880000 -0.565930
12.120000 2.472080
12.380000 -2.822890
12.620000 -2.208420
12.880000 1.910060
13.120000 -2.037450
13.380000 2.087560
13.620000 -1.158360
13.880000 0.955130
14.120000 2.129340
14.380000 -0.969090
14.620000 2.006010
14.880000 -2.215250
15.120000 1.140800
15.380000 1.964780
15.620000 1.113200
15.880000 2.515650
16.120000 3.132110
16.380000 1.227160
16.620000 2.695040
16.880000 -0.909770
17.120000 -0.723810
17.380000 -2.094050
17.620000 2.739250
17.880000 2.076680
18.120000 2.732820
18.380000 -2.833060
18.620000 2.774280
18.880000 -1.809180
19.120000 -2.456850
19.380000 -2.419950
19.620000 -2.903400
19.880000 -1.739940
