0.2 -2.08856 14.36862 -3.8489 113.89399 109.79363 105.43411
0.6 0.97651 38.82943 -0.63371 107.17548 100.31532 94.51596
1.0 0.60658 56.78944 -3.23027 100.10344 90.71345 84.54183
1.4 2.70198 71.82811 -0.10035 93.37984 85.17168 78.41252
1.8 3.34925 85.59043 -1.23566 87.54277 79.96139 73.12916
2.2 0.55645 102.67035 -0.19974 79.71867 76.93316 70.38351
2.6 2.13686 115.0015 0.56953 73.94151 72.59366 66.23078
3.0 0.04491 130.05915 -0.25587 68.00778 68.83438 63.84927
3.4 1.15881 142.84798 -0.19732 64.43986 62.83126 58.70952
3.8 1.92694 155.29334 0.25245 60.13909 57.93624 55.1992
4.2 0.25005 164.13698 1.40146 57.46927 52.61466 50.82757
4.6 0.97681 170.7414 -0.01252 54.00465 48.34044 47.93991
5.0 0.86598 175.58053 0.34728 51.81388 45.10668 45.21842
5.4 -0.36991 180.99941 0.22555 50.23103 42.18972 42.16364
5.8 0.53796 184.67571 0.2977 48.446 40.69086 40.20184
6.2 0.92748 187.0514 0.16707 46.85599 39.30528 38.14728
6.6 -0.63912 191.61024 0.09763 44.76015 37.91168 36.62382
7.0 -0.74263 194.98421 -0.28752 43.26955 35.8519 34.83603
7.4 0.06444 197.94499 -0.20545 41.81814 33.93633 33.31026
7.8 -1.47412 199.78978 -0.83803 40.00766 33.01061 32.26976
8.2 -0.71227 201.78748 -0.30586 38.80671 30.97253 30.87547
8.6 -0.39046 202.583 -0.91883 38.44275 30.07716 29.5702
9.0 -0.94844 204.50954 0.22734 36.52756 29.03424 28.46786
9.4 -1.31171 205.96071 1.21285 35.34209 28.1466 27.38952
9.8 -1.20069 207.9741 1.15067 33.37512 27.05268 26.28798
10.2 -0.84568 208.68624 0.26437 33.23201 26.31506 25.1017
10.6 -0.66398 209.70216 1.87444 32.12258 24.8561 24.36386
11.0 -0.78317 211.01161 1.37801 31.82383 23.98252 23.1534
11.4 0.27829 211.36102 1.53365 30.14048 23.31557 22.97692
11.8 -0.0704 211.6005 0.95462 29.20003 22.40088 22.6431
12.2 -0.3402 213.138 1.02875 28.7531 20.89661 21.28047
12.6 0.30832 212.46235 0.26818 28.23191 20.97475 20.87943
13.0 -0.25945 211.86554 1.08761 27.47485 20.09821 20.59027
13.4 -0.18671 212.78054 0.50701 26.47495 19.97562 20.29176
13.8 0.23468 212.37677 0.99066 26.16589 19.54536 19.39933
14.2 0.19517 211.91256 0.44551 25.30299 18.81425 18.13502
14.6 0.74784 211.9521 1.02767 25.0051 18.6746 18.15815
15.0 0.54153 212.49748 0.67248 23.64277 18.77489 17.01327
15.4 0.48461 213.38916 0.6976 22.88799 18.0424 16.4903
15.8 -0.09101 213.17814 0.07815 22.72672 17.86425 16.44203
16.2 0.25613 213.16392 0.48231 22.25949 16.42453 15.90031
16.6 -0.03296 212.62682 0.49574 22.34967 16.79485 15.56426
17.0 0.01097 213.85486 0.58596 21.28001 15.63698 15.54192
17.4 1.05312 212.77437 -0.06403 20.15159 15.55674 15.17545
17.8 0.55406 212.75509 0.13978 20.10711 14.83119 14.66219
18.2 0.08848 213.03252 0.14273 19.37623 14.94701 14.96298
18.6 0.09584 212.51547 -0.05988 19.25129 14.67078 14.14831
19.0 -0.74707 213.79811 1.09281 19.22587 13.82782 14.00867
19.4 0.78208 212.23925 -0.21502 18.82041 13.65891 14.10372
19.8 -0.94035 212.06882 -0.10528 18.48297 13.06135 13.57538
