0.12500 0.01613
0.37500 0.08932
0.62500 0.17473
0.87500 0.25904
1.12500 0.32772
1.37500 0.36698
1.62500 0.39428
1.87500 0.40214
2.12500 0.42207
2.37500 0.42782
2.62500 0.43817
2.87500 0.45425
3.12500 0.45932
3.37500 0.46468
3.62500 0.48409
3.87500 0.49720
4.12500 0.51325
4.37500 0.53109
4.62500 0.53556
4.87500 0.55506
5.12500 0.56518
5.37500 0.56889
5.62500 0.57860
5.87500 0.59413
6.12500 0.58950
6.37500 0.59976
6.62500 0.59175
6.87500 0.61514
7.12500 0.59274
7.37500 0.58102
7.62500 0.56402
7.87500 0.54227
8.12500 0.51745
8.37500 0.49386
8.62500 0.46877
8.87500 0.43866
9.12500 0.41299
9.37500 0.38433
9.62500 0.36798
9.87500 0.34673
10.12500 0.35025
10.37500 0.32240
10.62500 0.34006
10.87500 0.32139
11.12500 0.30187
11.37500 0.30078
11.62500 0.29531
11.87500 0.27039
12.12500 0.24814
12.37500 0.22524
12.62500 0.19681
12.87500 0.17919
13.12500 0.16196
13.37500 0.13037
13.62500 0.13019
13.87500 0.10303
14.12500 0.12153
14.37500 0.09594
14.62500 0.09574
14.87500 0.10706
15.12500 0.11541
15.37500 0.09933
15.62500 0.08257
15.87500 0.09514
16.12500 0.10172
16.37500 0.09457
16.62500 0.11641
16.87500 0.07874
17.12500 0.08849
17.37500 0.07034
17.62500 0.07809
17.87500 0.08445
18.12500 0.07536
18.37500 0.08515
18.62500 0.12608
18.87500 0.11205
19.12500 0.13160
19.37500 0.12692
19.62500 0.12202
19.87500 0.14637
