0.05000 -2355.25658 -634.65033 -777.69515 3244.75476 3493.74502 4612.19856
0.15000 -8722.21821 579.00468 -1636.29063 5353.82583 4129.97406 10769.85532
0.25000 -12439.05409 -89.42875 -140.27264 5514.49967 4507.50615 12210.45717
0.35000 -14629.13173 -9.04344 -425.08657 5736.57812 3620.13833 13358.68954
0.45000 -15362.98085 219.88180 368.49486 5509.86584 3530.93989 14569.95774
0.55000 -15228.88303 -11.97185 473.14670 5284.04380 3457.81436 14691.29574
0.65000 -14811.02296 90.27594 -94.42746 5292.29928 3702.94054 14452.99526
0.75000 -14876.12754 -45.69869 -470.74368 5095.12834 3796.58145 14654.19119
0.85000 -14858.78014 14.61044 -143.20917 4829.51767 3500.68497 13983.41204
0.95000 -14673.82731 48.15686 -312.81322 4726.43095 3463.27829 13650.02652
1.05000 -14302.45674 48.00333 -288.79459 4615.13346 3516.10181 13456.35604
1.15000 -14136.57268 -11.07173 33.20993 4449.18775 3294.08998 12873.49869
1.25000 -13771.39005 48.77999 196.43922 4550.17519 3341.51203 12441.00105
1.35000 -13618.26758 -51.54843 -182.95637 4098.98106 3250.09863 11757.74787
1.45000 -13207.25114 -16.73880 432.92486 3942.87897 3281.92858 11441.94929
1.55000 -13054.92770 12.35759 235.44341 3792.08779 3199.73937 10887.55199
1.65000 -12784.48663 7.75798 190.44903 3551.43039 3202.79878 10338.86963
1.75000 -12642.25639 80.69023 188.35235 3321.73248 3096.71443 9912.42939
1.85000 -12205.12263 -1.42350 266.03698 3233.84418 3093.43418 9701.17164
1.95000 -12125.28996 -71.69556 168.51115 3103.01167 3080.66343 9190.40163
2.05000 -11884.99377 -22.36935 -178.24498 2957.11182 2932.47825 8882.26468
2.15000 -11846.84052 5.28735 121.51310 2769.51400 2979.11939 8443.12640
2.25000 -11577.95277 25.71613 136.17054 2747.17478 2856.49008 8190.49136
2.35000 -11406.77106 -71.23614 -183.84970 2457.92202 2790.97790 7950.10407
2.45000 -11192.98758 31.07632 81.57118 2405.70860 2675.68051 7694.36385
2.55000 -11024.98536 4.68265 -155.52634 2285.10468 2642.20839 7373.07448
2.65000 -10830.09394 -39.52387 24.09475 2249.63382 2624.50281 7034.16024
2.75000 -10631.51620 61.26803 21.09102 2210.63389 2468.04311 6896.15841
2.85000 -10446.07679 86.65793 141.75506 2096.47186 2445.32907 6686.02384
2.95000 -10351.91766 60.96266 -4.58425 1916.28764 2337.99030 6407.09617
3.05000 -10107.48755 71.64870 137.51588 2048.01275 2234.88305 6323.07104
3.15000 -10012.22232 -6.43628 174.23700 1872.57781 2243.65464 6060.24535
3.25000 -9859.72089 49.51006 93.07956 1768.48691 2217.96599 5825.34564
3.35000 -9730.82831 53.89359 114.53634 1731.54154 2099.56061 5709.21418
3.45000 -9684.57086 138.08168 252.43961 1646.15184 2146.04850 5409.42898
3.55000 -9489.78188 72.24929 15.78184 1573.76874 1977.46610 5381.23291
3.65000 -9362.43600 60.43326 -28.92975 1646.89157 1930.11252 5149.32184
3.75000 -9204.34371 79.40304 42.59953 1566.48943 1903.30732 5052.59470
3.85000 -9093.03855 2.82190 12.07086 1420.30945 1851.03246 4851.12867
3.95000 -8971.65764 2.21710 -20.77739 1440.50909 1766.67082 4771.63848
4.05000 -8828.29117 35.96767 75.00925 1412.65311 1717.41709 4655.40491
4.15000 -8686.72276 41.97047 74.82565 1349.12729 1681.48684 4517.39279
4.25000 -8618.38447 -11.50850 28.37598 1355.40471 1625.20143 4354.05069
4.35000 -8508.45273 6.79818 114.22897 1354.00299 1598.13156 4245.37564
4.45000 -8352.20824 -13.52950 -85.87840 1266.98660 1528.20401 4088.86644
4.55000 -8271.25362 91.95623 -15.13935 1125.01747 1481.79163 4038.36050
4.65000 -8111.68958 65.90080 -91.73775 1110.52986 1438.78083 3936.57255
4.75000 -7987.53015 10.98201 42.49062 1044.59565 1408.45144 3846.08993
4.85000 -7870.36368 78.16110 1.49794 1141.88902 1353.83395 3729.52847
4.95000 -7844.79677 -34.12328 77.05707 989.95522 1341.22123 3541.75938
5.05000 -7695.99138 52.95156 134.21708 1161.24300 1406.95747 3511.63314
5.15000 -7569.80928 15.77803 105.65565 1040.50392 1265.00474 3476.06210
5.25000 -7470.25543 23.81685 75.90589 938.66558 1193.84570 3370.29874
5.35000 -7389.93300 -18.00318 -128.95539 1041.88305 1208.04351 3311.35601
5.45000 -7245.70940 -15.27710 150.08338 854.06574 1122.48325 3279.72939
5.55000 -7174.37658 35.70504 24.24536 901.69122 1108.37854 3103.77547
5.65000 -7083.66246 16.42970 -72.21248 852.66368 1136.09137 3096.83345
5.75000 -6944.86621 35.98946 -118.95087 851.91400 1080.28838 3071.29787
5.85000 -6887.31964 -24.29846 57.33686 785.42668 1019.67921 2956.17190
5.95000 -6764.56145 26.92177 -100.54886 1125.43833 1054.31201 3069.08355
6.05000 -6739.20310 57.12462 -74.44768 758.79878 996.04703 2831.46349
6.15000 -6645.39788 19.10100 -81.62927 706.22500 956.78496 2774.08186
6.25000 -6549.84303 93.74620 69.82247 699.60613 938.34705 2705.13076
6.35000 -6439.07025 65.87377 -44.12578 703.97030 888.29441 2664.75798
6.45000 -6400.84807 34.43433 -166.64697 817.62113 967.89662 2566.36338
6.55000 -6278.90192 38.18173 -58.40505 650.27901 853.11223 2576.44710
6.65000 -6236.66282 40.40007 -98.38682 637.47657 856.01104 2514.53634
6.75000 -6147.58592 -23.84675 -213.57780 669.73323 887.00024 2430.95225
6.85000 -6096.37731 8.59650 -150.37978 652.82442 787.65837 2370.90457
6.95000 -5993.13064 25.02355 58.13297 627.84189 746.94246 2335.32617
7.05000 -5920.41111 24.93135 -12.92315 631.87208 738.21672 2291.21310
7.15000 -5838.72980 45.70906 -161.89246 520.95124 718.04958 2256.53304
7.25000 -5765.83477 -0.82174 -42.31980 572.49604 693.62366 2165.33637
7.35000 -5750.29536 37.44072 -49.66912 486.12677 718.80303 2048.94311
7.45000 -5626.53834 35.99710 -238.11733 547.77032 670.38716 2122.67441
7.55000 -5567.83556 -3.49294 -115.15590 496.39048 649.12742 2033.35441
7.65000 -5504.80740 51.99554 -7.32800 493.85932 642.36786 2007.32682
7.75000 -5448.99522 4.58065 13.53910 489.11798 641.72017 1929.09547
7.85000 -5380.45764 25.04542 107.14344 713.30797 635.06822 1886.26063
7.95000 -5333.39624 19.75157 -43.88812 488.27639 662.39444 1788.18728
8.05000 -5293.28570 38.75773 -80.43181 465.24826 673.83339 1776.10219
8.15000 -5217.38779 26.90646 -107.50999 564.39849 596.55592 1756.14164
8.25000 -5167.47513 3.31434 -45.60288 403.31245 525.84157 1712.18371
8.35000 -5113.70190 33.31760 -82.98408 412.95448 536.57478 1615.20612
8.45000 -5060.11746 33.63161 -146.00794 421.29893 524.87195 1622.87816
8.55000 -5007.71435 25.22281 -66.11837 499.02061 553.30209 1658.35506
8.65000 -4943.87469 -5.29734 -1.33451 411.80914 518.49942 1540.66341
8.75000 -4882.64138 23.28756 -204.50719 390.72631 478.20159 1502.22444
8.85000 -4875.51357 19.90041 -29.57883 571.25711 552.23532 1470.82840
8.95000 -4785.11692 -2.54550 7.39592 403.65267 472.18914 1404.69997
9.05000 -4735.19544 14.30633 -44.63998 347.48341 489.13107 1386.25933
9.15000 -4701.29681 -0.30505 8.74783 374.85325 483.56630 1372.46398
9.25000 -4689.35751 -4.30585 -35.63233 454.97991 506.11697 1287.72556
9.35000 -4611.26232 21.00795 -58.32624 402.99671 437.76361 1284.27755
9.45000 -4591.22736 13.22184 16.02280 472.92839 405.24210 1231.54457
9.55000 -4535.08279 -5.43382 -58.82640 427.69472 443.62908 1216.97045
9.65000 -4520.76564 -2.69977 -49.72466 327.41318 429.12709 1176.91099
9.75000 -4483.57478 -7.90378 -109.66321 368.42270 427.60529 1155.11540
9.85000 -4450.05939 11.25504 -42.85829 340.25696 472.54572 1097.27658
9.95000 -4406.77401 9.97305 -107.77226 321.67068 421.94220 1089.33725
10.05000 -4379.50419 -8.20497 -47.87994 362.45828 441.64217 1081.74005
10.15000 -4335.37844 -27.10024 -81.42190 290.49318 345.62127 994.51914
10.25000 -4305.03853 -9.78104 -72.64982 315.91904 344.26593 1026.66230
10.35000 -4279.93297 -3.68679 17.78044 336.01647 360.07092 1000.88256
10.45000 -4250.15937 2.82240 -33.92737 358.57294 388.38980 976.62614
10.55000 -4202.97947 -23.08252 -60.18410 314.37549 347.67409 928.21584
10.65000 -4201.24929 -15.29780 -84.06622 322.54929 362.10268 890.41166
10.75000 -4159.37524 -16.98413 -55.26674 335.59867 323.93817 886.43905
10.85000 -4149.80925 -10.72149 -27.61766 322.27424 351.55710 856.06027
10.95000 -4111.51928 -10.16947 -28.33014 353.88457 325.72062 813.81381
11.05000 -4074.59878 -8.83769 -50.55685 349.03493 283.17163 842.62557
11.15000 -4066.52565 4.65488 -75.54868 318.24427 291.81226 809.07413
11.25000 -4016.54254 -4.77784 -34.55373 407.31279 335.54953 771.38258
11.35000 -3997.19725 -3.06986 -40.22703 361.40342 283.13526 741.67625
11.45000 -3971.62641 -9.79252 -59.14027 311.57287 259.98125 736.67560
11.55000 -3940.94918 -7.63481 -31.50907 299.63861 242.43295 711.51664
11.65000 -3915.60242 -15.35894 -53.26578 330.32122 251.17564 695.55865
11.75000 -3911.63253 -11.29167 -58.82746 287.99977 246.35300 702.55826
11.85000 -3872.53121 -0.26815 22.45875 386.44972 288.34320 656.35332
11.95000 -3847.64729 -4.47482 -17.12706 367.22320 303.51020 651.47634
12.05000 -3818.13685 2.04895 -20.79290 298.40986 227.73532 616.12091
12.15000 -3795.34554 -1.40327 -24.63714 282.73675 225.06299 620.21318
12.25000 -3746.82909 0.30518 -15.04159 292.42279 209.97091 592.86424
12.35000 -3744.58560 11.21472 -36.15731 277.77976 239.71345 594.50128
12.45000 -3714.98271 9.67967 -41.64102 318.18588 191.73449 604.50289
12.55000 -3663.96687 2.79698 -28.04016 265.60158 188.88575 548.57288
12.65000 -3632.26037 -0.34269 -2.30862 274.42590 259.50981 592.15212
12.75000 -3607.69314 12.74049 19.49730 283.36966 317.02144 509.74757
12.85000 -3592.63945 0.66327 -39.69243 270.89665 200.87767 528.38105
12.95000 -3551.23690 12.41803 -26.53421 407.24371 230.96336 531.79466
13.05000 -3556.18172 6.89109 -66.09210 261.80722 201.11065 534.26333
13.15000 -3509.43686 -1.31957 7.14550 271.05686 212.16934 509.66912
13.25000 -3501.96457 14.15995 -18.75381 249.60691 189.16216 535.25814
13.35000 -3461.20183 4.89572 2.19516 214.39079 155.30603 474.96134
13.45000 -3442.18901 7.95506 -43.04490 215.14183 143.76044 463.54630
13.55000 -3398.49815 2.55794 -30.48421 387.90618 185.49748 488.11493
13.65000 -3377.75313 -19.03963 -21.55572 360.41751 426.24206 461.10339
13.75000 -3352.27000 7.57326 -14.69452 195.23652 140.70406 448.08638
13.85000 -3343.61513 9.15338 -19.18070 193.52104 231.85065 493.01451
13.95000 -3321.20765 1.93111 11.04775 261.28607 294.12763 430.00887
14.05000 -3308.87942 4.52682 12.25228 183.18209 135.63408 445.47828
14.15000 -3262.30272 -1.78910 8.76176 358.16282 399.59513 933.63639
14.25000 -3235.00093 -7.06532 -9.26863 262.81034 211.21795 412.36308
14.35000 -3215.83416 7.34405 -35.66635 195.68934 157.43225 407.57661
14.45000 -3199.47445 1.44725 -25.05574 164.70911 158.64795 401.35157
14.55000 -3183.62196 13.43343 -13.73670 181.64168 128.85483 465.19239
14.65000 -3157.99700 6.16946 -42.39574 156.32937 109.74336 393.59414
14.75000 -3126.32599 -12.46098 -1.64518 264.57123 371.94703 411.06542
14.85000 -3139.32114 9.03678 -53.07352 207.83194 135.10712 435.96924
14.95000 -3090.24083 6.66015 -42.19439 157.09753 108.09396 392.86058
15.05000 -3085.97849 17.67278 -31.77761 271.76275 183.58360 423.08466
15.15000 -3050.86266 9.33069 -15.95480 134.39685 96.39478 358.03456
15.25000 -3038.47309 8.15671 -22.03472 134.73518 99.96596 348.08981
15.35000 -3019.57774 7.78408 -39.07385 132.09163 91.77128 350.81638
15.45000 -2985.47569 6.96288 -19.42255 128.06674 94.74223 351.76604
15.55000 -2973.39647 4.62092 -63.87478 142.04335 102.52142 333.32633
15.65000 -2940.50233 22.59292 -27.32310 129.88839 261.53335 372.75713
15.75000 -2926.26949 7.41531 -46.52996 128.66790 85.81839 331.51743
15.85000 -2917.98067 3.34282 -55.02435 111.31119 88.59164 298.10109
15.95000 -2899.32660 8.92431 -32.90957 153.18510 119.51719 312.45847
16.05000 -2861.61028 4.74498 -59.92951 114.95513 91.02076 316.59268
16.15000 -2856.28030 1.80028 -67.45831 266.01556 142.02322 335.09803
16.25000 -2837.06032 5.68580 -40.10185 103.19115 121.70479 316.03206
16.35000 -2832.80900 3.29668 -44.85832 104.12261 92.28914 267.92079
16.45000 -2798.58120 17.96157 -39.69768 149.57000 206.95004 317.05562
16.55000 -2790.10981 11.48932 -63.88656 99.34426 166.76182 279.75694
16.65000 -2772.32755 5.86625 -38.57717 128.26827 98.48929 274.28298
16.75000 -2753.74565 0.33367 -59.03747 96.60481 73.52406 319.54756
16.85000 -2740.35469 4.68171 -65.51845 107.48895 82.26882 277.94009
16.95000 -2724.81111 0.46593 -51.89244 138.36883 101.30624 277.35655
17.05000 -2699.19596 12.00597 -60.13156 99.21808 80.47555 283.67567
17.15000 -2686.18550 4.37676 -86.94685 96.52419 85.70058 273.38401
17.25000 -2664.15366 11.59648 -69.68735 212.06219 72.11780 272.69932
17.35000 -2659.36573 11.42920 -63.01357 90.37633 83.74430 235.15486
17.45000 -2638.66830 4.52922 -57.77369 102.67696 77.31552 257.85611
17.55000 -2622.15725 -1.45754 -71.30626 116.40131 85.75228 253.94471
17.65000 -2631.90425 1.22502 -39.92515 319.87732 129.32272 404.66868
17.75000 -2588.89386 -1.89190 -64.14492 108.41877 105.67972 262.61011
17.85000 -2586.24596 8.27534 -55.75829 75.11072 78.09360 211.30370
17.95000 -2568.12224 26.53077 -72.76114 154.60768 204.67534 341.09377
18.05000 -2552.72563 12.56428 -54.02219 86.81553 78.23978 216.27890
18.15000 -2523.94760 3.85317 -65.48015 144.37520 63.45209 244.01582
18.25000 -2513.57095 2.08521 -41.77157 85.85327 64.32009 241.07987
18.35000 -2507.87290 1.24170 -60.81566 66.34252 57.55166 216.99877
18.45000 -2488.71552 0.71351 -40.68741 146.83172 151.38458 222.74228
18.55000 -2477.56975 12.02525 -36.53617 94.00549 66.71019 225.49918
18.65000 -2455.06479 7.28664 -69.26663 62.37774 58.62540 227.37617
18.75000 -2446.08783 4.09289 -20.94252 64.69783 57.36317 204.65011
18.85000 -2437.19202 5.19384 -24.53650 71.31286 64.03619 232.23128
18.95000 -2412.10717 4.80359 -46.06790 62.10231 59.46564 214.47251
19.05000 -2410.61165 -3.12862 -11.35511 110.51836 76.71358 205.49022
19.15000 -2386.54877 -7.50600 -21.16081 131.78379 103.01560 226.42282
19.25000 -2379.81014 31.45726 16.19374 88.65406 380.69241 592.96626
19.35000 -2365.80294 1.86400 -38.79458 61.09501 54.18851 188.89520
19.45000 -2347.99432 -0.69292 -33.20480 55.66505 45.08075 178.59594
19.55000 -2331.54167 6.59488 -42.06603 60.09502 44.46493 180.76140
19.65000 -2318.47692 2.91544 -37.48936 55.53266 56.59239 190.34796
19.75000 -2311.36720 5.95767 -5.60776 85.08547 158.95537 187.76311
19.85000 -2303.23786 -0.22707 -30.42095 57.30113 52.73371 199.98381
19.95000 -2284.74344 2.07931 -39.32970 56.78829 43.47513 185.80967
