0.120000 -1.413190
0.380000 -2.547870
0.620000 -0.392830
0.880000 -2.337170
1.120000 -1.615710
1.380000 -1.642670
1.620000 -1.503740
1.880000 -1.409850
2.120000 -1.346140
2.380000 -1.386100
2.620000 -1.787430
2.880000 -1.681440
3.120000 -1.915350
3.380000 -2.409440
3.620000 -2.358810
3.880000 -2.766770
4.120000 -2.719980
4.380000 1.975580
4.620000 0.459620
4.880000 0.833290
5.120000 0.780290
5.380000 0.734160
5.620000 0.501610
5.880000 0.419700
6.120000 0.452580
6.380000 0.464480
6.620000 0.390070
6.880000 0.624080
7.120000 0.522800
7.380000 0.620180
7.620000 0.455500
7.880000 0.141910
8.120000 -0.147290
8.380000 0.151820
8.620000 -0.550900
8.880000 -0.835980
9.120000 -1.109900
9.380000 -1.093290
9.620000 -1.072600
9.880000 -1.895110
10.120000 -1.427070
10.380000 -1.811870
10.620000 -1.846120
10.880000 -2.393600
11.120000 -2.826250
11.380000 3.097520
11.620000 -3.120690
11.880000 2.731050
12.120000 1.606050
12.380000 2.030420
12.620000 1.795700
12.880000 0.857540
13.120000 0.782900
13.380000 1.074340
13.620000 0.318420
13.880000 0.087750
14.120000 -0.423850
14.380000 -0.144650
14.620000 -0.557850
14.880000 0.571200
