0.120000 -0.242310
0.380000 -0.298820
0.620000 -2.048250
0.880000 -0.969660
1.120000 -1.216950
1.380000 -1.086500
1.620000 -1.120330
1.880000 -1.282630
2.120000 -1.593030
2.380000 -1.764120
2.620000 -1.455530
2.880000 -1.002190
3.120000 -1.041380
3.380000 -2.087340
3.620000 -1.653870
3.880000 -1.024060
4.120000 -1.186300
4.380000 -1.669490
4.620000 -1.660660
4.880000 -1.775170
5.120000 -0.111530
5.380000 -2.646490
5.620000 -2.818680
5.880000 -1.239540
6.120000 -0.794140
6.380000 -1.248830
6.620000 -2.006240
6.880000 1.232280
7.120000 -1.379210
7.380000 -2.243390
7.620000 2.843490
7.880000 -2.615290
8.120000 -0.966750
8.380000 0.025230
8.620000 -1.179690
8.880000 -0.667280
9.120000 -1.457310
9.380000 -1.567590
9.620000 -3.035960
9.880000 -2.444180
10.120000 3.077270
10.380000 -2.852950
10.620000 -3.060440
10.880000 -2.306590
11.120000 -2.954510
11.380000 2.755740
11.620000 1.598230
11.880000 2.773530
12.120000 -1.446440
12.380000 0.550390
12.620000 0.644870
12.880000 -0.375460
13.120000 -0.532730
13.380000 -0.527260
13.620000 -2.709680
13.880000 -2.741020
14.120000 -2.385050
14.380000 2.162310
14.620000 2.067400
14.880000 2.786500
15.120000 2.220210
15.380000 1.670030
15.620000 1.708600
15.880000 1.193330
16.120000 1.681350
16.380000 0.593660
16.620000 1.131480
16.880000 1.298950
17.120000 -0.537280
17.380000 -0.407080
17.620000 -1.247920
17.880000 -0.165490
18.120000 -2.215420
18.380000 -2.553560
18.620000 -1.935390
18.880000 -2.406170
19.120000 0.041700
19.380000 -0.687640
19.620000 2.630730
19.880000 -1.914990
