0.2 -0.64425 25.27003 -0.03036 90.77771 90.54026 75.35707
0.6 -0.27791 53.57985 0.48434 90.25844 83.30043 72.54716
1.0 -1.35498 71.9376 0.81837 86.21197 77.30055 67.69424
1.4 -0.13748 88.0798 0.8115 82.24433 72.21494 63.24915
1.8 -0.16037 99.61329 -0.37106 78.66459 67.21615 58.91833
2.2 -1.36448 112.73785 0.22683 73.4831 62.68468 56.00103
2.6 -0.03435 124.03834 -1.01966 68.06033 58.61866 53.05212
3.0 0.69288 134.37224 0.15385 61.69751 54.63765 50.33951
3.4 0.20065 145.02223 -0.22634 56.78865 50.62644 47.69548
3.8 0.70485 154.88189 0.08977 51.83448 46.59275 44.47656
4.2 0.87133 163.08998 0.40308 48.33743 42.63097 42.82094
4.6 0.6512 170.16321 -0.13922 45.26581 38.95566 39.78978
5.0 -0.31382 175.77115 -0.03933 42.87748 36.05846 37.61877
5.4 -0.64675 180.45128 -0.1708 40.84499 34.11979 35.66961
5.8 -0.6909 184.86181 -0.46918 39.27159 32.20499 34.16548
6.2 -1.10369 188.3942 -0.64842 37.76777 30.83197 32.56669
6.6 -0.64709 191.76318 -0.65142 36.90331 29.69383 31.39938
7.0 -0.34356 193.92852 -0.70048 34.68641 28.53174 30.18471
7.4 -0.35145 196.09771 -0.3155 33.67275 27.61576 28.50402
7.8 -0.21717 198.88365 -0.32721 32.66452 26.67457 27.60808
8.2 -0.34734 200.59013 -0.0281 31.69926 25.72767 26.61643
8.6 0.85943 202.84579 0.55518 30.72427 24.98255 25.17228
9.0 -0.07136 205.29767 0.66224 29.86489 23.77646 24.00335
9.4 -0.38844 206.77252 1.01712 28.71533 22.33423 23.31619
9.8 -0.50748 207.46031 0.70631 27.81004 21.07476 22.35855
10.2 -0.32289 207.76892 1.33529 26.90217 20.30038 21.33888
10.6 -0.55389 208.38763 0.74112 25.92541 19.68527 20.754
11.0 -0.37893 208.69919 1.06313 25.33329 19.17515 20.00767
11.4 -0.51333 209.83365 0.68409 24.47132 18.50675 18.90317
11.8 -0.3388 209.84358 0.31572 23.63819 18.06212 18.03101
12.2 -0.55749 210.27999 0.24764 22.4794 17.43874 17.23314
12.6 -0.49594 210.71419 -0.1759 21.46406 16.89361 16.5545
13.0 -0.89147 211.24128 -0.26315 21.09939 16.35179 15.75555
13.4 -0.89357 211.67689 -0.13167 20.48446 15.29018 15.28178
13.8 -1.06742 211.98878 -0.8919 19.61388 14.7251 14.97829
14.2 -0.9989 212.19692 -0.70618 18.87289 14.13277 14.29242
14.6 -1.08408 212.01968 -1.03137 17.93533 13.44773 13.72482
15.0 -0.86912 212.15631 -0.71853 17.38429 12.96495 13.08508
15.4 -0.84619 212.3714 -0.22059 16.89669 12.65496 12.76639
15.8 -0.48937 212.20646 -0.31227 16.20722 12.09758 12.18224
16.2 0.15698 211.6644 -0.4172 16.11105 11.65935 11.86264
16.6 -0.33198 211.2849 -0.11264 15.37208 11.54067 11.70835
17.0 0.49694 211.72133 -0.16659 15.12986 11.59485 11.01142
17.4 1.32526 211.96736 -0.94175 15.21135 11.23484 10.77929
17.8 1.1957 211.68443 -1.39504 14.17151 10.4657 10.32492
18.2 0.47521 210.92726 -0.88893 13.93944 10.25301 10.30066
18.6 0.9147 210.12145 -0.97779 13.49025 9.88711 10.04422
19.0 -0.00302 211.18511 -0.84886 13.47983 9.93674 9.51363
19.4 0.37188 211.79025 -0.92532 13.03489 9.91158 9.36902
19.8 0.32751 212.21458 -1.57132 12.13165 9.4653 9.04231
