0.05000 -4332.97295 4413.14455 -2541.66310 29510.66807 31345.08241 13996.13860
0.15000 -14191.67309 -99.59188 -3324.78893 25442.35799 28282.74726 24717.36783
0.25000 -23741.29145 -241.99304 -2474.51130 19908.36465 24713.88563 33151.26583
0.35000 -30511.85169 584.38300 -1044.17869 16424.61147 21259.17922 38345.79686
0.45000 -36049.72594 75.37355 -953.21195 14405.30504 18507.66167 39201.78110
0.55000 -38245.79154 539.80938 -406.33542 14133.91141 15534.29084 38269.36948
0.65000 -39088.34828 326.17382 -282.14176 13154.31346 13493.14148 35327.04252
0.75000 -37580.16516 40.79712 617.25746 11999.58750 11875.46417 32166.94567
0.85000 -35671.15873 130.51755 275.41909 10975.15993 10574.32928 29393.03160
0.95000 -33700.85652 209.04506 -92.64447 9991.55727 9491.24104 26931.06431
1.05000 -31997.22919 -7.21235 579.81159 8921.93349 8698.25716 24029.06240
1.15000 -30347.45318 106.45166 177.92324 7914.57939 8041.76575 21883.89277
1.25000 -28547.10092 18.10638 -276.46802 7291.28366 7288.69554 20019.09153
1.35000 -26772.49986 -22.13908 248.69863 6510.74139 6701.64721 18403.53332
1.45000 -25302.58958 51.76644 247.26343 5835.92017 6158.45060 16858.44179
1.55000 -23870.07427 62.57701 158.37302 5397.53534 5716.70802 15524.78663
1.65000 -22678.03085 90.16634 70.23578 4899.58248 5403.38525 14373.08469
1.75000 -21449.75706 -41.45376 6.09676 4512.93383 5021.05472 13428.36734
1.85000 -20456.12870 69.59846 -158.21392 4279.97373 4648.03752 12536.84048
1.95000 -19462.90422 60.42656 -130.97041 3929.12402 4423.07781 11760.89468
2.05000 -18491.54689 49.83366 193.13589 3745.36297 4131.74559 11217.78022
2.15000 -17764.46357 -30.97148 -41.94287 3535.39051 3936.58573 10623.24755
2.25000 -17065.55461 70.82405 40.56258 3331.19812 3735.71297 9963.57186
2.35000 -16352.22749 -82.81884 107.29413 3129.13481 3521.63234 9536.26842
2.45000 -15729.10212 132.32320 31.00250 3022.90353 3309.80066 9083.79026
2.55000 -15176.72109 11.29837 30.22739 2852.37189 3210.25704 8682.79166
2.65000 -14711.38880 -70.20175 -16.63581 2593.05003 3020.25080 8284.03398
2.75000 -14262.92082 -1.21867 -49.00922 2513.47599 2865.81198 7802.48991
2.85000 -13726.30195 -19.31846 178.78917 2355.60049 2753.40824 7562.10952
2.95000 -13312.53966 -23.77882 24.83411 2241.72566 2640.45506 7231.59207
3.05000 -12867.15555 -13.21500 23.78848 2183.30245 2513.24376 6955.31883
3.15000 -12478.68463 28.22186 24.90502 2078.24041 2406.92332 6753.91472
3.25000 -12160.91705 21.02476 105.23631 1997.27138 2296.35540 6425.28032
3.35000 -11778.33274 20.69866 34.38347 1967.40762 2232.20788 6296.58522
3.45000 -11525.65333 -2.46465 46.09119 1820.10881 2129.98034 5999.91052
3.55000 -11197.42738 -4.18526 67.16665 1787.82685 2063.49503 5800.64318
3.65000 -10884.19576 25.04821 -134.16842 1680.31662 1974.46775 5620.67565
3.75000 -10613.35338 -1.18549 -27.85775 1613.49674 1887.98655 5435.69335
3.85000 -10338.28025 -3.65178 106.48061 1566.14118 1824.24880 5251.07398
3.95000 -10096.87744 7.54543 -97.71755 1506.31315 1777.44555 5103.35022
4.05000 -9878.42072 11.89847 11.89611 1400.97499 1723.00001 4898.31618
4.15000 -9646.89810 1.05655 93.50099 1348.32194 1647.81481 4740.82007
4.25000 -9467.58258 -3.74164 49.33137 1279.79710 1605.90456 4549.50569
4.35000 -9226.44625 -11.12971 115.83179 1282.25537 1556.44736 4460.77312
4.45000 -9028.24538 -42.43764 128.55476 1222.70921 1503.26984 4337.97020
4.55000 -8844.23974 -27.62201 -1.62986 1177.94897 1437.32891 4191.48007
4.65000 -8621.78066 -38.87866 18.81334 1127.64013 1408.22835 4096.37936
4.75000 -8438.40697 22.97365 42.21544 1082.83495 1355.62796 3986.17335
4.85000 -8245.93421 -34.98800 -54.18616 1056.76924 1309.22092 3889.96658
4.95000 -8096.15898 -5.94959 49.13944 1008.45014 1286.87146 3726.44362
5.05000 -7936.49648 -10.26429 16.35699 979.59031 1249.75626 3616.51239
5.15000 -7779.96523 4.36582 56.86195 925.37036 1186.77029 3546.16502
5.25000 -7664.32460 28.98853 79.86610 846.68691 1165.65322 3392.27883
5.35000 -7492.19596 4.66335 155.75920 870.82930 1128.39484 3378.77990
5.45000 -7386.31933 13.48103 -28.07638 817.34940 1100.37856 3242.77604
5.55000 -7236.88739 6.95014 -10.19823 794.51706 1060.49237 3192.88721
5.65000 -7110.41246 43.53489 -103.39276 782.82424 1043.56237 3107.16914
5.75000 -6979.30118 23.15120 42.12182 737.02818 1000.34091 2985.42638
5.85000 -6841.31156 29.91784 60.86962 732.75412 983.09787 2965.93599
5.95000 -6748.46303 17.15796 96.05376 677.57592 962.52950 2825.39516
6.05000 -6618.84936 20.64753 75.94331 660.53505 924.72589 2806.86181
6.15000 -6529.12111 7.23490 77.08180 648.86668 906.53173 2718.95758
6.25000 -6436.31656 4.44061 118.57560 588.29131 873.50668 2606.38450
6.35000 -6336.56638 9.32234 -32.79278 599.56152 858.13821 2576.18758
6.45000 -6229.97589 47.76348 7.73566 593.92076 826.88547 2529.33847
6.55000 -6126.83430 7.26998 81.80781 572.82565 808.79491 2474.29204
6.65000 -6042.23499 17.45811 -20.43057 545.66665 785.37748 2377.31551
6.75000 -5950.04548 5.39011 -45.19190 523.16432 763.39458 2298.62833
6.85000 -5863.78283 12.09904 30.26241 503.35186 745.01168 2233.07608
6.95000 -5789.05322 11.86294 18.63162 474.15204 718.92709 2135.97371
7.05000 -5693.39258 -0.02717 6.12165 456.43643 692.32801 2092.96754
7.15000 -5633.05409 2.79434 18.35834 435.85895 676.93499 2043.00681
7.25000 -5541.74337 -8.80698 55.14843 464.54013 678.50662 1966.50504
7.35000 -5486.29817 5.09405 -8.13218 424.84926 654.77774 1906.59777
7.45000 -5412.75981 -9.05156 34.11825 426.79204 640.72766 1851.01612
7.55000 -5356.99165 -2.89461 73.38355 407.88015 634.10212 1789.19527
7.65000 -5294.65142 18.21988 -1.39478 392.91707 612.09206 1735.35327
7.75000 -5236.05174 -15.06477 0.96171 380.87241 608.40721 1670.45227
7.85000 -5168.63623 2.81577 -15.39001 390.52871 587.20010 1597.50950
7.95000 -5107.65056 -6.31216 12.19934 375.01262 576.54831 1555.37466
8.05000 -5053.59460 -12.91598 66.16699 368.12258 569.82097 1483.51653
8.15000 -5014.99243 -23.99685 39.09720 369.42919 555.35655 1443.16406
8.25000 -4960.80600 -22.54667 59.67837 370.13081 532.68577 1388.08708
8.35000 -4899.01893 -12.06164 25.38411 372.17446 523.13227 1338.13562
8.45000 -4857.68934 -16.04857 26.13638 353.82116 517.94553 1286.86673
8.55000 -4817.30643 -14.92783 71.23778 344.03544 505.25327 1250.33206
8.65000 -4766.16061 -10.57034 13.90059 341.33231 490.70133 1213.99448
8.75000 -4733.46079 -14.60322 41.69685 353.47156 482.48443 1161.14137
8.85000 -4703.50185 -8.33535 0.81288 351.05474 465.75144 1123.45542
8.95000 -4668.62511 -24.91721 18.70014 366.84786 463.08659 1091.97820
9.05000 -4625.52712 -15.90929 38.30232 365.69565 444.33649 1063.28301
9.15000 -4588.16896 -21.79818 49.26042 359.45167 437.41587 1021.86573
9.25000 -4551.46627 -26.07727 21.39369 369.53702 426.61472 1012.14509
9.35000 -4512.37977 -21.20712 37.18894 363.11539 415.90924 986.90948
9.45000 -4492.31419 -10.29102 57.44966 374.05135 407.43403 962.22840
9.55000 -4461.61052 -11.57128 39.47934 374.82065 390.63014 947.94527
9.65000 -4420.52393 -13.89298 34.14663 366.20015 377.29698 926.07929
9.75000 -4395.74274 -12.28223 14.56932 373.29098 366.71496 920.12271
9.85000 -4353.72815 -9.16230 55.66448 371.56133 349.45948 911.72488
9.95000 -4320.35176 8.00798 43.53456 376.05027 344.20824 884.04144
10.05000 -4285.73904 1.68292 24.17220 371.65305 339.13427 870.62130
10.15000 -4253.44724 7.90764 37.61604 361.45375 329.09523 819.96230
10.25000 -4219.47656 12.94099 26.80292 360.67462 315.29776 828.14351
10.35000 -4210.14787 6.53410 3.47012 362.53405 301.45736 798.42808
10.45000 -4166.97922 13.73288 29.18019 353.70357 289.95490 792.03172
10.55000 -4116.01095 14.30204 37.18263 339.71798 283.10811 774.03846
10.65000 -4093.02446 18.89298 36.33569 340.84486 269.90870 761.88720
10.75000 -4067.63817 10.66540 65.11871 323.85294 270.88710 733.09842
10.85000 -4022.32045 12.53545 39.35872 317.74382 249.02626 728.08325
10.95000 -3988.27765 16.45607 37.14673 307.28167 254.46252 704.65016
11.05000 -3974.92567 23.09056 41.07066 295.83822 242.63958 694.61266
11.15000 -3929.99263 16.18091 19.22392 297.70542 237.28980 683.22680
11.25000 -3892.71637 16.22610 51.13614 283.98642 226.34399 681.42799
11.35000 -3865.27146 15.01681 19.91322 275.90415 218.88749 667.78970
11.45000 -3829.68707 20.99951 57.19395 270.32519 212.30049 644.70073
11.55000 -3806.53901 17.55847 65.74638 266.65160 212.09850 654.64664
11.65000 -3776.21561 15.94390 45.24214 260.28060 197.88138 635.93079
11.75000 -3746.68910 14.58463 37.64235 259.49943 193.80398 621.72988
11.85000 -3719.54130 13.37495 46.19843 247.30883 186.12626 585.26459
11.95000 -3691.03464 15.07539 15.63333 233.55460 181.28015 590.43489
12.05000 -3668.56830 16.36518 14.80871 234.07772 179.27595 577.77836
12.15000 -3628.20733 11.30018 11.97795 228.67849 170.23416 577.48727
12.25000 -3598.04117 13.49430 36.08996 215.95304 167.07540 556.92432
12.35000 -3579.45997 7.14649 39.15311 217.36976 170.81744 542.64219
12.45000 -3539.89617 13.06427 49.78464 205.33974 159.09692 539.35492
12.55000 -3515.54350 13.00460 32.04912 197.63193 165.53170 535.56538
12.65000 -3488.12360 11.94279 31.73248 193.18894 156.25144 524.87392
12.75000 -3463.42575 17.07282 45.79050 189.96124 157.23610 513.93335
12.85000 -3439.91814 14.88687 40.16615 194.68243 151.89206 506.48018
12.95000 -3417.45359 11.60961 27.20405 185.36318 142.84273 479.32396
13.05000 -3390.79329 10.01088 32.72423 186.42243 154.00661 495.86111
13.15000 -3364.68687 15.48694 12.02857 179.90339 139.77262 480.15936
13.25000 -3337.95065 12.45858 47.19553 168.01719 135.88282 476.24370
13.35000 -3317.70963 11.22145 45.33497 170.48609 127.47603 468.63257
13.45000 -3294.59552 9.09025 29.48374 164.40650 133.64384 458.01471
13.55000 -3272.56096 6.72416 39.05096 172.18236 137.08670 463.99645
13.65000 -3241.72189 11.70178 39.29356 164.97238 120.83495 451.86310
13.75000 -3222.88966 9.23507 36.74389 153.84063 133.50764 444.87169
13.85000 -3202.46480 9.31951 53.71427 155.39811 129.13940 433.95615
13.95000 -3181.14683 8.97496 37.56454 155.54301 124.64259 427.75113
14.05000 -3156.54715 14.49521 44.71487 140.37707 114.16636 423.68623
14.15000 -3137.31173 13.86522 42.45662 141.15028 116.02598 411.99301
14.25000 -3107.53990 13.93967 60.63357 143.92186 114.08774 399.89941
14.35000 -3088.21267 11.23202 41.50930 135.68310 120.28958 413.07934
14.45000 -3065.50090 13.81952 32.96888 144.94413 120.07977 406.31292
14.55000 -3050.49260 11.00647 33.70781 135.27157 119.61625 386.60846
14.65000 -3024.36277 6.28663 13.73343 148.41079 114.97391 384.81250
14.75000 -3005.39300 12.37712 37.29399 131.56174 116.14827 376.69596
14.85000 -2989.59568 4.01597 31.08072 129.76231 111.39593 366.98652
14.95000 -2970.49922 13.37804 44.14007 134.58403 104.60353 382.88888
15.05000 -2955.17706 10.15771 30.93009 132.48900 104.94278 369.83090
15.15000 -2935.75652 11.17688 45.66269 138.44190 109.12212 359.50738
15.25000 -2912.66481 6.69270 30.19656 123.07907 104.99829 348.55739
15.35000 -2891.20828 9.16166 54.61700 125.19743 99.85564 350.08751
15.45000 -2873.82011 11.74596 37.29424 130.99692 114.44672 353.14280
15.55000 -2860.36551 9.64636 28.86263 125.63640 98.78467 331.39905
15.65000 -2836.75827 12.74842 38.57451 119.09863 98.84491 329.58268
15.75000 -2815.93168 15.19415 37.49101 131.96390 110.92956 335.95912
15.85000 -2800.99420 8.49116 46.56393 120.72223 95.21431 336.37901
15.95000 -2784.76732 9.77041 45.10197 121.56778 93.47516 320.63217
16.05000 -2761.85755 16.63966 37.02469 113.21479 90.18731 323.35302
16.15000 -2748.53372 7.19224 24.74886 117.30503 86.85472 322.13643
16.25000 -2731.36610 9.49056 29.91385 113.67082 95.07102 325.39769
16.35000 -2714.27038 12.98218 26.66471 112.41344 86.97559 313.73773
16.45000 -2697.55188 11.42440 37.65550 114.06913 83.18708 305.83752
16.55000 -2682.19801 14.43490 35.12294 109.58761 89.89178 309.77624
16.65000 -2665.62376 8.69089 35.14415 111.64007 78.57483 299.28533
16.75000 -2652.70388 13.76393 52.46340 109.19250 83.48435 296.79064
16.85000 -2633.89620 12.15078 32.84386 105.13381 87.95797 285.54355
16.95000 -2622.02283 9.62130 43.75452 106.76659 82.33189 286.47828
17.05000 -2607.45893 9.79078 46.07697 121.39240 80.00272 289.22045
17.15000 -2592.87736 11.68253 39.91530 103.05674 90.39596 287.36779
17.25000 -2572.04602 12.72795 25.65538 103.65186 78.88379 279.17302
17.35000 -2559.68803 12.77792 42.74837 99.08316 77.48168 274.73105
17.45000 -2539.56352 7.35821 42.21538 104.56001 77.11598 268.94389
17.55000 -2531.46741 9.96432 38.16636 106.35204 84.60465 269.27730
17.65000 -2512.46670 15.13416 36.70219 94.08465 79.20172 277.72857
17.75000 -2500.95150 10.39455 40.68644 102.81968 87.08970 273.65315
17.85000 -2488.17643 8.14426 33.23498 92.56395 73.98953 259.33654
17.95000 -2468.87427 6.78327 37.46536 92.97417 92.71844 264.72907
18.05000 -2460.12946 11.11020 37.32803 94.23892 83.05607 260.69371
18.15000 -2450.81632 11.20861 33.82273 84.84768 66.79128 252.38091
18.25000 -2434.00559 12.00963 23.14406 82.92626 68.29297 252.22408
18.35000 -2418.39559 9.49882 27.44992 95.52277 74.86561 247.96204
18.45000 -2407.58497 8.52676 40.62174 80.45228 68.67942 239.57723
18.55000 -2396.78712 11.14391 50.33225 81.04913 75.10234 250.05531
18.65000 -2384.88269 11.34624 29.87316 81.47861 77.86539 237.94686
18.75000 -2366.89807 9.99694 25.90382 79.03012 63.85135 227.76104
18.85000 -2357.99732 11.15882 49.14750 77.65646 60.00934 230.57310
18.95000 -2340.24195 10.31615 26.23760 84.62184 68.41282 233.76194
19.05000 -2332.88367 8.45730 36.85500 81.87881 77.98729 228.15483
19.15000 -2318.74952 9.80281 34.51571 79.28224 70.27020 225.51521
19.25000 -2304.98165 11.46657 39.41580 70.65849 65.92821 233.22796
19.35000 -2292.40517 9.29743 25.21057 68.35465 60.70643 217.35811
19.45000 -2281.69170 7.57446 35.87787 60.11783 61.02012 222.77456
19.55000 -2275.13453 8.72993 39.18877 60.54219 52.82570 209.08199
19.65000 -2264.02943 9.31590 33.82534 63.14724 61.93681 211.58195
19.75000 -2255.80901 11.72004 46.56879 63.63498 59.17545 207.45500
19.85000 -2239.22342 9.69956 30.73435 64.73409 73.89525 203.96501
19.95000 -2232.10047 9.87689 35.96636 75.01593 94.41071 211.19881
