0.125 -0.009 0.007 0.022
0.375 0.027 -0.012 0.366
0.625 0.040 -0.057 0.920
0.875 0.015 -0.067 1.555
1.125 -0.016 -0.048 2.115
1.375 -0.004 -0.099 2.768
1.625 0.048 -0.125 3.551
1.875 -0.060 -0.169 4.409
2.125 -0.028 -0.188 5.732
2.375 -0.036 -0.151 7.185
2.625 -0.119 -0.172 8.650
2.875 -0.167 -0.254 10.375
3.125 -0.152 -0.267 12.022
3.375 -0.161 -0.339 14.019
3.625 -0.164 -0.363 15.842
3.875 -0.160 -0.408 17.516
4.125 -0.228 -0.394 19.503
4.375 -0.275 -0.388 20.201
4.625 -0.280 -0.398 21.165
4.875 -0.277 -0.464 22.068
5.125 -0.285 -0.479 21.851
5.375 -0.230 -0.414 21.788
5.625 -0.279 -0.373 21.355
5.875 -0.250 -0.372 20.319
6.125 -0.248 -0.350 20.293
6.375 -0.226 -0.426 20.431
6.625 -0.263 -0.408 19.701
6.875 -0.300 -0.345 20.377
7.125 -0.257 -0.355 21.619
7.375 -0.288 -0.386 22.527
7.625 -0.248 -0.356 22.535
7.875 -0.197 -0.462 23.022
8.125 -0.231 -0.355 23.542
8.375 -0.091 -0.327 23.903
8.625 -0.171 -0.346 24.598
8.875 -0.132 -0.305 23.678
9.125 -0.099 -0.315 23.264
9.375 -0.066 -0.201 22.240
9.625 -0.178 -0.184 22.161
9.875 -0.230 -0.151 21.259
10.125 -0.323 -0.124 20.911
10.375 -0.208 -0.117 18.974
10.625 -0.239 -0.191 18.477
10.875 -0.208 -0.062 16.982
11.125 -0.280 -0.106 15.641
11.375 -0.252 -0.122 15.514
11.625 -0.236 -0.163 15.022
11.875 -0.167 -0.218 13.960
12.125 -0.206 -0.160 13.042
12.375 -0.147 -0.189 12.489
12.625 -0.149 -0.156 12.695
12.875 -0.070 -0.127 11.674
13.125 -0.076 -0.178 11.330
13.375 -0.064 -0.174 10.428
13.625 -0.073 -0.132 10.314
13.875 -0.049 -0.139 10.540
14.125 -0.061 -0.111 8.873
14.375 -0.017 -0.099 8.890
14.625 -0.040 -0.094 8.381
14.875 0.007 -0.075 7.800
15.125 -0.031 -0.116 7.858
15.375 -0.024 -0.069 7.264
15.625 -0.013 -0.048 7.624
15.875 -0.003 -0.024 6.532
16.125 0.026 -0.007 6.577
16.375 0.003 -0.003 5.943
16.625 0.001 0.008 5.619
16.875 -0.023 0.019 5.347
17.125 -0.046 0.024 4.778
17.375 -0.060 0.021 4.882
17.625 -0.064 0.031 4.222
17.875 -0.045 0.036 3.913
18.125 -0.049 0.047 4.131
18.375 -0.040 0.020 3.802
18.625 -0.046 0.016 3.334
18.875 -0.050 0.036 2.919
19.125 -0.050 0.019 2.813
19.375 -0.059 0.017 2.598
19.625 -0.048 0.008 2.436
19.875 -0.058 -0.007 2.050
