0.12500 0.01785
0.37500 0.06172
0.62500 0.11122
0.87500 0.17270
1.12500 0.22642
1.37500 0.27685
1.62500 0.28893
1.87500 0.33151
2.12500 0.35520
2.37500 0.37995
2.62500 0.39796
2.87500 0.42589
3.12500 0.44056
3.37500 0.46076
3.62500 0.46414
3.87500 0.47926
4.12500 0.49317
4.37500 0.50412
4.62500 0.51972
4.87500 0.49915
5.12500 0.45787
5.37500 0.44363
5.62500 0.39564
5.87500 0.35332
6.12500 0.32535
6.37500 0.28596
6.62500 0.25041
6.87500 0.20860
7.12500 0.17361
7.37500 0.13626
7.62500 0.10736
7.87500 0.09042
8.12500 0.07215
8.37500 0.06774
8.62500 0.08137
8.87500 0.09316
9.12500 0.10852
9.37500 0.13043
9.62500 0.13553
9.87500 0.16468
10.12500 0.15127
10.37500 0.14689
10.62500 0.12580
10.87500 0.10272
11.12500 0.08431
11.37500 0.06578
11.62500 0.02822
11.87500 0.02457
12.12500 0.01108
12.37500 0.02657
12.62500 0.03002
12.87500 0.05008
13.12500 0.04268
13.37500 0.05147
13.62500 0.04592
13.87500 0.05554
14.12500 0.05982
14.37500 0.04215
14.62500 0.05950
14.87500 0.06983
15.12500 0.07514
15.37500 0.09916
15.62500 0.08161
15.87500 0.09461
16.12500 0.13955
16.37500 0.11764
16.62500 0.11611
16.87500 0.12816
17.12500 0.11774
17.37500 0.11778
17.62500 0.12228
17.87500 0.11514
18.12500 0.12791
18.37500 0.09657
18.62500 0.07221
18.87500 0.05841
19.12500 0.09516
19.37500 0.05726
19.62500 0.06417
19.87500 0.05717
