0.1875 -1.66344 21.80558 1.24712 80.61077 81.32775 73.37619
0.5625 -1.52953 52.90585 0.77782 77.21842 77.14528 69.47823
0.9375 -0.65791 77.70262 0.48556 71.40195 69.25544 63.84426
1.3125 -0.00419 95.49754 -0.82034 66.13041 63.12385 59.97911
1.6875 -0.82207 111.82534 1.11441 61.36907 58.39482 56.09466
2.0625 -1.60148 127.06974 0.26173 56.0315 52.58856 51.79097
2.4375 -0.83578 136.96455 0.02914 52.22455 48.49492 48.40055
2.8125 -1.64708 146.23345 -0.22727 49.37216 45.2333 44.96222
3.1875 -0.24364 154.29125 -0.21135 47.23741 41.79358 42.31505
3.5625 -1.30913 160.35753 -0.28179 44.83108 39.49363 39.73844
3.9375 -0.4285 165.83535 -0.90914 43.34105 35.92914 38.21463
4.3125 -1.05632 169.38867 0.0472 41.23937 34.27167 36.25819
4.6875 -1.18159 174.40758 -0.55609 39.20549 33.74239 34.89446
5.0625 -0.48739 178.43572 -0.42535 37.63382 31.92236 32.72811
5.4375 0.004 182.45864 -1.18725 35.74965 30.30345 30.8417
5.8125 -0.03666 185.88803 -0.83093 34.92493 29.18541 29.83109
6.1875 1.25276 188.81401 -0.74183 33.66809 27.15139 28.00865
6.5625 0.61866 190.40637 -0.69548 32.65088 25.74799 26.96385
6.9375 0.49806 192.37095 -0.41758 30.85998 24.99032 25.6656
7.3125 -0.59324 194.45053 -1.00802 29.81493 24.44715 24.54257
7.6875 0.05564 197.58311 0.42389 28.25501 23.09895 23.50748
8.0625 0.26141 198.34231 0.79603 27.9021 21.79905 22.77898
8.4375 0.57257 200.3681 0.42428 26.54515 20.61808 21.38697
8.8125 0.84376 201.1012 1.77798 25.27659 19.81683 20.61901
9.1875 -0.16153 200.94441 1.96301 24.86359 19.27399 19.75763
9.5625 -0.06588 201.43246 1.93812 24.61002 18.28216 19.26544
9.9375 -1.25004 202.31776 3.08047 23.38501 17.69959 17.71945
10.3125 -1.53002 203.15622 3.18041 22.82624 16.95614 17.56327
10.6875 -2.03045 203.79767 2.24155 21.44603 15.92089 16.92871
11.0625 -0.20193 205.21971 1.09154 20.73284 16.15805 16.18915
11.4375 0.99032 205.29182 0.38943 19.33913 15.19045 15.39986
11.8125 1.0783 205.25657 -1.14483 19.18089 13.95541 14.85295
12.1875 1.43745 204.22567 -1.43448 18.71318 13.68957 14.39899
12.5625 0.2627 204.05119 -2.10307 18.24036 13.28456 14.01271
12.9375 0.52891 205.21318 -2.35956 17.85432 14.16738 12.96104
13.3125 0.57332 205.83333 -1.51199 17.75675 13.35261 12.08221
13.6875 1.01077 207.62885 -1.10935 16.26471 12.16603 12.10859
14.0625 0.72093 206.31049 -1.53841 15.22944 11.63358 11.46558
14.4375 -0.01688 206.77706 0.09841 15.4742 11.11737 10.68891
14.8125 -1.02333 206.17217 -0.48724 14.24059 10.64919 10.5321
15.1875 -2.06707 205.20543 -0.97258 13.99564 10.61525 10.02569
15.5625 -0.75787 205.67097 -0.58228 13.41742 10.10299 10.07016
15.9375 -0.26536 206.68282 -0.10744 12.76057 9.79923 8.95953
16.3125 0.78885 206.4285 1.06499 12.43875 9.56969 8.76847
16.6875 1.30941 206.36982 1.30048 11.95631 9.69763 8.49465
17.0625 2.15933 207.91435 1.50227 11.30375 9.61705 8.76306
17.4375 2.53135 208.18596 1.57815 11.52356 9.43678 8.7126
17.8125 2.07822 207.44302 0.49112 12.15722 8.44537 8.27937
18.1875 1.1757 207.0897 0.27963 11.33253 8.74259 7.78123
18.5625 -0.27236 206.97612 -0.55184 10.36518 8.44599 7.33423
18.9375 -0.64165 205.98944 -1.32642 11.2073 8.40662 7.1881
19.3125 -1.88964 206.69497 -1.31171 9.81917 8.07191 8.25571
19.6875 -2.20516 206.32486 -3.28396 9.12899 7.1965 6.83561
20.0625 -2.85759 206.7368 -3.48224 9.57159 5.38041 7.31518
20.4375 -2.71685 206.54832 -3.28348 8.56149 5.07968 6.72435
20.8125 -3.18221 205.45212 -3.70568 8.31765 5.38095 5.62339
21.1875 -2.30857 204.07095 -2.28937 8.54123 5.18469 6.33864
21.5625 -1.91562 204.26812 -1.55711 7.45424 5.44178 6.79949
21.9375 1.24036 204.39632 -1.55073 7.91469 5.74822 6.08467
22.3125 2.16445 205.25417 -1.61472 7.42229 5.89904 5.25267
22.6875 2.77241 204.41635 -0.98539 8.19324 6.06211 5.76771
23.0625 2.1921 205.21731 -0.69166 7.42789 6.45743 6.41252
23.4375 1.93917 204.914 0.44966 7.19951 7.15474 6.58792
23.8125 1.7061 205.05292 -0.47768 7.41901 6.3158 5.36497
24.1875 0.40151 206.6178 -0.93893 6.06277 5.11655 5.44815
24.5625 -0.37736 206.93504 -1.14952 6.60534 6.37764 4.51356
24.9375 -1.24659 206.51114 -1.24226 6.18264 3.45669 5.62229
25.3125 -0.10493 204.57372 -0.22399 4.95204 4.24041 5.80404
25.6875 -2.76318 204.42985 0.59771 5.64772 5.65487 5.55001
26.0625 -1.88388 203.90415 -1.7538 8.0731 4.21048 5.864
26.4375 -3.16369 205.30143 -1.60754 8.21968 2.73406 4.92915
26.8125 -3.84293 203.79609 -1.25287 6.56767 4.42426 4.96392
27.1875 -1.17821 204.24832 0.36107 6.87012 2.64925 6.60551
27.5625 -4.78156 202.17326 -1.8649 5.37941 2.85508 4.06702
27.9375 -2.07405 201.30523 -2.02146 4.84213 2.83027 5.36239
28.3125 -2.87289 200.0946 -3.5987 4.31421 3.33452 3.56442
28.6875 -1.24762 200.66693 -2.11168 6.40071 2.89109 6.37946
29.0625 1.64008 199.90328 -2.36102 4.15892 4.63799 4.94799
29.4375 0.14831 200.63413 -1.66169 1.77908 3.551 2.8572
29.8125 -5.91284 197.68805 -3.31626 5.06079 6.56512 3.48365
