0.120000 -3.078040
0.380000 2.706230
0.620000 2.613400
0.880000 2.592850
1.120000 2.645000
1.380000 2.696170
1.620000 2.621120
1.880000 2.617370
2.120000 2.600800
2.380000 2.618760
2.620000 2.592220
2.880000 2.589830
3.120000 2.605880
3.380000 2.573890
3.620000 2.588740
3.880000 2.539510
4.120000 2.516090
4.380000 2.455700
4.620000 2.492070
4.880000 2.402210
5.120000 2.392350
5.380000 2.488870
5.620000 2.367490
5.880000 2.468260
6.120000 2.240250
6.380000 2.372710
6.620000 2.321880
6.880000 1.893400
7.120000 2.286090
7.380000 2.209380
7.620000 -3.057680
7.880000 2.670230
8.120000 2.991800
8.380000 2.812480
8.620000 2.891350
8.880000 3.101880
9.120000 2.904460
9.380000 3.045380
9.620000 2.859880
9.880000 1.944510
10.120000 2.561640
10.380000 1.321970
10.620000 0.495990
10.880000 0.520480
11.120000 -0.221250
11.380000 -0.717860
11.620000 -0.941460
11.880000 -0.677060
12.120000 -0.781880
12.380000 -1.136970
12.620000 -1.032020
12.880000 -1.408280
13.120000 -1.236860
13.380000 -1.357320
13.620000 -1.693980
13.880000 -0.977340
14.120000 -1.731100
14.380000 -1.967690
14.620000 -0.503700
14.880000 -0.713980
