0.05000 1390.70633
0.15000 2486.72463
0.25000 3311.24771
0.35000 4090.89345
0.45000 4831.03418
0.55000 5338.99939
0.65000 5684.82404
0.75000 5828.42575
0.85000 5902.15558
0.95000 5875.66679
1.05000 5801.22859
1.15000 5795.92870
1.25000 5718.77450
1.35000 5574.15643
1.45000 5459.52811
1.55000 5325.08918
1.65000 5082.97179
1.75000 4919.42142
1.85000 4824.51085
1.95000 4733.90607
2.05000 4601.46732
2.15000 4481.56110
2.25000 4300.42561
2.35000 4275.58156
2.45000 4133.65336
2.55000 4033.03113
2.65000 3931.32106
2.75000 3777.79125
2.85000 3680.77904
2.95000 3570.79134
3.05000 3464.09821
3.15000 3415.44105
3.25000 3249.99324
3.35000 3201.29332
3.45000 3113.23467
3.55000 3037.55055
3.65000 2928.03048
3.75000 2813.91460
3.85000 2759.53326
3.95000 2682.67500
4.05000 2592.50876
4.15000 2550.59561
4.25000 2458.60110
4.35000 2412.70933
4.45000 2380.94558
4.55000 2290.17377
4.65000 2214.73622
4.75000 2184.08228
4.85000 2116.91310
4.95000 2058.58476
5.05000 2019.19026
5.15000 1973.99683
5.25000 1924.77312
5.35000 1890.96698
5.45000 1835.79503
5.55000 1812.83954
5.65000 1745.21323
5.75000 1716.54499
5.85000 1676.38441
5.95000 1631.28812
6.05000 1598.57281
6.15000 1532.56298
6.25000 1525.65521
6.35000 1488.28433
6.45000 1463.76439
6.55000 1413.87269
6.65000 1403.41169
6.75000 1366.95187
6.85000 1337.40616
6.95000 1283.61795
7.05000 1264.28341
7.15000 1232.97167
7.25000 1203.90950
7.35000 1180.65405
7.45000 1167.46794
7.55000 1134.37464
7.65000 1099.79435
7.75000 1072.21823
7.85000 1059.94571
7.95000 1029.16688
8.05000 1004.96869
8.15000 981.57033
8.25000 967.81396
8.35000 928.11606
8.45000 917.03919
8.55000 897.04822
8.65000 873.48596
8.75000 845.09507
8.85000 833.16257
8.95000 820.40930
9.05000 800.43185
9.15000 783.25753
9.25000 765.64259
9.35000 737.54364
9.45000 728.09954
9.55000 714.86730
9.65000 717.13476
9.75000 692.80133
9.85000 667.33102
9.95000 656.65874
10.05000 643.58910
10.15000 625.73460
10.25000 613.54794
10.35000 587.55691
10.45000 586.62212
10.55000 566.77043
10.65000 565.68382
10.75000 542.45528
10.85000 547.85272
10.95000 527.63714
11.05000 522.37583
11.15000 516.50564
11.25000 498.66970
11.35000 486.71507
11.45000 475.73920
11.55000 481.01489
11.65000 463.15266
11.75000 469.00448
11.85000 451.74691
11.95000 433.33370
12.05000 432.68036
12.15000 416.30488
12.25000 410.78421
12.35000 397.04130
12.45000 393.19259
12.55000 397.97339
12.65000 377.38531
12.75000 359.19396
12.85000 360.70669
12.95000 359.72509
13.05000 349.62658
13.15000 337.18298
13.25000 334.50479
13.35000 326.73412
13.45000 320.25374
13.55000 319.66729
13.65000 310.53121
13.75000 293.82236
13.85000 297.57437
13.95000 292.06005
14.05000 287.72483
14.15000 273.71614
14.25000 271.28420
14.35000 271.03162
14.45000 271.46374
14.55000 262.59216
14.65000 257.06874
14.75000 251.44268
14.85000 250.68969
14.95000 250.97581
15.05000 242.48738
15.15000 232.03966
15.25000 233.36420
15.35000 223.65655
15.45000 223.91695
15.55000 218.03882
15.65000 212.87709
15.75000 212.56778
15.85000 207.80028
15.95000 206.33820
16.05000 202.22484
16.15000 198.03523
16.25000 197.16191
16.35000 186.77006
16.45000 192.12075
16.55000 184.76657
16.65000 178.57177
16.75000 174.40845
16.85000 176.59953
16.95000 169.42238
17.05000 157.31163
17.15000 167.49802
17.25000 166.87681
17.35000 154.00009
17.45000 159.14230
17.55000 150.57737
17.65000 148.13718
17.75000 143.91216
17.85000 143.99473
17.95000 137.22102
18.05000 139.32881
18.15000 137.58315
18.25000 134.06872
18.35000 134.01360
18.45000 132.40569
18.55000 130.14641
18.65000 128.37009
18.75000 122.97362
18.85000 122.08694
18.95000 116.14000
19.05000 113.36641
19.15000 123.08549
19.25000 127.36192
19.35000 113.11213
19.45000 114.59095
19.55000 110.60067
19.65000 109.85402
19.75000 103.65818
19.85000 112.22598
19.95000 104.18256
