0.120000 1.929930
0.380000 -2.378240
0.620000 2.436660
0.880000 1.115350
1.120000 1.352820
1.380000 1.823590
1.620000 1.264030
1.880000 -0.008150
2.120000 0.651970
2.380000 0.556790
2.620000 1.116010
2.880000 2.743990
3.120000 1.075570
3.380000 2.223930
3.620000 1.908950
3.880000 0.754550
4.120000 -0.338040
4.380000 -1.091810
4.620000 -1.910890
4.880000 -1.945790
5.120000 -1.124940
5.380000 -2.862330
5.620000 1.394810
5.880000 0.972550
6.120000 0.477290
6.380000 0.867710
6.620000 0.839020
6.880000 -0.350170
7.120000 0.654250
7.380000 -0.816570
7.620000 -0.613090
7.880000 -0.738160
8.120000 -0.174080
8.380000 -0.871290
8.620000 -0.357810
8.880000 -1.392290
9.120000 -0.984350
9.380000 -0.770290
9.620000 -0.640400
9.880000 0.300170
10.120000 -0.588980
10.380000 2.537170
10.620000 -2.903720
10.880000 2.338130
11.120000 -3.101250
11.380000 2.474280
11.620000 -2.396920
11.880000 1.754150
12.120000 -1.296270
12.380000 3.085140
12.620000 2.836160
12.880000 1.453150
13.120000 2.557290
13.380000 1.841670
13.620000 0.934910
13.880000 1.582230
14.120000 1.122150
14.380000 1.897020
14.620000 -2.315970
14.880000 -0.786820
15.120000 -0.208980
15.380000 1.007750
15.620000 1.003180
15.880000 1.590290
16.120000 1.380500
16.380000 -3.013550
16.620000 1.803330
16.880000 0.477710
17.120000 -2.908610
17.380000 -2.377310
17.620000 -2.883770
17.880000 -2.874560
18.120000 1.230130
18.380000 1.501910
18.620000 2.944570
18.880000 -2.883160
19.120000 0.988750
19.380000 -2.642220
19.620000 1.387430
19.880000 1.493700
