0.05000 -3516.94203 -2353.47610 -4609859.78016 0.00000 0.00000 0.00000
0.15000 -23.71800 -85.40225 139556.54811 2177.86519 2819.59278 651191.83532
0.25000 -385.97705 717.04522 -279406.44633 3040.99760 2659.45670 1485153.88430
0.35000 -345.61333 -175.73248 -152314.20200 2616.91559 2964.83870 515432.87280
0.45000 -523.18458 317.21802 218157.69423 2656.87762 2795.77004 1320604.95240
0.55000 -732.32399 6.98193 75734.04953 2325.99449 2959.95813 1738860.38951
0.65000 -1004.02827 80.54837 146669.57184 2403.04624 2686.26018 1551925.07857
0.75000 -1284.33220 95.89724 -57569.76354 1910.73809 2877.59167 1336322.87775
0.85000 -1820.84813 86.42036 -52379.52691 1722.24853 2608.68324 756824.57561
0.95000 -2204.63728 -74.25614 -57690.70690 1340.35838 2527.83153 872269.14231
1.05000 -2571.33918 -98.22571 -6956.05613 1145.27825 2424.09455 1079221.36710
1.15000 -2861.50016 34.35118 29726.07678 878.12882 2342.37329 1332284.33075
1.25000 -3114.85810 -117.76131 19333.20404 870.12836 2135.93626 1253342.94996
1.35000 -3319.20469 -40.98293 67057.34530 722.44651 2073.56933 1225824.26721
1.45000 -3512.64242 68.30754 -117154.00444 617.93156 1889.87864 1893090.45927
1.55000 -3561.03050 18.89384 158943.42811 688.42835 1805.35226 1592250.54962
1.65000 -3621.99414 -41.66692 -94781.84477 550.95408 1655.32547 1997698.00740
1.75000 -3691.93927 -20.50551 -113279.75373 473.87000 1581.85351 2011480.48098
1.85000 -3751.85176 28.54495 -38477.53383 574.97102 1477.21804 1939221.55005
1.95000 -3836.30257 -3.52196 31394.85224 497.02490 1461.68183 1702834.17447
2.05000 -3886.40800 -12.00863 -33146.01701 423.13651 1370.16965 1739380.19296
2.15000 -3924.70856 62.82773 1356.12868 457.16277 1316.54606 1822285.59300
2.25000 -3943.52782 26.90803 -92021.41679 391.16547 1234.61505 1640178.16101
2.35000 -3960.68542 1.32849 56241.19902 433.69597 1183.13693 1893950.21148
2.45000 -3943.02273 -31.27099 43526.09100 447.32664 1106.21954 1453515.19923
2.55000 -3947.72501 -8.89333 75485.81124 412.17326 1080.62081 2357290.35387
2.65000 -3981.89834 -47.35740 7289.48826 398.11195 1057.01898 2000282.07409
2.75000 -3982.19506 -43.60856 39823.43388 436.31810 1021.42169 2635419.82820
2.85000 -3984.92902 -0.44604 23958.60046 365.21268 991.13722 1928134.48703
2.95000 -4008.92745 19.47216 -14943.17009 367.25892 946.08496 2550252.64298
3.05000 -4006.65002 9.25673 -64788.74158 364.90500 936.99489 2044736.34541
3.15000 -3997.66988 18.03438 -85825.34475 311.82616 879.03469 2161596.13287
3.25000 -3994.73731 -23.52867 67818.21235 300.96115 870.78815 1728146.85965
3.35000 -3994.68331 5.57134 30627.80539 300.82418 800.66219 1677377.81943
3.45000 -3966.87483 10.66170 -2040.90774 342.43535 810.07007 2325578.80538
3.55000 -3964.48914 -3.87229 17134.74119 326.44502 775.22469 1901022.80487
3.65000 -3942.01140 3.49669 -115434.57558 312.44226 765.48274 1918095.46151
3.75000 -3931.24320 10.76693 -38664.11980 407.89942 712.15527 2471493.20046
3.85000 -3905.26665 -10.32469 21884.21598 319.13903 715.62242 2026330.49706
3.95000 -3911.06344 0.10453 -95337.55598 310.13900 681.29737 2244262.56776
4.05000 -3876.80393 12.51195 -1464.72387 354.77793 677.18425 2216069.60141
4.15000 -3867.07358 4.94866 -25181.84394 311.08164 650.13181 2384674.34849
4.25000 -3845.82591 -2.99878 -51080.62283 334.08096 611.29332 2074060.65535
4.35000 -3844.91054 5.36121 -3904.54617 302.26630 609.78733 2097073.19578
4.45000 -3814.22468 -0.05499 -11093.12821 298.02151 590.21270 2221683.99821
4.55000 -3801.17473 -0.46402 2990.80777 335.48037 561.32419 2274732.54175
4.65000 -3787.18636 15.24838 51591.76203 282.00701 561.29030 2423138.79958
4.75000 -3774.63583 7.82577 -51764.54802 318.86308 555.64895 2130552.16490
4.85000 -3759.75189 -17.96504 44665.61660 256.40454 528.93454 2323512.02923
4.95000 -3747.80050 20.20514 32823.47607 265.82473 529.19830 2443662.81678
5.05000 -3743.42023 3.22350 -2145.66402 265.76551 511.16779 2213950.03683
5.15000 -3716.11153 1.10457 -17308.35236 294.29611 512.07235 2296830.60201
5.25000 -3694.64883 -9.53518 46122.95280 278.07136 519.42944 2294345.98982
5.35000 -3686.80340 -3.83011 6295.71409 286.10448 479.14623 2366497.52043
5.45000 -3670.27045 -9.92214 9406.02435 200.22396 452.27970 2258549.27228
5.55000 -3657.52300 12.51692 -46843.69819 251.28461 457.18268 2312727.34290
5.65000 -3638.45903 -12.02014 -99481.27473 269.68240 434.15226 2097564.11323
5.75000 -3611.68866 0.04025 -26124.36065 214.53250 429.82478 2426346.87090
5.85000 -3611.29823 -2.66921 12863.33891 234.84614 427.91512 2342405.47513
5.95000 -3599.97472 9.52602 35175.26950 172.62889 397.41205 2360851.68161
6.05000 -3571.02286 -16.96328 16092.22549 216.36420 420.15164 2393902.23529
6.15000 -3548.38655 5.14845 -36107.22466 235.44841 399.17057 2391948.83798
6.25000 -3539.32029 9.05992 66631.19693 188.37709 394.49230 2407885.03623
6.35000 -3529.92573 0.43014 -29170.21867 216.63105 379.40923 2379318.75464
6.45000 -3501.09706 1.72464 63901.40192 250.76627 390.71241 2417222.48929
6.55000 -3489.20360 8.99083 -97524.35553 224.48951 369.47822 2430791.19978
6.65000 -3486.59700 -8.37656 -28572.88319 229.88077 361.37513 2416988.45789
6.75000 -3461.05269 0.52326 -84126.32081 196.07164 358.30183 2180761.88984
6.85000 -3442.21680 4.26068 90510.04968 232.41868 363.22692 2339360.70144
6.95000 -3430.19475 -8.55686 110636.58347 190.20557 350.94219 2766488.71724
7.05000 -3412.25556 -8.59146 24106.61290 155.74966 326.73288 2309419.80439
7.15000 -3394.41282 -5.23575 12300.23831 168.72061 331.74480 2053901.97477
7.25000 -3372.56220 10.99994 -127408.13224 229.68371 340.13155 2461731.74866
7.35000 -3357.13233 -4.67914 6727.56841 193.57356 327.65091 2158028.43208
7.45000 -3339.12120 4.39678 -2519.90559 184.52710 307.15115 2081486.34732
7.55000 -3325.23873 -12.68060 -81060.23971 149.21105 297.85074 2173372.61417
7.65000 -3305.90908 5.41493 -64224.22122 164.77864 288.15417 2147414.65677
7.75000 -3290.24495 2.81512 -79906.54500 168.73094 306.33847 2358043.04258
7.85000 -3274.29185 2.46487 58847.70106 173.74662 297.29353 2344110.36299
7.95000 -3257.95086 -0.71793 34011.83373 141.63057 272.65575 2251092.71778
8.05000 -3248.35529 2.47535 1723.26060 135.75536 279.25416 2147206.07295
8.15000 -3232.34740 0.14031 -65725.57274 138.40896 271.90822 2368421.13782
8.25000 -3210.76151 -9.43328 4277.18898 179.89670 268.28614 2196968.24403
8.35000 -3198.20307 4.24103 32613.69933 137.26334 264.11870 2527165.19501
8.45000 -3173.99242 -2.54398 -40232.14763 151.53214 268.90183 2186269.90737
8.55000 -3165.70535 5.58551 53911.59444 192.90378 254.79324 2235849.02138
8.65000 -3147.99145 -3.34529 36045.78807 157.76042 267.91412 2289557.09865
8.75000 -3130.89254 -4.68316 -5171.29021 140.96500 242.67835 2321024.61719
8.85000 -3110.75521 6.64569 1830.91579 141.70481 249.68892 2291325.06448
8.95000 -3094.93203 -6.33547 -8161.52789 192.87347 251.56545 2306229.75577
9.05000 -3083.60011 2.17958 4597.31049 158.87492 235.44948 2194733.72242
9.15000 -3063.09436 -0.05186 -40576.46194 157.70739 240.22901 2369456.83346
9.25000 -3050.26152 -0.15078 -69608.35737 131.07728 224.07354 2309502.58040
9.35000 -3035.24753 -2.63097 -30256.06112 128.25847 240.63652 2291655.21561
9.45000 -3019.41191 0.55940 -47381.13204 131.03402 232.98851 2352405.90409
9.55000 -3003.09271 -2.28724 -43488.86437 141.76377 221.89115 2311301.78892
9.65000 -2982.73184 2.34082 -19176.10940 181.33967 208.66634 2340961.98317
9.75000 -2970.40240 5.98806 -49383.06582 133.36809 220.52816 2166449.24824
9.85000 -2951.19214 -2.57249 -16575.73356 157.44323 213.59785 2461085.91063
9.95000 -2937.55834 0.35109 -65831.59927 155.98503 213.36134 2259951.29925
10.05000 -2923.40007 -0.96209 101024.01375 134.78900 204.17587 2317020.73108
10.15000 -2899.72131 0.49044 5383.19478 139.44935 200.96860 2531387.72223
10.25000 -2894.72823 5.30747 -37004.56127 142.22465 213.62885 2296758.88817
10.35000 -2876.33219 1.95397 65148.09820 131.09104 197.10385 1959264.60936
10.45000 -2864.79753 3.94899 -4884.83183 140.08289 191.63176 2035582.82343
10.55000 -2847.98812 5.83491 15225.47617 125.45648 192.67933 2311377.93815
10.65000 -2832.00178 -2.37105 86124.90481 125.30933 182.94769 2132035.33260
10.75000 -2818.03985 2.09597 41232.99873 127.69183 187.45035 2183862.70688
10.85000 -2807.67706 -5.44716 -25663.26269 112.29430 190.56973 2108884.68573
10.95000 -2790.30437 -0.95594 14696.38376 115.08804 180.30007 2318152.17241
11.05000 -2777.02385 -4.29148 75074.27516 106.38120 178.18157 2291226.56994
11.15000 -2760.49713 0.23662 20712.82622 119.80773 174.89588 2179789.84333
11.25000 -2746.11650 0.68961 -18260.54560 115.69960 170.29039 2114768.46518
11.35000 -2733.89518 2.15827 44955.91837 112.89996 192.16301 2239850.79411
11.45000 -2721.00706 3.75717 549.85818 132.06539 182.81928 2339861.68909
11.55000 -2710.32924 -1.91020 -25571.62015 131.70058 170.81520 2218363.78797
11.65000 -2698.60730 4.76250 -85769.88363 130.34684 171.72592 1953665.91697
11.75000 -2679.77935 -1.19533 -58681.29100 109.77606 166.53120 1953984.80741
11.85000 -2669.58527 2.05908 -23715.44254 108.36537 162.77482 2350845.08318
11.95000 -2652.95113 2.72069 -29908.99970 123.89095 162.13205 2045857.68010
12.05000 -2641.52388 2.07618 58968.09477 109.52145 170.70521 2236959.34103
12.15000 -2627.47827 5.66226 -35935.46939 107.61101 163.09028 1914966.97851
12.25000 -2615.73232 1.13402 25449.01753 100.09108 151.48723 2307478.68399
12.35000 -2603.62856 0.08633 -39120.84755 105.52215 156.00324 1921228.60419
12.45000 -2594.42509 -1.78595 -65373.31248 104.77889 166.79259 2087293.31583
12.55000 -2572.59968 -4.97178 4107.67807 132.60869 170.82878 2112955.47009
12.65000 -2569.27443 -0.13592 -19126.28556 139.78404 166.49861 2174109.70684
12.75000 -2548.87608 3.04836 -18310.10078 114.70080 149.45204 2189542.46377
12.85000 -2536.44972 -1.79148 45514.39139 114.78484 161.68370 2057871.67607
12.95000 -2527.67233 6.81211 -20950.07327 105.46578 137.41892 2015693.83448
13.05000 -2512.68433 1.90182 -59831.18658 93.50774 149.33796 1970939.29456
13.15000 -2498.37749 3.93708 24069.31328 95.97534 146.57393 2040955.96026
13.25000 -2489.25249 2.59748 26670.88276 99.30355 138.08769 2044159.89299
13.35000 -2477.32751 2.48173 5999.05836 103.20251 142.19082 2048294.34074
13.45000 -2462.72794 2.67417 15085.52609 112.33502 142.51672 2279098.02774
13.55000 -2448.91532 -2.51507 45953.53435 102.80528 151.06785 2024591.88167
13.65000 -2436.64375 -0.85657 -41967.20632 142.28404 131.71615 2047751.03678
13.75000 -2429.01185 -0.69095 -86347.28043 90.84748 125.08819 2279510.80412
13.85000 -2416.86451 1.62667 -42555.93512 107.87469 139.68105 2039747.13547
13.95000 -2404.12376 1.98969 -37956.96495 124.12967 131.98526 1898383.62933
14.05000 -2396.43898 2.60987 41577.59857 109.68829 135.53099 1968495.29124
14.15000 -2385.76474 2.79282 -32851.82774 90.53496 121.65588 2206991.66277
14.25000 -2368.27773 -0.72572 -1018.59434 97.18171 142.38317 1913226.20174
14.35000 -2357.80722 2.69191 -27758.27772 97.65356 123.38606 2099531.69683
14.45000 -2349.86464 3.03925 -9891.23418 97.27111 130.98922 2047522.81049
14.55000 -2334.76121 1.40659 -3358.29445 112.29546 115.72750 2107630.34625
14.65000 -2325.15742 -1.57250 115167.78191 107.07366 126.28836 2127093.28514
14.75000 -2312.69967 -4.99902 -4090.61492 105.82581 117.91332 1782289.97644
14.85000 -2303.92539 0.40929 29198.38704 93.43932 111.26872 1795224.64579
14.95000 -2292.38575 0.60449 22564.92541 84.85621 111.53158 2137134.60257
15.05000 -2283.96408 -1.34912 -5501.59579 85.90109 116.54882 1897733.42414
15.15000 -2268.86796 -1.63549 45011.88894 81.64346 114.82426 1954464.84898
15.25000 -2261.65603 3.85773 -11611.18930 97.43040 128.61277 2088810.83135
15.35000 -2252.88033 -3.68622 -7001.92473 113.87336 114.06465 2177843.77571
15.45000 -2242.68907 -2.45436 41206.52306 93.78515 107.10871 1878587.93867
15.55000 -2231.83777 -1.49849 46287.47354 77.48430 102.96547 1913616.44105
15.65000 -2219.47077 3.59174 -12635.27581 90.03925 112.46424 1791903.65551
15.75000 -2210.16602 -0.14775 21438.35525 89.94778 112.93940 1946007.35840
15.85000 -2198.22377 -1.77595 32944.33901 107.71819 102.88715 1904670.72695
15.95000 -2189.86425 -1.71242 58192.00616 78.52916 109.03930 1940014.84150
16.05000 -2179.81425 2.22874 -72584.05595 78.96002 107.98191 2066378.92452
16.15000 -2168.60937 -1.68924 -61232.68871 75.69772 100.74051 1992246.31334
16.25000 -2158.15572 0.51405 -192.08454 89.33772 107.74615 2054421.00038
16.35000 -2149.06986 1.28679 -17096.22631 81.21199 105.07884 1945999.26527
16.45000 -2139.07070 -0.68935 -13257.59533 98.19660 103.96845 2150594.69788
16.55000 -2126.71408 -1.52841 -15329.98315 96.89642 124.51163 1674688.91652
16.65000 -2119.86179 1.77928 29255.57220 73.56549 94.50087 1938642.52546
16.75000 -2110.23985 -1.74724 -44724.96315 71.41040 85.19586 1830952.40803
16.85000 -2096.93923 -3.19124 37023.49328 124.17936 101.90138 1884434.40770
16.95000 -2089.36268 0.39891 -33328.19696 80.60092 115.22814 1695792.65617
17.05000 -2078.70568 -2.62957 -13281.05536 72.04497 91.24727 1935700.79553
17.15000 -2073.15579 -0.08229 -57553.48457 75.22869 104.73947 1785146.47432
17.25000 -2063.83691 1.00181 2339.61095 78.71337 97.04308 1852974.99168
17.35000 -2052.56683 -2.88992 13514.85548 80.85331 86.69699 1830292.30187
17.45000 -2043.26911 3.08763 -20514.97514 76.75759 100.08565 1848297.32384
17.55000 -2035.52464 1.84779 -33073.96306 67.51706 84.46612 2027865.34071
17.65000 -2027.11044 -1.29194 18438.03689 83.41539 91.89081 2015331.58155
17.75000 -2017.07765 -0.81748 -29723.10904 79.48339 95.02946 1787768.11010
17.85000 -2006.69669 -1.69515 51214.48783 107.75536 117.22780 1990100.70629
17.95000 -1999.65175 -1.72208 -5211.99812 102.80599 134.28506 1688909.97794
18.05000 -1994.11789 0.52209 -45446.22756 72.44353 93.44785 1826119.76149
18.15000 -1981.97538 0.91145 11056.51305 71.31409 83.31411 1760958.42078
18.25000 -1972.58198 -0.00299 16591.89253 71.93285 86.87277 1866624.24355
18.35000 -1964.66081 0.62184 30404.04507 67.10209 79.58209 1572488.48696
18.45000 -1954.73044 0.92642 3643.55325 64.54822 84.46459 1929889.52705
18.55000 -1946.59055 -0.25368 -3214.20707 67.20886 87.85330 1725508.92034
18.65000 -1936.66233 -0.52683 64347.13653 70.24465 81.38889 1918653.26713
18.75000 -1928.97798 -0.59828 14288.68779 71.27985 85.86271 1797420.06204
18.85000 -1923.45115 0.99199 17069.06689 69.39852 84.59921 1859132.48999
18.95000 -1913.80052 -0.57607 49468.13399 73.29134 88.71542 1803870.82469
19.05000 -1908.06012 -3.02195 2716.75793 63.66129 72.72222 1830876.44307
19.15000 -1897.71723 1.35289 33701.62554 69.33158 89.53897 1683833.60141
19.25000 -1886.47758 0.22666 5433.94321 115.38586 78.23249 1701972.77252
19.35000 -1878.88679 -1.16258 95981.39985 66.34413 82.66949 1895556.93147
19.45000 -1870.88013 -0.79769 -16632.15920 68.76231 91.80764 1874275.63321
19.55000 -1864.92103 1.45707 -39181.64390 69.96214 88.68021 1763980.41761
19.65000 -1854.58077 0.90165 -7561.42685 86.29167 79.98130 1798370.90128
19.75000 -1848.50313 -1.07380 162.80082 62.55672 90.98419 1637861.57411
19.85000 -1841.20579 -0.11916 -58403.49794 65.09193 84.12258 1701982.97829
19.95000 -1830.17910 -0.82134 -19978.59356 78.76490 101.55384 1745332.99049
