0.1875 -1.22627 17.71902 1.92004 81.91338 81.12427 75.80658
0.5625 -1.48637 42.49264 -0.27913 79.47381 80.07173 71.85338
0.9375 0.45255 65.75732 -0.50806 75.99259 76.39542 68.40182
1.3125 1.26296 85.09154 -0.90916 72.95102 71.32533 64.52131
1.6875 1.54189 101.04958 -0.62544 67.9871 65.77196 61.63782
2.0625 0.55556 114.45658 0.55747 65.99425 60.78657 57.54207
2.4375 1.46508 124.67871 0.33402 62.83145 57.4991 54.56176
2.8125 -0.03733 134.06878 -0.17936 58.75337 54.10304 51.16372
3.1875 -0.66805 143.53511 -0.276 54.89879 50.72234 49.26059
3.5625 -2.72972 151.85381 -0.69346 52.25575 47.56749 45.59534
3.9375 -1.77298 159.49153 -0.40824 49.75183 44.52234 43.55881
4.3125 -2.29256 166.72969 0.25128 46.87933 41.87129 41.64165
4.6875 -1.92783 170.53893 -0.28798 45.76126 39.41678 39.28237
5.0625 -2.06183 175.21354 1.0892 44.23747 37.89719 38.5342
5.4375 -0.89828 179.90911 -0.60591 42.62657 35.84451 36.52738
5.8125 0.13581 183.01657 0.66276 40.72317 34.84497 34.85879
6.1875 -0.06754 187.10417 0.52045 39.99782 33.84633 33.13036
6.5625 0.45713 191.19322 0.42773 37.95633 32.12579 32.27138
6.9375 0.17581 193.91836 0.35058 36.42936 30.10578 30.91847
7.3125 0.22868 195.74328 0.39605 35.42258 29.12642 29.78221
7.6875 1.07949 197.42288 -0.03149 34.92758 28.38342 28.97665
8.0625 -0.33074 200.23919 -0.26127 33.59195 27.47043 27.26314
8.4375 -0.69507 202.38694 -1.117 32.08712 26.07688 25.47222
8.8125 -0.21923 204.40824 -0.83976 30.42254 25.24211 25.76564
9.1875 -0.69445 205.99141 -1.49369 29.75976 23.41533 24.15295
9.5625 -0.34468 206.6097 -0.64309 29.49141 21.98971 23.72943
9.9375 -0.24449 207.30031 -0.72434 28.18051 22.17006 23.02382
10.3125 -0.62621 208.79152 0.56518 26.72384 21.07158 22.01641
10.6875 -1.43429 208.3939 1.05675 26.6418 19.64839 21.38275
11.0625 -0.98083 209.21769 0.85627 26.1578 19.46166 20.13808
11.4375 -0.99412 209.80215 1.42761 25.02575 18.16881 19.74895
11.8125 -1.07643 209.54671 1.11761 24.28789 18.37581 19.16646
12.1875 -1.02556 209.45677 0.31571 24.24492 18.05041 18.12172
12.5625 -1.54478 209.24509 1.17507 22.02064 17.30262 17.61768
12.9375 -0.6662 209.45899 0.07234 22.42363 17.23615 17.01647
13.3125 0.81327 210.60673 0.53138 21.66565 16.04785 16.64122
13.6875 -0.41889 210.10581 -0.32079 21.07015 15.9408 15.84646
14.0625 -0.07823 210.48786 -0.06154 20.75652 14.89107 15.33923
14.4375 -0.44013 211.29941 0.0015 18.86144 14.14266 14.76551
14.8125 0.43486 211.95255 -0.25775 18.69063 14.44144 14.51435
15.1875 0.39522 210.76203 -0.19099 18.59931 13.80918 13.82889
15.5625 -0.52899 211.69881 -0.27124 16.73136 12.93681 13.35228
15.9375 1.00523 210.93634 0.4271 16.62206 13.07865 14.14382
16.3125 0.13096 211.77112 -0.49754 16.33118 12.29606 13.92045
16.6875 0.67631 210.92603 -0.09219 15.56182 11.97833 13.58477
17.0625 0.95171 210.73649 0.69783 15.99335 11.25531 14.55123
17.4375 0.15131 210.86368 1.08949 15.05207 11.06443 13.33589
17.8125 0.21268 209.6138 0.48749 15.64495 11.61118 13.42052
18.1875 0.44474 210.44576 1.87105 15.05746 12.31186 13.35787
18.5625 0.46839 211.43217 1.89278 14.27643 10.73726 12.90228
18.9375 0.65923 211.49231 1.31375 13.88571 10.46619 11.71161
19.3125 1.18236 211.61385 0.10768 12.49258 10.28273 11.55338
19.6875 1.53625 211.38467 -0.70678 12.7624 9.75136 11.1165
20.0625 0.84616 209.44896 -0.19116 12.98361 9.226 10.34586
20.4375 0.08346 210.36592 -1.8769 12.71484 8.24878 10.43939
20.8125 -0.50849 209.58441 -1.2467 12.75789 8.46897 10.2505
21.1875 0.37246 208.7375 -1.62121 12.59079 8.95717 9.20583
21.5625 0.05295 209.2535 -1.25625 11.27494 8.74599 8.77277
21.9375 0.21512 209.52144 -1.10935 12.1158 8.30115 8.31163
22.3125 0.57123 210.20926 -0.46079 12.83185 7.43052 9.14322
22.6875 1.34751 209.05514 0.2662 10.89969 8.24516 8.26703
23.0625 0.97814 209.23725 0.57775 11.10971 7.72376 7.54341
23.4375 0.38481 208.85121 -0.14624 12.25797 7.17022 7.51277
23.8125 0.41118 208.29958 1.14023 10.65236 7.48789 7.52082
24.1875 0.90369 207.02875 -0.18344 9.7621 7.52592 7.34716
24.5625 0.04901 207.76472 -0.33232 9.4617 7.44702 7.05982
24.9375 -0.42103 207.12838 -1.09209 9.16665 7.50502 7.51621
25.3125 -1.53869 207.52832 -0.81904 9.427 8.00854 6.71436
25.6875 -1.3807 207.69146 0.22619 9.09126 6.22858 6.77479
26.0625 -3.04941 207.59056 -0.22234 9.70069 5.37886 7.76516
26.4375 -1.72296 207.41528 -1.64454 8.30657 5.46823 6.32595
26.8125 -1.64549 207.14509 0.0247 8.22428 5.98035 7.22631
27.1875 -0.09084 207.3242 -0.95069 7.64199 5.56541 6.14037
27.5625 0.09342 206.44711 -0.1904 8.84455 5.54062 6.72342
27.9375 0.22684 205.84124 -0.70658 8.8828 5.58489 6.62472
28.3125 0.63926 205.38288 0.59259 8.61437 6.07232 5.55599
28.6875 1.39358 205.26038 0.19052 6.66114 6.07823 6.65044
29.0625 -1.22245 205.8693 -1.7365 7.11065 5.27502 5.7832
29.4375 0.25152 204.53901 -0.22673 5.299 6.04423 5.70097
29.8125 0.00942 206.44884 -1.0782 5.20747 4.37859 4.58161
