0.1875 -1.0873 21.21606 3.43458 81.21235 82.42167 75.41402
0.5625 -1.14641 43.51484 -0.84112 80.32061 79.00067 71.54932
0.9375 -0.716 64.28681 -0.42331 76.98909 74.5902 68.20728
1.3125 -0.04685 81.04033 0.08848 73.38878 70.20714 65.72409
1.6875 -0.8854 96.94013 -0.30965 68.48998 65.14366 62.2294
2.0625 -0.59261 111.38308 0.43874 65.45957 61.46457 59.18226
2.4375 0.06481 121.9278 -0.89012 62.02702 57.91637 56.25987
2.8125 -0.78585 131.03952 -0.59178 58.68115 54.27931 53.97287
3.1875 0.07419 140.49665 -0.90681 55.1874 50.87823 51.1866
3.5625 0.21129 148.22698 -1.27144 53.13297 48.13715 49.02114
3.9375 -0.36963 156.15695 -1.46289 50.69252 46.20614 46.84637
4.3125 0.04992 162.31871 -1.37205 49.05036 43.54746 44.84666
4.6875 -0.36724 167.4277 -0.86149 47.41779 41.53775 42.58786
5.0625 1.26989 172.14024 -0.48125 45.70868 40.03193 40.97657
5.4375 0.3486 176.88524 0.05437 44.00931 38.2714 39.25335
5.8125 0.47035 180.20148 0.35987 42.85682 36.15564 38.08558
6.1875 0.43568 183.91637 0.3416 41.1946 34.58714 36.31099
6.5625 -0.17472 187.60093 0.78933 39.67047 33.19061 34.39639
6.9375 -0.09935 190.16857 0.80029 38.11638 32.25141 33.57674
7.3125 -0.72361 192.82993 0.35916 37.00979 31.36336 32.06381
7.6875 -0.58625 195.45725 0.69397 35.62142 29.84242 30.68094
8.0625 -0.52313 198.04467 0.33512 34.44222 27.94099 29.7715
8.4375 -0.91782 199.96049 0.38772 33.83187 26.95407 28.68459
8.8125 -0.89115 201.60313 0.54938 32.83686 26.44069 27.79399
9.1875 -0.61943 203.06373 0.77993 31.78996 25.49899 26.71678
9.5625 -1.02734 204.41665 0.27357 30.95346 24.69786 25.89278
9.9375 -0.0314 206.09107 0.6645 30.16985 24.21621 24.99983
10.3125 -0.68324 206.99562 0.39898 29.41828 23.15746 23.8305
10.6875 0.01613 208.11598 0.59102 28.53343 22.31914 22.9938
11.0625 0.31257 209.03384 0.3307 27.90936 21.1829 22.15323
11.4375 0.69282 209.86831 0.11758 27.04865 21.07867 21.62715
11.8125 0.42514 210.35168 0.0663 26.35394 19.77059 20.80882
12.1875 0.59214 210.4246 0.13899 25.55658 19.21168 20.12757
12.5625 1.01052 211.13277 -0.0746 24.69754 18.97255 19.37231
12.9375 0.09932 211.60541 -0.18215 24.01411 18.63374 18.5425
13.3125 0.1732 212.15267 0.27518 23.45562 18.13798 17.8593
13.6875 0.27473 212.69101 0.87364 22.33439 17.48251 17.28113
14.0625 0.55232 213.01186 0.80775 21.77109 17.36624 17.23684
14.4375 -0.10024 213.50145 1.40453 21.20636 15.88837 16.38528
14.8125 0.52188 213.82369 1.47751 20.5488 15.85462 16.13359
15.1875 0.2955 214.29096 1.108 19.94949 14.88814 15.56126
15.5625 -0.34886 214.00933 0.77848 19.28725 14.62942 15.33848
15.9375 -0.13507 213.97224 0.32769 18.61437 13.83289 14.74222
16.3125 0.04688 214.08815 -0.21485 18.29069 13.75825 14.24723
16.6875 0.24495 213.90174 -0.68819 17.72731 13.44442 13.60786
17.0625 -0.11624 213.85073 -0.79343 17.28088 13.08001 13.36549
17.4375 -0.36839 214.06136 -0.63173 16.57079 12.42336 12.59935
17.8125 -0.00978 213.67512 -0.58979 16.4138 11.80623 12.43198
18.1875 0.09899 213.18311 -0.38583 15.90175 11.51542 12.14101
18.5625 -0.02697 213.22482 -0.59637 15.44358 11.49537 11.56382
18.9375 -0.0705 212.83205 0.41752 15.26634 11.67283 11.33938
19.3125 -0.49924 212.7129 0.41072 14.63122 11.11294 11.11034
19.6875 -0.41847 213.00454 0.43662 14.22112 10.63257 10.92819
20.0625 -0.11939 212.73041 0.20702 13.94156 10.08281 10.41656
20.4375 -0.7571 212.21952 0.49104 13.94532 9.83754 10.27948
20.8125 -0.42385 211.60918 0.79253 13.1884 10.03181 10.35088
21.1875 0.28931 211.4756 1.05266 12.933 9.70961 10.06418
21.5625 -0.20853 212.17868 1.3024 12.7022 9.28427 9.5626
21.9375 0.20889 212.05779 1.58071 12.02972 9.15917 9.15946
22.3125 1.06994 211.60783 1.79949 12.10427 8.68704 9.16253
22.6875 0.5088 210.82664 1.44509 11.50823 7.82782 8.95123
23.0625 0.10292 209.99406 0.67175 11.55254 8.1659 8.69901
23.4375 -0.22454 209.85578 0.68363 11.108 8.51053 8.62874
23.8125 -0.34503 210.24118 0.24521 11.19982 8.63052 8.09049
24.1875 0.12325 210.46965 -0.29253 11.12591 7.8588 7.97091
24.5625 0.6354 210.56421 -0.18007 10.3334 7.48353 7.97579
24.9375 0.2489 209.79139 -0.24085 10.34172 6.67958 7.62934
25.3125 0.27187 208.45649 -0.48439 9.94275 6.86199 7.67262
25.6875 0.13169 208.65051 0.52663 10.13322 6.60011 7.71556
26.0625 -0.20409 208.22244 -0.22354 9.62798 7.19901 7.66704
26.4375 -0.69863 208.35816 0.0056 8.90046 6.91409 7.29641
26.8125 0.18985 208.85639 0.17864 9.34285 6.68094 7.08821
27.1875 0.37585 208.67285 -0.86641 9.19369 6.91598 6.80551
27.5625 -0.18884 208.30023 -1.08114 8.45962 5.97377 6.69661
27.9375 0.64249 207.82125 -0.59911 8.85675 6.05683 6.76087
28.3125 0.92746 206.98542 -0.80167 8.8333 5.58081 6.76641
28.6875 -0.33032 207.09557 -0.8334 8.00465 5.37113 7.09645
29.0625 -0.96148 205.65617 0.13037 8.05721 6.07786 6.18978
29.4375 -0.49568 205.86268 -0.5065 7.78047 5.92717 5.94265
29.8125 -0.27158 204.99916 0.24702 7.54148 6.24476 6.4897
