0.12500 0.02315
0.37500 0.02720
0.62500 0.05224
0.87500 0.09232
1.12500 0.12807
1.37500 0.16707
1.62500 0.17791
1.87500 0.20346
2.12500 0.23067
2.37500 0.26192
2.62500 0.27231
2.87500 0.28847
3.12500 0.30668
3.37500 0.31913
3.62500 0.36065
3.87500 0.37264
4.12500 0.37814
4.37500 0.40116
4.62500 0.41137
4.87500 0.43204
5.12500 0.45997
5.37500 0.45589
5.62500 0.46092
5.87500 0.47160
6.12500 0.47878
6.37500 0.45327
6.62500 0.45889
6.87500 0.45839
7.12500 0.41653
7.37500 0.39355
7.62500 0.38239
7.87500 0.36895
8.12500 0.36213
8.37500 0.35975
8.62500 0.36217
8.87500 0.33875
9.12500 0.31607
9.37500 0.27020
9.62500 0.24408
9.87500 0.24717
10.12500 0.18007
10.37500 0.14245
10.62500 0.10555
10.87500 0.06682
11.12500 0.08041
11.37500 0.05107
11.62500 0.00758
11.87500 0.04963
12.12500 0.04776
12.37500 0.02761
12.62500 0.03264
12.87500 0.04843
13.12500 0.02976
13.37500 0.02063
13.62500 0.03401
13.87500 0.02999
14.12500 0.04300
14.37500 0.03013
14.62500 0.08567
14.87500 0.06141
15.12500 0.02970
15.37500 0.06868
15.62500 0.04973
15.87500 0.07303
16.12500 0.06486
16.37500 0.10728
16.62500 0.04079
16.87500 0.03759
17.12500 0.08530
17.37500 0.01229
17.62500 0.02485
17.87500 0.02309
18.12500 0.07150
18.37500 0.04546
18.62500 0.04772
18.87500 0.06062
19.12500 0.06952
19.37500 0.03770
19.62500 0.12835
19.87500 0.11147
