0.05000 -51896.57408 -2645.26560 -15085.47697 64846.50080 79405.61786 62505.64115
0.15000 -68402.11536 -3243.65520 -3486.17003 41520.72606 48911.65953 71991.32041
0.25000 -67974.16304 -300.03756 735.85994 27626.46758 25337.95081 57294.32872
0.35000 -53820.98022 -79.60568 64.17983 20078.05990 13555.88063 45417.67241
0.45000 -44895.27614 -32.84666 172.68874 14888.61350 8651.15485 35766.89812
0.55000 -37648.40798 130.56784 34.12368 12011.08807 6023.82317 29742.31354
0.65000 -32045.32700 127.69057 122.94150 9809.26609 4519.38069 26049.16867
0.75000 -28482.20292 125.88567 -258.09910 8245.76723 3413.71651 22137.41704
0.85000 -25653.75226 62.73780 355.10905 7376.06828 3048.71303 19839.44176
0.95000 -23422.52672 -3.99929 439.22593 6397.63920 2751.72119 17570.80648
1.05000 -21357.30450 39.26356 156.94818 5955.77470 2346.95768 15975.58361
1.15000 -19915.93359 53.68909 -161.83900 5428.86453 2527.32160 14406.58066
1.25000 -18578.48552 35.80672 -36.33410 4744.47696 2490.19728 13216.48681
1.35000 -17315.80283 83.40482 503.07404 4144.76777 1533.85277 12273.64749
1.45000 -16486.94843 35.28789 93.26267 4036.49056 1773.17054 11178.21955
1.55000 -15589.29624 57.05239 -214.24183 3311.57994 1305.82133 10450.66682
1.65000 -14909.44278 34.25561 59.61407 3086.10836 1227.29227 9572.54181
1.75000 -14272.16597 34.23706 -65.54578 3316.57196 1460.96154 9074.28270
1.85000 -13715.09392 -18.84225 24.89828 2915.42530 1563.74122 8252.46178
1.95000 -12971.59040 18.75530 280.70499 3093.40731 972.95787 7963.91868
2.05000 -12582.09106 39.44644 -192.10823 2356.94556 1031.22691 7346.07660
2.15000 -12183.32667 23.97489 -92.68775 2148.56311 973.35339 6996.90486
2.25000 -11807.63077 43.11499 119.36158 1809.57938 968.19968 6500.55364
2.35000 -11389.06886 56.62556 -43.57769 1881.70043 1463.51373 6328.11342
2.45000 -11103.86591 23.28400 1.11191 1634.59580 889.54161 5897.60988
2.55000 -10825.36539 -3.47321 115.44724 1531.43100 961.02325 5530.15816
2.65000 -10589.18506 25.04708 4.32807 1630.57819 743.50883 5230.08302
2.75000 -10347.39052 5.07897 -119.91298 1301.20239 929.15562 5053.33158
2.85000 -10162.71653 28.04393 -42.69155 1298.33921 1058.87356 4668.06374
2.95000 -9916.26281 15.64124 -61.95472 1251.68851 754.37225 4570.60004
3.05000 -9718.01515 12.89476 92.35253 1059.48151 651.57903 4315.45065
3.15000 -9490.59625 12.74066 53.82746 1328.47422 780.82137 4405.54753
3.25000 -9332.22123 36.71011 -23.41617 1653.26084 1403.22099 3959.65702
3.35000 -9144.88295 35.56314 82.80248 1005.12802 722.47116 3805.99383
3.45000 -9000.27696 3.34007 142.35786 1007.48880 722.79342 3640.88175
3.55000 -8847.02806 -32.08487 -8.80917 1584.89840 1525.03053 3866.74574
3.65000 -8712.19822 42.09728 64.32971 2018.62105 892.33512 3394.92714
3.75000 -8661.12005 12.01347 12.78225 836.04674 691.88990 3233.46942
3.85000 -8477.45971 -1.52570 102.95220 775.11860 838.30937 3153.13151
3.95000 -8347.00511 4.49589 -3.20695 625.17111 463.36031 3013.64977
4.05000 -8173.80451 32.02953 66.68719 1151.38843 806.69969 3023.03280
4.15000 -8113.65356 -3.43958 21.30988 696.75274 680.67545 2878.20168
4.25000 -8012.23705 18.75264 75.23695 627.07236 522.28152 2743.51726
4.35000 -7889.28698 7.24231 61.64563 762.65699 1009.39636 2627.09490
4.45000 -7802.79554 -19.28229 -24.93109 988.69003 1234.66622 2956.99360
4.55000 -7677.89670 27.42461 -31.64523 2327.26733 1227.48088 3088.96952
4.65000 -7623.59117 6.50033 38.54978 687.26371 571.29471 2483.20624
4.75000 -7530.08530 7.91095 38.00181 615.57708 496.54905 2412.99798
4.85000 -7440.53712 10.69330 72.52490 537.85805 403.68651 2343.84395
4.95000 -7365.87254 7.10973 31.39042 615.41458 441.34613 2269.90666
5.05000 -7294.08544 -5.72820 24.44295 536.44288 425.56616 2178.74034
5.15000 -7211.36877 27.09014 -64.08711 576.19715 736.20143 2430.28976
5.25000 -7189.39734 42.93901 74.91546 1900.49982 1018.47730 2183.39026
5.35000 -7085.98439 -17.01207 -11.10636 492.78252 791.57496 2041.02458
5.45000 -7010.04587 15.07171 -35.95565 908.42163 530.94392 2019.03177
5.55000 -6920.34691 12.42947 -9.52290 491.59629 458.61560 1942.04449
5.65000 -6857.93539 -6.94709 -61.21447 598.80180 614.33754 2058.85180
5.75000 -6804.52494 -3.01091 24.74459 530.06837 557.57645 1803.23929
5.85000 -6718.71334 31.49999 -74.98808 616.15332 475.30295 1818.32550
5.95000 -6687.61311 -7.20044 61.42124 482.69073 359.85771 1698.75236
6.05000 -6644.13464 9.57062 45.00210 464.63290 324.74190 1650.46481
6.15000 -6560.95868 -2.17701 -5.62909 389.74592 529.12492 1633.16348
6.25000 -6490.82786 -4.13477 -30.11647 472.05010 312.86890 1597.40047
6.35000 -6430.39975 10.75440 -84.58858 470.46272 292.91571 1516.02211
6.45000 -6368.24258 11.13611 -45.84455 446.41605 870.95238 1515.27615
6.55000 -6286.66060 1.87967 -38.69340 518.50429 411.67820 1517.71604
6.65000 -6247.27860 1.62102 -42.20751 325.25741 406.80504 1413.07151
6.75000 -6155.82630 18.21257 -12.13120 495.27083 623.66878 1395.85723
6.85000 -6113.06550 6.49803 -18.17397 385.20297 275.94820 1345.11014
6.95000 -6066.08407 4.79256 15.77215 399.51325 328.73680 1300.82606
7.05000 -6008.88691 3.04898 8.19974 313.42600 305.62269 1276.64173
7.15000 -5941.20570 1.42674 32.54646 461.42099 271.70431 1269.80367
7.25000 -5895.73740 13.84333 -38.87107 336.11499 345.01569 1223.32128
7.35000 -5827.27870 7.61465 -62.89259 318.44753 194.96067 1180.93876
7.45000 -5770.27306 0.31263 4.33419 275.36371 370.79035 1191.05472
7.55000 -5717.73503 20.05356 -36.00221 299.83191 379.26594 1170.06768
7.65000 -5654.49996 -13.71175 -30.83408 392.51530 569.02295 1236.94716
7.75000 -5622.48975 8.59509 -34.33628 319.07103 370.73500 1131.70384
7.85000 -5560.46949 4.45507 -0.13060 325.56673 264.85457 1057.78676
7.95000 -5495.01122 0.42568 -19.77287 497.53834 253.10618 1079.52499
8.05000 -5451.11716 -2.16140 19.10447 401.97056 569.84452 1099.94306
8.15000 -5384.13503 -6.79162 -60.34773 575.52998 941.98644 1249.86834
8.25000 -5342.96575 3.49974 3.83523 290.87706 403.29719 1006.53960
8.35000 -5293.02579 9.05034 8.21639 495.65909 268.11172 1014.57692
8.45000 -5253.60182 24.64808 -10.14766 329.94264 358.81901 1243.67115
8.55000 -5201.33153 -4.08864 -22.99579 263.64775 218.19378 940.66352
8.65000 -5153.44114 2.83788 51.69369 300.79879 208.97567 889.66670
8.75000 -5104.42581 4.08652 -3.18652 251.63575 187.82340 850.43729
8.85000 -5063.52793 12.33058 15.64277 267.79545 331.83202 900.12091
8.95000 -5018.75705 3.33129 1.72638 271.00649 350.55493 822.32488
9.05000 -4956.07101 1.38541 14.65265 258.97885 294.28136 844.73587
9.15000 -4921.93643 10.32078 22.64577 401.31075 267.23613 812.91741
9.25000 -4862.93001 11.77764 57.12836 222.92130 220.96891 800.96563
9.35000 -4830.26291 6.22491 10.05506 247.21375 208.63692 757.83716
9.45000 -4785.70462 0.74669 6.94237 235.38509 243.46969 799.83505
9.55000 -4733.92754 1.53737 1.03842 183.03958 168.58995 753.00938
9.65000 -4699.43605 -4.48787 29.79012 212.64491 188.48044 712.09439
9.75000 -4655.59634 7.65101 -17.67542 177.50165 178.28876 701.99999
9.85000 -4602.02107 6.57586 24.46326 201.37850 161.04941 691.96999
9.95000 -4562.26394 -1.78698 -10.34330 372.68706 175.70614 701.25988
10.05000 -4534.24413 -8.84111 -24.45913 199.50187 136.07201 625.17608
10.15000 -4469.11892 -13.46821 65.09909 609.95076 330.03130 744.92123
10.25000 -4449.48378 -5.28758 27.26114 203.00773 173.99787 637.82380
10.35000 -4390.83474 19.65799 23.15855 189.00955 285.30739 653.67368
10.45000 -4343.72868 -1.58328 8.60288 209.37665 195.78035 607.88774
10.55000 -4324.95483 4.03231 6.46707 180.17168 224.88388 577.30804
10.65000 -4284.88400 13.26446 11.02120 156.42014 210.87086 578.73350
10.75000 -4260.65677 0.64683 17.29049 201.83344 174.49653 554.41034
10.85000 -4215.69098 5.22016 0.54348 204.50189 112.34047 564.52905
10.95000 -4165.26456 16.49736 1.29981 209.64976 182.13729 561.90331
11.05000 -4139.54515 -6.09337 -13.20218 159.39734 216.90087 556.44495
11.15000 -4124.29347 -10.14260 -23.75807 159.53694 152.66001 516.20972
11.25000 -4080.73778 -5.06275 15.28392 166.11969 215.66282 550.63251
11.35000 -4044.58860 3.28207 -45.45013 144.86693 147.21852 530.06168
11.45000 -4008.42831 -10.24227 -38.42711 127.40432 147.74683 549.08526
11.55000 -4016.07954 16.55713 -48.07934 1506.65207 437.07023 1285.17048
11.65000 -3934.04121 1.16187 -64.73831 214.93911 129.00271 464.00456
11.75000 -3899.63258 14.79081 -95.89061 177.51206 277.81814 486.53134
11.85000 -3869.36994 0.67920 -13.95142 162.70238 184.86618 452.38528
11.95000 -3900.94462 -19.93859 85.89733 1679.75401 1058.91482 2353.14996
12.05000 -3802.94709 12.63636 -27.17958 145.40128 116.91411 432.18124
12.15000 -3753.51546 5.80557 -35.53657 268.34221 136.27076 429.89863
12.25000 -3740.34444 0.11728 -28.26424 197.37578 221.40190 426.76613
12.35000 -3711.80098 5.41701 -52.48431 117.18089 145.76490 429.31726
12.45000 -3683.10700 -0.40212 -85.14847 121.69275 101.04820 437.67870
12.55000 -3642.84771 8.00647 -54.24553 132.21408 124.50444 409.11625
12.65000 -3609.46202 -1.19971 -49.63372 162.48614 127.00682 424.00010
12.75000 -3569.76669 -10.26207 -18.81846 707.33665 290.92006 771.92574
12.85000 -3589.53833 1.47716 20.63416 342.08294 284.67093 890.85247
12.95000 -3537.69320 -11.21941 -21.10587 187.22994 262.52003 434.48714
13.05000 -3521.03063 14.27087 -47.03977 125.48958 138.90736 382.45071
13.15000 -3499.33818 2.30951 -25.30747 114.73140 77.63802 345.84186
13.25000 -3465.04236 19.54440 -46.30647 80.77818 95.26523 360.23268
13.35000 -3445.33332 -10.74651 -9.45607 98.42898 143.47019 333.47113
13.45000 -3422.90986 10.06281 -21.59557 127.72387 121.70972 353.29517
13.55000 -3374.63865 -5.24868 6.60920 131.79848 149.68712 336.49772
13.65000 -3380.52434 4.12611 -0.03349 392.28609 96.73168 337.04040
13.75000 -3358.08662 -18.74258 -8.37048 460.47536 430.27488 329.87498
13.85000 -3309.71864 10.80549 -0.79149 174.88178 111.58757 343.90756
13.95000 -3295.80217 5.49456 -21.88729 108.38631 119.22484 310.00331
14.05000 -3282.06518 -6.82838 -22.70427 173.85311 142.39312 329.09287
14.15000 -3240.66902 4.34600 -21.72736 100.04990 89.83292 350.09776
14.25000 -3220.81226 8.86190 5.10331 119.49869 75.61382 349.87816
14.35000 -3181.72152 8.42367 38.59379 104.68977 108.26798 344.09873
14.45000 -3165.23329 4.03349 15.45423 101.06757 90.71988 281.03839
14.55000 -3149.50932 -33.44614 29.30891 206.07685 650.67864 322.49062
14.65000 -3114.46469 13.13622 23.11457 147.19063 100.30556 273.91027
14.75000 -3096.98921 6.02010 -21.85527 62.65558 69.23727 271.52454
14.85000 -3059.81616 -1.81024 19.01427 75.13500 83.80419 284.72604
14.95000 -3052.52034 5.51879 -14.94276 82.95945 64.55392 258.93620
15.05000 -3021.54176 6.13113 49.81847 169.06219 76.67270 434.54336
15.15000 -3005.39237 1.13606 14.80439 105.89125 85.26462 267.22087
15.25000 -2982.43632 0.68295 24.21499 66.11481 73.94540 241.58333
15.35000 -2954.37467 -3.94309 20.63115 93.56507 75.94697 269.48977
15.45000 -2937.71543 -6.26417 -13.58211 84.52864 109.77100 229.92230
15.55000 -2905.71133 7.67763 19.79045 104.50040 174.00459 257.88111
15.65000 -2897.50829 -3.36552 34.77087 71.24354 71.54735 251.53070
15.75000 -2887.62006 -0.39910 3.13258 60.41502 57.53293 231.42962
15.85000 -2848.27711 -10.96622 -13.77587 92.83537 92.26771 340.68181
15.95000 -2842.71355 -12.47879 -21.64337 85.36762 60.04925 256.32635
16.05000 -2828.56570 -1.69575 -11.60069 67.36624 80.11048 226.69337
16.15000 -2813.15297 -2.44577 -48.84611 74.38132 64.39174 206.55009
16.25000 -2787.09621 0.78968 -22.06769 56.97831 62.20604 202.11423
16.35000 -2770.87466 10.99330 46.20853 146.25503 93.11797 239.90456
16.45000 -2748.31213 -3.80284 -3.32003 75.52551 74.22154 223.13139
16.55000 -2729.49774 5.31319 -66.26557 65.63336 63.56727 202.60560
16.65000 -2711.27900 22.98904 2.06809 65.84679 289.80777 245.50544
16.75000 -2699.58675 0.14399 -50.88750 92.52143 64.92041 197.80453
16.85000 -2690.89239 -0.55231 -40.57448 65.74169 67.55271 232.14385
16.95000 -2665.43277 1.73003 -79.81401 56.94876 62.87311 193.15841
17.05000 -2650.00086 -6.62026 -39.39458 49.18464 65.27571 225.65053
17.15000 -2614.85069 21.66289 -76.01295 179.18344 257.54057 255.21154
17.25000 -2616.10819 -6.39235 -21.09340 52.32137 55.29671 207.13295
17.35000 -2604.19988 -9.43637 -60.51012 44.08789 50.88769 183.07224
17.45000 -2590.17439 -0.49889 -14.22131 50.94914 56.33181 199.57297
17.55000 -2573.85243 -1.29271 -29.41588 51.91130 59.73410 189.21999
17.65000 -2557.64360 -4.44579 -58.33105 48.74514 47.95873 158.85971
17.75000 -2533.06082 -0.91242 -56.57678 50.07031 59.79082 194.18075
17.85000 -2516.38200 2.75766 -40.98259 44.57941 47.54337 166.62751
17.95000 -2506.01818 -3.45888 -67.24010 47.18959 46.54447 172.63014
18.05000 -2480.03198 21.03035 -9.33506 57.89239 59.37774 183.06236
18.15000 -2468.02437 -7.55363 -51.90895 40.47505 44.82737 163.61673
18.25000 -2463.83299 3.82546 -51.97632 61.68009 68.82378 205.30193
18.35000 -2441.25696 7.05058 -51.26680 50.05998 48.01391 158.39722
18.45000 -2442.42226 15.23394 -47.37686 53.12930 182.91188 138.34056
18.55000 -2414.43104 2.41180 -53.74468 134.00813 51.13354 149.06074
18.65000 -2411.50396 -2.26708 -38.95041 49.54238 44.37003 153.96524
18.75000 -2386.71183 -6.47623 -46.80976 51.65450 51.71469 163.14352
18.85000 -2362.22305 -4.03009 -92.38922 43.53660 52.91674 165.50673
18.95000 -2371.33071 -5.94697 -64.40714 48.63769 73.67734 152.16339
19.05000 -2347.07584 6.62899 -26.19231 58.83840 49.62918 139.41020
19.15000 -2334.36317 2.57599 -50.64740 39.95008 65.19293 158.80036
19.25000 -2319.41844 -8.62078 -70.72456 75.74062 55.00471 168.04977
19.35000 -2304.53736 0.46094 -57.19518 43.95826 34.34870 140.18420
19.45000 -2320.74134 7.75298 -71.04867 175.61712 103.71657 188.96705
19.55000 -2281.84994 -6.69236 -33.50883 52.59484 66.00779 153.99163
19.65000 -2269.80624 -1.64112 -51.34585 58.49850 76.83507 126.00967
19.75000 -2254.64506 -1.22955 -38.65695 34.56938 47.45693 135.28542
19.85000 -2245.10974 5.73293 -36.83852 97.68996 61.23289 134.47108
19.95000 -2227.02617 -6.74817 -69.36222 52.65081 54.08882 162.11557
