0.12500 0.06070
0.37500 0.05694
0.62500 0.06233
0.87500 0.09146
1.12500 0.13433
1.37500 0.18492
1.62500 0.19932
1.87500 0.21411
2.12500 0.23475
2.37500 0.24465
2.62500 0.23578
2.87500 0.25971
3.12500 0.25464
3.37500 0.22827
3.62500 0.20321
3.87500 0.18195
4.12500 0.16289
4.37500 0.13696
4.62500 0.11982
4.87500 0.11720
5.12500 0.10283
5.37500 0.07167
5.62500 0.05891
5.87500 0.05561
6.12500 0.06041
6.37500 0.06284
6.62500 0.04884
6.87500 0.05087
7.12500 0.04189
7.37500 0.04261
7.62500 0.03318
7.87500 0.01870
8.12500 0.03744
8.37500 0.04341
8.62500 0.03612
8.87500 0.04680
9.12500 0.03503
9.37500 0.04236
9.62500 0.04072
9.87500 0.02372
10.12500 0.05919
10.37500 0.04047
10.62500 0.04110
10.87500 0.06922
11.12500 0.04709
11.37500 0.04880
11.62500 0.06281
11.87500 0.04437
12.12500 0.03966
12.37500 0.04170
12.62500 0.02741
12.87500 0.04839
13.12500 0.03581
13.37500 0.03598
13.62500 0.04990
13.87500 0.08914
14.12500 0.06449
14.37500 0.09743
14.62500 0.10358
14.87500 0.06297
15.12500 0.09206
15.37500 0.08378
15.62500 0.03440
15.87500 0.11589
16.12500 0.04611
16.37500 0.03263
16.62500 0.05670
16.87500 0.07835
17.12500 0.07881
17.37500 0.12949
17.62500 0.08074
17.87500 0.07087
18.12500 0.06458
18.37500 0.05118
18.62500 0.03845
18.87500 0.05902
19.12500 0.06132
19.37500 0.05181
19.62500 0.04398
19.87500 0.05985
