0.120000 1.693480
0.380000 -0.099630
0.620000 0.006620
0.880000 0.006930
1.120000 -0.024480
1.380000 0.019320
1.620000 0.003890
1.880000 0.038090
2.120000 -0.028600
2.380000 -0.071830
2.620000 -0.061860
2.880000 -0.079360
3.120000 -0.070750
3.380000 -0.065780
3.620000 -0.088370
3.880000 -0.053620
4.120000 -0.045840
4.380000 -0.061210
4.620000 -0.045170
4.880000 -0.056370
5.120000 -0.149470
5.380000 -0.225850
5.620000 -0.146200
5.880000 -0.214000
6.120000 -0.061790
6.380000 -0.025240
6.620000 -0.027320
6.880000 -0.019500
7.120000 0.038980
7.380000 -0.213710
7.620000 -0.168060
7.880000 -0.379010
8.120000 -0.346480
8.380000 -0.450800
8.620000 -0.600920
8.880000 -0.634380
9.120000 -0.795710
9.380000 -0.980910
9.620000 -1.143500
9.880000 -1.636420
10.120000 -1.858210
10.380000 -2.253040
10.620000 -2.631670
10.880000 -2.716490
11.120000 -2.942580
11.380000 -2.877360
11.620000 -2.743260
11.880000 -3.056270
12.120000 -3.117690
12.380000 3.048910
12.620000 3.024920
12.880000 2.793840
13.120000 2.722600
13.380000 2.702430
13.620000 1.984810
13.880000 1.593460
14.120000 0.822180
14.380000 1.477250
14.620000 0.138950
14.880000 0.306630
