0.05000 2652.98839
0.15000 3457.72563
0.25000 4489.85193
0.35000 5491.77628
0.45000 6050.27502
0.55000 6478.25942
0.65000 6633.02804
0.75000 6615.49749
0.85000 6528.27404
0.95000 6480.80804
1.05000 6212.38306
1.15000 6096.87580
1.25000 5801.34099
1.35000 5743.12063
1.45000 5563.53897
1.55000 5338.88138
1.65000 5234.10799
1.75000 5035.02112
1.85000 4782.80719
1.95000 4694.15189
2.05000 4579.24211
2.15000 4309.42617
2.25000 4265.79352
2.35000 4128.63736
2.45000 3970.29579
2.55000 3851.94978
2.65000 3725.84172
2.75000 3595.93523
2.85000 3529.75371
2.95000 3377.33324
3.05000 3287.47056
3.15000 3210.90086
3.25000 3039.34676
3.35000 2957.96439
3.45000 2897.07591
3.55000 2804.37797
3.65000 2707.22908
3.75000 2587.18037
3.85000 2511.30310
3.95000 2434.66507
4.05000 2345.73241
4.15000 2276.08097
4.25000 2187.54689
4.35000 2131.31869
4.45000 2064.57760
4.55000 1984.30719
4.65000 1926.42133
4.75000 1882.03963
4.85000 1822.63448
4.95000 1797.68673
5.05000 1715.33551
5.15000 1682.04363
5.25000 1622.25019
5.35000 1586.14086
5.45000 1538.52698
5.55000 1484.58772
5.65000 1461.87254
5.75000 1428.39391
5.85000 1354.26652
5.95000 1318.29720
6.05000 1312.91830
6.15000 1260.11911
6.25000 1229.01937
6.35000 1197.93816
6.45000 1143.47864
6.55000 1133.78896
6.65000 1080.56868
6.75000 1061.76583
6.85000 1034.07151
6.95000 999.35165
7.05000 986.07993
7.15000 934.96447
7.25000 916.64735
7.35000 893.37666
7.45000 860.13785
7.55000 830.22044
7.65000 804.13956
7.75000 792.04098
7.85000 767.23895
7.95000 744.11807
8.05000 719.68609
8.15000 700.24113
8.25000 703.48268
8.35000 676.43455
8.45000 647.80370
8.55000 629.36013
8.65000 623.68116
8.75000 604.94433
8.85000 594.04942
8.95000 565.08630
9.05000 559.00531
9.15000 536.37700
9.25000 534.45895
9.35000 518.99778
9.45000 505.49045
9.55000 498.92129
9.65000 474.01854
9.75000 475.07040
9.85000 457.63220
9.95000 457.55721
10.05000 435.05686
10.15000 433.69475
10.25000 421.43522
10.35000 399.96475
10.45000 390.80345
10.55000 378.49293
10.65000 384.04211
10.75000 366.93262
10.85000 351.42405
10.95000 353.39744
11.05000 343.56225
11.15000 342.16791
11.25000 324.21695
11.35000 322.81345
11.45000 306.00432
11.55000 302.02249
11.65000 292.05875
11.75000 282.61984
11.85000 272.70937
11.95000 272.50356
12.05000 261.89073
12.15000 245.77032
12.25000 253.12645
12.35000 249.46747
12.45000 237.79179
12.55000 235.08355
12.65000 238.00256
12.75000 224.84027
12.85000 218.24954
12.95000 223.55081
13.05000 218.63516
13.15000 212.44118
13.25000 204.27076
13.35000 199.13134
13.45000 195.15959
13.55000 185.55310
13.65000 184.61731
13.75000 180.17095
13.85000 180.97973
13.95000 171.05694
14.05000 168.67141
14.15000 171.83858
14.25000 165.10506
14.35000 172.28180
14.45000 162.54698
14.55000 156.21931
14.65000 157.50971
14.75000 150.30557
14.85000 149.97016
14.95000 151.82129
15.05000 147.62217
15.15000 139.78424
15.25000 146.56845
15.35000 141.10350
15.45000 137.42954
15.55000 124.80720
15.65000 132.79531
15.75000 127.67696
15.85000 124.11837
15.95000 122.26737
16.05000 126.67695
16.15000 116.52001
16.25000 120.70031
16.35000 113.19225
16.45000 109.92170
16.55000 111.10589
16.65000 106.78891
16.75000 100.72667
16.85000 106.91770
16.95000 97.38337
17.05000 101.09867
17.15000 97.25104
17.25000 94.22968
17.35000 92.65992
17.45000 91.64054
17.55000 93.18169
17.65000 94.33086
17.75000 81.81890
17.85000 88.30769
17.95000 92.38135
18.05000 80.96211
18.15000 90.84684
18.25000 84.45068
18.35000 80.96564
18.45000 82.98742
18.55000 77.82148
18.65000 77.77132
18.75000 74.45829
18.85000 75.59075
18.95000 81.58955
19.05000 78.57538
19.15000 79.22752
19.25000 82.70858
19.35000 78.72074
19.45000 77.10584
19.55000 74.68072
19.65000 71.79896
19.75000 68.06385
19.85000 77.83616
19.95000 60.95321
