0.05000 -1391.00029 -334.65022 1035.71384 3040.96388 3201.63675 2332.87343
0.15000 -2730.15908 78.10312 232.00308 3270.33371 3112.44591 4059.88860
0.25000 -4465.74940 -73.06500 -106.85481 2970.01535 2970.10945 5563.36355
0.35000 -5712.87382 63.40402 150.06565 2919.92148 2882.31063 7160.77793
0.45000 -6811.61602 96.76699 -78.09950 2836.16350 2785.74699 8317.94623
0.55000 -7618.72268 152.70724 -436.50945 2863.68046 2794.85610 9052.20392
0.65000 -8265.56257 40.64002 -218.33114 2955.04539 2714.69760 9692.19423
0.75000 -8847.85954 55.51609 -70.51694 2979.68187 2757.92871 9964.94220
0.85000 -9196.19610 17.93922 -94.87571 3024.78024 2730.35716 10231.71480
0.95000 -9547.88011 72.91547 -120.50940 2987.58030 2742.41325 10140.90675
1.05000 -9822.26485 18.03096 139.81110 2894.74266 2733.32144 10028.27485
1.15000 -9995.84021 72.25368 -65.92832 2843.80274 2679.31983 9859.65106
1.25000 -10220.28715 74.14459 -95.35263 2746.13806 2667.20030 9546.65346
1.35000 -10292.09401 60.50172 20.42281 2674.25683 2581.77462 9281.37926
1.45000 -10391.79854 91.05270 7.52387 2504.16109 2562.62713 8923.97364
1.55000 -10357.44653 103.14282 -62.40410 2463.61877 2475.78945 8599.46983
1.65000 -10388.91858 24.27710 123.22930 2313.77374 2429.56580 8186.49114
1.75000 -10315.95734 30.13907 -80.85751 2192.05364 2345.74446 7865.85015
1.85000 -10231.57992 -20.25218 87.45125 2095.80745 2258.28990 7555.86521
1.95000 -10149.48074 -12.27800 0.09796 2004.49854 2215.24619 7275.16719
2.05000 -10070.01286 25.84228 7.84678 1819.48192 2167.48616 7016.93059
2.15000 -9960.39132 -4.63089 -43.91675 1782.92371 2112.05489 6751.49138
2.25000 -9880.22487 16.75691 31.19204 1660.62309 2087.33458 6452.85178
2.35000 -9785.57593 50.91211 -12.45547 1536.68295 2012.39768 6207.66942
2.45000 -9666.13741 28.34652 22.22060 1505.51831 1970.97733 6057.76358
2.55000 -9585.60441 28.85848 -65.72455 1446.60430 1906.45266 5826.19121
2.65000 -9488.62713 48.70313 14.68575 1395.46570 1846.56435 5687.27281
2.75000 -9424.43185 74.01168 120.49577 1358.55607 1764.61186 5447.60716
2.85000 -9356.97876 84.52850 15.34306 1274.76982 1717.61766 5208.64071
2.95000 -9262.34531 81.31123 119.16284 1256.72199 1646.12098 5056.27014
3.05000 -9188.97542 59.43012 103.76193 1210.05573 1590.29263 4863.75499
3.15000 -9104.63001 77.33901 67.73738 1169.46778 1521.27001 4681.12092
3.25000 -8974.50052 45.78912 144.04836 1162.79249 1458.45046 4570.69027
3.35000 -8889.03526 62.42733 68.42603 1114.00404 1393.41633 4393.59688
3.45000 -8773.78505 86.92220 30.73711 1106.44761 1329.12947 4295.19784
3.55000 -8631.27008 66.65610 -39.92791 1124.24751 1255.26921 4185.08350
3.65000 -8566.15254 84.81588 47.52498 1063.63711 1214.95173 3964.11452
3.75000 -8427.77872 71.79333 -31.61031 1036.94395 1144.28412 3873.64604
3.85000 -8315.31859 73.90431 67.65059 1016.34026 1092.71032 3765.35014
3.95000 -8234.38071 68.38476 12.01984 971.62154 1035.73009 3591.62447
4.05000 -8124.11712 107.17769 -5.38069 974.40182 990.45731 3495.74340
4.15000 -8037.97898 87.70277 69.36886 961.65172 943.84450 3365.32086
4.25000 -7925.78158 83.98889 4.32059 938.67827 900.23257 3251.23148
4.35000 -7806.71379 80.33686 18.17164 925.28122 851.40450 3147.87496
4.45000 -7683.51381 91.19082 19.97334 894.55739 822.43673 3052.90444
4.55000 -7576.82915 67.71667 6.59217 875.41633 762.37453 2945.33293
4.65000 -7505.89800 76.09010 15.06786 857.86586 732.74107 2808.60678
4.75000 -7390.56455 77.89656 9.66220 849.45073 692.84929 2731.96741
4.85000 -7284.95715 68.07840 -0.79087 830.40725 646.57183 2620.24936
4.95000 -7178.13472 62.01200 52.77536 820.53005 607.52187 2532.56033
5.05000 -7057.60342 57.33619 33.12176 808.05641 565.03215 2452.36975
5.15000 -6942.67130 52.71175 12.92492 803.06349 526.88375 2364.50994
5.25000 -6821.20976 62.99371 38.36122 787.23158 494.19886 2232.57143
5.35000 -6687.04688 48.25772 15.69305 760.35408 454.90257 2167.01181
5.45000 -6551.27448 29.57426 33.67738 732.12768 410.57263 2095.69811
5.55000 -6446.76932 37.58248 5.23181 698.46411 384.33387 2023.29541
5.65000 -6294.99381 39.69850 16.99153 647.57971 352.63327 1992.51128
5.75000 -6168.11725 32.39884 16.91764 599.93456 326.85448 1927.60545
5.85000 -6075.71670 39.87669 -12.16988 554.27069 307.92872 1847.72663
5.95000 -5979.65696 36.00437 7.59393 497.95893 290.70941 1788.72417
6.05000 -5889.10701 40.26282 -4.91774 478.93655 268.39647 1761.86560
6.15000 -5816.22556 42.26269 -1.51780 428.62858 257.19665 1654.74409
6.25000 -5736.72190 39.96835 -15.41024 397.20096 249.09825 1631.27937
6.35000 -5656.02864 41.57080 28.17672 373.12131 233.50141 1572.86697
6.45000 -5586.12607 37.13201 4.97636 350.49747 221.94001 1537.24712
6.55000 -5536.52319 37.39743 57.09479 327.13113 219.47945 1499.48531
6.65000 -5471.37577 36.46185 32.85329 319.31441 210.92604 1454.24551
6.75000 -5423.33624 41.54570 28.49039 302.10876 207.30665 1399.44874
6.85000 -5359.56019 44.94865 -2.31088 290.75061 198.79324 1387.56014
6.95000 -5306.84073 40.61356 20.19497 276.23108 192.06027 1334.64507
7.05000 -5255.65547 41.26038 12.57989 264.17881 192.32980 1306.37319
7.15000 -5209.85417 43.81575 -0.54702 259.58192 192.35121 1276.59848
7.25000 -5156.78267 46.91929 3.36229 250.55209 186.06715 1262.60481
7.35000 -5114.06593 50.08483 14.95282 251.07126 185.76737 1235.21350
7.45000 -5073.14074 46.26783 -10.94196 231.64785 186.05837 1197.11882
7.55000 -5029.40263 44.88588 0.06118 231.78778 186.91660 1188.08754
7.65000 -4987.72101 45.02175 -4.96535 221.53791 181.91079 1153.76111
7.75000 -4939.75336 48.28523 36.16621 217.30396 177.39248 1143.31908
7.85000 -4902.56231 45.20366 -0.07477 207.85854 179.22884 1113.27841
7.95000 -4863.30797 48.95820 18.30386 202.20002 181.57269 1080.10453
8.05000 -4827.56059 54.21350 18.61851 197.50832 173.24870 1047.85123
8.15000 -4787.27305 48.58241 -36.98167 206.71395 174.61702 1071.07578
8.25000 -4750.79742 47.16148 3.25292 197.05778 174.18850 1042.18907
8.35000 -4719.86742 48.87492 -61.24699 188.07480 172.12554 993.24002
8.45000 -4682.97816 52.13740 -44.03378 185.45382 172.22514 994.57342
8.55000 -4657.29234 49.76121 -23.96046 179.44416 169.88001 974.95577
8.65000 -4621.56658 47.93720 -34.82515 187.46839 172.82304 967.76101
8.75000 -4590.91342 51.57387 -36.37889 168.15543 165.76494 949.06924
8.85000 -4559.90940 45.74983 -29.14970 164.95827 168.38169 938.42351
8.95000 -4521.81760 45.82719 -34.68110 155.90966 166.41934 916.71289
9.05000 -4493.90091 44.11514 -16.27015 159.26765 163.45813 894.10680
9.15000 -4467.71837 43.31145 -39.82869 154.82498 159.26954 881.44197
9.25000 -4444.92507 42.21378 -23.78785 152.42344 158.42443 870.87011
9.35000 -4418.93630 39.09332 -23.17254 150.60317 157.36052 863.88829
9.45000 -4390.29244 40.86152 -21.92724 159.94131 155.32904 841.81839
9.55000 -4363.09762 37.07990 -21.22001 148.03546 149.98432 818.75720
9.65000 -4336.38889 42.03287 -30.39204 152.38076 148.24767 798.26559
9.75000 -4310.05153 36.65517 -18.61303 154.55682 144.18901 770.23018
9.85000 -4280.87461 38.11841 -23.43131 159.71587 139.78087 786.16042
9.95000 -4253.66977 35.34314 -16.92401 154.71839 135.92136 756.06986
10.05000 -4217.46568 39.05066 -17.40572 154.68880 134.44679 754.72085
10.15000 -4196.60715 36.28680 -13.24950 162.76645 131.03526 732.25298
10.25000 -4174.04641 29.70249 9.55077 160.38196 127.70367 716.91179
10.35000 -4138.27197 38.60414 -3.18924 162.49805 124.80065 710.61701
10.45000 -4119.31341 32.91146 -20.32184 171.88714 122.61307 687.44922
10.55000 -4084.88917 35.48696 3.73447 177.38786 117.91073 685.47366
10.65000 -4056.44085 35.65950 10.82880 170.95010 113.24101 677.68658
10.75000 -4035.22552 33.04614 6.51995 179.03673 110.83583 653.99598
10.85000 -4012.05840 33.88776 16.24391 188.80795 107.99149 641.01397
10.95000 -3982.00121 33.16387 -2.36226 188.30231 103.52453 633.82976
11.05000 -3954.73054 36.80112 28.48779 179.71621 101.91395 632.95700
11.15000 -3922.96736 37.45484 -15.90687 184.55001 98.29056 620.92141
11.25000 -3899.09768 35.61554 12.34107 184.28368 96.50605 599.71960
11.35000 -3869.25507 37.50502 -15.75698 179.13323 93.44786 586.54300
11.45000 -3841.51678 35.83864 -0.14878 174.53610 90.71760 587.61123
11.55000 -3822.23142 34.72359 2.44113 172.37205 88.37044 575.06445
11.65000 -3796.78594 34.29278 13.64466 171.35675 84.94182 555.79680
11.75000 -3768.03545 34.86912 -1.54186 162.29991 80.83925 547.98015
11.85000 -3747.65792 34.61768 -14.63058 163.61544 78.51697 539.09722
11.95000 -3721.41595 32.12078 -9.31386 159.68474 79.04727 520.81870
12.05000 -3696.85733 32.29434 -7.01030 155.47870 74.27398 518.24364
12.15000 -3666.20464 34.15153 10.38322 150.38630 72.38857 514.74623
12.25000 -3649.15763 32.64229 -2.22388 148.87609 71.52895 502.59867
12.35000 -3625.68594 29.15652 -8.44082 143.82654 68.85510 488.99145
12.45000 -3600.80503 31.32516 -10.02425 140.09054 65.31735 478.47878
12.55000 -3579.08929 29.36257 14.95907 137.00873 64.42089 463.99085
12.65000 -3556.00342 30.18351 1.88557 131.82311 63.15177 461.42703
12.75000 -3529.67818 27.30720 -3.92000 121.21772 61.72056 443.61918
12.85000 -3508.37313 25.10784 -5.92077 122.76400 59.87877 445.75219
12.95000 -3486.48974 25.63569 4.43860 114.49664 58.99163 423.62052
13.05000 -3464.07335 25.10684 -9.99109 113.53092 58.41813 419.09674
13.15000 -3437.59923 25.18983 16.85634 103.90116 58.18916 408.92202
13.25000 -3411.88737 24.43489 9.42615 101.50224 57.97859 414.47567
13.35000 -3391.62803 23.74719 -13.06026 97.74825 56.10697 395.58829
13.45000 -3369.53494 24.42208 13.36915 96.05028 54.15743 387.74817
13.55000 -3342.58125 24.51626 -9.33208 88.52408 53.07392 378.90219
13.65000 -3323.30857 23.25302 0.64489 89.09032 51.56773 370.35145
13.75000 -3297.77985 24.14900 -9.92474 85.57502 52.87828 366.11009
13.85000 -3274.59062 21.29616 -1.25834 81.30659 51.28634 348.69806
13.95000 -3252.17441 21.57582 -12.05117 79.37451 50.17592 351.63375
14.05000 -3227.36177 22.69891 -2.56322 81.06407 48.92353 350.67482
14.15000 -3202.80682 19.93236 13.32011 73.92149 48.86003 339.93638
14.25000 -3185.50629 21.25754 -17.12679 72.57634 48.15136 323.59946
14.35000 -3162.88966 19.32871 -25.81624 70.61850 48.00811 320.15343
14.45000 -3142.93969 18.14234 -21.11615 73.80577 46.99027 323.29067
14.55000 -3124.55869 17.86153 -12.98641 74.70906 46.40636 315.94912
14.65000 -3102.02872 20.14029 -20.34472 74.86016 46.57075 322.61067
14.75000 -3080.60141 17.88108 -28.15688 73.00593 45.69110 305.50008
14.85000 -3065.89505 16.75136 -19.07542 71.07759 45.71373 293.82274
14.95000 -3043.86039 15.70404 -31.51943 68.69005 45.18524 298.95546
15.05000 -3028.64659 16.88468 -32.29780 71.32338 44.64593 291.46091
15.15000 -3006.27575 16.44530 -25.36420 69.18384 45.01178 284.61995
15.25000 -2992.36574 15.44426 -23.45977 69.09319 42.52115 274.56326
15.35000 -2968.50701 15.90685 -27.92593 68.09897 43.06067 278.96013
15.45000 -2954.66870 15.31090 -27.46456 70.19862 43.57090 276.84639
15.55000 -2935.15880 16.34311 -29.27354 66.25512 43.38704 268.24683
15.65000 -2918.68115 16.36546 -22.27959 63.62560 41.41041 264.74842
15.75000 -2900.07193 17.44776 -29.76767 64.25586 45.95004 268.15532
15.85000 -2882.30144 17.64153 -24.49321 63.21052 42.11830 264.57690
15.95000 -2870.13735 16.06494 -25.49103 64.17765 42.63504 259.23058
16.05000 -2845.38326 14.93098 -42.94539 62.70218 41.62401 256.43111
16.15000 -2835.35486 16.09870 -17.66122 62.30108 43.08526 250.59276
16.25000 -2817.84575 15.51409 -26.49978 62.54255 41.67017 244.83414
16.35000 -2800.90381 16.29935 -18.37116 60.30008 41.22502 241.17020
16.45000 -2784.43044 17.69115 -21.23554 58.87378 41.78191 241.40459
16.55000 -2766.51125 20.47205 -22.19849 57.12509 43.85678 235.19974
16.65000 -2751.81925 16.39205 -16.80886 57.22655 41.47064 229.35718
16.75000 -2737.03456 16.16667 -5.23671 54.34768 42.64937 234.92775
16.85000 -2717.47883 18.02607 -22.24472 54.11179 43.45983 230.33761
16.95000 -2706.08352 17.71771 -20.07502 51.44676 41.91160 218.49135
17.05000 -2688.76909 17.34183 -12.54283 49.88480 39.92489 217.01252
17.15000 -2670.58166 16.59460 -7.09519 49.51716 40.49126 216.08942
17.25000 -2656.69217 13.65113 -10.68903 50.12627 40.56425 206.96639
17.35000 -2639.68262 15.68469 -7.72736 49.04262 42.94597 204.73793
17.45000 -2623.42682 15.99375 -17.96353 50.43757 40.44470 211.41529
17.55000 -2612.67391 14.43368 -5.68304 49.90335 41.52162 194.68521
17.65000 -2593.01678 15.13148 -21.37857 47.78172 41.05069 195.56840
17.75000 -2581.29694 16.03709 -8.41001 48.43473 40.54802 188.68578
17.85000 -2563.70990 15.24637 -11.63224 48.06628 39.79087 192.97072
17.95000 -2548.87581 13.12205 -8.99556 45.41851 41.12095 183.53762
18.05000 -2532.09141 14.95087 -3.26912 47.85644 40.97279 199.79193
18.15000 -2519.90312 14.74321 -5.26266 45.71340 40.77700 194.58178
18.25000 -2504.99246 15.22388 -20.87895 47.32409 39.98539 184.34366
18.35000 -2490.16008 13.53055 -3.37468 43.60514 39.98011 178.73092
18.45000 -2476.34973 13.35701 -3.93400 47.05919 38.79375 176.47670
18.55000 -2460.97471 12.91991 -5.51292 47.78154 39.74363 182.96397
18.65000 -2453.68044 14.12254 -1.14034 48.72342 39.44427 174.96748
18.75000 -2436.08256 10.91330 -2.79115 48.18285 39.52009 172.65888
18.85000 -2418.30816 11.31616 -11.10961 49.30422 39.52857 174.38420
18.95000 -2407.18699 12.87507 -11.84368 48.81322 38.26384 177.44113
19.05000 -2389.84293 11.14906 -7.32874 48.86115 37.04754 163.50814
19.15000 -2377.93812 13.93544 -8.64075 48.73658 37.48722 168.22736
19.25000 -2358.67906 10.96201 -7.05843 48.38153 37.37560 168.76654
19.35000 -2345.87928 16.46815 10.09632 51.87036 38.62017 173.34737
19.45000 -2329.66152 21.04188 -7.75443 49.65116 38.21775 180.76395
19.55000 -2322.82251 24.08716 0.49451 49.24441 39.44564 156.36746
19.65000 -2306.96488 26.82717 9.03564 46.50730 37.08194 164.99099
19.75000 -2294.53965 28.60122 4.60631 46.67798 39.46344 152.25436
19.85000 -2281.11774 27.74686 4.82378 48.96526 36.23733 170.18767
19.95000 -2271.19464 28.37023 -0.44507 48.87137 37.86883 160.14376
