0.05000 -1237.01737 1356.37646 4471.68652 506.31618 280.52560 362.01233
0.15000 290.04784 433.09442 4467.48067 1350.40743 1423.47784 148.24510
0.25000 -714.33008 358.20153 4265.72236 1494.24195 1281.85353 521.93965
0.35000 -893.72194 -0.00847 4259.77366 1686.26392 1257.28436 549.07290
0.45000 -925.20566 67.69363 4260.02128 1995.26053 3135.62685 2367.09341
0.55000 -1275.23329 431.64696 4080.89968 1482.27448 1515.58155 620.13539
0.65000 -1442.32293 -56.83718 4097.16956 1431.19043 1544.20789 658.16441
0.75000 -1625.56547 -152.27853 3933.12931 1559.77476 1556.60519 893.05663
0.85000 -1927.37498 -34.52697 3886.44521 1788.03424 1616.78219 1379.53225
0.95000 -2102.14000 24.10671 3600.95918 1683.32019 1802.78669 1071.48365
1.05000 -2346.64996 -62.52972 3357.31217 1590.75244 1893.55014 1087.04039
1.15000 -2446.46352 -71.58687 3041.07357 1937.33416 2003.98556 1262.82197
1.25000 -2643.55123 -144.63459 2632.05021 1928.55922 2030.06447 1518.03057
1.35000 -2828.50491 76.36910 2248.78125 1941.59837 1981.66601 1854.71880
1.45000 -3026.00282 -53.05534 1787.09527 1792.73542 1922.03151 1954.97120
1.55000 -3157.34103 -8.91090 1519.74872 1554.15469 1800.12925 2354.71915
1.65000 -3313.93373 87.26758 1297.80547 1471.87158 1645.50555 2222.22727
1.75000 -3364.63279 14.04724 1226.34365 1424.86159 1492.38019 2302.45401
1.85000 -3410.56669 -26.78789 1101.83439 1346.05291 1336.50513 2393.24113
1.95000 -3509.53479 -12.76765 949.76245 1322.14715 1291.26286 2364.15985
2.05000 -3507.17781 -24.02304 963.10591 1250.92269 1204.54550 2384.38328
2.15000 -3494.80082 2.92342 793.17268 1268.81827 1154.24556 2451.63301
2.25000 -3473.75887 32.51586 857.85622 1246.15508 1172.01117 2425.74966
2.35000 -3457.74912 -19.58028 538.82356 1446.32161 1224.99822 2571.53963
2.45000 -3485.48747 -10.48093 643.09370 1358.13542 1133.53728 2615.58641
2.55000 -3557.09252 4.36145 459.52519 1169.39308 921.78669 2514.79121
2.65000 -3508.61007 36.96302 654.95636 1158.08823 816.79060 2486.24886
2.75000 -3414.62207 35.18263 494.69977 1177.16510 864.30241 2557.28081
2.85000 -3480.16735 -5.80394 443.52296 1202.04088 851.36177 2539.60209
2.95000 -3448.87500 -2.19705 338.57770 1140.85647 753.67474 2487.43275
3.05000 -3494.38040 -22.38189 344.05709 1071.42674 704.07456 2455.29770
3.15000 -3417.45236 -7.01510 372.19370 1069.58816 714.46057 2516.55190
3.25000 -3448.77213 0.35920 413.28703 1142.35053 780.05353 2473.30107
3.35000 -3445.48137 -21.52855 170.05034 1076.10766 716.77617 2453.58968
3.45000 -3366.24133 -13.61680 249.83492 1146.08810 699.55950 2481.63042
3.55000 -3349.62650 -20.18316 236.51617 1108.33862 619.16282 2460.24058
3.65000 -3359.79253 23.35693 223.78246 1057.03251 630.85796 2413.81646
3.75000 -3345.75685 10.64632 265.50649 1000.63604 562.22096 2389.03990
3.85000 -3294.20617 27.88009 259.25235 1030.90030 513.13576 2389.79681
3.95000 -3279.34850 -10.01950 120.17288 1016.58321 539.96919 2390.69428
4.05000 -3257.96911 -3.15938 128.04911 1007.77401 525.78427 2385.76020
4.15000 -3224.73172 12.47283 133.32675 999.84435 502.14670 2400.80254
4.25000 -3247.24611 -5.62098 40.73963 1020.53165 519.19017 2391.09211
4.35000 -3203.04309 4.35784 97.79949 1011.28070 473.87856 2362.97582
4.45000 -3193.60318 -17.52939 87.21431 985.88959 454.16772 2344.03936
4.55000 -3153.58792 3.93530 84.00255 993.00174 474.91106 2354.55164
4.65000 -3162.37329 3.02591 181.62959 942.34842 413.67263 2293.49337
4.75000 -3146.75045 3.06078 67.96626 961.52606 425.22802 2285.24043
4.85000 -3115.74337 2.60717 97.35195 923.57063 386.56693 2279.80050
4.95000 -3093.52431 0.97816 124.58363 924.51185 377.29094 2264.71582
5.05000 -3079.97164 -17.30320 154.74284 911.48450 394.03958 2225.87009
5.15000 -3051.45704 6.13318 18.98195 949.50183 378.68366 2249.41506
5.25000 -3028.56427 1.47064 116.35412 941.87812 381.52254 2243.50471
5.35000 -3012.44094 1.18558 129.19835 922.24421 373.06137 2209.37608
5.45000 -3003.14013 5.49286 96.43647 893.09316 334.20596 2206.04909
5.55000 -2994.14841 9.55456 49.47792 889.34292 366.02519 2195.93436
5.65000 -2958.35719 9.64933 -68.23909 913.30656 346.33680 2197.88333
5.75000 -2929.05709 10.96037 116.86186 911.75037 323.97898 2171.39392
5.85000 -2928.06973 -3.80308 65.65329 873.86697 325.38812 2163.87648
5.95000 -2899.32594 0.92470 3.40101 890.61278 302.83427 2170.75758
6.05000 -2898.29654 2.25957 85.74370 912.38095 320.83346 2132.83138
6.15000 -2881.04814 -0.42029 102.45244 845.34389 292.40043 2110.97954
6.25000 -2854.87779 -0.82842 42.06151 850.53632 328.53369 2112.34973
6.35000 -2824.33515 0.18568 41.51551 846.92142 313.81514 2128.55064
6.45000 -2802.82500 1.90522 54.42816 852.01380 309.56554 2104.50374
6.55000 -2835.83616 1.25094 -79.17465 830.27213 300.30267 2062.03045
6.65000 -2795.45425 9.32194 37.30385 855.50997 386.99275 2082.05467
6.75000 -2793.17838 -4.72953 -3.45274 807.22554 335.53115 2043.72190
6.85000 -2790.17165 -6.67582 -14.75303 819.81776 299.34541 2015.49051
6.95000 -2760.99292 6.82549 -41.99657 795.31184 242.20867 2020.66878
7.05000 -2755.26619 0.00683 13.27879 801.33659 264.02904 1999.44638
7.15000 -2751.74361 -2.16657 -49.72381 782.29962 254.52710 1973.19202
7.25000 -2702.45674 6.10468 20.67928 790.88398 258.88131 1995.32822
7.35000 -2676.51087 -1.12494 67.09921 798.16040 240.46299 1982.96509
7.45000 -2697.00973 0.64725 -14.06041 786.50138 235.06940 1944.87677
7.55000 -2641.58197 1.26764 65.47496 806.15506 235.38060 1983.00503
7.65000 -2650.58980 0.46242 -6.50168 817.76133 264.27865 1946.88612
7.75000 -2616.06610 -1.92114 -38.25416 782.20630 203.48684 1960.46589
7.85000 -2641.28925 -3.20825 46.27120 786.21685 220.63333 1892.01153
7.95000 -2610.85212 3.32406 -85.69386 788.24921 240.38468 1907.85333
8.05000 -2578.93006 -0.86778 -27.43784 765.16281 238.09604 1923.99503
8.15000 -2604.91079 -1.38212 -81.29901 758.05581 275.65467 1868.29007
8.25000 -2565.70085 3.04524 44.57091 745.92004 199.58135 1876.94362
8.35000 -2531.71506 -3.35329 -106.61670 753.90130 205.52155 1909.19512
8.45000 -2542.06429 -1.15102 -65.28414 733.11829 225.67581 1874.80810
8.55000 -2512.01366 -2.42932 -1.74228 835.93907 296.26292 1862.27965
8.65000 -2503.74077 0.74200 53.27963 723.22639 174.17347 1844.92441
8.75000 -2493.97639 -0.56908 -54.04506 740.02657 199.59601 1838.64596
8.85000 -2487.78966 -1.47715 -38.54703 716.60933 181.73151 1828.44238
8.95000 -2471.48195 -0.33158 -58.57977 719.53096 171.86694 1809.07395
9.05000 -2480.08554 3.76863 -6.69066 708.88329 178.05925 1761.15639
9.15000 -2437.33897 -7.14417 -61.11671 731.57479 212.39231 1798.39699
9.25000 -2422.24965 -6.45679 -44.01273 703.13375 183.22789 1793.47677
9.35000 -2432.42982 -4.94942 -13.80419 710.46165 187.51851 1751.77218
9.45000 -2415.99566 -2.95795 -28.24885 687.12883 196.07755 1749.13426
9.55000 -2396.11375 -0.04651 -93.02404 696.40812 152.47566 1748.54920
9.65000 -2355.93751 5.36220 -88.85310 717.83349 153.21081 1761.48488
9.75000 -2385.33218 -0.32354 -26.59845 685.89769 268.61656 1714.81452
9.85000 -2323.12966 0.24449 -14.87216 695.98810 146.78841 1753.83675
9.95000 -2341.65215 0.82295 -126.73591 672.38025 191.93966 1718.29973
10.05000 -2315.55156 3.30119 -28.06494 663.72365 146.63568 1721.51614
10.15000 -2302.92638 0.28145 -48.44622 682.01843 137.76832 1704.99110
10.25000 -2289.62130 -0.83446 -79.34421 671.46741 162.61701 1708.75103
10.35000 -2273.19897 -1.36069 -49.94391 664.28360 141.07123 1694.53568
10.45000 -2278.42602 -0.52578 39.91194 657.24634 151.65804 1653.16547
10.55000 -2257.93621 1.89806 -40.53163 658.33746 166.76729 1672.18086
10.65000 -2243.41382 -1.18189 -40.21234 660.97925 173.75095 1667.06455
10.75000 -2230.83035 0.24722 -112.71819 664.70394 160.06954 1660.28357
10.85000 -2232.95288 -3.40833 -92.22800 634.42136 136.82247 1634.28125
10.95000 -2204.61394 -3.65340 -8.36610 650.07001 130.93833 1636.23604
11.05000 -2188.12556 1.76820 -69.85714 655.85864 138.54644 1642.29015
11.15000 -2210.91048 -3.19579 -96.42049 624.98103 147.93611 1597.62538
11.25000 -2201.45603 -0.28817 -86.07797 613.08328 144.34883 1589.38415
11.35000 -2168.51417 -1.95604 -35.22512 630.60595 194.58969 1600.04766
11.45000 -2181.47167 4.84976 -10.91148 608.45314 149.45150 1561.41567
11.55000 -2148.50225 3.65604 -53.12858 620.02532 144.49381 1584.03226
11.65000 -2111.67564 -1.45204 -39.94597 652.91848 185.08192 1593.92964
11.75000 -2131.43289 2.19110 -9.62227 625.59458 222.86724 1550.04752
11.85000 -2107.11787 5.22142 -11.00492 617.98370 206.75598 1558.57197
11.95000 -2090.36103 2.11639 -29.60812 630.33802 121.24104 1561.51808
12.05000 -2094.80361 -1.96769 -65.26697 621.18291 170.94912 1546.05322
12.15000 -2070.23591 -0.29895 -48.37647 606.69974 122.02861 1550.22695
12.25000 -2062.09847 -2.11478 -71.40937 597.45430 375.25453 1542.35408
12.35000 -2064.99097 3.69060 -42.93160 598.58014 133.16165 1513.59877
12.45000 -2049.35148 1.43327 -24.87126 580.82270 120.42003 1510.85226
12.55000 -2038.70354 -0.11540 -80.68403 602.69730 130.44011 1502.94112
12.65000 -2026.41179 1.18339 -53.94228 585.55476 142.54537 1498.88691
12.75000 -2026.59911 0.02029 -109.17401 577.66028 107.05777 1485.07193
12.85000 -1991.71512 1.65079 -36.87189 618.49932 148.49809 1495.96622
12.95000 -2008.53097 -0.75752 -47.12786 569.47089 154.03850 1462.41039
13.05000 -1971.01535 -0.62582 -13.83585 579.60404 121.90500 1487.72941
13.15000 -1967.08536 1.49513 -115.59924 582.33271 99.67130 1470.04436
13.25000 -1972.23123 -0.50896 -16.71310 583.90267 110.04105 1438.74803
13.35000 -1942.15679 -4.39715 -82.49806 564.63523 106.09443 1468.04870
13.45000 -1947.94127 0.78356 -64.31969 550.42627 95.71849 1440.68379
13.55000 -1913.24151 1.61294 -90.14465 572.23575 97.53190 1459.43359
13.65000 -1931.98735 0.71381 -56.78613 559.13225 103.66564 1418.51238
13.75000 -1903.12475 -1.69312 -30.43990 562.59834 153.80767 1435.88830
13.85000 -1927.47322 2.93278 -85.60638 537.75344 138.58622 1392.25052
13.95000 -1896.06382 1.53054 -65.62508 540.57488 115.37691 1411.25441
14.05000 -1888.52657 -2.23182 -54.45698 565.22629 100.13553 1397.53053
14.15000 -1879.44238 0.62832 -118.03473 544.91824 129.15460 1392.58488
14.25000 -1866.39893 1.41792 -73.36413 545.01711 97.64989 1392.71372
14.35000 -1873.38097 -3.09958 -27.11335 530.52554 91.65582 1364.04868
14.45000 -1855.81023 0.00905 -66.01145 533.57676 89.79361 1372.24559
14.55000 -1857.71773 2.84732 -44.74669 546.56224 249.75568 1397.07356
14.65000 -1848.61124 1.36249 -33.76917 526.34224 90.16253 1340.26705
14.75000 -1837.54708 0.27187 -85.12057 526.42060 92.06833 1336.88432
14.85000 -1811.88037 -0.08552 -0.94887 527.22214 94.48416 1349.71595
14.95000 -1806.99607 2.76288 -48.25841 513.99536 98.05244 1347.47682
15.05000 -1814.89585 0.26317 -62.38623 527.49270 128.32815 1316.84020
15.15000 -1812.96345 0.52422 -79.19798 508.24707 171.24358 1304.07067
15.25000 -1804.38429 -2.84439 -65.97270 511.98827 160.29510 1296.56931
15.35000 -1766.64120 -0.40610 -49.56691 531.94224 129.64346 1323.02410
15.45000 -1771.26565 -1.96457 -12.74598 505.23993 101.87860 1301.48572
15.55000 -1773.69357 2.74620 -65.94151 505.81891 121.68290 1286.47348
15.65000 -1730.55854 0.13391 -38.88078 517.65249 140.46341 1316.48337
15.75000 -1746.45190 -1.07324 -124.71711 510.83378 101.78735 1288.47693
15.85000 -1728.20937 0.04842 -46.62315 512.26232 91.52193 1284.60101
15.95000 -1727.49950 -0.25337 -47.24689 510.87519 73.74887 1269.59737
16.05000 -1732.37901 0.44060 -53.30564 490.24504 94.25458 1254.34916
16.15000 -1695.97241 -0.32490 -53.60007 499.49658 105.94534 1283.07118
16.25000 -1701.91135 1.30004 -66.74714 498.83402 110.65341 1258.80992
16.35000 -1688.16690 -0.55158 -12.41346 505.24686 97.22199 1259.04779
16.45000 -1687.07731 -1.16469 -81.28035 488.16240 88.69329 1247.71463
16.55000 -1681.22281 -0.42481 -98.47739 489.86907 127.28193 1242.60181
16.65000 -1674.22176 0.09384 -31.42898 486.45959 79.03972 1228.68912
16.75000 -1681.51141 -0.32748 -29.34547 470.40357 73.09499 1206.64038
16.85000 -1654.68686 0.16096 -89.87920 476.37268 73.27336 1226.72773
16.95000 -1645.51759 1.19048 -37.52763 474.39264 85.86564 1219.05265
17.05000 -1645.90638 1.59046 -63.83529 472.61876 103.17432 1204.40947
17.15000 -1631.30666 -0.05597 -32.00010 475.99150 80.98181 1208.78971
17.25000 -1633.22175 0.31391 -97.85686 464.93702 72.37200 1194.55673
17.35000 -1614.43076 -2.19186 -47.88800 464.07906 66.46397 1198.89211
17.45000 -1611.62320 -1.76810 -74.55344 471.78102 91.11381 1188.63538
17.55000 -1611.41815 3.87447 -60.76910 614.10683 104.36417 1182.64710
17.65000 -1600.04155 0.86838 -66.28710 464.19058 98.07678 1173.95772
17.75000 -1577.23259 -2.60972 -34.04017 470.28078 70.40516 1183.96051
17.85000 -1581.61715 2.32065 -16.07957 459.45611 65.51748 1167.38539
17.95000 -1575.40938 0.90145 -76.42018 453.64246 64.44893 1160.52141
18.05000 -1569.98237 1.91163 2.91712 452.55173 65.37868 1149.28321
18.15000 -1556.20098 -0.00597 -73.67395 460.20106 99.54655 1153.57695
18.25000 -1556.89401 -1.34776 -50.45629 437.42678 70.13879 1148.89840
18.35000 -1558.40140 -3.37594 -70.38408 450.97598 102.60164 1127.62017
18.45000 -1540.51567 0.12131 -91.19431 439.31539 67.69398 1137.84838
18.55000 -1526.63331 0.83741 -49.02408 435.96228 59.45680 1142.24553
18.65000 -1528.15127 -3.16846 -51.41366 437.39870 78.56894 1124.23777
18.75000 -1503.49485 0.38081 -25.83825 444.80566 74.45025 1134.35695
18.85000 -1527.03287 2.93489 -31.36704 432.34095 106.47651 1098.63151
18.95000 -1513.74861 -3.00130 -40.34640 422.86466 65.45363 1103.07886
19.05000 -1500.28328 0.58623 -81.18335 446.96509 70.67509 1112.29615
19.15000 -1487.53181 1.03419 -18.06550 430.57008 61.41623 1105.84359
19.25000 -1488.57265 -0.37959 -36.80861 423.93809 56.91501 1093.46342
19.35000 -1471.99267 -0.66843 -49.34107 430.91078 84.45689 1103.05604
19.45000 -1484.57286 0.91738 -31.70522 446.39733 65.95973 1068.24223
19.55000 -1465.00819 1.95959 -33.93034 419.05945 71.65237 1084.42193
19.65000 -1469.77760 -0.48509 -55.96252 412.50187 56.84397 1073.05823
19.75000 -1448.06081 -3.27928 -32.86042 423.95805 84.92762 1078.40559
19.85000 -1450.38384 -0.19478 -26.50286 418.13832 60.00827 1061.29993
19.95000 -1428.57348 -0.61736 -37.82294 422.11462 53.67720 1076.41364
