0.05000 10443.70089
0.15000 10294.71897
0.25000 11971.01152
0.35000 11740.03744
0.45000 11429.91015
0.55000 10714.15443
0.65000 10174.43439
0.75000 9712.45183
0.85000 9277.63077
0.95000 8826.64624
1.05000 8224.35858
1.15000 7827.21961
1.25000 7457.12694
1.35000 7206.83880
1.45000 6895.81986
1.55000 6606.26096
1.65000 6269.57233
1.75000 5999.65641
1.85000 5886.93218
1.95000 5569.86180
2.05000 5415.86457
2.15000 5277.38399
2.25000 4910.62763
2.35000 4851.44718
2.45000 4599.77970
2.55000 4385.35587
2.65000 4282.07468
2.75000 4152.01276
2.85000 4020.57608
2.95000 3833.23860
3.05000 3717.76492
3.15000 3691.40833
3.25000 3545.79712
3.35000 3506.75817
3.45000 3368.21316
3.55000 3121.98607
3.65000 3196.31879
3.75000 3117.18528
3.85000 3018.14871
3.95000 2895.67713
4.05000 2857.08130
4.15000 2797.45397
4.25000 2715.71936
4.35000 2612.06219
4.45000 2513.22240
4.55000 2401.05417
4.65000 2413.30386
4.75000 2356.34733
4.85000 2263.22341
4.95000 2242.32378
5.05000 2125.09116
5.15000 2033.55063
5.25000 2018.17676
5.35000 1964.76169
5.45000 1890.32035
5.55000 1858.58416
5.65000 1779.55469
5.75000 1697.54139
5.85000 1693.27949
5.95000 1646.22905
6.05000 1557.41723
6.15000 1526.19694
6.25000 1516.70987
6.35000 1457.92534
6.45000 1461.78614
6.55000 1348.99833
6.65000 1339.42889
6.75000 1278.36938
6.85000 1270.33379
6.95000 1241.73426
7.05000 1226.66319
7.15000 1221.83237
7.25000 1198.27157
7.35000 1105.22445
7.45000 1120.74623
7.55000 1051.25925
7.65000 1052.36795
7.75000 1023.30372
7.85000 1021.82321
7.95000 999.26608
8.05000 950.76967
8.15000 937.40186
8.25000 944.57588
8.35000 895.17680
8.45000 848.55189
8.55000 860.02708
8.65000 836.88903
8.75000 808.61565
8.85000 811.78043
8.95000 773.73297
9.05000 776.81985
9.15000 750.10027
9.25000 760.55407
9.35000 717.51855
9.45000 693.41456
9.55000 678.45446
9.65000 664.04889
9.75000 669.69831
9.85000 641.51675
9.95000 651.11275
10.05000 633.26135
10.15000 614.18062
10.25000 595.70230
10.35000 628.77191
10.45000 581.68811
10.55000 570.05607
10.65000 542.07601
10.75000 567.56669
10.85000 547.43299
10.95000 515.25284
11.05000 526.80154
11.15000 504.43836
11.25000 490.70464
11.35000 515.35041
11.45000 475.30366
11.55000 457.81895
11.65000 474.79983
11.75000 438.57552
11.85000 442.07636
11.95000 414.33132
12.05000 415.95560
12.15000 408.79698
12.25000 392.44354
12.35000 401.45400
12.45000 378.55329
12.55000 375.63047
12.65000 371.04833
12.75000 374.45189
12.85000 340.61493
12.95000 344.76965
13.05000 356.41044
13.15000 328.34086
13.25000 342.90496
13.35000 314.63203
13.45000 325.10735
13.55000 314.83929
13.65000 307.18174
13.75000 303.30697
13.85000 294.59807
13.95000 304.71698
14.05000 282.78279
14.15000 279.80709
14.25000 269.48759
14.35000 257.81175
14.45000 254.40725
14.55000 273.52085
14.65000 252.97841
14.75000 243.53330
14.85000 240.75788
14.95000 246.55447
15.05000 250.53600
15.15000 226.13834
15.25000 227.55196
15.35000 226.45869
15.45000 222.47524
15.55000 208.59020
15.65000 220.41479
15.75000 230.48160
15.85000 219.23833
15.95000 208.83987
16.05000 195.95947
16.15000 211.94489
16.25000 192.79898
16.35000 187.44073
16.45000 196.71472
16.55000 177.42764
16.65000 211.11024
16.75000 181.43762
16.85000 173.20160
16.95000 171.66359
17.05000 179.46308
17.15000 190.64145
17.25000 157.95918
17.35000 195.17979
17.45000 165.41258
17.55000 171.58635
17.65000 168.62065
17.75000 182.69664
17.85000 154.51867
17.95000 159.23785
18.05000 156.95453
18.15000 163.81435
18.25000 161.43431
18.35000 171.98792
18.45000 145.78447
18.55000 138.81219
18.65000 164.71835
18.75000 159.57224
18.85000 141.44753
18.95000 150.53297
19.05000 163.18072
19.15000 144.27960
19.25000 165.88770
19.35000 158.58196
19.45000 156.32061
19.55000 159.37132
19.65000 137.80094
19.75000 141.96500
19.85000 142.74265
19.95000 134.06865
