0.2 -0.30515 15.97269 0.40932 115.6488 113.3291 87.24845
0.6 -0.63961 37.98398 0.04868 115.53683 108.488 84.20775
1.0 0.12168 58.56534 0.80267 115.56446 99.31854 80.57608
1.4 0.81922 71.51266 0.44326 111.96863 91.94097 77.69518
1.8 0.09557 78.90271 0.05215 109.2459 87.19399 73.23096
2.2 -0.25163 84.59073 1.34276 105.25735 82.08966 70.12886
2.6 -1.57905 88.71524 -0.56042 100.94265 78.91795 66.90272
3.0 0.78088 93.40148 -0.41922 95.84875 75.15466 63.53986
3.4 0.39377 98.81128 -0.40919 92.35969 72.81378 60.56309
3.8 1.05202 105.23467 -1.12168 87.79029 70.01082 59.11694
4.2 2.52995 111.75714 -1.46583 83.26081 68.26979 56.03262
4.6 4.32187 119.4073 -0.98711 77.16107 66.81293 54.00076
5.0 4.43943 128.61355 0.16931 71.58946 66.2837 51.38576
5.4 5.85009 138.89981 0.18858 66.35116 64.2083 48.35417
5.8 6.33944 150.14467 0.76939 61.11031 61.10898 45.10894
6.2 4.87888 161.25363 0.57815 56.76269 56.1861 41.14971
6.6 2.9181 172.78718 0.56492 51.88192 48.52112 38.03347
7.0 1.82487 178.18869 0.58156 47.60102 44.52357 34.75826
7.4 -0.03958 183.50838 0.65468 43.59289 40.56269 32.07675
7.8 -0.48175 187.82916 0.59327 40.97071 36.24654 29.92857
8.2 -1.77987 189.83563 0.39848 39.61285 33.55177 27.30552
8.6 -2.19094 192.22279 0.03876 38.0405 31.12285 25.71292
9.0 -2.57436 194.78914 -0.38746 36.83314 28.97372 23.96612
9.4 -2.25933 197.04023 -1.18162 36.61373 26.54285 22.88138
9.8 -1.94741 198.04709 -1.05507 35.28096 24.38744 22.12867
10.2 -1.41704 198.14519 -0.96884 33.75048 23.18271 21.05624
10.6 -1.09779 198.12975 -1.44137 32.68711 22.07565 20.58337
11.0 -1.03893 198.47524 -0.96477 31.48529 22.08968 19.44444
11.4 -1.1462 199.03728 -1.16485 29.26999 22.45136 18.92219
11.8 -0.64636 199.43662 -1.13337 27.4972 22.1912 18.20133
12.2 -0.13823 200.8164 -0.65545 26.56205 22.30622 17.38064
12.6 0.19525 201.98807 -0.58462 24.9856 21.57987 16.6038
13.0 0.41044 202.65385 -0.01369 23.7575 21.25066 16.15438
13.4 0.69151 203.4636 0.2391 22.5008 20.32402 15.54294
13.8 0.17365 204.46278 0.16579 21.7993 18.82581 15.12315
14.2 -0.03042 204.82804 0.78015 20.71182 17.70567 14.74794
14.6 -0.54335 205.73365 0.89402 20.0695 16.70634 14.15637
15.0 -0.61293 206.06004 1.12668 19.51633 16.13387 13.87721
15.4 -0.84903 207.50913 1.23383 18.68109 15.49361 13.61876
15.8 -0.81502 208.70603 0.61782 18.40506 15.01426 13.4801
16.2 -0.22942 209.44932 0.96159 17.69965 13.62922 12.72967
16.6 0.11384 210.11966 0.41844 17.48661 12.77791 12.56143
17.0 -0.03635 209.29123 0.59406 17.01873 11.62622 12.24667
17.4 0.11967 208.67984 0.40542 17.24006 10.5436 12.17759
17.8 0.17134 208.02313 0.52771 16.54832 10.2538 11.82062
18.2 0.71008 206.98902 0.29527 15.79786 10.46623 11.46225
18.6 -0.11865 206.31489 0.11266 15.61181 10.31613 11.14483
19.0 0.19708 206.09263 0.11854 14.94501 10.95995 10.59754
19.4 0.95104 206.20701 0.10736 14.43885 11.05107 10.09835
19.8 0.5532 206.53322 0.12989 14.35256 10.84243 9.96628
