0.05000 5635.21822
0.15000 9145.67777
0.25000 12244.27645
0.35000 13882.01598
0.45000 14564.62355
0.55000 14492.78417
0.65000 14388.72025
0.75000 13255.20973
0.85000 12732.01792
0.95000 11970.94345
1.05000 11380.07720
1.15000 10817.08703
1.25000 10247.98510
1.35000 9668.23536
1.45000 9161.04122
1.55000 8869.60375
1.65000 8152.32294
1.75000 7715.69078
1.85000 7445.97695
1.95000 7065.02958
2.05000 6715.80098
2.15000 6506.88454
2.25000 6256.51729
2.35000 5928.59054
2.45000 5699.36874
2.55000 5590.50941
2.65000 5251.81162
2.75000 5077.61840
2.85000 4833.33903
2.95000 4637.20759
3.05000 4573.14574
3.15000 4356.74420
3.25000 4098.80475
3.35000 3940.81457
3.45000 3806.27529
3.55000 3727.13577
3.65000 3520.57972
3.75000 3450.99566
3.85000 3278.41716
3.95000 3180.32997
4.05000 3090.88868
4.15000 2990.71748
4.25000 2924.55327
4.35000 2717.74307
4.45000 2656.54558
4.55000 2537.72824
4.65000 2455.08547
4.75000 2326.92575
4.85000 2240.62715
4.95000 2140.43988
5.05000 2144.13443
5.15000 2034.83992
5.25000 1955.56221
5.35000 1852.81357
5.45000 1736.09954
5.55000 1709.25106
5.65000 1670.81124
5.75000 1634.67737
5.85000 1521.85071
5.95000 1484.49466
6.05000 1413.15511
6.15000 1405.90653
6.25000 1379.78562
6.35000 1305.62532
6.45000 1278.01977
6.55000 1208.60494
6.65000 1205.54649
6.75000 1160.35856
6.85000 1121.42795
6.95000 1105.29628
7.05000 1088.20909
7.15000 1035.91990
7.25000 1006.18279
7.35000 967.52862
7.45000 951.10672
7.55000 902.62164
7.65000 885.16725
7.75000 873.83289
7.85000 846.88486
7.95000 822.87827
8.05000 789.30822
8.15000 779.37755
8.25000 742.63824
8.35000 744.26296
8.45000 716.93519
8.55000 701.30499
8.65000 683.58033
8.75000 676.39688
8.85000 675.39619
8.95000 662.73466
9.05000 630.24516
9.15000 618.66204
9.25000 638.69403
9.35000 607.01885
9.45000 616.05638
9.55000 562.79976
9.65000 551.26070
9.75000 540.32683
9.85000 562.28589
9.95000 525.31979
10.05000 521.96894
10.15000 479.86649
10.25000 495.12743
10.35000 479.28463
10.45000 497.69245
10.55000 480.27520
10.65000 442.44049
10.75000 440.07672
10.85000 444.21670
10.95000 426.72023
11.05000 419.65303
11.15000 415.24037
11.25000 411.04393
11.35000 405.95108
11.45000 395.79798
11.55000 404.75398
11.65000 395.64051
11.75000 376.22563
11.85000 379.46716
11.95000 379.28666
12.05000 343.78501
12.15000 342.01599
12.25000 343.64680
12.35000 358.67243
12.45000 341.89086
12.55000 334.37666
12.65000 316.72914
12.75000 316.20003
12.85000 305.80966
12.95000 318.75744
13.05000 288.66186
13.15000 283.99542
13.25000 281.49781
13.35000 302.89066
13.45000 279.77832
13.55000 284.92438
13.65000 266.33897
13.75000 294.45760
13.85000 268.36876
13.95000 258.93736
14.05000 247.05577
14.15000 240.15062
14.25000 230.58548
14.35000 252.20582
14.45000 241.85893
14.55000 221.29687
14.65000 210.85788
14.75000 231.63948
14.85000 204.47015
14.95000 211.93369
15.05000 234.79320
15.15000 215.50326
15.25000 211.09518
15.35000 221.73367
15.45000 216.14961
15.55000 190.21316
15.65000 195.55650
15.75000 198.88777
15.85000 196.27925
15.95000 194.70467
16.05000 197.43444
16.15000 199.63611
16.25000 192.16194
16.35000 170.78392
16.45000 157.45029
16.55000 167.71332
16.65000 175.19236
16.75000 165.15093
16.85000 170.64587
16.95000 166.21359
17.05000 148.39280
17.15000 144.88552
17.25000 146.10898
17.35000 143.24507
17.45000 164.21316
17.55000 133.65570
17.65000 134.81501
17.75000 125.45579
17.85000 133.12672
17.95000 116.70200
18.05000 134.17155
18.15000 122.79786
18.25000 91.25543
18.35000 114.69790
18.45000 126.32976
18.55000 128.77568
18.65000 131.15223
18.75000 124.09523
18.85000 108.42076
18.95000 95.81373
19.05000 109.02675
19.15000 99.45425
19.25000 119.65247
19.35000 117.60300
19.45000 105.45329
19.55000 98.86776
19.65000 95.64568
19.75000 116.59296
19.85000 95.91834
19.95000 100.61734
