0.0 0.02972
0.05 0.03671
0.1 0.03725
0.15 0.03861
0.2 0.03439
0.25 0.03743
0.3 0.03177
0.35 0.03313
0.4 0.04019
0.45 0.03336
0.5 0.02945
0.55 0.03643
0.6 0.03512
0.65 0.03742
0.7 0.05451
0.75 0.0503
0.8 0.03835
0.85 0.04133
0.9 0.04667
0.95 0.03541
1.0 0.03528
1.05 0.0475
1.1 0.04283
1.15 0.04568
1.2 0.06067
1.25 0.05749
1.3 0.03688
1.35 0.03974
1.4 0.05094
1.45 0.04125
1.5 0.05221
1.55 0.04369
1.6 0.0617
1.65 0.0632
1.7 0.05553
1.75 0.05804
1.8 0.04895
1.85 0.04701
1.9 0.05087
1.95 0.05519
2.0 0.06275
2.05 0.06288
2.1 0.06231
2.15 0.06153
2.2 0.06723
2.25 0.0752
2.3 0.06278
2.35 0.07542
2.4 0.07735
2.45 0.08012
2.5 0.07043
2.55 0.08909
2.6 0.07494
2.65 0.08073
2.7 0.07642
2.75 0.08163
2.8 0.08964
2.85 0.08454
2.9 0.09673
2.95 0.10307
3.0 0.09339
3.05 0.1133
3.1 0.11355
3.15 0.11789
3.2 0.12975
3.25 0.131
3.3 0.13001
3.35 0.12682
3.4 0.11836
3.45 0.10959
3.5 0.12831
3.55 0.12128
3.6 0.12537
3.65 0.12868
3.7 0.13248
3.75 0.13304
3.8 0.13625
3.85 0.13718
3.9 0.14434
3.95 0.15002
4.0 0.15542
4.05 0.16414
4.1 0.16241
4.15 0.17216
4.2 0.1677
4.25 0.16326
4.3 0.16121
4.35 0.1608
4.4 0.16046
4.45 0.14015
4.5 0.14996
4.55 0.15533
4.6 0.15449
4.65 0.17806
4.7 0.19353
4.75 0.19197
4.8 0.20856
4.85 0.19923
4.9 0.21213
4.95 0.21456
5.0 0.20855
5.05 0.20509
5.1 0.21238
5.15 0.20482
5.2 0.2081
5.25 0.21361
5.3 0.20208
5.35 0.20878
5.4 0.21184
5.45 0.21935
5.5 0.22095
5.55 0.23069
5.6 0.24799
5.65 0.24674
5.7 0.2472
5.75 0.24575
5.8 0.24459
5.85 0.23191
5.9 0.23283
5.95 0.23098
6.0 0.24101
6.05 0.2283
6.1 0.23498
6.15 0.22643
6.2 0.22317
6.25 0.22837
6.3 0.23184
6.35 0.24158
6.4 0.24503
6.45 0.24327
6.5 0.24956
6.55 0.23818
6.6 0.24107
6.65 0.25477
6.7 0.25163
6.75 0.24691
6.8 0.24087
6.85 0.22125
6.9 0.23371
6.95 0.21707
7.0 0.21372
7.05 0.22523
7.1 0.2157
7.15 0.22824
7.2 0.23617
7.25 0.24312
7.3 0.24988
7.35 0.25107
7.4 0.2503
7.45 0.23765
7.5 0.2339
7.55 0.24617
7.6 0.2429
7.65 0.21917
7.7 0.22807
7.75 0.22522
7.8 0.22913
7.85 0.22748
7.9 0.23916
7.95 0.23244
8.0 0.23663
8.05 0.22439
8.1 0.24056
8.15 0.22896
8.2 0.25071
8.25 0.23794
8.3 0.2482
8.35 0.25329
8.4 0.24876
8.45 0.24813
8.5 0.24348
8.55 0.23814
8.6 0.24905
8.65 0.23824
8.7 0.23349
8.75 0.25556
8.8 0.25343
8.85 0.25101
8.9 0.25558
8.95 0.25301
9.0 0.25163
9.05 0.26522
9.1 0.26039
9.15 0.26152
9.2 0.26035
9.25 0.27107
9.3 0.2742
9.35 0.27355
9.4 0.27079
9.45 0.27629
9.5 0.2667
9.55 0.27574
9.6 0.2746
9.65 0.27122
9.7 0.27182
9.75 0.28353
9.8 0.27085
9.85 0.26455
9.9 0.28431
9.95 0.27899
10.0 0.29772
10.05 0.29613
10.1 0.30431
10.15 0.30035
10.2 0.31931
10.25 0.3038
10.3 0.30541
10.35 0.31542
10.4 0.3034
10.45 0.31215
10.5 0.30109
10.55 0.31356
10.6 0.31615
10.65 0.30268
10.7 0.31352
10.75 0.29725
10.8 0.31884
10.85 0.307
10.9 0.31996
10.95 0.32915
11.0 0.3308
11.05 0.33584
11.1 0.33119
11.15 0.33333
11.2 0.33398
11.25 0.3472
11.3 0.35054
11.35 0.33221
11.4 0.34289
11.45 0.34582
11.5 0.35429
11.55 0.3506
11.6 0.35286
11.65 0.36167
11.7 0.36396
11.75 0.35904
11.8 0.35594
11.85 0.34526
11.9 0.36552
11.95 0.36108
12.0 0.3563
