0.05000 -1333.67406 -51.36041 -39576.82934 862.05009 603.20354 654155.02687
0.15000 -3137.62165 23.11445 46308.24770 1005.67307 551.72201 491594.99325
0.25000 -4969.49896 40.28567 -3652.95750 1083.66903 623.61091 401634.53419
0.35000 -6319.73776 48.48626 684.36072 1213.36355 699.01462 371802.48579
0.45000 -7241.28589 57.13435 -3444.70858 1332.24000 759.94754 394117.97108
0.55000 -7711.02151 47.12715 1253.42656 1455.21255 881.52953 364668.75130
0.65000 -8127.91673 66.31285 -7559.91038 1520.38247 932.78667 393174.03166
0.75000 -8402.06130 25.47026 -600.67848 1515.94604 982.09602 330963.50596
0.85000 -8624.24280 23.74228 3163.51894 1497.08937 1022.53295 311264.07779
0.95000 -8802.17686 42.18609 11858.28367 1474.14476 1072.93161 318911.09249
1.05000 -8896.64504 62.31338 -626.69450 1427.94482 1123.77702 312341.86955
1.15000 -8927.74431 69.59330 -1181.73457 1344.79347 1138.22000 289285.45671
1.25000 -8981.28685 67.34885 -737.73917 1288.31164 1144.15793 278207.60958
1.35000 -8973.35426 60.71100 -3725.28771 1252.08285 1159.03303 255948.16432
1.45000 -8886.23634 39.23664 -4161.24580 1176.68759 1196.30059 270012.77722
1.55000 -8848.03995 27.17119 -3928.45087 1084.35584 1205.19298 238621.35351
1.65000 -8838.07875 31.11388 7058.80694 1007.28686 1218.16695 249820.28351
1.75000 -8776.12822 27.29688 2905.37403 936.42915 1209.83974 205685.73149
1.85000 -8707.51353 41.92142 2652.49321 854.41510 1203.11077 209150.31934
1.95000 -8655.68544 37.30345 2519.98394 797.44846 1196.95644 193699.15087
2.05000 -8589.37123 52.62778 -4566.21902 721.08624 1198.85239 187977.55543
2.15000 -8525.20304 38.80464 -2358.59989 689.44981 1177.26323 190902.76910
2.25000 -8431.70445 20.72496 4317.13738 645.35313 1158.04260 177602.62263
2.35000 -8345.40600 33.00531 2659.99996 612.96689 1138.89768 169535.30485
2.45000 -8265.16937 15.82010 -5245.76176 573.73200 1122.24418 169470.05260
2.55000 -8184.00764 37.27591 -204.99736 526.59433 1109.90438 173782.63286
2.65000 -8142.74179 45.54743 -316.92786 486.43980 1081.73602 158921.27101
2.75000 -8074.22693 47.31469 2009.22413 450.36734 1057.77529 156232.06742
2.85000 -8006.37695 53.51956 -3872.82955 415.55845 1028.21985 149264.26665
2.95000 -7940.19789 56.69379 2737.57430 384.40924 1000.25178 136370.31023
3.05000 -7886.73413 53.93263 2254.29114 362.91001 963.78736 148311.84799
3.15000 -7845.93997 55.23634 -476.98369 354.33757 943.74187 139145.62253
3.25000 -7816.15874 64.31230 -2684.19683 341.11881 909.69397 132903.08327
3.35000 -7790.59111 53.56213 -22.38756 348.55720 870.34217 112817.11639
3.45000 -7764.21874 57.46725 -920.56720 363.55094 835.54630 113544.35409
3.55000 -7730.10796 62.70889 -240.95080 392.14196 799.72811 113068.33863
3.65000 -7703.66052 46.03122 -861.90160 420.62545 759.98148 110383.91804
3.75000 -7645.47707 46.46766 -825.25494 441.93635 725.14771 101812.28995
3.85000 -7597.75338 45.75964 -358.05055 457.23128 680.72882 102753.09108
3.95000 -7562.39592 55.21090 2521.64076 479.54250 643.66381 95983.05040
4.05000 -7503.51729 46.48466 717.37636 491.32770 609.89191 103110.03228
4.15000 -7444.20250 48.61713 301.15415 501.27054 568.96072 95292.24161
4.25000 -7387.83734 40.71403 1460.56669 507.39632 541.81593 82865.96026
4.35000 -7330.00284 33.38670 212.32063 510.47487 501.73655 105703.51694
4.45000 -7270.02278 33.19248 844.27942 508.28155 465.91503 94820.61888
4.55000 -7227.80425 20.31396 314.88622 493.31543 439.73222 81046.39296
4.65000 -7171.83083 44.95785 -445.10981 484.46553 409.25564 81807.65958
4.75000 -7111.56797 37.04725 -435.17754 483.70165 379.13342 80109.91228
4.85000 -7049.08335 37.20013 88.12784 474.63526 351.93636 80405.51623
4.95000 -6986.18296 38.04185 672.10743 455.39675 331.58988 74777.91471
5.05000 -6922.86248 25.01737 -1112.14261 437.32128 309.11711 72139.97541
5.15000 -6855.13880 24.52535 -795.27814 411.33813 286.57242 63699.44259
5.25000 -6806.86348 29.03699 -785.57710 386.41604 270.01046 68727.83779
5.35000 -6752.29048 26.04875 -36.62889 365.09139 253.69240 67519.09035
5.45000 -6697.18585 22.46119 391.63435 340.36139 235.81393 61348.80971
5.55000 -6649.01999 23.67349 790.19967 318.00852 221.99080 57766.75082
5.65000 -6595.06067 22.72949 564.85166 299.35722 206.90819 58491.47029
5.75000 -6537.53551 23.49379 -553.04568 278.73972 196.55414 72020.54451
5.85000 -6490.91072 19.53503 -828.74007 256.93820 185.89361 52047.79033
5.95000 -6439.00320 21.18696 148.28678 236.61822 174.56660 53488.74972
6.05000 -6387.68586 22.42871 -500.12037 220.43743 166.26860 51350.60631
6.15000 -6338.58981 24.51367 -888.06944 208.69319 156.66451 64996.13241
6.25000 -6290.17540 21.82310 50.05366 193.31019 151.91457 46570.43226
6.35000 -6240.13554 20.27705 515.76837 178.23514 143.89965 43009.00171
6.45000 -6184.83599 23.06383 1444.21045 171.55439 138.72092 57312.85274
6.55000 -6135.91412 18.28894 257.57482 165.41299 136.25246 65249.81751
6.65000 -6081.77275 16.29496 -202.90681 157.36733 129.92276 35940.23611
6.75000 -6027.78162 22.88382 -599.86201 156.63526 122.33224 41457.32830
6.85000 -5976.65493 24.55176 205.11846 146.06573 116.57479 38137.41756
6.95000 -5931.41996 22.41675 -1568.73442 134.92474 115.13659 57853.44966
7.05000 -5878.97464 18.34319 1287.40702 131.39855 109.30778 50156.77158
7.15000 -5829.36030 21.30805 -659.11347 125.45233 106.30077 47104.99330
7.25000 -5779.13756 22.03780 -328.26703 120.77203 103.37005 35613.54737
7.35000 -5735.18711 23.24191 -1897.01814 116.98379 101.50169 109533.46495
7.45000 -5686.82224 21.25971 -381.88753 109.80001 96.77052 31444.58391
7.55000 -5635.63661 23.08944 -515.73678 106.45366 95.34186 32779.53717
7.65000 -5585.09270 22.50816 -471.68140 99.12406 92.20310 45321.56220
7.75000 -5534.51986 23.08884 -390.95321 99.36192 88.61039 27599.40780
7.85000 -5483.56063 21.07000 729.10077 98.88090 87.22091 39144.22941
7.95000 -5432.95885 20.99994 543.71014 98.09746 85.57791 31502.01220
8.05000 -5384.86128 20.58643 -2219.86621 96.26503 84.12003 84822.84173
8.15000 -5341.44039 20.47488 -619.27102 90.24333 81.92789 24933.57429
8.25000 -5293.42475 20.64006 -339.73543 90.11003 78.60513 26860.23060
8.35000 -5244.09880 19.74400 271.97276 85.63126 77.04031 24496.19991
8.45000 -5195.83408 19.87202 -371.63588 82.82427 74.91718 25817.87184
8.55000 -5151.07870 21.16908 -254.59986 83.35157 75.17707 25996.21371
8.65000 -5107.08836 17.67564 -223.78748 83.50063 73.65445 20460.73444
8.75000 -5065.00428 17.59580 233.32566 82.38664 72.39725 21242.05024
8.85000 -5021.01202 18.26153 -227.36807 87.38126 70.97475 20698.04575
8.95000 -4977.82191 18.15311 -81.25190 86.09580 71.82974 21835.86371
9.05000 -4934.86694 18.75102 -514.76331 85.07622 70.48473 22816.40352
9.15000 -4897.22730 16.37175 -431.59271 86.99873 68.14452 19217.55109
9.25000 -4856.27553 17.54064 21.83025 89.17544 68.51201 18922.33545
9.35000 -4818.57371 14.84710 201.21879 90.20564 66.65528 30338.50854
9.45000 -4774.44733 16.80321 -502.57339 87.84233 63.98654 19289.52089
9.55000 -4735.78383 16.16361 80.08492 86.80835 62.17008 19436.53577
9.65000 -4691.69169 16.30600 -352.10426 80.34167 61.16500 19033.42409
9.75000 -4655.59400 14.90604 639.50528 79.78098 59.01232 17561.54656
9.85000 -4616.19388 15.29132 -290.00377 75.77648 58.39206 17366.69248
9.95000 -4577.39176 15.07279 41.44887 72.78542 58.00391 14958.32445
10.05000 -4537.69086 14.94364 -86.65375 71.98433 56.81337 16554.19612
10.15000 -4499.89327 15.80394 -202.74894 70.48445 57.09047 18585.45977
10.25000 -4467.88218 13.54169 -300.55477 68.96118 56.75048 15324.46518
10.35000 -4431.79271 13.95248 -582.47811 67.67528 57.08447 14577.10150
10.45000 -4396.14301 13.76250 282.90849 69.14727 55.83451 13589.11976
10.55000 -4358.47762 12.97419 51.70398 67.13498 56.36242 15595.24034
10.65000 -4321.72463 12.42181 -219.28385 66.99065 54.31659 11889.06731
10.75000 -4288.89328 14.25911 -15.67857 69.06171 53.96385 15271.46342
10.85000 -4252.17521 12.13872 -82.67914 69.80025 54.82882 12778.11820
10.95000 -4215.13989 13.22001 -204.42651 67.62173 52.03132 12655.86582
11.05000 -4177.43245 13.46375 146.66946 61.19087 51.41342 14492.48738
11.15000 -4145.94501 10.93038 -236.62785 62.93349 49.42009 10738.09771
11.25000 -4111.99386 12.19918 -248.96164 62.81226 50.64655 13900.66661
11.35000 -4083.82173 13.02048 -6.48359 63.93919 48.77604 13371.85486
11.45000 -4054.52481 11.98551 -78.88481 63.06950 48.51707 9863.89583
11.55000 -4024.89076 11.41285 -276.29659 64.17817 49.07884 10937.71432
11.65000 -3994.93762 11.26990 -312.91587 63.40614 47.00535 9637.69140
11.75000 -3966.10387 12.45546 -168.19007 64.24165 45.37538 9042.19987
11.85000 -3934.61018 11.09538 5.15616 62.68292 44.49337 10375.49462
11.95000 -3909.44132 11.34150 50.73374 62.24550 45.18754 10363.23175
12.05000 -3883.40597 11.74180 -103.97812 62.59565 44.71798 12595.99162
12.15000 -3852.84769 11.29766 -308.62699 61.55176 44.07719 8770.82809
12.25000 -3825.08488 11.65015 3.02062 62.97458 42.20893 10817.29827
12.35000 -3797.15855 10.47838 61.30644 61.69256 41.01122 10020.81530
12.45000 -3769.88030 9.44275 114.79761 61.57174 40.52540 8369.16573
12.55000 -3739.42844 10.22237 -134.59576 61.82646 38.19353 9627.51780
12.65000 -3713.25188 10.12538 -86.64796 59.65330 38.66780 8577.97244
12.75000 -3685.30629 10.37212 -325.69394 57.39301 38.07442 8329.24783
12.85000 -3658.85872 9.12507 276.54052 55.78690 37.60101 8626.78082
12.95000 -3635.76083 10.10641 -240.77438 54.10766 36.52700 6975.61994
13.05000 -3605.95130 8.70641 40.64747 53.26370 37.77874 7606.01916
13.15000 -3581.23140 8.56519 54.29370 51.32860 36.73411 7277.94129
13.25000 -3555.71415 9.58700 22.92038 50.68800 35.92942 7853.78415
13.35000 -3532.54838 8.45699 42.66386 48.74732 34.98821 6133.46084
13.45000 -3508.63422 8.91197 10.33700 47.70550 35.09019 6491.61832
13.55000 -3484.95160 8.26977 342.41472 49.35027 35.03591 6220.10794
13.65000 -3458.72058 8.92370 -59.52124 46.06927 33.52916 7900.63172
13.75000 -3435.19336 8.93479 -89.46117 44.93960 34.41854 5864.76004
13.85000 -3409.83115 7.52597 181.22709 41.83693 32.32461 6587.15577
13.95000 -3387.78643 8.69721 366.84819 39.56269 33.49939 7545.45656
14.05000 -3362.56965 7.06834 128.61312 38.30787 33.37547 6117.38029
14.15000 -3340.55709 6.30525 -45.37769 37.94492 32.81964 5310.34506
14.25000 -3316.05525 7.49682 241.00362 36.92852 30.97319 6884.32577
14.35000 -3293.92232 6.54860 -215.70499 36.13462 30.14780 5692.78662
14.45000 -3267.96322 8.46430 -75.45280 34.47813 30.68054 5529.54547
14.55000 -3245.09901 6.97272 122.30089 34.05557 31.36366 5173.13917
14.65000 -3223.61326 6.57697 63.64164 33.65505 31.56701 4571.97944
14.75000 -3200.69923 6.78079 -118.29824 32.76047 31.88251 4383.37256
14.85000 -3177.86817 7.43475 37.29042 33.31946 30.30923 4996.86603
14.95000 -3155.87067 7.26087 77.92154 32.90079 30.33479 4314.16644
15.05000 -3131.87649 6.17805 -44.71029 31.45275 29.18612 4498.02868
15.15000 -3110.96125 6.79177 56.91279 30.00575 30.05948 3959.45062
15.25000 -3088.20895 6.92809 148.82100 30.52904 29.65625 4298.59213
15.35000 -3063.84097 5.58279 -194.54791 32.01930 29.84326 4425.83224
15.45000 -3044.62634 7.24114 144.30416 30.13776 29.80898 5174.52590
15.55000 -3024.13287 7.03978 341.39334 30.58816 29.55762 5304.21563
15.65000 -3003.78977 7.66012 -262.61346 31.54868 29.44465 5228.60796
15.75000 -2982.55955 7.40713 101.15979 31.07500 27.76241 4515.43090
15.85000 -2964.67956 5.94534 30.99314 29.47467 28.70985 3565.60279
15.95000 -2942.93187 5.88443 -153.52861 30.84674 27.67854 4091.36045
16.05000 -2924.42880 4.45260 -26.55198 29.80781 25.96997 3308.60277
16.15000 -2903.63880 5.36522 -68.40023 30.97205 26.74014 3026.09121
16.25000 -2884.13176 6.77366 73.75476 27.59803 26.88181 3249.83035
16.35000 -2867.31900 4.79924 -284.49275 28.01045 25.38046 4809.56297
16.45000 -2851.52723 7.01753 141.77944 28.60707 25.83175 2856.20001
16.55000 -2832.39399 6.56466 -17.60772 29.41604 26.75596 3985.60880
16.65000 -2811.64959 6.08670 2.76521 29.87125 26.08817 3511.29950
16.75000 -2793.64772 6.47907 -139.29380 28.22217 26.21375 3857.25991
16.85000 -2773.70225 5.73127 -21.39270 27.98074 26.97460 3331.94661
16.95000 -2756.67669 5.92717 -144.17987 27.25772 27.20021 3852.11092
17.05000 -2739.18613 4.49647 9.71354 26.88624 27.45878 3163.24404
17.15000 -2722.83701 6.24406 -6.78145 27.87790 26.60217 2599.65466
17.25000 -2705.86795 5.01977 -78.40127 26.08205 24.54895 2820.11995
17.35000 -2690.75548 5.00546 -139.45010 28.36399 23.91279 2750.04959
17.45000 -2673.63404 5.81914 5.43196 26.86135 25.03097 3464.52519
17.55000 -2657.55930 3.78279 -124.90804 27.71341 25.82994 2812.05956
17.65000 -2640.22289 6.06703 -35.49644 27.84968 25.34305 2427.73452
17.75000 -2621.70220 5.92552 -110.72914 25.99115 24.83744 2701.51265
17.85000 -2606.01433 4.05927 87.95215 26.45293 25.24837 2321.99305
17.95000 -2592.42048 4.01058 62.03439 24.10852 24.83127 3149.07466
18.05000 -2576.97866 4.79791 49.82368 23.91258 24.97946 2064.41818
18.15000 -2562.23472 4.51184 8.15670 24.54760 24.09845 2062.97253
18.25000 -2545.31053 4.35740 -100.23345 24.47517 25.04022 2963.03715
18.35000 -2530.85086 4.14799 12.41189 23.98248 24.85081 2003.52591
18.45000 -2516.17346 4.30615 87.35989 24.82604 23.13505 2771.34202
18.55000 -2501.85410 3.22539 163.30871 26.71976 25.59021 4547.74855
18.65000 -2486.56235 4.44270 90.07699 25.63797 23.97038 2099.78128
18.75000 -2471.84108 5.38554 -42.27511 27.79186 24.15589 2583.77202
18.85000 -2456.73648 2.79843 38.26628 26.51621 23.46752 1925.52596
18.95000 -2442.38075 4.00210 51.18328 25.87325 23.22452 1548.93480
19.05000 -2428.97436 5.99324 -0.55764 25.75966 21.86947 1850.54336
19.15000 -2411.64303 5.21864 -52.82560 25.51858 21.57643 1712.90728
19.25000 -2395.66573 3.77346 47.23931 23.14354 21.83824 2001.29535
19.35000 -2380.79858 5.12341 33.73671 24.02316 22.66174 1737.46017
19.45000 -2368.31475 5.22453 -246.59827 23.16108 22.78924 2826.42165
19.55000 -2353.50590 7.81362 38.64194 22.41941 22.07088 2098.72576
19.65000 -2338.18321 8.05046 -31.31241 22.36940 22.41602 1573.54273
19.75000 -2321.92990 16.31335 -45.75399 21.09793 22.88381 1298.59095
19.85000 -2310.08305 16.89655 102.02186 21.29491 23.00167 1638.92078
19.95000 -2296.40570 19.42563 -40.42065 22.24716 22.73482 1564.63433
