0.05000 -119483.05399 486.24997 -45686.34098 195081.94022 256091.46461 229097.73148
0.15000 -159852.36090 -1274.68383 1667.60706 87406.96616 90203.28762 153498.37159
0.25000 -106508.45142 308.25160 1806.31709 43407.88680 31311.84518 87841.80169
0.35000 -77476.47237 94.81854 1343.86634 26892.50068 15914.48655 61501.78171
0.45000 -61901.40857 39.98226 374.18927 19799.69549 9949.50485 47183.76699
0.55000 -51048.21309 167.83314 703.11841 15869.89874 7380.52456 38001.03956
0.65000 -43435.92953 45.30099 830.35185 13482.20399 5219.24263 31742.41070
0.75000 -37684.65281 86.19109 261.13509 10452.56923 4256.36277 26804.80403
0.85000 -33135.53941 -35.68941 360.68882 9225.08621 4336.99502 23460.25213
0.95000 -29805.53309 10.39658 -290.71560 7742.34848 2654.04335 20596.84885
1.05000 -27014.19526 46.10055 239.14280 6951.66405 2393.24952 18437.53031
1.15000 -24774.61055 34.54066 287.46913 6026.63152 2036.33222 16368.67791
1.25000 -22687.28978 36.87671 241.68152 5563.49050 2386.58978 14998.26287
1.35000 -21042.43952 9.15265 23.29925 5622.59533 1913.91957 13642.04740
1.45000 -19654.76023 -9.48384 426.96479 4990.38721 2989.15651 12755.98469
1.55000 -18417.72879 -12.77437 -54.16732 4017.03779 1763.45249 11529.87593
1.65000 -17234.58474 22.39174 173.72869 3817.52494 1544.36554 10830.92378
1.75000 -16279.43621 -5.39518 83.24585 3576.50391 2198.64662 10042.41384
1.85000 -15322.76900 27.36488 34.90625 3272.09362 1293.91904 9458.77050
1.95000 -14599.65312 -0.35466 288.87011 3033.81235 1268.40073 8869.31568
2.05000 -13930.61120 -4.71783 226.88978 2721.03369 1345.42109 8429.06407
2.15000 -13262.62441 -13.41701 144.65616 2594.43393 1265.67317 7908.84585
2.25000 -12626.27036 -9.70504 -109.76901 2400.96604 1026.34707 7567.82251
2.35000 -12168.21380 15.23667 -30.40144 2155.10518 1224.29120 7093.74220
2.45000 -11680.14786 -7.52377 67.53862 2357.53003 1183.33383 6801.38599
2.55000 -11250.31530 13.96298 85.30627 2175.30216 1753.25623 6711.30449
2.65000 -10884.98251 10.87123 96.78090 1740.55109 1321.91929 6075.65537
2.75000 -10513.26448 -13.05918 77.15680 1672.44620 1289.95541 5855.44190
2.85000 -10134.54066 -2.78970 -41.44942 1674.32526 1079.95017 5740.19687
2.95000 -9894.36490 -1.85958 37.31960 1529.75574 912.61351 5297.97829
3.05000 -9578.79794 -12.68662 179.06195 1261.60397 944.36658 5053.12666
3.15000 -9346.88092 2.85883 37.30940 1239.42922 789.97422 4862.96737
3.25000 -9091.17244 10.15543 33.51296 1630.75559 1258.42070 4807.48979
3.35000 -8896.18891 -2.13396 99.14475 1073.60510 997.79028 4359.27191
3.45000 -8690.68876 -7.48966 104.52747 812.19542 698.74440 4142.97556
3.55000 -8537.97907 -18.15291 32.70457 760.84700 1056.65380 3918.12879
3.65000 -8359.28046 -7.55327 0.11855 727.51088 736.94513 3728.03705
3.75000 -8211.81281 -4.25683 57.08894 652.77625 685.49741 3576.72324
3.85000 -8084.23334 -2.60492 90.89463 1758.74327 803.47701 3402.80446
3.95000 -7928.43982 23.92096 -45.23143 521.29908 774.20258 3202.82505
4.05000 -7833.80004 -15.49437 2.30810 1465.60512 1241.89925 3045.99660
4.15000 -7712.80883 -14.08936 -31.53401 482.08460 632.73777 2856.23089
4.25000 -7601.81284 -3.50527 16.73247 751.15416 882.65221 2783.59898
4.35000 -7488.42857 -3.39632 -13.12982 754.58050 585.73588 2636.79456
4.45000 -7422.81719 0.72526 -23.48453 930.97566 1109.53249 2577.27201
4.55000 -7328.36334 -8.03616 19.17862 758.63099 864.63861 2510.07675
4.65000 -7249.20674 -1.85473 64.32275 484.85857 631.38756 2331.49410
4.75000 -7207.78946 7.85737 50.89479 2178.47416 1410.77709 2505.64362
4.85000 -7129.48227 -6.94226 59.72992 485.38756 575.27492 2235.68841
4.95000 -7087.53433 -5.54563 54.70524 485.60440 504.72227 2162.04480
5.05000 -7038.21174 3.74091 30.99810 631.64840 1492.08668 2168.32443
5.15000 -6998.42339 -11.26033 -5.58478 640.15145 779.85687 2074.67294
5.25000 -6962.65171 9.80475 27.83961 564.13451 985.22717 2048.48458
5.35000 -6921.00241 0.04120 5.98474 517.81874 418.92197 1958.80431
5.45000 -6877.03806 9.06245 -38.12233 485.79396 410.79627 1929.31299
5.55000 -6822.23012 -7.67181 21.36086 563.46218 586.97318 1904.04840
5.65000 -6733.98579 -0.67248 -33.03895 4356.23605 898.07106 2821.99563
5.75000 -6732.41353 10.65424 27.87121 595.14175 530.66100 1888.59717
5.85000 -6679.72517 10.95779 14.49958 837.85207 756.66309 1841.51573
5.95000 -6632.06206 2.20214 0.27660 535.43354 435.08350 1709.69491
6.05000 -6563.45330 15.39094 9.54970 519.62843 519.86822 1642.14877
6.15000 -6516.01555 3.17359 -21.36901 500.74990 544.84208 1654.17946
6.25000 -6463.77421 5.75815 30.87525 494.11832 380.99222 1552.80659
6.35000 -6423.62505 29.29529 -59.98383 1374.86011 1751.66899 1757.24965
6.45000 -6330.99330 5.88555 -7.29395 425.21970 321.76091 1467.17532
6.55000 -6270.86527 2.36685 4.15098 709.94699 1122.25694 1499.96358
6.65000 -6201.81657 -4.30699 -20.71048 556.39672 342.06444 1438.36141
6.75000 -6135.55039 11.07176 -3.53806 416.42282 357.38953 1375.00410
6.85000 -6080.54756 -4.02927 24.72646 439.58512 397.58888 1305.42682
6.95000 -6017.27236 9.19062 31.61212 380.53516 397.79072 1305.51338
7.05000 -5955.21174 2.09948 -0.17012 319.61576 273.73190 1266.99475
7.15000 -5901.17867 2.95809 17.38080 333.47777 237.68555 1228.09193
7.25000 -5839.48208 19.49253 -25.45584 344.38384 707.40664 1430.70766
7.35000 -5784.40506 5.02075 -15.11099 315.37154 418.05242 1164.74098
7.45000 -5731.80011 0.90932 -19.42059 347.35752 237.88538 1122.06225
7.55000 -5672.79269 7.65562 -23.66886 422.01566 248.10973 1108.74353
7.65000 -5621.57348 2.24000 -7.47212 284.21503 263.53392 1084.95066
7.75000 -5555.96804 10.10276 -25.86945 269.00262 239.58873 1035.39075
7.85000 -5492.16143 7.90561 -4.51892 249.53625 198.44230 1013.07196
7.95000 -5437.70081 8.82293 11.20542 268.23883 241.10656 986.32774
8.05000 -5387.36031 5.47381 11.80791 247.50854 185.84132 975.08085
8.15000 -5336.66787 10.08689 5.06291 353.46595 204.31748 944.61024
8.25000 -5281.40253 4.55035 33.44341 427.05917 287.29884 965.89834
8.35000 -5231.69638 4.57768 27.18024 370.18083 192.64153 900.47063
8.45000 -5182.13632 8.18643 26.65574 237.61861 154.50270 899.23836
8.55000 -5132.04630 6.67156 63.87836 206.83915 157.33639 862.67812
8.65000 -5081.07997 11.30725 59.85836 319.54150 204.18324 860.63689
8.75000 -5038.51972 2.05404 46.75491 249.41044 208.12733 813.44364
8.85000 -4992.49000 5.49062 26.02892 220.00165 155.40691 806.75312
8.95000 -4946.50759 -0.67066 60.87030 292.19036 261.11943 804.54089
9.05000 -4907.72938 2.07182 31.63719 176.56790 150.30053 766.59602
9.15000 -4858.50476 7.39769 58.72096 232.23145 201.56349 767.55208
9.25000 -4814.33806 1.76847 55.53494 193.14932 216.11966 746.64834
9.35000 -4775.12125 3.74376 49.66947 177.34852 157.49417 721.90787
9.45000 -4733.25509 -0.33988 66.51462 243.94558 268.94693 736.99545
9.55000 -4685.40434 6.38015 44.93692 288.38331 169.94247 701.05790
9.65000 -4649.76427 2.08342 40.63754 433.50650 210.75040 767.28059
9.75000 -4615.68188 -2.14413 42.33173 202.98205 154.81200 678.98396
9.85000 -4576.52032 7.73824 42.80106 204.90914 257.60163 654.17770
9.95000 -4529.36750 7.17884 34.77998 201.97546 131.78806 637.31693
10.05000 -4482.49039 7.37270 40.45404 176.60985 228.94373 628.02854
10.15000 -4445.90652 1.73028 15.52366 157.14031 152.19414 609.55590
10.25000 -4403.74861 4.21548 46.87072 392.54928 189.99624 766.82847
10.35000 -4355.13499 -6.44841 39.18483 961.59122 550.85917 851.09412
10.45000 -4334.25758 7.63649 30.38466 340.61008 1277.00293 1556.72981
10.55000 -4303.20320 -1.57315 18.18867 195.19853 292.90536 575.85407
10.65000 -4258.81152 6.88681 9.33962 209.16007 117.81523 550.48285
10.75000 -4229.79320 4.37269 17.20849 182.86358 112.23063 555.21596
10.85000 -4197.12479 3.42813 -3.75023 177.96236 146.43241 530.90389
10.95000 -4159.15140 10.33781 4.75542 173.16332 235.46650 527.45485
11.05000 -4130.02155 1.93394 6.59896 151.97648 176.92965 513.95964
11.15000 -4096.09735 4.28163 9.67044 115.17706 82.61448 504.12832
11.25000 -4069.35538 1.71882 -5.14397 501.31076 306.36192 525.26518
11.35000 -4028.41969 2.59124 23.17450 162.58912 207.90145 492.46905
11.45000 -4002.10762 -0.84924 16.44051 139.87348 135.28455 480.59372
11.55000 -3963.19527 5.01918 -11.62687 128.63795 114.95458 490.85484
11.65000 -3932.30120 1.49138 10.73319 443.00495 195.55953 485.99447
11.75000 -3907.68421 5.05668 3.60560 120.54841 123.40352 444.02256
11.85000 -3882.50316 5.17062 -3.60966 121.40299 118.09803 436.85051
11.95000 -3849.31035 6.47638 11.09958 169.41535 96.95157 438.31439
12.05000 -3823.43561 3.62303 4.99068 142.04267 119.68861 436.83538
12.15000 -3790.24412 4.12977 -11.90720 130.70458 124.48658 428.94864
12.25000 -3757.58233 3.60413 2.27357 153.20366 125.20335 420.37324
12.35000 -3729.82737 3.59609 22.40088 115.24326 109.26625 408.87808
12.45000 -3699.36174 8.98114 20.12178 230.02376 118.76605 417.79725
12.55000 -3678.52896 7.37268 18.37233 117.23219 105.59756 383.28448
12.65000 -3645.90592 6.64148 12.23881 129.23292 77.43710 382.53180
12.75000 -3621.72413 0.54537 10.71409 106.06844 175.76623 448.37497
12.85000 -3599.80270 -1.32465 18.95382 98.22117 96.33241 363.72227
12.95000 -3574.33815 2.66334 16.50937 112.96929 121.09962 360.54994
13.05000 -3546.11166 0.15300 16.00452 105.79103 114.86493 346.92657
13.15000 -3519.28169 5.63759 33.12697 155.74197 133.22664 344.59673
13.25000 -3498.54001 1.59970 8.07992 91.52447 97.03412 325.54286
13.35000 -3467.48476 -0.73251 19.41451 132.40588 103.52971 334.29312
13.45000 -3435.81559 4.90271 27.15093 146.81759 145.52168 337.26383
13.55000 -3408.24927 -11.23746 10.32614 208.21010 394.09011 313.89194
13.65000 -3385.95566 8.35552 15.01871 125.84995 109.14259 330.35529
13.75000 -3356.29197 1.99908 -2.58086 97.39666 61.38209 307.03042
13.85000 -3328.96352 4.97954 28.71399 153.43267 159.62229 322.38541
13.95000 -3307.61303 6.21861 23.86530 96.88078 125.79979 305.05472
14.05000 -3284.23740 -2.00727 24.37479 123.12085 253.90425 406.49870
14.15000 -3266.56959 0.92125 14.82069 114.69084 86.58224 286.45506
14.25000 -3237.46201 0.98171 20.87547 60.94655 96.91532 269.64692
14.35000 -3211.62880 4.07483 9.55939 73.14139 69.43545 330.48582
14.45000 -3190.39034 8.74598 23.84523 73.39172 106.82010 251.68911
14.55000 -3162.03065 0.22779 14.05639 76.65705 127.38000 270.43800
14.65000 -3139.30196 1.36658 25.41378 63.60384 67.61033 250.08460
14.75000 -3125.29346 5.61068 20.90201 70.31103 71.72292 249.96845
14.85000 -3101.41680 5.59292 27.42310 203.81864 72.88163 267.34962
14.95000 -3073.68257 3.60410 20.01676 56.57672 47.56451 234.78004
15.05000 -3050.96974 2.60571 22.50513 61.17161 87.16470 231.49847
15.15000 -3029.64949 6.02529 31.19999 56.05268 53.27579 223.47105
15.25000 -3007.79290 5.71812 20.35699 64.13562 64.54626 217.92869
15.35000 -2978.11496 1.98195 41.57458 147.88815 52.17303 275.98322
15.45000 -2960.43651 0.02389 24.02419 79.02923 55.21005 212.92946
15.55000 -2939.13590 4.02622 25.42552 92.13660 135.84540 225.36181
15.65000 -2921.32611 2.32199 41.71733 59.50699 48.15180 219.56844
15.75000 -2898.51419 1.51788 7.11653 102.41002 86.35573 232.26443
15.85000 -2883.08043 3.91621 22.52291 74.62970 91.48467 206.01124
15.95000 -2864.14787 -8.02277 16.38350 63.86176 214.89421 206.71240
16.05000 -2839.92272 -3.33717 24.18252 152.81561 146.09207 234.92413
16.15000 -2824.05010 2.46000 12.82500 83.72606 69.38011 205.89788
16.25000 -2802.32906 -3.19467 8.71804 105.47997 75.99905 222.08418
16.35000 -2792.66925 0.69491 -5.90001 73.38653 49.00374 184.13399
16.45000 -2774.38823 5.43013 12.38277 65.07368 94.38061 184.83259
16.55000 -2751.86762 2.24197 11.59201 108.18304 70.14359 202.26417
16.65000 -2739.71430 -2.59147 7.60762 114.63068 69.09115 258.15866
16.75000 -2713.89305 0.06682 5.16004 54.18550 47.58632 172.65652
16.85000 -2703.23584 -0.21583 -2.82998 47.23146 50.26959 162.59590
16.95000 -2688.06554 -0.77569 19.73834 46.23028 39.88839 161.03903
17.05000 -2666.60764 -2.22332 18.55764 47.69354 49.75822 170.19777
17.15000 -2645.01543 -0.44906 16.32952 99.18647 45.67855 179.87296
17.25000 -2635.21541 0.85140 16.97622 53.63690 42.89966 174.38572
17.35000 -2610.63669 -1.14796 10.13839 222.18137 128.21138 186.55584
17.45000 -2605.63011 10.86004 6.88252 57.72763 118.23452 156.24639
17.55000 -2582.74244 -1.13997 16.00397 43.67145 37.08988 147.99737
17.65000 -2568.62339 5.97376 11.28571 64.77259 47.48261 148.90800
17.75000 -2552.42317 -0.88766 7.41774 44.69991 41.25279 142.24504
17.85000 -2532.25827 -0.52203 -0.68912 69.08998 41.82180 156.84352
17.95000 -2523.19070 -1.59197 8.32126 104.84470 112.69914 317.78466
18.05000 -2508.07536 10.22337 11.02462 43.87502 61.33075 137.31003
18.15000 -2489.47604 3.52727 12.65809 53.63039 57.59427 139.54922
18.25000 -2473.75155 0.88893 -7.83641 43.20996 33.64555 142.46610
18.35000 -2461.08879 1.72954 11.07987 43.25506 37.82497 140.95149
18.45000 -2447.47330 5.69886 -4.07244 50.47221 47.67307 134.32302
18.55000 -2428.89637 4.83090 -10.47789 39.47775 43.04469 134.96816
18.65000 -2415.72455 3.48315 5.88791 44.33384 29.84744 115.71052
18.75000 -2394.56706 9.27674 4.92427 103.46904 89.56489 133.81420
18.85000 -2389.92096 1.12064 7.46007 47.53086 59.36924 124.70421
18.95000 -2371.65098 -16.00360 0.70709 75.05592 263.02188 158.78831
19.05000 -2359.50595 2.81576 0.66669 39.47075 39.44951 131.93995
19.15000 -2354.64526 -5.87324 -9.36393 100.05331 110.20518 133.21738
19.25000 -2328.02087 2.17913 -2.52238 40.82183 35.37732 116.07394
19.35000 -2320.28859 5.31055 -2.29250 41.22526 36.80219 115.57998
19.45000 -2307.40057 7.15289 2.15101 45.34017 39.85237 113.13969
19.55000 -2295.00519 7.22828 1.94079 40.50765 53.18829 124.08189
19.65000 -2276.62347 6.82965 7.46973 40.50690 44.53015 115.96515
19.75000 -2261.88921 3.67694 -3.10016 69.34041 73.34682 128.88519
19.85000 -2251.36655 2.13888 7.34921 49.85298 45.52195 117.21399
19.95000 -2236.64389 2.68595 0.12323 40.49409 32.55206 127.88217
