0.1875 0.75218 17.8381 -0.54076 110.8961 107.51273 99.19691
0.5625 -1.08685 42.59395 0.26683 105.72312 96.63684 88.81703
0.9375 0.34273 62.69379 0.41976 97.70109 86.67848 80.32153
1.3125 -0.51408 77.16154 0.91559 89.70562 80.10293 74.76202
1.6875 0.69983 89.10143 -1.09951 82.38977 75.31083 70.46346
2.0625 0.26464 102.02997 -0.34915 75.73932 72.03459 67.11708
2.4375 0.13521 116.12952 0.39787 70.74332 68.56609 63.94663
2.8125 -0.39379 131.6862 0.02345 64.82542 64.45858 60.38699
3.1875 -0.27646 144.18667 -0.30353 61.01984 58.88731 56.28402
3.5625 -0.37705 154.57041 -0.54221 57.93951 52.49698 52.40039
3.9375 -0.66806 160.78891 0.17257 55.00103 47.77238 49.34704
4.3125 -0.50336 165.2954 0.14715 52.23826 45.60855 46.81447
4.6875 -0.30077 170.19918 0.08356 50.09789 43.20201 44.05502
5.0625 -0.36288 175.50353 0.23772 48.23945 40.78111 42.02404
5.4375 0.01638 178.79399 0.08188 46.3784 38.69793 40.68622
5.8125 0.51364 182.43138 0.7379 45.19285 37.18089 38.50345
6.1875 0.44935 185.53473 0.11968 43.83284 36.18485 36.80665
6.5625 0.28553 188.2627 -0.21831 42.06612 34.7237 35.68942
6.9375 0.45705 190.88334 -0.196 40.48584 33.5372 34.23025
7.3125 1.10634 193.53841 -0.65077 39.50313 32.65031 32.99023
7.6875 -0.12967 196.1021 -0.21422 38.14081 31.31739 31.67794
8.0625 0.79231 198.47648 0.03289 36.8545 30.39633 30.57468
8.4375 -0.09044 200.69237 0.01885 35.86796 29.2042 29.50191
8.8125 -0.14137 202.53915 0.56468 34.51575 27.96933 28.36585
9.1875 -0.79409 204.01535 0.93887 33.91445 27.07685 27.05148
9.5625 -0.7865 205.72631 0.6648 33.04334 26.19993 26.56417
9.9375 -0.92602 206.86321 0.99184 32.4195 25.43574 25.54388
10.3125 -0.4323 208.15345 0.68194 31.33685 24.68563 25.00393
10.6875 -0.0171 209.41358 0.88355 30.88027 23.53513 24.02957
11.0625 -0.19241 209.96752 0.00774 29.82293 22.54825 23.21806
11.4375 0.75768 210.58172 -0.20288 29.14171 21.59535 22.59714
11.8125 0.76601 210.14787 -0.47699 28.52943 21.05449 22.01344
12.1875 -0.0477 210.69577 -0.71828 27.31478 20.50367 20.83035
12.5625 0.24987 210.77924 -0.47413 26.8281 20.24769 20.30255
12.9375 -0.29525 211.15942 -0.43786 25.85064 20.42528 19.40641
13.3125 0.3946 211.46423 -0.43997 25.20133 19.60264 18.92084
13.6875 -0.66154 212.04944 -1.05367 24.30541 19.60731 17.95356
14.0625 -0.13218 212.56483 -0.73416 23.83593 18.49911 17.48675
14.4375 -0.48866 214.02053 -0.72953 22.58152 17.80197 17.22869
14.8125 -0.86942 213.95365 -0.41497 21.77514 17.0906 16.56962
15.1875 -0.89486 214.37445 -0.65157 21.10752 16.25342 15.84033
15.5625 -0.56493 213.52092 -0.29988 21.27987 16.27357 16.03809
15.9375 -0.62759 213.77724 -0.34128 20.34798 15.35783 15.22768
16.3125 -0.61096 213.97544 -0.37204 19.84834 14.8016 14.85329
16.6875 -0.57298 213.99539 -0.48465 19.79846 14.31822 14.39516
17.0625 -0.14804 213.75148 -0.46645 19.6495 14.2287 14.0556
17.4375 0.18392 213.53815 -0.20973 18.71662 13.82793 13.67678
17.8125 0.19554 213.4929 -0.48963 18.46877 12.89891 13.15758
18.1875 -0.09057 213.31204 -0.42394 18.09496 12.64276 12.37274
18.5625 0.59902 213.11646 -0.44171 17.89237 12.32975 12.08389
18.9375 -0.195 213.09138 -0.08087 16.78183 12.32706 12.25628
19.3125 0.10527 213.24397 0.27024 16.53954 11.89744 11.28038
19.6875 0.15269 212.33768 0.34352 16.2523 11.73913 11.29767
20.0625 -0.19534 212.54361 -0.3265 16.04971 11.52672 10.87854
20.4375 0.62633 212.18242 0.35433 15.33171 11.38599 10.78536
20.8125 0.21639 211.88668 0.04876 14.35455 10.77422 10.24472
21.1875 0.39211 211.75973 -0.5675 14.36445 10.70468 9.82234
21.5625 0.1389 211.06758 -0.1577 14.32172 10.54987 9.77014
21.9375 -0.15586 211.37816 -0.44432 13.56463 10.15855 9.42126
22.3125 -0.06196 211.29105 -0.34772 13.34268 9.64995 9.01771
22.6875 0.24357 211.57387 -0.56422 12.9372 9.12711 9.34039
23.0625 0.12374 210.89886 -0.37914 13.15657 9.22212 8.89544
23.4375 -0.05045 210.22318 0.20637 12.74896 8.43956 8.78172
23.8125 -0.11344 210.02984 0.21852 11.57685 8.67187 8.38188
24.1875 -0.76395 210.31936 -0.1392 11.50537 7.77287 8.56312
24.5625 -0.45183 209.46969 0.06546 11.68792 8.63298 8.3113
24.9375 -0.94416 208.58486 0.12788 11.56547 8.01703 8.53995
25.3125 -0.3255 209.19519 -0.66873 11.28617 7.62434 7.91258
25.6875 -0.27488 209.34701 -1.10154 11.16843 7.84246 7.6477
26.0625 0.18702 208.59156 -0.32125 10.31107 7.8005 7.8582
26.4375 0.79429 209.09784 -1.26 10.93797 7.18721 8.17181
26.8125 0.53994 207.97183 -1.76622 9.74262 6.87101 7.92694
27.1875 0.48135 207.69356 -1.58757 9.64834 6.69325 7.67979
27.5625 0.00418 207.78228 -1.41392 9.9247 6.24976 7.84865
27.9375 -0.24736 206.85655 -1.07906 9.84613 6.92967 8.10561
28.3125 -0.65153 205.78333 -0.33805 9.79279 6.27017 7.90492
28.6875 -0.82985 207.01592 0.51043 8.52828 5.7797 7.58963
29.0625 0.11009 205.52639 -0.49615 8.83733 6.23275 7.85255
29.4375 -1.15392 205.7423 0.30594 8.11666 5.73302 6.33726
29.8125 0.77417 206.0797 0.52677 8.61649 6.1428 7.20658
