0.120000 -1.951070
0.380000 2.318770
0.620000 0.073360
0.880000 -2.423290
1.120000 -2.296150
1.380000 -1.479730
1.620000 -1.676470
1.880000 -1.724710
2.120000 -1.925120
2.380000 -2.035740
2.620000 -2.125330
2.880000 -2.288280
3.120000 -2.259630
3.380000 -2.197010
3.620000 -2.241720
3.880000 -2.283910
4.120000 -2.306420
4.380000 -2.367460
4.620000 -2.369590
4.880000 -2.755290
5.120000 -2.706230
5.380000 -2.705130
5.620000 -2.888650
5.880000 2.829800
6.120000 3.133910
6.380000 -3.048740
6.620000 -1.661010
6.880000 -1.730340
7.120000 -0.908710
7.380000 -1.139530
7.620000 -1.888840
7.880000 -2.034500
8.120000 -2.458440
8.380000 -2.146740
8.620000 -2.506480
8.880000 -2.869160
9.120000 -2.939560
9.380000 2.702010
9.620000 1.726650
9.880000 -0.593790
10.120000 -0.886450
10.380000 -2.072450
10.620000 -1.563750
10.880000 -2.662000
11.120000 -1.151590
11.380000 -1.306890
11.620000 -2.256810
11.880000 -2.295640
12.120000 -1.881890
12.380000 -3.051330
12.620000 0.767720
12.880000 2.021520
13.120000 2.142420
13.380000 1.781340
13.620000 1.933060
13.880000 1.358830
14.120000 2.062810
14.380000 0.472530
14.620000 1.190570
14.880000 0.742820
