0.15 -0.35167 11.3386 -0.12998 130.33625 129.69217 100.17583
0.45 1.04497 23.69349 -0.07068 130.40904 127.47105 98.80627
0.75 -1.82987 36.91016 0.21648 131.28315 123.72162 96.94371
1.05 -0.99885 49.66019 -1.13122 132.76663 117.01444 93.12691
1.35 -0.82399 56.66374 -0.09948 134.03734 110.78627 91.17487
1.65 -0.03764 63.25263 0.61863 135.26133 104.97345 88.20462
1.95 -2.39689 67.69913 -0.41563 134.63413 101.51627 86.4157
2.25 -0.6066 73.29402 -0.32011 135.29748 98.53054 83.58105
2.55 -2.99673 77.91308 -0.8339 135.04239 95.84451 80.55868
2.85 -2.64377 78.30359 -0.33027 133.65119 91.17091 77.81963
3.15 0.24292 81.39917 -0.60233 132.22245 90.41549 75.00929
3.45 -2.32905 83.3726 -0.8558 130.01867 87.21471 72.54554
3.75 -2.61266 82.59521 -0.16975 128.03713 83.06207 70.0915
4.05 -1.56412 84.07376 -0.39602 125.30726 80.50174 67.23071
4.35 -2.27533 84.44956 -0.99877 122.24229 78.17761 65.00039
4.65 -3.32786 85.43323 0.16418 117.43608 75.51483 62.94291
4.95 -2.65413 86.2682 -0.5341 113.94871 73.64927 60.9137
5.25 -4.3042 87.07086 -0.65331 110.42056 71.89377 58.91558
5.55 -6.00033 87.35271 0.13953 106.21325 70.78724 57.4136
5.85 -3.81789 89.43572 0.45007 102.76993 69.3806 55.54675
6.15 -7.33273 91.12151 -0.82043 98.05411 68.76249 53.57955
6.45 -6.28402 94.04717 -0.10786 93.83918 69.195 51.92653
6.75 -7.01921 95.41275 -0.71982 88.72664 68.90005 49.95508
7.05 -7.86339 98.79118 -0.73095 85.64574 69.93786 48.7723
7.35 -7.56714 103.67512 0.27201 81.44308 70.80437 47.45713
7.65 -8.50632 106.93014 0.05383 77.99594 70.9154 45.26815
7.95 -6.96187 115.03807 -0.54542 74.01999 71.9677 43.24653
8.25 -8.45369 124.4692 0.37712 73.2 71.41594 41.33457
8.55 -10.03379 139.71079 -0.09121 69.33394 68.53539 39.73955
8.85 -9.10704 152.9566 0.53282 67.3829 64.50911 37.70742
9.15 -7.90988 160.06142 -0.72027 64.37126 61.24418 36.76955
9.45 -7.65766 166.5061 0.65269 61.11183 58.00395 34.94123
9.75 -6.04179 170.86628 1.02538 57.83305 54.40123 33.64322
10.05 -4.03611 174.54616 0.26396 53.39543 52.495 32.0311
10.35 -4.3859 176.76272 0.45439 50.85257 50.73195 31.03792
10.65 -2.0862 179.42989 1.03594 47.98597 49.13652 29.34953
10.95 -0.50093 180.36611 1.52343 45.39594 48.14842 28.55418
11.25 0.81442 181.59053 1.41359 43.28503 45.99501 26.93039
11.55 1.29595 181.41395 1.03652 41.82463 44.96313 25.99115
11.85 1.32706 182.5497 0.99699 39.79406 44.18982 24.52882
12.15 1.78188 184.33282 1.11002 38.5045 42.90041 23.67875
12.45 1.94487 185.78466 1.21114 36.92707 41.21089 22.76733
12.75 1.91885 189.51033 0.752 36.27546 37.46072 21.70493
13.05 1.34404 193.05225 1.49488 35.28872 32.88355 20.62064
13.35 2.12628 197.05184 0.18459 34.81987 27.56958 20.51087
13.65 3.21735 198.79626 0.92798 34.41675 23.45481 19.51484
13.95 1.7559 199.8397 0.57911 32.92502 22.06249 18.64242
14.25 2.80884 199.46901 0.21494 32.92463 20.70124 17.98648
14.55 2.12158 199.61544 -0.0755 32.33839 20.32976 17.86238
14.85 2.59982 198.87736 0.32035 31.23223 20.31276 17.55177
15.15 1.07938 199.28195 0.53627 29.59348 20.0539 17.29729
15.45 1.29707 198.38318 -0.1631 29.07862 20.35482 16.75892
15.75 1.28765 197.96637 0.03085 28.63555 19.85591 16.27285
16.05 0.21262 198.18537 -0.16606 27.40766 20.33179 16.01987
16.35 0.21649 197.58923 -0.16987 26.71295 20.13456 15.85163
16.65 -0.01693 197.69082 0.12079 24.87444 21.05845 15.32675
16.95 -0.4496 197.18403 0.11093 24.59305 20.64922 14.65844
17.25 -0.4145 197.40368 0.04076 24.36199 21.36855 14.32848
17.55 -0.18489 198.39123 0.17209 22.58037 20.66383 14.18192
17.85 -1.06679 198.33262 0.3292 22.39984 21.04814 13.97499
18.15 -0.96061 199.03076 0.33907 22.07667 20.68629 13.42624
18.45 -0.45851 200.15155 0.34359 21.76656 20.95206 13.44095
18.75 0.01418 201.59824 0.23091 20.84838 20.13476 12.93278
19.05 -0.47815 201.72657 0.90541 20.999 20.07331 13.17453
19.35 -0.61772 203.45963 0.22099 20.18666 18.23843 12.78333
19.65 -0.94876 204.52579 0.2385 19.96808 16.26675 12.86461
19.95 0.96483 205.1677 0.80958 19.06802 15.32856 12.70333
20.25 -0.00213 205.22834 0.59535 19.26271 14.45795 11.86241
20.55 0.19632 204.89355 0.00428 18.73346 13.02487 12.24816
20.85 0.85331 204.05385 0.84933 18.39954 12.83128 11.99806
21.15 0.56062 203.87925 0.85032 18.91792 13.09982 12.05286
21.45 0.23294 204.37594 1.07362 19.08159 12.79755 11.96789
21.75 0.68175 204.20856 0.91191 18.22579 13.10924 11.72592
22.05 1.00025 204.07699 1.12256 17.37493 13.22352 11.96177
22.35 1.9815 204.48273 0.73125 17.66413 13.68099 11.70077
22.65 1.47935 204.62299 0.25601 17.73185 13.44315 11.89362
22.95 1.4731 204.64982 0.37029 17.85931 13.77529 11.67209
23.25 2.04508 205.30087 0.1853 17.36193 12.87694 11.69229
23.55 1.11432 205.41521 0.04105 16.77553 12.65489 11.37776
23.85 0.97631 204.84448 0.54709 17.24422 12.20899 11.27084
24.15 0.95412 205.05835 0.32258 17.20595 11.35593 11.57977
24.45 1.16201 204.63677 -0.08682 16.35523 10.53877 11.25736
24.75 1.06102 203.82966 0.45957 16.50829 9.92894 11.17006
25.05 0.37316 202.88935 0.63485 16.29671 9.96968 10.49977
25.35 1.03254 202.62128 -0.03337 15.9781 9.61746 10.50771
25.65 0.66467 201.79073 0.02349 15.90048 9.21094 10.37988
25.95 0.756 200.98664 0.33158 15.58393 8.79997 10.13318
26.25 0.76953 200.43401 0.22296 15.46271 9.72084 9.76105
26.55 0.95904 199.85495 0.69951 14.76225 9.85751 9.45054
26.85 0.73211 199.4771 0.66459 15.08501 10.04393 9.61144
27.15 -0.41945 199.37619 0.13328 14.35484 9.72536 8.9546
27.45 -0.13521 199.50113 0.38594 13.95318 10.94092 8.59099
27.75 -0.05193 198.42351 0.42861 13.67163 11.1218 8.83912
28.05 -0.21669 199.57136 0.27703 12.95641 10.69463 7.75605
28.35 -0.82858 199.67196 -0.31657 12.68697 10.85304 6.91293
28.65 0.03314 199.00806 -0.33528 13.22835 11.15526 7.74001
28.95 -0.92829 200.28533 -0.09931 11.95512 9.77668 7.03893
29.25 -1.13147 198.52594 0.09797 12.70944 10.77981 7.04561
29.55 -0.8667 199.24639 -0.87327 12.87081 11.50889 7.39457
29.85 -1.55726 200.11673 -0.01775 12.01733 10.08656 6.47857
