0.2 0.02711 20.56221 -0.04071 69.17307 68.97024 65.91314
0.6 1.20636 43.51983 0.64137 66.87714 66.24343 63.28374
1.0 -0.00449 67.77625 0.33274 63.14458 62.48353 59.71129
1.4 0.81684 88.35387 -0.61765 59.95999 58.69241 55.98578
1.8 1.04921 105.78371 0.29831 56.12021 54.91036 53.44532
2.2 0.52125 119.33937 0.33319 53.67137 50.91575 50.47242
2.6 0.2569 130.94908 0.67319 50.89426 48.86979 47.51107
3.0 0.40096 140.78981 0.02891 48.67515 45.94474 45.1987
3.4 0.53117 150.66123 0.45706 45.94678 42.37943 41.99869
3.8 -0.10205 158.03624 0.69648 44.09692 39.45133 40.00185
4.2 -1.22992 165.24076 0.52405 41.89462 36.76005 37.92443
4.6 -1.4977 171.59877 -0.00752 39.77489 34.20329 35.80949
5.0 -1.15057 176.15505 0.32062 37.86966 32.64111 33.97789
5.4 -1.02429 181.27066 0.08626 36.18706 30.90218 32.43563
5.8 -0.3306 185.16382 0.09661 34.89094 29.30752 30.51234
6.2 -0.32509 188.4445 -0.22779 34.00614 27.50448 29.06966
6.6 -0.42038 190.40538 -0.27451 32.46724 26.2068 27.9109
7.0 -0.50639 193.06861 -0.04362 31.02976 25.16148 26.22335
7.4 -0.74138 195.36252 0.09697 29.24106 23.99849 24.90394
7.8 -0.26291 197.79391 0.00719 27.88066 22.59139 23.59927
8.2 0.24095 199.72468 -0.01602 26.68132 21.1229 22.48975
8.6 0.7942 201.32674 -0.62879 25.8493 20.5138 21.84688
9.0 0.83353 202.07382 -0.66023 24.79172 19.85704 20.67552
9.4 0.80425 203.40398 -0.9298 23.99822 19.04797 19.50263
9.8 0.90405 204.91183 -0.95929 22.55768 18.29159 18.56361
10.2 0.52223 205.05985 -0.48447 21.96012 17.58907 17.73056
10.6 0.05525 205.50533 0.22791 21.16864 15.98092 16.90372
11.0 -0.56099 206.542 0.53201 20.15551 15.56284 16.10569
11.4 -0.371 207.98844 -0.20843 19.50828 15.4708 15.47649
11.8 0.69335 208.73604 -0.40274 18.43427 14.46845 14.66566
12.2 0.46833 208.47537 -1.3276 17.77609 13.14503 14.0123
12.6 -0.22817 207.4546 -1.38733 17.6841 12.59932 13.55374
13.0 -0.96248 207.3267 -0.72319 17.20917 12.39622 13.07276
13.4 -1.33815 208.38869 -0.52996 16.25422 12.52662 12.71347
13.8 -0.66179 208.7487 -0.01342 15.33541 11.80951 11.69245
14.2 -0.40734 209.17394 -0.40672 14.51992 10.96582 11.23709
14.6 -0.27626 209.0377 0.04793 13.95911 10.69838 10.89669
15.0 -0.68258 208.42403 0.02652 13.52329 9.94085 10.37461
15.4 -1.23658 207.78731 0.19264 13.28292 9.39868 10.16868
15.8 -1.83546 207.71689 -0.48216 13.04105 9.46437 9.6569
16.2 -0.66122 208.26999 -1.04662 11.62984 9.25232 9.09355
16.6 0.05145 208.47863 -1.58336 11.54595 8.72735 8.88961
17.0 1.51565 208.17045 -1.40828 11.20079 8.71477 8.49345
17.4 1.50362 208.9561 -1.2251 10.47339 8.66456 8.12181
17.8 2.01779 209.56436 -0.83343 10.06309 8.28729 8.27457
18.2 1.20911 209.36644 -1.00307 10.5072 7.83172 7.89095
18.6 0.97878 208.83734 -0.84228 10.06947 7.62516 7.44568
19.0 -1.20674 208.36269 -1.07976 10.34111 7.48029 7.16425
19.4 -2.51709 208.47004 -1.23897 9.25686 7.44639 6.6731
19.8 -4.06959 208.50079 -1.49907 8.76279 5.87505 6.99426
