0.120000 1.809080
0.380000 1.919830
0.620000 1.894290
0.880000 1.883740
1.120000 1.879890
1.380000 1.874270
1.620000 1.921560
1.880000 1.912050
2.120000 1.903760
2.380000 1.867140
2.620000 1.897100
2.880000 1.872510
3.120000 1.854000
3.380000 1.855260
3.620000 1.870360
3.880000 1.869300
4.120000 1.864750
4.380000 1.858360
4.620000 1.852880
4.880000 1.875350
5.120000 1.886910
5.380000 1.874530
5.620000 1.911900
5.880000 1.925940
6.120000 1.944230
6.380000 1.967400
6.620000 2.080050
6.880000 2.215150
7.120000 2.569010
7.380000 -2.974150
7.620000 -2.497770
7.880000 -2.111420
8.120000 -2.180660
8.380000 -2.438640
8.620000 -2.444260
8.880000 -2.735640
9.120000 -2.832020
9.380000 -3.031230
9.620000 3.014880
9.880000 2.748160
10.120000 2.788930
10.380000 2.436720
10.620000 2.253460
10.880000 2.421220
11.120000 1.781050
11.380000 1.268640
11.620000 0.793560
11.880000 0.909860
12.120000 0.767430
12.380000 0.629720
12.620000 0.821150
12.880000 0.626400
13.120000 1.141010
13.380000 0.956500
13.620000 1.643920
13.880000 1.717110
14.120000 1.443470
14.380000 1.377270
14.620000 1.463010
14.880000 1.265220
