0.05000 3407.12037
0.15000 5504.96701
0.25000 7770.51347
0.35000 9638.94521
0.45000 10710.03689
0.55000 11777.38720
0.65000 11613.22154
0.75000 11630.52300
0.85000 11513.33442
0.95000 10996.51470
1.05000 10457.19297
1.15000 10052.50678
1.25000 9574.78842
1.35000 9114.93702
1.45000 8641.29568
1.55000 8213.21110
1.65000 7912.02489
1.75000 7645.94213
1.85000 7206.53343
1.95000 6869.11836
2.05000 6588.11005
2.15000 6282.85148
2.25000 6108.41202
2.35000 5810.56183
2.45000 5571.59296
2.55000 5324.75823
2.65000 5091.84062
2.75000 4858.54003
2.85000 4698.71427
2.95000 4502.30004
3.05000 4349.37309
3.15000 4192.95402
3.25000 4065.49189
3.35000 3880.90752
3.45000 3753.96866
3.55000 3650.22252
3.65000 3529.86008
3.75000 3384.65919
3.85000 3242.83871
3.95000 3152.17258
4.05000 2993.87157
4.15000 2878.82153
4.25000 2768.42288
4.35000 2654.21831
4.45000 2557.15367
4.55000 2439.56416
4.65000 2332.99146
4.75000 2270.28101
4.85000 2131.86897
4.95000 2053.20494
5.05000 1987.35561
5.15000 1934.22711
5.25000 1819.06610
5.35000 1758.73611
5.45000 1687.66120
5.55000 1664.73706
5.65000 1559.40087
5.75000 1530.19785
5.85000 1446.45781
5.95000 1425.91924
6.05000 1374.05584
6.15000 1365.54050
6.25000 1314.15836
6.35000 1282.76696
6.45000 1229.35012
6.55000 1177.58936
6.65000 1171.56858
6.75000 1130.92215
6.85000 1094.27694
6.95000 1058.89460
7.05000 1038.78798
7.15000 1002.12981
7.25000 979.26073
7.35000 945.61385
7.45000 951.89460
7.55000 906.73035
7.65000 894.72649
7.75000 871.31569
7.85000 846.96816
7.95000 817.87302
8.05000 791.98706
8.15000 772.26479
8.25000 759.63866
8.35000 745.44243
8.45000 743.66546
8.55000 719.43859
8.65000 701.93929
8.75000 691.54546
8.85000 658.11974
8.95000 658.89255
9.05000 644.36182
9.15000 638.25948
9.25000 621.79467
9.35000 601.66044
9.45000 590.50700
9.55000 569.54024
9.65000 575.84462
9.75000 566.87128
9.85000 552.95940
9.95000 540.83628
10.05000 535.30209
10.15000 514.61530
10.25000 500.53480
10.35000 493.25004
10.45000 489.79941
10.55000 470.12320
10.65000 475.15916
10.75000 455.62157
10.85000 441.67348
10.95000 443.61121
11.05000 442.79216
11.15000 422.90871
11.25000 422.99796
11.35000 406.68431
11.45000 390.22345
11.55000 387.73544
11.65000 391.09803
11.75000 368.99293
11.85000 362.82432
11.95000 355.98104
12.05000 359.40465
12.15000 342.22290
12.25000 332.15193
12.35000 337.01108
12.45000 324.25182
12.55000 321.97942
12.65000 312.95703
12.75000 316.15429
12.85000 308.59768
12.95000 300.28128
13.05000 297.37656
13.15000 282.82580
13.25000 283.63445
13.35000 282.69040
13.45000 265.03663
13.55000 262.78906
13.65000 278.58237
13.75000 257.36256
13.85000 257.33524
13.95000 250.37490
14.05000 246.32950
14.15000 242.99634
14.25000 247.30220
14.35000 232.17797
14.45000 232.09602
14.55000 221.58708
14.65000 221.86358
14.75000 221.53727
14.85000 222.37939
14.95000 211.30772
15.05000 208.25542
15.15000 206.17084
15.25000 196.91651
15.35000 190.53204
15.45000 193.86507
15.55000 188.34907
15.65000 183.54617
15.75000 183.48671
15.85000 175.70225
15.95000 180.69524
16.05000 170.38577
16.15000 169.75193
16.25000 162.96603
16.35000 159.44260
16.45000 152.41514
16.55000 147.65935
16.65000 148.33013
16.75000 151.69536
16.85000 138.42486
16.95000 138.45198
17.05000 143.61605
17.15000 134.98214
17.25000 133.60118
17.35000 135.66628
17.45000 130.06400
17.55000 127.15536
17.65000 116.92143
17.75000 131.65021
17.85000 124.31122
17.95000 122.04267
18.05000 118.51980
18.15000 115.55888
18.25000 110.95141
18.35000 114.11780
18.45000 115.91375
18.55000 107.91963
18.65000 111.49345
18.75000 114.29010
18.85000 111.14411
18.95000 111.05825
19.05000 103.00821
19.15000 107.87979
19.25000 101.61604
19.35000 96.08139
19.45000 103.65967
19.55000 94.03916
19.65000 102.86683
19.75000 100.72362
19.85000 88.83231
19.95000 97.46090
