0.12500 0.00673
0.37500 0.02129
0.62500 0.01154
0.87500 0.03948
1.12500 0.03000
1.37500 0.03518
1.62500 0.06334
1.87500 0.06157
2.12500 0.05754
2.37500 0.04086
2.62500 0.02977
2.87500 0.02332
3.12500 0.02737
3.37500 0.05879
3.62500 0.05776
3.87500 0.04480
4.12500 0.04324
4.37500 0.04482
4.62500 0.04770
4.87500 0.04792
5.12500 0.05571
5.37500 0.06093
5.62500 0.05683
5.87500 0.04096
6.12500 0.04706
6.37500 0.02552
6.62500 0.02214
6.87500 0.04148
7.12500 0.02852
7.37500 0.03521
7.62500 0.04716
7.87500 0.03073
8.12500 0.02996
8.37500 0.03622
8.62500 0.04055
8.87500 0.06804
9.12500 0.04337
9.37500 0.05880
9.62500 0.05421
9.87500 0.08060
10.12500 0.08611
10.37500 0.07131
10.62500 0.05400
10.87500 0.06172
11.12500 0.05498
11.37500 0.05169
11.62500 0.01121
11.87500 0.04217
12.12500 0.03735
12.37500 0.02140
12.62500 0.02177
12.87500 0.01088
13.12500 0.01983
13.37500 0.01448
13.62500 0.02645
13.87500 0.01890
14.12500 0.05996
14.37500 0.05395
14.62500 0.01890
14.87500 0.02770
15.12500 0.02964
15.37500 0.01411
15.62500 0.08454
15.87500 0.04462
16.12500 0.07313
16.37500 0.05457
16.62500 0.03224
16.87500 0.03266
17.12500 0.03242
17.37500 0.05904
17.62500 0.03135
17.87500 0.02109
18.12500 0.05407
18.37500 0.08411
18.62500 0.06646
18.87500 0.06848
19.12500 0.08057
19.37500 0.06118
19.62500 0.06971
19.87500 0.01967
