0.1875 -0.86982 21.15911 2.56774 138.69613 137.75009 137.21492
0.5625 -0.38755 50.50641 2.43464 115.98779 116.37408 112.69556
0.9375 0.60788 78.69497 1.59383 103.47717 103.02629 95.5581
1.3125 -1.16996 103.5541 0.57491 94.00741 92.65205 85.28893
1.6875 0.18161 122.30921 1.12433 86.16207 84.20867 74.06247
2.0625 0.50412 136.49938 0.9836 79.61223 74.76595 66.55051
2.4375 -0.45468 147.54481 -0.49994 72.76305 69.02575 61.82142
2.8125 -0.95252 156.46871 -0.62751 67.63276 62.24162 55.09149
3.1875 -2.3348 162.80082 -0.73936 63.66434 57.59112 52.45935
3.5625 -0.6631 169.14192 0.03475 59.62174 53.63026 49.12316
3.9375 -0.64885 173.99366 0.01086 56.01818 50.15899 47.13978
4.3125 0.85622 179.40073 0.18118 53.07544 46.54851 43.88441
4.6875 0.14995 182.90104 0.16124 51.71502 45.59284 41.90755
5.0625 0.69862 187.23074 0.64017 49.89241 42.04048 40.5276
5.4375 1.34555 189.22416 0.14359 48.31484 39.76238 38.32028
5.8125 0.94309 193.22811 0.50497 45.83714 37.61266 37.48835
6.1875 1.40517 194.83516 0.14893 45.14881 35.80839 36.19868
6.5625 0.34394 197.58787 -0.25053 42.91169 34.71694 34.22624
6.9375 1.18043 198.60177 -1.64963 41.6872 32.8971 33.61235
7.3125 1.46808 199.61422 -1.88225 40.56717 31.90322 31.96614
7.6875 0.88695 200.85334 -2.37214 39.10553 30.93085 31.46575
8.0625 0.60609 201.88293 -2.0498 39.36468 30.12355 30.7053
8.4375 0.85105 202.42376 -2.5813 37.68137 28.89055 29.58147
8.8125 -0.08227 202.65521 -2.77437 36.72889 28.57949 28.71095
9.1875 0.77059 203.63859 -3.66366 36.03093 26.95393 27.77284
9.5625 1.11684 203.7138 -2.22129 36.19421 26.4781 26.6016
9.9375 0.69858 204.12178 -1.62552 35.09248 25.96578 26.14044
10.3125 0.60688 203.87179 -0.35834 33.34494 24.74818 25.61311
10.6875 -0.02267 205.82906 -1.15938 32.8717 24.35052 24.56897
11.0625 -0.5721 204.99128 -2.12422 31.83013 23.25382 24.20975
11.4375 0.28262 205.33554 -1.40453 31.12772 22.77989 23.19582
11.8125 -0.02178 204.9912 -0.776 30.52684 21.36764 22.63376
12.1875 -0.85483 205.03537 -1.24681 28.55228 21.55609 22.30839
12.5625 -1.35478 204.97105 -0.11647 29.01664 20.54618 21.5346
12.9375 0.23234 205.42173 0.17072 27.5954 21.1293 21.09426
13.3125 0.12328 204.44658 0.87717 26.24526 19.87005 20.50744
13.6875 0.84265 205.38782 1.87928 25.45468 19.56314 19.62294
14.0625 -1.28244 204.72229 2.02538 25.27553 19.06769 20.50999
14.4375 0.79445 204.91557 0.21186 23.19735 18.43664 19.40017
14.8125 -0.75502 204.13943 2.11515 24.64325 19.5293 18.60934
15.1875 -1.43886 205.53069 1.58388 22.85175 17.81678 18.53787
15.5625 0.76582 206.33365 0.85042 23.16921 17.75875 18.70253
15.9375 -0.66442 206.46555 1.32996 22.66517 16.13537 17.3793
16.3125 0.1903 206.62319 1.5743 19.74265 16.21912 17.45191
16.6875 0.90971 206.15457 1.11541 21.52342 15.49532 16.4275
17.0625 1.2687 206.47863 1.2473 21.20051 15.04379 16.19641
17.4375 1.00348 206.18015 1.3456 21.0296 14.95701 15.79172
17.8125 -0.40432 205.70142 1.55976 18.32883 15.35214 15.74241
18.1875 0.34192 205.48956 0.89994 19.30839 13.65601 15.73158
18.5625 1.34936 205.95632 -0.28655 18.32525 12.48619 14.81904
18.9375 1.92954 205.54393 0.53124 17.77905 13.70258 15.30783
19.3125 0.68677 206.41136 -0.13528 17.19716 14.60663 14.32376
19.6875 1.22262 205.28294 0.18884 16.79025 13.6417 12.99144
20.0625 0.4531 205.95323 -1.54696 15.36109 12.20865 12.87939
20.4375 0.16567 205.49085 -0.88093 16.84135 11.44075 13.70737
20.8125 -0.98931 207.337 -2.08284 14.72295 10.45762 11.85155
21.1875 -1.25896 206.25593 -1.42643 14.88318 12.43753 11.93921
21.5625 1.82134 206.23762 0.57789 13.32968 12.55214 11.63436
21.9375 -0.5576 205.64938 -0.71374 15.05893 11.50171 11.43665
22.3125 0.22762 204.8768 -1.91268 12.86104 10.79042 10.66622
22.6875 -1.9646 205.73858 0.07918 16.41899 10.71161 9.56273
23.0625 0.6099 206.99795 1.56388 13.1894 9.10625 9.63339
23.4375 -1.08967 205.25369 -0.53402 13.1984 7.42632 11.08756
23.8125 -2.07655 205.7749 -1.78693 15.15328 10.21867 10.38244
24.1875 1.66836 205.29765 -1.05213 14.55825 10.56589 11.16832
24.5625 -0.86023 204.79415 -0.79043 14.53181 8.73782 9.72062
24.9375 2.26312 204.52455 -2.83 13.38039 8.65188 9.1621
25.3125 -0.52893 204.28571 -0.35601 11.68699 8.36427 9.66621
25.6875 -1.53825 202.81756 -2.36485 13.80314 8.97938 8.11299
26.0625 3.37417 203.22481 0.86791 9.67149 6.32699 5.98061
26.4375 4.38641 202.32279 3.80191 9.99557 8.22521 6.84663
26.8125 2.94186 203.27991 -0.20862 11.77687 7.41112 8.57926
27.1875 0.74728 199.09565 -0.65578 13.39126 8.29277 6.32953
27.5625 -0.93679 203.40846 4.51162 10.7823 8.06405 7.39352
27.9375 -0.14972 202.78735 0.82752 10.47708 8.77924 6.8779
28.3125 -2.48908 204.63279 0.30321 15.40712 7.63691 10.51842
28.6875 3.05828 205.68875 0.71821 8.00295 7.83132 6.23303
29.0625 3.45239 200.88445 -0.09879 11.00104 2.3397 5.27725
29.4375 1.61893 200.6673 -1.91822 3.70741 8.52477 1.76141
29.8125 -2.24404 199.76997 0.9807 12.00771 6.51763 6.88326
