0.05000 2120.73536
0.15000 3123.49146
0.25000 4060.33848
0.35000 5062.45403
0.45000 5591.41240
0.55000 6234.67487
0.65000 6365.61010
0.75000 6472.20184
0.85000 6607.01451
0.95000 6510.07294
1.05000 6314.71944
1.15000 6208.38814
1.25000 6003.39510
1.35000 5792.82867
1.45000 5609.70895
1.55000 5418.73306
1.65000 5284.30799
1.75000 5165.83308
1.85000 4958.45873
1.95000 4810.41569
2.05000 4676.05687
2.15000 4479.46602
2.25000 4375.68065
2.35000 4216.48559
2.45000 4068.22882
2.55000 3934.10480
2.65000 3857.18462
2.75000 3718.60470
2.85000 3650.92730
2.95000 3573.27619
3.05000 3396.27763
3.15000 3353.31649
3.25000 3236.42495
3.35000 3130.88229
3.45000 3034.70492
3.55000 2940.89998
3.65000 2867.62350
3.75000 2762.86011
3.85000 2664.29956
3.95000 2606.58854
4.05000 2530.08538
4.15000 2468.05035
4.25000 2415.01954
4.35000 2326.80111
4.45000 2250.79591
4.55000 2198.04123
4.65000 2133.03136
4.75000 2078.17068
4.85000 2036.24459
4.95000 1970.54282
5.05000 1931.51659
5.15000 1874.69474
5.25000 1820.51165
5.35000 1769.95515
5.45000 1733.69733
5.55000 1685.04941
5.65000 1629.98728
5.75000 1610.30270
5.85000 1551.76067
5.95000 1526.54768
6.05000 1491.07511
6.15000 1436.90113
6.25000 1403.11364
6.35000 1370.23551
6.45000 1344.45063
6.55000 1292.58590
6.65000 1282.64518
6.75000 1235.02460
6.85000 1209.78618
6.95000 1165.87335
7.05000 1142.41498
7.15000 1115.46544
7.25000 1072.82285
7.35000 1082.22829
7.45000 1042.60574
7.55000 1024.96069
7.65000 991.65714
7.75000 978.29334
7.85000 935.64945
7.95000 913.02011
8.05000 887.37580
8.15000 861.75690
8.25000 857.38302
8.35000 837.88204
8.45000 815.38075
8.55000 783.17589
8.65000 767.03342
8.75000 761.41875
8.85000 735.45054
8.95000 732.44264
9.05000 700.94380
9.15000 673.59369
9.25000 658.12670
9.35000 634.76162
9.45000 639.11227
9.55000 611.64354
9.65000 591.78279
9.75000 578.22440
9.85000 574.26503
9.95000 559.97071
10.05000 548.30931
10.15000 525.70888
10.25000 512.05588
10.35000 510.03198
10.45000 496.58295
10.55000 487.73000
10.65000 485.30051
10.75000 470.29844
10.85000 463.71130
10.95000 449.81051
11.05000 434.35510
11.15000 426.03782
11.25000 421.93211
11.35000 421.62873
11.45000 405.87619
11.55000 398.86422
11.65000 390.68363
11.75000 379.61736
11.85000 368.41453
11.95000 360.60214
12.05000 357.28428
12.15000 355.89467
12.25000 340.88785
12.35000 326.97373
12.45000 340.60203
12.55000 316.29412
12.65000 319.37661
12.75000 307.89801
12.85000 292.35105
12.95000 288.33207
13.05000 280.05386
13.15000 288.52629
13.25000 282.99915
13.35000 262.65121
13.45000 260.69771
13.55000 255.40955
13.65000 247.18240
13.75000 255.64988
13.85000 241.56077
13.95000 238.99603
14.05000 226.55800
14.15000 234.74415
14.25000 222.53351
14.35000 223.22607
14.45000 216.04646
14.55000 215.82444
14.65000 216.43269
14.75000 203.57533
14.85000 198.52736
14.95000 203.62798
15.05000 202.40504
15.15000 196.22521
15.25000 184.50828
15.35000 185.23340
15.45000 187.00102
15.55000 177.17571
15.65000 173.42419
15.75000 178.66003
15.85000 168.39772
15.95000 165.79241
16.05000 166.04034
16.15000 154.86313
16.25000 152.74059
16.35000 163.43257
16.45000 145.77461
16.55000 152.12764
16.65000 152.33448
16.75000 133.98969
16.85000 141.02984
16.95000 134.44772
17.05000 131.78316
17.15000 136.09207
17.25000 123.06668
17.35000 120.79161
17.45000 119.47837
17.55000 121.28408
17.65000 127.33861
17.75000 120.94203
17.85000 119.35086
17.95000 114.16081
18.05000 110.62235
18.15000 117.37773
18.25000 102.47801
18.35000 104.66753
18.45000 107.44874
18.55000 102.63588
18.65000 108.84213
18.75000 100.36352
18.85000 93.06572
18.95000 105.38268
19.05000 89.55992
19.15000 94.50955
19.25000 83.76352
19.35000 86.87993
19.45000 85.17480
19.55000 93.95694
19.65000 81.41150
19.75000 73.06026
19.85000 83.70475
19.95000 87.45423
