0.12500 0.04990
0.37500 0.01526
0.62500 0.00800
0.87500 0.01066
1.12500 0.01600
1.37500 0.01650
1.62500 0.01201
1.87500 0.01878
2.12500 0.01748
2.37500 0.00866
2.62500 0.00529
2.87500 0.01782
3.12500 0.01725
3.37500 0.01452
3.62500 0.00203
3.87500 0.02530
4.12500 0.03421
4.37500 0.02056
4.62500 0.01719
4.87500 0.01490
5.12500 0.00998
5.37500 0.00774
5.62500 0.00981
5.87500 0.00892
6.12500 0.00933
6.37500 0.00902
6.62500 0.00703
6.87500 0.01719
7.12500 0.01386
7.37500 0.02496
7.62500 0.01376
7.87500 0.02404
8.12500 0.01975
8.37500 0.01426
8.62500 0.00489
8.87500 0.00636
9.12500 0.00580
9.37500 0.00773
9.62500 0.01151
9.87500 0.01511
10.12500 0.00652
10.37500 0.00746
10.62500 0.00813
10.87500 0.00108
11.12500 0.01444
11.37500 0.00856
11.62500 0.00979
11.87500 0.00221
12.12500 0.02284
12.37500 0.01640
12.62500 0.00760
12.87500 0.02058
13.12500 0.01326
13.37500 0.00724
13.62500 0.01930
13.87500 0.01208
14.12500 0.01966
14.37500 0.02349
14.62500 0.01932
14.87500 0.04517
15.12500 0.00990
15.37500 0.01227
15.62500 0.01912
15.87500 0.01117
16.12500 0.04046
16.37500 0.01554
16.62500 0.02631
16.87500 0.02686
17.12500 0.02033
17.37500 0.02822
17.62500 0.04152
17.87500 0.02369
18.12500 0.02645
18.37500 0.04127
18.62500 0.04623
18.87500 0.02733
19.12500 0.01756
19.37500 0.02017
19.62500 0.03438
19.87500 0.02866
