0.120000 -1.503130
0.380000 -2.711630
0.620000 -2.509530
0.880000 -2.633180
1.120000 -2.497910
1.380000 -2.580110
1.620000 -2.633500
1.880000 -2.616310
2.120000 -2.582040
2.380000 -2.553370
2.620000 -2.600150
2.880000 -2.583630
3.120000 -2.616330
3.380000 -2.566830
3.620000 -2.616620
3.880000 -2.586720
4.120000 -2.625170
4.380000 -2.575880
4.620000 -2.570780
4.880000 -2.592220
5.120000 -2.579060
5.380000 -2.577680
5.620000 -2.593420
5.880000 -2.595640
6.120000 -2.540690
6.380000 -2.544200
6.620000 -2.510230
6.880000 -2.452890
7.120000 -2.428080
7.380000 -2.351930
7.620000 -2.435130
7.880000 -2.399330
8.120000 -2.361870
8.380000 -2.335880
8.620000 -2.378150
8.880000 -2.414650
9.120000 -2.396210
9.380000 -2.443210
9.620000 -2.306050
9.880000 -2.488300
10.120000 -2.498730
10.380000 -2.538330
10.620000 -2.776940
10.880000 -3.058690
11.120000 -2.906360
11.380000 -2.676410
11.620000 2.648820
11.880000 -2.702530
12.120000 3.033290
12.380000 2.453280
12.620000 2.575420
12.880000 3.083620
13.120000 1.693460
13.380000 2.791610
13.620000 -1.966160
13.880000 -2.901290
14.120000 3.082370
14.380000 -2.749850
14.620000 -2.619750
14.880000 -2.804560
15.120000 -2.976930
15.380000 -2.611650
15.620000 3.083470
15.880000 2.799660
16.120000 2.727480
16.380000 3.050260
16.620000 2.499430
16.880000 3.109820
17.120000 1.954120
17.380000 3.005860
17.620000 -1.449710
17.880000 -2.074820
18.120000 2.499200
18.380000 -2.507860
18.620000 3.076460
18.880000 -2.960580
19.120000 3.115550
19.380000 2.883470
19.620000 2.709230
19.880000 2.266700
