0.05000 -245.92975 -45.87650 -160.10549 1396.64717 1378.18791 1720.51507
0.15000 -2192.65175 28.70092 -212.55487 1499.66149 1282.23191 3364.16151
0.25000 -3316.58563 -43.38848 -90.28043 1812.39011 1358.74504 5025.71841
0.35000 -4352.18969 4.15426 107.30238 1832.50300 1323.14931 5961.34487
0.45000 -5003.30827 84.39573 75.12051 1847.81008 1235.26479 6689.57060
0.55000 -5597.21515 81.02604 61.97726 1797.07307 1240.34191 6986.87517
0.65000 -5950.26146 50.47288 174.59342 1808.17805 1191.00057 7287.87269
0.75000 -6200.13880 49.77691 68.89238 1849.50702 1168.21277 7476.76929
0.85000 -6587.76531 62.89032 24.49235 1818.24639 1144.89324 7357.87989
0.95000 -6785.07036 70.34172 118.39064 1771.30739 1154.46307 7385.30022
1.05000 -7030.71469 74.08072 61.60980 1722.27155 1181.67846 7214.25559
1.15000 -7158.20424 89.56230 130.10049 1696.49675 1171.75088 7124.45257
1.25000 -7364.09995 77.74436 30.45570 1557.64074 1165.21265 6857.86814
1.35000 -7522.25858 88.59714 112.99184 1507.84206 1161.96400 6693.55537
1.45000 -7603.56381 67.10213 60.74208 1456.06096 1149.57890 6452.74777
1.55000 -7696.53302 112.28129 156.76086 1366.19968 1135.71803 6218.77717
1.65000 -7739.00628 80.29629 8.26399 1311.85446 1127.59629 6086.55623
1.75000 -7751.55495 55.73820 -26.04593 1249.10063 1115.95040 5833.96067
1.85000 -7791.76103 65.84826 -30.11675 1176.81682 1081.72278 5715.61783
1.95000 -7838.43343 80.99474 31.69000 1082.27869 1065.90547 5483.37514
2.05000 -7842.11404 52.36188 67.67274 1042.99047 1058.49465 5333.07548
2.15000 -7869.58518 68.38892 -11.05073 967.60254 1028.50960 5160.88574
2.25000 -7871.40871 61.32581 -48.04954 932.01317 1006.92474 4984.36107
2.35000 -7880.37863 47.54003 16.22251 896.47753 969.28396 4886.36101
2.45000 -7894.01631 46.77846 -65.45554 845.20642 952.15027 4677.18886
2.55000 -7906.90427 48.93179 -6.72318 827.96446 913.37324 4564.76594
2.65000 -7897.58904 60.89452 -98.97192 772.25885 885.12828 4440.49384
2.75000 -7901.87279 39.88935 -20.16388 790.24318 843.92298 4288.06735
2.85000 -7870.53261 50.01368 10.70621 767.06011 797.50828 4171.73868
2.95000 -7853.12529 44.21112 -65.97763 769.70011 752.38163 4043.68731
3.05000 -7802.41760 44.02362 73.15653 767.01006 714.54335 3922.69756
3.15000 -7797.06653 67.12890 -48.91095 740.12071 662.64424 3788.76823
3.25000 -7762.67851 56.39284 43.52668 749.29186 649.56656 3664.39098
3.35000 -7714.59417 56.39512 16.14406 698.22782 606.35869 3538.66870
3.45000 -7657.93166 65.37050 19.25281 691.36825 574.92606 3426.40814
3.55000 -7630.14261 60.37659 15.42629 681.84443 545.70637 3331.76582
3.65000 -7588.54866 54.26862 -7.21731 647.38955 509.25473 3223.36358
3.75000 -7525.34972 57.15358 29.48745 622.43415 492.79871 3126.75413
3.85000 -7466.52658 48.95973 -21.71165 602.96418 468.21929 3030.34176
3.95000 -7396.45802 56.40230 -17.14301 576.44055 436.69306 2942.50739
4.05000 -7339.82151 51.73173 -4.20215 572.02555 427.65485 2870.75392
4.15000 -7291.86381 60.73244 -66.80285 527.22151 410.38814 2777.71062
4.25000 -7259.83462 48.18108 36.91125 518.69689 401.12451 2705.50713
4.35000 -7211.74135 44.75987 33.12145 509.22584 375.41018 2624.98264
4.45000 -7172.48037 42.49947 -30.23201 477.16925 355.20147 2560.20018
4.55000 -7113.69642 41.04457 -39.01769 475.98986 363.06976 2501.35012
4.65000 -7075.31623 39.27292 -36.05595 479.03063 331.23077 2419.88481
4.75000 -7026.40717 41.72122 -66.05935 442.91393 323.75544 2321.82240
4.85000 -6972.09598 39.91812 -26.98834 456.94686 329.68669 2277.25296
4.95000 -6926.02114 37.92041 -36.72040 446.56235 321.90474 2233.89422
5.05000 -6885.73593 39.92401 -31.06743 441.00330 322.45980 2155.16344
5.15000 -6835.14301 39.30249 -29.95067 437.41385 284.57609 2101.54169
5.25000 -6773.37622 27.94854 -59.85820 415.22007 299.77322 2019.34119
5.35000 -6711.43622 32.70770 -37.30815 397.91831 276.13555 1971.16560
5.45000 -6650.45947 30.82074 -38.89581 386.83336 259.48263 1914.70051
5.55000 -6590.72423 31.55388 -48.04720 376.13861 263.60304 1884.67006
5.65000 -6529.24211 32.42752 -11.56286 377.99614 258.26252 1817.20648
5.75000 -6465.38439 34.06071 -21.00157 352.43235 269.19567 1772.92423
5.85000 -6404.98088 31.95801 19.79176 341.35262 263.56728 1722.93826
5.95000 -6345.41553 28.02911 -47.97649 331.26044 241.99967 1675.68125
6.05000 -6297.02538 31.20667 -24.50940 328.85626 232.87376 1615.62817
6.15000 -6247.45082 28.70962 -49.22583 300.66894 236.30116 1576.31570
6.25000 -6195.70076 30.00516 -12.97231 296.70191 218.40674 1539.02651
6.35000 -6154.57244 28.68846 -53.01424 290.96218 207.11828 1502.68682
6.45000 -6102.70342 28.90046 -17.44332 301.42054 212.79545 1450.76326
6.55000 -6036.05951 27.57110 -30.10102 292.43342 195.40369 1435.94895
6.65000 -5981.83289 25.61739 13.34006 271.59043 194.18847 1389.61976
6.75000 -5927.80749 30.52564 -23.14289 268.85341 209.70309 1348.77797
6.85000 -5876.75105 27.80325 4.20303 270.52771 203.52384 1309.55792
6.95000 -5814.37942 25.78789 -37.70830 292.88996 221.87794 1295.50986
7.05000 -5767.71541 26.35402 8.57096 266.76003 210.23720 1237.39847
7.15000 -5709.65343 27.99712 -21.93595 269.45280 189.48604 1209.90900
7.25000 -5653.07121 26.80840 4.05694 257.42005 196.50577 1184.12015
7.35000 -5594.94181 20.15813 1.94213 263.26883 173.55411 1154.19304
7.45000 -5539.92874 27.67399 2.35918 233.47773 178.89703 1133.66807
7.55000 -5491.65510 25.24096 -12.87977 262.88977 241.69578 1087.47119
7.65000 -5449.62252 24.54142 -16.93438 224.63766 203.63741 1068.61274
7.75000 -5394.38778 24.33687 17.41731 225.56263 159.87233 1059.36808
7.85000 -5350.18048 23.18816 -9.37579 215.09032 169.62640 1018.98316
7.95000 -5305.46465 20.57643 -14.42808 230.92877 175.96047 971.36425
8.05000 -5251.59984 15.97616 3.32902 205.14531 179.63217 966.88421
8.15000 -5205.21422 18.22650 10.24442 235.65110 190.79443 945.17721
8.25000 -5170.19479 14.90518 32.98067 198.36753 151.19839 916.12749
8.35000 -5110.85347 18.83315 -6.27860 205.23415 161.77020 898.75779
8.45000 -5078.98405 19.53848 16.37844 219.68518 196.61242 867.83984
8.55000 -5029.99348 17.46424 -8.27815 210.93097 183.21947 872.05760
8.65000 -4987.63198 21.22430 -0.13667 200.71558 141.76869 834.23327
8.75000 -4934.91320 16.19571 12.22892 202.22278 154.41265 823.70317
8.85000 -4894.28002 18.48262 4.39705 181.08102 145.79957 792.04065
8.95000 -4856.30325 21.37845 7.54540 174.23927 172.22379 780.03869
9.05000 -4813.16800 13.80128 4.16641 214.86931 190.19242 767.98142
9.15000 -4778.49016 18.12606 14.36936 192.35857 152.91931 733.37403
9.25000 -4728.88845 16.07000 13.03192 187.17647 178.05789 731.35351
9.35000 -4687.59913 14.07208 -17.41073 193.27420 159.96943 704.10112
9.45000 -4638.29597 20.37188 5.06173 181.74912 160.96863 703.70797
9.55000 -4596.99807 20.65550 11.65645 175.10526 185.19370 680.91235
9.65000 -4559.50099 15.20250 3.86946 177.58137 176.13089 664.58030
9.75000 -4526.23142 13.15898 1.48340 160.18627 150.72183 642.81417
9.85000 -4478.05280 13.24437 10.67593 189.33319 136.06827 640.99304
9.95000 -4446.16010 9.75449 10.47363 159.64291 131.19501 607.44337
10.05000 -4410.83415 12.56504 6.17889 141.76744 132.15291 595.40078
10.15000 -4374.03273 18.09610 12.33150 150.89325 128.26005 582.61758
10.25000 -4338.60366 15.79319 -4.22186 148.38583 110.63446 568.60382
10.35000 -4303.20978 14.64145 1.48702 154.07142 123.38336 573.57571
10.45000 -4261.71413 17.79516 27.52254 133.69827 118.53746 556.45855
10.55000 -4227.27788 10.13383 -19.05682 127.66426 105.91011 525.22673
10.65000 -4185.09493 11.44628 10.44236 160.50239 117.14004 520.22831
10.75000 -4149.08182 15.54801 -2.13182 228.70364 137.71264 511.69097
10.85000 -4115.32706 16.82431 5.41401 168.66866 187.53969 495.54210
10.95000 -4086.28834 12.01537 12.49912 134.71090 110.62915 487.40722
11.05000 -4054.64233 14.47566 9.39936 183.83905 155.06687 483.63470
11.15000 -4025.74736 16.98152 9.37754 120.70872 154.03519 449.96865
11.25000 -3991.89313 15.44080 20.69795 147.65894 119.99198 450.56991
11.35000 -3964.71232 13.36297 17.87283 124.79646 97.66795 441.35726
11.45000 -3928.47164 9.36469 7.44439 126.48572 96.74276 420.32436
11.55000 -3893.03495 9.61996 20.37977 108.81348 86.12501 421.22009
11.65000 -3860.65527 15.21170 17.70072 125.35677 94.24095 409.02074
11.75000 -3827.50526 10.44885 15.42661 118.18256 121.86275 404.25406
11.85000 -3802.04128 9.86291 10.10750 115.10618 90.20324 397.15698
11.95000 -3773.58784 14.77000 6.96899 134.04150 159.15028 396.47804
12.05000 -3743.75659 10.86959 -1.14853 159.54569 121.22320 374.77046
12.15000 -3716.16428 17.11358 1.89152 95.54059 91.15142 364.48825
12.25000 -3692.56820 14.35093 21.65958 125.78171 109.74901 351.94843
12.35000 -3663.29846 15.14682 14.47236 115.02884 102.21806 362.20169
12.45000 -3630.65955 16.95421 -1.79134 154.23442 89.98285 352.78890
12.55000 -3603.98089 16.58456 -6.04826 139.97455 117.02696 356.00836
12.65000 -3578.94033 16.72823 -5.23690 81.23489 76.59889 337.54448
12.75000 -3552.82465 17.23858 -2.29982 85.01778 74.18645 315.43378
12.85000 -3523.40963 13.61661 5.54902 98.98565 89.51585 306.11839
12.95000 -3498.44292 18.57317 -4.80055 120.78133 96.86059 317.37629
13.05000 -3472.78253 13.33131 -10.12645 84.10375 92.98397 306.54550
13.15000 -3443.64767 15.16161 5.58805 102.43931 80.20390 287.09044
13.25000 -3417.22955 15.24091 -1.78144 70.79522 62.32021 289.90524
13.35000 -3390.24129 12.00385 -8.36286 85.48424 78.38764 282.99175
13.45000 -3361.81072 16.62703 17.54445 94.76282 80.19048 303.61486
13.55000 -3336.14748 15.83466 3.25767 62.97289 69.57271 266.14235
13.65000 -3314.39447 17.19576 0.25943 69.65150 69.38678 278.82909
13.75000 -3288.42053 16.71612 14.31814 92.70553 63.68688 254.61797
13.85000 -3262.70809 15.93563 18.64442 72.63316 72.48777 248.82356
13.95000 -3242.88253 15.78200 19.97739 84.99457 73.86559 239.69330
14.05000 -3220.30020 17.47970 2.21295 87.99817 86.76517 247.10993
14.15000 -3190.72863 20.00022 16.81850 116.14377 153.86580 256.92997
14.25000 -3166.26416 20.07479 31.90272 100.52766 121.02026 234.40255
14.35000 -3145.50486 13.23492 11.93916 95.59953 89.35804 234.99362
14.45000 -3125.96392 11.36155 11.29706 80.73869 80.28299 226.21184
14.55000 -3098.73857 17.00515 19.14030 153.79623 73.07343 222.79104
14.65000 -3075.22511 14.04503 13.82894 143.15812 59.11777 232.45260
14.75000 -3057.61556 12.89899 15.87482 67.32571 65.10276 204.42250
14.85000 -3032.90841 11.54115 12.77116 63.96403 55.45722 202.05232
14.95000 -3011.94202 11.72916 17.87708 88.80353 114.12658 207.05895
15.05000 -2989.11563 12.61881 4.49523 74.77682 82.19853 210.04902
15.15000 -2970.67595 14.94722 17.28002 52.63731 63.05079 193.00295
15.25000 -2945.35999 12.69147 10.78268 49.73739 44.96472 194.93115
15.35000 -2922.00255 16.76344 14.75460 77.84355 84.48993 201.80737
15.45000 -2904.80247 12.74762 5.82326 65.99708 75.27653 183.03205
15.55000 -2879.40300 11.92131 16.32772 88.87572 51.30008 187.36863
15.65000 -2864.85682 7.78105 -2.73017 65.58955 91.97631 194.78380
15.75000 -2848.11683 15.50078 6.13776 51.37446 46.87071 175.82889
15.85000 -2829.00926 10.76493 -1.63223 51.38886 43.81949 176.69516
15.95000 -2807.33165 9.79972 5.60258 81.14190 48.13545 174.16283
16.05000 -2787.95180 12.78911 -1.93022 67.13533 49.52207 168.21658
16.15000 -2774.60438 5.41153 11.18998 57.56838 85.32616 161.81050
16.25000 -2758.06406 14.02280 -3.46617 59.50901 52.88881 161.29218
16.35000 -2738.71406 16.58186 -3.05005 116.89951 102.26478 188.55599
16.45000 -2724.40250 9.15015 -11.86436 64.98141 61.73310 154.41546
16.55000 -2704.16785 12.10776 -2.64307 46.45615 49.90852 156.85192
16.65000 -2683.17915 15.87473 -6.53765 82.91468 88.69471 154.77575
16.75000 -2671.05815 11.95476 -16.47538 57.08258 85.55348 147.04048
16.85000 -2644.56606 9.58879 -22.92203 67.97325 52.91967 164.22603
16.95000 -2627.78444 9.05421 -21.97042 55.93569 57.27614 149.73127
17.05000 -2610.38256 4.54200 -29.73226 95.01463 124.86295 171.43773
17.15000 -2599.76518 9.46716 -22.18879 49.89847 51.14284 140.63822
17.25000 -2580.30822 12.43020 -24.07051 57.15710 67.22710 127.68912
17.35000 -2567.67335 7.97456 -18.06904 56.32694 57.59432 133.97238
17.45000 -2553.87137 8.16694 -14.41328 60.68327 48.26672 135.74499
17.55000 -2540.07957 11.08549 -26.37004 45.27934 37.85752 127.82330
17.65000 -2516.31909 9.83562 -15.26657 66.87257 52.15731 126.25044
17.75000 -2507.07217 7.44023 -17.14548 52.54992 49.20661 127.26366
17.85000 -2492.94328 11.70050 -7.74059 43.35663 43.33748 125.98834
17.95000 -2476.70053 13.60148 3.95467 42.57104 42.67842 122.77064
18.05000 -2461.70747 10.02492 -12.74687 46.59400 37.90781 120.90093
18.15000 -2451.72010 11.20781 2.58106 68.13736 86.47750 119.51323
18.25000 -2431.17397 6.61703 -3.25273 104.09789 40.29994 130.33986
18.35000 -2421.12610 7.29712 -9.04470 37.82119 41.99893 122.90949
18.45000 -2401.70265 9.40891 -5.06341 34.66301 34.07610 113.03531
18.55000 -2392.10211 9.27183 -2.17951 42.74365 39.13416 120.33001
18.65000 -2375.87418 12.70386 -0.70362 40.52604 48.02711 150.06391
18.75000 -2366.78939 5.32257 0.92528 41.92914 58.87474 122.16680
18.85000 -2352.38419 7.08297 1.07983 30.60842 32.00861 112.67179
18.95000 -2339.87407 7.39758 8.26030 63.60238 50.03938 115.66057
19.05000 -2322.57890 11.29773 -7.12432 49.18638 64.81701 117.65599
19.15000 -2309.80666 6.65672 4.50899 37.68986 30.27292 101.40732
19.25000 -2298.12666 8.97341 2.50919 39.61638 53.25505 105.60160
19.35000 -2283.29649 7.43069 4.22331 41.45548 27.54888 91.64121
19.45000 -2263.86566 5.61141 1.22991 108.31269 75.71604 117.08653
19.55000 -2252.19320 10.45128 -3.81112 37.93875 33.58842 102.70596
19.65000 -2240.38509 8.02500 -4.98138 54.90714 56.58382 116.07272
19.75000 -2224.23802 10.11000 12.96428 54.95651 43.49939 99.42815
19.85000 -2213.99290 3.79906 11.93272 30.14787 47.83867 122.73185
19.95000 -2204.28004 7.22805 -5.74896 42.95699 27.73379 90.70150
