0.05000 165543.62341
0.15000 102842.90962
0.25000 59334.92976
0.35000 41901.91328
0.45000 32421.39605
0.55000 26580.19951
0.65000 22045.86266
0.75000 19112.04415
0.85000 16713.96669
0.95000 14909.32783
1.05000 13460.89177
1.15000 12226.67886
1.25000 11070.03847
1.35000 10309.53369
1.45000 9497.37430
1.55000 8899.31190
1.65000 8222.57143
1.75000 7901.97734
1.85000 7461.15288
1.95000 7065.59414
2.05000 6703.99092
2.15000 6309.50490
2.25000 6012.57486
2.35000 5722.26005
2.45000 5445.57973
2.55000 5246.52976
2.65000 5029.83968
2.75000 4699.71592
2.85000 4463.66706
2.95000 4267.08222
3.05000 4069.37764
3.15000 3883.84822
3.25000 3804.36553
3.35000 3543.74687
3.45000 3403.55656
3.55000 3231.01430
3.65000 3128.96653
3.75000 2975.56001
3.85000 2815.16415
3.95000 2788.04188
4.05000 2694.32482
4.15000 2580.65138
4.25000 2548.58635
4.35000 2462.65926
4.45000 2379.45075
4.55000 2382.69700
4.65000 2309.54068
4.75000 2262.24323
4.85000 2160.31661
4.95000 2114.54102
5.05000 2073.47670
5.15000 2022.44573
5.25000 1998.80477
5.35000 1938.32049
5.45000 1882.55898
5.55000 1879.85503
5.65000 1822.43389
5.75000 1772.25165
5.85000 1748.15742
5.95000 1666.21382
6.05000 1624.63950
6.15000 1646.02648
6.25000 1546.06737
6.35000 1562.53100
6.45000 1510.88043
6.55000 1493.67215
6.65000 1452.22509
6.75000 1419.00640
6.85000 1380.62398
6.95000 1321.40162
7.05000 1316.31676
7.15000 1309.53910
7.25000 1264.75605
7.35000 1235.69317
7.45000 1233.35202
7.55000 1191.66332
7.65000 1169.95429
7.75000 1127.71126
7.85000 1129.59601
7.95000 1118.34609
8.05000 1073.05965
8.15000 1039.61318
8.25000 1000.83910
8.35000 1001.91779
8.45000 963.31098
8.55000 955.06710
8.65000 944.32855
8.75000 934.70535
8.85000 906.49324
8.95000 878.92032
9.05000 852.70906
9.15000 839.14372
9.25000 849.13374
9.35000 794.71757
9.45000 794.24654
9.55000 799.09623
9.65000 761.13313
9.75000 735.97652
9.85000 728.64636
9.95000 712.30625
10.05000 691.95341
10.15000 670.98536
10.25000 677.51162
10.35000 648.81800
10.45000 647.60712
10.55000 640.95776
10.65000 634.33934
10.75000 602.78250
10.85000 604.99236
10.95000 596.68167
11.05000 588.64645
11.15000 581.77707
11.25000 562.48414
11.35000 546.02520
11.45000 534.34821
11.55000 530.70078
11.65000 540.90385
11.75000 501.66067
11.85000 507.71327
11.95000 490.18674
12.05000 480.39899
12.15000 473.61653
12.25000 459.82648
12.35000 458.95316
12.45000 439.75485
12.55000 448.84521
12.65000 428.26544
12.75000 424.99583
12.85000 403.88542
12.95000 409.44780
13.05000 405.95470
13.15000 390.35941
13.25000 398.12393
13.35000 366.21705
13.45000 366.62806
13.55000 368.45356
13.65000 355.19713
13.75000 343.49468
13.85000 336.18839
13.95000 343.28365
14.05000 327.61954
14.15000 324.27016
14.25000 311.39336
14.35000 314.61221
14.45000 306.01148
14.55000 391.81665
14.65000 289.21381
14.75000 288.34541
14.85000 282.45766
14.95000 274.60416
15.05000 278.34330
15.15000 273.65004
15.25000 264.95727
15.35000 265.00134
15.45000 255.77153
15.55000 256.23619
15.65000 244.34576
15.75000 240.35501
15.85000 234.05706
15.95000 234.17835
16.05000 224.53511
16.15000 217.94095
16.25000 219.53015
16.35000 219.86465
16.45000 217.51218
16.55000 216.39380
16.65000 212.89281
16.75000 211.30493
16.85000 200.76546
16.95000 201.38116
17.05000 184.47731
17.15000 195.89007
17.25000 185.75791
17.35000 204.61188
17.45000 190.31415
17.55000 181.57337
17.65000 180.17895
17.75000 181.62643
17.85000 171.94041
17.95000 173.91853
18.05000 180.12104
18.15000 156.55165
18.25000 163.76543
18.35000 157.73883
18.45000 159.67942
18.55000 152.32639
18.65000 146.49665
18.75000 151.06591
18.85000 153.72996
18.95000 151.22979
19.05000 141.19337
19.15000 139.67683
19.25000 140.05444
19.35000 136.13277
19.45000 131.80294
19.55000 137.77388
19.65000 142.47464
19.75000 127.42523
19.85000 130.35120
19.95000 163.63683
