0.12500 0.00865
0.37500 0.01028
0.62500 0.03286
0.87500 0.05787
1.12500 0.09983
1.37500 0.11148
1.62500 0.13257
1.87500 0.13791
2.12500 0.17554
2.37500 0.14880
2.62500 0.14572
2.87500 0.10548
3.12500 0.08430
3.37500 0.06979
3.62500 0.04399
3.87500 0.04234
4.12500 0.03174
4.37500 0.01300
4.62500 0.01840
4.87500 0.01267
5.12500 0.00806
5.37500 0.00685
5.62500 0.02151
5.87500 0.01873
6.12500 0.02553
6.37500 0.00825
6.62500 0.00416
6.87500 0.02710
7.12500 0.01317
7.37500 0.00811
7.62500 0.01986
7.87500 0.03426
8.12500 0.01098
8.37500 0.04373
8.62500 0.03117
8.87500 0.04790
9.12500 0.00358
9.37500 0.02862
9.62500 0.03862
9.87500 0.02194
10.12500 0.00845
10.37500 0.01955
10.62500 0.06126
10.87500 0.04926
11.12500 0.04066
11.37500 0.07947
11.62500 0.09885
11.87500 0.03193
12.12500 0.02023
12.37500 0.04762
12.62500 0.08449
12.87500 0.04912
13.12500 0.03010
13.37500 0.04074
13.62500 0.04895
13.87500 0.04939
14.12500 0.01234
14.37500 0.02863
14.62500 0.02989
14.87500 0.07152
15.12500 0.03720
15.37500 0.04404
15.62500 0.01464
15.87500 0.04987
16.12500 0.03628
16.37500 0.05619
16.62500 0.03016
16.87500 0.04091
17.12500 0.00535
17.37500 0.08057
17.62500 0.08188
17.87500 0.09938
18.12500 0.10500
18.37500 0.08471
18.62500 0.00152
18.87500 0.07177
19.12500 0.03298
19.37500 0.10722
19.62500 0.03008
19.87500 0.02933
