0.1875 -2.00803 21.59874 -0.6223 111.69483 108.82167 86.92895
0.5625 -1.21068 47.21513 0.88614 107.67549 103.24897 83.10239
0.9375 -0.26037 65.01072 1.49447 107.77901 94.20934 77.75333
1.3125 2.05113 77.4253 2.25557 104.49833 88.04584 73.53765
1.6875 -0.61488 85.70546 0.88537 102.75377 81.47137 68.57209
2.0625 -1.76377 92.93597 1.81546 98.21321 77.21386 63.53701
2.4375 -1.02334 97.87027 0.87133 94.7135 72.94338 60.4324
2.8125 0.71327 107.01279 1.14914 91.39333 69.77051 57.16892
3.1875 0.01537 112.65985 0.15343 86.73818 68.68951 55.00104
3.5625 0.52296 122.66562 -0.25013 79.67617 65.81166 52.07883
3.9375 1.69999 134.38627 0.55173 72.38351 62.68975 49.30968
4.3125 1.93359 145.26721 0.33074 66.35997 60.21901 47.03918
4.6875 3.41538 154.58307 0.33209 60.19547 55.66061 45.40078
5.0625 2.14699 163.24356 1.23776 54.8489 51.5434 42.67685
5.4375 2.60552 170.54672 -1.05393 49.55866 47.57099 39.41094
5.8125 1.92621 177.99074 0.14905 47.17312 41.6445 37.19871
6.1875 1.02861 183.98132 -1.25764 43.6342 37.28055 35.00196
6.5625 -0.20403 188.22919 -1.45569 41.99131 35.00755 33.73519
6.9375 0.5629 192.30342 -1.23145 39.88786 31.66565 32.33715
7.3125 0.98473 194.13152 -0.80009 37.74306 29.46762 30.03827
7.6875 1.25362 195.53344 -1.19977 36.11107 28.86494 29.77654
8.0625 0.55969 197.44735 -1.5798 34.9973 27.40294 27.72762
8.4375 1.09259 198.22418 -1.03375 34.05774 26.89375 27.00718
8.8125 1.29391 200.05868 -0.82245 32.77992 26.35144 25.25058
9.1875 1.50032 201.6812 -1.43921 32.43773 25.24205 25.32378
9.5625 1.86743 203.50594 -1.07794 30.7332 24.69391 23.99456
9.9375 1.19339 203.86595 -1.15183 29.90294 24.65808 23.71068
10.3125 0.66285 206.16456 -0.71732 28.52455 23.54076 22.84312
10.6875 0.67428 208.1449 -0.68245 28.4417 22.1994 22.19973
11.0625 0.78978 208.93371 -0.66401 27.71547 21.53646 20.97287
11.4375 0.86902 209.1475 -0.51815 27.00191 19.9057 20.65684
11.8125 -0.41251 209.67523 -0.71649 26.26523 18.70585 20.26245
12.1875 -0.10905 209.20351 -1.13344 26.0767 17.99649 19.64861
12.5625 0.40017 208.7451 -0.59722 25.70596 18.18111 19.36006
12.9375 -0.24433 208.40941 -0.79136 24.86507 17.71332 18.73964
13.3125 -0.02523 208.36026 -0.22619 23.7671 17.94761 17.72839
13.6875 -0.20497 208.58564 -0.48963 22.32488 17.41054 17.15252
14.0625 0.72784 208.14088 -0.73172 22.76612 17.29569 16.55622
14.4375 1.0543 208.42979 -1.25772 21.69207 16.41548 16.0463
14.8125 -0.54628 209.03584 -0.96397 21.02245 16.14205 14.93932
15.1875 -0.79964 208.80784 -0.67869 20.57759 15.62645 15.02558
15.5625 -1.08422 210.08919 -0.07165 20.01292 15.80333 14.59431
15.9375 -0.75404 210.97717 -0.02844 18.95345 15.50654 14.14923
16.3125 -0.71388 212.1146 0.86385 18.26019 13.37267 14.07127
16.6875 -1.1334 211.14961 2.0948 18.2154 12.88972 13.68182
17.0625 -0.13793 210.8062 2.3507 17.78588 13.32688 12.44533
17.4375 0.54242 210.49399 2.17231 18.0895 12.35238 12.97092
17.8125 1.15138 209.88125 1.83035 17.83304 12.35794 12.49444
18.1875 0.44487 208.62365 2.49842 17.11248 11.70027 13.32809
18.5625 -0.79713 208.73909 0.87275 16.40299 12.37334 13.20343
18.9375 0.32492 208.64637 0.40881 16.2564 12.30843 13.20532
19.3125 -0.56328 209.59723 -0.42913 14.33983 11.52756 12.93949
19.6875 0.34286 209.14121 -1.32474 15.72906 11.14887 13.48361
20.0625 0.0209 208.65308 -0.37245 13.77424 10.76584 12.74478
20.4375 -0.16558 208.69546 -1.20028 13.94243 10.55739 12.68329
20.8125 0.47908 209.30436 -1.65948 13.12979 10.48505 12.2137
21.1875 0.41776 208.75347 -0.84162 13.35956 10.03879 11.7666
21.5625 0.39393 209.76873 -0.91569 13.44889 9.18825 11.22265
21.9375 0.42779 209.25593 0.41147 13.19124 9.74352 10.09392
22.3125 0.55181 208.42266 -1.5198 11.87478 9.13471 10.36391
22.6875 0.36036 207.30419 -1.08786 12.25745 8.74844 10.25368
23.0625 -1.35631 208.6898 -0.95784 11.26927 7.97622 9.90576
23.4375 -1.19551 207.53442 -2.55457 11.3923 7.77157 9.12451
23.8125 -2.25008 208.81236 -0.1959 10.88786 8.11671 9.1793
24.1875 -0.97354 208.61452 -1.57025 10.16374 7.19156 8.1882
24.5625 -1.125 208.07967 -0.4823 10.37169 7.27427 7.11764
24.9375 -1.1758 207.99353 -0.35896 10.03819 7.34557 7.63514
25.3125 0.81759 206.94824 -0.4385 9.43323 5.9882 6.95366
25.6875 -0.0206 206.25397 -0.26568 9.977 6.92607 7.24989
26.0625 -0.99364 205.26845 -1.05255 9.13607 7.22094 7.34239
26.4375 -1.42417 205.11265 -0.57618 8.70542 6.81689 8.09443
26.8125 0.00954 205.07631 -0.81146 10.60705 7.73484 8.21803
27.1875 -0.87947 206.27655 -1.59195 8.17463 5.65409 6.18522
27.5625 -1.53902 204.38536 -1.80049 8.66139 5.93249 6.58904
27.9375 -0.80313 205.20048 -0.43597 8.25986 5.93008 5.15084
28.3125 -2.72319 204.39816 -1.06886 7.49262 5.15562 6.48301
28.6875 0.19836 203.62461 1.65155 9.64924 5.68826 5.40613
29.0625 -0.67589 202.56275 2.83125 9.87894 5.68823 6.77183
29.4375 -0.45538 202.90534 -0.55022 7.42799 7.16818 4.84588
29.8125 0.39162 204.93141 1.33306 8.52284 5.05632 5.7161
