0.05000 -30050.54304 -2513.85997 172024.42583 19724.70737 17844.52141 3382058.93541
0.15000 -46967.60220 762.99918 -77388.56761 13902.46823 16447.27159 1521253.24020
0.25000 -47110.73524 492.68338 33823.88789 8328.87400 11235.28797 1656513.58523
0.35000 -42262.25550 -45.46325 64137.34906 5868.97658 7617.26542 1636378.17938
0.45000 -38007.16756 437.25246 66793.94888 5073.97642 6319.09063 1365524.34861
0.55000 -34116.18147 177.13529 10494.65156 4079.79386 4599.20372 1284509.13091
0.65000 -30749.25031 173.98138 43251.93806 3378.55160 3416.14110 1161928.42130
0.75000 -28038.57487 2.53855 24063.97392 2969.99842 2759.41770 1038224.87411
0.85000 -26160.46246 29.15133 19919.27237 2654.19858 2366.23811 920972.60044
0.95000 -24103.24792 43.15705 -6996.67958 2487.28801 2278.37260 798773.35585
1.05000 -22459.91920 -14.18544 -7243.97997 2596.44160 2093.73623 730265.75693
1.15000 -20941.97488 86.89918 -5949.18508 1973.42580 1791.61236 716013.67538
1.25000 -19616.21017 37.89374 -30813.20817 1771.64141 1667.42657 671817.25830
1.35000 -18605.66307 23.27632 -4310.30806 1741.40849 1442.77761 677697.53479
1.45000 -17539.25151 69.99879 14788.59451 1452.96546 1482.51736 616901.33619
1.55000 -16687.47970 47.16584 15387.76554 1358.89169 1508.80017 640843.26467
1.65000 -15791.49675 68.75799 -32939.17136 1416.60016 1337.69093 548449.72431
1.75000 -15000.78728 30.16550 -3440.74391 1452.89799 1495.17365 496940.95332
1.85000 -14328.75500 -23.70609 -8634.48079 1403.54578 1336.42418 490925.45152
1.95000 -13699.40652 78.99583 7803.15212 1673.68111 1548.42164 455460.56734
2.05000 -13220.53618 28.38674 -3336.32933 1004.20795 1270.58613 402173.26506
2.15000 -12805.79972 11.25152 7984.19568 1047.62171 1170.37342 431500.37072
2.25000 -12291.10336 10.97912 7675.79789 1151.00922 1301.97228 420880.55666
2.35000 -11907.94198 -21.16416 -15349.45173 949.16599 1306.71010 402582.52007
2.45000 -11526.47314 0.66827 -9434.85902 998.82513 1200.42647 369841.39267
2.55000 -11215.20049 19.02944 4887.26258 876.11198 1201.06039 357170.28873
2.65000 -10858.50327 8.15572 2490.72575 916.26879 1107.45731 340403.87708
2.75000 -10598.93207 -13.30893 -989.22913 858.70504 1180.70652 403054.49935
2.85000 -10290.62121 -35.92222 -3027.58697 1077.33273 994.98376 310726.77338
2.95000 -10042.60975 44.83517 3415.93426 744.31971 981.66531 291844.04109
3.05000 -9786.55101 -19.75502 -5545.73446 877.12769 949.32187 316737.82083
3.15000 -9572.49664 -12.57079 6216.43842 887.20105 939.61047 301782.71371
3.25000 -9368.66946 -13.28965 -1570.67005 750.45816 1005.37383 248214.21780
3.35000 -9191.54961 -19.99447 5773.65087 672.85336 990.23136 260223.87227
3.45000 -8983.95208 -1.08867 1122.68497 774.40728 949.95918 261362.42928
3.55000 -8821.26412 7.87422 -684.75656 678.24538 825.73498 219146.90474
3.65000 -8677.37041 -29.24934 -2030.51598 733.04243 809.91982 221960.58347
3.75000 -8522.18736 10.99294 2552.11731 683.51580 916.47302 202438.90591
3.85000 -8411.39412 -12.77807 5791.29178 665.96255 808.85591 185976.15531
3.95000 -8264.19077 -8.17310 -893.16626 867.14940 869.85872 181821.23253
4.05000 -8161.04354 7.61963 -5711.08253 802.62857 749.45825 183575.31496
4.15000 -8059.41633 27.79477 -1432.08873 664.34841 707.42141 185575.98500
4.25000 -7972.94426 -23.63018 3277.65670 768.80222 774.74168 152368.47433
4.35000 -7881.82705 -1.98744 -3605.52071 721.47960 753.13519 183280.33573
4.45000 -7816.98434 8.73988 3496.72432 560.20531 712.82690 148399.67072
4.55000 -7758.54523 21.42360 4294.93153 629.32531 701.99736 180179.30781
4.65000 -7692.15808 33.50949 1630.83279 554.60015 632.99054 137261.88250
4.75000 -7626.51413 5.02737 1650.20100 582.56934 614.72501 133007.72009
4.85000 -7566.61479 30.66938 1154.12889 580.64167 633.60876 132059.00089
4.95000 -7543.46483 18.96207 606.29729 697.48893 993.31608 136381.05515
5.05000 -7482.95809 20.37013 3657.23672 599.15288 578.08560 123465.91221
5.15000 -7417.76797 10.38249 -1183.92362 892.39974 813.13518 107329.01232
5.25000 -7381.68707 42.85793 3430.88027 559.35004 663.62880 107746.25236
5.35000 -7342.08149 30.95495 2548.02890 646.43703 593.92337 94030.04465
5.45000 -7288.54722 23.24556 469.75021 656.06517 585.25990 125582.77762
5.55000 -7242.86719 9.88060 2436.79091 481.49971 533.30884 99608.60932
5.65000 -7179.03244 12.70085 -2227.69769 488.25406 507.51232 98048.93692
5.75000 -7116.53674 30.97731 4871.08283 647.09585 497.56501 113664.68290
5.85000 -7061.28197 18.40868 269.47520 542.07190 500.45457 81070.78788
5.95000 -7009.82490 23.22259 -2307.93232 527.38690 514.05093 78783.92303
6.05000 -6965.33375 19.05994 1107.40303 758.88392 658.81917 80051.20584
6.15000 -6890.56992 19.81618 1158.76768 583.27263 524.26901 81857.28140
6.25000 -6853.01507 18.85008 -745.05032 518.08777 474.77242 77207.44202
6.35000 -6800.97392 19.62059 796.64834 453.84321 394.29433 74685.89121
6.45000 -6725.57618 17.57318 -1008.31186 465.83102 349.67831 79549.01607
6.55000 -6671.81210 5.72945 -996.14893 377.85346 364.23407 66455.25642
6.65000 -6611.72555 19.73839 175.44633 422.69815 446.55342 67587.93991
6.75000 -6564.68681 21.77758 -1194.95628 432.58867 492.06714 56241.42417
6.85000 -6497.90027 9.40846 644.56398 454.25475 753.16626 55761.46758
6.95000 -6439.85751 23.38509 366.55349 582.78503 492.25261 64805.91123
7.05000 -6369.65381 20.06355 2194.77822 345.64042 320.09760 53000.21706
7.15000 -6299.38624 23.74254 104.53397 429.23946 646.26650 63140.51185
7.25000 -6263.62066 10.75235 -397.96651 335.24615 303.23207 49679.96376
7.35000 -6190.19355 30.63491 494.14761 816.72724 661.22207 49384.53200
7.45000 -6172.66919 14.26648 1968.76878 450.63600 381.39135 45092.48117
7.55000 -6104.72171 12.22868 830.67565 387.72805 338.81755 43328.06728
7.65000 -6053.17785 9.45957 -155.16720 297.69705 310.79531 50337.40578
7.75000 -5997.47093 12.44432 -211.20967 315.85149 330.76231 45218.85862
7.85000 -5928.26364 20.05147 468.64630 365.36143 520.84664 34193.64725
7.95000 -5872.42083 16.48122 -1.16210 267.62219 280.56180 36674.70040
8.05000 -5817.81682 21.94981 1833.50380 494.63400 487.58710 40578.33136
8.15000 -5761.08738 7.59487 -1869.30096 388.90878 464.13664 40977.79641
8.25000 -5707.12863 15.16672 474.39195 462.56931 466.80359 38025.36860
8.35000 -5641.19412 -16.92762 -2464.09920 313.02888 770.22520 46756.86139
8.45000 -5597.23283 17.58918 -882.22217 241.57699 204.82139 36534.41551
8.55000 -5528.54077 10.42483 -538.80450 303.32170 297.07765 37477.38220
8.65000 -5468.65323 -1.69961 1831.44572 258.30374 243.61674 29836.42945
8.75000 -5420.92136 13.16228 -386.92439 270.40560 239.15864 37253.67561
8.85000 -5365.78121 3.41695 189.43269 268.43231 303.13233 39013.37536
8.95000 -5302.89569 -3.03946 -785.59908 256.42017 318.91726 37277.51662
9.05000 -5262.08864 7.13724 -1009.13936 198.11341 202.20615 33741.58543
9.15000 -5202.88303 8.78117 -54.13794 344.18687 305.89177 38238.76910
9.25000 -5174.10332 1.44296 -471.05867 337.09824 234.34453 27610.31693
9.35000 -5112.82443 1.84835 -3222.88857 234.79509 219.71553 26295.76035
9.45000 -5069.83959 10.61112 505.70751 218.41068 215.84852 35160.51747
9.55000 -5020.84224 0.63735 438.85001 207.20517 250.22001 21302.74271
9.65000 -4977.17260 -0.46666 -630.05209 208.03428 196.56986 30512.55169
9.75000 -4948.69017 -1.88163 424.12991 317.43517 263.56975 24079.42849
9.85000 -4883.06147 13.56351 573.80460 255.24624 328.57738 28315.86839
9.95000 -4858.65395 9.25315 95.13554 439.78891 416.30467 22491.49091
10.05000 -4815.91801 2.30861 -101.99317 240.57980 224.79165 23650.86274
10.15000 -4744.01324 6.71862 -1393.38798 514.01273 305.58937 22647.02321
10.25000 -4720.66388 0.57768 700.97008 233.80295 370.02718 25300.51687
10.35000 -4678.04075 10.35635 1016.56657 248.66779 161.47584 19007.74335
10.45000 -4633.16199 6.39714 226.22471 173.66983 155.52407 21125.83117
10.55000 -4593.99760 14.69467 -109.44624 232.00947 266.32604 20185.08097
10.65000 -4563.07491 -19.61766 -599.29210 232.34948 551.46053 17523.44712
10.75000 -4503.62467 13.42159 -196.51596 164.17100 381.25286 21152.40715
10.85000 -4470.42938 10.64250 362.79232 345.40146 217.73548 17611.37023
10.95000 -4440.14730 4.98285 -306.71677 195.09953 150.30265 20651.25910
11.05000 -4399.13288 8.83046 -214.34732 207.03684 225.05366 18676.58529
11.15000 -4340.93880 1.70818 -490.62662 437.98257 178.46113 17334.19560
11.25000 -4325.76299 0.97130 -164.00244 205.92890 134.58852 21032.38641
11.35000 -4295.75408 1.24551 88.63333 108.68839 106.41439 20816.12580
11.45000 -4270.67983 23.72517 640.75543 184.61118 374.42127 20599.70453
11.55000 -4237.84216 2.60694 -303.57361 204.08361 197.95804 13988.49453
11.65000 -4184.64002 -12.33150 -1036.07432 239.11573 512.95385 16180.27812
11.75000 -4178.21432 -8.01212 -755.06408 298.98757 218.90169 14291.20856
11.85000 -4112.91770 8.40168 -441.13651 159.31542 132.88768 15884.70305
11.95000 -4086.31637 4.28833 149.33896 295.80568 184.60938 19633.34231
12.05000 -4047.54244 -1.56385 -331.45873 292.26163 170.62649 13320.53761
12.15000 -4016.24212 9.68747 -129.81681 378.39423 127.88679 14175.06697
12.25000 -4008.01774 0.91260 18.30677 346.02387 169.59033 11842.94105
12.35000 -3960.82567 14.01785 485.60917 133.69952 129.12852 12875.49567
12.45000 -3930.61164 19.34233 -334.00535 181.30887 312.11520 14158.42122
12.55000 -3894.91974 4.39521 -267.25428 154.83177 144.00726 12840.66861
12.65000 -3857.71597 3.16873 -414.47686 225.39319 119.71643 15933.70361
12.75000 -3845.53908 -0.93951 -563.91769 122.61606 105.94455 11995.00880
12.85000 -3803.40855 10.16744 521.67646 141.50212 133.19581 15454.40763
12.95000 -3783.58681 1.92454 -417.97286 147.05936 121.58797 11980.33736
13.05000 -3735.70943 13.43375 -89.03244 211.54519 393.61697 9704.93072
13.15000 -3718.85326 0.93008 545.34504 109.20339 128.43697 14029.44126
13.25000 -3689.34173 -23.36619 -411.39770 227.96515 608.63059 14074.33382
13.35000 -3675.60598 3.06963 -345.10895 136.58281 141.99880 14338.88358
13.45000 -3654.89543 3.55233 697.36455 140.11751 91.15357 10359.29439
13.55000 -3621.70546 11.42507 660.33123 93.82656 124.06817 12219.54949
13.65000 -3593.99850 7.47311 -382.57522 217.29854 202.29078 9579.11918
13.75000 -3575.66314 -4.95058 -452.29403 186.30849 216.44022 11125.64032
13.85000 -3555.58763 1.89797 -105.33023 183.91859 351.34545 12581.95716
13.95000 -3527.04432 -1.00211 267.92148 230.02522 143.53352 12242.91240
14.05000 -3493.90099 1.18043 719.02810 102.77313 116.17993 9191.80342
14.15000 -3465.12019 4.55016 890.27261 174.12034 165.97119 9159.00285
14.25000 -3454.05366 11.63263 -252.47428 177.48429 113.37691 11290.73350
14.35000 -3425.16444 6.16833 430.04747 89.56832 91.43172 8773.92447
14.45000 -3392.61479 -21.65680 -342.23908 383.28657 719.95412 13667.03344
14.55000 -3381.23728 9.91179 500.70819 107.20483 137.27278 8328.22412
14.65000 -3361.18469 19.38976 745.13447 123.15465 458.26935 9172.94865
14.75000 -3343.23381 6.75034 -514.43367 201.75388 143.40043 6325.57449
14.85000 -3307.68828 -1.55538 543.68683 228.20097 81.46240 10042.17013
14.95000 -3281.68627 9.36245 797.56154 99.00738 124.11998 9473.06779
15.05000 -3255.45255 0.85560 -115.73316 77.02175 155.62893 10149.39747
15.15000 -3236.50106 0.33778 376.91784 81.44795 115.08443 7056.43082
15.25000 -3219.96920 2.33324 136.58096 95.52326 83.53015 6675.25765
15.35000 -3208.37735 15.24010 -50.25617 372.01867 279.05273 5956.45005
15.45000 -3192.38500 -19.11913 243.47473 332.33062 439.04251 5867.61300
15.55000 -3146.96041 1.27700 -256.14075 88.65577 62.98616 7547.16124
15.65000 -3129.45892 -0.24076 -199.29142 89.22058 120.17945 7152.45876
15.75000 -3104.16039 3.33074 226.60207 76.00626 69.60257 5155.41468
15.85000 -3090.20909 1.29756 854.37311 70.80235 86.50402 7023.83818
15.95000 -3069.48724 2.92064 -9.44737 133.33161 94.36043 8415.71241
16.05000 -3050.68119 0.75540 -314.84743 87.19595 75.03983 6274.12235
16.15000 -3024.85645 3.13950 257.62219 119.32505 69.25847 6022.45964
16.25000 -3003.15439 5.55028 -597.32382 71.08311 163.18371 5849.19855
16.35000 -2992.76461 -11.00939 341.25779 233.30621 412.35019 6810.98069
16.45000 -2969.98334 4.67874 -26.82601 465.49989 350.38313 5223.86903
16.55000 -2949.68282 3.44436 515.57315 66.63910 62.99008 7563.05401
16.65000 -2932.34888 1.92382 243.86893 63.64788 87.44848 6800.65378
16.75000 -2906.67332 4.79583 -613.96267 102.51960 54.99837 7268.12866
16.85000 -2885.82377 0.84379 137.33082 119.01043 80.44541 4648.03482
16.95000 -2872.26750 -0.88114 120.75809 59.81914 48.77892 6022.60673
17.05000 -2860.36355 3.87736 -293.78586 103.70813 72.59193 5296.57606
17.15000 -2829.08273 2.17275 -215.48781 82.09806 67.91491 5417.82676
17.25000 -2819.70373 5.98735 536.98417 60.30766 294.11517 5049.29111
17.35000 -2793.65495 5.12108 286.66227 81.26360 105.50571 7803.52439
17.45000 -2783.19587 6.43969 -82.50821 93.43570 185.47584 5215.49865
17.55000 -2755.10706 -9.05729 112.90886 107.00179 176.68853 4401.42776
17.65000 -2747.16854 1.84630 -229.06200 88.68078 82.51739 12074.46542
17.75000 -2724.42930 3.86999 -206.42855 76.29945 63.66964 4426.67436
17.85000 -2716.24946 -2.70405 465.83728 69.45978 68.22697 6978.68082
17.95000 -2695.16409 -0.63558 140.37010 90.65583 62.75115 5030.77823
18.05000 -2679.84139 3.57920 -144.88996 51.81796 54.66340 5380.93561
18.15000 -2662.18907 -0.88256 -538.81093 57.69451 53.45917 8078.92547
18.25000 -2649.02704 2.09867 -42.03954 60.88589 64.22247 5396.27403
18.35000 -2624.25784 4.04798 -14.54262 56.25912 46.47614 6527.29191
18.45000 -2620.42107 4.08859 -278.31965 154.80497 126.56938 5008.58189
18.55000 -2597.56294 5.34705 -118.77569 61.08580 68.94632 3731.80782
18.65000 -2574.31862 -1.94660 371.87314 104.27426 211.96512 4326.68698
18.75000 -2573.99834 15.20899 -43.26802 378.97545 360.86694 5742.59593
18.85000 -2551.17438 -1.72601 292.14347 46.43875 51.15463 3449.35796
18.95000 -2522.70020 -2.64011 383.54134 82.21963 50.82791 3916.35646
19.05000 -2512.84264 1.54803 62.00932 75.76711 54.10060 3503.40674
19.15000 -2500.62099 2.67850 244.81300 39.37017 50.67269 3916.97793
19.25000 -2484.20596 2.89348 -125.76944 53.25833 56.73910 4674.93114
19.35000 -2470.49170 -1.51567 210.66998 42.72425 41.68557 3614.41814
19.45000 -2479.58612 16.78825 487.30797 497.66009 185.99629 3895.96777
19.55000 -2442.65320 -3.59174 -232.21884 85.81385 72.36399 4420.42944
19.65000 -2436.38899 7.47204 -44.46084 132.21595 81.78318 5040.38279
19.75000 -2433.65402 6.53963 -250.89425 169.73576 122.96115 2513.24770
19.85000 -2403.34682 5.07030 -109.59901 71.11294 65.71348 3033.21149
19.95000 -2387.09697 8.87540 241.82157 51.97094 60.01237 2739.41737
