0.120000 1.307060
0.380000 1.040690
0.620000 1.258780
0.880000 -1.361540
1.120000 -2.391500
1.380000 2.696320
1.620000 0.281150
1.880000 -2.175960
2.120000 2.485900
2.380000 1.704920
2.620000 -1.148910
2.880000 -0.093440
3.120000 -0.171310
3.380000 0.180230
3.620000 0.484120
3.880000 -0.297290
4.120000 -0.167040
4.380000 0.099620
4.620000 -0.820090
4.880000 -0.595730
5.120000 -1.389580
5.380000 -0.842550
5.620000 -1.215620
5.880000 -0.873800
6.120000 -1.197360
6.380000 -1.753060
6.620000 -1.665540
6.880000 -3.102560
7.120000 -2.565210
7.380000 2.458380
7.620000 -2.279290
7.880000 0.010250
8.120000 -2.175880
8.380000 2.502340
8.620000 -2.777610
8.880000 2.858120
9.120000 3.135710
9.380000 -2.784220
9.620000 2.674710
9.880000 2.999180
10.120000 -3.127240
10.380000 -2.998680
10.620000 -1.747660
10.880000 -2.223990
11.120000 -2.466380
11.380000 -2.103610
11.620000 3.032650
11.880000 -2.521210
12.120000 3.024270
12.380000 -2.245390
12.620000 -0.683980
12.880000 -1.492420
13.120000 -2.630330
13.380000 0.585070
13.620000 2.299230
13.880000 0.383280
14.120000 -1.686120
14.380000 1.337340
14.620000 -0.973630
14.880000 -2.372880
15.120000 -1.523150
15.380000 0.450050
15.620000 -1.182080
15.880000 0.321970
16.120000 -2.287870
16.380000 -1.623100
16.620000 -1.533190
16.880000 -1.133290
17.120000 -0.882180
17.380000 0.349570
17.620000 -0.686220
17.880000 3.135380
18.120000 -1.018410
18.380000 -1.425350
18.620000 0.760980
18.880000 -2.455880
19.120000 -1.977960
19.380000 2.425040
19.620000 2.230010
19.880000 2.607780
