0.125 -0.000 -0.000 0.001
0.375 0.002 0.001 0.034
0.625 0.005 0.001 0.177
0.875 -0.005 0.004 0.531
1.125 -0.016 0.025 1.094
1.375 -0.031 0.031 1.936
1.625 -0.042 0.034 3.057
1.875 -0.053 0.058 4.281
2.125 -0.082 0.070 5.653
2.375 -0.108 0.061 7.037
2.625 -0.147 0.092 8.371
2.875 -0.123 0.129 9.806
3.125 -0.200 0.140 11.216
3.375 -0.208 0.133 12.642
3.625 -0.214 0.132 14.111
3.875 -0.215 0.124 15.357
4.125 -0.257 0.182 16.651
4.375 -0.271 0.195 17.916
4.625 -0.342 0.171 19.287
4.875 -0.362 0.127 20.342
5.125 -0.386 0.132 21.524
5.375 -0.381 0.102 22.404
5.625 -0.407 0.088 23.323
5.875 -0.441 0.110 23.922
6.125 -0.352 0.073 25.023
6.375 -0.372 0.074 25.290
6.625 -0.360 0.105 25.611
6.875 -0.436 0.089 26.033
7.125 -0.371 0.116 26.485
7.375 -0.333 0.104 26.309
7.625 -0.321 0.055 26.634
7.875 -0.358 0.148 25.946
8.125 -0.307 0.125 25.995
8.375 -0.381 0.122 25.754
8.625 -0.352 0.120 24.980
8.875 -0.371 0.071 24.962
9.125 -0.381 0.051 24.762
9.375 -0.355 0.007 24.338
9.625 -0.381 0.046 24.169
9.875 -0.353 -0.011 24.240
10.125 -0.344 -0.012 23.297
10.375 -0.280 0.009 23.242
10.625 -0.324 -0.036 22.184
10.875 -0.234 -0.050 21.781
11.125 -0.258 -0.033 22.079
11.375 -0.210 -0.017 21.061
11.625 -0.290 0.021 21.157
11.875 -0.273 -0.022 20.455
12.125 -0.226 0.027 19.648
12.375 -0.211 0.000 18.632
12.625 -0.221 -0.017 18.402
12.875 -0.213 -0.022 17.856
13.125 -0.214 -0.011 17.832
13.375 -0.221 -0.003 17.741
13.625 -0.214 -0.019 17.516
13.875 -0.205 -0.018 16.386
14.125 -0.166 -0.041 15.389
14.375 -0.161 -0.041 14.248
14.625 -0.129 -0.024 12.871
14.875 -0.102 -0.052 12.579
