0.2 -0.39805 25.02425 1.21316 141.37994 137.4397 136.22629
0.6 -1.25054 53.0366 -0.22156 119.85794 104.49989 105.2783
1.0 -1.3585 66.77535 -0.53479 105.81575 89.1904 88.49248
1.4 0.43672 79.323 -0.25895 94.02939 83.33445 78.43996
1.8 1.19871 98.2203 -0.29416 82.33151 81.459 72.44215
2.2 0.24958 121.34461 -0.51452 71.9491 76.13999 66.23958
2.6 -0.41113 140.70745 -0.2384 63.0447 66.66932 60.17351
3.0 -0.36655 155.46559 0.28839 56.73893 56.86867 54.21951
3.4 -0.7605 165.2389 -0.3241 52.93988 48.08637 49.65648
3.8 -0.30647 171.26901 -0.03201 50.22235 42.32113 45.46868
4.2 -0.36197 175.89847 -0.6723 47.91726 39.67197 42.80392
4.6 -0.49144 179.42082 0.02317 46.2039 37.82192 40.70036
5.0 -0.10898 183.09788 -0.31835 43.63683 36.34764 38.85055
5.4 -0.01414 187.20483 0.35039 42.29982 34.97221 37.08588
5.8 0.27644 190.2631 -0.21476 40.54414 33.23904 35.46235
6.2 0.27046 193.11635 0.20109 39.47744 31.95185 33.60549
6.6 0.96058 195.06059 0.38353 38.35072 31.09411 32.19853
7.0 0.31715 198.11173 0.13164 37.08837 29.72989 30.9993
7.4 0.14573 200.18457 -0.24649 35.87113 29.10034 29.50509
7.8 -0.33842 202.33639 0.22963 34.4151 28.46512 28.69582
8.2 -0.07814 205.09498 0.15472 34.00676 27.12197 27.45653
8.6 -0.30043 206.938 0.54912 33.18131 25.68244 26.58014
9.0 -0.02765 208.36408 0.33443 32.19498 24.23244 25.65016
9.4 -0.58918 208.97754 0.64419 31.30892 22.93167 24.74501
9.8 -0.27002 209.18635 0.50618 30.50412 22.15526 24.22168
10.2 -0.26469 209.5266 0.45609 29.79635 21.63337 23.35318
10.6 -0.01605 209.84231 0.24355 28.44101 20.96202 22.53732
11.0 -0.47917 209.95358 0.34687 27.70945 20.44504 21.73361
11.4 0.28148 210.65588 -0.20392 27.25882 20.66365 20.87646
11.8 -0.20932 210.86648 -0.60728 26.1441 19.83271 19.83984
12.2 -0.82053 211.35215 -0.56597 25.60118 19.49443 19.03848
12.6 -1.31234 211.38226 -1.39675 24.92509 19.09482 18.52962
13.0 -1.37365 212.09504 -1.17394 24.0838 18.54207 17.92679
13.4 -1.70997 212.75253 -1.46775 23.48121 18.44132 16.98973
13.8 -1.45986 213.05026 -1.4048 23.46909 17.47232 16.82613
14.2 -1.29933 212.97155 -1.55785 23.16178 17.17318 15.90263
14.6 -1.11895 213.35013 -1.48891 23.16222 16.77998 15.70125
15.0 -1.0007 213.06848 -0.79088 23.31063 16.22646 15.10114
15.4 -0.21158 212.66224 -0.6053 23.08558 15.69862 14.61178
15.8 -0.61766 212.56229 -0.30847 23.21528 14.63759 14.07624
16.2 0.50021 212.14637 0.33387 22.4025 13.72061 13.78635
16.6 0.48011 210.9606 0.88142 21.60659 13.14612 13.56114
17.0 -0.17883 209.88458 1.16759 20.82999 13.53724 13.36417
17.4 0.25551 208.96231 1.57733 19.35453 14.13914 12.81224
17.8 -0.33703 209.18441 2.03025 17.90268 13.95209 12.82305
18.2 -0.10427 208.88306 1.83275 17.11782 13.86448 12.23661
18.6 0.30636 209.47566 1.58085 16.17388 13.80537 11.9334
19.0 0.4927 210.13732 0.96687 15.51131 13.01068 11.70498
19.4 0.1854 210.37663 1.2481 15.58881 12.12036 11.23282
19.8 0.27545 209.95046 1.14054 15.17501 11.69372 10.7013
