0.05000 1870.38082
0.15000 3141.95355
0.25000 4353.47160
0.35000 5810.47926
0.45000 6721.71436
0.55000 7570.64176
0.65000 8329.88646
0.75000 8496.39604
0.85000 8680.16196
0.95000 8713.72550
1.05000 8644.71518
1.15000 8644.56204
1.25000 8407.29300
1.35000 8187.47902
1.45000 8049.71190
1.55000 7763.31222
1.65000 7503.11981
1.75000 7230.89633
1.85000 7102.83179
1.95000 6752.00370
2.05000 6454.73926
2.15000 6145.26266
2.25000 5953.19511
2.35000 5746.58846
2.45000 5518.73286
2.55000 5345.30358
2.65000 5175.61603
2.75000 4995.37476
2.85000 4790.36500
2.95000 4610.10349
3.05000 4524.36471
3.15000 4311.49065
3.25000 4204.67102
3.35000 4095.33226
3.45000 3930.21091
3.55000 3914.36496
3.65000 3714.39758
3.75000 3620.92896
3.85000 3527.21849
3.95000 3447.97577
4.05000 3411.23023
4.15000 3327.05574
4.25000 3216.30280
4.35000 3098.86737
4.45000 3060.79461
4.55000 2998.25979
4.65000 2867.62695
4.75000 2839.19782
4.85000 2756.80206
4.95000 2660.05398
5.05000 2658.14312
5.15000 2576.80398
5.25000 2471.04807
5.35000 2407.70979
5.45000 2350.80803
5.55000 2239.43460
5.65000 2152.57304
5.75000 2091.92552
5.85000 2047.56675
5.95000 1908.11362
6.05000 1874.52344
6.15000 1788.13946
6.25000 1713.21081
6.35000 1673.01211
6.45000 1590.95899
6.55000 1533.89145
6.65000 1493.49195
6.75000 1424.57453
6.85000 1390.40162
6.95000 1327.20270
7.05000 1249.30517
7.15000 1216.47982
7.25000 1197.18077
7.35000 1119.86323
7.45000 1104.54666
7.55000 1069.06896
7.65000 1033.96914
7.75000 1012.11300
7.85000 976.26342
7.95000 964.08963
8.05000 951.19545
8.15000 934.79434
8.25000 908.36875
8.35000 883.72856
8.45000 870.26740
8.55000 849.13573
8.65000 835.75731
8.75000 820.66954
8.85000 806.11692
8.95000 795.45111
9.05000 777.90267
9.15000 759.70936
9.25000 727.26232
9.35000 733.56147
9.45000 723.85219
9.55000 700.79995
9.65000 679.16937
9.75000 683.10708
9.85000 652.50720
9.95000 654.31394
10.05000 639.02446
10.15000 621.67635
10.25000 609.89096
10.35000 620.49332
10.45000 595.10670
10.55000 584.49434
10.65000 573.36618
10.75000 557.63367
10.85000 561.21696
10.95000 551.35314
11.05000 529.98217
11.15000 527.98310
11.25000 519.96556
11.35000 498.85421
11.45000 504.98740
11.55000 483.80475
11.65000 481.97739
11.75000 480.29721
11.85000 466.09748
11.95000 463.55194
12.05000 448.21786
12.15000 441.00255
12.25000 439.44913
12.35000 436.20688
12.45000 426.69194
12.55000 406.73245
12.65000 401.97025
12.75000 400.12130
12.85000 388.42676
12.95000 391.51529
13.05000 382.07688
13.15000 364.69247
13.25000 371.63086
13.35000 356.59710
13.45000 343.66931
13.55000 345.34378
13.65000 338.44475
13.75000 330.62376
13.85000 322.09139
13.95000 317.00211
14.05000 308.82598
14.15000 297.80752
14.25000 293.63503
14.35000 291.06055
14.45000 278.90363
14.55000 283.19390
14.65000 279.28834
14.75000 272.56962
14.85000 267.18461
14.95000 261.23527
15.05000 256.93049
15.15000 255.56151
15.25000 245.47386
15.35000 241.33221
15.45000 247.53933
15.55000 243.44079
15.65000 237.42275
15.75000 235.39163
15.85000 220.47737
15.95000 232.37245
16.05000 228.89853
16.15000 216.50312
16.25000 218.65332
16.35000 214.23442
16.45000 212.64952
16.55000 204.42765
16.65000 200.65873
16.75000 199.50374
16.85000 195.50148
16.95000 201.47927
17.05000 190.36352
17.15000 183.46427
17.25000 181.92938
17.35000 177.14423
17.45000 178.14753
17.55000 175.01662
17.65000 177.43667
17.75000 169.73277
17.85000 169.12634
17.95000 162.54044
18.05000 157.37140
18.15000 160.69506
18.25000 155.33951
18.35000 148.48840
18.45000 152.19919
18.55000 148.40253
18.65000 141.28805
18.75000 143.64634
18.85000 138.28595
18.95000 127.00310
19.05000 140.22593
19.15000 127.85699
19.25000 136.01381
19.35000 126.30851
19.45000 126.12777
19.55000 125.88129
19.65000 129.56333
19.75000 119.81592
19.85000 122.78134
19.95000 107.63374
