0.450000 1.098780
1.350000 1.336610
2.250000 1.426550
3.150000 1.466900
4.050000 1.416960
4.950000 1.286770
5.850000 1.080930
6.750000 1.076860
7.650000 0.718210
8.550000 0.297460
9.450000 0.004880
10.350000 -0.558140
11.250000 -1.153570
12.150000 -1.618870
13.050000 -1.544200
13.950000 -1.842010
14.850000 0.778800
15.750000 -0.762140
16.650000 -1.624240
17.550000 -2.713800
