0.12500 0.05580
0.37500 0.13109
0.62500 0.21090
0.87500 0.24401
1.12500 0.28234
1.37500 0.31008
1.62500 0.33581
1.87500 0.36347
2.12500 0.37056
2.37500 0.36351
2.62500 0.33734
2.87500 0.30304
3.12500 0.27562
3.37500 0.24819
3.62500 0.22188
3.87500 0.21026
4.12500 0.16952
4.37500 0.13286
4.62500 0.10904
4.87500 0.08049
5.12500 0.06151
5.37500 0.04114
5.62500 0.03894
5.87500 0.03702
6.12500 0.03320
6.37500 0.03773
6.62500 0.03846
6.87500 0.04291
7.12500 0.04556
7.37500 0.03597
7.62500 0.02071
7.87500 0.01588
8.12500 0.02969
8.37500 0.03295
8.62500 0.03386
8.87500 0.04079
9.12500 0.03483
9.37500 0.03398
9.62500 0.04394
9.87500 0.05100
10.12500 0.05814
10.37500 0.07363
10.62500 0.08642
10.87500 0.09988
11.12500 0.10325
11.37500 0.09845
11.62500 0.06323
11.87500 0.07033
12.12500 0.05790
12.37500 0.05731
12.62500 0.05195
12.87500 0.03058
13.12500 0.01023
13.37500 0.04304
13.62500 0.03887
13.87500 0.02927
14.12500 0.05232
14.37500 0.04248
14.62500 0.04708
14.87500 0.05523
