0.2 1.11843 17.85328 0.50887 108.78841 106.17519 89.43815
0.6 0.43307 39.75343 0.42092 106.17501 100.34601 86.95288
1.0 -0.2785 59.03067 0.18436 105.17049 92.70096 82.67615
1.4 -1.27472 71.44721 0.55805 103.58634 86.96437 79.05305
1.8 -0.66437 82.09687 1.07327 101.33147 84.01968 75.72136
2.2 0.38442 91.87524 1.23084 99.44672 82.31788 71.87021
2.6 0.44162 99.02811 1.85732 98.08019 78.92708 67.85931
3.0 -0.63222 104.95763 2.40783 95.2485 75.97652 63.99715
3.4 0.84015 111.51971 2.79356 92.10479 73.48358 60.53599
3.8 0.61989 116.10409 2.76015 88.13412 68.90597 57.61326
4.2 1.75884 122.60069 1.80433 85.06142 65.23674 55.2604
4.6 0.54499 129.01808 0.25814 80.15303 63.11248 52.69886
5.0 -0.77005 137.44586 -0.24349 75.82768 60.71743 49.5301
5.4 -0.87582 145.39204 -1.52031 70.36864 58.17572 45.72386
5.8 -1.94429 151.01661 -2.34685 63.70356 56.64068 43.63306
6.2 -0.96679 159.30587 -3.23166 56.21572 54.02857 40.93362
6.6 -1.69596 167.2367 -2.6308 50.09336 51.07886 38.31672
7.0 -1.83786 176.46254 -1.00322 45.22908 45.16524 35.52118
7.4 -1.40754 183.91595 -0.8074 41.53474 38.47412 33.09302
7.8 -1.94352 188.94984 -1.25696 38.60195 33.30445 31.03082
8.2 -1.91127 191.16022 -1.35248 36.3055 30.40796 29.06601
8.6 -1.98493 192.59193 -1.54785 34.46687 29.02325 27.7266
9.0 -1.93774 194.70631 -1.23488 33.08464 27.91269 26.40275
9.4 -1.33622 196.34278 -1.37145 31.82917 26.88732 25.19113
9.8 -0.97205 198.89016 -0.98036 30.49386 25.66369 24.02629
10.2 -0.62473 201.08181 -0.75705 29.79018 23.71193 22.88118
10.6 -0.07939 202.69025 -0.76738 28.74313 22.63476 21.93924
11.0 -0.03166 202.92617 -0.59721 27.20876 21.51886 21.00911
11.4 0.80805 203.78693 -0.75895 26.38061 21.38392 19.86895
11.8 0.49913 204.63666 -0.3442 25.53064 20.79851 19.46656
12.2 0.64017 205.61428 -0.03273 24.5354 20.11719 19.15436
12.6 0.55696 206.31927 -0.11553 23.75647 18.97361 18.56973
13.0 0.93693 206.8775 -0.12994 23.35489 17.76019 17.6843
13.4 0.8585 206.99135 -0.43208 22.22568 17.09904 17.15105
13.8 1.03554 206.8636 0.19394 21.58161 16.65736 16.77892
14.2 0.58307 207.49025 -0.08771 21.19796 16.9668 16.30398
14.6 1.09682 208.3715 -0.10694 20.0342 16.84878 15.59067
15.0 1.0698 209.82485 0.13209 20.08683 16.2169 15.29148
15.4 1.12438 210.72901 0.23326 19.35429 15.12052 14.97778
15.8 1.29899 211.26438 -0.42128 19.51211 13.67446 14.75625
16.2 1.8514 210.71267 -0.25778 19.09516 12.54294 14.41199
16.6 1.67788 209.8268 -0.44402 18.92427 11.69576 14.4123
17.0 1.32339 208.86187 -0.39024 18.27535 11.44314 14.10315
17.4 1.00357 208.305 -0.43384 17.75285 11.66847 13.36293
17.8 1.47185 207.42225 -0.51615 17.31649 12.04661 13.28641
18.2 0.65711 207.32594 -0.73248 16.75218 12.62393 12.51717
18.6 0.64916 207.02787 -0.10063 15.92139 12.92632 12.01743
19.0 0.10962 207.11123 0.21066 15.39777 12.85992 11.27583
19.4 -0.79256 207.06672 0.32472 15.62937 12.54378 11.18269
19.8 -0.68647 207.9063 0.23171 15.18017 11.79145 10.72476
