0.120000 -2.574310
0.380000 0.130930
0.620000 -2.657030
0.880000 -2.660050
1.120000 -2.708070
1.380000 -2.910500
1.620000 -2.962940
1.880000 -3.014330
2.120000 -2.932780
2.380000 -3.015750
2.620000 -3.037360
2.880000 -3.071870
3.120000 -3.055150
3.380000 -3.120260
3.620000 -3.082200
3.880000 -3.021650
4.120000 -2.981180
4.380000 -2.903510
4.620000 -2.824280
4.880000 -2.820110
5.120000 -2.881210
5.380000 -2.959740
5.620000 -3.135340
5.880000 2.908710
6.120000 3.091820
6.380000 2.894060
6.620000 2.645830
6.880000 2.504090
7.120000 2.662990
7.380000 2.657650
7.620000 2.592850
7.880000 -3.107480
8.120000 2.898680
8.380000 2.708570
8.620000 2.829190
8.880000 2.453760
9.120000 2.861310
9.380000 2.820050
9.620000 2.964650
9.880000 2.663590
10.120000 2.401670
10.380000 2.330120
10.620000 1.971400
10.880000 1.488090
11.120000 1.415290
11.380000 1.238600
11.620000 1.139300
11.880000 1.007560
12.120000 0.585190
12.380000 0.838180
12.620000 0.709750
12.880000 0.402270
13.120000 1.249580
13.380000 0.795950
13.620000 -0.114660
13.880000 0.200720
14.120000 -0.407050
14.380000 -0.162080
14.620000 -0.201470
14.880000 -0.396820
