0.125 -0.000 0.001 0.002
0.375 -0.001 -0.002 0.060
0.625 -0.015 -0.001 0.355
0.875 -0.044 -0.014 1.018
1.125 -0.069 -0.041 1.886
1.375 -0.100 -0.013 2.677
1.625 -0.164 -0.056 3.503
1.875 -0.171 0.003 4.019
2.125 -0.194 -0.045 4.718
2.375 -0.265 -0.073 5.170
2.625 -0.287 -0.129 5.787
2.875 -0.320 -0.089 6.341
3.125 -0.342 -0.127 6.795
3.375 -0.356 -0.109 7.363
3.625 -0.379 -0.085 7.703
3.875 -0.423 -0.127 8.143
4.125 -0.402 -0.098 8.362
4.375 -0.400 -0.106 8.852
4.625 -0.487 -0.169 9.071
4.875 -0.456 -0.114 9.440
5.125 -0.460 -0.111 9.652
5.375 -0.546 -0.144 9.840
5.625 -0.533 -0.130 10.352
5.875 -0.543 -0.111 10.702
6.125 -0.527 -0.112 11.471
6.375 -0.607 -0.110 12.608
6.625 -0.655 -0.156 14.306
6.875 -0.741 -0.147 15.598
7.125 -0.885 -0.254 17.793
7.375 -0.882 -0.194 19.535
7.625 -0.969 -0.278 21.322
7.875 -1.045 -0.328 22.603
8.125 -1.057 -0.289 23.328
8.375 -1.050 -0.268 23.499
8.625 -1.039 -0.302 22.344
8.875 -1.045 -0.282 22.248
9.125 -0.941 -0.265 21.158
9.375 -0.902 -0.247 20.557
9.625 -0.865 -0.268 19.379
9.875 -0.835 -0.202 18.435
10.125 -0.772 -0.167 18.247
10.375 -0.794 -0.227 18.408
10.625 -0.803 -0.185 17.796
10.875 -0.851 -0.159 18.241
11.125 -0.915 -0.180 19.305
11.375 -0.853 -0.166 19.734
11.625 -0.969 -0.141 20.484
11.875 -0.978 -0.171 20.664
12.125 -0.982 -0.154 20.754
12.375 -0.994 -0.149 21.288
12.625 -0.971 -0.181 21.238
12.875 -1.008 -0.203 20.847
13.125 -0.946 -0.155 20.336
13.375 -0.944 -0.136 19.297
13.625 -0.889 -0.148 18.100
13.875 -0.862 -0.157 17.039
14.125 -0.830 -0.167 16.299
14.375 -0.754 -0.149 15.424
14.625 -0.683 -0.169 14.411
14.875 -0.661 -0.131 14.047
