0.12500 0.01889
0.37500 0.02593
0.62500 0.02276
0.87500 0.01478
1.12500 0.01903
1.37500 0.04748
1.62500 0.04381
1.87500 0.03837
2.12500 0.04895
2.37500 0.06822
2.62500 0.08257
2.87500 0.08857
3.12500 0.09415
3.37500 0.08509
3.62500 0.07564
3.87500 0.07657
4.12500 0.05786
4.37500 0.05488
4.62500 0.04875
4.87500 0.04227
5.12500 0.03759
5.37500 0.04955
5.62500 0.05025
5.87500 0.05747
6.12500 0.05447
6.37500 0.04628
6.62500 0.05178
6.87500 0.04066
7.12500 0.03218
7.37500 0.03322
7.62500 0.02063
7.87500 0.01844
8.12500 0.01325
8.37500 0.01642
8.62500 0.02035
8.87500 0.01751
9.12500 0.02366
9.37500 0.03627
9.62500 0.02590
9.87500 0.04370
10.12500 0.04100
10.37500 0.03245
10.62500 0.04361
10.87500 0.03993
11.12500 0.03349
11.37500 0.04801
11.62500 0.02618
11.87500 0.02981
12.12500 0.01099
12.37500 0.03109
12.62500 0.02207
12.87500 0.03204
13.12500 0.02224
13.37500 0.04695
13.62500 0.03548
13.87500 0.03145
14.12500 0.04884
14.37500 0.04274
14.62500 0.04192
14.87500 0.05003
15.12500 0.02693
15.37500 0.01865
15.62500 0.05230
15.87500 0.03029
16.12500 0.03249
16.37500 0.01855
16.62500 0.02717
16.87500 0.01567
17.12500 0.02685
17.37500 0.00205
17.62500 0.01304
17.87500 0.01918
18.12500 0.02078
18.37500 0.00446
18.62500 0.02918
18.87500 0.00976
19.12500 0.01111
19.37500 0.00446
19.62500 0.02140
19.87500 0.02394
