0.05000 -1047.01492 -377.55211 328.55616 2677.57786 3303.34263 1897.69974
0.15000 -2770.04102 126.06828 -217.78046 2753.13198 3000.80891 3649.00187
0.25000 -4307.03888 -21.00716 139.55655 2752.15054 2842.30027 5948.29956
0.35000 -5926.88321 122.52380 -309.28863 2742.79890 2627.17819 7202.68135
0.45000 -7034.36442 55.32377 -331.36628 2851.45423 2602.11621 8383.50361
0.55000 -7900.09805 34.46054 13.31265 2911.38777 2607.85759 9229.01694
0.65000 -8428.15907 -25.45341 -45.14510 2970.79040 2585.58474 9993.09843
0.75000 -9105.89208 47.67342 -288.49262 2912.49631 2541.76541 10233.79317
0.85000 -9688.67985 56.97159 -45.96540 2962.55212 2517.45611 10135.50702
0.95000 -9984.46977 64.68443 121.72298 3050.57098 2485.38652 10306.22830
1.05000 -10231.37546 39.93503 -205.28571 2925.79751 2480.71918 10161.64175
1.15000 -10462.69917 72.60339 -46.14810 2917.28680 2447.42099 9935.28398
1.25000 -10571.16115 78.03846 -155.54341 2854.20637 2413.74293 9639.73135
1.35000 -10634.61105 65.73588 84.17512 2687.31159 2379.45440 9257.46633
1.45000 -10578.24197 42.04783 -175.09110 2611.06424 2357.99509 9039.05461
1.55000 -10613.89255 73.77541 143.98622 2428.66615 2307.64996 8568.36482
1.65000 -10615.58094 43.63290 -14.02205 2296.38031 2289.54561 8126.45471
1.75000 -10496.59596 -61.51137 -41.42667 2183.37395 2282.55592 7907.33163
1.85000 -10380.29880 -18.03191 -7.36737 2129.80547 2182.37390 7602.74907
1.95000 -10320.82984 -50.02809 67.92719 1924.33691 2149.17880 7235.30283
2.05000 -10151.79734 -105.09390 -32.64740 1875.19339 2102.99014 7010.32071
2.15000 -10026.03906 -119.80932 91.35205 1777.34476 2044.30119 6743.94172
2.25000 -9938.63463 -113.14817 60.51507 1686.72367 2013.98145 6440.05292
2.35000 -9832.79971 -117.98495 178.82427 1580.26338 1951.25288 6232.18799
2.45000 -9779.57248 -169.28315 35.93455 1512.50887 1906.09136 5941.40983
2.55000 -9612.50281 -113.33150 53.41665 1477.73184 1858.95646 5841.94658
2.65000 -9529.14769 -70.76960 81.71792 1374.41377 1810.98921 5583.68830
2.75000 -9403.74588 -51.79603 119.40749 1372.03089 1764.58247 5407.40063
2.85000 -9325.14976 -33.95164 -31.85819 1292.24592 1701.89290 5204.81307
2.95000 -9227.85109 -3.08389 41.22200 1244.09256 1667.31210 5011.11016
3.05000 -9105.83587 -14.68352 78.45210 1236.50879 1595.27006 4883.61425
3.15000 -9027.90633 16.80779 92.26907 1186.50073 1544.73297 4705.27874
3.25000 -8929.47869 16.47473 23.72034 1173.61921 1487.79943 4565.23867
3.35000 -8799.26700 -15.07963 46.47832 1166.68610 1432.09461 4466.83204
3.45000 -8713.35679 -33.88332 134.17733 1084.66405 1390.12012 4252.34716
3.55000 -8560.55167 22.41765 77.87690 1092.51189 1310.84621 4188.67252
3.65000 -8425.71800 3.59408 2.47858 1066.99002 1273.13182 4097.60279
3.75000 -8332.73110 3.16069 -14.46409 1026.21111 1214.23499 3922.01944
3.85000 -8251.02093 -6.03525 -40.89810 993.71881 1181.58549 3803.86724
3.95000 -8151.14351 -11.62284 -48.26017 961.08141 1127.98825 3671.81273
4.05000 -8045.02700 8.98091 -12.37272 939.19098 1076.06241 3598.72818
4.15000 -7933.39336 -3.74711 48.36556 938.66446 1028.59799 3502.74171
4.25000 -7864.12575 10.56722 -8.74575 890.66964 987.93236 3343.24757
4.35000 -7778.78337 10.87263 35.14690 892.84115 945.98792 3212.77081
4.45000 -7653.93572 4.99494 36.97170 873.62777 901.59217 3192.75725
4.55000 -7548.23436 39.97493 16.05585 850.03782 858.12999 3047.07916
4.65000 -7439.65402 20.12465 80.45718 842.88390 820.83299 2937.78668
4.75000 -7341.27899 31.69863 30.64486 799.62135 780.76756 2834.49269
4.85000 -7223.78417 44.50220 47.39705 784.62221 735.56625 2786.21894
4.95000 -7124.38237 52.89313 54.59689 769.07916 700.89042 2655.18919
5.05000 -7027.22488 55.73191 34.01914 768.50718 663.03122 2541.54554
5.15000 -6924.81305 71.35178 17.70851 750.36471 632.04282 2429.95862
5.25000 -6823.59669 70.66552 18.37651 737.32603 596.16524 2356.71364
5.35000 -6714.84208 77.11887 108.42072 724.12557 560.90386 2259.04711
5.45000 -6603.93818 70.48028 -8.88065 712.70035 533.40093 2233.13784
5.55000 -6481.91863 91.09885 -35.02884 668.22888 506.71485 2102.37803
5.65000 -6374.36058 96.56250 -30.11856 656.19867 463.06026 2061.03156
5.75000 -6291.62491 89.07710 0.25222 617.34682 446.82842 1981.76854
5.85000 -6179.38547 85.33929 -8.30492 596.51670 426.03726 1928.50226
5.95000 -6081.28490 88.14899 -7.30854 551.14360 402.67471 1870.40654
6.05000 -5995.69286 100.12990 5.53944 539.56681 379.40461 1816.01437
6.15000 -5914.26837 81.52498 -18.81168 506.57547 362.68780 1711.81615
6.25000 -5832.95461 89.90595 23.97699 486.76770 345.51850 1687.66741
6.35000 -5766.35831 87.82877 -0.11490 461.78370 325.00545 1638.99133
6.45000 -5693.49381 79.62326 -13.21023 445.79340 314.24594 1620.46303
6.55000 -5624.39112 78.74850 -40.67791 430.24960 299.77730 1560.14771
6.65000 -5569.57908 70.59508 -51.74439 407.58912 294.02300 1490.48060
6.75000 -5507.74058 67.30709 -20.63888 395.60524 282.83718 1453.73875
6.85000 -5462.51151 66.16663 -29.27971 391.19768 278.90264 1428.90342
6.95000 -5382.09578 55.00325 -11.31443 376.25780 267.07941 1396.81873
7.05000 -5340.79233 52.06514 -23.29104 374.09514 254.83184 1353.68602
7.15000 -5295.81449 51.06626 -8.06661 352.52390 252.03587 1296.35795
7.25000 -5257.23625 43.14334 -34.24564 331.87142 246.38845 1286.45548
7.35000 -5212.63398 39.05857 -20.58197 322.67635 235.02824 1248.95810
7.45000 -5167.84657 31.95259 -24.93092 314.61653 234.23373 1222.23536
7.55000 -5107.62423 33.02087 -29.52347 301.61464 231.43150 1202.99216
7.65000 -5073.09555 34.33906 -7.04861 297.69309 223.87618 1160.82554
7.75000 -5038.86706 25.23046 -4.70548 291.54877 216.12214 1128.70995
7.85000 -4990.69495 20.57973 -9.45280 286.21948 208.67530 1122.60678
7.95000 -4963.28430 18.58408 -17.69578 277.95748 201.76682 1100.89582
8.05000 -4915.79718 17.69971 -20.63650 272.78633 196.07774 1076.34956
8.15000 -4883.93092 9.54772 -4.25538 264.46197 189.97614 1036.96408
8.25000 -4843.26224 11.37234 -22.46671 251.28140 188.59751 1030.59899
8.35000 -4808.84011 7.61483 -10.58214 245.55672 186.52274 1015.57261
8.45000 -4777.49539 12.50775 -18.96451 236.93217 178.35037 977.71555
8.55000 -4734.74805 5.68867 0.82958 231.02972 171.70424 992.28383
8.65000 -4693.79635 5.06810 8.64907 220.22233 166.44689 957.29418
8.75000 -4658.08353 1.78052 0.26621 207.41793 159.81299 950.82636
8.85000 -4630.62467 -3.48839 4.86905 195.89581 156.55453 908.73975
8.95000 -4598.61821 -1.89070 -14.00767 193.02891 152.04699 903.20124
9.05000 -4568.53927 -2.57686 -29.13658 182.10438 149.60560 889.47443
9.15000 -4531.65990 -3.00514 -10.24069 177.67048 146.93196 867.33812
9.25000 -4496.80147 0.28365 11.86876 171.60249 145.50490 853.55615
9.35000 -4466.03013 -7.42741 -20.82669 165.81777 134.60170 831.29510
9.45000 -4430.55877 -9.33168 -5.69084 160.93131 133.92052 823.66582
9.55000 -4401.47178 -9.33553 -9.38797 152.41809 131.70385 792.64589
9.65000 -4368.31713 -5.17103 12.62884 150.00513 127.55542 785.69053
9.75000 -4330.33007 -9.33238 2.21370 145.22259 122.60296 765.54396
9.85000 -4306.52129 -11.84270 25.58472 140.75356 119.11580 754.41588
9.95000 -4272.74448 -8.72444 -20.34197 158.40004 117.90912 740.86032
10.05000 -4242.48894 -7.65696 32.34160 134.76988 113.97153 732.87528
10.15000 -4212.33525 -7.60953 3.74166 130.09630 110.60529 710.44177
10.25000 -4185.03318 -8.46717 5.83457 131.08821 107.97284 703.62707
10.35000 -4156.70170 -7.83425 9.45670 127.95059 105.57739 685.14230
10.45000 -4124.40490 -7.43776 11.19355 127.81259 101.47642 687.56845
10.55000 -4093.35862 -8.48941 18.03865 128.11306 95.84224 685.53780
10.65000 -4065.74785 -8.11262 19.75653 125.14567 92.91037 660.46518
10.75000 -4034.03323 -3.32508 -1.20129 129.10101 91.40675 648.62044
10.85000 -4008.95061 -4.99057 4.28998 123.75995 89.50310 636.52531
10.95000 -3977.00021 -2.58749 25.47506 126.35139 86.14944 628.36271
11.05000 -3953.19764 -4.16778 4.53531 128.32850 83.87056 612.84450
11.15000 -3922.36189 -2.92328 7.51516 132.08149 81.92235 606.56892
11.25000 -3893.38937 -1.45297 -0.98071 140.84682 80.94396 596.61082
11.35000 -3870.26928 0.90082 17.83752 129.86654 80.53742 589.45314
11.45000 -3847.57724 -1.62963 -10.58027 125.25329 77.42229 576.61553
11.55000 -3822.18863 0.85390 -14.78776 126.94919 76.09775 554.20687
11.65000 -3793.88067 1.97306 -8.12551 129.20165 74.76078 552.66222
11.75000 -3770.11603 3.34557 -23.90457 135.95750 73.38908 553.01572
11.85000 -3748.08141 5.71144 5.16466 134.36039 70.02280 523.21840
11.95000 -3722.82345 7.49438 -2.53902 133.40207 69.01584 522.46214
12.05000 -3702.74682 6.78817 -0.28962 141.46503 66.61085 517.20703
12.15000 -3678.73593 6.91832 -16.59759 130.80810 65.99486 496.08305
12.25000 -3651.19176 10.21388 -23.79899 129.99568 63.87546 490.89004
12.35000 -3621.86675 11.04820 -19.23190 127.85761 64.32680 480.28009
12.45000 -3604.55380 9.27562 -36.05429 123.79991 62.54564 471.26266
12.55000 -3579.08017 8.22445 -25.18050 121.44286 61.38479 462.99925
12.65000 -3556.15344 6.99166 -52.50056 118.34729 59.51085 465.33576
12.75000 -3533.66476 10.17894 -24.93353 115.26634 57.52563 443.70906
12.85000 -3511.48952 9.94414 -22.78843 110.84820 56.73134 442.37405
12.95000 -3482.73221 11.11845 -39.19498 104.47247 57.00937 433.52459
13.05000 -3466.69930 10.26299 -40.50576 97.72542 55.82362 424.44472
13.15000 -3439.89497 7.61358 -58.17769 94.48184 54.41856 428.57387
13.25000 -3421.13384 10.15443 -34.47515 90.10138 53.33666 404.42061
13.35000 -3398.84052 7.87979 -38.99770 87.06535 53.19660 398.09301
13.45000 -3372.44315 6.99338 -36.86081 84.89600 51.20107 399.13769
13.55000 -3352.63237 6.90921 -28.36364 85.41547 50.91336 392.93444
13.65000 -3332.99204 4.23389 -36.63047 76.56954 50.48580 379.68764
13.75000 -3311.88362 5.71789 -35.18997 73.75744 49.89383 368.04532
13.85000 -3287.52591 3.94321 -31.67999 73.61474 47.28590 363.88105
13.95000 -3263.58826 4.17924 -19.92661 71.91371 45.53870 355.00662
14.05000 -3243.22605 3.12373 -38.09757 70.41974 45.12049 352.67110
14.15000 -3224.85738 2.78945 -32.09545 69.04923 46.22812 336.64830
14.25000 -3199.39658 2.70270 -32.68649 67.80090 44.42934 340.06453
14.35000 -3180.22304 3.40213 -37.68696 65.99585 43.18197 324.10369
14.45000 -3156.39619 3.39866 -28.53117 66.63348 43.20414 325.42976
14.55000 -3136.93664 3.20512 -29.53007 65.66695 41.64682 322.06562
14.65000 -3115.77273 2.05349 -25.11220 68.44521 40.03728 315.78945
14.75000 -3095.48077 3.81602 -23.70133 66.04230 40.06904 311.92333
14.85000 -3074.59912 1.26923 -17.04334 63.91652 38.38364 301.22971
14.95000 -3058.64143 2.91230 -14.22407 60.79536 38.42529 288.78097
15.05000 -3036.05764 2.52514 -14.03021 66.51071 38.25385 300.17912
15.15000 -3013.66078 4.99538 -14.91794 59.82827 36.33969 285.18623
15.25000 -2996.71526 3.25140 -19.29704 59.00423 35.76363 280.40396
15.35000 -2976.54315 1.90196 -13.43330 60.74483 34.36476 286.99669
15.45000 -2951.98279 5.20518 -12.60793 58.68349 34.34400 282.09983
15.55000 -2933.79503 2.39317 -13.12241 57.87093 33.56993 276.91064
15.65000 -2914.01280 2.26757 2.54303 57.54153 32.69378 269.27827
15.75000 -2894.00327 3.21528 -0.82042 56.33817 33.61277 267.79036
15.85000 -2878.09346 4.66425 -5.78983 57.22599 33.74947 269.60696
15.95000 -2867.01438 2.71424 -0.21761 56.61545 33.00285 257.70069
16.05000 -2847.44049 3.02977 10.67823 52.72420 32.86507 247.49668
16.15000 -2834.66563 2.47355 -4.12526 53.20630 31.49561 244.20288
16.25000 -2812.84265 4.30947 -7.87454 53.99337 33.10780 248.94742
16.35000 -2798.62366 3.76378 9.67951 52.48085 31.49109 243.93457
16.45000 -2778.95697 3.35526 8.52602 52.38309 30.52021 234.45360
16.55000 -2766.91208 3.52543 7.54484 52.30559 31.74312 230.96874
16.65000 -2746.87182 4.22974 -11.51792 48.81545 32.38597 227.72064
16.75000 -2733.29744 2.72626 -2.85865 47.96186 31.17039 224.57091
16.85000 -2716.93727 3.34279 16.12862 48.58143 31.02614 224.22509
16.95000 -2700.22172 3.11673 7.04183 47.43487 30.20245 222.46659
17.05000 -2685.54097 3.05408 0.53319 44.42992 30.64691 213.82351
17.15000 -2668.49270 2.81914 -0.37705 44.77279 30.46406 216.81971
17.25000 -2649.97375 2.20598 2.91645 43.44377 30.34908 220.61232
17.35000 -2636.86078 1.52399 5.23349 41.07755 30.22859 208.14059
17.45000 -2621.15449 0.98949 13.30256 39.54611 30.21677 200.97961
17.55000 -2606.10049 2.46896 -2.51658 41.24026 30.23837 200.13221
17.65000 -2591.14950 1.49191 11.19275 38.95413 29.66040 198.77899
17.75000 -2576.21131 3.66194 4.09346 38.69837 30.12570 191.29960
17.85000 -2561.22392 3.47350 -12.57427 36.89982 30.30026 189.00718
17.95000 -2545.73504 1.46638 2.64304 36.17421 29.25893 184.61511
18.05000 -2531.23310 0.75858 -1.59760 35.75981 28.91245 189.26635
18.15000 -2513.01229 -0.15356 -2.70599 38.98864 27.31225 189.38271
18.25000 -2498.24917 -0.61876 -2.09921 33.93804 28.41925 182.44518
18.35000 -2485.36496 -0.19006 2.38423 33.43373 29.12388 175.92230
18.45000 -2470.16991 -0.93785 -5.98698 35.71110 28.72142 178.53543
18.55000 -2455.15197 1.15282 8.51211 34.07782 27.44873 173.43672
18.65000 -2440.76555 -2.12619 4.23731 34.71624 26.74579 176.51482
18.75000 -2426.13642 0.99565 9.32388 33.93389 28.02696 182.31730
18.85000 -2413.71991 0.81413 -3.20391 34.15182 27.48134 175.96580
18.95000 -2398.85289 -0.88110 -13.13145 34.40152 27.30316 169.71171
19.05000 -2383.18965 0.83972 -16.43011 37.51117 26.84310 181.97627
19.15000 -2373.68602 -0.30714 20.71938 34.19576 26.70105 175.20145
19.25000 -2356.66059 1.91094 7.93533 33.66234 29.05296 168.53184
19.35000 -2339.46858 5.29523 1.49067 34.65189 27.51071 178.53947
19.45000 -2322.22238 9.80598 -6.88800 32.54340 28.78751 171.11873
19.55000 -2316.10229 12.06261 16.27613 33.00264 27.77387 170.33787
19.65000 -2299.32107 14.85977 1.20262 31.33273 26.05489 176.00350
19.75000 -2286.67771 16.36387 -13.19129 32.90361 27.52321 168.41901
19.85000 -2270.59598 17.44409 1.67725 31.33361 26.92660 175.70871
19.95000 -2261.21448 17.62752 -8.43121 32.56105 27.70123 170.41342
