0.05000 1472.36501
0.15000 2294.90232
0.25000 3649.74067
0.35000 4317.53584
0.45000 4952.51174
0.55000 5480.07301
0.65000 5567.93795
0.75000 5796.19206
0.85000 5956.26985
0.95000 5872.20166
1.05000 5857.88499
1.15000 5720.33690
1.25000 5582.18419
1.35000 5480.83925
1.45000 5341.45495
1.55000 5326.75298
1.65000 5055.76735
1.75000 4899.81372
1.85000 4835.03267
1.95000 4725.38713
2.05000 4583.01602
2.15000 4403.13493
2.25000 4308.82683
2.35000 4234.37226
2.45000 4141.60292
2.55000 3965.38229
2.65000 3877.51744
2.75000 3777.88394
2.85000 3687.10391
2.95000 3569.76956
3.05000 3494.28896
3.15000 3393.10717
3.25000 3328.20555
3.35000 3202.54564
3.45000 3114.32389
3.55000 3039.28352
3.65000 2960.89961
3.75000 2838.52974
3.85000 2809.01840
3.95000 2687.61831
4.05000 2618.20875
4.15000 2590.78367
4.25000 2498.46433
4.35000 2425.68882
4.45000 2355.01382
4.55000 2281.08157
4.65000 2246.60607
4.75000 2191.02417
4.85000 2114.94390
4.95000 2070.55371
5.05000 2039.74871
5.15000 1995.38919
5.25000 1937.79209
5.35000 1876.33604
5.45000 1831.61079
5.55000 1781.11409
5.65000 1770.02967
5.75000 1722.52788
5.85000 1668.42296
5.95000 1619.12548
6.05000 1592.46741
6.15000 1555.83484
6.25000 1534.77305
6.35000 1510.83797
6.45000 1436.27599
6.55000 1419.52697
6.65000 1410.02116
6.75000 1364.08867
6.85000 1323.98898
6.95000 1270.19460
7.05000 1272.81384
7.15000 1222.05493
7.25000 1204.39314
7.35000 1181.61897
7.45000 1171.23753
7.55000 1134.04867
7.65000 1101.38346
7.75000 1083.10691
7.85000 1047.23618
7.95000 1010.86503
8.05000 990.05864
8.15000 992.87979
8.25000 946.08424
8.35000 940.27299
8.45000 903.12843
8.55000 893.80442
8.65000 877.31807
8.75000 835.60522
8.85000 831.51352
8.95000 836.03185
9.05000 788.21235
9.15000 785.63706
9.25000 766.19849
9.35000 740.72152
9.45000 727.40299
9.55000 703.12556
9.65000 683.69665
9.75000 684.19440
9.85000 664.56772
9.95000 649.46925
10.05000 634.88038
10.15000 617.20085
10.25000 624.49156
10.35000 593.02293
10.45000 577.33187
10.55000 569.34038
10.65000 570.93530
10.75000 534.93399
10.85000 533.41915
10.95000 535.49857
11.05000 502.74193
11.15000 509.58622
11.25000 492.84061
11.35000 471.16518
11.45000 462.20779
11.55000 470.38121
11.65000 456.96658
11.75000 451.28347
11.85000 436.47998
11.95000 426.25806
12.05000 418.87699
12.15000 408.27692
12.25000 411.59857
12.35000 402.26419
12.45000 394.65428
12.55000 392.39291
12.65000 378.76727
12.75000 363.90466
12.85000 360.91892
12.95000 354.23933
13.05000 349.56587
13.15000 341.98858
13.25000 325.07276
13.35000 319.34245
13.45000 321.62565
13.55000 315.41938
13.65000 305.99402
13.75000 301.88384
13.85000 303.56199
13.95000 285.73848
14.05000 284.21388
14.15000 287.11803
14.25000 282.84025
14.35000 263.90752
14.45000 269.78972
14.55000 265.85743
14.65000 249.14231
14.75000 254.50779
14.85000 253.93484
14.95000 248.78263
15.05000 245.26704
15.15000 239.53899
15.25000 237.39056
15.35000 216.48103
15.45000 221.72712
15.55000 219.57658
15.65000 212.70268
15.75000 212.28514
15.85000 211.01261
15.95000 193.23692
16.05000 197.67967
16.15000 196.11297
16.25000 195.24101
16.35000 190.71070
16.45000 184.53502
16.55000 183.21687
16.65000 185.55133
16.75000 178.96226
16.85000 175.59643
16.95000 166.49438
17.05000 175.57560
17.15000 160.65862
17.25000 168.60138
17.35000 161.36678
17.45000 161.58754
17.55000 153.61533
17.65000 147.46356
17.75000 148.81064
17.85000 144.89760
17.95000 142.14664
18.05000 139.64137
18.15000 142.17806
18.25000 131.26694
18.35000 134.94228
18.45000 130.74996
18.55000 127.67258
18.65000 123.35804
18.75000 123.32670
18.85000 127.33249
18.95000 114.75299
19.05000 122.08247
19.15000 120.05494
19.25000 110.46017
19.35000 108.58197
19.45000 117.05516
19.55000 107.93334
19.65000 105.59408
19.75000 106.88231
19.85000 103.80953
19.95000 110.33380
