0.05000 -1279.60351 -46.60448 93916.62318 1331.52227 1587.66347 267350.01347
0.15000 -3723.37815 127.39675 -371.89895 1279.04786 1478.52722 348161.86289
0.25000 -5276.70715 -14.63718 4676.55229 1099.29256 1280.27333 330334.41538
0.35000 -6199.59346 77.99496 11890.78886 1118.02834 1059.62129 364989.34466
0.45000 -6931.31277 111.98123 5593.34792 1215.79295 905.07454 387018.10467
0.55000 -7514.02138 125.00565 5712.50358 1332.73959 787.61455 380499.77409
0.65000 -7919.36455 105.82839 1486.53397 1462.17510 699.17927 300692.56013
0.75000 -8188.86156 76.06335 -13846.89816 1502.80612 629.90499 311104.98998
0.85000 -8328.29131 64.99006 7059.48344 1460.48988 564.40189 306545.47490
0.95000 -8461.84616 92.91376 -4303.63687 1443.82312 504.61279 323731.42724
1.05000 -8541.58692 106.71178 4874.58941 1373.12848 463.43700 297276.12413
1.15000 -8593.37795 96.63211 -4148.64012 1274.19410 425.62036 269593.41402
1.25000 -8623.35535 92.99965 -4501.12791 1231.26312 402.18752 263465.16811
1.35000 -8639.16832 98.78867 -4218.10790 1154.14012 380.70250 261145.35426
1.45000 -8632.19922 102.96753 -3969.68615 1058.21718 359.72560 248590.19405
1.55000 -8604.41540 104.35069 1213.12212 982.68229 342.15066 215741.34059
1.65000 -8613.36648 103.89741 1772.49171 924.22342 324.46336 225500.41442
1.75000 -8581.01669 97.92631 449.82990 814.00093 308.80774 208825.57993
1.85000 -8586.71059 98.09508 3200.26498 750.74155 284.04363 179979.85858
1.95000 -8590.17185 96.47194 3522.65580 679.00677 258.64978 204508.39578
2.05000 -8568.28635 96.02922 3583.53517 623.64010 234.34874 200022.24152
2.15000 -8510.88194 97.95737 -1796.52455 565.92411 215.16297 162358.67663
2.25000 -8486.99936 93.35790 -1728.46881 530.32144 198.36511 177839.42428
2.35000 -8449.41200 88.60942 39.87280 484.48431 185.50842 156016.71483
2.45000 -8444.76806 96.32114 2979.22899 435.43399 177.99702 154890.57727
2.55000 -8427.64716 89.99826 -1478.56325 391.00522 167.48920 144128.76178
2.65000 -8398.35668 91.54862 609.79594 358.14176 162.80404 147183.48953
2.75000 -8356.03088 84.27654 1211.85291 322.37894 157.96815 138770.33378
2.85000 -8300.23021 87.09018 -619.53132 292.00766 153.81130 135167.32280
2.95000 -8242.89927 85.43512 -578.91171 268.01109 152.64189 129318.80472
3.05000 -8184.31519 83.35337 668.42639 250.91524 148.22212 133609.60804
3.15000 -8112.85551 81.11636 1041.76930 238.10320 144.81358 121113.86033
3.25000 -8053.42862 80.22038 -2074.22620 224.34981 144.34326 112631.47748
3.35000 -7980.64027 79.69536 -2824.56569 215.60272 138.75173 112973.94805
3.45000 -7912.60589 78.33624 -171.07791 203.40078 130.83959 98699.33987
3.55000 -7854.67431 74.82439 -1842.97134 191.37136 128.90501 104052.84136
3.65000 -7786.12919 77.38341 -2754.46727 177.03722 122.92505 106085.57632
3.75000 -7717.91919 77.01757 -965.27472 168.92952 120.90685 96355.06299
3.85000 -7638.60758 71.39855 400.89568 161.81015 118.43311 89691.22358
3.95000 -7565.88590 70.49624 -806.37520 155.94622 117.90195 91955.15621
4.05000 -7494.19880 70.63108 466.25854 147.38542 113.92877 81364.43167
4.15000 -7430.27785 65.82924 -1325.95045 139.97695 114.17753 81783.77652
4.25000 -7374.32635 63.56990 -471.48875 143.19498 112.81824 77679.35224
4.35000 -7313.68274 67.48452 -2199.25126 139.69917 111.78203 73876.28598
4.45000 -7262.86807 62.46869 1113.67641 130.32604 107.43773 70220.72618
4.55000 -7217.67818 62.40220 -403.81897 126.68521 106.37130 84019.51619
4.65000 -7166.71302 61.48528 -565.84915 134.18697 101.51757 64059.66050
4.75000 -7116.54812 59.72997 -1034.80039 143.85337 101.68427 67664.52138
4.85000 -7064.38265 58.52123 1684.62022 146.15224 96.41616 66694.92229
4.95000 -7011.43295 54.59907 -375.43817 145.53805 94.71098 67526.34014
5.05000 -6957.84297 57.62081 -446.98244 143.16496 95.19481 58667.33815
5.15000 -6906.50041 55.01849 -684.64249 141.49644 93.65232 58973.65122
5.25000 -6852.50924 54.61601 -554.95327 140.23430 92.04351 57553.68596
5.35000 -6799.90966 52.46864 1753.81491 131.09527 90.59785 121587.11770
5.45000 -6749.33990 51.79488 598.15367 120.05298 90.35193 56313.65982
5.55000 -6699.90795 50.72116 279.30515 107.02464 87.37992 50623.70603
5.65000 -6648.16430 49.96525 -257.53756 100.36293 86.56689 45047.24858
5.75000 -6594.11655 48.09811 -379.06139 101.39775 86.43562 51848.10391
5.85000 -6542.49826 48.96469 -1543.66877 102.12908 85.51825 51342.20243
5.95000 -6490.59272 48.25614 -1001.59096 102.19659 86.28204 41038.28014
6.05000 -6438.06333 46.01540 492.39017 101.68762 85.98574 41069.55102
6.15000 -6379.61462 46.72867 -456.96623 95.92305 85.44230 40820.56408
6.25000 -6324.82063 45.59374 -66.08629 91.26407 86.56934 39616.11051
6.35000 -6272.79170 43.92224 1181.63052 89.99903 85.26652 64485.76625
6.45000 -6222.87553 44.01098 -823.07019 89.74304 82.27795 38316.29048
6.55000 -6173.87044 44.53695 826.53228 88.24944 79.98673 37136.10259
6.65000 -6120.01922 41.37514 -273.43209 89.92487 74.59173 40103.18510
6.75000 -6067.16259 41.47825 -519.87739 93.84820 73.99368 52704.01837
6.85000 -6013.22577 40.63675 780.03182 93.74391 72.11479 38280.16227
6.95000 -5956.53234 38.11938 1193.08067 95.83812 71.57441 31197.52532
7.05000 -5902.33175 37.19321 421.57825 96.02273 70.08400 28541.48105
7.15000 -5846.14193 38.58033 295.30289 97.93489 69.37653 28838.16051
7.25000 -5797.26307 37.73193 -103.81986 98.44688 68.61206 30904.42098
7.35000 -5749.16954 36.62286 270.85851 99.52313 64.91090 33552.62953
7.45000 -5693.48667 36.66544 607.75278 97.76073 65.55559 30747.93447
7.55000 -5640.90014 35.55469 203.22497 92.84620 64.80870 25087.36001
7.65000 -5592.06361 33.64119 -207.50988 92.26894 65.07011 25109.90911
7.75000 -5544.50497 34.43662 -224.68083 92.27637 65.79232 29907.58695
7.85000 -5500.75748 33.10700 52.86080 91.85597 65.61670 24731.29368
7.95000 -5454.00393 32.79972 1159.18835 90.31933 64.60617 28214.47929
8.05000 -5402.39336 32.40640 619.61221 91.44002 63.42644 24064.53289
8.15000 -5354.96254 30.48050 359.42108 87.97881 62.64696 23305.92201
8.25000 -5306.44299 31.67394 -3.28576 86.65520 62.71747 19610.63829
8.35000 -5259.79909 30.98043 -389.12742 83.76508 61.67598 19766.41381
8.45000 -5213.08957 30.61532 -168.71781 82.03208 62.23033 20487.22675
8.55000 -5162.33347 29.00236 -41.61878 81.38493 60.69364 22502.41070
8.65000 -5113.75371 28.76785 -271.83009 77.52517 58.85901 25195.17933
8.75000 -5070.06701 30.30235 -196.70837 73.85008 60.77231 20925.51057
8.85000 -5025.21473 28.44107 98.57986 70.85311 62.44722 17048.64271
8.95000 -4986.64960 29.05708 32.02327 72.68862 60.33642 14597.41198
9.05000 -4943.15432 27.49148 -41.96227 71.30156 59.90092 16288.92173
9.15000 -4900.37389 26.92847 -177.31591 69.00043 59.19159 14695.99043
9.25000 -4856.33730 25.64712 -152.73714 67.62959 59.69384 18045.35471
9.35000 -4817.67153 24.62503 763.27056 69.11913 58.58394 46957.49715
9.45000 -4776.38102 24.38077 60.45273 66.66689 57.82729 16377.48173
9.55000 -4736.35259 25.15475 -91.15363 64.49039 56.38541 12329.05244
9.65000 -4699.97756 25.02826 -686.92750 64.34173 54.86681 14611.96880
9.75000 -4658.76879 23.09916 -227.48193 63.77814 54.28085 13946.28431
9.85000 -4622.87305 21.59008 -332.47217 63.04693 51.82123 14780.70618
9.95000 -4583.70280 24.01299 -96.41024 60.09039 52.18049 12638.58147
10.05000 -4546.76453 21.97903 -232.84657 63.83693 52.69385 13912.01394
10.15000 -4509.99990 21.38021 -179.38447 67.62802 51.78166 12704.94767
10.25000 -4473.23954 22.58161 -138.50231 69.38236 50.30816 11348.16822
10.35000 -4436.01116 20.32186 -77.47237 72.49495 50.81060 11620.39631
10.45000 -4400.40756 20.40086 -351.01950 73.59555 49.59710 11501.50913
10.55000 -4363.42189 19.60287 -382.90125 73.02513 47.72541 11195.35103
10.65000 -4328.08378 20.97373 -196.59638 71.87208 47.76941 9759.65917
10.75000 -4292.22884 20.62129 -163.25186 67.79066 47.34346 10636.77339
10.85000 -4260.32438 18.63944 -299.87730 67.08872 45.42965 9840.66672
10.95000 -4220.76122 21.82804 62.07639 67.03004 44.49120 11288.25545
11.05000 -4187.00408 20.24132 -36.77185 66.29545 45.52786 9214.47970
11.15000 -4152.29801 20.27960 -17.93483 65.13069 44.11325 7690.97860
11.25000 -4117.86172 19.84392 76.07564 65.93705 42.97893 8760.89243
11.35000 -4085.23356 18.67165 -67.71914 62.73657 42.56895 7901.12860
11.45000 -4050.42001 17.86156 -320.67136 59.23659 41.86749 9653.44503
11.55000 -4016.74965 17.23041 -164.04553 56.24899 41.21839 6790.50960
11.65000 -3986.29649 16.93420 -7.46715 55.09441 41.32061 7860.45507
11.75000 -3952.88464 18.07000 122.46902 54.58221 41.10723 7448.56565
11.85000 -3919.44997 17.99932 -166.78446 54.62728 41.48488 8560.78441
11.95000 -3889.66186 16.63233 165.27888 54.12174 40.34636 7925.19729
12.05000 -3858.37774 16.85000 -101.13037 49.51308 40.05685 7351.73832
12.15000 -3830.16903 15.13209 -59.14541 48.53259 38.65261 8165.45940
12.25000 -3797.81940 15.64972 -59.15004 48.66473 38.57424 6517.90513
12.35000 -3768.11578 15.01425 -144.37180 45.08981 37.84966 5473.97272
12.45000 -3738.42050 16.16546 -73.54239 46.36545 39.52449 6378.46315
12.55000 -3715.63976 15.34610 -91.64646 47.21438 37.33632 5439.43571
12.65000 -3684.01963 15.07573 -37.97813 46.58051 37.49432 5095.94883
12.75000 -3652.28201 14.62233 -25.39531 44.02679 36.67402 6548.88883
12.85000 -3624.08959 14.33614 -353.80534 43.02757 36.89574 6944.11328
12.95000 -3599.87354 14.78385 -14.01168 41.91204 34.96645 5289.86472
13.05000 -3570.66576 14.42611 15.63217 41.32299 36.51902 5422.76522
13.15000 -3544.44488 12.60310 66.11247 41.20525 36.16338 4186.25902
13.25000 -3520.95168 13.03594 51.44893 40.87257 36.32229 5162.89662
13.35000 -3495.62516 14.37461 -170.28858 41.26486 36.21276 5926.36605
13.45000 -3472.05335 12.28508 8.38142 41.36179 35.01635 4258.02384
13.55000 -3441.86839 13.38434 -30.37054 41.15497 35.33630 4646.27677
13.65000 -3419.65756 14.16070 231.96040 40.19658 33.51114 6527.06699
13.75000 -3396.86029 13.64563 41.62410 40.60201 34.28981 4590.82176
13.85000 -3373.05272 14.20696 -85.27996 41.70938 32.78492 3524.31003
13.95000 -3349.73427 12.39754 155.43889 44.22689 32.01151 4722.46471
14.05000 -3323.12243 12.71995 -67.09977 43.71029 32.91918 4410.11566
14.15000 -3301.09669 12.84043 35.24405 44.16092 32.40693 4925.31564
14.25000 -3275.36420 12.21420 160.59661 42.25395 32.63790 4426.68464
14.35000 -3253.78186 10.98491 -129.86659 41.44913 32.28833 3924.49214
14.45000 -3230.78071 10.24457 151.80354 41.84153 31.54921 4898.01668
14.55000 -3207.23056 10.73981 87.06321 41.10381 31.07411 3401.96236
14.65000 -3184.92826 12.42893 178.48796 41.50757 30.22990 3650.20621
14.75000 -3164.79842 10.41708 -91.83091 40.57920 31.53447 3333.58117
14.85000 -3143.29733 10.82871 30.20376 40.81316 32.47444 3980.89146
14.95000 -3124.56753 10.64652 -95.50917 41.25725 31.16493 3078.74073
15.05000 -3103.19393 9.18565 15.32852 40.22467 30.62468 3311.05057
15.15000 -3081.46615 10.29465 -11.41460 38.66081 30.09718 2733.99759
15.25000 -3059.25741 10.27025 -59.77659 39.22619 29.79755 2750.90167
15.35000 -3042.11460 9.63681 -81.70674 39.90435 29.45609 2798.26316
15.45000 -3019.93764 10.11789 25.56805 40.71563 28.85805 2311.01496
15.55000 -3000.18083 10.93487 119.78008 40.23803 27.68028 2908.38539
15.65000 -2982.54280 10.50213 -75.93339 39.38248 28.03617 2865.10314
15.75000 -2963.55826 9.98582 -48.33381 38.47356 28.07033 4089.82155
15.85000 -2939.96652 10.04887 -61.51514 38.44167 27.29145 2829.17779
15.95000 -2919.51155 9.37617 -66.67060 37.13163 27.01664 2396.95517
16.05000 -2895.63773 8.36790 29.25869 37.92485 27.26171 2543.44040
16.15000 -2876.62443 11.20566 -72.96123 36.35305 27.05987 3201.46495
16.25000 -2856.08217 9.72107 212.10937 36.28177 26.70843 2940.55806
16.35000 -2836.50834 7.07130 90.58811 35.52853 26.14662 2187.94785
16.45000 -2814.64718 6.97282 -19.59196 35.56943 26.50164 2065.05554
16.55000 -2794.26925 9.84094 -47.62917 35.73874 25.69315 2279.02967
16.65000 -2777.12128 10.05699 108.74492 33.53411 25.74660 1766.36901
16.75000 -2756.37319 10.56099 -49.81196 34.62960 26.31200 2416.49164
16.85000 -2737.17371 8.90649 -81.73851 35.17593 25.73151 2444.12555
16.95000 -2717.66698 7.17732 -211.89778 33.16359 26.48309 2824.25472
17.05000 -2699.82957 9.04697 21.14288 32.62282 25.68250 2286.54761
17.15000 -2686.65515 7.81788 83.16500 35.43930 26.09253 2006.03020
17.25000 -2666.33384 8.28009 -37.92680 34.43396 26.63733 2867.06459
17.35000 -2646.97328 9.36076 89.56941 33.53430 27.13050 1845.31528
17.45000 -2630.05177 6.27488 40.09504 31.28985 27.05817 1454.65013
17.55000 -2615.03771 6.76133 69.75445 31.53644 25.13415 1531.05561
17.65000 -2600.99278 6.12360 -5.74544 31.56054 25.35059 1495.75780
17.75000 -2583.59824 5.16305 50.92077 29.75941 25.99726 1782.47085
17.85000 -2569.89671 8.48090 -64.47336 30.28127 25.20719 2029.46209
17.95000 -2554.69744 7.60472 9.24627 30.30255 26.01794 1477.99962
18.05000 -2537.16003 7.94766 -95.59532 28.81121 25.51218 1381.67669
18.15000 -2521.71988 6.12437 51.64958 29.96929 26.38255 1295.63582
18.25000 -2505.54119 7.95269 20.38741 29.34717 25.14215 1728.41549
18.35000 -2492.63148 5.88540 -8.45189 29.92135 24.51876 1646.57779
18.45000 -2477.03913 7.88382 38.62219 29.41581 24.86856 1753.42413
18.55000 -2460.94524 7.27760 75.11387 28.19606 22.87292 1403.67054
18.65000 -2448.43382 7.05025 -56.74096 28.91114 25.74989 1198.85475
18.75000 -2432.37580 9.45001 25.97617 28.99710 26.50885 1358.94779
18.85000 -2415.49083 4.12374 82.53887 28.90665 22.80410 1759.96549
18.95000 -2402.86252 6.30032 45.27379 28.18444 24.65724 1400.73153
19.05000 -2387.82084 6.07009 -7.64874 29.04565 23.28224 1126.00433
19.15000 -2374.91480 8.43236 19.11905 30.24630 24.31538 1228.17693
19.25000 -2360.64594 8.18548 25.71000 30.90131 23.67250 971.96756
19.35000 -2345.94263 10.48038 -36.70322 28.25881 25.07926 1564.23074
19.45000 -2330.91093 13.01303 -59.45919 25.79136 26.06553 1133.33392
19.55000 -2319.01191 18.04565 -0.00842 26.50748 26.49176 1379.98216
19.65000 -2303.98482 18.47071 3.57138 26.82513 22.64696 1491.45646
19.75000 -2290.70776 20.93682 69.12573 25.97003 22.45864 1160.28916
19.85000 -2277.18161 23.27434 -1.86236 26.68637 23.55431 1337.70283
19.95000 -2263.69741 22.67206 -138.56139 26.75966 23.64972 3076.70575
