0.05000 2050.72537
0.15000 2955.55687
0.25000 3414.74970
0.35000 4195.81245
0.45000 4558.87271
0.55000 4839.71268
0.65000 5164.22600
0.75000 5393.85086
0.85000 5469.82891
0.95000 5462.08507
1.05000 5403.34243
1.15000 5414.76231
1.25000 5393.65915
1.35000 5207.38539
1.45000 5119.88594
1.55000 5065.23999
1.65000 4973.08687
1.75000 4845.45827
1.85000 4651.60121
1.95000 4507.99799
2.05000 4388.47732
2.15000 4333.88603
2.25000 4113.67771
2.35000 4062.54036
2.45000 3979.43158
2.55000 3887.20065
2.65000 3722.10489
2.75000 3670.84976
2.85000 3569.61786
2.95000 3490.39226
3.05000 3351.63194
3.15000 3307.30876
3.25000 3196.08443
3.35000 3095.58241
3.45000 3024.16565
3.55000 2969.79431
3.65000 2860.20386
3.75000 2838.78099
3.85000 2752.76895
3.95000 2660.32686
4.05000 2613.24351
4.15000 2534.79954
4.25000 2475.11617
4.35000 2397.13809
4.45000 2336.41821
4.55000 2261.43697
4.65000 2235.16037
4.75000 2169.22598
4.85000 2104.33830
4.95000 2087.80436
5.05000 2045.44961
5.15000 1952.03652
5.25000 1912.43471
5.35000 1845.16010
5.45000 1843.68477
5.55000 1786.76338
5.65000 1747.06995
5.75000 1702.40884
5.85000 1670.94564
5.95000 1632.83794
6.05000 1601.27762
6.15000 1566.82942
6.25000 1530.10458
6.35000 1467.43510
6.45000 1447.61073
6.55000 1435.86944
6.65000 1369.45614
6.75000 1359.11863
6.85000 1321.56044
6.95000 1289.96922
7.05000 1257.01362
7.15000 1250.27827
7.25000 1202.65634
7.35000 1162.61184
7.45000 1158.33393
7.55000 1132.22294
7.65000 1104.75092
7.75000 1087.86636
7.85000 1043.99406
7.95000 1021.56051
8.05000 998.49675
8.15000 979.41025
8.25000 958.90482
8.35000 946.09707
8.45000 903.24518
8.55000 886.31826
8.65000 886.02902
8.75000 855.57623
8.85000 828.02270
8.95000 815.39390
9.05000 801.09566
9.15000 779.79312
9.25000 780.15795
9.35000 759.84136
9.45000 743.83104
9.55000 713.26932
9.65000 708.26479
9.75000 691.14669
9.85000 678.58875
9.95000 649.44323
10.05000 645.61479
10.15000 631.00488
10.25000 619.58985
10.35000 603.25819
10.45000 586.53246
10.55000 579.70796
10.65000 563.70626
10.75000 545.17386
10.85000 540.44140
10.95000 533.07028
11.05000 522.96932
11.15000 507.81284
11.25000 489.16851
11.35000 488.32633
11.45000 479.63703
11.55000 469.70239
11.65000 460.95791
11.75000 451.90580
11.85000 454.35106
11.95000 435.56876
12.05000 419.92894
12.15000 411.10679
12.25000 406.97386
12.35000 405.77989
12.45000 389.06055
12.55000 381.28038
12.65000 373.27632
12.75000 372.80774
12.85000 363.79971
12.95000 350.63035
13.05000 350.53446
13.15000 341.53276
13.25000 336.42270
13.35000 325.77007
13.45000 322.84026
13.55000 307.80428
13.65000 305.78332
13.75000 302.94236
13.85000 286.70263
13.95000 284.77158
14.05000 282.67576
14.15000 273.17205
14.25000 275.77856
14.35000 261.86305
14.45000 265.68004
14.55000 257.52277
14.65000 248.27598
14.75000 239.54684
14.85000 241.38225
14.95000 235.32828
15.05000 229.22477
15.15000 233.44447
15.25000 222.51671
15.35000 220.82689
15.45000 216.25339
15.55000 219.84409
15.65000 209.95794
15.75000 204.02585
15.85000 206.95461
15.95000 202.39395
16.05000 199.14872
16.15000 195.21261
16.25000 185.48523
16.35000 180.08067
16.45000 177.95873
16.55000 176.76957
16.65000 181.32498
16.75000 164.84838
16.85000 173.60072
16.95000 161.39851
17.05000 163.95853
17.15000 157.94273
17.25000 154.86089
17.35000 155.89255
17.45000 153.05377
17.55000 152.70051
17.65000 138.76246
17.75000 155.27319
17.85000 144.30361
17.95000 144.77306
18.05000 141.38549
18.15000 140.67723
18.25000 136.46214
18.35000 131.83084
18.45000 135.14173
18.55000 131.80944
18.65000 129.51459
18.75000 137.19349
18.85000 127.60191
18.95000 129.91092
19.05000 117.89315
19.15000 122.36908
19.25000 114.59451
19.35000 114.47612
19.45000 112.08505
19.55000 113.56969
19.65000 109.79404
19.75000 106.94267
19.85000 98.79823
19.95000 92.68593
