0.120000 -2.227580
0.380000 -2.902910
0.620000 -2.898900
0.880000 -2.879640
1.120000 -2.815700
1.380000 -2.838080
1.620000 -2.857130
1.880000 -2.834550
2.120000 -2.811750
2.380000 -2.818830
2.620000 -2.844130
2.880000 -2.797710
3.120000 -2.886450
3.380000 -2.860380
3.620000 -2.855250
3.880000 -2.859590
4.120000 -2.843310
4.380000 -2.778300
4.620000 -2.808450
4.880000 -2.704920
5.120000 -2.715110
5.380000 -2.754860
5.620000 -2.717030
5.880000 -2.767560
6.120000 -2.853760
6.380000 3.085830
6.620000 3.045540
6.880000 0.326190
7.120000 0.765420
7.380000 0.423810
7.620000 0.519040
7.880000 0.581910
8.120000 0.599450
8.380000 0.613930
8.620000 0.538120
8.880000 0.575180
9.120000 0.393460
9.380000 0.496650
9.620000 0.445030
9.880000 0.535740
10.120000 0.468700
10.380000 0.677990
10.620000 1.272660
10.880000 2.840470
11.120000 -1.283760
11.380000 -2.907940
11.620000 -2.633270
11.880000 -2.728440
12.120000 -2.501760
12.380000 -2.420030
12.620000 -2.445300
12.880000 -2.553420
13.120000 -2.521380
13.380000 -2.161610
13.620000 -1.939190
13.880000 -2.162150
14.120000 -2.589970
14.380000 -1.885030
14.620000 -2.223170
14.880000 -2.296860
