0.2 0.35437 21.56034 0.67939 75.87681 74.80221 71.11476
0.6 1.01362 44.51138 -0.24833 73.32475 73.71123 68.22144
1.0 0.3783 65.88794 0.89833 69.52033 69.6434 65.11839
1.4 -0.83489 84.70084 0.1842 66.42607 64.75701 61.91401
1.8 -1.32853 101.95534 0.24536 62.85955 61.8024 58.85032
2.2 -0.8747 115.99838 0.29877 59.73797 58.12282 56.62503
2.6 -0.08102 127.49681 0.11368 57.26802 54.08118 53.90114
3.0 -0.13611 136.95696 -0.41383 54.96156 51.92069 51.82047
3.4 0.62158 147.006 -0.03326 51.76188 49.79523 49.09794
3.8 0.8064 155.66584 0.13665 50.40647 47.43296 47.12293
4.2 1.47763 163.65544 -0.14789 48.20868 44.17953 44.92586
4.6 0.60825 168.36536 -0.0351 46.67722 41.06259 42.88037
5.0 0.21156 173.64737 -0.08603 44.69079 38.97673 41.02061
5.4 -1.04015 178.7894 -0.46592 43.24653 37.40364 38.61504
5.8 -1.84244 184.31217 -0.94628 41.16986 34.9778 36.91024
6.2 -2.0296 187.98742 -1.24742 39.52153 33.46745 35.74613
6.6 -1.40057 191.47821 -1.42996 37.59173 31.68178 34.30979
7.0 -1.12128 194.29296 -0.49418 37.05001 30.25252 32.72532
7.4 -0.56712 196.67912 -0.69901 35.77522 29.07048 31.08842
7.8 0.10184 199.28005 -0.48744 34.67934 28.22066 29.98745
8.2 0.13052 201.40742 -0.06869 33.46058 26.88975 28.9994
8.6 0.4536 202.92399 -0.35433 32.46215 26.16327 27.86906
9.0 -0.30114 203.90272 0.36505 31.75416 25.16168 26.27734
9.4 -0.43302 205.759 0.46387 31.05231 24.51144 25.5442
9.8 -0.58189 206.6867 0.55727 29.95507 23.7282 24.63267
10.2 -0.68707 208.63332 0.6972 29.05163 22.42475 23.84906
10.6 -0.25111 209.18449 0.49468 27.94814 21.61798 22.55054
11.0 -0.00358 210.09453 0.51755 26.9914 20.59674 22.15568
11.4 -0.45374 210.92058 0.46075 26.07004 20.06106 21.05427
11.8 -0.97435 211.64162 0.65009 25.27665 19.49386 19.92276
12.2 -0.08458 212.38112 0.4956 24.97168 18.7769 19.51654
12.6 0.28262 212.68604 0.17307 23.83003 18.15864 18.78988
13.0 0.32172 212.40483 0.75118 23.22821 17.61432 18.00139
13.4 0.07754 213.15176 0.68251 22.30644 16.85657 17.34089
13.8 -0.29254 213.50026 0.44149 21.75773 16.60673 16.86761
14.2 -0.12244 213.47915 0.76041 21.32781 15.71094 16.61591
14.6 -0.18187 213.97085 0.62435 20.48334 15.52128 15.88558
15.0 0.43926 214.0227 0.46504 20.0903 15.26205 15.42852
15.4 0.41835 213.58499 0.63849 19.52831 14.90884 15.1097
15.8 0.18032 213.94654 0.78284 18.79068 14.05409 14.60949
16.2 -0.25101 213.63526 0.6584 17.99342 12.99839 14.02151
16.6 0.0437 213.82147 0.61656 17.9605 12.84739 13.30932
17.0 -0.03242 214.23998 0.41309 17.10848 12.89084 13.06245
17.4 0.51253 214.33878 0.74075 16.6313 12.79688 12.43951
17.8 0.2013 214.43421 0.49745 16.17698 11.7407 12.43572
18.2 0.17642 213.62008 0.47794 15.82157 11.26433 11.92436
18.6 -0.65358 212.80482 -0.33855 15.25011 10.78814 11.5162
19.0 -1.18992 212.42518 0.0507 15.13628 10.61917 11.19599
19.4 -1.38224 212.61981 0.07377 14.75117 10.78882 10.70644
19.8 -1.06368 213.83171 -0.0836 13.8676 10.83911 10.31234
