0.12500 0.02212
0.37500 0.06701
0.62500 0.14925
0.87500 0.22687
1.12500 0.27729
1.37500 0.33587
1.62500 0.34487
1.87500 0.37198
2.12500 0.38487
2.37500 0.40083
2.62500 0.41067
2.87500 0.41467
3.12500 0.42774
3.37500 0.44488
3.62500 0.43938
3.87500 0.45101
4.12500 0.47022
4.37500 0.47535
4.62500 0.48844
4.87500 0.49137
5.12500 0.50461
5.37500 0.51163
5.62500 0.52328
5.87500 0.54459
6.12500 0.54939
6.37500 0.55178
6.62500 0.55052
6.87500 0.56201
7.12500 0.58469
7.37500 0.56383
7.62500 0.57358
7.87500 0.55405
8.12500 0.55030
8.37500 0.54431
8.62500 0.53363
8.87500 0.52526
9.12500 0.49548
9.37500 0.47905
9.62500 0.46038
9.87500 0.43308
10.12500 0.43228
10.37500 0.42215
10.62500 0.39202
10.87500 0.36129
11.12500 0.35784
11.37500 0.35661
11.62500 0.32076
11.87500 0.31261
12.12500 0.30372
12.37500 0.28608
12.62500 0.25314
12.87500 0.24237
13.12500 0.22423
13.37500 0.21817
13.62500 0.19375
13.87500 0.17349
14.12500 0.15484
14.37500 0.14303
14.62500 0.12399
14.87500 0.10904
15.12500 0.10525
15.37500 0.11290
15.62500 0.08657
15.87500 0.09578
16.12500 0.09107
16.37500 0.09390
16.62500 0.06526
16.87500 0.07100
17.12500 0.06342
17.37500 0.06134
17.62500 0.05058
17.87500 0.02359
18.12500 0.02852
18.37500 0.03732
18.62500 0.02956
18.87500 0.01968
19.12500 0.04837
19.37500 0.02076
19.62500 0.01163
19.87500 0.02261
