0.120000 1.498950
0.380000 2.596790
0.620000 2.682720
0.880000 2.640850
1.120000 2.563130
1.380000 2.600470
1.620000 2.640110
1.880000 2.623110
2.120000 2.614720
2.380000 2.563250
2.620000 2.656770
2.880000 2.665900
3.120000 2.696880
3.380000 2.707160
3.620000 2.677920
3.880000 2.625480
4.120000 2.597890
4.380000 2.526900
4.620000 2.435100
4.880000 2.356390
5.120000 2.315830
5.380000 1.902670
5.620000 2.095540
5.880000 1.827000
6.120000 1.410160
6.380000 2.623280
6.620000 2.190750
6.880000 1.576230
7.120000 0.809840
7.380000 1.738420
7.620000 1.367780
7.880000 1.232200
8.120000 0.346250
8.380000 -0.218750
8.620000 0.340190
8.880000 0.940530
9.120000 -0.002780
9.380000 0.140780
9.620000 0.329790
9.880000 -0.139580
10.120000 0.060880
10.380000 -0.321840
10.620000 -0.186990
10.880000 -0.439700
11.120000 -0.456050
11.380000 -0.583190
11.620000 -0.471800
11.880000 -0.247520
12.120000 -0.782870
12.380000 -0.515810
12.620000 -0.553250
12.880000 -0.328180
13.120000 -0.763040
13.380000 -0.294000
13.620000 -1.662860
13.880000 0.325910
14.120000 -1.580380
14.380000 1.710490
14.620000 0.020220
14.880000 -0.448110
15.120000 0.387950
15.380000 -0.130390
15.620000 0.599030
15.880000 0.574840
16.120000 -1.266690
16.380000 -1.478910
16.620000 -1.346680
16.880000 -2.196630
17.120000 -1.528800
17.380000 -2.450520
17.620000 -2.083570
17.880000 -2.853280
18.120000 -1.824230
18.380000 -3.036610
18.620000 -3.026770
18.880000 2.642810
19.120000 3.062250
19.380000 2.306470
19.620000 2.327300
19.880000 -0.836560
