0.26 0.65829 72.88739 0.05314
0.51 1.06294 112.78688 0.04897
0.77 1.28264 128.86776 0.04454
1.02 1.29924 128.47193 0.04192
1.28 1.36171 129.94782 0.03899
1.54 1.33037 122.28588 0.03599
1.79 1.34224 116.88444 0.03307
2.05 1.32845 112.80704 0.03106
2.31 1.31333 106.40249 0.02866
2.56 1.32666 102.01863 0.02627
2.82 1.3477 99.23051 0.02425
3.08 1.30337 92.39541 0.02261
3.33 1.30069 87.4109 0.0207
3.59 1.39341 89.89343 0.0193
3.84 1.31131 81.05239 0.01785
4.1 1.35982 80.57555 0.01652
4.36 1.34347 75.80194 0.0152
4.61 1.40289 76.40195 0.01411
4.87 1.36737 70.59154 0.01315
5.12 1.46481 72.53641 0.01209
5.38 1.40849 67.2575 0.0112
5.64 1.43524 65.05055 0.01037
5.89 1.46521 64.5233 0.00975
6.15 1.49781 62.16262 0.00889
6.41 1.53347 60.22439 0.00818
6.66 1.58219 58.59347 0.0075
6.92 1.6186 57.3099 0.0069
7.17 1.63652 55.68688 0.00645
7.43 1.62338 53.95299 0.00602
7.69 1.66213 51.56659 0.00553
7.94 1.74336 53.06268 0.00515
8.2 1.67573 48.47215 0.00479
8.46 1.84986 49.43319 0.00435
8.71 1.81333 46.97357 0.00406
8.97 1.8484 46.64824 0.00383
9.22 1.90123 45.24731 0.0035
9.48 1.91528 44.25573 0.00326
9.74 1.9693 43.14412 0.00302
9.99 2.05496 42.51741 0.00275
