0.12500 0.03598
0.37500 0.13012
0.62500 0.24331
0.87500 0.34559
1.12500 0.40698
1.37500 0.44498
1.62500 0.46231
1.87500 0.47129
2.12500 0.47436
2.37500 0.48710
2.62500 0.48508
2.87500 0.49676
3.12500 0.50393
3.37500 0.51504
3.62500 0.52285
3.87500 0.51961
4.12500 0.51568
4.37500 0.51100
4.62500 0.48105
4.87500 0.46833
5.12500 0.44285
5.37500 0.40134
5.62500 0.38027
5.87500 0.36033
6.12500 0.33981
6.37500 0.31938
6.62500 0.32162
6.87500 0.29739
7.12500 0.27039
7.37500 0.26696
7.62500 0.22110
7.87500 0.19046
8.12500 0.16352
8.37500 0.12589
8.62500 0.11870
8.87500 0.10315
9.12500 0.07529
9.37500 0.10595
9.62500 0.08956
9.87500 0.07403
10.12500 0.08075
10.37500 0.08123
10.62500 0.06938
10.87500 0.05795
11.12500 0.06641
11.37500 0.06164
11.62500 0.05848
11.87500 0.05092
12.12500 0.06287
12.37500 0.06091
12.62500 0.04321
12.87500 0.02575
13.12500 0.03215
13.37500 0.03905
13.62500 0.07669
13.87500 0.06867
14.12500 0.07326
14.37500 0.08713
14.62500 0.09744
14.87500 0.10379
15.12500 0.11582
15.37500 0.11995
15.62500 0.13359
15.87500 0.12860
16.12500 0.11800
16.37500 0.09929
16.62500 0.12378
16.87500 0.10172
17.12500 0.08765
17.37500 0.08972
17.62500 0.09931
17.87500 0.05905
18.12500 0.07750
18.37500 0.07050
18.62500 0.09976
18.87500 0.10260
19.12500 0.09897
19.37500 0.10332
19.62500 0.09067
19.87500 0.08955
