0.12500 0.04376
0.37500 0.01120
0.62500 0.01980
0.87500 0.01758
1.12500 0.01543
1.37500 0.01057
1.62500 0.01734
1.87500 0.00703
2.12500 0.01435
2.37500 0.01808
2.62500 0.01630
2.87500 0.00863
3.12500 0.00487
3.37500 0.00246
3.62500 0.01268
3.87500 0.00711
4.12500 0.00418
4.37500 0.01589
4.62500 0.02311
4.87500 0.01093
5.12500 0.00971
5.37500 0.00799
5.62500 0.00592
5.87500 0.00796
6.12500 0.00778
6.37500 0.00582
6.62500 0.02578
6.87500 0.00790
7.12500 0.01926
7.37500 0.00895
7.62500 0.01855
7.87500 0.02614
8.12500 0.00508
8.37500 0.01155
8.62500 0.00460
8.87500 0.01600
9.12500 0.01693
9.37500 0.00678
9.62500 0.03323
9.87500 0.00573
10.12500 0.02163
10.37500 0.01794
10.62500 0.02429
10.87500 0.02399
11.12500 0.02351
11.37500 0.02515
11.62500 0.00823
11.87500 0.01761
12.12500 0.02132
12.37500 0.02063
12.62500 0.02003
12.87500 0.01506
13.12500 0.01821
13.37500 0.04147
13.62500 0.02027
13.87500 0.02919
14.12500 0.02888
14.37500 0.03574
14.62500 0.03245
14.87500 0.05043
