0.05000 -1964.64710 2325.19488 -18252.23891 0.00000 0.00000 0.00000
0.15000 1385.04975 -2.23687 990389.35109 2828.52289 2009.19692 1203976.00937
0.25000 -411.97088 224.37144 118686.24625 2764.29217 2238.23079 293443.50807
0.35000 19.63397 -145.07333 375415.32642 3143.85377 2049.59146 4342101.01379
0.45000 -233.75778 1.69264 118017.23113 3010.26130 1993.96213 996610.50083
0.55000 -603.45767 78.16847 -112658.56823 3011.64225 1974.82352 988232.46516
0.65000 -175.69692 49.11808 -230643.48976 3103.50390 2075.47020 1872031.75849
0.75000 -587.14604 15.60225 73745.93299 3089.81454 2092.12294 1313004.84762
0.85000 -798.61298 -271.06379 63429.53918 2903.28082 1930.61144 2026927.83257
0.95000 -743.24934 195.76064 -104711.30654 2969.28562 2238.53411 1772031.31780
1.05000 -584.96157 286.13367 112783.99523 3159.51678 2354.15516 1551508.78755
1.15000 -689.58860 -142.46603 16373.50298 2982.98446 2691.89015 1360178.30142
1.25000 -884.31011 -126.37277 69338.42633 2833.43357 2473.99830 1188137.12028
1.35000 -911.95911 -214.49470 -50765.72667 2843.52263 2648.99043 1140348.46223
1.45000 -1064.97095 70.48608 40560.48777 2853.64503 2745.07403 2126910.65968
1.55000 -1250.37167 43.18317 22051.30023 2524.50848 2682.53798 1575732.85078
1.65000 -1627.16543 99.58022 -17442.24006 2331.47950 2844.39457 1962328.87013
1.75000 -1874.86346 67.97415 30552.02986 2335.36194 2789.66949 1302569.20726
1.85000 -2261.12609 -105.63032 35815.82625 2138.67466 2900.50383 1963335.24759
1.95000 -2872.00001 -39.84961 2762.88556 1300.53128 3066.22050 1877309.41658
2.05000 -3309.53579 32.49086 1839.29428 1003.33803 2768.50680 1541338.53151
2.15000 -3605.00690 95.75738 -80341.98637 1002.37703 2518.06099 1689072.35067
2.25000 -3821.12886 -9.60315 4839.05597 834.46157 2275.95723 1875155.36926
2.35000 -3945.54911 -42.63439 40896.13779 947.36852 2121.96794 1917013.80454
2.45000 -4080.33363 92.51052 -33981.86690 868.07532 1956.41137 2155090.79133
2.55000 -4128.10765 -36.79263 26210.61924 874.78116 1799.29254 2262211.31197
2.65000 -4187.85280 39.68724 -55514.03292 996.43518 1704.80075 2284619.94231
2.75000 -4231.38309 -57.92841 21274.95374 655.17927 1529.82424 1885368.96954
2.85000 -4271.08488 -25.21518 53365.58545 687.82520 1504.68787 1522552.21481
2.95000 -4243.92279 -0.60518 -56449.40646 672.84249 1390.93789 2032726.81494
3.05000 -4233.51324 0.25244 -23308.89664 636.93935 1361.43320 2185192.79884
3.15000 -4271.36424 26.28412 -113864.33125 678.42385 1413.60524 2307711.57156
3.25000 -4265.15645 -35.90451 5.49100 662.46047 1208.31517 2064341.33233
3.35000 -4250.62732 -4.81194 -104909.80975 590.30760 1136.58377 2471325.80240
3.45000 -4245.36036 -34.35629 -24353.57719 553.42844 1117.84407 2193648.20339
3.55000 -4237.83526 23.50961 112112.66327 613.94833 1028.32095 2352241.60284
3.65000 -4217.82640 -31.06272 979.81113 551.39650 932.98589 2095810.55613
3.75000 -4223.45270 0.51203 12977.82278 617.23719 916.54390 2215598.56980
3.85000 -4203.42265 0.93272 15207.34142 532.04465 906.02093 2356045.22808
3.95000 -4180.77729 -18.17618 -4371.33677 516.84161 852.38507 1983731.90419
4.05000 -4157.83329 -10.91599 49467.97339 557.88275 833.45849 2153533.63560
4.15000 -4138.33810 -18.36540 -99427.97467 501.83222 781.10691 2078451.35183
4.25000 -4113.20841 8.97538 -35794.60279 468.10765 761.02566 2237786.07598
4.35000 -4094.01440 7.67916 -4005.88525 479.34140 730.77907 2205099.94627
4.45000 -4106.73611 -25.86524 -48255.09615 446.90279 718.92492 2182685.58458
4.55000 -4070.53908 17.80521 16455.39899 468.45870 740.31634 2347954.36119
4.65000 -4030.25752 16.19916 16989.70917 417.23725 655.86060 2408982.48832
4.75000 -4015.63255 10.29720 25504.43553 458.00136 664.71632 2214262.98034
4.85000 -3988.21065 -16.46219 35917.41401 447.43975 620.12929 2610579.57347
4.95000 -3972.85623 18.43938 -19051.32973 459.29465 622.38886 2403534.53562
5.05000 -3953.39808 7.46697 4201.04451 436.53090 610.08873 2685764.11892
5.15000 -3936.48760 8.92247 35633.55077 390.47709 558.48559 2278470.47718
5.25000 -3910.61666 20.41476 56756.93640 405.01263 543.41439 2004999.13239
5.35000 -3878.37186 13.47183 -10855.27648 365.34778 564.00056 1951270.34745
5.45000 -3861.96544 -0.19297 19893.97180 375.39566 534.51772 2157852.83381
5.55000 -3819.47887 -3.29341 -30818.35260 379.97239 522.33676 2299653.74205
5.65000 -3815.52057 -1.91816 54419.94709 346.38720 488.47884 2103825.15302
5.75000 -3793.66889 -3.17335 -7262.21502 337.83536 477.91974 2182314.83229
5.85000 -3761.97376 -7.28322 -19817.08978 368.38984 511.26279 2383463.18695
5.95000 -3736.85843 -0.75977 109201.49623 357.51367 484.95795 2582255.89564
6.05000 -3731.87205 12.45008 35692.44953 392.70752 543.28987 2332687.83759
6.15000 -3701.85927 14.97868 -65877.50977 311.31138 430.23538 2362329.30094
6.25000 -3675.61673 4.70716 -71830.02594 321.65734 415.39047 2816086.74761
6.35000 -3656.37279 6.16499 68075.32793 301.96537 414.00019 2630762.05669
6.45000 -3649.03331 -13.74219 9719.63660 321.71206 420.38578 2616243.08780
6.55000 -3620.51484 8.15432 -592.05410 296.84084 399.85306 2353072.16173
6.65000 -3609.38781 9.73488 -44896.19461 307.87371 407.15232 2203196.72275
6.75000 -3586.35906 0.74629 -3933.39627 323.46016 387.59551 2508849.61898
6.85000 -3567.40471 3.62810 37552.16212 297.39172 395.58953 2344520.86151
6.95000 -3532.14932 10.54661 -54540.53767 290.48441 375.67679 2162600.29290
7.05000 -3512.96277 5.44566 15878.22262 327.60336 369.77077 2225539.68169
7.15000 -3509.28890 -5.43961 -48995.34295 326.16022 393.51984 2497567.84996
7.25000 -3487.51770 -6.16978 -9641.85532 284.36850 354.71186 2231244.94965
7.35000 -3456.00450 -3.61346 -25703.93172 276.66986 325.17570 2139179.24244
7.45000 -3435.11362 -7.18184 36889.48594 290.95665 334.82946 2322374.53213
7.55000 -3426.79682 8.66919 16821.72094 283.05382 358.45297 2082685.59887
7.65000 -3402.02794 -1.81416 -1291.50422 296.39402 322.64171 2301866.08005
7.75000 -3393.76927 9.99225 1246.16902 333.85181 331.63055 2264617.98922
7.85000 -3370.27628 -4.32138 -120131.64820 251.41146 309.31121 2634949.08885
7.95000 -3341.53904 0.77554 -34165.13105 260.57510 301.42005 2157811.41708
8.05000 -3331.71962 5.73511 -36797.14133 328.22417 422.81071 2210619.28933
8.15000 -3305.97914 -9.65542 76253.26219 345.89118 321.70762 2105211.31099
8.25000 -3291.27152 -4.27351 -74890.09959 262.45589 302.22360 2385430.78778
8.35000 -3273.31499 -12.26590 -3224.55401 240.22058 285.40585 2197609.98525
8.45000 -3257.65867 2.21843 20488.63593 244.09096 296.97050 2201511.14369
8.55000 -3237.86313 2.92793 -8769.72403 242.60854 267.88551 2319359.99290
8.65000 -3229.18650 -5.78023 -86.73732 290.14108 326.57461 2414680.74244
8.75000 -3207.81528 7.53989 128572.84102 334.20727 293.47271 2313629.52171
8.85000 -3185.84473 -3.18766 -12295.18907 242.10109 275.92363 2058994.34326
8.95000 -3172.56996 4.32741 2059.39629 239.21590 275.33676 2172845.02158
9.05000 -3150.59934 -1.43391 29993.08309 214.98784 239.06517 2222169.16537
9.15000 -3139.34442 -5.08886 -8854.74280 236.69801 255.07459 2317105.62952
9.25000 -3121.65994 1.23949 69912.48796 233.00633 247.51125 2000503.76921
9.35000 -3104.83675 -4.15236 8296.50418 232.32056 259.78070 2048723.74018
9.45000 -3087.75353 7.55748 -20025.75873 258.25865 265.42033 2417161.96934
9.55000 -3073.16783 -1.23273 -18586.54561 237.05835 231.18888 2605163.35683
9.65000 -3053.74134 -11.71960 -24406.40004 214.59973 222.73696 2150950.63804
9.75000 -3038.70666 -4.78578 73061.64007 207.04176 227.77550 2391675.50643
9.85000 -3020.37400 -5.24926 83456.59203 213.67236 223.08356 2205514.28309
9.95000 -3003.86002 -0.95168 15077.53748 206.84920 228.12638 2306886.52203
10.05000 -2985.90804 0.20015 -21147.19089 216.22336 245.68241 2217230.01694
10.15000 -2968.30267 -3.46282 2293.70392 204.60191 207.01714 2336487.70523
10.25000 -2960.42469 1.47185 -71458.94729 225.83134 215.41267 2299195.72914
10.35000 -2932.23613 -2.91543 -15762.49664 208.54984 209.40333 2347030.88982
10.45000 -2927.98549 -1.46236 -61403.97983 203.11042 216.37860 2442280.00895
10.55000 -2910.35120 2.52461 -80105.15634 213.92471 244.76157 2178924.84626
10.65000 -2891.03664 1.60205 17353.11082 229.16026 208.09419 2313576.22181
10.75000 -2873.83375 -1.35603 53965.01694 235.98136 236.82729 1997374.71674
10.85000 -2872.58428 0.45801 -21539.93606 193.52964 225.01409 1870061.88981
10.95000 -2845.57846 -0.10954 92565.39435 196.58739 216.74407 2050679.09036
11.05000 -2829.44863 -2.13410 14971.26627 179.96916 179.67651 2464959.80735
11.15000 -2807.31000 1.44053 14333.34082 198.52159 182.87460 2275528.90437
11.25000 -2802.38563 3.02815 -51794.18052 189.95635 172.79285 2503482.31170
11.35000 -2782.81994 -0.43273 -127554.22161 232.11240 178.45003 2111961.02149
11.45000 -2768.22678 0.59574 -38750.22286 170.25187 184.29358 2294494.81690
11.55000 -2753.80148 0.35850 2594.68062 190.93822 206.12931 1975140.69983
11.65000 -2741.24801 -0.32978 -27532.88258 197.42846 197.82754 2321441.19660
11.75000 -2722.54032 -0.09197 -41002.89733 171.83228 165.52632 2345622.65552
11.85000 -2714.96019 1.89594 -8240.47955 181.89986 170.15430 2099444.34810
11.95000 -2703.16764 1.29809 22676.27664 158.00236 161.54393 2345638.86559
12.05000 -2682.60433 -2.29972 40411.43435 163.34796 151.46198 2365148.02660
12.15000 -2674.11746 1.44062 5501.64964 179.07734 160.83585 2210987.63855
12.25000 -2661.00529 -1.80644 50859.20649 214.59028 179.66936 2087838.40404
12.35000 -2646.42110 1.15725 -42549.50471 170.94446 168.23952 2395710.72481
12.45000 -2629.99987 -1.61212 -52924.29610 189.02118 176.49421 1931108.37355
12.55000 -2618.15688 2.63733 -76015.00134 160.28765 164.45824 2020958.19862
12.65000 -2605.24422 2.25239 -28186.65719 161.79376 155.47554 1855973.92895
12.75000 -2593.82651 -6.07115 4722.37701 161.99378 149.62477 2018716.06395
12.85000 -2581.06136 0.49980 32556.16526 173.89532 223.91348 2256472.42770
12.95000 -2571.11946 0.28336 -24523.42464 158.62867 149.33457 1870387.33213
13.05000 -2555.35041 1.78436 -45382.96955 167.04972 141.19212 1997311.78130
13.15000 -2545.07233 -0.14885 18116.08299 153.90090 135.99826 1860154.49219
13.25000 -2529.80097 -0.05326 -84463.53311 156.09204 140.05571 2150300.14155
13.35000 -2513.36414 0.19309 48393.43862 161.52569 139.44784 2003175.80537
13.45000 -2507.93835 0.34806 -20066.23290 146.74064 143.43932 2155540.59114
13.55000 -2493.80487 4.28266 17830.43807 159.17935 154.49380 2075179.88100
13.65000 -2480.51370 -1.56893 44792.15870 168.02826 142.05524 2146559.32582
13.75000 -2472.21955 -1.17182 -44406.85332 146.87145 126.08900 2142113.33556
13.85000 -2457.26853 2.91934 15986.38660 154.26827 132.35457 1876896.98009
13.95000 -2443.59153 -3.49140 10811.48672 146.59218 137.37868 2012477.31132
14.05000 -2435.55821 -0.76587 -28810.12381 149.80310 129.56394 1921164.70784
14.15000 -2418.74398 -0.53174 -53194.54405 154.10211 126.47986 1751195.41189
14.25000 -2406.25614 2.54245 -73881.82577 163.96814 121.09734 1872575.59674
14.35000 -2392.53543 -1.88158 8930.76347 141.84076 116.81805 1960118.73112
14.45000 -2380.27915 0.82797 -6242.57936 143.82840 124.42583 1859406.57575
14.55000 -2374.43567 0.07083 1067.42674 149.41447 116.52642 1872181.96607
14.65000 -2359.78624 -2.46857 -106473.37274 140.14085 116.66691 2115107.08729
14.75000 -2339.25234 -4.31915 11718.96319 160.51480 142.24580 2044364.57952
14.85000 -2335.44829 1.71359 -869.08534 141.82077 132.28656 1754451.04419
14.95000 -2326.31273 0.93215 -20309.75684 169.65621 122.55125 1971130.96154
15.05000 -2313.12790 1.76052 -54982.99987 184.13191 118.80439 2108200.90970
15.15000 -2304.22182 -0.77687 13393.99053 173.82692 144.05464 1908905.24841
15.25000 -2288.24169 0.70640 3881.72421 151.49356 130.62626 2024142.89412
15.35000 -2282.07276 1.42055 9325.94704 129.29517 105.44162 2216947.39436
15.45000 -2270.82306 -0.28417 -6215.23977 130.49152 109.76172 1947709.96756
15.55000 -2261.38491 -1.03432 12802.07789 134.07522 110.32309 1944485.83939
15.65000 -2248.32968 3.29579 -17599.92059 129.98599 105.37513 1981499.36476
15.75000 -2239.81329 1.16748 38413.50110 138.62792 117.06349 2025846.74372
15.85000 -2228.18614 -0.24354 -44030.67796 155.99094 155.29123 2084583.16421
15.95000 -2218.85457 -4.82273 -14551.93844 143.95952 104.15114 1913607.88226
16.05000 -2206.74122 -0.42088 79010.10225 123.15557 101.33575 1770708.92151
16.15000 -2192.97161 -0.75789 240.30232 158.38406 98.65583 1929232.68986
16.25000 -2183.39186 0.15559 66132.55483 125.92100 97.89181 2074276.46245
16.35000 -2176.65777 -0.03036 18352.95491 125.57336 99.22520 1795046.63734
16.45000 -2165.92078 -0.54764 -48905.51362 148.72085 118.35402 1797152.68531
16.55000 -2155.30344 -1.10560 -4209.70494 119.93711 99.57851 1782719.45494
16.65000 -2145.57028 -1.86907 -4626.52793 117.30330 99.43642 2027340.50032
16.75000 -2133.88756 1.65172 -10279.15832 133.50737 99.39619 1923839.96059
16.85000 -2126.28977 2.56224 34097.38349 119.32260 107.62259 1920246.78239
16.95000 -2115.44692 -3.70256 32853.42977 119.14352 123.79323 1849137.63845
17.05000 -2108.26831 -0.25733 36414.86458 115.81900 87.81040 1888442.77165
17.15000 -2097.56878 -1.99016 -18922.98348 131.43866 94.85059 1824491.96067
17.25000 -2090.39334 0.33900 -9795.22013 111.48767 88.37228 1847418.43839
17.35000 -2077.67206 1.41296 -54803.78886 137.69100 90.50134 1787131.31045
17.45000 -2067.14006 3.13972 19374.85343 122.90119 99.94635 1873453.25832
17.55000 -2060.30718 -0.40008 -38888.26448 111.04994 86.98920 1661303.04664
17.65000 -2049.18208 -0.58900 600.33554 115.95121 92.06053 1859233.64614
17.75000 -2038.08857 -2.92854 -45223.58057 131.34617 93.18341 2012040.49144
17.85000 -2032.82410 1.74446 59086.97191 120.82529 102.91813 1996217.60175
17.95000 -2018.38973 -0.33112 73381.29856 104.23666 79.42346 1872923.67300
18.05000 -2007.86897 -0.59064 1082.20427 136.37113 95.96411 1841433.93555
18.15000 -1997.94976 1.15874 -75640.15325 113.82949 87.54721 2083716.60188
18.25000 -1991.14007 -1.14563 -14316.38520 104.86172 80.55564 1924633.16775
18.35000 -1979.95670 0.52817 20676.40079 111.31741 81.25040 1941771.47005
18.45000 -1978.71095 2.25648 7577.73956 115.55118 108.59028 1793849.97941
18.55000 -1964.86768 -1.59882 -46057.09757 113.97553 78.74351 1839479.27619
18.65000 -1957.86095 -0.63815 -22693.07265 117.86347 83.78206 1904105.52219
18.75000 -1951.73529 1.73020 41965.28527 132.50627 126.49764 1939619.54791
18.85000 -1943.99630 -0.31491 -53945.87436 97.91616 77.00393 1831121.47883
18.95000 -1928.48794 0.40681 4863.89453 173.54961 110.66296 1914838.87905
19.05000 -1925.02573 -3.38695 -10050.72223 117.72411 108.55907 1834760.98741
19.15000 -1915.50516 -0.93995 10922.95911 100.22610 81.09894 1816187.79447
19.25000 -1909.43511 -1.77393 -65026.44301 110.79650 122.00642 1722587.22607
19.35000 -1899.65840 -0.96582 -61776.68864 98.38586 77.02853 1800184.84743
19.45000 -1890.27226 1.47297 17218.88335 107.60751 95.53189 1813907.80286
19.55000 -1883.54802 0.18044 -25009.60347 113.48714 82.38059 1734849.98151
19.65000 -1876.17593 1.00973 29602.91121 100.17632 77.01681 1624417.24119
19.75000 -1864.97623 -0.63865 15941.07605 94.85034 68.80097 1843019.76259
19.85000 -1856.94283 -1.53903 -19581.02694 95.60474 86.40677 1781436.35242
19.95000 -1848.13405 -0.75983 -43930.83644 92.24131 66.70685 1974523.80796
