0.12500 0.00934
0.37500 0.05336
0.62500 0.13576
0.87500 0.20487
1.12500 0.26886
1.37500 0.31321
1.62500 0.36226
1.87500 0.38555
2.12500 0.42591
2.37500 0.46773
2.62500 0.49585
2.87500 0.52744
3.12500 0.54328
3.37500 0.55714
3.62500 0.57574
3.87500 0.57650
4.12500 0.56946
4.37500 0.53296
4.62500 0.48861
4.87500 0.41991
5.12500 0.35175
5.37500 0.28964
5.62500 0.25167
5.87500 0.23722
6.12500 0.22310
6.37500 0.24012
6.62500 0.25455
6.87500 0.24770
7.12500 0.24858
7.37500 0.22415
7.62500 0.19981
7.87500 0.18186
8.12500 0.13542
8.37500 0.12936
8.62500 0.09353
8.87500 0.08419
9.12500 0.06074
9.37500 0.05553
9.62500 0.05600
9.87500 0.05581
10.12500 0.07658
10.37500 0.03656
10.62500 0.03750
10.87500 0.03101
11.12500 0.02979
11.37500 0.03517
11.62500 0.01188
11.87500 0.03852
12.12500 0.04616
12.37500 0.04035
12.62500 0.05081
12.87500 0.05862
13.12500 0.04392
13.37500 0.06295
13.62500 0.05630
13.87500 0.06319
14.12500 0.05269
14.37500 0.10131
14.62500 0.07005
14.87500 0.10847
