0.120000 0.199570
0.380000 -0.846400
0.620000 -0.501470
0.880000 -0.157540
1.120000 -0.192650
1.380000 -0.188070
1.620000 -0.340850
1.880000 -0.632110
2.120000 -0.903780
2.380000 -0.974130
2.620000 -1.259440
2.880000 -0.996530
3.120000 -1.984490
3.380000 -1.625810
3.620000 -2.306270
3.880000 -2.243650
4.120000 -1.992390
4.380000 -1.606560
4.620000 -1.319640
4.880000 -1.170520
5.120000 -1.002560
5.380000 -0.885520
5.620000 -0.678800
5.880000 -0.485980
6.120000 -0.270710
6.380000 -0.440460
6.620000 -0.502190
6.880000 -0.998630
7.120000 -0.472350
7.380000 -0.971840
7.620000 -2.079810
7.880000 -2.336180
8.120000 -2.783210
8.380000 -2.667520
8.620000 -2.857200
8.880000 2.441620
9.120000 2.937520
9.380000 2.332880
9.620000 2.712860
9.880000 2.384900
10.120000 -2.869570
10.380000 2.827030
10.620000 3.127030
10.880000 2.531740
11.120000 2.456530
11.380000 2.239510
11.620000 2.027990
11.880000 1.739480
12.120000 1.665700
12.380000 1.972880
12.620000 1.395500
12.880000 2.234600
13.120000 2.558530
13.380000 1.778870
13.620000 2.558580
13.880000 2.132330
14.120000 -0.115590
14.380000 -1.919720
14.620000 -1.510410
14.880000 -1.721150
