0.12500 0.03347
0.37500 0.01931
0.62500 0.00570
0.87500 0.00568
1.12500 0.00983
1.37500 0.01099
1.62500 0.00783
1.87500 0.01829
2.12500 0.00438
2.37500 0.00687
2.62500 0.00927
2.87500 0.01889
3.12500 0.01135
3.37500 0.01266
3.62500 0.01189
3.87500 0.01026
4.12500 0.00527
4.37500 0.00730
4.62500 0.01127
4.87500 0.00610
5.12500 0.02433
5.37500 0.01217
5.62500 0.01467
5.87500 0.01245
6.12500 0.01801
6.37500 0.00566
6.62500 0.01453
6.87500 0.00895
7.12500 0.00566
7.37500 0.01473
7.62500 0.01572
7.87500 0.01639
8.12500 0.00346
8.37500 0.00780
8.62500 0.00982
8.87500 0.01625
9.12500 0.01292
9.37500 0.01289
9.62500 0.01147
9.87500 0.00990
10.12500 0.00763
10.37500 0.01131
10.62500 0.01065
10.87500 0.01292
11.12500 0.01442
11.37500 0.00757
11.62500 0.00076
11.87500 0.00149
12.12500 0.00758
12.37500 0.00699
12.62500 0.00390
12.87500 0.00634
13.12500 0.00727
13.37500 0.03064
13.62500 0.00052
13.87500 0.00424
14.12500 0.00677
14.37500 0.03147
14.62500 0.00503
14.87500 0.00542
