0.120000 0.252680
0.380000 0.939200
0.620000 2.616940
0.880000 1.810170
1.120000 1.221730
1.380000 1.027840
1.620000 1.275460
1.880000 1.129410
2.120000 0.868170
2.380000 1.107440
2.620000 1.026360
2.880000 0.991830
3.120000 0.804580
3.380000 1.286630
3.620000 1.584810
3.880000 1.899620
4.120000 -3.115910
4.380000 2.219420
4.620000 2.355900
4.880000 2.367160
5.120000 2.692380
5.380000 2.733270
5.620000 0.301270
5.880000 0.451000
6.120000 -0.133070
6.380000 -0.262750
6.620000 -0.953990
6.880000 -0.149850
7.120000 -0.506290
7.380000 0.632970
7.620000 1.065450
7.880000 2.504550
8.120000 1.497690
8.380000 0.372990
8.620000 2.673660
8.880000 1.711440
9.120000 2.742550
9.380000 -0.705390
9.620000 0.285080
9.880000 0.024720
10.120000 -0.157970
10.380000 0.127710
10.620000 -0.687500
10.880000 -0.637190
11.120000 -1.283070
11.380000 -0.888530
11.620000 -1.458510
11.880000 -1.842100
12.120000 -2.016910
12.380000 -1.617150
12.620000 -1.245530
12.880000 0.675140
13.120000 0.219880
13.380000 0.307160
13.620000 -0.247660
13.880000 0.428670
14.120000 1.067480
14.380000 0.582230
14.620000 1.782510
14.880000 1.478940
