0.05000 6503.06234
0.15000 7338.90291
0.25000 8827.32220
0.35000 10128.94172
0.45000 10674.77411
0.55000 10714.42461
0.65000 10663.82144
0.75000 10405.19054
0.85000 10007.62655
0.95000 9658.79259
1.05000 9139.31658
1.15000 8870.27865
1.25000 8381.58719
1.35000 8022.36381
1.45000 7660.40994
1.55000 7398.68718
1.65000 7108.96899
1.75000 6848.68799
1.85000 6502.52119
1.95000 6312.82459
2.05000 6119.04259
2.15000 5849.20755
2.25000 5645.60674
2.35000 5537.25999
2.45000 5338.85964
2.55000 5149.86376
2.65000 4999.34280
2.75000 4814.70291
2.85000 4679.38335
2.95000 4518.32642
3.05000 4321.06183
3.15000 4169.77565
3.25000 4067.05086
3.35000 3919.99188
3.45000 3756.86910
3.55000 3663.55969
3.65000 3465.21196
3.75000 3388.55619
3.85000 3287.30178
3.95000 3153.27486
4.05000 3044.75525
4.15000 2969.10822
4.25000 2860.88698
4.35000 2786.40546
4.45000 2660.67638
4.55000 2599.77526
4.65000 2578.24424
4.75000 2439.15037
4.85000 2365.13202
4.95000 2303.33009
5.05000 2173.01305
5.15000 2144.81231
5.25000 2051.86704
5.35000 1960.45822
5.45000 1878.46170
5.55000 1805.26623
5.65000 1726.95024
5.75000 1628.82684
5.85000 1571.78786
5.95000 1505.54307
6.05000 1432.38883
6.15000 1385.10537
6.25000 1333.71890
6.35000 1259.96113
6.45000 1204.50223
6.55000 1177.27296
6.65000 1132.92604
6.75000 1114.14075
6.85000 1073.07875
6.95000 1043.41252
7.05000 1023.91389
7.15000 1000.00754
7.25000 959.74648
7.35000 929.18582
7.45000 911.59257
7.55000 874.40387
7.65000 852.18782
7.75000 835.88316
7.85000 792.77313
7.95000 761.50764
8.05000 757.73378
8.15000 735.47106
8.25000 721.99634
8.35000 690.20042
8.45000 671.93482
8.55000 647.85833
8.65000 628.37080
8.75000 609.27814
8.85000 595.02084
8.95000 578.92533
9.05000 561.67217
9.15000 548.50454
9.25000 545.01855
9.35000 519.35807
9.45000 517.58387
9.55000 494.00661
9.65000 496.11710
9.75000 483.96376
9.85000 476.82566
9.95000 465.35925
10.05000 454.09669
10.15000 448.24650
10.25000 429.02945
10.35000 422.29423
10.45000 404.39863
10.55000 412.04094
10.65000 395.65721
10.75000 387.00057
10.85000 377.60274
10.95000 359.88765
11.05000 363.34543
11.15000 362.92415
11.25000 339.22236
11.35000 346.06853
11.45000 333.50960
11.55000 327.45897
11.65000 313.30654
11.75000 321.58786
11.85000 302.56439
11.95000 311.68271
12.05000 295.97930
12.15000 305.02857
12.25000 293.77670
12.35000 288.39970
12.45000 288.46558
12.55000 276.15655
12.65000 268.33654
12.75000 274.14780
12.85000 267.77193
12.95000 268.77885
13.05000 254.10004
13.15000 253.11257
13.25000 246.24066
13.35000 247.07853
13.45000 242.30563
13.55000 239.36754
13.65000 227.78285
13.75000 217.62140
13.85000 224.84240
13.95000 223.13004
14.05000 215.04609
14.15000 205.71002
14.25000 195.54318
14.35000 196.18867
14.45000 196.51581
14.55000 185.39526
14.65000 184.71019
14.75000 178.79617
14.85000 174.00639
14.95000 169.66813
15.05000 168.41213
15.15000 163.97698
15.25000 157.64852
15.35000 166.21853
15.45000 157.13234
15.55000 155.16071
15.65000 152.43441
15.75000 137.87764
15.85000 132.50007
15.95000 133.49983
16.05000 135.94634
16.15000 131.64162
16.25000 119.09261
16.35000 129.12496
16.45000 124.69066
16.55000 113.48169
16.65000 113.93419
16.75000 125.62054
16.85000 112.62911
16.95000 114.16525
17.05000 103.10903
17.15000 99.34947
17.25000 106.06885
17.35000 115.86829
17.45000 104.65552
17.55000 104.54497
17.65000 104.19239
17.75000 97.59877
17.85000 94.57640
17.95000 93.77964
18.05000 95.14654
18.15000 81.16019
18.25000 81.79370
18.35000 86.22550
18.45000 78.28980
18.55000 87.37160
18.65000 87.46568
18.75000 96.00905
18.85000 73.66185
18.95000 78.07675
19.05000 76.57672
19.15000 79.69337
19.25000 67.64985
19.35000 82.29984
19.45000 76.83554
19.55000 88.34265
19.65000 70.24885
19.75000 63.22895
19.85000 71.68497
19.95000 69.59125
