0.1875 -1.02431 19.49037 -1.53733 73.83006 72.93578 71.14623
0.5625 0.60832 40.49127 0.18248 72.09458 70.76119 65.57762
0.9375 0.78445 63.81751 1.82116 68.10227 68.02038 63.81304
1.3125 0.78219 83.37038 1.05827 64.329 64.78576 59.42433
1.6875 0.12484 101.72885 -0.34807 60.40527 58.9276 56.76242
2.0625 0.64321 114.00282 1.36892 57.19253 55.97091 54.69719
2.4375 1.10716 124.41406 -0.49628 54.65986 53.26146 51.72071
2.8125 2.04575 134.63238 -0.30121 52.73333 49.90106 49.60987
3.1875 1.61251 143.96704 -0.03387 50.77028 46.47661 47.05499
3.5625 2.23348 150.98312 0.31947 48.56201 44.34284 44.82302
3.9375 -0.49154 157.81324 -0.37601 46.64843 42.05618 43.07165
4.3125 -0.81334 162.88905 -0.55404 45.54516 40.14922 41.3048
4.6875 -0.46951 169.52326 -0.08931 42.89064 37.88088 39.19349
5.0625 -0.80142 174.97524 -0.21169 41.26429 35.80312 37.46308
5.4375 0.46084 178.69958 -0.57795 40.27636 33.82137 35.7981
5.8125 1.07912 181.6213 -0.57666 38.62449 33.30269 34.09032
6.1875 0.40074 185.39828 -0.48436 37.43125 30.87473 32.93431
6.5625 0.63895 187.67659 -0.4238 36.29639 30.53418 31.70454
6.9375 0.46575 192.24254 -0.69929 34.6097 29.10373 30.32461
7.3125 0.91214 195.357 -0.06452 33.26436 28.32427 28.72182
7.6875 1.18104 197.49967 -0.57833 32.91798 26.55797 27.8345
8.0625 0.47479 199.02217 -0.58527 31.2986 25.29528 26.57537
8.4375 0.56174 200.48405 0.13336 29.87247 24.52516 25.5834
8.8125 -0.17943 203.02532 -0.86032 29.87505 23.9912 24.36978
9.1875 -0.53079 204.45199 -0.4219 28.20983 22.87944 23.71667
9.5625 -0.34517 205.77275 -1.29779 27.14571 22.11204 22.28138
9.9375 -0.95895 206.80188 -0.73649 26.27354 20.30538 22.22023
10.3125 -2.38941 206.04432 -0.30484 25.74229 19.30005 20.2972
10.6875 -2.78552 206.7126 0.05016 25.53098 18.18402 19.9827
11.0625 -2.91597 207.84043 0.75844 24.0872 17.73803 19.31111
11.4375 -2.78279 208.04415 0.60126 23.50817 17.07863 18.14704
11.8125 0.19429 209.86364 1.12051 21.48944 16.90561 17.68981
12.1875 0.16795 210.23582 1.32304 21.38156 16.59941 17.06849
12.5625 2.93368 210.3054 0.92554 20.49362 16.27607 16.64173
12.9375 2.43805 210.67719 0.05398 20.66443 15.77327 15.97582
13.3125 1.4217 210.44604 -0.3751 19.74483 16.195 15.58943
13.6875 0.64752 211.47183 -0.20181 19.75419 15.28634 15.07484
14.0625 -0.01258 210.94938 -0.37718 19.11885 14.07555 14.5756
14.4375 -1.04078 211.24755 -0.00542 18.82804 12.87614 13.92793
14.8125 -1.51888 210.43969 0.86014 18.63851 12.48435 13.56436
15.1875 -3.47858 210.78976 1.90823 16.77836 11.48793 12.81894
15.5625 -2.62868 210.38696 2.70946 16.2154 11.50978 12.94724
15.9375 -1.74936 210.12719 2.36312 15.25159 11.78444 12.37892
16.3125 -1.11076 210.70257 2.95075 14.5762 9.81515 10.9948
16.6875 -1.11476 210.37786 2.38477 13.85662 9.69939 10.6397
17.0625 -0.2955 210.36963 1.49278 13.82835 9.86421 10.3582
17.4375 0.14391 209.87553 0.84829 13.30655 9.87866 10.66017
17.8125 -0.82355 210.26116 -0.10474 13.02221 9.43016 10.39539
18.1875 0.36643 209.93744 -0.41985 11.94371 9.36266 9.81953
18.5625 1.85329 210.36778 -0.96222 12.41211 9.97293 9.96592
18.9375 3.79915 210.8935 -0.62751 12.61032 9.33691 8.91927
19.3125 3.77478 210.5112 -0.7103 12.3318 10.21559 8.65868
19.6875 5.5553 210.6657 -1.2433 12.7875 9.75103 8.88479
20.0625 4.12177 211.36261 0.3823 11.97381 9.81338 8.74362
20.4375 3.19467 211.09039 0.05379 11.51245 9.94134 8.27585
20.8125 0.90884 210.56042 1.16207 10.31626 10.07277 7.85612
21.1875 -0.81813 212.11415 1.48331 10.21195 8.51126 7.50006
21.5625 -0.70252 211.65264 1.89655 10.56108 8.27951 7.64129
21.9375 -1.19399 212.02542 2.13682 9.62897 6.99569 6.89651
22.3125 -2.34873 211.35212 2.52105 9.05792 7.37521 7.35335
22.6875 -2.75425 211.49777 2.90499 9.36537 6.24355 6.6727
23.0625 -1.85418 209.64038 2.59858 9.62793 5.6551 7.22018
23.4375 -0.46333 209.99742 2.46384 8.70153 5.19902 6.3346
23.8125 -2.20141 210.31294 2.88501 9.98196 4.83517 6.98252
24.1875 -1.1849 209.7928 2.42975 8.81484 4.73605 6.10943
24.5625 -2.36162 209.79698 1.77634 8.5927 4.65879 6.22005
24.9375 -1.92981 209.09101 2.02846 8.58085 4.65704 6.52743
25.3125 -2.81255 208.59937 2.09424 7.69219 4.33733 6.58465
25.6875 -2.95711 207.78763 1.98399 7.36012 4.76575 5.9207
26.0625 -3.97696 207.83416 2.11791 7.81546 4.5559 5.73222
26.4375 -2.11193 207.03629 0.64459 8.21209 4.70182 6.01413
26.8125 -3.72704 206.68802 1.40366 6.26767 4.7692 5.00234
27.1875 -3.20858 205.74019 1.32697 5.9955 4.43567 5.32568
27.5625 -2.82845 204.81836 1.50197 6.42255 5.60364 5.04646
27.9375 -3.19748 205.37028 -0.04271 6.7153 4.99011 6.12313
28.3125 -0.28488 203.98871 1.40272 5.35604 4.19359 4.81124
28.6875 -2.66676 203.77405 -0.34094 7.35961 5.11021 5.84174
29.0625 -0.02613 203.39316 0.26617 5.33227 4.90116 5.32446
29.4375 0.10368 202.92704 0.72258 6.27891 4.54471 4.42567
29.8125 -0.23364 202.18729 -0.64935 5.40732 4.69066 4.01946
