0.12500 0.00775
0.37500 0.01572
0.62500 0.01586
0.87500 0.02043
1.12500 0.03862
1.37500 0.05322
1.62500 0.06574
1.87500 0.05746
2.12500 0.05068
2.37500 0.05645
2.62500 0.05041
2.87500 0.05236
3.12500 0.04765
3.37500 0.05145
3.62500 0.05825
3.87500 0.06948
4.12500 0.06230
4.37500 0.05211
4.62500 0.03381
4.87500 0.03373
5.12500 0.02569
5.37500 0.01160
5.62500 0.00801
5.87500 0.01517
6.12500 0.01007
6.37500 0.01634
6.62500 0.02008
6.87500 0.01373
7.12500 0.01772
7.37500 0.01650
7.62500 0.01867
7.87500 0.01973
8.12500 0.00255
8.37500 0.00887
8.62500 0.01955
8.87500 0.00994
9.12500 0.01792
9.37500 0.01328
9.62500 0.01631
9.87500 0.00662
10.12500 0.01661
10.37500 0.01727
10.62500 0.01963
10.87500 0.01738
11.12500 0.02208
11.37500 0.02148
11.62500 0.00283
11.87500 0.01196
12.12500 0.01593
12.37500 0.02524
12.62500 0.03738
12.87500 0.00614
13.12500 0.01179
13.37500 0.02771
13.62500 0.01186
13.87500 0.02271
14.12500 0.01732
14.37500 0.01846
14.62500 0.01775
14.87500 0.01578
