0.12500 0.02489
0.37500 0.03531
0.62500 0.06035
0.87500 0.06780
1.12500 0.08729
1.37500 0.11288
1.62500 0.12996
1.87500 0.16130
2.12500 0.19045
2.37500 0.17692
2.62500 0.16384
2.87500 0.17285
3.12500 0.15637
3.37500 0.13655
3.62500 0.12690
3.87500 0.11565
4.12500 0.10308
4.37500 0.06578
4.62500 0.04450
4.87500 0.02943
5.12500 0.05661
5.37500 0.02005
5.62500 0.00847
5.87500 0.00658
6.12500 0.03514
6.37500 0.01429
6.62500 0.01028
6.87500 0.00943
7.12500 0.01357
7.37500 0.01778
7.62500 0.02076
7.87500 0.03148
8.12500 0.01427
8.37500 0.02210
8.62500 0.01961
8.87500 0.01466
9.12500 0.03476
9.37500 0.02369
9.62500 0.03512
9.87500 0.02168
10.12500 0.01943
10.37500 0.01831
10.62500 0.04024
10.87500 0.03309
11.12500 0.03086
11.37500 0.07395
11.62500 0.05109
11.87500 0.02722
12.12500 0.04701
12.37500 0.08168
12.62500 0.05830
12.87500 0.04354
13.12500 0.06287
13.37500 0.03814
13.62500 0.03780
13.87500 0.03421
14.12500 0.02380
14.37500 0.05386
14.62500 0.03063
14.87500 0.02121
