0.12500 0.01327
0.37500 0.01694
0.62500 0.00882
0.87500 0.01874
1.12500 0.01292
1.37500 0.02011
1.62500 0.03164
1.87500 0.04474
2.12500 0.03931
2.37500 0.03736
2.62500 0.04763
2.87500 0.03680
3.12500 0.02787
3.37500 0.03188
3.62500 0.01969
3.87500 0.01727
4.12500 0.01781
4.37500 0.02168
4.62500 0.01973
4.87500 0.03583
5.12500 0.03499
5.37500 0.02650
5.62500 0.03313
5.87500 0.03262
6.12500 0.03294
6.37500 0.03490
6.62500 0.02055
6.87500 0.03272
7.12500 0.02754
7.37500 0.03058
7.62500 0.01523
7.87500 0.01408
8.12500 0.01758
8.37500 0.01636
8.62500 0.03321
8.87500 0.02548
9.12500 0.02908
9.37500 0.02483
9.62500 0.01484
9.87500 0.00909
10.12500 0.01173
10.37500 0.02851
10.62500 0.02074
10.87500 0.03132
11.12500 0.03026
11.37500 0.02901
11.62500 0.03329
11.87500 0.02006
12.12500 0.00904
12.37500 0.02580
12.62500 0.02588
12.87500 0.02269
13.12500 0.00473
13.37500 0.01691
13.62500 0.00328
13.87500 0.01067
14.12500 0.02713
14.37500 0.02651
14.62500 0.04841
14.87500 0.05742
