0.05000 3687.12732
0.15000 5792.94668
0.25000 8721.26437
0.35000 9768.12199
0.45000 10168.29520
0.55000 9931.75848
0.65000 9953.66883
0.75000 9547.01333
0.85000 9162.75351
0.95000 8742.92433
1.05000 8554.09543
1.15000 7821.42458
1.25000 7410.46418
1.35000 7249.51014
1.45000 6947.17094
1.55000 6507.11177
1.65000 6321.19794
1.75000 5869.07410
1.85000 5638.97565
1.95000 5644.93055
2.05000 5343.75091
2.15000 4960.75519
2.25000 4774.19731
2.35000 4621.78076
2.45000 4512.25564
2.55000 4310.58599
2.65000 4124.71482
2.75000 4050.17314
2.85000 3799.22340
2.95000 3739.23220
3.05000 3573.97500
3.15000 3469.12075
3.25000 3335.29648
3.35000 3271.90511
3.45000 3106.53258
3.55000 2979.29107
3.65000 2933.89299
3.75000 2832.96070
3.85000 2800.62068
3.95000 2688.93462
4.05000 2621.98210
4.15000 2521.21075
4.25000 2453.41141
4.35000 2440.32236
4.45000 2312.30575
4.55000 2259.49276
4.65000 2218.14214
4.75000 2149.60347
4.85000 2141.31673
4.95000 2004.50678
5.05000 1972.21764
5.15000 1941.79092
5.25000 1864.65555
5.35000 1824.31846
5.45000 1817.41347
5.55000 1739.08017
5.65000 1698.31793
5.75000 1664.47946
5.85000 1604.64304
5.95000 1618.66088
6.05000 1541.11451
6.15000 1483.82736
6.25000 1457.77226
6.35000 1458.04081
6.45000 1399.89260
6.55000 1395.14917
6.65000 1308.33103
6.75000 1305.79525
6.85000 1276.00099
6.95000 1254.83646
7.05000 1203.59381
7.15000 1189.35750
7.25000 1167.96532
7.35000 1169.66358
7.45000 1116.96038
7.55000 1061.14087
7.65000 1103.89519
7.75000 1028.98312
7.85000 1026.49318
7.95000 968.19699
8.05000 961.08485
8.15000 952.26867
8.25000 920.11476
8.35000 909.67816
8.45000 910.86490
8.55000 873.13730
8.65000 858.41978
8.75000 848.48786
8.85000 833.43476
8.95000 785.27262
9.05000 778.71170
9.15000 777.83738
9.25000 742.84061
9.35000 742.88321
9.45000 731.28509
9.55000 695.11593
9.65000 680.15756
9.75000 667.74801
9.85000 647.64096
9.95000 646.11083
10.05000 638.89180
10.15000 618.42478
10.25000 599.10600
10.35000 569.57512
10.45000 596.32844
10.55000 563.17351
10.65000 567.27278
10.75000 547.89602
10.85000 515.96548
10.95000 539.23273
11.05000 496.53731
11.15000 491.21808
11.25000 493.07285
11.35000 489.97171
11.45000 464.21023
11.55000 472.03679
11.65000 476.66226
11.75000 446.18024
11.85000 428.67772
11.95000 434.02680
12.05000 421.30042
12.15000 429.33184
12.25000 385.49207
12.35000 393.50510
12.45000 394.72548
12.55000 379.28136
12.65000 370.15105
12.75000 375.81145
12.85000 345.25083
12.95000 347.63616
13.05000 349.14009
13.15000 338.21260
13.25000 368.03913
13.35000 337.46356
13.45000 334.42757
13.55000 325.47842
13.65000 321.20781
13.75000 323.72704
13.85000 294.18606
13.95000 304.43852
14.05000 301.83194
14.15000 316.68104
14.25000 299.46792
14.35000 284.33457
14.45000 274.57739
14.55000 289.35090
14.65000 250.54769
14.75000 272.07615
14.85000 267.73688
14.95000 238.05333
15.05000 262.36621
15.15000 248.60150
15.25000 241.15750
15.35000 223.38070
15.45000 239.62713
15.55000 226.98777
15.65000 214.38257
15.75000 202.66407
15.85000 209.59771
15.95000 208.44041
16.05000 196.45704
16.15000 184.48013
16.25000 191.79416
16.35000 182.13350
16.45000 190.17135
16.55000 187.06944
16.65000 184.67527
16.75000 188.38632
16.85000 191.48431
16.95000 176.42080
17.05000 173.16819
17.15000 176.87777
17.25000 179.43765
17.35000 148.50731
17.45000 154.44234
17.55000 164.13270
17.65000 151.91779
17.75000 160.14844
17.85000 151.61270
17.95000 151.85493
18.05000 143.47650
18.15000 151.83175
18.25000 164.30248
18.35000 163.41281
18.45000 135.02022
18.55000 142.73474
18.65000 124.11301
18.75000 149.76802
18.85000 141.15956
18.95000 148.50695
19.05000 140.72132
19.15000 126.66488
19.25000 128.79348
19.35000 127.06926
19.45000 128.97822
19.55000 143.12412
19.65000 128.11531
19.75000 137.99398
19.85000 115.04655
19.95000 123.28100
