0.1875 -1.62522 19.6912 -2.18447 127.41333 125.73436 123.62196
0.5625 0.98774 45.30714 -0.73989 106.85305 103.63419 99.15145
0.9375 0.23563 71.70265 -1.75844 96.33385 92.77126 86.00649
1.3125 -0.02277 96.61832 -0.79467 85.90199 85.28945 75.79737
1.6875 0.75935 116.71128 -0.33415 77.15685 75.73304 67.77622
2.0625 1.01166 131.1187 -0.69532 70.00231 67.39275 61.53909
2.4375 -1.51178 142.04155 -0.07981 63.03698 60.41105 56.33094
2.8125 -3.16447 152.2857 -0.9221 59.21774 55.08768 51.09405
3.1875 -0.36146 161.8388 -1.67839 55.23411 49.41951 47.34999
3.5625 0.71263 166.97228 -0.20737 52.60441 45.63051 44.77125
3.9375 0.89964 171.82034 -0.30962 49.3676 43.48567 42.90545
4.3125 1.1386 175.74889 -0.32087 48.16541 40.31603 40.41299
4.6875 2.57494 179.65407 0.45712 46.20395 39.07837 38.09471
5.0625 0.69072 183.43461 -0.03982 44.16749 37.29305 36.08488
5.4375 0.63114 186.50605 0.79356 42.84836 35.99443 35.14125
5.8125 -1.00299 189.42808 0.54843 40.91987 34.27543 33.68716
6.1875 -0.98601 193.36335 1.37641 39.59496 32.14541 32.42275
6.5625 -1.4517 195.37665 1.67178 38.08387 30.73883 30.43493
6.9375 -0.83407 197.60527 1.54364 37.57914 29.25356 30.05081
7.3125 -0.94331 199.39024 1.68761 35.9184 27.62449 28.66093
7.6875 -1.57022 199.63369 1.63005 34.87341 26.44178 27.98969
8.0625 -1.40894 199.9663 2.55571 34.6481 25.76343 27.2781
8.4375 -1.21429 200.6963 1.85604 33.80387 24.64116 26.29519
8.8125 -1.68232 201.05498 1.21858 32.58835 24.71904 25.14893
9.1875 -1.19016 202.16078 0.89272 32.0484 24.11914 24.20213
9.5625 -0.55677 202.79089 0.08675 30.17755 23.52284 23.11885
9.9375 0.60224 203.29162 0.39232 30.24848 22.77696 23.26323
10.3125 0.64637 204.49427 -0.3604 28.92972 22.59991 22.43656
10.6875 1.15234 204.57966 -0.03083 27.74735 21.54497 21.77094
11.0625 1.19434 204.65587 -0.35886 27.69863 20.79376 21.23294
11.4375 1.61284 205.39593 -1.0503 26.94135 19.5181 20.86105
11.8125 -0.14012 204.36396 -0.42395 25.93466 19.19903 19.71913
12.1875 1.0325 205.41551 0.32838 25.09521 19.04635 18.97466
12.5625 1.65141 205.40899 0.29177 24.50385 17.86583 17.60091
12.9375 0.76772 205.73523 0.63925 23.4462 17.99139 17.40437
13.3125 0.48728 205.93587 0.21499 23.41544 18.02614 16.69479
13.6875 0.28471 206.98788 1.42575 21.47124 17.23348 16.23598
14.0625 2.40357 207.7408 0.93339 21.61005 15.91999 15.81604
14.4375 1.53924 207.24545 1.52189 20.73309 16.18348 15.23052
14.8125 1.72255 206.59179 1.61872 21.21325 15.08862 14.50035
15.1875 -0.34182 207.1604 0.62068 19.23099 14.58871 14.44977
15.5625 0.10772 206.42358 -0.16658 18.83267 14.71844 14.21611
15.9375 -1.35101 207.48751 -0.02047 18.21314 13.47136 13.29796
16.3125 -1.06353 207.47843 0.46104 17.60562 13.80967 12.81853
16.6875 -2.73811 207.97591 0.40821 17.4446 13.06291 12.48423
17.0625 -1.90144 208.84582 0.5537 16.605 11.61499 12.63169
17.4375 -2.02498 208.50025 0.90098 16.15499 11.58119 12.53568
17.8125 0.10108 207.77618 2.08415 16.70397 10.61875 12.02218
18.1875 -0.35817 205.04114 1.26932 15.26448 10.71322 12.01624
18.5625 -1.55182 204.72267 2.41536 14.59354 10.96389 12.6668
18.9375 -1.8665 206.24683 1.62762 15.08325 11.74591 12.64323
19.3125 -1.6893 206.3721 -1.01002 13.56823 10.80412 13.16635
19.6875 -0.34014 207.44629 -1.36678 12.99487 9.25304 12.07777
20.0625 0.96256 207.04821 0.61208 13.613 9.24645 13.04366
20.4375 -0.48834 206.12765 -0.57086 12.3798 9.63952 11.51865
20.8125 -0.36267 205.76073 -2.29083 13.46097 9.18839 11.62576
21.1875 -1.81472 206.93445 -0.08607 12.06344 9.09099 10.72994
21.5625 1.05924 204.61615 0.54308 11.79308 8.73898 9.51851
21.9375 -0.53648 204.34409 0.85588 12.14981 8.44788 9.18039
22.3125 -2.39278 206.78011 0.6855 11.38002 7.84357 10.28239
22.6875 1.35911 204.89132 1.57092 11.92911 8.89169 8.35583
23.0625 -2.95165 205.78958 2.19677 11.60378 9.27484 7.94406
23.4375 -0.92648 204.16588 1.03509 12.03206 8.73895 8.53425
23.8125 -1.25487 205.43384 1.58055 11.30989 8.22884 8.28851
24.1875 -1.93603 203.77996 1.47971 10.95794 8.39778 7.73329
24.5625 -2.35474 204.20776 1.05474 10.25897 7.49226 8.00382
24.9375 -3.52979 207.1985 -1.62346 10.89976 7.46509 8.0827
25.3125 -1.87611 203.05777 0.82796 12.3877 7.27799 8.13011
25.6875 -2.1592 202.23541 -2.61495 8.15844 7.80876 9.5056
26.0625 1.25754 202.54077 0.49743 9.56942 6.98118 7.57177
26.4375 -3.10382 203.95612 0.0062 10.57751 7.13205 6.71629
26.8125 -3.92561 199.89226 2.28458 9.40073 5.63134 5.85088
27.1875 0.82871 204.33982 -1.82841 8.37903 7.04483 7.78116
27.5625 0.66448 203.93314 -2.92558 8.21459 6.54032 7.75736
27.9375 -2.27088 203.88941 2.22946 9.39788 5.63534 7.49285
28.3125 -3.24884 200.50539 -1.55319 9.88933 8.95881 6.8503
28.6875 5.59306 207.57653 -1.76318 12.85675 3.64291 5.59646
29.0625 3.57431 202.67079 -1.33325 14.25832 3.92929 4.86044
29.4375 1.59711 203.09569 0.9629 6.94091 4.70239 4.97248
29.8125 -3.74619 203.09711 -1.99192 11.33841 8.64321 7.1726
