0.05000 5274.02546
0.15000 4804.17193
0.25000 5597.15737
0.35000 6874.26486
0.45000 7052.82203
0.55000 7161.55863
0.65000 7128.15800
0.75000 7530.32517
0.85000 7309.03340
0.95000 7216.25726
1.05000 7007.82351
1.15000 6851.45164
1.25000 6416.98129
1.35000 6243.02864
1.45000 6136.94496
1.55000 5983.89634
1.65000 5553.91745
1.75000 5350.84607
1.85000 5099.86780
1.95000 4880.51461
2.05000 4769.48513
2.15000 4568.70043
2.25000 4359.53856
2.35000 4340.52113
2.45000 4036.26826
2.55000 3994.27924
2.65000 3800.18833
2.75000 3606.19469
2.85000 3454.61816
2.95000 3390.74188
3.05000 3276.53817
3.15000 3191.30908
3.25000 3004.58309
3.35000 2920.84720
3.45000 2771.48925
3.55000 2763.52831
3.65000 2607.13527
3.75000 2575.65396
3.85000 2475.79212
3.95000 2413.40921
4.05000 2358.64901
4.15000 2257.13629
4.25000 2198.71515
4.35000 2198.06800
4.45000 2104.57816
4.55000 2040.04145
4.65000 1982.56667
4.75000 1984.82961
4.85000 1849.70216
4.95000 1816.39311
5.05000 1767.67654
5.15000 1717.38318
5.25000 1618.81356
5.35000 1606.81891
5.45000 1535.86056
5.55000 1515.49042
5.65000 1460.67476
5.75000 1415.54529
5.85000 1448.24459
5.95000 1371.55098
6.05000 1328.67491
6.15000 1268.45659
6.25000 1249.12967
6.35000 1203.10183
6.45000 1196.45751
6.55000 1139.33628
6.65000 1142.73747
6.75000 1052.82808
6.85000 1080.86068
6.95000 1055.19204
7.05000 1009.99706
7.15000 963.51100
7.25000 985.72810
7.35000 936.37252
7.45000 889.09358
7.55000 830.71762
7.65000 849.08597
7.75000 842.78577
7.85000 808.64878
7.95000 791.25743
8.05000 777.89843
8.15000 762.08111
8.25000 754.87053
8.35000 653.26956
8.45000 669.94629
8.55000 668.20356
8.65000 631.37413
8.75000 641.29416
8.85000 605.20730
8.95000 598.05587
9.05000 579.79974
9.15000 542.17015
9.25000 536.92997
9.35000 502.64313
9.45000 512.72269
9.55000 479.90613
9.65000 493.07368
9.75000 473.56571
9.85000 466.18330
9.95000 446.14169
10.05000 444.24001
10.15000 423.50092
10.25000 389.25276
10.35000 410.22416
10.45000 380.62005
10.55000 382.23208
10.65000 388.04418
10.75000 363.72719
10.85000 356.74972
10.95000 389.49803
11.05000 323.23333
11.15000 341.42789
11.25000 333.25775
11.35000 321.30148
11.45000 308.19052
11.55000 320.97825
11.65000 318.01831
11.75000 291.15300
11.85000 289.41977
11.95000 298.75619
12.05000 285.21881
12.15000 272.75513
12.25000 283.29757
12.35000 288.51312
12.45000 249.37446
12.55000 244.39201
12.65000 236.08428
12.75000 245.38153
12.85000 238.51857
12.95000 240.62300
13.05000 208.39472
13.15000 237.63424
13.25000 205.45161
13.35000 207.41403
13.45000 212.22842
13.55000 188.31786
13.65000 191.15763
13.75000 192.68286
13.85000 183.15775
13.95000 166.55557
14.05000 352.97576
14.15000 175.36502
14.25000 166.87071
14.35000 180.05061
14.45000 161.93513
14.55000 177.87959
14.65000 143.91661
14.75000 154.58238
14.85000 156.81644
14.95000 144.09941
15.05000 141.45910
15.15000 138.78712
15.25000 142.99813
15.35000 138.84379
15.45000 131.71604
15.55000 134.00797
15.65000 135.23780
15.75000 129.67103
15.85000 115.81818
15.95000 112.71863
16.05000 109.13605
16.15000 121.20671
16.25000 124.88339
16.35000 121.71939
16.45000 130.41076
16.55000 108.18984
16.65000 124.81463
16.75000 110.78413
16.85000 112.30812
16.95000 122.03117
17.05000 102.04747
17.15000 110.42860
17.25000 125.19583
17.35000 100.23636
17.45000 93.59372
17.55000 111.96202
17.65000 102.38980
17.75000 88.81541
17.85000 117.10833
17.95000 113.82117
18.05000 92.29988
18.15000 104.39814
18.25000 96.15458
18.35000 93.60185
18.45000 88.35250
18.55000 93.43727
18.65000 92.92455
18.75000 93.99698
18.85000 83.05802
18.95000 76.68764
19.05000 75.32924
19.15000 103.37061
19.25000 84.69791
19.35000 84.70485
19.45000 80.42082
19.55000 81.04870
19.65000 91.54776
19.75000 69.59633
19.85000 80.09461
19.95000 92.41152
