0.12500 0.01233
0.37500 0.06024
0.62500 0.12165
0.87500 0.16552
1.12500 0.20656
1.37500 0.23436
1.62500 0.28089
1.87500 0.31346
2.12500 0.33362
2.37500 0.35771
2.62500 0.36587
2.87500 0.34693
3.12500 0.29500
3.37500 0.26686
3.62500 0.23798
3.87500 0.22858
4.12500 0.21698
4.37500 0.19014
4.62500 0.17066
4.87500 0.13229
5.12500 0.12569
5.37500 0.11930
5.62500 0.09838
5.87500 0.07768
6.12500 0.08841
6.37500 0.06647
6.62500 0.06688
6.87500 0.04500
7.12500 0.05574
7.37500 0.04698
7.62500 0.04870
7.87500 0.05013
8.12500 0.04643
8.37500 0.04178
8.62500 0.04629
8.87500 0.05451
9.12500 0.02688
9.37500 0.05364
9.62500 0.04702
9.87500 0.06296
10.12500 0.07300
10.37500 0.08784
10.62500 0.09891
10.87500 0.07806
11.12500 0.09245
11.37500 0.06372
11.62500 0.06480
11.87500 0.05356
12.12500 0.04065
12.37500 0.03643
12.62500 0.01521
12.87500 0.02199
13.12500 0.03260
13.37500 0.02537
13.62500 0.03416
13.87500 0.03912
14.12500 0.05013
14.37500 0.03146
14.62500 0.00653
14.87500 0.01867
