0.12500 0.03942
0.37500 0.00426
0.62500 0.02844
0.87500 0.04973
1.12500 0.07739
1.37500 0.09232
1.62500 0.10278
1.87500 0.12077
2.12500 0.13643
2.37500 0.15698
2.62500 0.17798
2.87500 0.16178
3.12500 0.17912
3.37500 0.14504
3.62500 0.14711
3.87500 0.17270
4.12500 0.15029
4.37500 0.14139
4.62500 0.13495
4.87500 0.13373
5.12500 0.13109
5.37500 0.11342
5.62500 0.13353
5.87500 0.12591
6.12500 0.11719
6.37500 0.11512
6.62500 0.09141
6.87500 0.11095
7.12500 0.10062
7.37500 0.08369
7.62500 0.10467
7.87500 0.11082
8.12500 0.08901
8.37500 0.08696
8.62500 0.07540
8.87500 0.08202
9.12500 0.05311
9.37500 0.07708
9.62500 0.08146
9.87500 0.04245
10.12500 0.04520
10.37500 0.03948
10.62500 0.03276
10.87500 0.04914
11.12500 0.05595
11.37500 0.06058
11.62500 0.06785
11.87500 0.04237
12.12500 0.03179
12.37500 0.05962
12.62500 0.03671
12.87500 0.06178
13.12500 0.04397
13.37500 0.03216
13.62500 0.04572
13.87500 0.05774
14.12500 0.04100
14.37500 0.05910
14.62500 0.00650
14.87500 0.00984
