0.12500 0.01558
0.37500 0.01110
0.62500 0.01361
0.87500 0.02508
1.12500 0.05057
1.37500 0.06526
1.62500 0.07980
1.87500 0.06721
2.12500 0.06654
2.37500 0.05852
2.62500 0.04469
2.87500 0.03363
3.12500 0.02101
3.37500 0.01682
3.62500 0.01390
3.87500 0.00637
4.12500 0.00619
4.37500 0.00643
4.62500 0.00642
4.87500 0.00788
5.12500 0.01413
5.37500 0.00309
5.62500 0.01363
5.87500 0.01973
6.12500 0.02961
6.37500 0.03095
6.62500 0.02323
6.87500 0.01778
7.12500 0.03144
7.37500 0.02547
7.62500 0.03828
7.87500 0.02932
8.12500 0.02053
8.37500 0.00774
8.62500 0.00774
8.87500 0.01031
9.12500 0.00595
9.37500 0.00632
9.62500 0.02540
9.87500 0.04826
10.12500 0.05348
10.37500 0.02266
10.62500 0.01856
10.87500 0.01842
11.12500 0.03266
11.37500 0.04273
11.62500 0.03130
11.87500 0.01683
12.12500 0.01451
12.37500 0.00839
12.62500 0.02020
12.87500 0.04073
13.12500 0.01443
13.37500 0.01552
13.62500 0.02091
13.87500 0.00906
14.12500 0.00524
14.37500 0.03863
14.62500 0.01775
14.87500 0.02109
