0.05000 726.57917 394.68698 354375.11959 3083.53690 209.42669 417828.58189
0.15000 -1304.79668 197.42288 -1115425.14225 2466.53506 716.82939 1375453.01637
0.25000 -702.74256 -121.42703 389469.63596 2609.33969 921.04480 1353507.98737
0.35000 -849.23573 14.90882 -122571.16065 2678.34277 922.37898 1364767.52596
0.45000 -192.54892 199.13387 237264.91060 2336.31173 934.61541 1778941.88984
0.55000 -885.94057 -168.48275 144235.72706 2269.79777 1057.82555 995941.19915
0.65000 -499.48117 188.49539 -13091.95687 2338.83490 1016.53099 644100.91808
0.75000 -436.85829 97.54645 150451.75087 2358.30714 1110.02235 1598865.26834
0.85000 -1373.33705 -41.21667 88192.30122 2141.14125 1018.76325 1100567.78225
0.95000 -1216.61450 -108.66990 -36816.24049 2115.03316 1115.93812 1176627.59983
1.05000 -1285.83517 60.22668 -24739.26743 1985.08964 1129.55085 1371377.56662
1.15000 -1491.78994 -32.23992 29582.86038 2008.06076 1191.70246 1828426.29315
1.25000 -1575.59191 35.41491 38504.22238 1859.31727 1294.31570 1210165.49704
1.35000 -1918.74578 29.45866 -27920.26504 1600.65495 1241.69988 1278525.46383
1.45000 -2284.47700 1.30397 -151002.66030 1335.43372 1231.03762 1768261.57642
1.55000 -2521.08453 34.85148 -64500.00683 1043.22822 1231.74225 1599418.71783
1.65000 -2789.56161 -35.53193 -86527.32810 850.95673 1160.96045 1605753.50640
1.75000 -3024.83530 23.63765 -84001.44029 658.84201 1082.53267 1357988.37486
1.85000 -3220.18218 21.34322 -19677.27834 568.18495 1019.36338 1947356.17988
1.95000 -3342.21037 -30.78733 -56961.65594 484.10958 985.22594 1971798.44369
2.05000 -3430.99038 14.50702 38719.01902 410.20431 929.84159 1542415.10520
2.15000 -3527.43153 -27.65567 -109725.60016 332.59523 858.99298 1975329.12491
2.25000 -3622.02613 26.62619 -91432.06608 287.32805 837.44955 1635055.30839
2.35000 -3705.83573 -22.90170 48610.76418 256.33325 800.15454 1640256.18704
2.45000 -3768.61574 -12.47858 -85358.62548 241.85184 738.42583 2423122.55993
2.55000 -3791.05347 -30.58886 -19948.28713 215.32510 691.17650 2200876.07781
2.65000 -3837.93922 11.15163 -120140.55908 204.58614 677.21567 1730993.47032
2.75000 -3865.75226 -9.94210 28379.83245 182.59159 651.43986 1648156.00255
2.85000 -3883.77229 -1.86693 50833.37633 175.24085 616.07990 2229490.92184
2.95000 -3910.25247 -5.64779 -18872.91798 160.46286 600.07261 2164088.11857
3.05000 -3912.78247 8.66641 -12511.03376 162.02254 564.27051 2072924.87321
3.15000 -3912.88499 -0.83606 -24406.68248 158.58090 548.61380 2280238.06085
3.25000 -3922.06073 -1.90714 42484.87461 156.37898 525.37787 2026383.91970
3.35000 -3921.40902 -0.60766 954.94328 153.18579 498.48858 1978683.95294
3.45000 -3930.14574 -2.45568 -83506.26268 157.49775 479.13370 2190667.74743
3.55000 -3919.60682 1.18429 -57653.46041 167.07318 459.62238 2657667.65568
3.65000 -3926.53620 -12.71698 29041.73471 169.78552 461.02857 2005669.48413
3.75000 -3918.30017 5.89713 8555.91513 172.03467 431.94154 2002479.54310
3.85000 -3914.64418 7.31587 32764.09019 177.59378 429.93738 2261414.11751
3.95000 -3906.85285 -9.12666 -55561.51775 185.80361 412.92658 2492199.17199
4.05000 -3894.96050 12.57997 35836.58313 186.15887 391.09527 2239599.70165
4.15000 -3881.59347 3.71208 19433.94844 181.79055 383.10993 2172190.54663
4.25000 -3875.71783 9.23374 -10152.74214 182.87902 376.63810 2338976.37300
4.35000 -3864.72906 -25.09769 -48972.06803 193.76844 357.06852 2477437.11542
4.45000 -3849.17382 6.22238 16503.86775 202.45261 344.92164 2514982.86126
4.55000 -3841.34124 5.91018 11271.80970 205.49273 339.05033 2338040.64326
4.65000 -3825.10835 -6.14418 62062.38333 206.57867 326.41645 2376334.55908
4.75000 -3803.45091 -14.05125 -55452.68569 203.64179 323.15229 2155409.64711
4.85000 -3791.53137 2.21663 33564.31653 203.65763 306.11386 2130491.78808
4.95000 -3780.36821 7.18438 40229.80210 205.86653 306.37976 2203153.91263
5.05000 -3756.91821 4.42644 127935.67804 198.18463 289.46901 2357734.21822
5.15000 -3742.11849 5.61495 11246.51339 199.56889 286.14994 2195827.95591
5.25000 -3721.98912 4.66876 -16651.63881 197.72551 276.02345 2151400.69884
5.35000 -3697.08880 8.59978 20325.21022 186.16699 268.49869 2384954.15986
5.45000 -3688.66052 -4.25418 5688.09372 184.37621 263.17431 2307500.82164
5.55000 -3667.52809 -5.16296 62058.59454 182.83738 250.14859 2343274.37215
5.65000 -3647.86763 11.23530 22330.94252 184.17267 247.05349 2263999.46466
5.75000 -3631.81099 4.60667 123733.95496 177.47057 242.16985 2462048.52216
5.85000 -3619.81780 -4.60145 11215.07183 176.72274 240.57217 2179894.62408
5.95000 -3603.83907 4.98468 95986.92430 179.46504 233.72133 2287777.94177
6.05000 -3578.77748 -0.21114 9135.57576 176.23237 224.13517 2121475.92597
6.15000 -3559.27575 1.61790 3940.23550 168.76265 219.70063 2464054.50699
6.25000 -3549.83061 -8.78421 47115.72461 169.50220 222.54282 2069281.92969
6.35000 -3535.57319 3.90025 -17543.27747 172.72504 211.62165 2328343.90357
6.45000 -3512.13525 -5.34129 -17706.25790 165.83459 205.87334 2234949.18559
6.55000 -3490.05070 3.89588 100494.70298 164.29008 202.60008 2148724.90106
6.65000 -3473.32357 -4.03068 30033.50195 165.13379 203.01014 2320134.71978
6.75000 -3460.41880 1.22002 75359.00675 163.28741 197.28023 2194280.20180
6.85000 -3440.44728 3.30710 -42642.57834 158.72327 194.50848 2302690.72265
6.95000 -3423.13540 0.68466 20255.66910 159.33858 189.39064 2403489.23515
7.05000 -3405.83182 2.26211 27386.91883 161.03191 184.71857 2356312.75675
7.15000 -3386.13750 2.38573 -33647.30376 156.73542 182.66384 2280155.59582
7.25000 -3379.16119 -1.39997 -32331.42633 156.81430 180.00858 2210520.40965
7.35000 -3358.96499 0.23713 -38288.39454 157.90412 177.32530 2459442.51325
7.45000 -3350.46811 4.51281 -172.85375 156.78998 173.54933 2158436.91555
7.55000 -3337.37731 -4.43444 33590.93546 164.28525 171.49011 1975347.07449
7.65000 -3310.32392 0.81120 27339.27621 159.41174 165.76999 2195629.38363
7.75000 -3290.23732 2.36769 8720.02075 156.17045 164.24313 2194822.44933
7.85000 -3275.19853 -1.42456 29360.87112 155.16530 159.81189 2428644.63932
7.95000 -3264.30999 -0.47185 -29581.76766 156.26245 158.02097 2238026.16012
8.05000 -3250.17232 -2.33229 -17156.15820 154.55191 157.58844 2486992.90453
8.15000 -3232.02717 -5.02405 -8216.80911 153.66771 152.22120 2408469.95172
8.25000 -3220.76282 -2.53494 -691.57049 155.33836 151.87401 2355680.94070
8.35000 -3212.33280 0.47463 2900.40099 157.01949 148.88188 2363794.16830
8.45000 -3187.58357 0.93868 -29824.76090 157.29627 145.91020 2355963.80310
8.55000 -3169.66584 1.72986 -39493.20165 157.66641 143.99223 2181144.55375
8.65000 -3151.81376 3.62267 -51519.89428 156.03183 139.48048 2391952.24865
8.75000 -3142.77435 1.68503 82071.41288 154.25031 138.22623 2219995.35250
8.85000 -3125.37110 -0.23173 -8102.46760 154.67369 136.25013 2314158.51901
8.95000 -3106.47328 -1.20185 27073.60022 154.88984 131.84835 2184155.91265
9.05000 -3092.67009 -2.01946 6161.34835 152.54264 131.67170 2320981.86512
9.15000 -3082.05425 1.85759 -4679.33727 155.00300 130.53013 2363211.17524
9.25000 -3055.47198 2.08045 32251.97554 155.89835 127.73608 2057688.49637
9.35000 -3042.36584 3.67872 81080.23637 148.61588 125.52423 2230564.95654
9.45000 -3031.07937 3.85123 -93164.49396 152.00558 123.85828 2262046.24871
9.55000 -3012.11317 -1.52126 113828.95353 149.95388 121.72984 2439806.21543
9.65000 -3000.07579 0.24901 16957.99557 148.92602 120.64503 2085678.16229
9.75000 -2981.56408 -2.16643 -47618.11691 151.95283 117.13664 2424519.31515
9.85000 -2963.12566 -3.19664 53373.16031 148.49525 114.91616 2336237.71682
9.95000 -2945.42523 -1.94778 -81176.80138 146.82350 114.94046 2096595.08545
10.05000 -2936.19509 -1.10240 28741.09975 145.48069 113.86780 1977341.68755
10.15000 -2919.47482 0.14162 34071.64063 143.04533 112.11531 2251827.95997
10.25000 -2906.47535 3.54796 4711.06999 141.23372 109.89383 2243845.90868
10.35000 -2889.17140 -0.80072 -1457.54827 140.49815 109.48017 2116639.29644
10.45000 -2878.87457 -1.78506 -5381.53700 140.02182 105.98652 2189613.84156
10.55000 -2862.07435 -3.22251 17419.53351 142.02473 103.82788 2197660.58657
10.65000 -2847.26979 1.99551 14352.79694 139.18514 104.03861 2303402.79787
10.75000 -2832.37308 -2.31553 22377.77023 138.06965 101.56666 2394478.67978
10.85000 -2822.56897 -1.75878 31928.60692 137.91966 99.84068 2070586.66955
10.95000 -2799.42512 0.21748 -23192.34868 134.26682 99.07875 2008944.18855
11.05000 -2797.75658 2.61502 -695.07505 136.27552 98.14179 2412434.69449
11.15000 -2773.77984 1.05680 -47212.74762 135.31715 96.28902 2421562.65284
11.25000 -2760.25154 0.97264 96612.31336 134.61228 95.21157 2244539.63686
11.35000 -2746.15231 0.48371 32684.77836 131.17733 93.57945 2265762.04770
11.45000 -2728.08173 -0.75916 -58108.16918 130.66613 92.46210 1952865.50071
11.55000 -2718.94473 -1.09281 10314.66549 129.60791 91.30115 2378439.54390
11.65000 -2703.46252 -0.45932 -30513.29474 128.57287 89.59973 2164070.92415
11.75000 -2688.99333 0.28454 38544.34634 126.29595 88.89018 2103550.07834
11.85000 -2671.12106 -1.02378 35220.16102 128.58781 88.67945 2088522.74812
11.95000 -2657.31915 2.40616 -53962.40395 124.91480 85.54990 2245277.50042
12.05000 -2646.59872 0.58004 3474.86407 122.16145 86.10223 2262569.50709
12.15000 -2633.79458 1.05193 -32428.04935 119.72020 85.31626 2213851.23608
12.25000 -2625.45350 -1.13513 -2173.46085 119.68608 84.58348 1996874.66110
12.35000 -2609.87071 2.11709 71508.99697 117.21510 83.38185 2093707.33733
12.45000 -2598.71104 1.82378 -29694.26874 118.12897 81.60190 2312254.93844
12.55000 -2583.40020 1.63606 49170.97974 117.36378 80.32571 2318846.09488
12.65000 -2570.05079 0.21595 40514.97238 116.58815 79.79214 2128723.86749
12.75000 -2556.89031 -0.38493 -2564.25013 115.36457 79.68833 2016559.21881
12.85000 -2546.27318 -2.89731 -19098.24811 112.86349 77.33767 2199698.96239
12.95000 -2533.02509 0.40984 105660.06131 114.28382 77.54782 2107357.14015
13.05000 -2521.79858 -1.88867 43514.06449 111.49027 77.67961 1986615.77660
13.15000 -2510.81761 1.37330 6369.66939 110.35506 74.19494 2141601.19318
13.25000 -2497.68471 -0.97642 -35373.85188 111.96169 75.76896 1977075.52891
13.35000 -2482.31618 -1.57856 54528.59468 109.74276 74.35043 2240836.87674
13.45000 -2471.96941 0.72526 -103091.45006 110.36558 71.80524 2078557.60975
13.55000 -2462.72969 -0.97528 -25258.98771 108.74172 72.08420 2166792.81846
13.65000 -2447.35868 0.18613 40433.19109 105.52337 71.45313 2123545.25981
13.75000 -2437.09104 -0.05863 -19568.61759 107.13699 72.28819 2056171.84891
13.85000 -2421.02457 -2.21594 -49027.87114 105.87434 68.98348 2259590.00302
13.95000 -2415.33504 -1.86417 24334.65012 104.10777 70.38846 1806519.24548
14.05000 -2400.03705 -2.18145 -12604.60685 104.74159 66.31131 1961508.57152
14.15000 -2390.64941 0.08170 14313.96235 104.97551 68.38875 2030485.70612
14.25000 -2380.45387 -0.69766 42717.37139 102.12023 66.25412 1992597.89127
14.35000 -2366.21558 0.99393 66393.64288 102.52953 67.37492 1868293.65024
14.45000 -2357.99257 -0.61553 -60457.83023 98.82914 65.45519 2131363.82873
14.55000 -2345.45257 1.23200 4670.90572 100.50960 65.35034 2143263.44806
14.65000 -2334.54722 0.24869 -13670.48990 100.64133 64.44172 1969393.43469
14.75000 -2324.70880 1.24996 -49883.57708 99.59665 62.49259 2005962.55200
14.85000 -2312.95191 0.26636 24223.76157 97.86381 62.57852 2184343.77821
14.95000 -2302.83547 -1.84844 16933.68581 99.73308 62.46637 2149818.80341
15.05000 -2293.16078 0.41349 -59233.83534 95.86468 60.18640 2136458.38667
15.15000 -2280.51830 0.90880 5468.12841 98.01980 59.19758 1951121.55651
15.25000 -2270.73773 -0.84196 -17200.41362 95.07917 60.30928 2167061.37267
15.35000 -2257.05753 -0.28342 -23493.07385 94.26869 59.06961 2103031.22602
15.45000 -2249.55501 1.04266 17859.47050 92.91135 58.21443 2113085.52473
15.55000 -2238.20829 -0.08281 25624.40665 93.26069 57.75789 1888842.15462
15.65000 -2227.54255 -1.29148 -47536.77283 91.89959 57.09040 1979673.71179
15.75000 -2220.89990 -0.08831 798.89484 92.96810 57.35832 1991344.84938
15.85000 -2208.60377 1.00669 -35980.81301 91.82200 55.67805 2019346.98879
15.95000 -2198.72979 0.76987 25913.60194 89.99745 55.11687 1790312.80480
16.05000 -2188.00987 1.05573 12170.14230 90.72520 54.26787 1879606.88136
16.15000 -2180.60739 -0.62750 -8706.63126 89.63965 54.98077 2000832.38368
16.25000 -2167.42353 -1.74624 22784.92442 87.91499 53.78382 1971188.11900
16.35000 -2158.46757 0.54656 -62440.59813 90.30070 54.07704 1985439.54404
16.45000 -2150.46168 1.10372 8171.13419 89.60024 52.05071 1822669.48928
16.55000 -2138.16329 -0.50838 -23136.01562 86.32071 52.20429 1877840.83994
16.65000 -2127.79997 0.51328 18917.32288 87.69287 51.47857 1788549.55069
16.75000 -2118.34635 -0.11920 17615.10643 86.23889 51.49717 1882535.58044
16.85000 -2108.54511 0.62047 69113.71803 85.30943 51.53710 2003740.21497
16.95000 -2101.31463 0.01825 -21349.49660 86.77360 51.27148 2032349.82811
17.05000 -2093.00382 0.41653 -407.39080 84.76945 49.58035 1974268.98837
17.15000 -2081.89809 2.66842 34509.17359 85.68774 49.05628 2106431.91296
17.25000 -2070.66425 -0.01730 -47759.11366 85.34041 49.34653 1944191.07782
17.35000 -2061.07364 -0.64384 49181.43682 82.84523 48.73912 1801822.38714
17.45000 -2053.21216 -0.23830 96291.49792 83.37154 47.74983 1771458.10225
17.55000 -2045.80568 0.22644 2371.30028 80.71604 47.27524 1857079.50488
17.65000 -2034.32105 -1.60098 51043.28195 81.67212 46.79660 1675519.88982
17.75000 -2023.07520 2.14060 -20152.99905 80.88190 46.14639 1987472.50453
17.85000 -2018.16963 -0.12783 -34415.27988 82.74716 45.68759 1942178.55178
17.95000 -2003.35689 0.44928 3266.97691 80.67762 45.51006 1977999.80564
18.05000 -1997.07142 -0.82474 33580.25414 80.13390 46.06543 1594185.57203
18.15000 -1989.49097 -0.39297 18023.82175 79.01313 45.20183 1943355.51545
18.25000 -1979.30669 -0.67798 -68057.59653 80.39838 45.01872 1906354.60923
18.35000 -1969.90612 0.42823 -10945.11722 76.71455 43.95835 1798140.17087
18.45000 -1964.42963 -1.60844 -5423.69948 76.28522 44.61209 1709660.05553
18.55000 -1952.75526 0.17323 44021.89907 76.56279 43.55605 1732507.42519
18.65000 -1946.04164 0.14852 49948.06251 77.21617 42.82740 2008335.83981
18.75000 -1934.52168 -1.47585 -30841.70051 76.20508 43.37687 2049639.72388
18.85000 -1928.38356 -0.71030 19722.17866 75.05004 42.00462 1895047.69343
18.95000 -1920.17731 0.37512 -19889.71646 74.90037 42.07214 1952801.53447
19.05000 -1914.70630 0.02805 -20415.82637 73.38729 40.64957 1853212.68306
19.15000 -1901.25172 -0.16297 -10793.01616 73.47122 40.57667 1789747.15765
19.25000 -1894.63015 -0.02737 -30472.78755 72.38681 40.81535 1708490.20893
19.35000 -1886.62580 -0.13943 20614.61313 73.19522 40.30617 1761213.21748
19.45000 -1880.17704 -0.51148 50243.63798 71.46725 40.01610 1857336.07416
19.55000 -1872.94413 -0.47901 -64917.32011 70.37746 39.52784 1960551.45539
19.65000 -1863.77962 0.13833 -24883.97444 71.57506 38.65592 1791375.17920
19.75000 -1855.98943 0.20387 23879.49568 70.80697 39.73568 1868158.37491
19.85000 -1849.72235 -0.46303 -40640.18288 71.58757 38.94455 1682573.78123
19.95000 -1838.50409 0.43244 8629.18453 69.90580 38.38817 1829466.00179
