0.125 -0.000 -0.000 -0.000
0.375 -0.000 0.001 -0.000
0.625 -0.001 0.000 -0.001
0.875 0.001 0.001 0.001
1.125 -0.001 -0.003 -0.000
1.375 0.004 0.003 -0.000
1.625 0.003 0.005 -0.002
1.875 0.006 0.006 -0.000
2.125 0.001 -0.008 -0.007
2.375 0.000 0.007 0.008
2.625 0.004 -0.012 0.007
2.875 0.003 -0.006 -0.001
3.125 0.004 -0.002 0.002
3.375 -0.018 0.011 0.007
3.625 -0.002 -0.010 0.009
3.875 -0.000 0.029 0.006
4.125 -0.009 -0.026 -0.009
4.375 0.008 0.021 -0.024
4.625 -0.008 0.008 0.004
4.875 -0.008 0.013 -0.009
5.125 -0.020 0.015 -0.002
5.375 0.015 0.034 0.004
5.625 0.006 0.016 -0.010
5.875 -0.023 0.018 0.026
6.125 -0.017 0.021 -0.000
6.375 0.003 0.001 -0.014
6.625 0.004 0.012 0.011
6.875 -0.015 0.001 0.004
7.125 0.009 0.047 -0.023
7.375 0.034 0.005 0.019
7.625 0.003 0.002 0.032
7.875 0.009 -0.009 0.045
8.125 -0.033 0.029 -0.007
8.375 -0.006 0.009 0.002
8.625 -0.003 -0.051 0.012
8.875 0.020 -0.040 0.008
9.125 -0.020 -0.011 -0.016
9.375 -0.017 -0.006 -0.017
9.625 0.032 0.019 -0.032
9.875 -0.043 -0.016 0.009
10.125 -0.042 0.088 -0.015
10.375 0.002 -0.036 -0.034
10.625 0.087 -0.015 0.021
10.875 -0.036 -0.056 -0.018
11.125 -0.031 -0.021 -0.028
11.375 -0.048 -0.021 -0.016
11.625 -0.028 -0.044 0.024
11.875 -0.032 0.040 0.030
12.125 -0.030 0.011 -0.006
12.375 0.051 -0.055 0.022
12.625 -0.044 -0.057 0.024
12.875 -0.042 0.015 -0.087
13.125 0.015 -0.064 0.096
13.375 -0.071 -0.002 0.048
13.625 0.037 0.060 -0.023
13.875 0.072 -0.011 -0.002
14.125 -0.023 -0.085 0.005
14.375 0.010 0.082 0.004
14.625 -0.045 -0.000 0.092
14.875 -0.013 0.034 -0.058
