0.05000 -85729.43115 2579.87936 9558.38352 53173.34603 53189.43377 80786.87953
0.15000 -90849.79346 993.55918 -136.14146 32337.53708 27170.25967 68495.49440
0.25000 -70289.01893 287.34896 -272.79159 24267.72227 13409.66875 56796.61648
0.35000 -55957.10615 12.32759 1038.22822 18515.16428 7818.18913 45999.10924
0.45000 -46520.16525 67.27466 892.06937 14021.41391 5356.81121 37234.85033
0.55000 -39320.21014 150.81789 190.71105 12176.31713 3894.09285 31227.66457
0.65000 -34135.97994 22.39527 843.03080 9988.21757 3540.91992 26676.71276
0.75000 -29712.32154 65.16135 -54.89086 8486.61580 2409.78917 23761.03737
0.85000 -26791.16551 35.61550 -249.00065 7251.55897 2075.66044 20465.27022
0.95000 -24083.05970 30.43881 -6.28714 6574.83902 2431.83563 18587.10127
1.05000 -22230.14269 117.26936 11.72647 5796.14037 1820.27766 16456.16483
1.15000 -20827.61698 4.88233 582.37873 5459.47576 2408.07621 14811.39929
1.25000 -19273.39646 11.94442 565.21268 4932.05036 2164.19135 13775.07241
1.35000 -18103.03777 28.25896 -65.28686 4292.50629 1184.61332 12555.41896
1.45000 -17004.77568 10.75801 19.90576 4142.99304 1043.33396 11623.05136
1.55000 -16184.83356 72.62874 -208.23740 3472.18091 1160.09239 10625.51769
1.65000 -15421.66773 24.27073 -5.11411 3838.65970 1737.44885 9994.73034
1.75000 -14755.35500 29.27181 -94.56384 3124.31539 1221.70943 9305.37783
1.85000 -13991.27897 65.94148 73.15978 3148.13402 1957.39258 8856.95973
1.95000 -13554.26166 -6.20828 -99.49608 2691.76817 1254.46133 8157.15583
2.05000 -13092.98527 37.36408 114.56281 2381.28004 1663.84664 7562.64270
2.15000 -12655.91298 1.58587 -159.66063 2182.52972 1427.74327 7215.51454
2.25000 -12139.21366 50.34273 209.69990 2435.24621 1193.53512 6893.50456
2.35000 -11801.41113 9.20633 -79.13041 2195.91620 1870.78968 6712.91456
2.45000 -11574.85280 31.59538 82.88304 1763.62164 861.61317 5999.18890
2.55000 -11173.15639 -1.76325 -33.23924 2008.87730 876.38912 5878.98681
2.65000 -10986.58157 28.67907 72.32062 1545.43099 1412.48607 5553.65024
2.75000 -10630.34475 -17.35755 -99.66907 1709.27211 1331.68788 5207.35852
2.85000 -10404.53986 -23.83448 -28.05483 1848.08680 2375.20857 5111.48436
2.95000 -10243.93254 -0.86084 -56.46397 1322.12184 616.81912 4695.72387
3.05000 -10000.51874 26.94944 -41.55423 1448.20143 840.24456 4462.51424
3.15000 -9810.25774 24.87388 -142.29440 1008.51195 543.71942 4279.05055
3.25000 -9625.58115 19.07415 157.73611 1126.25094 836.73582 4103.20953
3.35000 -9433.90802 17.94034 -12.53194 1121.21658 899.20333 3988.85100
3.45000 -9286.16433 45.71279 20.02916 1146.43776 1612.95494 3714.03139
3.55000 -9105.24032 5.05322 -67.95086 954.37384 598.05808 3683.53116
3.65000 -8955.92740 13.01474 -10.06613 1286.59133 976.35395 3488.16292
3.75000 -8812.53451 12.85483 36.12507 785.29501 488.34437 3331.96134
3.85000 -8673.02026 8.62680 -177.33062 859.35627 618.62022 3271.75979
3.95000 -8514.76554 38.40627 -157.03603 1144.54159 1505.13485 3472.80030
4.05000 -8415.84484 12.38866 -40.69583 791.57817 628.45683 3035.01531
4.15000 -8347.94107 -14.46263 -132.73938 1176.12846 968.32108 2869.43240
4.25000 -8170.42881 17.72479 -59.02924 1614.48569 623.95180 2953.00492
4.35000 -8082.17657 7.51905 -123.74029 703.48917 470.40680 2745.48393
4.45000 -7993.56551 23.37463 -98.92183 816.21063 554.38074 2694.89843
4.55000 -7920.84982 12.40539 -79.47317 731.42231 563.63908 2572.92222
4.65000 -7812.16625 7.68919 -45.71699 721.09671 481.27209 2475.82881
4.75000 -7710.80479 12.06325 -146.44682 787.43160 583.12862 2448.31709
4.85000 -7638.54641 8.66133 -90.56104 634.55363 511.80602 2324.83338
4.95000 -7548.92446 26.80839 -180.11636 610.77157 612.13841 2311.88411
5.05000 -7466.59112 8.80945 -109.62717 550.84371 379.23070 2267.96483
5.15000 -7420.33714 37.05221 -130.84249 1137.09677 864.29105 2686.16032
5.25000 -7328.55502 13.46598 -90.34430 549.47838 407.81630 2112.58198
5.35000 -7251.45196 2.44457 -72.41970 648.74578 526.39919 2047.12055
5.45000 -7173.41107 -6.17003 62.75429 617.89531 850.40868 2107.70952
5.55000 -7093.37146 16.91488 -70.20202 635.51140 399.41778 2002.70837
5.65000 -7016.96794 14.49887 -131.75011 585.76231 514.57716 1867.43575
5.75000 -6952.99927 11.35220 43.52296 525.11854 330.00188 1848.95472
5.85000 -6860.32614 4.67398 -77.54995 469.86248 472.43143 1820.45526
5.95000 -6779.34133 8.50959 -72.95781 467.23715 360.09662 1781.87621
6.05000 -6712.73429 15.60883 -116.73782 457.19900 371.70911 1732.20702
6.15000 -6667.08917 21.86423 -18.79628 395.83390 357.49602 1644.77036
6.25000 -6577.64547 11.63172 -35.67427 469.02878 300.22041 1625.35568
6.35000 -6518.88428 12.47930 -42.42838 458.69271 346.27060 1567.83263
6.45000 -6461.36619 21.71955 -87.31161 454.36492 462.71600 1567.15890
6.55000 -6392.65084 3.72900 -79.57032 432.38603 429.29595 1530.14629
6.65000 -6358.44033 -5.15961 -104.97966 1595.69822 1063.03495 1683.72723
6.75000 -6270.87543 6.40291 -38.95672 416.64721 298.44915 1431.29710
6.85000 -6200.24238 0.61138 -72.86795 338.25363 272.62202 1363.98727
6.95000 -6145.53101 4.71840 -78.46863 515.13825 424.71518 1380.07316
7.05000 -6061.74928 19.44914 -47.40155 474.95036 461.16056 1391.89701
7.15000 -5998.95140 16.02631 -11.75397 352.98253 273.52471 1313.52583
7.25000 -5963.52960 7.75856 -86.72503 364.34286 314.16673 1275.07675
7.35000 -5884.79410 12.26555 -83.18725 409.57481 336.14627 1283.89059
7.45000 -5825.61836 -1.53872 -69.20990 466.01801 398.21538 1306.72960
7.55000 -5816.81271 12.07596 -128.72066 359.52640 243.54448 1148.24411
7.65000 -5769.05552 1.48385 -105.37184 1786.08616 379.35612 1205.06361
7.75000 -5683.13708 -13.30528 -147.95744 367.92435 703.11586 1177.06900
7.85000 -5621.06906 17.44864 -115.10124 270.10553 209.30833 1077.09777
7.95000 -5557.28390 19.38677 -131.05031 283.94800 235.67727 1138.60211
8.05000 -5504.00281 17.42766 -108.08987 307.10507 289.10839 1073.05417
8.15000 -5469.75713 8.22857 -97.24597 269.27655 257.01577 1025.59583
8.25000 -5398.72476 5.44662 -173.27315 240.30662 208.76213 998.95144
8.35000 -5352.82104 9.66098 -93.90576 276.85290 281.08663 980.13976
8.45000 -5289.33427 14.23102 -67.24264 265.02987 201.70608 981.68679
8.55000 -5255.40184 6.91557 -117.60878 261.02224 227.19732 922.13008
8.65000 -5194.73007 10.54482 -129.39638 271.15648 209.86580 919.23261
8.75000 -5151.58258 13.12691 -108.57891 208.03623 156.49693 900.74131
8.85000 -5111.74317 13.08200 -49.85880 306.70785 332.86613 855.07709
8.95000 -5056.74450 0.89826 -99.35708 317.97595 247.35000 834.36694
9.05000 -5014.89285 6.48094 -100.78130 351.67544 309.86504 934.11378
9.15000 -4964.94729 4.61959 -46.63996 241.70949 176.13818 824.59913
9.25000 -4927.08408 4.37779 -102.14164 253.44152 350.26656 807.15502
9.35000 -4883.13907 18.18567 -44.16239 220.86239 280.28277 803.41958
9.45000 -4841.61873 14.25631 -69.70949 240.80663 193.28662 776.92524
9.55000 -4800.43261 8.69623 -98.97329 397.49503 171.76694 763.58835
9.65000 -4756.73919 4.18533 -32.51333 214.96936 193.40348 721.76508
9.75000 -4717.61550 6.34242 -45.31316 184.70092 145.76237 724.80533
9.85000 -4673.53781 16.44454 -68.95580 176.49089 141.66687 692.66340
9.95000 -4618.40623 10.78036 -39.77539 202.62145 144.94284 699.50802
10.05000 -4586.78693 4.89180 -47.54187 214.36716 222.09750 689.15859
10.15000 -4564.57224 -2.05368 -37.13004 442.24167 192.68182 664.95516
10.25000 -4492.89323 -4.92776 -8.48284 174.90223 231.32119 650.27601
10.35000 -4454.37033 18.92960 -68.82277 170.36760 211.56236 652.84779
10.45000 -4421.61309 12.49062 -38.87154 236.50085 188.65972 626.04303
10.55000 -4366.90499 10.89466 -23.79890 189.44731 192.45323 637.83508
10.65000 -4341.31721 8.14711 -12.06464 151.32392 180.46945 617.36440
10.75000 -4295.78941 3.36722 -48.23039 150.74070 142.30794 593.50754
10.85000 -4267.88612 -7.90162 -64.43605 155.03177 180.70500 562.24471
10.95000 -4244.69026 15.06713 -32.28948 223.99123 128.35984 647.95528
11.05000 -4199.89877 7.12974 -49.26907 151.76372 138.13285 523.50342
11.15000 -4160.31592 4.37181 -40.10019 151.37672 187.87942 504.95785
11.25000 -4127.23167 5.57777 -44.67657 150.59004 152.18785 505.27805
11.35000 -4089.87112 6.31253 -20.36605 124.83202 119.84046 503.78807
11.45000 -4043.52309 8.26830 -8.02265 139.82403 166.08989 534.75592
11.55000 -4011.60362 6.79330 -41.87204 166.70123 137.82380 491.59606
11.65000 -3968.55856 4.08346 -8.20480 197.76333 168.91656 546.56123
11.75000 -3953.54831 -2.79255 -76.58663 146.03820 424.79174 495.61369
11.85000 -3914.25982 4.57503 -53.08525 112.71957 131.31671 447.93870
11.95000 -3867.18872 8.33549 -71.49127 215.20044 121.94902 1267.29470
12.05000 -3841.05395 10.91323 -30.06818 243.14327 166.95096 515.12567
12.15000 -3821.17215 16.47721 -40.18969 176.57171 127.22583 444.97404
12.25000 -3782.97648 9.30832 -73.53609 112.36588 103.86527 421.78481
12.35000 -3743.45125 8.23048 -84.15972 192.40000 106.34587 425.40809
12.45000 -3726.78101 5.82429 -58.65450 119.37055 88.87059 409.77282
12.55000 -3688.45482 24.06313 -61.81120 140.96836 278.04001 415.29142
12.65000 -3664.33946 4.42541 -84.62418 332.76291 340.33879 754.26018
12.75000 -3626.87866 7.43298 -46.72357 111.76174 177.23833 417.06786
12.85000 -3592.05410 -6.19077 -79.33775 105.28830 159.26981 375.01104
12.95000 -3566.55821 11.11166 -75.97789 280.26987 137.29204 418.11658
13.05000 -3537.90339 5.96567 -45.93237 142.68526 137.27539 376.60820
13.15000 -3515.64302 9.86926 -93.51835 98.15553 88.79420 386.76620
13.25000 -3467.69286 0.44024 -94.00700 179.32246 136.35762 357.68905
13.35000 -3452.11369 7.78753 -72.91713 120.72463 95.66703 389.52768
13.45000 -3422.10303 12.67408 -105.74449 176.25031 270.36840 384.52986
13.55000 -3412.34895 10.95203 -72.75892 94.32369 106.02150 335.30058
13.65000 -3389.03687 7.87081 -79.87196 105.15537 74.07841 326.48169
13.75000 -3359.93563 10.57103 -53.92321 99.57995 150.11498 382.73233
13.85000 -3339.31286 11.03755 -102.00754 160.59126 104.82855 376.89624
13.95000 -3313.15099 1.12914 -79.13583 101.76293 135.96436 331.17412
14.05000 -3284.32917 4.83960 -90.04126 78.72241 58.08436 315.02903
14.15000 -3253.41181 10.32378 -56.04779 69.93564 62.72495 315.11017
14.25000 -3229.00733 11.12023 -107.83526 137.16515 83.40325 308.57657
14.35000 -3196.60275 5.83741 -58.33655 102.58548 92.83474 317.74354
14.45000 -3184.55310 -0.64661 -98.44726 102.95732 138.56590 295.95855
14.55000 -3159.53919 11.63847 -98.84155 180.03543 169.77786 319.73483
14.65000 -3131.97108 3.77040 -114.24738 75.08389 71.69195 297.34895
14.75000 -3115.53725 -4.39257 -111.83182 59.61297 71.00182 301.81112
14.85000 -3083.97584 13.79065 -62.48070 125.73942 85.42891 308.55042
14.95000 -3055.21585 5.49565 -129.43872 260.42444 100.72748 400.30077
15.05000 -3052.61968 -0.48738 -85.26262 110.37296 87.81510 289.64876
15.15000 -3028.49554 0.26105 -102.14404 54.90771 56.71334 296.36318
15.25000 -2974.74374 -8.49862 -92.14687 277.07066 381.64673 348.27084
15.35000 -2979.88703 5.44431 -84.96769 98.61629 55.62991 269.80105
15.45000 -2961.12428 6.67187 -91.76195 71.84903 76.95722 271.39689
15.55000 -2935.65036 -0.73212 -86.78801 121.17879 71.79011 268.50252
15.65000 -2935.38592 -14.20035 -81.97578 75.85940 120.16740 260.63723
15.75000 -2904.94483 10.05875 -80.77431 59.06215 76.32250 239.22763
15.85000 -2897.61645 -3.49662 -105.11070 66.22803 65.08255 254.84799
15.95000 -2862.45121 10.33310 -112.17199 51.54164 58.90928 255.04222
16.05000 -2839.96829 -2.41379 -78.74534 81.23778 83.86191 221.57188
16.15000 -2826.64292 4.09309 -53.89286 42.67518 43.09526 214.05720
16.25000 -2804.90172 4.41145 -69.89615 81.36408 71.48233 271.38508
16.35000 -2797.72528 -0.09798 -88.49361 63.90647 53.79669 239.26872
16.45000 -2750.19434 20.30022 -94.84104 276.11838 206.45331 232.33408
16.55000 -2751.93202 13.07225 -78.21588 59.25851 47.94369 253.79639
16.65000 -2727.78154 1.35649 -87.24052 66.51643 109.47113 228.81108
16.75000 -2717.63191 -0.15048 -45.77515 55.33693 48.68383 219.46216
16.85000 -2693.89625 -8.66977 -67.45070 74.82420 69.70913 221.52293
16.95000 -2676.49926 4.25106 -82.19231 59.92463 51.35925 212.62656
17.05000 -2665.27679 6.34415 -37.16380 69.14000 46.93856 216.18713
17.15000 -2650.12413 -1.52802 -89.73322 52.81506 97.02330 211.76037
17.25000 -2594.91181 24.86310 -58.00615 257.55099 268.54002 209.51953
17.35000 -2605.38726 9.21571 -78.38251 43.56063 42.11434 191.70021
17.45000 -2595.04828 -3.96243 -89.47484 50.91596 76.47934 218.15049
17.55000 -2580.88791 3.50273 -42.51219 78.68824 46.71820 212.49619
17.65000 -2568.16588 8.96332 -70.77552 33.74167 48.75987 182.06219
17.75000 -2547.71727 3.51597 -62.22722 82.03209 64.43747 196.22539
17.85000 -2534.87835 2.55554 -76.92059 40.84472 48.34146 192.42059
17.95000 -2516.52167 3.35012 -42.88113 36.83345 39.65315 182.69397
18.05000 -2505.42936 -9.91930 -34.88621 46.68298 77.60649 204.03900
18.15000 -2477.94126 6.64209 -45.68525 56.72207 35.25079 164.51541
18.25000 -2484.37790 -15.12166 -61.80765 133.56741 183.50842 167.62597
18.35000 -2456.44642 3.98142 -73.64882 61.64299 67.18902 175.80991
18.45000 -2438.68832 3.67966 -41.51768 38.55461 43.07338 172.88155
18.55000 -2440.00589 4.54719 -76.99013 66.87162 43.60769 175.28812
18.65000 -2420.55339 2.03244 -61.36795 68.57173 59.92575 172.88466
18.75000 -2411.21398 -11.58319 -99.51318 79.84142 95.09902 170.87945
18.85000 -2388.28569 12.49335 -69.20670 46.43491 50.70303 160.51151
18.95000 -2376.47388 1.41946 -78.37576 50.52752 65.27021 194.50940
19.05000 -2361.97303 4.96837 -50.16428 37.99645 42.64064 156.95402
19.15000 -2349.81949 25.77649 -74.11639 83.75543 78.69199 214.88520
19.25000 -2340.05581 12.41284 -77.84022 51.66291 41.23430 171.16703
19.35000 -2317.85473 -2.08865 -60.81080 46.16183 52.98359 162.16017
19.45000 -2301.57645 5.50457 -41.41601 44.41202 36.97307 146.66000
19.55000 -2294.63662 3.28186 -67.84751 40.33230 51.38280 165.38217
19.65000 -2281.25174 1.27650 -107.84225 42.53253 60.68625 172.18613
19.75000 -2270.52944 3.35509 -97.32098 70.63187 36.28644 153.18063
19.85000 -2257.71951 7.23267 -96.22411 53.08942 28.08363 159.00858
19.95000 -2241.97626 -0.00721 -45.00029 68.22829 56.87583 174.13431
