0.05000 2454.93251
0.15000 3997.82338
0.25000 6098.08989
0.35000 7728.89694
0.45000 8959.56172
0.55000 9706.44672
0.65000 9969.33941
0.75000 10026.20227
0.85000 10135.04763
0.95000 9800.56927
1.05000 9633.96990
1.15000 9310.21644
1.25000 8908.93166
1.35000 8644.55949
1.45000 8093.05232
1.55000 7772.79113
1.65000 7510.89781
1.75000 7138.62025
1.85000 6744.93759
1.95000 6418.17386
2.05000 6252.50916
2.15000 5962.43181
2.25000 5708.39547
2.35000 5510.65204
2.45000 5290.17064
2.55000 5126.38480
2.65000 4755.13911
2.75000 4726.10751
2.85000 4445.00635
2.95000 4269.56151
3.05000 4201.24405
3.15000 4028.30262
3.25000 3868.25902
3.35000 3653.77302
3.45000 3562.75294
3.55000 3397.34049
3.65000 3376.71840
3.75000 3296.28609
3.85000 3020.44357
3.95000 3013.49633
4.05000 2853.91484
4.15000 2834.10408
4.25000 2642.42814
4.35000 2554.31278
4.45000 2491.22795
4.55000 2329.65819
4.65000 2252.69811
4.75000 2158.36383
4.85000 2041.19494
4.95000 1956.75058
5.05000 1903.40200
5.15000 1870.00991
5.25000 1781.90425
5.35000 1730.71271
5.45000 1691.80757
5.55000 1652.55370
5.65000 1617.48781
5.75000 1552.97208
5.85000 1511.38539
5.95000 1485.97221
6.05000 1428.20485
6.15000 1383.41849
6.25000 1325.02071
6.35000 1331.40699
6.45000 1290.84955
6.55000 1218.30671
6.65000 1220.05583
6.75000 1171.58075
6.85000 1146.19101
6.95000 1122.93592
7.05000 1072.71914
7.15000 1042.02549
7.25000 1014.54432
7.35000 1002.05829
7.45000 955.42847
7.55000 902.03193
7.65000 877.27423
7.75000 889.86817
7.85000 846.29357
7.95000 838.06494
8.05000 779.50655
8.15000 767.79008
8.25000 752.54620
8.35000 710.48171
8.45000 708.78972
8.55000 705.10132
8.65000 690.62183
8.75000 652.59088
8.85000 667.81269
8.95000 651.07155
9.05000 645.97270
9.15000 626.18526
9.25000 591.35483
9.35000 598.97500
9.45000 564.12527
9.55000 563.41185
9.65000 540.60977
9.75000 538.39838
9.85000 535.39193
9.95000 517.57581
10.05000 473.79259
10.15000 506.41494
10.25000 496.23784
10.35000 461.82736
10.45000 444.60379
10.55000 438.50104
10.65000 444.37640
10.75000 439.20081
10.85000 420.95049
10.95000 410.98632
11.05000 417.66148
11.15000 390.27150
11.25000 390.92979
11.35000 379.48115
11.45000 372.64640
11.55000 385.06817
11.65000 385.69916
11.75000 373.22696
11.85000 356.50731
11.95000 363.99954
12.05000 349.31719
12.15000 350.29022
12.25000 330.12438
12.35000 315.34773
12.45000 321.34851
12.55000 333.27348
12.65000 326.81642
12.75000 328.83597
12.85000 312.13731
12.95000 323.28946
13.05000 313.62643
13.15000 291.20108
13.25000 291.12929
13.35000 280.25691
13.45000 297.35037
13.55000 268.22195
13.65000 287.86000
13.75000 268.88775
13.85000 267.57496
13.95000 259.05543
14.05000 257.32985
14.15000 261.80217
14.25000 260.38495
14.35000 241.08344
14.45000 251.55683
14.55000 248.86331
14.65000 251.31854
14.75000 228.84150
14.85000 248.65509
14.95000 231.27800
15.05000 217.38735
15.15000 231.82071
15.25000 231.61796
15.35000 227.45911
15.45000 220.05988
15.55000 213.43566
15.65000 229.55017
15.75000 216.93794
15.85000 203.95262
15.95000 190.68031
16.05000 191.27984
16.15000 186.86300
16.25000 188.02303
16.35000 177.13854
16.45000 184.01769
16.55000 172.35473
16.65000 176.19435
16.75000 151.64804
16.85000 168.56570
16.95000 182.89752
17.05000 142.66829
17.15000 158.78868
17.25000 161.92515
17.35000 152.08614
17.45000 137.32194
17.55000 137.62780
17.65000 122.04818
17.75000 146.04841
17.85000 124.44348
17.95000 139.11783
18.05000 120.12079
18.15000 149.31379
18.25000 111.12810
18.35000 120.77175
18.45000 139.75318
18.55000 113.20460
18.65000 115.22767
18.75000 125.80431
18.85000 113.96490
18.95000 103.91849
19.05000 111.50150
19.15000 115.78058
19.25000 105.78343
19.35000 126.37933
19.45000 105.69189
19.55000 105.70346
19.65000 129.75926
19.75000 128.07350
19.85000 98.56162
19.95000 112.77713
