0.12500 0.01837
0.37500 0.01169
0.62500 0.01301
0.87500 0.01429
1.12500 0.02429
1.37500 0.02087
1.62500 0.02130
1.87500 0.01460
2.12500 0.00291
2.37500 0.00400
2.62500 0.00944
2.87500 0.00873
3.12500 0.02107
3.37500 0.02859
3.62500 0.04053
3.87500 0.01881
4.12500 0.03477
4.37500 0.03093
4.62500 0.02034
4.87500 0.00631
5.12500 0.01532
5.37500 0.02231
5.62500 0.00535
5.87500 0.02037
6.12500 0.02522
6.37500 0.00619
6.62500 0.02629
6.87500 0.01229
7.12500 0.01437
7.37500 0.01351
7.62500 0.02894
7.87500 0.02920
8.12500 0.03403
8.37500 0.04549
8.62500 0.03929
8.87500 0.03562
9.12500 0.00882
9.37500 0.02074
9.62500 0.02423
9.87500 0.00891
10.12500 0.03245
10.37500 0.02782
10.62500 0.02953
10.87500 0.03140
11.12500 0.02214
11.37500 0.01619
11.62500 0.01906
11.87500 0.05225
12.12500 0.01507
12.37500 0.04169
12.62500 0.01434
12.87500 0.05599
13.12500 0.04420
13.37500 0.02583
13.62500 0.04409
13.87500 0.02814
14.12500 0.02245
14.37500 0.03816
14.62500 0.01660
14.87500 0.08171
15.12500 0.08575
15.37500 0.05392
15.62500 0.05947
15.87500 0.00625
16.12500 0.07399
16.37500 0.07036
16.62500 0.09805
16.87500 0.06721
17.12500 0.05657
17.37500 0.05880
17.62500 0.00441
17.87500 0.07754
18.12500 0.03699
18.37500 0.13881
18.62500 0.01720
18.87500 0.07855
19.12500 0.05286
19.37500 0.02648
19.62500 0.06022
19.87500 0.10768
