0.05000 -206.92897 -1370.59520 -121318.07903 0.00000 0.00000 0.00000
0.15000 -700.76305 102.30359 -34662.06305 2496.56039 1195.74853 1018909.26965
0.25000 -465.07366 -198.93098 -105474.08947 2630.20163 1113.51344 1020950.19675
0.35000 -1205.92652 -184.75207 66275.73050 2561.23579 1233.75221 2264811.70953
0.45000 -722.10911 186.87544 224420.58314 2617.91205 1141.47471 1668110.23598
0.55000 -203.44563 190.04868 31203.10768 2694.69002 1219.33909 1479423.77516
0.65000 -671.73127 -76.04313 84221.40479 2291.05832 1271.21811 583707.43698
0.75000 -824.82193 85.59336 -199279.74908 2459.07791 1250.80911 2243136.33668
0.85000 -810.88956 -25.32192 -54375.66926 2501.06320 1290.12152 1268774.66599
0.95000 -941.13378 -35.57720 105880.67200 2405.52891 1309.60053 1666846.69093
1.05000 -1122.58202 70.03364 26875.90531 2290.56623 1384.40008 1848136.50300
1.15000 -1077.24263 22.03397 21550.61748 2262.98573 1333.53356 1066296.87431
1.25000 -1156.73813 -44.75347 -20816.91603 2106.41256 1467.36627 1362555.25832
1.35000 -1347.81251 -19.44386 -129839.71954 1922.89130 1500.84775 1267934.21526
1.45000 -1672.25001 -0.00331 -119806.18669 1815.39760 1446.70457 1596901.31566
1.55000 -1907.67356 8.90285 -65231.54980 1504.57078 1435.20905 1927646.01136
1.65000 -2218.94979 61.94981 -40986.32433 1284.65634 1458.84338 1385221.59218
1.75000 -2441.16016 -11.77250 94482.54942 1012.35506 1457.08102 1574036.81259
1.85000 -2730.02847 28.92253 6225.93459 777.40189 1395.35962 1649722.04802
1.95000 -2939.13020 12.84156 -61768.11911 613.15936 1272.12751 1568789.20865
2.05000 -3140.38933 2.16922 45171.77429 526.81651 1180.02143 2320393.87535
2.15000 -3274.17511 30.30751 -14102.35493 443.16594 1105.40387 1641725.35103
2.25000 -3389.12507 -37.04982 8565.78027 378.50739 1105.24542 1525835.00766
2.35000 -3477.38873 29.10866 -21722.00089 337.62337 1000.27985 2214082.65952
2.45000 -3544.90230 -19.40377 -127198.66607 303.57315 962.40868 2201144.98070
2.55000 -3606.79916 11.87787 -22301.02236 277.30986 912.96138 1651742.40597
2.65000 -3663.59663 21.13635 -30472.60863 245.83228 852.85042 1671706.73968
2.75000 -3693.58937 -25.27554 -50035.00584 214.22941 792.60065 1855828.63801
2.85000 -3724.38473 39.94305 -40657.03608 194.57658 756.48033 2090535.58380
2.95000 -3754.70821 0.76297 -10526.70929 188.54564 737.14634 1911701.68130
3.05000 -3789.82221 31.18281 10489.03911 185.37113 692.36868 1966691.75314
3.15000 -3808.92347 8.03265 -52183.43637 188.49923 674.74266 1927534.18029
3.25000 -3822.13790 -21.47632 11321.06186 196.11412 641.64845 2250306.24510
3.35000 -3834.34134 5.53015 23752.55419 199.58023 616.34034 2272730.44947
3.45000 -3841.51382 9.02761 -65520.04177 201.73603 587.78430 2172552.24866
3.55000 -3857.61957 6.08170 14613.87670 208.40124 562.96197 2095044.38599
3.65000 -3854.03860 -11.94419 -118269.46053 201.40137 545.19720 2071788.71198
3.75000 -3860.21068 3.99650 82165.35206 209.82750 519.50459 2162443.50450
3.85000 -3848.16995 -2.23551 2974.80787 193.20188 501.04042 1898793.17516
3.95000 -3843.89632 -29.29003 -43741.54871 195.77847 482.16110 2365653.98783
4.05000 -3833.78465 1.46123 45227.48590 194.23515 467.38153 2397300.62798
4.15000 -3825.72604 -4.54494 36353.78970 193.13593 452.82039 2212200.63103
4.25000 -3816.95103 3.99177 38693.13249 193.23587 440.97589 2173212.19288
4.35000 -3798.21185 -2.26535 17664.21552 192.31112 422.02765 2113602.82051
4.45000 -3806.80867 5.13968 17367.82123 200.02606 422.96905 2263808.25671
4.55000 -3796.06620 2.44912 -65311.27808 202.29768 410.89570 2237734.39614
4.65000 -3769.42712 -3.50727 48948.57666 207.93330 393.63893 2350509.55624
4.75000 -3762.32239 -0.14660 -100969.00542 209.16969 377.40258 2394848.85020
4.85000 -3745.88424 -10.70977 -38990.51955 205.56828 375.28366 2493021.16479
4.95000 -3725.93568 -13.16052 -16101.34353 201.49876 364.10327 2464633.30029
5.05000 -3709.84478 3.39530 -18588.47071 196.92821 353.49290 2532642.37010
5.15000 -3703.59672 6.67223 -102896.40745 204.31449 343.55942 2265032.16735
5.25000 -3693.00371 3.86729 16802.67665 204.16790 333.84567 2116180.23046
5.35000 -3672.20486 -7.68022 -24510.51323 201.71576 336.41923 2068919.56963
5.45000 -3654.85462 -5.76371 -8022.86996 203.35893 319.81178 2184020.94174
5.55000 -3637.45360 2.50051 -151395.98662 200.08656 314.04346 2290087.16649
5.65000 -3623.21506 0.73766 -112223.15187 200.05502 303.15422 2379394.90734
5.75000 -3611.93083 5.59158 2425.79797 204.04688 304.92157 2132688.75166
5.85000 -3589.85852 -0.02620 5255.09379 203.78756 290.09860 2481001.30925
5.95000 -3568.46175 2.52862 -38142.20498 200.45583 280.91765 2264736.66762
6.05000 -3553.87854 -3.18127 -4770.30897 195.29239 283.30261 2374493.05978
6.15000 -3534.52885 5.78324 -32082.30372 197.83104 272.88901 2339224.53187
6.25000 -3530.56931 -2.04920 124128.78301 197.55128 270.69679 2356325.64013
6.35000 -3505.12768 7.00732 55582.39346 191.69864 256.71308 2192044.95570
6.45000 -3486.03786 1.45019 -26265.83766 191.56072 259.14315 2370372.73149
6.55000 -3460.83533 1.15233 -133340.71597 185.23461 249.44023 2583145.42984
6.65000 -3461.49261 2.26906 -20276.22417 182.67354 247.28301 2205967.55392
6.75000 -3445.21513 -3.18497 46027.69451 184.61748 241.55161 2403754.29101
6.85000 -3430.57632 5.65622 27192.01524 183.26818 238.73759 2687450.26147
6.95000 -3420.44585 3.77724 -18514.71330 187.64244 231.52782 2502610.17907
7.05000 -3402.38968 -1.54692 18618.76655 181.93335 227.10656 2577481.78175
7.15000 -3387.52812 -1.49085 59479.16130 181.22368 225.24687 2432725.50182
7.25000 -3368.82532 -9.46650 -19560.83115 186.05523 220.29899 2184785.94967
7.35000 -3352.94194 -0.31596 68858.56288 185.13007 217.24458 2385937.40751
7.45000 -3336.73396 -1.98672 35017.82730 181.89385 212.20699 2178277.07851
7.55000 -3327.44884 -0.03475 102353.29314 182.71718 206.59971 2435675.90988
7.65000 -3301.11586 1.35179 10406.72951 179.22377 200.23193 2052114.55649
7.75000 -3286.71583 3.42956 636.72219 181.66902 202.17802 2234886.19672
7.85000 -3271.93456 -2.21092 -42014.78055 177.73672 195.40585 2353274.27587
7.95000 -3255.01458 6.88746 35801.24819 175.81949 195.08172 2459314.19075
8.05000 -3247.08418 4.53498 -25692.69170 176.99435 191.20067 2139456.72014
8.15000 -3222.10658 6.49549 -1503.30055 177.00979 189.07407 2645137.74640
8.25000 -3202.95380 -1.53131 10897.35151 172.66047 182.72468 2178297.22356
8.35000 -3191.93725 0.62758 11608.18039 176.40095 182.06725 2301811.21637
8.45000 -3182.33677 -5.38912 60774.17097 170.95482 177.73947 2133194.90349
8.55000 -3167.39977 -8.23920 112.23211 172.29101 175.21577 2299808.49069
8.65000 -3148.91545 -1.52869 -67069.38703 173.72744 170.35523 2302895.54271
8.75000 -3129.82088 1.87676 39187.56268 168.16893 169.91857 2069192.06851
8.85000 -3122.29087 -2.93193 -91255.32155 169.42710 164.99923 2327604.33563
8.95000 -3102.22259 -0.55123 -77008.76950 172.13122 161.62206 2304915.66246
9.05000 -3084.15908 4.35930 24196.47483 172.00294 162.45501 2257645.63073
9.15000 -3064.29553 -7.39443 24727.58748 168.83479 159.14609 2312101.64866
9.25000 -3054.04862 0.47076 -70080.14245 166.69863 158.28847 2259045.53197
9.35000 -3037.42410 -6.59606 -26427.17147 163.77586 152.92684 2648474.63323
9.45000 -3021.94553 -4.43665 48548.08300 163.83020 152.53450 2277981.71777
9.55000 -3004.32155 -0.13822 777.21308 162.74576 149.09615 2032969.94052
9.65000 -2995.49598 -0.78732 55645.05247 161.99192 149.82700 2142914.78533
9.75000 -2976.93003 -4.97196 -3127.53679 165.47330 144.44727 2186770.20884
9.85000 -2957.86766 7.45615 54.45567 161.87678 141.99499 2262649.57536
9.95000 -2944.09416 0.85647 13103.77274 160.71273 139.40658 2035785.52340
10.05000 -2933.41268 -0.64170 38374.51528 159.89970 141.54680 2261034.22182
10.15000 -2918.89257 1.22231 -20423.34412 158.63232 136.95952 2228654.95625
10.25000 -2896.23393 -1.96420 -91690.03253 156.58749 135.80756 2193372.39578
10.35000 -2885.84079 -1.11961 -88135.42269 155.74496 133.03324 2370093.95414
10.45000 -2868.66549 -0.91236 11827.72817 154.63166 129.39177 1977298.98989
10.55000 -2858.64160 -2.98958 -61518.29092 155.99652 128.51586 2087944.83160
10.65000 -2837.51927 0.32836 22143.19087 151.47606 126.60719 2237929.53662
10.75000 -2825.20427 -0.10480 11822.13955 151.09250 126.48452 2132374.53413
10.85000 -2815.36113 -2.27443 20605.18879 153.23991 125.25469 1978398.99633
10.95000 -2801.07026 -2.92644 -14814.18258 152.07930 124.26171 2123015.75781
11.05000 -2788.64930 -0.69362 -59670.93963 154.56152 118.46300 2099426.35354
11.15000 -2774.35125 -2.63726 7135.02435 149.87967 120.83065 2201306.72112
11.25000 -2758.96831 -2.31128 -7681.68044 151.59638 116.30273 2272731.30992
11.35000 -2743.97651 4.01345 -35642.64201 150.66067 113.14876 2259711.86368
11.45000 -2731.23868 -0.76188 4793.92061 151.75677 114.43082 2159052.15263
11.55000 -2713.32376 0.99414 -102246.70864 147.39064 110.41769 2231242.11284
11.65000 -2704.58281 -1.28845 -77309.32237 146.59322 111.12352 2230131.69128
11.75000 -2694.57607 -0.41623 -42809.52968 147.20028 109.94097 2055077.56597
11.85000 -2673.72235 4.24528 -16948.07631 145.20976 108.95319 2300528.82983
11.95000 -2659.05876 -0.44719 -22707.38391 144.29340 107.24910 2006936.01361
12.05000 -2645.43338 2.89234 17737.26364 140.25572 105.66383 2112530.63666
12.15000 -2638.36235 -0.61261 -39307.69396 140.77514 103.78744 2111726.92054
12.25000 -2625.26613 -0.66872 20539.09075 140.01551 102.10708 1939512.01202
12.35000 -2613.44469 1.62784 -56659.52186 139.26417 104.20397 1784748.23388
12.45000 -2591.07513 -0.63366 14521.63669 139.16732 99.62783 2068833.10818
12.55000 -2580.24402 -0.78511 -85036.49993 136.57963 99.03776 2343423.38058
12.65000 -2571.98289 1.26285 51800.72518 136.23695 97.26054 2313734.93617
12.75000 -2559.90687 1.01401 -25645.60808 132.41018 96.63934 2184572.15493
12.85000 -2544.43909 0.84112 -54924.43004 135.53278 95.36235 2162408.42501
12.95000 -2532.00923 -2.09988 -88994.52474 131.29601 93.92470 2091168.14367
13.05000 -2518.59966 -1.44585 21136.97712 130.85824 93.28337 2096156.58465
13.15000 -2505.75952 1.31480 -380.36078 130.22138 91.23155 2076832.91992
13.25000 -2495.48575 -0.80721 -42577.70527 128.11069 91.77741 1998255.36803
13.35000 -2481.84531 -0.52603 51488.28343 125.89958 88.24306 2152325.29866
13.45000 -2468.47046 -0.67435 18572.23123 125.54710 88.45760 1995184.35874
13.55000 -2451.35834 -0.47201 1069.59431 124.89906 87.44189 1949291.51777
13.65000 -2448.33269 1.95836 25980.64175 122.30620 86.86521 2050158.84109
13.75000 -2434.62754 -1.51428 1567.32198 123.46875 87.08019 1991577.04981
13.85000 -2421.39557 -0.34740 41041.67303 121.17718 85.28126 1915128.12270
13.95000 -2410.95932 -2.11842 18180.41946 119.44995 84.36226 2141308.21687
14.05000 -2397.95969 -1.33203 46369.27033 120.12734 82.92960 2132447.23865
14.15000 -2388.93277 -1.31356 43069.05829 119.03478 82.55115 1910764.39664
14.25000 -2378.34701 2.90493 19151.04710 117.30143 80.69198 1974653.52122
14.35000 -2366.14210 1.11834 -28283.44803 117.14000 81.18112 2122943.24542
14.45000 -2356.75942 0.24453 -28284.28957 118.25251 79.83574 2150514.65163
14.55000 -2347.15629 -2.87493 37691.43026 117.54222 78.90380 2050882.92135
14.65000 -2333.04949 -3.93992 73709.15928 115.61129 76.53578 2182634.54208
14.75000 -2323.15204 0.48224 60458.88062 115.13743 77.94512 1809336.01655
14.85000 -2315.83539 1.11121 60823.65372 115.86880 75.70335 2157692.13810
14.95000 -2304.53591 -0.66536 -19315.57172 114.66327 75.74441 2347828.97377
15.05000 -2289.07853 1.21448 -344.46685 115.22846 74.59345 1819978.74204
15.15000 -2281.91648 3.23326 -19848.04829 112.15424 74.22846 1897674.68499
15.25000 -2269.78544 0.77300 41622.26400 110.03390 72.38834 1974656.10882
15.35000 -2261.87942 0.37147 -25221.41700 111.23092 72.55277 1837495.82697
15.45000 -2248.94460 -1.86958 834.87821 109.03648 71.53759 1875528.50076
15.55000 -2237.11234 -1.02397 3801.91713 107.21158 70.40652 1912091.37022
15.65000 -2227.57095 -0.84910 39894.92851 108.77652 69.31095 1974718.71337
15.75000 -2220.80390 -0.42688 -18157.52530 107.46865 68.79660 2032322.37307
15.85000 -2208.61876 1.61619 17329.77216 107.89421 67.90848 1924998.99933
15.95000 -2197.15470 0.40848 -44568.98777 106.75785 67.73868 1900391.61427
16.05000 -2191.91381 -1.50658 -11547.01619 104.43340 67.13206 1872896.39530
16.15000 -2176.11023 0.12579 -6443.77699 105.62175 66.38716 1736018.87739
16.25000 -2169.98495 -0.87255 17847.61031 105.05073 65.11606 1780542.55019
16.35000 -2154.19055 -0.54445 99580.46855 103.91748 63.82132 2082856.63298
16.45000 -2147.18738 1.44785 21419.40480 103.63892 62.94527 1894381.72913
16.55000 -2143.07365 1.46734 36661.20632 101.86989 64.30029 1814559.17114
16.65000 -2127.85745 1.23651 4832.81461 102.98761 62.39983 1736232.34059
16.75000 -2119.86181 -0.22622 13191.21257 102.38851 61.76038 2002206.25363
16.85000 -2108.61022 0.10626 855.24001 102.29224 60.99150 2007486.10688
16.95000 -2099.88253 -1.20213 10751.85743 101.41710 61.35120 1988471.68054
17.05000 -2088.05360 0.64990 18515.92249 97.48726 59.70343 2030892.18936
17.15000 -2078.40910 -0.32660 -19378.55288 98.48607 60.04200 1991934.42925
17.25000 -2065.17007 0.54508 -1703.49163 96.21494 59.08054 1959064.25841
17.35000 -2059.87763 -1.78362 80683.40944 97.52423 58.42592 1980249.92127
17.45000 -2053.69515 0.97846 -17834.96416 95.48056 57.24363 2079633.42441
17.55000 -2041.99564 0.97651 -23899.48939 95.81027 57.49090 1849546.00495
17.65000 -2034.81123 -1.72015 11782.09616 94.27406 55.95027 1925861.99211
17.75000 -2025.28931 2.14626 -51682.47796 95.16233 55.90954 2008610.12520
17.85000 -2015.83925 -0.08859 9855.58382 92.27337 56.42634 1959587.40285
17.95000 -2007.40076 -0.16857 -9629.19190 91.57125 54.72812 1846446.55294
18.05000 -1995.90756 -1.56194 -41519.63507 93.87933 54.46871 1953819.51530
18.15000 -1989.63595 0.02048 24777.81089 93.68114 53.27181 1719655.38964
18.25000 -1978.63967 -1.08645 -28260.70711 90.35666 52.87670 2132611.09239
18.35000 -1969.64366 0.09683 17510.45358 90.85055 53.05772 1951121.73166
18.45000 -1958.62620 1.75210 1291.41334 89.86215 53.20109 1836496.09555
18.55000 -1953.95095 0.80948 -31141.84118 89.33723 51.28973 1856038.48583
18.65000 -1943.80538 0.28414 10112.01391 90.18197 50.90293 1746732.39401
18.75000 -1934.55807 0.98457 -46678.69837 87.66780 51.62646 1814173.83317
18.85000 -1927.57704 -0.73402 -61131.23508 89.52676 50.19194 1824932.58859
18.95000 -1917.44828 0.26200 9900.58820 87.30433 50.50602 1975947.62496
19.05000 -1913.31886 0.60338 -8196.15900 87.69425 49.55589 1804333.67599
19.15000 -1902.38571 -0.66900 -87596.43440 87.12368 50.02691 1842994.70883
19.25000 -1892.37058 -0.60327 14888.29923 86.08313 47.62784 1896004.09124
19.35000 -1887.14410 0.18283 -447.49540 86.55330 48.90677 1836043.28867
19.45000 -1877.40244 1.58708 28998.31361 86.21799 48.38640 1777277.83750
19.55000 -1868.34728 -0.46587 -5257.86733 85.22832 47.52341 1761110.67662
19.65000 -1858.08765 0.62219 13433.58918 83.67886 47.42836 1715847.43496
19.75000 -1852.52378 -0.00251 -16291.56106 84.48840 46.04006 1692906.61906
19.85000 -1847.03861 0.97390 53602.72734 81.94804 46.32855 1791407.38473
19.95000 -1835.86542 -1.42756 -49416.46443 82.68184 45.50313 1820355.57786
