0.05000 -1988.97878 760.59242 233.74487 2800.41857 2611.55173 2630.50943
0.15000 -4059.17602 219.62559 -171.87975 3431.11177 3299.78106 4936.86903
0.25000 -5496.11654 -48.42442 196.22915 3160.53976 2600.94438 7115.22164
0.35000 -6533.43002 37.69795 24.19064 2939.94371 2594.80334 7619.77159
0.45000 -7393.48685 33.97550 -167.28235 2839.06965 1916.33399 8008.66039
0.55000 -7787.38182 30.84799 104.98674 3208.44134 2140.54321 8542.52669
0.65000 -7929.07631 32.25809 -36.78105 2918.34460 1977.54608 8234.93528
0.75000 -7878.92735 72.21963 -312.45214 2324.92076 1355.40261 8228.29866
0.85000 -7911.67462 49.69844 33.32811 2236.19421 1540.07846 8170.80930
0.95000 -8041.98809 16.42181 -163.57948 2046.14705 1179.34600 7806.51365
1.05000 -7990.48598 10.00726 13.77926 2262.90200 1155.34467 7675.42650
1.15000 -7991.26669 53.54805 121.58477 1943.61419 1058.62169 7460.00155
1.25000 -8012.76330 23.27662 -40.58450 1981.75024 1177.51461 7284.69131
1.35000 -8019.28713 24.87894 -63.78583 1712.94364 985.94840 6920.87774
1.45000 -8033.37074 54.87689 -184.46722 1778.03225 949.85472 6750.97997
1.55000 -8030.01251 48.96195 -126.48427 1722.91074 1078.69166 6538.53664
1.65000 -8033.27577 62.01932 -31.35519 1781.19426 1126.48530 6287.38325
1.75000 -8045.03596 39.57085 16.53038 1552.69369 958.77923 6072.56074
1.85000 -7996.07153 45.23199 61.51919 1462.65641 880.55079 5955.09517
1.95000 -7958.20296 28.73709 -14.34916 1628.59342 963.34712 5698.74714
2.05000 -7950.20024 42.58084 -46.52767 1296.27232 796.95015 5422.36757
2.15000 -7911.75802 12.50493 -120.87216 1208.79051 857.97476 5292.96879
2.25000 -7851.87731 4.28258 -156.19494 1191.25697 826.86920 5139.63851
2.35000 -7800.00362 12.94150 83.80089 1169.18287 838.02637 4993.44928
2.45000 -7746.88254 6.73743 26.10356 1132.10956 756.18630 4857.29422
2.55000 -7715.50662 10.76320 -58.98399 1027.12196 710.96253 4709.06351
2.65000 -7696.94824 10.19496 9.08526 984.48000 735.56575 4571.74234
2.75000 -7664.46262 14.95772 -72.19902 946.40240 718.12510 4455.06554
2.85000 -7628.89901 -3.09330 20.06048 902.90052 885.76131 4382.11560
2.95000 -7650.40321 10.13138 -46.25005 900.59377 689.48560 4183.03501
3.05000 -7605.50335 11.19476 -32.21945 884.07400 652.04215 4081.61352
3.15000 -7608.26773 1.09867 -77.40575 803.41625 627.52123 3953.99107
3.25000 -7529.39954 4.05627 -65.32320 775.17393 544.75506 3877.08337
3.35000 -7501.80051 20.47799 -10.83850 783.84303 589.12090 3766.69364
3.45000 -7466.66698 18.67770 43.41176 788.00136 610.20686 3653.75421
3.55000 -7418.26055 21.14201 -33.78080 711.16545 614.33227 3558.93817
3.65000 -7387.20537 3.32778 -4.71167 762.69250 636.89287 3456.75955
3.75000 -7345.47110 22.01859 -66.34957 690.78693 531.13061 3397.82149
3.85000 -7293.94895 21.92713 -50.52065 881.87175 520.20200 3313.44962
3.95000 -7259.59736 15.16174 -10.74143 678.63539 494.82694 3204.77284
4.05000 -7224.56081 16.26088 -5.22998 685.93172 482.96900 3127.41630
4.15000 -7153.81368 10.80862 8.94622 674.68598 452.40188 3043.70529
4.25000 -7102.51719 11.96970 -11.32734 605.09622 418.07049 2946.25462
4.35000 -7038.77205 16.06695 -15.32927 801.02179 520.79068 2909.61435
4.45000 -6982.83763 13.85302 -65.50919 624.58745 477.74293 2785.91839
4.55000 -6923.85276 6.77825 -90.93633 673.58849 703.18828 2747.78657
4.65000 -6879.29349 19.07058 -22.93936 533.39649 390.09838 2648.38397
4.75000 -6823.20922 20.28334 -17.23286 542.60111 442.14118 2597.19098
4.85000 -6749.03189 -7.99454 41.81400 734.09644 835.05339 2565.94437
4.95000 -6693.15454 14.95555 -91.94073 541.87011 370.36972 2489.94525
5.05000 -6647.19718 12.80572 39.18632 464.27670 396.09159 2401.15844
5.15000 -6602.74959 10.81847 -29.38215 495.33541 413.69513 2379.67691
5.25000 -6550.04894 14.58409 -52.87726 495.73822 365.65659 2313.48163
5.35000 -6495.80325 7.12961 7.59617 510.39609 408.37219 2289.34173
5.45000 -6465.94699 11.98138 -53.31972 516.15478 429.02878 2205.54569
5.55000 -6406.78515 17.94131 -39.23362 495.64776 376.60973 2200.78562
5.65000 -6380.30471 8.88144 -40.10454 485.30537 382.01313 2101.15698
5.75000 -6334.95134 12.23340 -16.41451 502.02409 355.20680 2068.49104
5.85000 -6286.14553 23.75166 22.49677 494.69610 685.54455 2046.68077
5.95000 -6239.42124 12.70938 -44.48095 482.38718 319.52213 1997.25517
6.05000 -6198.59827 9.60413 -54.05930 409.83772 328.01874 1930.45275
6.15000 -6145.75911 17.56261 -28.50906 361.78158 304.16344 1883.81609
6.25000 -6108.33136 10.46685 24.67644 377.77897 369.35695 1843.97872
6.35000 -6050.59779 17.58577 6.15322 405.39409 434.08527 1881.78674
6.45000 -6002.97097 6.62876 -18.16037 384.73421 528.58881 1865.90792
6.55000 -5966.93490 9.61210 -8.50268 374.90806 267.48712 1731.83154
6.65000 -5926.85542 6.83442 31.23330 350.06753 482.31853 1706.23642
6.75000 -5882.83702 12.15911 11.03716 336.84823 288.52580 1675.81129
6.85000 -5831.17719 6.35589 -3.76478 424.35398 383.10384 1656.31527
6.95000 -5787.99890 14.97707 19.31746 343.86957 311.67416 1589.95551
7.05000 -5745.16580 10.02750 9.25508 373.71312 288.81228 1567.75476
7.15000 -5709.26962 8.57817 10.44496 338.50181 305.84823 1553.15219
7.25000 -5675.54657 7.20156 -31.80424 355.81953 305.12101 1493.07067
7.35000 -5621.73257 11.00588 24.82129 327.23246 292.71441 1473.23025
7.45000 -5582.65958 10.83199 37.29843 292.10016 221.50663 1446.03246
7.55000 -5541.25096 9.27730 13.91638 351.90264 307.36236 1401.63164
7.65000 -5507.06008 8.48671 38.66764 320.95284 282.72059 1381.86865
7.75000 -5462.40952 -1.97713 41.63924 394.21910 304.29543 1371.26207
7.85000 -5427.08046 8.78808 2.12715 278.88992 268.72954 1313.48634
7.95000 -5383.53576 11.69400 15.84429 335.50515 200.26380 1275.59486
8.05000 -5346.39241 -0.59684 47.03304 294.09685 356.06120 1266.93614
8.15000 -5308.01425 10.31259 29.38826 369.47198 309.81234 1248.34803
8.25000 -5264.37105 6.33834 32.23751 330.01194 248.04973 1203.89673
8.35000 -5217.44849 9.03995 -8.63968 279.26285 248.62765 1182.23870
8.45000 -5176.40323 14.19210 20.21585 334.48628 281.13854 1158.99411
8.55000 -5131.54128 8.67489 19.49267 286.77860 253.80090 1163.93907
8.65000 -5084.48362 13.86159 13.19121 270.35114 242.67071 1116.95845
8.75000 -5044.65445 6.94818 40.20831 266.36921 286.56363 1090.53105
8.85000 -4998.03880 5.27065 41.97667 268.30558 237.65567 1088.56075
8.95000 -4958.61581 8.69717 31.72332 205.20965 161.03284 1040.14125
9.05000 -4918.48139 5.06981 22.79552 239.11487 204.52370 1020.14302
9.15000 -4881.42898 8.34711 18.07243 367.97585 269.41425 1018.47251
9.25000 -4854.16005 6.71697 7.97152 303.88358 279.63188 1045.68577
9.35000 -4813.90098 6.72954 35.84880 234.85878 193.73489 960.33356
9.45000 -4777.34586 9.44005 37.17847 215.18746 225.87736 937.29604
9.55000 -4732.74153 7.86353 36.98145 207.99576 173.95073 931.65516
9.65000 -4700.72553 13.09423 50.25361 247.62057 238.49969 911.65601
9.75000 -4667.84002 4.39906 28.23947 182.64806 160.67944 880.70595
9.85000 -4629.29853 6.03535 32.54073 201.41227 170.50798 908.76353
9.95000 -4590.46045 8.70009 41.19712 270.28004 282.21366 869.23654
10.05000 -4551.00080 8.79816 11.29715 171.42887 186.82823 841.74926
10.15000 -4522.10096 4.67389 14.37684 225.44379 171.72966 814.30743
10.25000 -4484.62041 8.97488 28.95992 183.62194 174.43959 809.18553
10.35000 -4450.31802 4.50012 43.44232 243.14724 199.57250 778.05306
10.45000 -4425.77699 4.26545 32.84543 293.13443 196.70781 787.44683
10.55000 -4383.79667 5.23905 33.48832 156.20477 171.09599 768.04128
10.65000 -4358.85274 -1.75357 19.62662 321.13132 264.02243 831.01762
10.75000 -4326.81089 5.51046 21.33516 201.28232 143.82196 748.71658
10.85000 -4290.77850 1.18966 34.73523 260.70561 175.05230 721.20184
10.95000 -4267.65876 9.45173 54.48126 255.05102 179.23409 723.76226
11.05000 -4236.69338 4.47003 28.03891 211.23624 139.78157 680.00076
11.15000 -4208.24205 6.70156 24.62226 160.27275 186.73992 661.67407
11.25000 -4178.07518 5.79168 37.91194 150.98726 114.46191 654.39910
11.35000 -4146.32495 6.23096 30.17483 173.90107 122.59097 644.42656
11.45000 -4113.62715 2.76471 15.90526 180.80209 271.28426 651.37271
11.55000 -4079.63926 8.08644 52.05267 152.26146 210.78669 678.31939
11.65000 -4057.58399 5.01943 25.53233 214.26033 221.67714 620.44442
11.75000 -4023.61845 6.60255 33.70068 153.14241 230.89658 629.75497
11.85000 -3999.79482 5.37532 36.67246 162.84996 268.88728 600.47381
11.95000 -3969.92513 4.82449 34.01654 128.39571 115.15594 568.69114
12.05000 -3943.40088 0.34877 32.47318 239.49280 255.36232 585.98113
12.15000 -3915.87154 0.09631 19.47446 116.17052 118.35423 552.10261
12.25000 -3882.85005 7.87470 32.23706 170.16106 163.18401 597.67225
12.35000 -3860.81199 4.92089 44.34128 150.73482 142.33155 563.27354
12.45000 -3836.94406 6.14029 31.05801 149.52449 109.33000 529.95440
12.55000 -3808.76227 8.48614 38.52408 119.35634 124.63192 509.07514
12.65000 -3782.29031 6.38243 20.73271 131.70551 110.83152 507.49947
12.75000 -3759.82668 -0.67644 13.80471 216.99940 286.67598 550.06433
12.85000 -3731.23255 5.58247 39.09714 126.75517 179.13080 536.57001
12.95000 -3700.38706 2.51340 50.78046 133.70485 310.10578 486.63165
13.05000 -3676.36142 5.49358 50.68894 159.46337 100.92994 455.01564
13.15000 -3648.60310 2.59804 54.29335 127.41726 128.81674 456.13856
13.25000 -3618.55639 2.91364 40.07404 280.95460 96.92456 447.63631
13.35000 -3595.92607 2.21222 63.54061 198.44751 248.12914 596.98570
13.45000 -3571.04887 4.63171 58.14708 156.22909 128.37342 439.52884
13.55000 -3543.75646 3.50637 51.76271 111.20103 107.80250 426.45814
13.65000 -3515.46706 3.72485 64.37567 122.99116 121.69226 424.77452
13.75000 -3492.89193 1.19925 57.71723 151.16406 124.44933 398.07304
13.85000 -3466.97340 2.07829 54.88255 104.68821 99.72482 396.19188
13.95000 -3442.62278 5.06234 42.69670 85.18280 90.95404 392.72034
14.05000 -3419.75086 0.51014 61.23760 91.05539 108.73834 385.15712
14.15000 -3395.19580 6.25024 45.08784 131.72355 153.84682 450.02450
14.25000 -3377.96387 2.12181 52.41685 231.00623 77.05876 369.28717
14.35000 -3345.21061 -1.74759 40.71861 154.44705 323.16139 364.42980
14.45000 -3319.20736 2.90024 52.78715 198.85946 87.38861 435.60565
14.55000 -3300.75137 7.32849 30.36650 140.30393 138.93193 385.13086
14.65000 -3280.72110 -0.18380 41.13806 68.95249 79.38536 349.17088
14.75000 -3259.41211 0.54412 41.36474 143.37351 151.87143 432.80060
14.85000 -3240.23595 4.61403 23.09291 92.21859 96.58643 336.62998
14.95000 -3214.14690 4.35102 24.93332 84.11595 117.61820 451.81546
15.05000 -3192.04101 5.76238 41.86226 150.09711 130.46986 410.50941
15.15000 -3171.06576 3.33012 31.48115 92.03101 90.04616 320.76829
15.25000 -3151.64275 -0.87969 38.78720 170.16985 153.93440 308.91914
15.35000 -3132.35600 4.97783 49.37743 90.95028 78.80135 306.42769
15.45000 -3115.87542 2.37339 58.37608 138.52920 67.51575 331.70241
15.55000 -3085.37105 1.23737 49.17147 143.29404 97.56200 391.68205
15.65000 -3068.64561 3.43581 39.68264 72.40064 54.79342 300.94430
15.75000 -3046.30661 6.10834 41.65246 123.86990 81.78236 310.91633
15.85000 -3031.52390 -0.58722 44.06298 118.40291 150.37861 280.14337
15.95000 -3010.71944 2.41214 41.13197 60.04834 69.60216 274.28466
16.05000 -2994.30019 5.76744 35.07503 117.79144 274.19763 280.21290
16.15000 -2968.88839 1.99100 55.25861 92.97862 80.26289 293.09450
16.25000 -2944.64171 2.79201 29.27510 242.03914 152.77024 322.36261
16.35000 -2930.23141 2.22552 41.66505 120.41839 63.15047 261.11683
16.45000 -2910.10334 0.70601 33.20407 80.89439 111.10517 268.38823
16.55000 -2891.18032 3.88108 37.55832 173.05760 68.71456 255.26333
16.65000 -2865.24381 3.71152 47.83606 93.54657 96.85797 305.66590
16.75000 -2849.26199 3.81803 46.25889 70.08942 91.77237 261.35389
16.85000 -2830.39705 -2.60285 38.62547 84.91467 125.90498 230.74028
16.95000 -2809.06677 4.43062 16.49286 54.91140 81.88767 235.49198
17.05000 -2786.67601 -10.21331 18.68439 99.34586 283.80957 371.35930
17.15000 -2768.63716 2.47382 30.80331 177.30113 117.21722 226.64437
17.25000 -2752.96639 0.50761 32.40638 141.84825 60.14716 311.07878
17.35000 -2733.62441 1.84642 21.42823 57.88160 52.60765 218.09267
17.45000 -2717.40570 -0.04611 18.28865 60.78187 57.91251 205.99642
17.55000 -2699.25100 2.57480 15.41924 64.91314 54.85562 207.20736
17.65000 -2690.84168 -1.53097 20.34613 116.53002 79.23851 215.76177
17.75000 -2670.95624 1.34347 21.60134 85.09958 85.02827 218.09455
17.85000 -2650.03838 0.95981 13.65697 51.06691 57.83377 203.28771
17.95000 -2633.84238 0.65441 13.41906 52.93585 67.07749 197.53417
18.05000 -2609.55050 -3.36133 15.72900 226.13513 94.27720 191.50891
18.15000 -2603.97643 1.03537 29.84255 46.35250 72.62632 215.08984
18.25000 -2591.96134 2.65711 19.89503 103.76405 51.28867 201.49992
18.35000 -2572.30835 3.06449 22.97174 49.59583 41.06941 184.17529
18.45000 -2556.29955 2.84450 14.49148 53.94959 40.81626 175.33452
18.55000 -2543.69138 1.22542 15.14356 65.13358 64.20891 183.25019
18.65000 -2525.58908 3.66439 21.87065 51.59073 61.50492 199.08240
18.75000 -2511.79438 0.99520 18.97656 45.76305 55.09428 176.57475
18.85000 -2493.65721 -1.39110 20.40804 42.31341 57.33694 159.63647
18.95000 -2482.51745 2.76870 36.33738 71.90797 59.87446 168.67435
19.05000 -2465.43828 -5.77867 22.27961 112.57098 175.94728 205.03338
19.15000 -2455.45969 2.17291 22.86457 140.77036 77.07603 164.71732
19.25000 -2434.74703 -0.91718 22.38192 47.68813 80.28435 154.64681
19.35000 -2425.72722 2.38680 24.07867 54.07046 34.68187 165.34036
19.45000 -2408.33229 0.05702 23.89221 37.85738 43.47276 161.16194
19.55000 -2398.33188 0.91706 42.82076 109.03623 113.60608 225.31676
19.65000 -2381.35660 4.71444 29.43771 41.53364 36.39060 146.50484
19.75000 -2367.23739 3.66081 47.50597 41.14697 39.78562 148.35934
19.85000 -2355.48315 4.12586 36.95160 45.52680 45.38765 145.12426
19.95000 -2338.15993 -0.58664 43.20621 259.76894 99.25985 199.23219
