0.05000 -3284.44001 123.82010 465050.87990 0.00000 0.00000 0.00000
0.15000 54.33854 1018.68557 1216781.76800 2545.59566 2849.90633 2122955.21088
0.25000 305.26055 -866.71490 -107565.40391 2124.08427 2935.81095 2428244.50502
0.35000 -427.51840 -70.41363 -223452.13337 2703.17777 2560.19974 2420287.48101
0.45000 -341.77007 -202.40516 134326.14729 2236.83335 3066.97957 1992539.56057
0.55000 -869.24878 130.09040 -61473.37103 2462.06730 2680.70882 840598.66862
0.65000 -1074.99793 -189.54302 83861.92083 2262.30339 2702.85640 3955145.24842
0.75000 -1017.51054 38.21572 -78589.44728 2220.03901 2839.18281 714454.24900
0.85000 -1030.41912 -63.93422 30790.68557 2124.38648 2847.26008 1715683.46234
0.95000 -1295.70209 -0.76482 57419.05862 1889.87648 2736.62919 1435434.84808
1.05000 -1673.55404 75.30971 7800.63691 1807.15094 2647.99525 2103154.39349
1.15000 -1858.92412 -34.86090 57011.43611 1722.26074 2567.46612 1680286.18643
1.25000 -2189.99908 6.35205 -93742.49518 1297.10094 2567.08538 1252956.64269
1.35000 -2570.28921 19.50462 19839.93342 1062.21479 2382.99837 1376139.34005
1.45000 -2867.96983 28.16010 -165887.82185 851.19232 2385.95818 1638057.39348
1.55000 -3052.25626 38.02140 -17264.99430 761.53602 2251.92177 913563.32155
1.65000 -3248.69303 -27.17414 -9795.99116 612.72635 2084.77144 1656106.31640
1.75000 -3433.85564 8.96930 69447.78132 672.92464 2023.02541 1663953.32538
1.85000 -3526.37862 -48.07274 -12959.48585 613.07659 1934.00616 1582694.02764
1.95000 -3667.04658 -19.42685 59748.76942 528.79927 1842.24001 1543306.18540
2.05000 -3718.74644 -0.24776 28318.75177 588.75196 1756.76382 1365932.72947
2.15000 -3802.08825 -70.47926 37735.50831 517.93752 1652.10542 1646829.62182
2.25000 -3818.91333 154.55300 35105.14273 525.46113 1581.83238 2143927.62577
2.35000 -3858.77287 48.85319 -25972.56837 410.52107 1508.65401 1942998.02649
2.45000 -3882.84065 29.50153 -1911.28393 534.40423 1429.69078 1857448.56839
2.55000 -3906.75590 -66.10324 -22546.12153 432.88114 1386.30506 1725512.93230
2.65000 -3930.27171 -44.85284 98165.85310 324.53189 1314.50428 2191241.49055
2.75000 -3940.20726 32.87060 6678.89354 486.98430 1268.71567 1716321.90962
2.85000 -3930.90549 -6.75414 63430.41657 390.71190 1229.78015 2181554.69663
2.95000 -3943.77967 -0.45992 -6214.45829 385.93988 1171.88395 2259099.85245
3.05000 -3949.59876 -3.27647 68269.04756 426.73348 1132.57026 2247461.63857
3.15000 -3948.35136 -39.92520 -82456.05424 316.59737 1091.98787 2421006.51645
3.25000 -3945.98807 -25.15613 30446.62345 328.86914 1057.73463 2129216.28782
3.35000 -3937.20038 -16.17079 7979.57513 355.23200 1036.45824 2122315.49283
3.45000 -3932.33386 30.13370 75454.03811 311.72822 971.82294 2250280.52576
3.55000 -3913.41721 -7.79006 -19479.30056 370.82487 969.67464 2074466.56375
3.65000 -3929.70725 -36.46811 -66160.49208 350.83631 929.21952 2132037.91041
3.75000 -3919.26077 17.05540 -83304.83685 340.01825 941.38554 2644395.56802
3.85000 -3916.29417 2.39183 -123920.07551 281.33358 901.09242 2916689.29502
3.95000 -3901.20760 8.18045 -70427.93930 329.50869 872.73643 2315270.24900
4.05000 -3883.59433 21.82095 30133.90493 405.41939 868.93008 2154194.47754
4.15000 -3880.60785 -27.07772 -6451.31057 285.92705 799.70077 2551537.69675
4.25000 -3849.33361 -5.30712 -40038.19281 294.71303 773.70040 2317822.72011
4.35000 -3850.37227 5.37091 -759.75661 330.86068 742.08704 2058838.61406
4.45000 -3824.47968 -16.76827 -26377.24099 289.93085 741.66264 2081744.30900
4.55000 -3823.83023 16.23330 2503.71507 294.45258 742.26228 2349677.11349
4.65000 -3805.38257 -6.92892 560.80580 291.53588 722.52289 2041644.13381
4.75000 -3787.42468 22.27419 -19901.21948 294.68865 676.87515 1969205.41175
4.85000 -3778.34998 23.60687 57876.81503 288.87554 670.25809 2062555.90767
4.95000 -3765.80811 12.26384 96906.05034 265.57506 657.91758 2707930.16875
5.05000 -3736.50007 7.80118 -27596.26666 278.81302 627.70010 2248547.51009
5.15000 -3740.25582 11.08510 60083.79644 230.43196 618.21773 2319225.14384
5.25000 -3721.79892 17.63691 12003.03560 269.92895 596.19163 1944657.56811
5.35000 -3706.88411 -17.77978 53966.12088 291.58762 596.15288 2285984.16232
5.45000 -3693.25704 3.98665 -10053.34944 265.71928 571.49641 2115117.55416
5.55000 -3682.88359 6.26197 7670.75576 276.25033 563.46846 2306086.20051
5.65000 -3660.97372 6.23584 -14783.97492 282.39787 538.68158 2181545.34419
5.75000 -3646.13251 -3.16679 -688.14868 247.85185 526.84507 2626907.39106
5.85000 -3634.96974 -2.59248 48443.25917 266.59074 513.09113 2080592.79552
5.95000 -3601.15949 -1.17437 -481.35333 236.51813 496.03783 2573268.81551
6.05000 -3590.69298 25.23260 -16357.84461 247.92641 518.49276 2469607.39655
6.15000 -3570.11719 -18.56378 29318.68747 248.63861 482.48984 2032956.04818
6.25000 -3545.99124 -18.73023 56142.67269 291.96921 485.18565 2010045.50396
6.35000 -3528.64274 21.77683 -42547.78010 239.01887 477.02382 2194990.41652
6.45000 -3521.34587 2.44652 61486.02800 235.40734 458.43906 2244252.54582
6.55000 -3499.45755 -15.83795 64758.79578 234.02933 457.97714 2400206.48688
6.65000 -3479.78995 14.69213 120233.37812 228.87123 436.39068 2760525.51904
6.75000 -3466.46738 2.13331 -28131.63619 194.86192 428.31239 1947751.30043
6.85000 -3452.09676 5.44298 63161.16216 213.58533 428.39796 2283149.95860
6.95000 -3427.91305 -6.43341 19954.00357 203.42693 407.00060 2300250.33424
7.05000 -3415.99360 -8.99451 -77217.08555 187.17166 409.00729 2288584.27096
7.15000 -3393.39462 -12.35559 -39215.44789 193.36368 407.91101 2441710.99989
7.25000 -3385.03597 -1.62035 28021.59633 232.07087 388.34551 1919959.66211
7.35000 -3365.27646 -12.07698 13508.25070 225.95333 405.58896 2219748.33608
7.45000 -3357.43585 -0.62880 11948.91287 172.97328 358.23435 2375966.31063
7.55000 -3335.63771 -7.27290 -12684.83525 195.46849 362.57332 2311376.76129
7.65000 -3314.80274 6.69396 -62259.93645 176.51845 359.16429 2351177.86350
7.75000 -3289.13032 -12.60115 20086.63606 245.66910 356.30639 2258391.88582
7.85000 -3275.95121 -0.15211 -102531.04377 187.81973 349.01237 2277182.03440
7.95000 -3260.36017 6.18056 -38522.09174 164.31528 342.06987 2241814.11172
8.05000 -3244.59401 -8.09215 71754.48048 174.17395 325.53687 2380835.90983
8.15000 -3229.97435 -13.28146 -14020.05234 190.04988 338.32083 2248858.80444
8.25000 -3219.06605 -8.35389 -94918.97021 173.55173 318.06393 2335091.78091
8.35000 -3194.07792 8.04324 -9419.70557 168.50108 316.92950 2183766.33086
8.45000 -3182.22409 1.64083 -13320.82998 160.40134 312.42834 2285113.06138
8.55000 -3163.05020 -3.74501 -17190.41186 173.93827 306.60983 2142026.00104
8.65000 -3145.78621 7.41860 -24263.92305 193.64295 306.56892 2251366.53191
8.75000 -3125.90649 -2.88732 31452.40248 190.73436 311.07940 2199039.52234
8.85000 -3113.39919 -2.31106 41424.95698 161.46834 292.32944 2064072.36665
8.95000 -3095.74175 -1.64279 -75241.76932 150.04232 281.72319 2092238.05902
9.05000 -3084.51078 -11.96903 38774.90993 178.33606 290.64254 2120095.77384
9.15000 -3064.96520 -10.11055 1372.50012 189.61057 288.35918 1994156.78745
9.25000 -3053.48113 0.56186 -28493.84853 146.70573 273.99969 2028412.16193
9.35000 -3038.70146 3.75883 -202.66271 178.03473 270.68400 2251740.97564
9.45000 -3019.41717 -0.88684 -56171.37632 158.41135 266.80422 2130276.28220
9.55000 -3007.18057 -3.24226 -62942.25604 189.59122 262.19249 2206682.42868
9.65000 -2992.02573 -0.07228 21391.64160 184.48482 267.75730 2250534.11506
9.75000 -2978.05426 -2.27864 -3338.97922 135.58490 243.42101 2147856.00984
9.85000 -2955.46183 -3.23905 61298.90645 161.40998 249.64110 2151578.29006
9.95000 -2945.88620 -1.57757 56567.00518 138.67716 261.45649 2083178.81716
10.05000 -2919.20280 2.07344 60627.99419 209.33013 252.19559 2206537.23453
10.15000 -2911.44702 2.02772 38848.03355 142.46225 235.80303 2044371.74038
10.25000 -2893.28700 -1.78394 9407.94763 133.50172 226.31673 2398111.19213
10.35000 -2881.22296 2.19109 798.41713 136.18266 235.03408 2058873.30143
10.45000 -2867.68405 8.05833 -49623.26589 134.94151 220.09317 2233540.50442
10.55000 -2848.20141 3.84761 -4041.04023 200.53454 235.79284 2161382.93580
10.65000 -2839.71079 3.26273 19752.57658 138.62077 216.45390 2425204.78967
10.75000 -2826.32024 -2.21311 -72791.26088 133.92630 210.83582 2160978.39128
10.85000 -2807.47597 -2.98052 -31650.32389 146.22345 215.63023 2315195.56147
10.95000 -2789.59787 -1.28226 -12633.99981 137.59852 209.91616 2149783.51392
11.05000 -2772.63797 2.79318 21553.71191 180.91598 213.76092 1958002.84102
11.15000 -2764.61483 2.04430 -12175.15689 126.98386 205.94054 2202858.00257
11.25000 -2750.33208 3.90517 15633.31343 124.52197 203.10988 2139427.00495
11.35000 -2732.08675 -0.86696 -22116.44204 125.87041 200.06072 2123808.41626
11.45000 -2717.54724 5.17221 36463.84733 126.94769 200.20508 2185831.13921
11.55000 -2703.51226 -5.01186 -80383.12860 125.48317 197.70147 2113058.68479
11.65000 -2692.64709 0.77066 -6955.85116 130.72246 205.95037 2011523.35736
11.75000 -2677.81786 -2.62612 -7613.55670 133.04952 189.06066 2086000.04592
11.85000 -2665.83830 -0.82634 1674.46844 128.15024 196.72506 2156639.28467
11.95000 -2651.09125 -1.35911 10159.36183 111.86506 178.62166 1943861.42143
12.05000 -2639.26220 -1.21239 -10358.33512 113.87307 186.47006 2425041.96733
12.15000 -2622.43565 -2.12135 19227.53368 172.19039 184.39731 2096366.23852
12.25000 -2610.05021 0.28492 49749.44570 158.80163 174.99764 2116026.53604
12.35000 -2596.46895 0.69589 46542.22461 112.31668 175.78618 2218284.40929
12.45000 -2583.65881 0.67239 14516.75485 108.55100 175.35844 2113009.55915
12.55000 -2571.94810 -1.42416 -69001.00029 110.94049 173.26421 2180717.08188
12.65000 -2557.82122 0.53039 -336.08891 113.30297 170.04426 1956417.00296
12.75000 -2541.97865 3.12879 -3219.08695 136.49627 179.20824 2231694.08713
12.85000 -2529.03906 1.59943 27354.84905 164.28315 177.95843 2206419.91068
12.95000 -2518.36075 7.43094 43253.99165 133.01618 173.58121 2115155.33530
13.05000 -2502.69737 -0.21766 -2762.18132 119.81868 155.43482 2134223.53868
13.15000 -2497.29011 2.26044 3494.78140 104.50768 157.03842 2137467.54503
13.25000 -2485.40679 0.78257 2285.86956 101.73597 157.13764 1935777.79623
13.35000 -2470.84295 -3.09041 -87081.51644 134.06758 159.01038 2396884.02231
13.45000 -2456.55215 -1.53648 -25297.04029 115.06368 167.18487 2362105.13368
13.55000 -2448.44133 -5.38260 36907.96751 106.90887 160.85598 1995565.94844
13.65000 -2434.54668 2.46142 3850.94517 99.54100 141.74511 2064796.03202
13.75000 -2420.81352 -3.81607 -18501.42780 101.47147 146.62357 1926659.14678
13.85000 -2413.39812 3.18032 -43498.00666 107.26151 143.07012 2036215.64450
13.95000 -2400.80688 1.36988 -27834.00269 104.24947 152.11702 2197373.55901
14.05000 -2387.84346 -2.22462 5375.15437 96.49044 141.03074 1856663.99970
14.15000 -2374.72173 -1.95607 -6687.20645 135.09824 144.23836 2143031.01586
14.25000 -2362.07744 -1.67064 -46066.28510 119.39820 139.30536 1902050.04550
14.35000 -2352.60192 0.83157 40316.82308 98.35473 146.83133 1947372.31368
14.45000 -2341.05531 -0.40664 -53578.12882 98.14177 149.79621 2205965.33486
14.55000 -2334.27880 4.53079 5648.23282 119.77715 144.76744 2055437.86807
14.65000 -2322.54626 0.61287 50912.46720 114.96678 147.26712 2115746.75551
14.75000 -2308.67382 -0.55336 7402.40581 101.51957 143.43370 2043068.45999
14.85000 -2295.18377 3.72383 55239.21076 158.25999 166.20868 1978189.59395
14.95000 -2290.40052 1.90084 31795.04243 102.06341 137.43188 2041556.57830
15.05000 -2277.57416 -2.08302 28986.14830 108.40941 130.89443 2191335.09391
15.15000 -2268.72282 0.36543 48242.19183 104.89794 137.94745 1980261.40254
15.25000 -2258.59004 0.91500 -26548.72372 94.83418 133.26197 2163938.48551
15.35000 -2246.54521 0.45664 -10359.98875 100.15952 130.58807 2119180.59179
15.45000 -2238.94035 1.16194 -119848.12014 85.50166 120.66075 1978015.78261
15.55000 -2229.22025 0.08221 7122.20295 84.51854 132.57603 1988436.13175
15.65000 -2214.59791 0.77434 -32047.37767 96.70322 127.41412 1811436.79423
15.75000 -2206.58888 0.81362 -13049.74779 84.26012 128.73102 2057074.48211
15.85000 -2196.03592 -0.36596 -42520.84784 95.87460 138.16845 2028435.42301
15.95000 -2181.97353 4.44262 -14375.18363 98.31964 122.28217 1847632.13955
16.05000 -2175.43520 -3.16744 39321.28342 110.72983 127.93802 1818080.23365
16.15000 -2168.08780 2.93932 1312.73786 85.32423 133.13200 1890757.83071
16.25000 -2155.20312 -2.94116 23.25097 128.91391 130.69976 2054068.90838
16.35000 -2147.09994 1.40104 -14373.93228 84.75379 120.87548 2127046.18612
16.45000 -2137.41362 -0.06959 15590.82882 150.96143 138.16769 1748743.12300
16.55000 -2126.65431 3.16356 42747.42968 81.61789 106.45251 1901475.71027
16.65000 -2113.71283 -2.78282 -38851.54996 87.86404 109.42357 1748230.97345
16.75000 -2107.75125 -1.00114 -90992.31826 122.25759 116.53271 1908904.82224
16.85000 -2097.45137 -0.06006 -33953.06171 86.54247 108.81753 2069019.89281
16.95000 -2088.05982 0.03151 -24043.70200 74.61058 116.77984 2104459.99999
17.05000 -2075.90016 1.10300 -59693.70438 97.29846 123.40448 1987822.24625
17.15000 -2065.75918 -0.73283 -39926.24211 97.24751 119.67292 1892642.52584
17.25000 -2063.57861 0.19656 17443.23484 80.56030 102.84613 1873759.50706
17.35000 -2053.57233 -0.45764 -68039.27359 83.27384 97.71968 1816730.59843
17.45000 -2041.26315 2.45547 47288.94318 72.36083 100.89638 1778405.99057
17.55000 -2031.55089 -0.10920 59958.90833 73.47684 97.11736 1818928.09474
17.65000 -2021.76940 0.64610 -12438.58104 82.23038 107.93463 1934267.33290
17.75000 -2009.33007 -4.49869 -29110.98496 106.57211 150.68232 1739518.44925
17.85000 -2002.80108 0.00685 67683.91015 145.06713 122.24804 1825335.80786
17.95000 -1996.29364 -0.28570 83025.63733 74.01291 97.83572 1976339.81278
18.05000 -1988.23768 -1.85879 32223.20582 76.25757 101.88919 1945403.40067
18.15000 -1981.71333 -1.53163 15739.01138 75.66742 97.41224 1903500.82660
18.25000 -1970.59916 -2.62070 14277.48075 74.04745 95.58725 1728573.96023
18.35000 -1963.65209 -2.32190 21695.71102 88.09805 108.69291 1928728.85552
18.45000 -1956.73308 1.97852 -40229.49510 69.16544 92.08191 1692553.08741
18.55000 -1945.64680 -1.39899 34119.57837 68.78239 88.28440 1875922.66398
18.65000 -1935.76665 -0.37604 -40380.37273 70.14326 87.20233 1751475.39396
18.75000 -1927.53913 -0.75168 33087.35011 97.64011 92.45663 1980285.62319
18.85000 -1917.99764 -3.35679 -17837.55636 98.75960 97.00282 1781806.75351
18.95000 -1910.23942 -0.38810 -1688.11200 98.60521 88.66156 1803156.40673
19.05000 -1901.62651 0.03008 -20575.64233 75.51251 86.46446 1694841.48381
19.15000 -1895.82516 2.35223 -16131.37411 76.30525 91.94423 1705603.85263
19.25000 -1889.81580 0.64037 -36432.01344 73.13777 95.95766 1706043.69122
19.35000 -1879.22275 0.57204 -14833.18941 69.27567 98.04798 1768241.75121
19.45000 -1871.84009 -0.13363 -11802.94998 67.91125 91.21786 1877472.08285
19.55000 -1860.30377 1.41336 -80743.12471 94.05803 97.50182 1988586.05763
19.65000 -1857.18080 0.16130 -26804.64339 72.74576 87.95746 1838144.35834
19.75000 -1846.87245 1.74387 -18702.74191 72.93304 100.74241 1714040.77270
19.85000 -1840.70590 -0.10755 4133.48124 78.30592 96.92103 1650758.04494
19.95000 -1830.78717 -1.46687 -3842.28681 66.69518 80.33387 1976769.10571
