0.120000 -2.791030
0.380000 0.684100
0.620000 0.063650
0.880000 -0.121340
1.120000 0.002140
1.380000 -0.229670
1.620000 -0.300500
1.880000 -0.178240
2.120000 -0.200170
2.380000 -0.221670
2.620000 -0.188170
2.880000 -0.233030
3.120000 -0.319950
3.380000 -0.290230
3.620000 -0.244350
3.880000 -0.204690
4.120000 -0.146000
4.380000 -0.266140
4.620000 -0.193700
4.880000 -0.438720
5.120000 -0.548620
5.380000 -0.353350
5.620000 -0.905650
5.880000 -1.338570
6.120000 -1.394080
6.380000 -1.253360
6.620000 -1.429350
6.880000 -1.287180
7.120000 -1.152740
7.380000 -0.942370
7.620000 -1.197480
7.880000 -1.212670
8.120000 -1.801220
8.380000 -1.137300
8.620000 -0.694110
8.880000 0.844420
9.120000 -1.665880
9.380000 -2.178180
9.620000 -1.700190
9.880000 -2.136620
10.120000 -2.473680
10.380000 -1.667760
10.620000 -2.345920
10.880000 -2.513980
11.120000 -1.978350
11.380000 -2.555410
11.620000 -2.612490
11.880000 -2.987630
12.120000 2.902540
12.380000 3.019520
12.620000 -2.740010
12.880000 1.132480
13.120000 0.130110
13.380000 0.883710
13.620000 1.912830
13.880000 1.987010
14.120000 1.630030
14.380000 0.547440
14.620000 -0.154240
14.880000 -2.094360
