0.05000 -1251.58140 220.02101 -42.46227 1326.70517 1175.05087 1046.34633
0.15000 -2059.45899 27.66286 429.44813 1343.09807 1244.45489 2256.07207
0.25000 -2526.09479 20.37925 667.70046 1546.30988 1252.84592 3664.07341
0.35000 -3532.62200 35.08986 104.52536 1487.10562 1286.05787 4522.32063
0.45000 -4077.71725 31.31759 43.28361 1492.53901 1107.59076 4904.88554
0.55000 -4148.89519 78.58728 -93.76963 1432.37683 914.47529 5392.33711
0.65000 -4447.19733 29.95194 -99.00133 1410.18731 880.36247 5561.08415
0.75000 -4637.70533 27.56000 7.16908 1457.19818 858.87317 5892.21182
0.85000 -4917.49181 77.47622 62.50057 1401.96135 739.60094 5957.13199
0.95000 -5182.87331 71.40384 145.51438 1404.20245 778.13168 6044.92238
1.05000 -5312.49008 58.98071 115.46636 1377.62065 722.48892 6093.24112
1.15000 -5522.03621 63.71629 2.97873 1309.27523 638.45168 5949.25865
1.25000 -5629.85222 78.76016 148.45698 1276.84868 626.39909 5985.49605
1.35000 -5748.58485 64.32015 -72.46945 1235.08867 606.80284 5880.96765
1.45000 -5862.02043 61.64265 -13.27061 1216.70658 579.53000 5795.15637
1.55000 -5993.29986 64.69842 -24.84991 1204.67240 574.12372 5668.59588
1.65000 -6133.68119 69.94370 155.96175 1190.42412 541.18069 5527.16421
1.75000 -6172.50086 70.46136 145.36144 1127.88120 552.82927 5474.11971
1.85000 -6251.04745 61.36171 25.92927 1066.18570 526.97644 5341.16512
1.95000 -6348.91518 59.25958 29.42013 1026.61413 533.96223 5113.75879
2.05000 -6443.74155 58.94912 65.31902 970.38951 505.39727 5009.79228
2.15000 -6502.92758 66.90704 41.81416 1015.47653 536.58738 4930.06991
2.25000 -6553.48394 60.60831 -84.41070 985.64346 475.30776 4783.68401
2.35000 -6599.99972 60.27825 40.81210 926.15033 474.93941 4688.63128
2.45000 -6667.51521 63.51935 98.11776 907.94538 456.25818 4562.75939
2.55000 -6707.36869 54.94023 21.92743 869.09314 460.83856 4516.61985
2.65000 -6748.19350 59.40848 56.20577 823.29215 452.80112 4370.61351
2.75000 -6790.22456 54.27415 56.09435 825.30861 446.05297 4310.15191
2.85000 -6842.65251 44.13217 22.00977 769.01380 443.93762 4198.90413
2.95000 -6909.62436 47.00239 58.84396 768.84203 440.76751 4031.51910
3.05000 -6950.14854 52.70515 -67.43301 735.01775 426.64158 3962.93021
3.15000 -6955.94844 52.82466 50.33193 731.21594 419.61101 3884.30938
3.25000 -6953.62148 50.30868 -20.13140 704.58429 409.95903 3787.49887
3.35000 -6952.62772 53.12848 -35.10104 688.50633 407.63478 3725.52622
3.45000 -6964.32695 50.20352 10.65323 645.02615 386.69918 3593.20283
3.55000 -6962.48324 50.52936 38.00768 662.79004 395.85318 3523.76487
3.65000 -6982.87355 54.79974 58.22828 628.03754 382.72482 3426.73877
3.75000 -6962.61355 51.16781 57.71490 618.59059 365.90299 3347.62192
3.85000 -6927.58442 47.80620 -35.10890 612.18571 361.72650 3269.21372
3.95000 -6880.27353 56.45571 -45.32426 598.98935 338.26559 3213.56910
4.05000 -6851.95621 48.88526 -10.83816 570.32274 318.18730 3083.12458
4.15000 -6830.67548 50.81226 3.45636 574.69635 316.26303 3031.19443
4.25000 -6791.88780 53.37555 52.72644 527.91441 312.54677 2934.04767
4.35000 -6769.68344 43.83028 -50.34744 522.51263 296.89921 2852.76640
4.45000 -6735.40449 47.96186 -33.86565 497.74976 303.38614 2775.55160
4.55000 -6680.78953 51.88907 -117.73053 504.25281 295.35278 2722.71993
4.65000 -6641.92523 41.24502 0.94656 489.40283 280.94948 2682.56915
4.75000 -6610.83682 45.04898 7.20441 487.84151 281.61701 2617.20804
4.85000 -6575.39910 40.44659 -42.61283 483.46473 302.31832 2534.47083
4.95000 -6552.50388 43.56984 -59.98873 439.30774 261.30163 2458.28012
5.05000 -6504.92182 39.61593 -23.49953 434.43557 259.44035 2419.66691
5.15000 -6468.35628 34.02568 0.10934 416.22471 285.11573 2358.71277
5.25000 -6426.39842 32.20789 2.87802 413.74078 260.71132 2310.62651
5.35000 -6381.44314 45.02361 11.28872 403.34824 269.22031 2270.13376
5.45000 -6342.20938 42.69078 -0.58765 405.81610 241.05742 2211.51381
5.55000 -6298.95506 36.13314 25.63104 379.12255 252.37195 2159.06094
5.65000 -6256.48967 35.10983 -59.32507 370.65039 245.51139 2113.78704
5.75000 -6215.02235 36.75055 -47.78872 362.04519 229.13709 2059.38490
5.85000 -6170.16960 36.68607 -14.89042 360.65640 227.82508 2024.47762
5.95000 -6120.95242 33.49206 22.35661 355.48164 247.29481 1969.45337
6.05000 -6079.60700 33.78467 -1.99780 358.28631 238.45332 1929.58365
6.15000 -6035.02260 29.77208 7.87068 360.44700 242.09583 1895.81215
6.25000 -5986.15318 29.96369 -24.35111 330.33696 229.54617 1840.95471
6.35000 -5951.54772 32.64379 31.99681 318.62830 242.69012 1805.42484
6.45000 -5912.65610 31.41968 -10.19114 292.67281 209.70534 1766.13381
6.55000 -5859.95714 27.57612 10.49919 324.36284 220.02858 1744.03667
6.65000 -5817.21359 28.88864 41.27618 306.79486 204.09781 1687.40411
6.75000 -5772.87754 31.66198 4.71061 303.23883 217.39809 1668.91764
6.85000 -5736.02861 28.01376 3.39279 328.23798 214.95062 1639.10934
6.95000 -5696.30694 26.41336 21.03860 300.57790 198.80934 1577.57881
7.05000 -5663.59067 27.93834 -1.63323 291.93989 214.46813 1534.50523
7.15000 -5620.43245 28.49530 -19.39608 276.63719 235.77441 1532.56863
7.25000 -5582.99588 33.15530 -1.97294 279.09549 203.32704 1506.93095
7.35000 -5552.60022 25.04643 -36.86205 269.57530 188.92758 1453.38724
7.45000 -5510.39410 28.01729 -39.95029 267.87621 187.91443 1426.99070
7.55000 -5475.63651 23.39827 -18.21472 259.12527 200.06432 1414.21735
7.65000 -5440.51533 28.30540 -31.71333 254.89897 191.90507 1370.74829
7.75000 -5385.35272 20.49481 -30.06052 252.71338 222.84664 1334.60191
7.85000 -5350.47918 21.88932 -23.01849 257.91672 176.13280 1309.22086
7.95000 -5316.77001 25.28750 -23.20122 246.22218 212.99093 1278.32956
8.05000 -5271.71738 20.31938 -21.92156 261.53350 193.72467 1261.97536
8.15000 -5234.17976 25.45497 4.92297 235.34945 188.54419 1223.14534
8.25000 -5196.07839 20.03826 -21.89578 236.36684 176.84388 1200.51825
8.35000 -5153.20158 18.58749 -7.66878 227.56288 200.44661 1179.12872
8.45000 -5117.36287 18.07449 -33.05190 223.48593 195.28248 1158.64179
8.55000 -5083.97722 24.81896 -35.66473 226.54594 180.46830 1131.91324
8.65000 -5046.00011 20.94054 0.23862 200.91711 143.61146 1093.03534
8.75000 -5009.64359 19.18665 -53.14759 212.50350 170.49190 1075.80806
8.85000 -4963.86420 21.32856 -66.94950 225.22505 172.23929 1059.24128
8.95000 -4931.34093 19.56475 -24.00650 230.71036 173.75158 1049.52705
9.05000 -4905.48209 17.40184 -12.06121 194.34061 151.93993 1004.80467
9.15000 -4866.99067 22.88125 -19.71737 202.85844 171.98561 995.18839
9.25000 -4821.92362 20.67865 -23.66333 238.75422 181.04197 985.35545
9.35000 -4793.07636 18.26038 1.35065 191.70057 163.33938 944.83402
9.45000 -4751.32287 17.21692 -18.23590 231.51689 165.67868 940.92665
9.55000 -4713.99809 19.61942 -38.46259 205.97830 137.62595 914.52052
9.65000 -4681.77473 22.78885 -23.23621 176.35187 144.56451 893.21272
9.75000 -4649.38590 20.27584 -10.09638 168.89179 150.91718 871.21475
9.85000 -4596.79962 16.82802 1.26493 188.21606 141.09772 861.96562
9.95000 -4569.48090 16.16805 -9.07559 205.83288 150.95365 850.90455
10.05000 -4526.39867 18.06538 -20.22150 176.63390 142.75731 829.08262
10.15000 -4496.72693 23.32662 -18.16287 204.82364 172.90857 801.46909
10.25000 -4455.36711 17.35792 3.44070 146.25188 122.56134 790.00566
10.35000 -4419.81394 17.00669 -8.36182 169.73371 154.55786 777.75827
10.45000 -4385.73304 17.58725 -7.74720 155.15437 138.55607 762.48006
10.55000 -4340.53181 18.29898 27.07091 192.20921 166.80433 752.20046
10.65000 -4309.90893 14.79156 4.98550 177.87491 127.38432 723.94363
10.75000 -4277.39095 12.64718 -18.19633 167.18474 175.78035 727.14107
10.85000 -4240.36689 14.61429 16.79442 205.72864 144.40744 710.04558
10.95000 -4215.30869 12.16457 -16.49166 171.83163 126.90923 670.62556
11.05000 -4181.60482 16.52415 -3.12304 126.30518 111.98458 683.06523
11.15000 -4146.57788 11.75435 -17.36101 161.99615 137.20313 678.82157
11.25000 -4123.73182 13.78968 1.00109 160.21835 115.26530 641.95074
11.35000 -4094.46485 15.83870 -21.41306 155.79020 122.98114 643.24404
11.45000 -4063.50617 12.71035 -1.51490 163.56466 159.47469 625.52572
11.55000 -4033.03649 10.85230 0.80953 126.92367 110.96099 621.91748
11.65000 -4005.81238 15.46518 -8.37246 149.24690 135.65894 607.86360
11.75000 -3976.95269 13.57555 -2.39390 158.59924 153.32379 583.37014
11.85000 -3948.32638 15.22693 2.81177 139.31760 114.09859 593.79715
11.95000 -3920.75509 14.18953 -7.44440 149.07474 113.94155 577.40144
12.05000 -3897.41055 16.06831 -8.69804 139.94183 133.61227 557.59369
12.15000 -3867.01043 14.62715 -16.11800 156.33249 123.12848 559.19665
12.25000 -3846.79011 12.89635 3.66731 148.82567 96.97569 534.62351
12.35000 -3818.96837 13.43390 -22.02851 144.49920 137.29997 523.29555
12.45000 -3792.41345 13.08610 -9.75326 138.32604 125.52820 528.31449
12.55000 -3770.94487 12.83609 -1.60192 124.56976 90.39933 518.50130
12.65000 -3750.95702 15.41178 -17.99788 127.68452 112.97305 504.67666
12.75000 -3725.20560 11.05675 -2.88931 124.39694 106.70599 504.67757
12.85000 -3705.35073 18.66342 -2.22968 119.46872 116.97697 479.37163
12.95000 -3684.56187 14.95177 0.87653 114.19445 130.98459 471.90631
13.05000 -3658.53183 15.91080 -3.97061 108.21532 95.00496 458.66648
13.15000 -3632.78869 18.52156 3.28860 175.07797 150.38255 443.94505
13.25000 -3611.58786 20.76633 -0.87207 126.49270 85.24320 447.78740
13.35000 -3582.03956 17.04430 -18.98286 108.32818 83.28734 439.61690
13.45000 -3557.89864 18.82083 -12.39165 129.57780 92.21376 432.32039
13.55000 -3527.75268 19.76115 -19.33598 94.28630 85.63307 416.97788
13.65000 -3500.38278 12.36828 -17.12883 117.47892 157.49913 426.56501
13.75000 -3483.96492 15.51961 -11.80459 104.71652 93.14609 407.72529
13.85000 -3449.54417 19.53315 1.67257 101.12905 83.72236 401.31425
13.95000 -3424.09056 21.32079 -20.76966 119.45271 89.19410 414.14776
14.05000 -3401.64885 18.19220 -2.23977 96.76932 80.42737 384.64683
14.15000 -3371.18219 15.11351 -1.45316 92.15889 88.44234 372.86958
14.25000 -3342.70219 15.99358 -7.74737 92.27159 75.85051 377.06633
14.35000 -3317.30385 17.52819 -17.95945 92.24125 80.42156 359.82601
14.45000 -3295.53122 16.20935 -18.27155 145.33661 79.34017 360.92079
14.55000 -3268.51301 16.93539 -8.75203 101.64704 78.80945 355.89853
14.65000 -3243.03375 13.94064 -14.44375 80.24871 74.58220 337.42050
14.75000 -3218.87507 17.89142 0.69154 124.92655 102.49728 350.66153
14.85000 -3202.48285 17.94259 -8.31517 74.43931 79.63711 319.42063
14.95000 -3178.17756 13.62356 -9.82409 73.17020 65.55863 329.99927
15.05000 -3154.70696 19.77134 2.89719 107.80659 106.03773 317.07641
15.15000 -3134.52179 15.62434 -11.23772 80.04684 71.79788 313.14904
15.25000 -3111.93053 15.91466 12.34342 150.87877 77.28343 311.66790
15.35000 -3095.18633 15.89631 -5.89251 86.97146 69.24337 298.20588
15.45000 -3074.61969 16.45302 -1.09607 69.64445 75.70734 294.44420
15.55000 -3059.11546 13.81961 0.55100 66.43354 79.14310 293.72966
15.65000 -3036.46045 14.27391 11.06239 79.44361 64.04990 285.59328
15.75000 -3019.01074 14.11016 -8.70277 68.57066 74.84498 282.78742
15.85000 -3002.86001 14.52648 4.51438 63.97849 107.87729 275.08737
15.95000 -2983.02197 13.18490 4.34227 67.05828 95.81843 272.30356
16.05000 -2961.01737 12.63486 6.61653 76.21770 62.75468 267.47795
16.15000 -2944.69815 12.69355 0.88369 66.27748 63.33452 259.43375
16.25000 -2924.66452 14.91695 3.77134 63.97914 70.61790 271.52313
16.35000 -2905.74591 13.98200 -10.95994 65.05621 56.34897 259.35040
16.45000 -2892.12647 14.50579 -5.09778 69.74667 66.90801 245.31941
16.55000 -2867.75759 15.14332 3.56094 71.26210 48.59845 247.10826
16.65000 -2853.13326 13.02992 -5.44480 70.29480 87.57237 249.65413
16.75000 -2833.79196 12.95154 3.86329 60.13073 60.35686 239.61968
16.85000 -2813.42099 13.08113 8.76135 79.96461 86.09071 239.02894
16.95000 -2797.76779 11.56447 -3.12582 67.15713 48.64684 227.93817
17.05000 -2778.09835 13.57243 -5.84424 48.17188 46.94112 228.13829
17.15000 -2759.26650 11.53052 -10.29308 51.67352 48.70092 230.68079
17.25000 -2743.05010 11.59838 -2.61446 64.48817 61.72158 229.39461
17.35000 -2724.94060 9.76663 -14.27810 58.32608 61.97866 216.40621
17.45000 -2705.47158 12.47913 -8.17573 54.82721 48.23583 212.10508
17.55000 -2682.88965 15.27553 -18.10527 98.35178 94.43158 221.37931
17.65000 -2670.33631 11.00365 -10.18637 44.17965 54.32977 211.16525
17.75000 -2650.94921 10.63839 0.82159 55.95388 58.12927 205.37332
17.85000 -2633.68914 10.44198 3.33771 53.81268 54.99755 196.90843
17.95000 -2618.33197 10.79883 -21.06772 57.26700 64.56725 201.73004
18.05000 -2601.88769 8.35257 -13.20067 59.43272 50.64086 189.65461
18.15000 -2586.32413 11.57760 0.72420 41.96411 56.02945 188.17190
18.25000 -2565.91643 10.81317 0.04154 46.62344 36.39792 183.78777
18.35000 -2546.56349 9.71479 -3.99533 49.10245 52.02914 182.67650
18.45000 -2534.44418 9.95959 1.59307 47.16382 59.85509 187.45369
18.55000 -2520.66956 9.70311 -2.94180 88.69525 40.60018 172.27465
18.65000 -2503.80343 7.98426 8.56656 56.64286 41.79899 166.38097
18.75000 -2488.99617 10.96998 -14.90629 52.47813 44.00749 169.65401
18.85000 -2479.94322 10.53478 -3.76107 77.36971 48.65683 179.59277
18.95000 -2458.00191 9.83674 -9.98296 55.83201 61.70031 166.84378
19.05000 -2450.31607 6.45256 -3.98223 65.43207 73.52138 163.16443
19.15000 -2434.52449 6.37180 -9.23613 44.28228 45.82266 162.49407
19.25000 -2422.83827 5.52910 5.03639 57.70642 82.14650 173.77412
19.35000 -2406.90426 10.44814 -6.27014 49.08331 48.26778 155.95645
19.45000 -2397.00123 9.70852 -0.75383 44.18199 41.61371 149.82972
19.55000 -2382.72667 6.57556 3.27638 55.50340 42.44503 147.90527
19.65000 -2370.72668 12.58894 -7.35717 45.08180 73.52369 150.97312
19.75000 -2360.43395 7.46653 -2.77687 74.29407 64.24907 154.75535
19.85000 -2343.40698 9.75661 -3.33563 38.86002 32.68563 137.08139
19.95000 -2329.85628 7.09791 -7.63425 84.74219 47.23403 148.70458
