0.05000 -1418.75727 -79.28546 -560.01957 1351.97297 1449.95798 2345.79741
0.15000 -2053.07217 54.81519 -416.23532 1375.81881 1209.52305 3134.00881
0.25000 -3166.30119 38.08108 -316.21548 1482.92093 1123.16268 4489.22105
0.35000 -4048.97617 39.75849 -191.93415 1589.10965 1098.75858 5413.70874
0.45000 -4942.24897 67.62815 120.33215 1816.53543 1055.10157 6107.15420
0.55000 -5532.72727 49.00067 242.24705 1826.45072 1017.63306 6660.43798
0.65000 -5937.93103 70.67195 -22.99866 1817.72871 953.53805 7108.80080
0.75000 -6297.11200 92.13432 -154.49532 1756.09956 987.48804 7094.51319
0.85000 -6545.34244 65.01907 -165.53015 1758.27867 973.09300 7164.20993
0.95000 -6716.11779 96.99810 -126.42326 1754.22195 993.39874 7091.72843
1.05000 -6830.81421 79.13417 41.48480 1725.22346 1015.80930 7096.77812
1.15000 -7006.44148 85.79878 -51.10535 1676.20174 1058.56771 6844.11139
1.25000 -7179.24511 92.15862 -32.73691 1595.64451 1052.51023 6659.34685
1.35000 -7236.45145 71.45769 -23.24984 1507.86027 1048.26032 6575.53354
1.45000 -7284.86447 92.74145 176.66235 1458.05962 1073.30630 6368.36275
1.55000 -7380.44986 70.26450 55.12542 1375.28515 1048.75854 6154.08710
1.65000 -7379.94285 59.67409 21.87970 1316.30181 1040.93031 6036.98516
1.75000 -7440.06554 77.67867 -1.21050 1239.71608 1045.96040 5816.07778
1.85000 -7487.55273 79.31772 35.90767 1194.25664 1046.05699 5647.12081
1.95000 -7544.08754 61.54656 -26.40180 1123.89083 1036.44251 5475.33603
2.05000 -7573.71356 50.93491 50.65911 1020.22718 1005.26750 5248.73965
2.15000 -7572.81561 52.87700 14.29024 1016.46174 992.37740 5159.45358
2.25000 -7594.14830 54.50266 70.88978 960.81780 978.25508 4995.82625
2.35000 -7589.80173 37.87591 113.84554 905.29346 942.25115 4835.82964
2.45000 -7599.93090 32.94521 50.91524 838.47016 913.63319 4682.44925
2.55000 -7591.86443 61.93731 -91.52000 805.20657 894.52353 4562.77774
2.65000 -7602.03955 34.73035 34.89012 786.69237 884.08988 4427.40579
2.75000 -7614.48357 45.49915 -25.57473 791.66964 847.84077 4304.11787
2.85000 -7606.59884 42.11080 28.84617 765.60616 799.10851 4167.80273
2.95000 -7587.41136 31.49401 -33.86996 737.11633 788.79551 4046.35144
3.05000 -7578.82006 51.77412 -99.82347 747.45951 755.71201 3917.55127
3.15000 -7564.68452 60.98662 34.03033 704.54624 730.18661 3820.22608
3.25000 -7537.65295 49.46723 -53.24689 681.01587 688.90102 3684.51630
3.35000 -7493.32263 47.98830 -17.94693 706.09702 668.41854 3621.86036
3.45000 -7474.98882 44.40177 -85.74958 676.35167 653.65867 3469.94522
3.55000 -7456.17332 62.51953 -12.62524 648.07955 608.79575 3363.53996
3.65000 -7428.86268 44.88724 -37.10320 636.80869 581.24209 3276.58533
3.75000 -7361.80621 53.18643 -87.61661 631.85755 567.61492 3209.61635
3.85000 -7337.02729 64.61666 -102.08062 607.11759 527.08492 3103.02554
3.95000 -7290.10889 63.78963 -65.67688 590.55814 513.29653 2995.18145
4.05000 -7229.71127 57.06684 -49.52291 588.60945 479.11107 2933.41449
4.15000 -7172.89998 50.07060 -33.42159 562.89526 460.76790 2817.04000
4.25000 -7128.08553 51.09410 -33.35031 562.67684 450.13327 2774.85630
4.35000 -7083.16135 48.42842 -24.22248 539.70345 419.74589 2672.41716
4.45000 -7020.32926 51.35440 -14.15987 548.73011 411.89477 2604.47348
4.55000 -6968.30845 52.24465 -20.99998 557.25213 398.99145 2553.71583
4.65000 -6916.78849 53.78150 -32.51405 512.83616 374.30412 2458.08190
4.75000 -6857.48527 51.58099 0.26594 491.39755 359.87017 2382.08541
4.85000 -6800.67288 43.66684 -34.97224 495.46290 352.68760 2331.53560
4.95000 -6767.01874 40.12606 -27.81354 467.08156 329.23326 2268.15244
5.05000 -6723.63694 43.17064 10.62642 474.64328 340.94078 2211.14158
5.15000 -6676.95078 38.06217 14.32216 450.31927 313.86185 2154.02736
5.25000 -6624.59355 45.30840 -8.13299 448.54695 298.59189 2100.34548
5.35000 -6570.34613 42.28727 -6.71185 430.83513 299.45504 2047.41701
5.45000 -6513.16003 42.95984 -2.79850 424.60468 282.89630 1992.92518
5.55000 -6457.38794 44.10259 -17.61967 400.66425 277.34593 1943.07456
5.65000 -6399.10131 35.50802 38.16156 384.26832 270.10786 1903.53409
5.75000 -6356.33702 39.37196 23.07658 359.44931 261.96150 1845.45924
5.85000 -6310.37459 36.49794 47.86724 364.73530 262.06474 1775.80848
5.95000 -6255.94191 38.15578 -15.58795 344.67313 253.14983 1754.32602
6.05000 -6213.41343 35.86270 43.61902 340.97160 248.53507 1708.89388
6.15000 -6151.97014 34.70440 34.54762 324.17608 247.47169 1671.23376
6.25000 -6114.84480 33.26760 46.50946 345.50524 242.05528 1616.24773
6.35000 -6066.91244 33.90986 17.22342 323.54992 243.42521 1596.09232
6.45000 -6025.89571 30.32503 44.90420 304.23933 217.31398 1536.89739
6.55000 -5980.10974 32.80194 25.64073 298.56340 215.04854 1533.61190
6.65000 -5926.20648 28.43664 18.23813 283.77960 227.23660 1470.73943
6.75000 -5880.53614 34.05854 40.32611 271.96904 197.99371 1434.64197
6.85000 -5836.76841 31.20375 34.50334 273.68685 207.61865 1402.58318
6.95000 -5794.44499 28.69696 18.17398 288.59306 221.90156 1388.34682
7.05000 -5751.73466 26.59036 31.82602 273.97118 201.22512 1341.93101
7.15000 -5706.44672 26.21082 43.18882 257.43525 224.98746 1313.39775
7.25000 -5666.56519 28.53567 4.52692 273.45666 212.59404 1279.31107
7.35000 -5613.69531 24.16774 19.90148 279.61866 195.42825 1250.96779
7.45000 -5575.57493 27.90059 40.54429 260.29839 187.83618 1233.68523
7.55000 -5528.37672 26.25408 -7.81806 250.65617 208.63169 1184.75018
7.65000 -5485.85141 25.81017 12.91121 241.33766 195.36719 1155.11468
7.75000 -5446.88390 23.16004 17.80459 216.05258 186.28880 1128.82815
7.85000 -5392.92695 21.30557 -17.81294 216.31367 176.83588 1114.70352
7.95000 -5344.68660 24.47759 1.84259 225.77942 174.60133 1082.44906
8.05000 -5306.05758 22.07449 22.05606 218.23410 172.92483 1041.72197
8.15000 -5265.30700 23.24745 13.23077 219.92127 185.74491 1024.52859
8.25000 -5222.44197 22.75245 3.74630 213.44649 183.78316 1002.32913
8.35000 -5163.46536 20.11574 0.68687 211.03731 186.66449 990.24051
8.45000 -5123.10009 20.68692 4.34731 198.72894 168.88141 945.85305
8.55000 -5080.88552 25.47762 0.87214 197.65839 176.89148 935.77227
8.65000 -5038.66144 20.94467 -2.36682 217.31090 182.68502 914.15313
8.75000 -4991.30854 18.88634 -1.94602 220.42004 165.82020 891.43325
8.85000 -4955.01023 15.75476 2.21811 228.63408 177.06422 855.18708
8.95000 -4901.90830 23.52560 -3.21872 202.89123 145.53157 839.27797
9.05000 -4858.43549 19.79184 -6.79199 180.17569 174.26260 820.94457
9.15000 -4813.93056 26.87923 -13.74023 212.12025 167.57515 794.80494
9.25000 -4770.94226 17.71971 -33.13752 174.84168 139.81814 781.19021
9.35000 -4726.92647 18.89317 -18.83792 202.07253 146.05284 766.04243
9.45000 -4673.50261 17.74790 -33.36846 227.82946 160.41270 758.88315
9.55000 -4635.62945 20.11343 -10.07741 197.95721 175.98484 745.00405
9.65000 -4598.72939 14.73785 -19.68065 159.52224 127.63120 710.10162
9.75000 -4557.77156 17.98587 8.24236 178.05403 127.62886 697.14635
9.85000 -4513.86245 14.15763 6.94485 180.74900 157.56311 684.25582
9.95000 -4473.97602 18.15148 11.32357 176.66762 133.19769 667.83844
10.05000 -4439.75295 15.04879 -13.47789 179.50955 174.96917 658.08028
10.15000 -4404.14793 17.35072 -14.49343 149.57937 159.44118 643.32465
10.25000 -4359.43846 12.39996 -19.15832 161.67395 116.40311 615.60218
10.35000 -4326.96301 16.60222 -26.36863 191.63552 134.04103 616.16005
10.45000 -4288.64520 14.48973 10.79274 134.47163 119.29447 602.05545
10.55000 -4260.07536 20.21825 -13.09024 152.18189 147.01216 579.81190
10.65000 -4214.67789 10.23044 4.77965 219.53136 115.52672 577.63722
10.75000 -4186.29882 13.27863 -7.61863 126.28757 122.00538 560.88204
10.85000 -4159.44030 17.91320 12.70205 118.96916 107.84138 546.24295
10.95000 -4120.49151 16.62353 4.24366 162.38048 121.12286 539.13552
11.05000 -4089.23474 14.95269 4.31176 164.05878 138.32979 533.32392
11.15000 -4051.30458 18.66216 -2.39802 183.45477 106.42978 530.29044
11.25000 -4022.64621 17.05438 -12.56776 137.03870 118.92299 497.88575
11.35000 -3990.39913 13.97846 9.33771 145.90546 103.97883 511.66299
11.45000 -3962.86187 14.53514 -16.29724 181.40301 113.60309 482.55539
11.55000 -3932.65289 14.69275 10.75388 133.01345 128.23197 469.04622
11.65000 -3899.10803 15.30183 6.69400 150.89918 126.89906 465.38433
11.75000 -3870.76420 14.21789 27.23894 130.11641 114.99965 470.27298
11.85000 -3842.68005 13.15242 3.25128 104.33213 100.22369 440.89722
11.95000 -3810.69244 9.52894 10.17559 132.72569 135.25098 436.91852
12.05000 -3787.73270 15.46103 10.87819 101.04426 126.48962 427.05878
12.15000 -3759.72279 17.99190 23.97656 148.37155 112.72475 411.15007
12.25000 -3728.33832 14.54294 -11.02288 101.49010 97.48230 426.94358
12.35000 -3698.59969 16.84797 2.46970 96.68015 143.36443 406.74356
12.45000 -3672.41625 19.52696 -6.83993 119.81425 92.24014 394.68700
12.55000 -3646.49824 19.96409 -9.32436 95.68773 101.44294 381.20878
12.65000 -3625.25524 19.27025 -0.63764 117.11247 84.97120 372.18763
12.75000 -3597.57765 19.83572 10.30097 104.41896 107.85477 376.17730
12.85000 -3577.85646 19.03360 2.26588 92.52505 88.13867 367.39766
12.95000 -3549.78127 17.86216 0.62148 99.92167 85.99983 357.48530
13.05000 -3522.79498 20.62998 3.25553 98.27782 66.29105 340.62402
13.15000 -3498.11892 19.27149 -4.12712 112.59880 76.06241 347.44726
13.25000 -3475.66978 20.89013 4.81818 85.19946 82.90471 341.50013
13.35000 -3453.62569 17.86631 5.96524 68.04832 65.90074 320.57037
13.45000 -3425.31056 17.90433 -5.93542 94.32898 75.09723 313.58451
13.55000 -3397.28509 19.95223 2.11430 81.88263 67.36750 304.34517
13.65000 -3372.80088 16.48538 12.28583 74.52395 89.54145 305.52806
13.75000 -3345.20725 15.59833 28.58592 132.08322 80.11496 306.51772
13.85000 -3316.77056 17.09502 20.58539 94.45945 113.29186 293.34131
13.95000 -3299.30745 19.73321 23.29705 78.30668 72.25459 286.13771
14.05000 -3270.50917 18.05967 23.44297 157.63410 93.25736 283.81500
14.15000 -3250.17522 16.52569 31.42752 59.24259 58.45321 263.35512
14.25000 -3230.70342 17.75118 21.13449 111.06794 66.19839 263.22576
14.35000 -3196.23385 17.96821 26.12662 121.61862 85.51203 286.70043
14.45000 -3180.93680 17.31523 45.48584 66.68517 66.61895 263.22544
14.55000 -3156.14799 16.29306 20.80200 84.08256 64.73093 257.45633
14.65000 -3134.60317 14.55929 32.63074 60.95273 57.44188 254.41769
14.75000 -3111.38151 19.22717 49.86609 68.45254 74.25841 245.34394
14.85000 -3081.63550 19.69033 36.12910 168.87706 71.11509 239.61698
14.95000 -3062.63587 17.24427 42.13871 58.65962 63.32373 242.43375
15.05000 -3038.79313 14.89018 35.72183 60.26990 50.41962 233.65201
15.15000 -3015.12415 14.46689 42.74341 66.15468 62.86170 231.43944
15.25000 -2993.08753 12.61503 38.50338 68.47535 70.53250 234.57104
15.35000 -2971.79548 13.28300 56.69717 58.83385 83.18707 219.52082
15.45000 -2951.74018 16.23757 55.86677 74.66320 59.34946 217.57948
15.55000 -2936.94169 15.69060 52.99476 72.56400 96.34497 213.36603
15.65000 -2912.47950 11.76208 57.72448 56.22728 63.94148 201.54010
15.75000 -2894.79146 15.28302 57.10863 62.07054 53.22580 201.46105
15.85000 -2874.99701 13.89307 47.95107 42.54631 43.11535 207.89913
15.95000 -2856.40160 14.61007 44.66308 62.52136 50.85418 199.46567
16.05000 -2835.03896 17.09417 43.16769 154.27365 79.85577 191.32824
16.15000 -2823.76554 13.57970 42.31599 56.85569 49.15640 185.04222
16.25000 -2800.35757 12.23296 32.87263 56.15746 58.52107 197.42664
16.35000 -2783.98927 15.57968 45.89187 53.61471 57.34856 183.56826
16.45000 -2766.37019 13.82479 32.95924 49.19619 58.94877 173.99057
16.55000 -2745.81976 10.89839 27.78794 66.19963 88.18363 190.62825
16.65000 -2731.87537 12.33456 34.26864 49.13883 50.83570 175.62705
16.75000 -2713.58751 8.01483 32.27549 89.18090 68.18953 178.09268
16.85000 -2699.09080 10.05373 36.21489 49.22991 54.83430 161.99924
16.95000 -2677.30907 15.92796 30.22804 40.14939 55.03530 169.39973
17.05000 -2658.24262 10.23079 28.56075 52.57017 49.80480 164.21010
17.15000 -2642.55909 8.93687 27.50073 42.25823 48.16701 161.47503
17.25000 -2626.07998 9.96580 40.10949 48.21121 42.23314 156.33370
17.35000 -2608.83651 12.54059 36.97498 54.84543 44.76787 152.77024
17.45000 -2589.87888 11.04099 40.59428 120.32528 68.52080 162.17913
17.55000 -2579.10087 11.29429 28.87015 50.81702 38.11001 161.03836
17.65000 -2560.94135 13.63116 24.05921 39.10838 40.56789 138.77848
17.75000 -2540.35460 6.10610 35.99016 78.86491 147.09654 143.06683
17.85000 -2527.40495 9.01881 29.62021 42.37483 39.98660 136.02050
17.95000 -2510.48692 10.81675 27.68581 41.69022 41.79182 141.94250
18.05000 -2496.24266 9.15030 32.60343 71.16991 63.00966 135.02927
18.15000 -2482.50530 13.78782 30.99652 49.65788 45.35583 131.76862
18.25000 -2472.73600 14.66934 18.80127 41.93255 40.89429 122.80989
18.35000 -2454.08790 12.65154 43.48736 36.35932 52.51809 138.76060
18.45000 -2442.51301 9.79785 30.32711 36.88269 35.19816 122.66715
18.55000 -2427.31246 10.36596 28.63941 52.44119 65.76619 118.22477
18.65000 -2412.69956 9.42405 28.50084 65.06578 79.99388 139.48968
18.75000 -2402.54014 8.78404 31.61489 39.92170 43.57158 120.20102
18.85000 -2382.59303 9.75496 24.69730 46.48289 43.44240 124.50979
18.95000 -2373.96339 12.85462 37.64975 45.57424 50.58285 134.63441
19.05000 -2362.22898 7.70551 23.07733 46.64188 36.95095 119.80217
19.15000 -2344.21468 3.46152 31.52148 68.99027 112.59044 122.44534
19.25000 -2329.74221 8.11237 41.59371 41.15887 42.93268 159.11733
19.35000 -2318.68512 7.49244 37.80874 41.53101 36.43260 119.69859
19.45000 -2305.27099 6.86660 26.25828 44.78816 40.43129 117.49298
19.55000 -2287.27543 4.99509 34.14340 56.10404 102.73375 154.96334
19.65000 -2278.98779 6.57132 29.37489 50.48264 38.56170 106.67932
19.75000 -2267.09236 7.87222 38.39615 22.90141 28.31719 104.08600
19.85000 -2253.93945 11.69731 34.33979 70.58464 56.41153 99.15533
19.95000 -2245.60726 10.91437 31.25857 73.52081 46.92140 105.76484
