0.12500 0.03547
0.37500 0.04902
0.62500 0.08809
0.87500 0.12239
1.12500 0.15930
1.37500 0.20259
1.62500 0.21691
1.87500 0.26134
2.12500 0.26935
2.37500 0.25535
2.62500 0.27027
2.87500 0.25696
3.12500 0.23618
3.37500 0.21775
3.62500 0.20087
3.87500 0.17182
4.12500 0.14314
4.37500 0.10791
4.62500 0.09205
4.87500 0.07129
5.12500 0.05652
5.37500 0.05249
5.62500 0.02318
5.87500 0.01918
6.12500 0.02927
6.37500 0.01247
6.62500 0.01675
6.87500 0.01060
7.12500 0.02218
7.37500 0.05478
7.62500 0.05292
7.87500 0.04991
8.12500 0.07448
8.37500 0.08496
8.62500 0.06233
8.87500 0.06684
9.12500 0.07100
9.37500 0.04319
9.62500 0.03797
9.87500 0.04458
10.12500 0.06142
10.37500 0.05462
10.62500 0.05041
10.87500 0.06693
11.12500 0.07307
11.37500 0.07603
11.62500 0.09010
11.87500 0.03498
12.12500 0.05853
12.37500 0.07111
12.62500 0.03527
12.87500 0.05130
13.12500 0.03832
13.37500 0.06761
13.62500 0.05479
13.87500 0.05742
14.12500 0.04235
14.37500 0.07137
14.62500 0.06990
14.87500 0.05792
15.12500 0.06500
15.37500 0.01373
15.62500 0.08013
15.87500 0.04310
16.12500 0.11458
16.37500 0.10127
16.62500 0.07717
16.87500 0.08859
17.12500 0.04670
17.37500 0.07697
17.62500 0.05704
17.87500 0.05199
18.12500 0.07667
18.37500 0.07981
18.62500 0.05792
18.87500 0.05908
19.12500 0.07687
19.37500 0.03089
19.62500 0.03185
19.87500 0.04510
