0.05000 0.00000 0.00000 0.00000 0.00000 0.00000 0.00000
0.15000 249.31238 -971.65538 4012.65927 843.09058 986.06345 468.20183
0.25000 -748.60841 -22.32724 3741.36189 1237.36612 1331.05292 450.41933
0.35000 -887.85374 -33.08657 4023.27916 1384.40706 1392.79445 420.70664
0.45000 -807.42888 -195.95517 3826.96949 1426.18341 1449.66876 495.70217
0.55000 -933.63684 -169.56205 3863.85323 1426.54564 1377.05539 520.19659
0.65000 -1033.35415 115.67171 3789.71495 1318.01446 1584.93030 513.34271
0.75000 -1149.96933 -107.52266 3692.27039 1429.78222 1531.62089 641.85006
0.85000 -1262.50891 -103.70956 3669.90667 1328.80011 1607.59087 617.59165
0.95000 -1509.83080 -26.51287 3478.30608 1429.17524 1615.21111 722.93455
1.05000 -1676.25892 232.95162 3387.94551 1484.39855 1555.37583 794.34443
1.15000 -1847.61362 25.47461 3258.73409 1351.37658 1650.61564 866.35274
1.25000 -2045.74217 -109.45715 3006.39752 1402.97042 1722.83879 933.79601
1.35000 -2068.87574 -24.72583 2940.89032 1481.68186 1680.15254 985.85776
1.45000 -2303.03560 -3.88396 2616.42805 1451.92650 1750.32975 1109.29697
1.55000 -2322.39369 62.97950 2406.57186 1543.54284 1732.94841 1280.17713
1.65000 -2632.29301 17.61022 2162.95027 1378.93476 1689.99564 1369.73367
1.75000 -2636.30736 62.55510 1899.64504 1437.69483 1687.51992 1594.96577
1.85000 -2850.09284 69.61309 1577.64433 1384.52639 1607.30112 1750.98799
1.95000 -2986.36741 -89.02018 1465.95716 1301.72880 1519.11519 1926.50442
2.05000 -3030.09908 50.67753 1095.45949 1339.78523 1535.27250 2120.68073
2.15000 -3203.73842 -1.46077 999.09293 1225.16904 1421.07389 2117.51134
2.25000 -3167.85122 -7.35933 1018.71056 1209.12731 1295.82819 2173.28578
2.35000 -3149.82272 3.41850 875.33498 1247.60013 1244.27367 2258.23250
2.45000 -3182.35126 40.40169 766.84144 1192.64753 1201.36175 2328.35283
2.55000 -3229.18819 -6.59992 817.32923 1182.59306 1095.55364 2317.85839
2.65000 -3317.53109 35.82056 737.13815 1046.51897 1048.46196 2266.83905
2.75000 -3315.04959 -50.91112 569.33141 1106.77463 1029.90112 2307.19023
2.85000 -3301.72622 -4.92191 637.42755 1075.53685 945.92536 2320.50211
2.95000 -3309.60622 6.45816 472.10496 1108.59704 907.50744 2352.23170
3.05000 -3253.30211 -1.06017 492.48579 1115.89206 882.85043 2363.49946
3.15000 -3268.43368 0.13310 425.67006 1048.93055 841.90678 2359.41615
3.25000 -3230.02562 12.31565 499.36640 1082.14199 825.45360 2350.53610
3.35000 -3252.37843 9.73613 351.33315 1043.76126 778.41003 2354.80109
3.45000 -3255.60342 -7.14662 438.32038 1034.93145 743.05931 2293.45310
3.55000 -3249.15828 7.55459 307.89403 1030.07930 728.91446 2343.55899
3.65000 -3236.69771 -17.41473 192.22458 1014.37601 696.27392 2350.76344
3.75000 -3189.76835 20.59613 286.23133 1043.12460 669.01193 2363.98297
3.85000 -3192.55212 -12.38881 301.89557 1010.45750 650.46996 2321.58871
3.95000 -3185.20693 1.16167 333.18281 1016.29992 628.03874 2302.92592
4.05000 -3157.41110 -14.86212 220.60071 992.88420 622.75243 2345.45385
4.15000 -3124.29544 -13.35943 235.83580 1017.13550 594.97791 2326.75875
4.25000 -3188.78527 13.58855 80.86426 953.80674 586.30048 2272.81684
4.35000 -3155.98241 -5.58178 101.95430 971.97064 565.99103 2288.10480
4.45000 -3127.86118 -23.88052 183.00188 959.21387 542.80448 2265.86425
4.55000 -3106.78589 10.23328 151.75347 959.10336 537.61515 2254.76449
4.65000 -3058.06247 25.24230 173.16376 948.57487 510.87246 2282.30139
4.75000 -3089.27340 0.86359 86.23702 937.41573 499.73472 2233.72462
4.85000 -3010.76696 33.94595 132.75964 948.51975 485.75442 2292.00438
4.95000 -3000.98931 -2.68511 149.80962 922.54431 481.31685 2261.77229
5.05000 -3036.64828 0.85972 167.88099 907.79947 458.23142 2181.36427
5.15000 -2997.58612 8.29006 67.29116 914.65722 453.36587 2204.66050
5.25000 -2954.92803 3.15663 143.91776 930.27310 431.49837 2223.70883
5.35000 -2950.92058 7.17300 120.47718 910.80958 425.88285 2188.13768
5.45000 -2932.00113 6.62890 54.92353 902.85185 420.48834 2192.75631
5.55000 -2957.35275 -4.83274 114.35330 871.23816 403.33750 2125.51253
5.65000 -2889.75973 -3.18953 179.10062 876.44408 388.85931 2170.10456
5.75000 -2939.12482 0.74344 23.88066 857.36157 390.27477 2107.21272
5.85000 -2898.61763 -14.47928 99.89516 870.15220 380.14137 2097.91158
5.95000 -2868.09519 -13.22079 132.09253 854.31039 366.71723 2122.85733
6.05000 -2872.04015 -9.55872 65.44154 844.61056 360.76747 2092.93476
6.15000 -2855.70644 1.91336 75.82374 844.28152 354.92881 2077.20162
6.25000 -2821.97795 7.99583 22.58117 859.52010 347.82157 2094.50263
6.35000 -2809.46569 15.16602 24.38064 832.56467 349.18158 2092.32630
6.45000 -2791.70990 -4.47001 103.88977 841.35760 331.25608 2065.41912
6.55000 -2800.10286 -11.44192 46.71859 816.99766 329.36922 2033.76101
6.65000 -2786.97960 -1.33659 -7.51177 805.77336 318.27409 2047.69488
6.75000 -2769.82869 2.80731 54.32121 830.08390 309.84356 2003.72174
6.85000 -2749.77146 0.15497 73.17895 824.74713 300.71730 1998.69022
6.95000 -2722.39115 -4.38348 -2.83569 795.85012 297.44985 2026.95580
7.05000 -2707.09104 -0.29904 26.51816 814.26523 300.72107 2004.94293
7.15000 -2704.40885 -12.10584 8.81344 789.43806 291.26568 1984.84448
7.25000 -2696.18415 5.32268 66.98496 795.54235 287.58320 1960.93580
7.35000 -2679.11845 -0.44981 30.65451 784.43976 276.24300 1960.07328
7.45000 -2668.05589 -9.23564 86.66544 794.51651 271.36858 1928.94719
7.55000 -2619.43274 -3.51345 -45.39186 798.70001 275.00352 1977.52573
7.65000 -2653.00074 3.02963 6.67184 775.31585 260.16828 1907.54834
7.75000 -2620.67133 -10.49807 -20.50703 770.59416 258.37354 1921.28135
7.85000 -2633.22294 -7.23899 17.02525 749.55345 253.65710 1873.55228
7.95000 -2568.34233 -3.88356 56.53455 773.85051 251.78386 1920.44902
8.05000 -2579.24648 7.44531 -21.64161 777.64074 252.02777 1897.76091
8.15000 -2585.44800 1.02722 -68.10779 747.05681 245.60820 1869.91720
8.25000 -2573.12680 -3.13069 2.93446 767.11553 239.41084 1858.04246
8.35000 -2560.81749 3.15338 -13.74998 744.50919 233.25100 1835.61510
8.45000 -2524.58763 -8.41104 -33.87251 744.96640 236.06737 1861.99360
8.55000 -2487.76232 5.40098 -113.09331 757.02311 235.10039 1884.72935
8.65000 -2525.04686 2.51868 -29.01574 727.28921 228.43975 1819.23410
8.75000 -2509.51294 -5.07948 -51.69038 714.00489 221.73070 1814.67424
8.85000 -2489.68120 -3.77702 -29.56336 715.89848 219.99815 1805.77563
8.95000 -2473.72193 2.36232 -139.74886 721.51357 220.98830 1811.87247
9.05000 -2456.41419 4.07326 -127.89507 726.75871 211.34137 1808.27605
9.15000 -2463.66814 -2.67076 5.86568 704.84464 211.12588 1763.17426
9.25000 -2448.76015 1.25039 -96.28986 703.41398 208.05545 1770.30046
9.35000 -2405.98514 3.72186 5.16805 711.77537 200.66944 1782.50523
9.45000 -2409.18727 -2.70368 -40.72575 726.73445 194.93580 1751.48877
9.55000 -2398.13482 -3.02379 0.49598 696.48064 196.70111 1745.68597
9.65000 -2373.35892 -1.67625 -53.25503 706.87923 190.77860 1748.67293
9.75000 -2347.20140 2.36021 -36.61274 698.35249 187.41277 1758.68151
9.85000 -2377.56564 -2.34150 -44.55714 665.87384 185.08285 1708.89864
9.95000 -2356.16682 1.35903 -59.34030 683.23513 181.85471 1701.33616
10.05000 -2313.98550 6.28252 -14.82118 696.98284 186.11333 1713.26349
10.15000 -2299.70503 -0.89218 -88.43905 674.92958 177.90942 1723.47963
10.25000 -2291.92770 3.71472 -49.24845 663.30161 175.43440 1709.59392
10.35000 -2296.33582 -0.02638 -61.05465 673.56531 173.41368 1675.69188
10.45000 -2296.43748 2.79655 -109.05267 665.59533 174.96647 1664.98692
10.55000 -2247.92129 2.25459 -88.93346 664.73299 167.71082 1685.25687
10.65000 -2246.94327 1.78995 -44.84001 681.71336 167.24828 1656.84172
10.75000 -2224.59707 -3.16459 -29.26624 643.59802 162.37085 1676.58687
10.85000 -2234.49825 0.51112 -75.84268 635.14652 159.53372 1646.90439
10.95000 -2224.91259 0.27357 -81.13328 652.18815 158.05802 1633.27964
11.05000 -2212.01831 3.18116 -11.76282 644.28261 152.78778 1618.04958
11.15000 -2177.04478 -5.41399 -54.31846 657.94341 157.51828 1632.02676
11.25000 -2182.34010 -3.67790 -40.68588 646.35516 152.04005 1604.68721
11.35000 -2141.45166 -4.73402 -31.17143 647.69818 152.65083 1631.04538
11.45000 -2164.22956 3.98537 -68.53742 625.17821 149.46569 1589.40027
11.55000 -2143.44403 -4.11841 -50.49898 640.78919 149.71939 1591.71862
11.65000 -2125.55250 -4.94540 -61.97506 626.54229 143.32730 1590.09338
11.75000 -2125.95788 -3.24210 -23.20087 620.89911 141.74671 1562.13231
11.85000 -2114.58743 2.18595 -18.70465 602.28571 139.75190 1561.66885
11.95000 -2090.27008 5.31590 -15.70270 631.17237 138.26780 1566.26768
12.05000 -2116.80652 3.25352 -59.65930 606.40182 135.83001 1517.97911
12.15000 -2080.50698 -1.79051 -29.33564 615.55163 131.01558 1535.58413
12.25000 -2050.69756 -4.18570 -65.34700 618.76575 139.44012 1555.05728
12.35000 -2073.82172 -0.25383 -106.88688 579.51160 129.71642 1512.69187
12.45000 -2062.73976 2.38489 -95.85122 586.49061 132.01056 1501.22552
12.55000 -2031.20915 -2.91224 -49.92570 607.65975 131.67770 1517.80536
12.65000 -2035.13902 0.68588 -52.93063 596.68846 134.03869 1492.11764
12.75000 -2028.04127 0.70837 -24.64423 586.46050 123.67436 1477.77322
12.85000 -2027.01816 0.71609 -54.46125 584.11962 125.46052 1458.97250
12.95000 -2003.39384 -2.72454 -63.06597 576.65711 125.37134 1473.78311
13.05000 -1990.58538 -3.53555 -17.87163 583.38146 122.40796 1464.53055
13.15000 -1987.28910 0.14011 -68.08364 582.54874 117.72910 1448.32162
13.25000 -1955.44041 -3.68429 -39.39201 573.85506 119.02213 1467.65704
13.35000 -1956.37669 -4.63525 -121.96115 574.43542 117.80107 1451.09001
13.45000 -1966.01099 1.58889 -16.38941 563.75517 113.12635 1413.11683
13.55000 -1921.00050 -0.33569 -70.29850 571.50355 112.56207 1453.63840
13.65000 -1943.88730 3.98231 -62.64667 546.36205 116.50508 1412.38310
13.75000 -1927.66930 2.01034 -72.56431 548.37473 111.11387 1412.76319
13.85000 -1890.87222 -4.00606 -19.41127 569.74572 113.97433 1428.21887
13.95000 -1903.52077 3.19604 -62.12658 556.21403 111.71395 1402.24053
14.05000 -1883.47609 1.13600 -44.89256 565.09441 107.25273 1401.64973
14.15000 -1882.59768 8.57982 -70.54237 555.08861 105.27548 1389.63015
14.25000 -1883.26515 -3.47548 -100.68778 540.68150 106.37105 1374.08061
14.35000 -1868.05688 5.07960 -0.18008 530.88008 105.44540 1370.68225
14.45000 -1843.35296 -1.08551 -22.56743 543.85373 102.08063 1380.22115
14.55000 -1830.98625 -1.26703 -27.52134 550.07516 105.58394 1379.90683
14.65000 -1838.25442 2.19429 -80.72824 523.98236 103.45575 1360.64819
14.75000 -1824.69803 0.14448 -82.50985 533.96777 97.43104 1357.59175
14.85000 -1836.76293 -4.60953 -72.42310 511.80341 102.94230 1331.57866
14.95000 -1821.75575 0.53876 -52.92974 518.74081 97.46427 1328.04296
15.05000 -1805.38364 0.31652 -35.67023 507.61089 94.29538 1332.75709
15.15000 -1805.97166 4.27470 -101.41144 509.10877 93.68892 1311.69960
15.25000 -1793.14805 1.57877 -51.56240 517.38832 95.42644 1312.20525
15.35000 -1790.83680 -2.17676 -64.43547 494.65908 91.03460 1303.40924
15.45000 -1770.96323 1.28591 -80.58505 511.37110 90.76436 1301.92696
15.55000 -1774.04709 1.55265 -43.30309 498.72688 91.04950 1281.94288
15.65000 -1764.89412 0.81931 -21.44500 494.23027 90.51487 1274.25597
15.75000 -1762.93311 -0.75738 -97.29897 495.01937 88.13882 1269.01785
15.85000 -1738.18248 2.29736 -46.18469 495.49873 88.99905 1278.39057
15.95000 -1749.86293 0.58041 -97.30496 487.54015 88.96139 1252.49380
16.05000 -1734.07091 -1.29545 -15.25990 487.41488 89.38650 1251.64429
16.15000 -1696.22074 2.12297 -43.86424 500.82704 85.07628 1281.06509
16.25000 -1705.43219 0.89421 -80.74370 491.49947 87.54593 1257.28689
16.35000 -1707.25353 2.00998 -59.26281 487.33162 85.76358 1238.57207
16.45000 -1681.82810 1.20941 -39.40435 496.44568 78.87127 1251.29188
16.55000 -1701.14303 1.15296 -58.24590 474.69171 80.83934 1221.27260
16.65000 -1676.64998 1.27895 -50.49455 475.83984 81.51244 1237.15734
16.75000 -1660.20238 -1.72514 -73.50991 493.54376 78.26206 1238.24651
16.85000 -1654.91938 0.23640 -59.07064 480.87484 83.30035 1230.61290
16.95000 -1671.52564 -2.45371 -50.37401 480.48840 78.39711 1197.60732
17.05000 -1653.11709 -0.63852 -65.06871 477.21994 76.35219 1201.60929
17.15000 -1642.73393 1.99488 -57.01423 472.59096 76.37267 1204.29086
17.25000 -1614.90662 -1.26285 -54.43340 471.46396 76.15352 1222.28794
17.35000 -1614.19057 -0.13804 -57.59173 487.33852 75.63472 1199.27213
17.45000 -1610.83143 0.58197 -69.32359 469.13700 74.86523 1201.45513
17.55000 -1610.73819 1.66258 -60.13133 458.14401 76.07105 1188.52516
17.65000 -1606.38278 -0.80281 -67.94427 457.34857 73.60602 1177.77786
17.75000 -1611.48975 0.97300 -38.42520 454.99121 71.20473 1153.60574
17.85000 -1585.15656 0.05947 -37.28209 467.70364 72.90348 1172.51364
17.95000 -1574.56618 -0.43259 -72.39229 455.59696 73.78177 1174.46571
18.05000 -1574.18648 1.21778 -53.73681 449.23755 68.79955 1160.73134
18.15000 -1582.44620 -0.63127 -46.30537 436.49548 71.36299 1140.21485
18.25000 -1581.06531 -1.81411 -92.84249 427.71337 69.41729 1129.61232
18.35000 -1535.22366 -3.17316 1.23355 457.30405 71.97543 1158.64975
18.45000 -1541.21360 1.38365 -62.19375 445.46460 76.70178 1141.46280
18.55000 -1545.35986 -1.03194 -48.60428 443.33349 67.68346 1129.36750
18.65000 -1522.18026 -0.03289 -29.18050 449.23115 72.08324 1133.45425
18.75000 -1531.30411 0.39437 -60.30085 438.53537 69.47002 1114.88237
18.85000 -1513.14859 1.50240 -43.16727 443.78859 68.91427 1120.41921
18.95000 -1523.25720 -0.30502 -58.61088 434.76070 69.49312 1101.69034
19.05000 -1499.51846 -0.25933 -73.19403 438.23369 70.43080 1113.37554
19.15000 -1493.12031 1.04157 -52.39626 434.42526 66.98418 1110.36109
19.25000 -1490.11460 0.40790 -49.44977 427.98479 64.70696 1102.29758
19.35000 -1488.90285 -1.89402 -73.94213 428.21189 65.37390 1091.21113
19.45000 -1493.71970 0.33784 -72.52417 418.93919 60.11150 1073.47639
19.55000 -1474.26389 -0.30420 -94.45605 416.35568 63.13207 1089.07786
19.65000 -1456.57616 2.32091 -60.74430 426.81508 67.69745 1092.58799
19.75000 -1451.45693 -0.12546 -30.45734 428.99675 60.44043 1086.22334
19.85000 -1457.63897 1.37816 -46.58832 411.33407 59.01675 1069.85554
19.95000 -1435.39814 -0.99001 -28.70801 417.17549 63.81326 1081.15428
