0.12500 0.11488
0.37500 0.08473
0.62500 0.04908
0.87500 0.02780
1.12500 0.02178
1.37500 0.01181
1.62500 0.02147
1.87500 0.01932
2.12500 0.02257
2.37500 0.01773
2.62500 0.02574
2.87500 0.00896
3.12500 0.00122
3.37500 0.02410
3.62500 0.02251
3.87500 0.02818
4.12500 0.04230
4.37500 0.05418
4.62500 0.03560
4.87500 0.04584
5.12500 0.04793
5.37500 0.04309
5.62500 0.03687
5.87500 0.03588
6.12500 0.04038
6.37500 0.03040
6.62500 0.02482
6.87500 0.01423
7.12500 0.02437
7.37500 0.02179
7.62500 0.04115
7.87500 0.04108
8.12500 0.03430
8.37500 0.03331
8.62500 0.04339
8.87500 0.04570
9.12500 0.01524
9.37500 0.01299
9.62500 0.00709
9.87500 0.01476
10.12500 0.04167
10.37500 0.06342
10.62500 0.06150
10.87500 0.03804
11.12500 0.06341
11.37500 0.03561
11.62500 0.02197
11.87500 0.05316
12.12500 0.05120
12.37500 0.05625
12.62500 0.01635
12.87500 0.01048
13.12500 0.02871
13.37500 0.03304
13.62500 0.03155
13.87500 0.02831
14.12500 0.05622
14.37500 0.05001
14.62500 0.02927
14.87500 0.03589
15.12500 0.08712
15.37500 0.09984
15.62500 0.07186
15.87500 0.01095
16.12500 0.03206
16.37500 0.02904
16.62500 0.07265
16.87500 0.05724
17.12500 0.01465
17.37500 0.07308
17.62500 0.17040
17.87500 0.05339
18.12500 0.04028
18.37500 0.08807
18.62500 0.04457
18.87500 0.02450
19.12500 0.05107
19.37500 0.07048
19.62500 0.14716
19.87500 0.06793
