0.05000 -3840.04547 -175.65656 8090749.00051 0.00000 0.00000 0.00000
0.15000 -563.67792 594.40605 -2635576.72668 2293.17666 2658.95750 7005020.45175
0.25000 -714.15090 610.63327 124752.58103 2533.83023 2702.79022 1103144.89420
0.35000 -644.82304 249.40811 -111149.78359 2463.76935 2757.50767 579539.23883
0.45000 -995.24553 159.92430 194106.21175 2514.15847 2779.58480 961363.80830
0.55000 -650.93178 84.73846 -214050.09912 2435.46999 2771.83488 3674200.04769
0.65000 -829.46524 -412.71481 -128171.24988 2234.73978 2757.30086 910109.30690
0.75000 -1182.51561 -102.82375 -105921.06473 2261.50225 2722.75106 1683490.54281
0.85000 -1316.32598 144.04357 11007.80026 2027.68713 2812.28634 1036356.32467
0.95000 -1586.38916 444.82917 -81208.92930 1867.34301 2656.01111 1657473.63009
1.05000 -1815.42976 -62.20371 -99152.21255 1660.50410 2618.37015 1241853.45045
1.15000 -2159.44874 45.11253 -129407.88401 1376.53296 2566.81611 1666556.03409
1.25000 -2593.81526 -57.41351 -72103.63001 1036.84251 2375.47431 1406746.78329
1.35000 -2849.45201 34.36615 45371.12140 927.93372 2334.07178 1475884.50658
1.45000 -3078.18584 -56.89550 -62539.24557 754.10465 2185.78564 1540431.55997
1.55000 -3244.68327 99.64058 4044.89141 635.79604 2082.04631 1378828.46002
1.65000 -3431.21030 35.02259 8228.21218 691.16773 1966.62145 2313746.74020
1.75000 -3538.95008 -162.36994 40071.16127 539.21294 1900.52976 1236466.54861
1.85000 -3621.37056 -47.47100 41650.51558 494.69454 1779.18560 1478128.74215
1.95000 -3701.01350 85.61130 12822.47615 522.19282 1717.70568 1873057.27672
2.05000 -3769.73839 -19.54115 2583.42558 441.26831 1623.63946 1701287.42068
2.15000 -3825.26238 25.06652 65854.72727 416.44369 1503.92265 2040254.24502
2.25000 -3850.67913 -14.97625 25329.17830 476.60762 1476.31013 1993271.75875
2.35000 -3860.31726 43.45417 788.69603 461.64896 1403.07978 2240295.37968
2.45000 -3905.90592 -37.90149 99797.76228 438.53862 1358.86887 2131380.03002
2.55000 -3930.18282 -2.66069 -600.33926 382.46599 1306.17315 1442802.49814
2.65000 -3925.04186 -46.96515 -90979.14520 405.43214 1223.91875 1988788.83389
2.75000 -3936.11239 37.05355 -5362.13799 367.41339 1213.42222 1489138.01276
2.85000 -3951.59903 31.57331 16046.00412 419.63159 1133.19431 1493926.61129
2.95000 -3947.39559 8.76659 64815.53978 429.97731 1107.38917 2178211.82017
3.05000 -3959.12274 -8.09422 -532.76363 374.16538 1073.66624 2084390.67341
3.15000 -3944.11529 -10.99248 -68705.09636 413.32550 1047.43895 2085407.74582
3.25000 -3950.05112 -1.34405 46892.54596 364.28213 999.80904 2209013.14743
3.35000 -3952.89912 -4.22558 24664.55098 329.53803 975.89187 2354893.87196
3.45000 -3941.13201 10.62888 -57570.08849 413.22676 968.54910 2001995.85250
3.55000 -3920.76507 -13.49174 -11232.98307 301.04036 913.99954 1721438.98684
3.65000 -3915.79520 -24.22833 57500.21930 297.53270 918.10492 2240692.47044
3.75000 -3900.62157 9.19630 708.58676 397.62830 856.93741 2041503.69647
3.85000 -3908.11627 27.06110 -29863.55376 307.54762 838.68772 2405864.12073
3.95000 -3889.59174 -15.11332 38564.28269 394.63395 812.54474 2014949.87113
4.05000 -3875.98768 14.15749 86942.75687 334.08632 802.63996 2335145.06142
4.15000 -3869.79231 -6.11695 58098.69479 285.50195 790.07687 2320196.95400
4.25000 -3841.28311 34.87996 57268.57870 382.57989 738.02275 2352556.61683
4.35000 -3849.96386 -16.57586 -7474.25440 363.53168 768.78424 1912272.51357
4.45000 -3819.18322 27.42279 -34351.80827 307.93439 711.03124 2214218.82266
4.55000 -3817.82772 -13.51366 944.14576 273.89990 686.63803 2430806.15502
4.65000 -3804.88409 13.83137 8202.93795 256.33508 671.74575 2210871.53969
4.75000 -3786.50873 0.89155 -35651.13663 300.95685 661.10548 2485550.42667
4.85000 -3772.30955 -15.47377 -7675.73661 324.70144 660.81682 2623997.44799
4.95000 -3750.19100 20.61560 -51303.02466 247.59893 630.51892 2345384.93276
5.05000 -3742.03429 -7.09428 14973.11430 256.58559 626.57825 2125979.98744
5.15000 -3727.83828 2.86865 -28910.34980 251.62715 602.18658 2311782.90302
5.25000 -3712.19669 12.61334 56609.60958 315.33962 588.46863 2258889.01105
5.35000 -3687.98191 3.41154 92116.13163 281.65586 600.55763 2042131.07131
5.45000 -3671.01048 23.05603 14150.33236 244.65258 555.83559 2120259.23060
5.55000 -3653.50118 6.51620 55816.20671 289.60429 544.09586 2181486.47358
5.65000 -3637.58952 -8.03727 21731.23942 288.93471 547.90336 2038625.34252
5.75000 -3616.43920 0.48653 -1455.90734 247.56854 531.26076 2370293.11741
5.85000 -3601.08605 -10.43269 -8375.54059 196.92879 499.11007 2109160.80481
5.95000 -3585.16377 9.92862 -102386.80768 271.44563 498.59732 2205878.77169
6.05000 -3574.54422 -2.61990 -114967.56937 228.10979 510.06178 2393077.08205
6.15000 -3553.53156 2.69866 -23979.02043 249.89538 497.52641 2575487.42995
6.25000 -3534.75092 -10.61745 28975.60563 223.45999 517.59394 2251079.23740
6.35000 -3530.48590 -5.55365 104055.82407 222.97895 469.73591 2096426.08390
6.45000 -3508.38976 -1.73718 -4126.24476 247.48207 451.43224 2520667.05526
6.55000 -3494.03288 5.79829 -14209.21586 210.56294 443.42462 2111325.54586
6.65000 -3469.12323 1.10459 20399.36651 221.45480 441.80117 1968008.59829
6.75000 -3456.54559 4.21806 34257.14296 198.56153 462.09399 2365962.69405
6.85000 -3439.00280 -9.44221 -40942.61755 165.43892 408.20524 2257394.07892
6.95000 -3421.53570 18.72796 36408.19901 211.17464 412.90858 2337477.97045
7.05000 -3408.56384 1.06630 -110943.53690 196.57412 406.20028 2263621.47017
7.15000 -3391.10297 -4.59479 78722.95193 218.02748 387.75468 2280658.66778
7.25000 -3366.79404 -3.11842 -34399.63613 197.33053 381.34265 2129845.75067
7.35000 -3361.19996 -8.41273 33972.66283 184.39202 370.85565 2147928.94609
7.45000 -3337.12953 2.30830 -223.83058 213.39601 381.71966 2247389.09890
7.55000 -3324.55358 12.31897 40882.54492 177.04002 366.42423 1916415.74340
7.65000 -3305.92333 9.82488 -21878.96700 191.57289 387.86615 2327685.33787
7.75000 -3291.48439 -5.99989 -181850.72947 205.72743 358.62651 2532419.25199
7.85000 -3270.16918 7.90772 -50967.06575 170.83806 343.94297 2387541.80269
7.95000 -3246.53388 5.35277 38858.83310 186.86952 355.08589 2385201.60209
8.05000 -3240.36479 5.67182 195820.06704 188.55925 346.33150 2473525.40587
8.15000 -3214.79427 2.66216 -2337.67871 181.22367 324.95679 2442979.02607
8.25000 -3194.73623 -8.34297 -333.08482 218.53317 354.30832 2152744.34908
8.35000 -3186.08519 -2.26793 -51200.23594 147.23048 308.46018 2060557.51343
8.45000 -3168.66680 6.67798 -13087.97044 163.00041 311.17417 1984250.52058
8.55000 -3148.98225 -2.03263 -34543.52266 169.57165 308.29561 2156479.76265
8.65000 -3139.68759 0.13347 -84641.25256 183.80824 304.63730 2299659.78364
8.75000 -3122.47001 -2.53354 -50307.22454 167.56242 292.44698 2451218.62656
8.85000 -3101.38851 0.18079 -28610.36648 160.48991 290.10192 2182297.96449
8.95000 -3090.92383 0.35951 39691.38308 167.66092 292.44352 2301491.20892
9.05000 -3066.83453 -13.04724 30812.86404 174.99984 282.84000 2385468.51880
9.15000 -3060.07799 2.21945 -55759.76888 153.44539 286.69896 2383032.62685
9.25000 -3044.18027 3.03933 12500.35803 190.72531 276.28394 2516791.53033
9.35000 -3023.13955 -3.62658 -6001.58356 185.64808 284.88924 2346892.88821
9.45000 -3009.28121 -1.89724 33417.25867 177.55620 272.88780 2124692.68796
9.55000 -2995.06965 1.37298 -94106.07472 143.97231 269.29443 2203500.69896
9.65000 -2983.50779 4.86735 -5569.69964 149.52951 259.05842 2303832.82446
9.75000 -2966.47284 4.59705 17067.59281 168.83136 281.13418 2284707.95911
9.85000 -2951.89044 -10.21991 7577.88875 134.08064 255.32988 2353832.92934
9.95000 -2938.29289 1.67678 -20220.35051 131.52997 242.30209 2370372.48258
10.05000 -2919.55349 8.18101 -65251.51205 195.00081 296.60876 2167952.45616
10.15000 -2911.99283 -0.03159 -11743.38500 138.73133 242.22572 2600106.10659
10.25000 -2892.60419 3.55849 -7748.56276 137.92360 233.04120 2130831.61935
10.35000 -2875.04379 -8.05300 6736.76987 155.36766 249.28646 2124860.07152
10.45000 -2862.40706 -1.42841 8841.77683 137.48381 228.75736 1965699.59993
10.55000 -2849.89919 -2.78603 -33087.59244 158.84683 234.51473 2421177.41987
10.65000 -2838.62687 -4.33790 60650.86285 128.98667 223.29014 2198003.98943
10.75000 -2819.27243 -2.06281 -66126.75592 151.40209 233.52845 2262263.99316
10.85000 -2801.43792 -0.13328 -16261.54817 124.10044 218.87859 2055396.98220
10.95000 -2790.24958 -2.40340 42728.53312 147.05172 225.69358 2067497.93211
11.05000 -2774.08771 -0.60670 27874.07979 136.88113 241.34348 2093914.55138
11.15000 -2758.53293 3.15477 59577.31298 157.52571 200.13933 2192472.15188
11.25000 -2745.77566 3.87237 -22515.17266 131.04157 209.90094 2400740.20101
11.35000 -2729.80442 1.48505 -19719.73075 167.71076 199.70174 2092821.67661
11.45000 -2714.47842 -4.75732 13174.91355 123.77005 202.49712 2194658.43002
11.55000 -2708.26228 2.52531 -8949.79325 150.79702 215.71134 2147813.64171
11.65000 -2686.42083 -3.20563 -5725.31170 159.67180 224.50358 2125886.59350
11.75000 -2676.64263 -3.88540 35355.84981 122.11049 199.31907 2068977.40667
11.85000 -2666.35536 -1.83586 6643.44671 159.51392 213.58882 1959187.79392
11.95000 -2649.94272 2.16527 39845.12777 118.70399 190.29295 1929725.26730
12.05000 -2633.17216 -0.08538 -70411.30897 142.06335 197.72682 2094682.95855
12.15000 -2620.16562 -2.15549 31136.45013 132.94150 190.39008 2042669.42279
12.25000 -2613.61929 0.13380 22139.67768 113.28123 181.40091 1944800.89355
12.35000 -2598.61270 -3.16357 37404.52036 119.63818 193.22803 2091411.16178
12.45000 -2583.13550 -2.82961 -60789.15715 155.98628 184.90507 2142915.08395
12.55000 -2568.37264 3.67912 30141.03557 127.39979 185.19448 2178577.08706
12.65000 -2562.90844 1.59870 10534.64892 112.99864 179.07080 2130501.72269
12.75000 -2551.08353 -1.42297 53926.97476 102.54287 169.29403 2106724.56359
12.85000 -2535.80235 9.28549 -50128.84404 146.70853 178.36275 2068939.48695
12.95000 -2525.18026 -6.94076 6442.08439 129.63828 173.46115 1977972.90186
13.05000 -2514.09087 -0.61417 68006.66507 103.47788 165.41158 2131781.52530
13.15000 -2500.37774 3.63491 -4676.01408 107.34534 166.99070 1921663.11184
13.25000 -2489.04201 -2.89440 14031.08970 107.78706 156.94117 2069939.57340
13.35000 -2473.97995 3.56660 31555.84941 146.66158 175.89589 2053980.17547
13.45000 -2461.90422 3.78977 29285.91629 98.87650 162.50471 2188848.95593
13.55000 -2443.34854 -2.65808 102995.55341 175.29033 169.74286 2132688.66042
13.65000 -2440.22715 0.70952 56983.76564 100.56139 152.30836 1962960.48909
13.75000 -2425.76814 4.52579 -58041.40395 109.75877 161.16629 2060603.58072
13.85000 -2411.22143 -7.24238 68029.62768 131.89630 166.97062 1996314.82237
13.95000 -2400.23696 7.32693 37734.35388 106.12239 148.45968 2100040.02207
14.05000 -2394.73411 -5.10269 46404.62966 122.69266 144.50398 1967866.03893
14.15000 -2381.84707 -6.98332 64886.75543 108.85713 154.18242 2001181.96421
14.25000 -2365.72127 -2.56812 -34821.21842 110.65858 155.36221 1956618.99736
14.35000 -2358.25402 -1.38350 -21062.93812 114.58544 156.35309 1900038.04385
14.45000 -2346.62669 2.27773 16655.63007 103.47259 141.73179 1866083.03173
14.55000 -2333.82406 -1.17130 -17040.22017 110.70273 142.98467 1946793.77276
14.65000 -2318.93870 -2.72035 -7452.41428 108.94323 145.78688 1976889.46500
14.75000 -2317.27405 -1.03818 13624.26248 95.34072 141.30571 1895038.56877
14.85000 -2301.87434 2.84774 49309.00822 129.40786 142.75031 2006225.14376
14.95000 -2290.36831 -2.29903 -21102.29849 113.49396 140.18535 1939485.42920
15.05000 -2279.10401 -5.71683 -24858.79170 95.22519 131.80851 1870407.49798
15.15000 -2267.73215 1.63107 39815.55051 97.74724 131.39662 1935146.93229
15.25000 -2258.60541 0.70510 -35325.61913 85.61444 129.33952 1881133.41849
15.35000 -2251.37441 -3.52168 -4996.56419 101.17308 137.80076 1976235.42611
15.45000 -2235.35515 -1.72785 -7499.11134 117.12327 141.48193 1944011.96586
15.55000 -2227.83804 0.94001 -8918.17495 113.45731 136.19962 1947963.57099
15.65000 -2218.64477 2.65701 -25477.78471 86.85378 116.74499 1831419.18113
15.75000 -2208.58540 1.60460 2776.27247 102.37491 125.57543 1883729.30460
15.85000 -2200.19812 -0.10457 17792.67279 90.28030 121.87074 1843721.16903
15.95000 -2184.95087 -0.26528 18711.82291 101.36179 114.13661 1974052.09536
16.05000 -2175.92554 -0.33292 1677.31383 102.03303 118.86090 1785714.31913
16.15000 -2166.99791 -2.24076 27873.33596 84.21215 123.62980 1891621.81290
16.25000 -2159.16373 -3.00073 -13651.25845 91.90411 113.97494 1695898.46006
16.35000 -2146.63235 0.86610 46702.98575 89.61961 109.43069 1754711.71741
16.45000 -2139.30426 2.03533 -15889.63262 84.90176 112.87994 1712674.92584
16.55000 -2130.56460 2.23033 -2212.40398 85.58426 113.63429 2000894.11188
16.65000 -2122.05771 -1.61803 -4487.35541 123.10060 145.47036 1917954.20038
16.75000 -2111.05172 -1.24933 -7634.31713 85.21785 109.70115 2045214.77414
16.85000 -2100.99447 3.90378 14632.28034 81.89840 108.25405 1993211.76050
16.95000 -2090.74346 0.08741 -42664.00943 77.36576 100.78054 1799069.72835
17.05000 -2079.06574 3.44959 -10792.08628 89.18518 107.24309 2093972.04443
17.15000 -2070.22679 -0.06424 -31557.47635 97.68955 120.45778 1764189.86361
17.25000 -2062.96049 2.40006 -33135.82272 77.96826 106.55736 1871576.73421
17.35000 -2050.59770 -4.11276 14624.27694 113.36269 110.12490 1844364.09881
17.45000 -2040.23318 2.56334 41115.62651 136.13526 103.24334 1771651.60703
17.55000 -2032.64607 -0.88003 22104.73886 89.33610 105.01460 1766286.69319
17.65000 -2027.64349 4.44710 38908.44048 75.59980 104.67093 2071675.79743
17.75000 -2016.07899 -2.98431 30542.53032 113.40008 101.51185 1940635.87048
17.85000 -2009.40658 -0.94674 -65404.77725 80.73986 121.60883 1772002.20927
17.95000 -1998.25931 -0.39223 25017.68865 94.73615 116.11199 2039076.69539
18.05000 -1989.58685 2.89546 -59310.16097 78.82365 103.68084 1858878.29422
18.15000 -1979.92945 -1.61156 17003.85749 83.21343 92.43921 1729076.18389
18.25000 -1973.13900 1.02536 48838.84122 91.99327 103.56662 1908529.92266
18.35000 -1963.70152 0.58255 -18618.48558 72.18641 103.12203 1620013.70493
18.45000 -1954.18197 -0.34493 24110.03396 113.21423 115.27676 1957896.33237
18.55000 -1945.73025 -0.64245 7352.70460 76.70589 94.95185 1739397.74845
18.65000 -1939.05223 0.73600 -18146.98689 79.10724 109.70764 1853318.26322
18.75000 -1929.41529 -0.32642 -34860.02479 90.74556 105.00836 1688275.22869
18.85000 -1919.93516 -0.25923 -9719.25910 85.27694 102.30696 1862812.43348
18.95000 -1913.78498 -0.34131 -15572.71415 82.84203 99.67888 1739670.00983
19.05000 -1901.63657 -3.43805 40237.63013 100.07862 89.66568 1926871.37445
19.15000 -1897.91433 0.09642 5909.85852 68.77951 93.63873 1732811.27634
19.25000 -1886.71962 -1.35600 -1339.56783 88.48560 91.71272 1704683.43627
19.35000 -1879.03816 -0.74292 26466.23647 67.48426 83.01140 1935974.23650
19.45000 -1872.41811 0.19401 4744.53430 73.40927 81.64213 1792124.54234
19.55000 -1865.35293 1.20657 -57142.40834 71.07125 80.63690 1667734.76921
19.65000 -1854.67261 1.08574 53612.61533 72.39403 90.89012 1689829.56386
19.75000 -1845.89681 0.67850 -34112.65667 78.99395 80.45279 1678861.29912
19.85000 -1840.25225 -0.44781 6440.21951 79.68159 83.74744 1731819.29723
19.95000 -1827.10543 -1.77550 7462.12885 96.96549 110.26062 1644960.58976
