0.120000 1.492050
0.380000 1.433410
0.620000 1.669130
0.880000 1.708090
1.120000 1.664880
1.380000 1.680220
1.620000 1.681180
1.880000 1.702140
2.120000 1.657610
2.380000 1.590630
2.620000 1.584590
2.880000 1.577390
3.120000 1.620510
3.380000 1.733400
3.620000 1.861560
3.880000 1.928770
4.120000 1.946150
4.380000 1.975350
4.620000 1.946970
4.880000 1.931070
5.120000 1.913390
5.380000 1.877520
5.620000 1.814420
5.880000 1.739120
6.120000 1.609450
6.380000 1.509850
6.620000 1.337050
6.880000 1.212270
7.120000 1.073470
7.380000 0.900590
7.620000 0.802250
7.880000 0.696580
8.120000 0.556330
8.380000 0.478950
8.620000 0.326340
8.880000 0.098510
9.120000 -0.049090
9.380000 -0.280750
9.620000 -0.629760
9.880000 -0.881660
10.120000 -1.277150
10.380000 -1.972010
10.620000 -2.239640
10.880000 -2.901880
11.120000 3.119530
11.380000 3.065890
11.620000 2.510340
11.880000 2.024890
12.120000 2.097120
12.380000 1.978300
12.620000 1.917880
12.880000 1.567860
13.120000 1.844160
13.380000 1.326070
13.620000 1.272280
13.880000 -0.295660
14.120000 0.121490
14.380000 -0.079300
14.620000 -0.287710
14.880000 -0.439300
