0.2 -1.14138 21.64803 0.51254 88.50168 88.02207 70.50339
0.6 1.67168 45.40394 0.18932 88.22098 83.7207 67.70328
1.0 0.4907 65.70497 0.17531 88.05736 79.13806 65.70049
1.4 -0.70333 80.23643 0.6284 87.22217 75.95381 61.90972
1.8 0.27058 92.52912 0.05816 86.77909 72.23317 59.64463
2.2 0.55202 99.98128 0.62538 84.8918 68.93923 56.56076
2.6 -0.26858 108.68158 0.11315 81.70784 65.05098 54.53558
3.0 0.79906 116.99896 0.45844 78.60059 62.31728 52.20302
3.4 -0.98845 125.38276 0.31267 74.66297 58.94394 50.94359
3.8 0.64218 133.3177 0.54836 69.29522 57.04798 48.67454
4.2 0.06185 141.50941 0.65509 64.86997 53.79097 46.93923
4.6 0.68283 150.92248 0.73024 59.51742 50.35068 44.56501
5.0 -0.14748 159.27174 0.53771 54.79661 47.14888 42.71156
5.4 0.77604 167.20473 0.26213 50.08032 43.55055 40.1252
5.8 -0.01071 173.82479 0.71531 45.76572 39.88678 37.88107
6.2 0.1218 180.23586 0.21546 42.96516 36.868 35.53832
6.6 0.14223 185.30179 0.25343 40.38181 34.71259 33.90057
7.0 0.03522 189.7138 0.17978 38.11218 32.25324 32.11229
7.4 -0.12064 193.39958 -0.08285 37.08407 30.2379 30.59079
7.8 -0.09004 195.97669 -0.11922 35.49175 29.17193 29.36695
8.2 0.12701 197.78441 -0.48461 33.94634 27.95452 27.97267
8.6 0.16745 199.51059 -1.01706 32.85646 26.81679 26.91363
9.0 0.15711 201.25121 -1.09114 31.69458 25.25447 26.01855
9.4 -0.305 203.0447 -1.44451 30.69834 24.39663 24.65127
9.8 -0.08492 204.07925 -1.38617 29.48434 23.16627 23.57689
10.2 -0.74534 205.03064 -0.99039 28.32999 22.59726 22.49247
10.6 -0.09014 206.33503 -1.46066 27.31411 21.77063 21.95934
11.0 0.11366 207.683 -0.9165 26.75159 21.06561 20.64956
11.4 0.17914 208.7904 -0.44315 25.72924 20.146 20.03799
11.8 0.09553 209.38717 -0.74289 25.16692 19.45362 19.24165
12.2 0.14625 210.45997 -0.31027 24.30708 18.82674 18.78411
12.6 -0.24913 211.08675 -0.08484 23.77563 17.60228 18.22429
13.0 -0.08846 210.94202 -0.33733 22.88929 16.64566 17.59017
13.4 0.19892 211.27119 -0.33555 22.29805 15.90819 17.07777
13.8 0.20779 211.11098 -0.53402 21.722 15.44001 16.36556
14.2 -0.09984 211.41766 -0.88404 20.83587 14.8358 16.09093
14.6 0.36629 211.18567 -0.84124 20.59857 14.74446 15.44607
15.0 0.51164 210.80947 -1.03602 20.02569 14.45114 15.10679
15.4 0.54268 210.83249 -1.34328 19.09648 13.82814 14.14543
15.8 0.32182 210.59776 -1.02103 18.22898 13.90674 13.79945
16.2 -0.28078 210.51745 -1.00755 17.44231 13.83162 13.23711
16.6 0.04158 211.01573 -0.42648 16.81889 13.01826 13.18747
17.0 -0.04272 210.99219 0.57184 16.87633 12.69822 12.72796
17.4 -0.12784 211.49596 0.59263 16.373 12.42129 12.12641
17.8 -0.03668 211.65376 1.2932 15.39122 11.03861 11.58555
18.2 -0.17935 211.58195 1.41837 14.80831 10.82404 11.40376
18.6 0.50389 211.03435 1.38383 14.72983 11.26097 11.09636
19.0 0.2104 211.39625 1.46371 14.63968 10.67112 10.77821
19.4 0.00578 211.23962 1.39305 13.7978 10.65564 10.24967
19.8 0.27569 210.75294 1.11495 14.03695 10.38074 10.41686
