0.2 0.53 18.41208 2.32269 105.02912 104.37418 87.49266
0.6 -0.56895 42.93379 0.61595 105.4112 97.44825 84.10655
1.0 0.54613 59.76397 -0.20712 103.31024 89.62408 80.75614
1.4 0.21284 73.50922 -0.54047 102.55289 84.19512 77.48302
1.8 0.32961 82.02221 -1.13406 100.60647 80.46313 73.52867
2.2 0.34062 89.79504 -1.49414 97.77291 77.42881 69.98278
2.6 0.9223 98.23054 1.07782 92.45828 74.17275 65.11286
3.0 2.87289 105.60321 0.35072 88.26661 71.37264 61.09487
3.4 1.92011 112.95627 0.14985 83.63287 68.60991 58.20625
3.8 1.95901 121.10116 0.66999 78.57994 65.07769 55.07382
4.2 1.97465 126.89466 0.90082 72.75251 62.61394 52.10201
4.6 2.87599 132.8179 1.79727 66.58571 60.6216 49.9565
5.0 2.90627 142.38246 1.79305 60.97888 57.81146 46.55716
5.4 2.13386 152.93021 1.9148 56.07191 55.20454 44.49595
5.8 1.68103 163.82592 -0.03691 51.57571 50.75501 41.16199
6.2 1.14521 173.26803 -1.09955 47.41391 46.02521 38.90269
6.6 0.75281 180.8598 -1.02288 44.4316 39.71124 35.95465
7.0 0.70713 184.81188 -1.11991 41.8295 35.86757 33.28972
7.4 0.91688 187.41371 -0.82755 39.66469 32.75227 31.10156
7.8 0.30441 189.4657 -0.08406 37.78315 30.8626 29.00895
8.2 -0.55258 190.78872 0.31044 36.577 30.04414 27.42848
8.6 0.05323 192.38962 0.22703 35.46242 28.80866 26.24891
9.0 -0.50108 193.54165 0.46548 35.04819 28.37939 25.04387
9.4 0.13591 195.8923 0.101 34.08454 26.6421 24.06979
9.8 -0.51148 197.92923 -0.30223 32.94646 25.08715 22.96219
10.2 -0.92465 198.94189 -0.61029 32.21609 22.98388 21.93636
10.6 -0.62784 199.83314 -0.80698 30.95749 21.81781 21.15506
11.0 -1.08309 200.81919 -1.00407 29.21955 21.38561 20.53927
11.4 -0.39666 200.65357 -1.17452 28.09977 21.40893 19.83784
11.8 0.51653 201.17197 -0.75906 26.48849 21.34904 19.41041
12.2 0.02782 202.43945 -0.70997 25.04942 21.36397 18.56438
12.6 0.20178 203.02317 -0.29947 23.77788 21.20749 17.99899
13.0 0.5486 204.86398 0.27247 23.00731 20.39185 17.60073
13.4 1.09094 206.58 -0.06294 21.88862 18.57848 17.08691
13.8 0.41325 207.94028 0.09637 21.46939 17.74575 16.32777
14.2 0.41876 208.58629 0.12872 20.9159 16.46054 16.1164
14.6 0.8901 208.93202 0.10979 20.49405 15.07657 15.62763
15.0 1.48626 208.62777 0.37148 20.63294 14.29358 15.47681
15.4 1.55191 208.24264 -0.16137 19.61697 13.48759 14.4975
15.8 1.39624 207.44618 0.17807 19.03554 13.16945 13.99859
16.2 1.43042 206.97308 -0.3059 18.2308 13.15858 13.48307
16.6 1.75453 206.98923 -0.67067 17.74423 13.11373 12.94531
17.0 0.97211 207.43983 -0.64406 16.64297 13.15225 12.50965
17.4 1.26137 208.16621 -0.55561 16.35516 12.98692 11.97992
17.8 0.89347 208.37342 0.22401 15.70425 12.81544 11.30788
18.2 0.00849 208.68239 0.51707 15.31301 12.41402 11.01524
18.6 -0.26083 208.88727 1.25585 15.11514 12.07646 10.75559
19.0 0.6502 209.08238 0.78108 14.7304 11.17252 10.38881
19.4 0.25784 209.52073 0.61436 15.17318 10.61801 10.12049
19.8 0.38289 209.22013 0.03074 14.7229 9.92557 9.74078
