0.12500 0.01708
0.37500 0.02767
0.62500 0.06395
0.87500 0.09904
1.12500 0.14552
1.37500 0.16117
1.62500 0.20152
1.87500 0.21983
2.12500 0.24489
2.37500 0.26379
2.62500 0.30794
2.87500 0.33101
3.12500 0.37301
3.37500 0.38094
3.62500 0.39717
3.87500 0.42395
4.12500 0.45959
4.37500 0.46626
4.62500 0.48054
4.87500 0.44567
5.12500 0.43292
5.37500 0.42064
5.62500 0.37690
5.87500 0.37529
6.12500 0.35472
6.37500 0.34933
6.62500 0.35644
6.87500 0.32830
7.12500 0.31206
7.37500 0.28479
7.62500 0.24744
7.87500 0.19106
8.12500 0.18831
8.37500 0.13071
8.62500 0.15815
8.87500 0.13707
9.12500 0.06723
9.37500 0.08152
9.62500 0.02487
9.87500 0.02142
10.12500 0.02831
10.37500 0.02519
10.62500 0.02076
10.87500 0.03227
11.12500 0.01445
11.37500 0.01875
11.62500 0.04866
11.87500 0.03048
12.12500 0.05126
12.37500 0.05144
12.62500 0.02208
12.87500 0.04301
13.12500 0.03576
13.37500 0.02128
13.62500 0.05437
13.87500 0.04936
14.12500 0.04209
14.37500 0.06391
14.62500 0.10762
14.87500 0.08512
15.12500 0.13548
15.37500 0.13416
15.62500 0.08692
15.87500 0.13737
16.12500 0.13210
16.37500 0.14993
16.62500 0.13032
16.87500 0.13050
17.12500 0.09937
17.37500 0.09975
17.62500 0.06080
17.87500 0.11891
18.12500 0.06553
18.37500 0.09216
18.62500 0.05193
18.87500 0.08193
19.12500 0.02477
19.37500 0.03490
19.62500 0.05978
19.87500 0.02275
