0.120000 1.115070
0.380000 -0.053570
0.620000 1.041030
0.880000 1.607760
1.120000 0.851470
1.380000 0.861930
1.620000 0.815650
1.880000 0.954280
2.120000 1.024990
2.380000 1.070750
2.620000 1.124630
2.880000 1.179950
3.120000 1.289500
3.380000 1.337780
3.620000 1.245340
3.880000 1.182400
4.120000 1.205620
4.380000 1.310830
4.620000 1.283450
4.880000 0.987740
5.120000 0.794250
5.380000 0.682190
5.620000 0.882530
5.880000 0.488510
6.120000 0.481820
6.380000 0.846730
6.620000 0.498860
6.880000 0.057490
7.120000 -0.038600
7.380000 0.096310
7.620000 -0.649570
7.880000 -0.127120
8.120000 -0.842290
8.380000 -1.048070
8.620000 -0.894570
8.880000 -1.205490
9.120000 -2.154720
9.380000 -1.291770
9.620000 -0.987760
9.880000 -0.926290
10.120000 -0.075270
10.380000 -0.086380
10.620000 0.119850
10.880000 -0.201030
11.120000 0.130400
11.380000 -0.109560
11.620000 0.043270
11.880000 -0.704680
12.120000 -0.690790
12.380000 -1.117430
12.620000 -1.419710
12.880000 -1.546440
13.120000 -0.943470
13.380000 -1.992190
13.620000 -1.670800
13.880000 -2.444330
14.120000 -2.203230
14.380000 -2.078400
14.620000 -2.297290
14.880000 -2.179290
