0.120000 -3.016710
0.380000 -2.324550
0.620000 -1.066970
0.880000 1.073200
1.120000 1.717840
1.380000 1.084130
1.620000 1.026490
1.880000 0.287280
2.120000 0.663650
2.380000 0.393580
2.620000 0.386320
2.880000 0.438790
3.120000 0.408370
3.380000 0.564080
3.620000 0.370740
3.880000 0.285590
4.120000 0.479950
4.380000 0.315770
4.620000 0.529550
4.880000 -0.377040
5.120000 -0.634470
5.380000 -0.857740
5.620000 -1.568350
5.880000 -1.722790
6.120000 -1.331130
6.380000 -0.698960
6.620000 1.051700
6.880000 0.286030
7.120000 0.157340
7.380000 0.106020
7.620000 0.287730
7.880000 0.210210
8.120000 -0.459820
8.380000 -0.788900
8.620000 -0.491890
8.880000 -1.724240
9.120000 -0.473240
9.380000 -1.459420
9.620000 -0.691080
9.880000 0.051740
10.120000 -1.899250
10.380000 -0.112780
10.620000 2.246350
10.880000 2.624130
11.120000 2.867620
11.380000 2.830990
11.620000 2.719030
11.880000 2.919050
12.120000 -2.939120
12.380000 2.819650
12.620000 -2.778530
12.880000 -0.875700
13.120000 -1.510290
13.380000 -2.149920
13.620000 2.095210
13.880000 -2.161180
14.120000 -0.267610
14.380000 -2.822020
14.620000 -2.686700
14.880000 -2.716080
