0.12500 0.01743
0.37500 0.06302
0.62500 0.13702
0.87500 0.21136
1.12500 0.26716
1.37500 0.30036
1.62500 0.32972
1.87500 0.35669
2.12500 0.37819
2.37500 0.39321
2.62500 0.40474
2.87500 0.41035
3.12500 0.41678
3.37500 0.41683
3.62500 0.40937
3.87500 0.40017
4.12500 0.38951
4.37500 0.35082
4.62500 0.32022
4.87500 0.26320
5.12500 0.20001
5.37500 0.16200
5.62500 0.12842
5.87500 0.11878
6.12500 0.10109
6.37500 0.08297
6.62500 0.07186
6.87500 0.05179
7.12500 0.02915
7.37500 0.01412
7.62500 0.02652
7.87500 0.05142
8.12500 0.06696
8.37500 0.07492
8.62500 0.08044
8.87500 0.06629
9.12500 0.07508
9.37500 0.04399
9.62500 0.04784
9.87500 0.02745
10.12500 0.02952
10.37500 0.04929
10.62500 0.05152
10.87500 0.06613
11.12500 0.08612
11.37500 0.10938
11.62500 0.13477
11.87500 0.14904
12.12500 0.14523
12.37500 0.10886
12.62500 0.10621
12.87500 0.08508
13.12500 0.05774
13.37500 0.05047
13.62500 0.02570
13.87500 0.06182
14.12500 0.09292
14.37500 0.11311
14.62500 0.16436
14.87500 0.14212
