0.450000 -3.005650
1.350000 -3.025050
2.250000 -3.020550
3.150000 -3.004680
4.050000 -2.978350
4.950000 -2.964480
5.850000 -2.984860
6.750000 -2.981930
7.650000 -2.997840
8.550000 -3.107760
9.450000 -3.067960
10.350000 3.072070
11.250000 2.980150
12.150000 -2.706930
13.050000 -2.735340
13.950000 -2.925700
14.850000 2.925350
15.750000 3.097930
16.650000 2.832950
17.550000 1.087680
