0.120000 1.265520
0.380000 1.191600
0.620000 1.198970
0.880000 1.137140
1.120000 1.145500
1.380000 1.142470
1.620000 1.130630
1.880000 1.187110
2.120000 1.208230
2.380000 1.283080
2.620000 1.242830
2.880000 1.225860
3.120000 1.187310
3.380000 1.176550
3.620000 1.199350
3.880000 1.169930
4.120000 1.180320
4.380000 1.216120
4.620000 1.036280
4.880000 1.057450
5.120000 1.046510
5.380000 0.986730
5.620000 0.497500
5.880000 0.931330
6.120000 0.431520
6.380000 0.442900
6.620000 0.139390
6.880000 0.083830
7.120000 0.082690
7.380000 0.033300
7.620000 -0.289700
7.880000 -0.203610
8.120000 -0.543750
8.380000 -0.777580
8.620000 -0.907830
8.880000 -0.730730
9.120000 -1.002490
9.380000 -1.245120
9.620000 -1.170020
9.880000 -1.248590
10.120000 -1.685170
10.380000 -2.308480
10.620000 -2.375780
10.880000 -3.123370
11.120000 2.521640
11.380000 2.156930
11.620000 2.569880
11.880000 1.985960
12.120000 1.573800
12.380000 1.230740
12.620000 0.912110
12.880000 1.299910
13.120000 0.619340
13.380000 -1.298880
13.620000 -1.120740
13.880000 -0.855820
14.120000 -0.841520
14.380000 -1.377910
14.620000 -1.921590
14.880000 -1.957410
