0.26 0.33835 30.67639 0.04588
0.51 1.03826 91.0995 0.04257
0.77 1.2484 108.78041 0.04075
1.02 1.40505 118.77715 0.03808
1.28 1.39273 112.78934 0.03533
1.54 1.47746 117.43038 0.0332
1.79 1.36904 106.3686 0.03157
2.05 1.45398 105.75881 0.02866
2.31 1.37249 99.91091 0.02769
2.56 1.41756 97.8917 0.02561
2.82 1.38143 92.83333 0.024
3.08 1.36902 88.36423 0.02264
3.33 1.38849 85.91882 0.02088
3.59 1.32657 79.67482 0.01978
3.84 1.39291 80.75043 0.01857
4.1 1.41071 78.47945 0.01737
4.36 1.34722 73.14723 0.01629
4.61 1.37752 71.83914 0.01529
4.87 1.38297 68.83359 0.0142
5.12 1.42773 69.75045 0.01344
5.38 1.39572 63.94069 0.01238
5.64 1.42219 64.32199 0.01184
5.89 1.46706 63.53053 0.01107
6.15 1.42902 58.44032 0.01014
6.41 1.51265 60.63064 0.00966
6.66 1.48624 57.08672 0.00896
6.92 1.53903 56.82596 0.00843
7.17 1.49657 54.11095 0.00804
7.43 1.50748 52.16306 0.00746
7.69 1.62516 53.84342 0.00696
7.94 1.52581 48.55137 0.00649
8.2 1.65492 50.82433 0.00607
8.46 1.67156 49.11244 0.00571
8.71 1.57292 45.04205 0.00536
8.97 1.72207 47.07436 0.005
9.22 1.74213 45.18324 0.00462
9.48 1.70835 43.61586 0.00447
9.74 1.86941 44.71332 0.00403
9.99 1.69777 40.19902 0.00387
