0.1875 -1.83188 13.71555 -1.67592 125.89524 124.3978 101.05455
0.5625 -1.37021 32.75946 -0.05076 126.27299 118.07954 95.8077
0.9375 0.54771 55.48656 -1.00272 122.6962 108.33909 89.37619
1.3125 0.3139 65.7833 1.36946 120.21316 99.27501 82.85443
1.6875 -0.12407 73.64568 0.89797 116.20938 92.19933 77.03393
2.0625 -0.63989 78.44515 0.28748 113.30563 86.74894 73.07834
2.4375 1.59265 81.48 0.30628 109.62192 81.85079 69.99613
2.8125 -1.55519 84.19368 0.22007 105.3143 77.70886 65.80144
3.1875 -1.3166 88.1417 0.27077 102.45011 74.62035 62.46116
3.5625 0.4342 90.84595 0.63476 99.62904 71.92343 60.01154
3.9375 -2.49027 94.51687 0.17498 93.32896 69.71662 57.64957
4.3125 -2.57885 103.40738 -0.24428 91.04648 68.98116 54.84625
4.6875 1.28446 108.49223 0.35333 85.54057 67.43707 53.16899
5.0625 -0.89928 118.43785 -0.25795 79.86921 68.05943 50.96729
5.4375 1.04451 127.16982 -1.44746 74.60524 65.62136 47.9636
5.8125 0.15235 134.50765 -0.10549 67.03178 64.23021 44.53504
6.1875 1.28774 145.41007 -0.39347 60.41025 61.26882 42.02054
6.5625 0.59794 152.91807 -0.16458 54.59962 58.96329 39.32602
6.9375 1.16904 162.37517 -0.08002 48.92438 55.14424 35.73853
7.3125 1.07717 170.39232 0.22582 44.27137 49.96681 32.51451
7.6875 -0.05719 176.77374 1.2254 40.25414 44.0482 30.50133
8.0625 0.55568 181.91105 1.26723 37.05134 38.66294 28.95726
8.4375 -0.09934 186.25116 1.54676 34.99239 33.34363 26.76585
8.8125 0.07321 189.53103 0.88764 34.31945 29.17478 25.58084
9.1875 -0.44912 193.5538 0.84895 32.98518 27.52415 24.95785
9.5625 0.19037 194.96486 0.52336 31.85846 25.75024 23.43059
9.9375 0.00392 197.89315 0.50089 30.81051 24.98027 22.49317
10.3125 0.81838 197.86631 -0.10473 30.02437 24.40406 21.97005
10.6875 -0.44755 199.80014 0.24575 28.88632 23.53664 21.65123
11.0625 0.78385 200.49292 -0.24184 28.63619 22.39283 21.35389
11.4375 0.72759 201.28725 -0.81208 27.84003 20.39732 20.3732
11.8125 -0.13393 201.13462 -1.5407 26.87073 19.67139 19.83467
12.1875 -0.67675 200.66752 -1.12736 26.56376 18.76069 18.38567
12.5625 -0.4669 199.89385 -1.83641 25.97453 18.7186 18.23591
12.9375 -0.48581 200.93675 -2.91383 24.20183 18.40952 17.81488
13.3125 -0.18214 200.38834 -2.48585 23.91801 17.86513 17.40851
13.6875 -0.30769 200.39495 -2.11469 23.00666 17.9123 17.10418
14.0625 -1.83861 202.01391 -1.97502 21.27294 16.82831 16.72001
14.4375 -1.36053 202.5954 -2.86748 21.3178 16.40701 16.1601
14.8125 -1.27489 201.70912 -2.84408 21.15526 16.42828 15.41468
15.1875 -0.90908 202.25228 -3.2881 20.15236 15.9993 15.27197
15.5625 -2.18893 203.50043 -1.85218 19.55676 15.61198 15.31853
15.9375 -1.86039 204.34014 -2.20451 19.62945 15.55748 14.96196
16.3125 -0.19707 204.63771 -1.59617 18.11463 15.41001 15.0461
16.6875 -0.85838 205.40619 0.18039 18.17569 15.04124 14.63713
17.0625 -0.43433 207.81523 -0.64415 18.7467 13.48251 13.84969
17.4375 1.80668 206.73468 -1.2358 18.18154 12.86029 13.31247
17.8125 0.39233 206.39371 -0.92981 17.28741 12.22111 13.64055
18.1875 0.38319 205.12396 -1.10506 17.1513 10.53607 13.35553
18.5625 2.59363 204.92404 -2.04297 16.81135 10.73215 13.02249
18.9375 0.39826 203.55981 -0.39995 16.30232 9.34074 12.85221
19.3125 0.12947 202.34788 -1.32368 16.21118 10.02444 13.52643
19.6875 0.51362 201.19183 -1.9972 17.15031 9.93225 12.54837
20.0625 -0.77142 201.1482 -0.51786 15.34551 11.52114 12.61466
20.4375 -0.8099 199.39903 -0.43722 13.82674 12.19553 13.43481
20.8125 0.47659 201.01742 -0.48515 14.75528 11.96721 12.97892
21.1875 -2.19874 199.4573 -1.37071 13.73029 12.18809 12.2578
21.5625 -0.8729 202.67884 0.05845 12.61408 11.50528 11.67625
21.9375 0.11628 203.6377 0.26291 11.34906 11.12483 10.35106
22.3125 -1.69055 201.37385 -0.22229 14.47009 11.42558 11.54535
22.6875 0.52547 203.71092 -0.32827 11.73812 8.95019 10.10469
23.0625 -1.22773 202.82235 -0.8297 11.64851 9.01273 10.74076
23.4375 -0.90079 202.86954 -1.18612 13.73099 8.19775 10.4693
23.8125 -2.55437 202.82604 -0.50541 11.78522 10.01233 8.40516
24.1875 -1.51734 204.37109 0.47695 13.13682 7.37205 8.62269
24.5625 -0.67258 202.93669 -0.41198 11.82982 7.39107 8.11566
24.9375 -3.32974 203.67116 0.45368 10.25815 7.45142 8.72653
25.3125 -3.57756 201.56228 -0.71002 10.89062 7.88933 10.58267
25.6875 2.90785 203.54526 0.11169 9.89133 7.30629 9.83705
26.0625 -4.15991 201.05532 -1.87266 9.85075 9.35331 7.41153
26.4375 1.36204 203.5456 -1.87702 12.17371 6.17535 7.80404
26.8125 1.33928 198.34142 -1.31105 12.01003 7.57964 7.41153
27.1875 -1.96973 201.95748 -3.22245 9.76857 5.41424 7.77929
27.5625 -2.04848 200.88034 -4.36426 8.82726 7.13487 5.85649
27.9375 -5.06987 201.17144 -2.05565 13.66958 7.59995 7.59094
28.3125 -6.64216 201.78874 -2.13721 14.86379 8.58839 7.33997
28.6875 -3.86095 202.52941 -2.40971 10.79746 4.95646 6.1678
29.0625 -0.47549 199.15711 1.78383 9.25711 5.12883 6.64502
29.4375 1.38054 199.00044 -2.40501 10.62936 5.89623 5.2362
29.8125 -3.92991 198.92924 -2.70335 8.51455 8.73496 5.13354
