0.05000 -1174.29912 77.65245 1940.33860 1249.03062 1163.64568 1900.45924
0.15000 -2740.28031 120.54910 1677.91558 1623.36797 1328.54165 3153.75149
0.25000 -4036.35243 78.75651 567.87063 1881.83764 1439.91916 4721.49795
0.35000 -5141.13642 32.63468 755.10267 2256.49733 1790.09546 6176.75920
0.45000 -6284.84777 86.36365 497.20322 2452.38894 2045.32858 7288.69577
0.55000 -7121.69407 39.52154 398.82323 2697.14904 2243.18500 8164.15325
0.65000 -7702.65937 21.66337 270.83336 2829.26712 2397.41612 8620.09789
0.75000 -8141.70743 39.24023 157.39997 2804.83997 2485.97121 9123.11367
0.85000 -8528.65461 -24.25392 -134.42050 2952.89093 2584.91480 9287.32958
0.95000 -8821.47568 7.05717 -4.83090 2934.60864 2618.31380 9401.42600
1.05000 -9114.27080 80.92645 26.12457 2919.95561 2683.09908 9266.88055
1.15000 -9106.67697 19.44283 -236.30978 2905.00168 2644.62726 9387.67118
1.25000 -9299.01787 70.76590 92.42605 2801.01585 2655.78674 9062.11018
1.35000 -9392.76239 34.85443 -100.09097 2640.55326 2633.55457 8866.01793
1.45000 -9350.57479 13.02169 -152.53360 2577.27994 2595.91757 8674.68419
1.55000 -9381.72535 -2.66989 -117.77615 2482.87364 2558.80116 8428.48891
1.65000 -9375.06805 -15.63524 -318.58665 2405.04833 2511.45772 8112.00618
1.75000 -9407.45613 56.05809 -242.11337 2282.35035 2444.60308 7801.68768
1.85000 -9358.83926 47.33730 -286.60024 2142.01761 2420.07134 7580.02343
1.95000 -9295.46602 -16.60792 -438.12646 2064.10448 2360.91025 7365.78305
2.05000 -9196.43445 16.23945 -390.37624 2005.51521 2280.36533 7151.88345
2.15000 -9134.10445 61.51571 -371.16972 1910.01408 2236.76396 6887.90182
2.25000 -9066.98328 16.65410 -418.01500 1842.61225 2187.19120 6683.78621
2.35000 -8995.57734 21.76776 -185.44662 1762.81449 2127.86217 6425.04050
2.45000 -8895.30967 55.03295 -287.80205 1686.31494 2093.68735 6237.83657
2.55000 -8839.45298 39.10920 -251.19438 1631.72242 2037.34643 5997.92069
2.65000 -8781.05080 57.92717 -94.55204 1564.14829 1984.01634 5818.68857
2.75000 -8681.67639 82.36432 -91.70593 1535.04893 1914.31062 5673.30982
2.85000 -8650.85664 44.28466 -24.16595 1413.88775 1892.01059 5412.01028
2.95000 -8561.92895 95.40230 35.12545 1402.76241 1837.46161 5252.38150
3.05000 -8508.66724 62.45776 112.10786 1357.20034 1783.02912 5096.34128
3.15000 -8441.54963 84.39424 197.15162 1342.70514 1722.77888 4949.40147
3.25000 -8327.18773 67.33335 232.68862 1325.31133 1669.08919 4869.39358
3.35000 -8273.46956 33.31469 233.23800 1272.85171 1605.23577 4660.72977
3.45000 -8195.41829 -23.52242 279.48544 1216.70415 1557.77343 4457.36772
3.55000 -8087.26520 -50.23715 186.34579 1205.85465 1517.50266 4364.36077
3.65000 -7963.79553 -64.87195 221.26784 1169.08930 1439.56748 4221.83954
3.75000 -7816.95136 -18.07420 228.72724 1142.03840 1379.94328 4150.92694
3.85000 -7723.13643 -21.34707 267.93444 1081.43436 1341.12880 4027.22496
3.95000 -7631.24064 5.26014 256.21205 1055.74062 1286.44350 3901.84303
4.05000 -7534.42229 38.54021 351.81839 1014.47774 1213.53478 3760.58643
4.15000 -7439.04960 50.64616 320.39125 949.16846 1178.15900 3686.54953
4.25000 -7384.01590 98.07478 235.34679 938.35613 1117.67589 3541.53272
4.35000 -7334.65036 99.34539 186.71349 956.10669 1076.68537 3390.60972
4.45000 -7269.81155 134.42744 257.85362 905.77309 1029.92772 3239.16571
4.55000 -7162.25681 105.46604 201.47067 931.29797 971.40910 3218.19373
4.65000 -7106.08739 139.87814 268.79115 911.12181 938.13043 3125.57860
4.75000 -7061.04996 114.04244 196.67503 890.78431 901.91761 3040.38219
4.85000 -6986.59092 93.00137 208.51872 890.91250 858.05263 2939.77321
4.95000 -6908.54287 85.45228 114.61869 898.15041 809.87063 2843.33256
5.05000 -6843.01736 53.71404 258.19738 904.91309 769.92090 2788.90703
5.15000 -6774.52592 22.22281 104.14854 897.62755 726.38779 2624.47254
5.25000 -6646.64651 14.86372 85.08399 863.41808 684.68221 2574.67136
5.35000 -6532.27683 -16.91475 -12.23021 851.14347 629.99824 2470.16072
5.45000 -6463.35589 -24.68479 -54.98476 827.89985 599.99857 2379.01078
5.55000 -6357.47705 -35.87139 -3.63484 803.28489 561.21536 2303.35113
5.65000 -6245.77748 -33.96265 -86.01077 791.91653 525.62924 2238.29391
5.75000 -6173.06233 -36.14768 -88.74217 776.97237 483.90717 2141.83299
5.85000 -6061.00599 -35.52754 -68.15447 761.88679 455.64061 2094.14807
5.95000 -5961.56869 -40.83572 -108.25579 733.43682 421.69324 2051.84472
6.05000 -5873.78632 -32.74162 -65.09872 721.51850 389.83114 1981.37897
6.15000 -5780.02230 -21.58709 -13.12430 677.25887 366.49977 1912.43230
6.25000 -5689.45653 -16.24011 -132.14131 635.03410 340.93768 1869.42159
6.35000 -5618.11811 -7.79064 -42.17113 602.06693 321.42865 1815.70802
6.45000 -5555.29932 -10.73691 -134.99343 572.20029 302.03103 1764.70562
6.55000 -5493.64743 -9.45299 -115.50148 547.88477 285.33596 1715.16228
6.65000 -5409.01351 12.62879 -119.51580 496.64228 265.55783 1692.39067
6.75000 -5359.76104 3.66513 -42.25312 463.02031 250.51602 1636.52806
6.85000 -5309.46020 6.79742 8.25070 420.99689 236.58438 1617.05905
6.95000 -5293.63240 16.34779 -39.82266 394.88741 230.91556 1565.89906
7.05000 -5255.17480 14.59557 -47.35176 367.41996 217.24506 1517.15562
7.15000 -5216.26377 16.03942 -37.53120 337.53711 210.26896 1512.01219
7.25000 -5202.82323 13.02466 3.06288 322.51954 199.42070 1461.03019
7.35000 -5171.27710 20.26949 9.51798 299.98902 193.81712 1436.34667
7.45000 -5143.70840 20.44098 -3.24781 278.78546 185.99411 1410.34370
7.55000 -5125.20509 24.28520 -7.21186 277.04245 180.20909 1362.63933
7.65000 -5093.63748 22.91659 10.62833 262.41815 174.89926 1344.58442
7.75000 -5068.02863 26.28201 -15.11088 266.31041 164.01126 1339.51389
7.85000 -5041.74634 28.14399 -8.08558 248.97530 166.89685 1299.82752
7.95000 -5022.12680 25.63506 30.20903 245.99681 158.74765 1263.85500
8.05000 -4992.56010 26.52078 0.81174 230.99011 154.67282 1240.87774
8.15000 -4971.66194 26.01429 -4.85984 222.24083 150.35053 1222.33512
8.25000 -4952.87192 24.37173 -14.78299 218.11036 153.98297 1195.16312
8.35000 -4927.43346 27.81833 20.41729 219.87142 148.65533 1169.56853
8.45000 -4902.69703 31.72380 -6.72935 212.17602 139.58777 1144.31725
8.55000 -4872.76934 27.85443 0.50115 207.69140 144.93040 1146.98273
8.65000 -4847.25283 26.99989 -11.93844 202.11228 146.81954 1112.53530
8.75000 -4818.80270 27.49447 9.84698 198.62517 140.69546 1083.67440
8.85000 -4800.05954 26.10407 -2.12178 186.84576 138.04766 1058.13071
8.95000 -4771.28814 25.29834 14.02570 183.98263 138.42921 1019.02367
9.05000 -4735.04668 23.88795 -17.25264 179.40202 135.81576 1023.20592
9.15000 -4706.44915 27.81083 -13.96252 174.21657 130.01481 1004.62394
9.25000 -4682.63547 23.93772 13.80939 185.96992 131.93019 977.92599
9.35000 -4650.55374 24.66718 3.32456 171.29363 131.31517 965.50431
9.45000 -4617.90828 23.76325 -6.73345 170.83900 127.40857 951.31648
9.55000 -4596.30044 22.64778 24.02365 162.20760 123.72461 921.79797
9.65000 -4563.41555 23.40881 19.60160 165.71231 123.97115 893.79269
9.75000 -4531.64645 20.14931 -19.80518 164.23617 126.19965 879.93206
9.85000 -4500.21100 24.98877 -1.36009 170.03095 128.23248 863.52723
9.95000 -4469.28954 26.31661 -2.39571 160.44035 121.90955 852.29235
10.05000 -4440.22387 22.86900 12.11429 163.60217 115.87066 816.70970
10.15000 -4406.90816 21.19848 2.33961 165.52977 116.17899 815.92875
10.25000 -4372.16852 22.09991 -4.54429 150.58899 112.84258 804.94011
10.35000 -4337.12408 20.90587 -9.24176 145.30457 111.54765 791.66903
10.45000 -4295.62836 23.20929 -8.48598 144.91455 112.22488 773.85581
10.55000 -4266.95578 21.77497 -5.75312 139.93842 103.30377 767.80836
10.65000 -4232.81274 23.54395 0.80714 139.47547 113.06450 724.45566
10.75000 -4201.13473 23.48160 -7.14894 138.43361 103.32982 721.95371
10.85000 -4169.95827 22.33890 -40.46356 140.80085 109.65402 719.66100
10.95000 -4136.71156 24.50484 -16.07534 138.15748 104.47588 709.70875
11.05000 -4103.94307 24.41191 11.45671 131.50397 100.64806 691.87700
11.15000 -4080.15041 18.41894 -10.75858 138.97813 101.72114 672.43187
11.25000 -4055.89032 18.04301 1.17001 135.15373 95.80538 654.46483
11.35000 -4022.43223 18.48413 -7.40851 139.29583 92.44587 651.23918
11.45000 -3990.34169 18.36646 2.13349 135.55682 93.51189 632.48276
11.55000 -3962.15989 19.73655 7.68595 131.78447 92.85073 621.66684
11.65000 -3931.39347 15.63352 -12.03490 131.46230 91.28372 612.91016
11.75000 -3907.30255 17.58710 6.44327 122.90876 94.01016 592.15776
11.85000 -3883.14594 16.74355 -11.30779 125.26841 88.96109 581.01629
11.95000 -3858.81624 16.96613 5.54458 118.92107 87.37027 569.94942
12.05000 -3825.41119 17.35801 16.36458 122.18946 83.45581 563.94308
12.15000 -3802.49142 15.58773 8.19312 118.61918 91.29915 565.16316
12.25000 -3782.01504 14.40599 -7.90011 116.41659 87.99014 538.93864
12.35000 -3757.39485 17.81132 -9.06249 114.88387 79.12111 527.66886
12.45000 -3729.96686 15.91558 14.20769 115.88294 78.09397 519.42988
12.55000 -3700.36242 14.79356 -1.96519 107.12645 81.07856 511.74653
12.65000 -3678.34632 11.68949 -0.00209 105.61592 82.37256 496.55786
12.75000 -3653.79149 15.42325 -0.35263 101.80425 70.53896 494.40485
12.85000 -3631.98164 14.24960 -10.17203 103.37308 75.70350 478.64341
12.95000 -3607.53104 13.82126 -3.52779 98.50455 73.52396 467.53177
13.05000 -3577.84619 14.48863 8.05447 97.79029 71.27928 479.69164
13.15000 -3553.06460 12.11056 7.37573 90.28077 68.57900 454.60122
13.25000 -3528.76399 12.63618 -7.00633 96.95281 76.81784 450.62699
13.35000 -3505.51513 15.46468 -10.59894 85.99078 67.86300 439.28383
13.45000 -3486.16265 12.23971 0.37987 87.86486 70.69297 427.44369
13.55000 -3456.33717 10.08203 5.46840 88.21485 70.08389 430.57892
13.65000 -3434.65877 9.95846 -11.08021 83.78363 72.32267 413.67936
13.75000 -3412.02459 10.19100 -3.12204 82.93899 68.30971 411.32493
13.85000 -3388.82754 10.41433 -13.94205 83.98326 75.21658 394.25173
13.95000 -3363.66056 10.00883 1.26236 86.45668 64.71146 399.81569
14.05000 -3339.55196 13.38779 5.36484 89.41674 69.51339 391.93953
14.15000 -3310.71547 13.20225 -7.81267 86.59248 69.13457 398.00390
14.25000 -3289.75383 10.44661 -5.42712 83.53776 60.59267 381.85675
14.35000 -3270.23180 10.25324 -10.83035 78.87688 62.90832 375.54692
14.45000 -3245.13481 10.51502 -2.20221 82.33866 71.72309 376.68833
14.55000 -3221.62632 13.78313 -3.72664 85.57050 62.40117 371.34631
14.65000 -3205.00777 10.71988 -0.39972 76.71598 63.72584 354.71652
14.75000 -3181.36992 8.46882 -10.93459 77.15258 60.20040 352.04063
14.85000 -3163.26042 11.05593 -9.03785 81.73080 60.92042 350.30119
14.95000 -3137.95895 11.96470 -14.67270 80.29801 68.15609 344.64448
15.05000 -3116.68267 8.39609 15.61728 76.33974 60.09790 332.32945
15.15000 -3097.71386 9.14421 3.53188 78.78030 61.32324 334.27951
15.25000 -3077.88058 10.01469 -5.37494 77.36602 57.31699 335.70710
15.35000 -3056.28004 9.77317 -4.87646 71.51982 61.57764 331.84956
15.45000 -3041.51821 9.28182 -0.02336 72.27267 57.66356 317.06809
15.55000 -3014.96064 12.78660 1.00728 69.99424 59.69264 320.14016
15.65000 -2999.93461 9.17296 0.43174 77.24215 52.68726 313.03368
15.75000 -2981.26931 9.95488 -15.08183 71.67925 63.67823 311.72281
15.85000 -2962.24331 9.14381 8.01134 68.89755 59.00926 311.54892
15.95000 -2944.83492 10.37032 -2.70333 66.67425 58.17577 299.24974
16.05000 -2925.90580 8.79564 0.22473 61.52161 48.68220 302.29756
16.15000 -2906.67911 11.99700 14.83608 68.04593 55.12209 294.62618
16.25000 -2891.59534 10.43679 -2.79753 65.81061 56.20597 295.49282
16.35000 -2873.62008 11.33506 4.17132 75.54865 58.67769 283.20157
16.45000 -2856.19232 9.85267 2.29191 61.61272 51.16535 287.05814
16.55000 -2842.58023 8.17907 14.71171 60.71744 50.99891 271.89540
16.65000 -2822.88434 10.82119 1.54540 69.37904 55.17724 267.92571
16.75000 -2805.86103 9.71757 -7.35583 62.77337 44.03569 265.22495
16.85000 -2792.91968 9.59683 -11.03919 70.15098 57.31816 262.47291
16.95000 -2777.08346 10.07835 6.70505 56.49908 54.53168 249.11233
17.05000 -2762.85717 7.59448 15.22479 68.51557 60.73037 257.22777
17.15000 -2745.57372 7.42912 -2.49452 64.45211 51.65810 257.01344
17.25000 -2727.83060 12.15431 -11.54763 67.19922 51.46621 252.21876
17.35000 -2714.69707 10.08226 12.02856 55.11606 57.24377 241.08788
17.45000 -2700.53919 8.78791 4.58982 64.89094 50.11980 241.45648
17.55000 -2688.71876 9.75580 -7.97817 63.09508 48.65963 225.94271
17.65000 -2669.19084 8.39960 -3.04082 55.41354 50.75093 228.26201
17.75000 -2654.17965 5.94801 -8.72381 49.12780 44.36424 221.59144
17.85000 -2640.17343 8.20855 2.78819 54.54895 48.31116 217.64470
17.95000 -2622.82131 9.63676 1.26550 52.97008 44.57090 221.17256
18.05000 -2604.60662 7.41786 -5.70129 47.91928 37.15403 212.12505
18.15000 -2587.53578 7.93240 0.89353 49.20836 45.58826 217.31754
18.25000 -2575.90384 8.15516 1.74384 66.15071 43.76871 205.09153
18.35000 -2558.50608 6.70539 13.29688 57.41805 51.29752 208.27858
18.45000 -2543.96322 5.12495 -4.02586 54.89708 41.97879 199.69612
18.55000 -2529.40133 6.92607 -1.94411 43.49319 42.09544 190.93901
18.65000 -2513.89256 5.54612 -8.02750 52.59340 56.01324 190.69783
18.75000 -2498.31089 4.12696 6.10898 48.81059 43.24372 193.97592
18.85000 -2485.47872 6.02658 3.09460 54.84000 55.25658 181.69095
18.95000 -2474.87113 6.42899 -3.65250 54.26141 42.31068 187.40653
19.05000 -2458.25594 4.97159 7.49767 52.81774 37.62466 182.93923
19.15000 -2442.65411 5.04137 10.30029 58.04768 45.87480 173.47272
19.25000 -2427.63940 3.53020 5.70234 50.60998 46.11180 176.86200
19.35000 -2412.86103 7.28808 8.34433 47.09845 42.07218 168.78725
19.45000 -2397.82175 3.34369 5.24268 48.41020 36.82740 165.13659
19.55000 -2388.39422 7.00720 8.36896 52.21003 50.07335 166.29096
19.65000 -2378.68756 7.24135 3.69739 37.78380 40.63560 155.10903
19.75000 -2364.45375 7.59883 0.49062 39.99825 37.33337 150.63119
19.85000 -2349.20164 6.28230 -9.17411 55.39691 62.04155 158.10741
19.95000 -2336.50699 6.68062 -6.62962 44.59422 32.27177 154.33304
