0.1875 -0.70505 17.628 -0.12827 108.79865 107.11278 93.48744
0.5625 -1.12019 39.61973 0.25031 106.78735 99.37977 86.18087
0.9375 -1.12206 58.3081 0.34977 102.44406 91.39751 80.8281
1.3125 -1.19025 72.79819 -0.21239 98.55998 84.23945 76.05893
1.6875 -0.45374 82.05035 0.19283 94.4215 79.28745 72.40296
2.0625 -0.46111 88.36559 -0.33013 89.69516 75.64369 69.27145
2.4375 -1.69272 95.20383 1.06411 85.11549 72.50369 67.21219
2.8125 -0.94994 102.7158 1.57871 80.02056 69.81616 64.34654
3.1875 -1.75242 112.97326 0.31165 75.35518 67.76235 61.60165
3.5625 -0.74508 122.6407 0.47111 71.58227 65.06696 58.64023
3.9375 -1.91315 134.54514 0.36649 66.99291 62.14315 54.6115
4.3125 -0.40472 145.31552 -0.0097 62.66682 59.10498 51.30875
4.6875 -0.98244 154.86483 0.35985 58.69026 54.30942 47.72146
5.0625 -0.4765 162.32696 0.12615 53.95131 49.15293 45.02317
5.4375 0.29201 167.95888 0.37094 50.73019 45.65426 43.0071
5.8125 0.29992 173.59216 0.16439 47.89838 42.7479 40.41596
6.1875 0.48151 179.3115 -0.09867 45.3362 40.49392 38.49968
6.5625 -0.11537 183.67213 0.10901 43.68411 37.65485 36.94159
6.9375 -0.24382 187.3957 -0.4735 42.49882 35.66311 35.04266
7.3125 -0.22243 190.67127 -0.26979 40.69187 33.52304 33.71978
7.6875 -0.15913 192.86319 -0.23053 39.41324 32.46795 32.05707
8.0625 -0.34866 195.50074 -0.69308 38.45571 31.60599 30.69023
8.4375 -0.01612 197.68907 -0.64082 36.86679 30.62719 29.54813
8.8125 0.44855 199.7865 -0.6895 35.13724 29.52446 28.42418
9.1875 0.45552 201.73006 -0.46154 34.18914 28.92959 27.43315
9.5625 0.00923 203.87625 -0.29814 32.74596 27.4497 26.16907
9.9375 0.06889 205.59952 -0.37079 32.00141 26.46672 25.05391
10.3125 0.46755 206.85566 -0.45345 30.71246 25.78562 24.49738
10.6875 0.04684 208.32439 -0.93272 29.91164 24.81577 23.28357
11.0625 -0.46147 209.59676 -0.05446 28.94253 23.76533 22.65964
11.4375 -0.16444 210.3886 -0.28944 28.02433 22.67701 21.96222
11.8125 -0.78282 211.42316 -0.09737 27.20161 21.93455 21.09817
12.1875 -0.42189 212.04338 -0.53109 26.67839 20.90002 20.59562
12.5625 -0.46529 213.11113 -0.23558 26.05657 20.33195 19.63995
12.9375 -0.9255 213.48932 0.03858 24.77765 19.43515 19.07519
13.3125 -0.8049 213.65061 0.17321 24.91059 19.21746 18.68122
13.6875 -1.03678 214.15192 0.01266 23.52392 18.14213 18.27507
14.0625 -1.12563 214.28299 0.03308 23.34046 16.90198 17.74515
14.4375 -1.42401 214.18646 0.36028 23.12261 16.51291 16.9514
14.8125 -0.40584 214.21706 -0.09006 22.2312 15.94883 16.75833
15.1875 -0.14978 213.55688 -0.08308 22.05233 15.11573 16.52902
15.5625 -0.62306 212.75672 0.00139 21.33073 15.05928 15.8377
15.9375 -0.60194 212.88344 -0.53146 20.80137 14.57118 15.36069
16.3125 -0.25132 212.30082 0.24265 20.55839 14.67005 14.99607
16.6875 -0.278 212.16838 -0.6117 19.78056 14.91684 14.57755
17.0625 -0.01008 212.46135 -0.47433 19.51821 14.30127 14.04533
17.4375 0.26401 212.30208 -0.29419 18.91575 14.29125 13.58219
17.8125 0.49127 212.53382 -0.00749 17.93212 13.92293 13.18571
18.1875 0.38688 212.76156 -0.31474 18.03436 13.53731 12.90509
18.5625 0.53282 212.67829 0.09182 17.32729 13.23993 12.20255
18.9375 0.49615 212.68302 0.15012 17.26844 12.63596 12.01621
19.3125 1.43739 213.19811 0.46878 16.91742 12.31284 11.96564
19.6875 0.72332 213.30914 0.19813 16.68232 11.8655 11.40547
20.0625 1.28032 212.15474 0.55624 16.48143 11.98662 11.33032
20.4375 0.82138 212.48611 0.42667 15.91832 10.95698 10.98549
20.8125 1.0573 212.22787 0.32828 15.4967 10.92663 10.65235
21.1875 0.33327 212.3221 0.65591 15.53013 10.54485 10.49045
21.5625 0.08271 211.82463 0.46422 14.77098 10.63785 9.83611
21.9375 0.28581 211.41886 0.1937 14.56259 10.49878 10.09125
22.3125 0.58322 210.97985 0.04382 13.79608 10.08208 9.392
22.6875 0.68754 210.79387 0.30651 14.01639 10.04985 9.69046
23.0625 0.05744 210.67237 -0.13776 13.44017 9.67901 9.02228
23.4375 0.77717 210.47827 0.55963 13.2621 9.12365 9.19686
23.8125 0.1819 210.74348 0.23215 12.78747 8.6731 9.15206
24.1875 -0.69142 209.89316 0.32257 12.2617 8.90645 8.90285
24.5625 -0.04078 209.38676 -0.12639 12.05954 8.68656 8.41124
24.9375 -0.30145 209.38326 -0.09916 11.15343 8.48463 8.78831
25.3125 -0.37791 208.93523 0.29723 11.3806 8.29781 7.96719
25.6875 0.20771 208.85981 -0.67392 11.01249 8.06561 7.67951
26.0625 -0.51959 208.76441 0.44281 11.00553 7.54385 7.95912
26.4375 0.14497 208.8873 -0.31129 10.60865 7.68733 7.3584
26.8125 0.39961 207.99956 -0.46397 9.41083 7.14808 6.8994
27.1875 0.02183 208.06667 0.68049 10.37122 7.21602 7.44252
27.5625 0.2255 208.11105 0.07849 10.03631 6.57102 6.63208
27.9375 0.7808 207.8808 0.04617 9.433 6.80625 6.62283
28.3125 0.10615 207.56103 0.74002 9.88895 6.35664 6.39954
28.6875 0.59775 206.7923 1.35498 9.18943 6.22441 6.74753
29.0625 1.30502 205.79136 0.36442 9.88842 6.03824 6.2116
29.4375 -0.86205 205.36513 1.08242 9.76145 6.25106 5.67797
29.8125 -1.1707 206.05486 0.58632 9.20814 5.65576 6.48067
