0.05000 2673.20082
0.15000 3396.53204
0.25000 5132.29340
0.35000 5945.69618
0.45000 6472.97828
0.55000 6682.14367
0.65000 6680.67002
0.75000 6683.36578
0.85000 6541.83790
0.95000 6464.00673
1.05000 6256.80416
1.15000 6076.48022
1.25000 5968.21077
1.35000 5722.25903
1.45000 5539.58513
1.55000 5318.04704
1.65000 5184.85337
1.75000 4976.86944
1.85000 4784.84997
1.95000 4670.62621
2.05000 4534.52810
2.15000 4334.11338
2.25000 4229.54376
2.35000 4072.84847
2.45000 3956.34601
2.55000 3817.04718
2.65000 3721.31198
2.75000 3575.12362
2.85000 3440.54307
2.95000 3341.19595
3.05000 3232.43808
3.15000 3166.94782
3.25000 3037.95450
3.35000 2959.11169
3.45000 2856.86132
3.55000 2792.97140
3.65000 2682.96239
3.75000 2615.92474
3.85000 2522.29876
3.95000 2465.07987
4.05000 2377.57789
4.15000 2309.27628
4.25000 2253.41498
4.35000 2186.13370
4.45000 2120.29267
4.55000 2088.99911
4.65000 1990.53398
4.75000 1927.49067
4.85000 1879.10866
4.95000 1839.81673
5.05000 1784.76590
5.15000 1728.90095
5.25000 1673.50772
5.35000 1623.20826
5.45000 1541.93687
5.55000 1510.53211
5.65000 1468.80577
5.75000 1433.24575
5.85000 1383.32753
5.95000 1353.25283
6.05000 1297.99373
6.15000 1292.66386
6.25000 1240.77947
6.35000 1189.97355
6.45000 1156.89300
6.55000 1119.53143
6.65000 1097.08969
6.75000 1063.75328
6.85000 1041.38862
6.95000 1010.70404
7.05000 982.12951
7.15000 951.32474
7.25000 933.86541
7.35000 895.60170
7.45000 888.98479
7.55000 841.66529
7.65000 841.55551
7.75000 791.07560
7.85000 793.52982
7.95000 762.70813
8.05000 748.09697
8.15000 720.43724
8.25000 713.61060
8.35000 674.08555
8.45000 662.39637
8.55000 655.22395
8.65000 626.47793
8.75000 612.80091
8.85000 609.83595
8.95000 580.04317
9.05000 575.95464
9.15000 550.71461
9.25000 533.00659
9.35000 535.45408
9.45000 513.41374
9.55000 507.30853
9.65000 487.52037
9.75000 482.79890
9.85000 463.98959
9.95000 467.32960
10.05000 442.65381
10.15000 439.93967
10.25000 429.29446
10.35000 409.87867
10.45000 408.61862
10.55000 396.43936
10.65000 381.78715
10.75000 368.30881
10.85000 351.76579
10.95000 350.10219
11.05000 342.85332
11.15000 346.63380
11.25000 321.34850
11.35000 326.33102
11.45000 314.07983
11.55000 303.53283
11.65000 301.99312
11.75000 295.06078
11.85000 280.00491
11.95000 281.59315
12.05000 278.13024
12.15000 260.37564
12.25000 251.89480
12.35000 258.25473
12.45000 249.85055
12.55000 247.64668
12.65000 246.55703
12.75000 246.89334
12.85000 246.61034
12.95000 229.57755
13.05000 216.88610
13.15000 210.19099
13.25000 213.13876
13.35000 203.70227
13.45000 209.79492
13.55000 212.89606
13.65000 189.87380
13.75000 196.21873
13.85000 185.07160
13.95000 168.42839
14.05000 168.55835
14.15000 169.15706
14.25000 167.17204
14.35000 168.63128
14.45000 164.85538
14.55000 161.30083
14.65000 156.66764
14.75000 153.09096
14.85000 143.51053
14.95000 143.30645
15.05000 149.43497
15.15000 136.38845
15.25000 139.70324
15.35000 140.61030
15.45000 135.41676
15.55000 137.38343
15.65000 138.83425
15.75000 124.21099
15.85000 128.84724
15.95000 119.15514
16.05000 126.63962
16.15000 115.09313
16.25000 122.80300
16.35000 118.51708
16.45000 111.71779
16.55000 104.55470
16.65000 104.30947
16.75000 101.47103
16.85000 102.43711
16.95000 105.13334
17.05000 91.94074
17.15000 99.54642
17.25000 89.76869
17.35000 86.68744
17.45000 82.23111
17.55000 80.65033
17.65000 82.92315
17.75000 82.18022
17.85000 87.88850
17.95000 78.94626
18.05000 86.21792
18.15000 84.33993
18.25000 100.11097
18.35000 77.45757
18.45000 71.26337
18.55000 74.68581
18.65000 74.36520
18.75000 78.73005
18.85000 71.70288
18.95000 79.18612
19.05000 71.91715
19.15000 70.92015
19.25000 68.82898
19.35000 76.98626
19.45000 79.30452
19.55000 70.24213
19.65000 68.22273
19.75000 72.77393
19.85000 72.03492
19.95000 70.52354
