0.2 -1.01193 22.07817 1.34722 88.17369 87.95472 71.74638
0.6 -0.92739 45.33969 -0.48558 86.84863 83.84881 69.30555
1.0 -0.30421 65.4423 -0.4274 86.27004 79.62229 65.89412
1.4 0.76041 81.75964 0.96007 85.41769 75.46394 63.46256
1.8 -0.35125 93.22829 0.33807 83.40036 71.45921 60.04315
2.2 -0.19103 102.06098 0.5134 82.04062 67.93948 57.35521
2.6 -0.16452 110.66642 0.5899 79.26845 65.02761 53.97512
3.0 -1.12124 118.50903 0.23275 75.31878 61.88974 52.10903
3.4 -0.99542 125.43649 0.15891 70.85271 58.95356 50.34141
3.8 -0.40757 135.33348 0.08728 66.19245 55.98984 47.79514
4.2 -0.98641 144.21365 -0.00968 61.36014 51.88534 45.66197
4.6 -1.32416 152.85833 -0.18259 56.91886 48.84878 43.36276
5.0 -1.4175 160.4799 0.49765 52.62231 45.48979 41.48386
5.4 -0.19756 168.16018 0.16913 48.95688 41.92532 39.59164
5.8 -0.71703 175.01751 0.10029 45.21147 38.36705 37.35053
6.2 -0.07635 180.04468 -0.01956 43.0125 36.01787 35.51798
6.6 0.18079 184.20495 -0.13638 40.43098 33.52923 33.62401
7.0 0.54158 188.20087 -0.10516 38.84686 32.07648 32.1697
7.4 0.6455 191.60382 -0.55561 37.15171 30.01279 30.50676
7.8 0.22316 194.4483 -0.61047 35.58906 28.53871 29.16282
8.2 0.40789 196.91444 -0.59236 33.87962 27.25231 28.22678
8.6 0.36558 198.87696 -0.99025 32.60993 26.26952 26.94239
9.0 0.84707 201.07027 -0.72203 31.4179 24.77543 25.69698
9.4 1.12936 202.32307 -0.36481 30.46405 24.0467 24.42796
9.8 1.14645 203.86203 -0.18294 28.94122 23.17319 23.52625
10.2 1.05856 205.09123 -0.22049 28.12192 22.30563 22.53418
10.6 1.25695 206.04283 0.12083 27.24597 21.916 21.97293
11.0 1.31355 207.69346 0.27549 26.40607 21.2305 20.79485
11.4 1.0828 208.5799 0.44987 25.48792 20.38681 20.10992
11.8 0.77489 209.48747 0.58011 24.61687 19.58383 19.57744
12.2 0.22744 210.04539 0.81172 23.73734 18.53699 18.67499
12.6 0.18297 210.369 0.3899 23.30477 17.43968 17.93913
13.0 0.51985 210.94598 0.39525 22.45811 16.34997 17.49803
13.4 0.09183 211.03235 -0.01289 22.26465 15.79168 16.88065
13.8 0.3787 210.81207 -0.02161 21.50356 15.3284 16.52322
14.2 0.83561 210.92521 -0.36273 20.51681 14.83561 15.85645
14.6 0.54986 210.43215 -0.64726 20.26498 14.66898 15.3666
15.0 0.41751 210.41571 -1.09582 19.36446 14.44492 14.83874
15.4 0.46931 210.32018 -1.2451 18.69699 14.56241 14.49256
15.8 1.03574 211.02598 -1.13672 17.88559 14.26805 14.10942
16.2 0.57425 211.41336 -1.08427 17.18311 13.70233 13.4805
16.6 0.4884 211.71997 -0.75746 17.23067 13.08716 12.98011
17.0 -0.0091 211.94965 -0.52119 16.21178 12.46949 12.48271
17.4 -0.37897 211.93585 -0.74395 15.7758 11.83441 11.99562
17.8 -0.77145 211.9923 -0.28697 15.64047 11.84852 11.77094
18.2 -0.25177 212.0908 -0.03051 14.73011 11.40222 11.25037
18.6 -0.32365 212.29285 0.15787 14.20859 10.89474 10.65686
19.0 -0.00627 211.80393 0.05104 14.1468 10.44958 10.14578
19.4 -0.77032 210.86435 -0.08974 14.08457 9.7619 10.25553
19.8 -0.4214 210.76301 0.19244 13.57738 9.93106 9.97018
