0.05000 0.00000 0.00000 0.00000 0.00000 0.00000 0.00000
0.15000 -626.19152 81.31054 -287017.22612 2985.67988 921.53107 562197.90788
0.25000 -85.81850 128.74282 310360.10858 2753.83659 1048.31323 745247.39858
0.35000 -348.74597 62.30068 67399.96383 2809.20241 1343.07264 575215.26639
0.45000 -728.49344 307.02576 -396523.46001 2481.62591 1257.34945 3414344.76395
0.55000 -802.88276 -83.98238 84436.80429 2728.13591 1288.19436 2162793.14126
0.65000 -423.84986 -53.36540 -57071.13244 2491.12390 1441.74994 2168205.59244
0.75000 -623.45107 -207.34760 -84842.26670 2349.58470 1417.38623 1072222.35937
0.85000 -995.65400 12.14599 -40523.60425 2402.62173 1411.54174 1547886.69507
0.95000 -955.46792 26.74683 39733.07547 2307.54315 1439.14549 979655.14955
1.05000 -1086.55141 -15.01526 2831.85678 2282.26336 1558.47563 1659927.85888
1.15000 -1408.18920 26.49312 50487.29621 2076.59729 1529.70890 1570544.60610
1.25000 -1478.65525 73.43767 93903.43996 2046.51733 1583.45204 1722790.74251
1.35000 -1770.37683 -42.74380 -86407.91664 1894.83686 1591.75135 1612008.67105
1.45000 -1807.48726 5.87437 -56159.16358 1774.25324 1703.29101 1286375.96559
1.55000 -2142.85265 96.45111 29445.64779 1436.77390 1605.17526 2029697.11077
1.65000 -2350.45325 24.60606 37972.12183 1188.28663 1669.46364 1610704.93104
1.75000 -2723.10281 47.36978 58087.44825 919.72922 1554.43444 1526687.09699
1.85000 -3023.71798 24.54894 70680.86954 738.03287 1487.95038 1513217.78395
1.95000 -3186.92606 -22.52902 -28264.57007 620.04006 1337.46404 1309307.41854
2.05000 -3338.91871 5.26012 -36029.92809 546.63810 1271.95732 1783125.20108
2.15000 -3442.76418 -5.05628 68592.22091 502.89882 1191.46131 1691904.92650
2.25000 -3508.31121 0.10563 -26779.94225 440.56496 1160.21247 1847955.43927
2.35000 -3596.84150 21.67074 78340.17731 390.47130 1067.40277 2020577.43404
2.45000 -3668.40440 -6.07080 30103.68697 367.45298 1019.20773 2119797.37666
2.55000 -3701.82299 -53.45289 57638.13003 351.90406 940.30425 1928498.48011
2.65000 -3753.11187 36.15732 -29016.60605 328.20382 925.99081 1677317.09907
2.75000 -3790.02822 2.09356 -1934.31959 300.97192 867.70437 1670990.04136
2.85000 -3804.10191 32.10710 -18781.51783 288.79530 802.96344 1676072.26148
2.95000 -3836.73632 -11.31209 42756.22000 297.89771 794.85664 2116724.15522
3.05000 -3857.10910 -7.43380 -2507.18159 285.26045 758.07852 1972465.37523
3.15000 -3869.35384 -14.55945 -42902.01029 289.86890 708.04239 2554872.83969
3.25000 -3883.98626 -33.25149 -115836.16675 274.44962 688.01195 2306443.91656
3.35000 -3895.89623 -10.26327 4304.63971 249.24970 658.91978 2482014.34729
3.45000 -3883.70995 -25.17675 -69823.10820 270.10940 643.06542 3016068.39105
3.55000 -3916.03106 -6.51550 70923.26517 265.32993 612.65797 2023212.12293
3.65000 -3901.12152 -17.29091 -10279.92746 258.67293 603.22901 2210800.83070
3.75000 -3913.27798 14.71937 1305.46187 269.21501 580.88598 2509633.13623
3.85000 -3899.23164 -3.74508 -5361.17826 265.52372 554.30608 2353032.03605
3.95000 -3887.22632 19.05040 71470.12070 279.72755 546.27255 2220964.83879
4.05000 -3882.52503 -1.72826 46544.92089 260.92405 525.86366 2177780.50443
4.15000 -3870.22112 3.12647 6595.90480 280.51581 501.96499 1991312.00209
4.25000 -3859.79732 -13.60729 -60378.62747 264.00148 484.66822 2502975.70389
4.35000 -3855.49673 2.28292 -55116.15278 265.82525 471.35442 1978437.61879
4.45000 -3848.16413 -5.43690 11655.26805 275.15014 464.82926 2359823.73201
4.55000 -3823.69506 -9.58833 6636.27104 254.03029 441.36138 1940409.34198
4.65000 -3813.28059 5.88558 -56397.91509 265.16455 440.65017 2317246.17557
4.75000 -3792.38164 -2.63333 -47543.50605 259.87802 422.54762 2215056.50705
4.85000 -3788.65295 -2.49706 -7485.17116 264.39423 412.65895 2207672.66803
4.95000 -3772.89166 0.61358 -7626.67128 264.58382 392.69753 2388137.35084
5.05000 -3756.43539 13.58122 34793.99592 260.72625 390.87619 2140416.58151
5.15000 -3725.61838 -8.19444 66206.94726 244.49923 377.56651 2368460.24968
5.25000 -3716.97814 11.09336 9419.01495 248.29792 370.16381 2591187.47738
5.35000 -3699.57716 6.92019 79580.77940 250.14654 363.07128 2721946.32501
5.45000 -3672.02937 -9.97580 -67586.71208 236.27669 348.54295 2568899.30310
5.55000 -3666.78414 8.00897 51954.47139 242.95433 344.44816 2258859.76318
5.65000 -3648.84051 -6.54851 -11565.90534 247.43005 334.10454 2464404.11719
5.75000 -3624.21756 4.21107 8611.28014 237.65323 321.32689 2373057.49665
5.85000 -3612.29903 6.09418 28650.91715 229.35713 319.45144 2362145.10488
5.95000 -3589.46107 -2.36401 -27614.31268 222.25846 307.38578 2280144.16574
6.05000 -3577.84267 6.64152 -7648.57054 224.96586 305.17501 2174524.41143
6.15000 -3558.78065 5.81443 -18257.50329 225.56985 299.32849 2670500.78420
6.25000 -3545.58128 -2.99129 -37053.45401 220.73610 287.19086 2480979.89555
6.35000 -3532.63020 -4.62851 -95830.82540 214.08567 281.30016 2321042.35725
6.45000 -3499.86794 -0.68375 37425.74981 213.26737 282.47568 2373908.66869
6.55000 -3489.14804 -5.72793 53965.05918 210.65838 273.15060 2512558.08767
6.65000 -3465.83395 -1.97336 -7678.25620 203.59344 262.79865 2347671.70073
6.75000 -3454.02462 -2.31384 11919.18078 210.84226 263.29845 2439078.48183
6.85000 -3443.75274 7.03938 28926.93022 207.15088 255.48035 2527145.53288
6.95000 -3428.82886 7.15866 -65000.72538 204.13670 254.50443 2263527.50063
7.05000 -3409.75530 6.87662 -27258.60033 203.59128 246.96554 2160533.68939
7.15000 -3390.57177 0.50552 -12001.52093 209.12247 240.13985 2321065.46465
7.25000 -3372.46987 3.02142 -58689.74243 198.48330 235.05395 2344985.79409
7.35000 -3360.48689 7.71905 -11471.36186 202.96941 236.62309 2133599.74442
7.45000 -3335.87373 -2.88445 -13291.96379 190.91510 232.62339 2460275.64678
7.55000 -3327.68214 -0.66889 -7913.93069 191.47106 223.35685 2202675.17057
7.65000 -3300.30565 -2.75407 -8826.03850 190.04640 220.86332 2208519.83818
7.75000 -3286.28365 -6.70859 47595.16664 182.57361 221.61293 2446517.30006
7.85000 -3273.30650 3.38029 14835.01685 180.29300 215.45510 2271928.63589
7.95000 -3272.54255 -1.96879 -87067.63030 174.66103 215.14173 2202608.93054
8.05000 -3252.37716 11.32936 45702.12190 176.39692 208.67309 2400200.29496
8.15000 -3225.09689 2.31367 45149.64031 177.23361 198.67462 2324157.75312
8.25000 -3212.78789 -1.17383 -50272.37391 174.68726 201.63379 2147688.58186
8.35000 -3197.39567 -1.27791 -6656.81440 174.70380 199.80072 2240612.79075
8.45000 -3181.05579 3.27120 -29299.74984 179.96252 194.87156 2482934.27051
8.55000 -3165.05974 -4.03025 43434.74022 169.98811 197.04020 2341344.01514
8.65000 -3152.52036 4.18299 82140.56479 173.01706 191.48785 2233339.12999
8.75000 -3138.23555 1.64159 -28751.59229 173.34342 188.18158 2177173.47739
8.85000 -3123.19197 1.99906 15261.54792 170.47423 188.41180 2331520.58303
8.95000 -3110.11042 -2.30954 -10279.46867 172.45843 181.93812 2089906.74696
9.05000 -3091.83088 0.75309 5367.64705 169.83343 176.80752 2444092.22616
9.15000 -3077.56064 3.42059 20276.57264 176.71595 177.51809 2107925.95603
9.25000 -3060.12496 -2.44212 71179.71516 170.99843 172.66685 2338920.18598
9.35000 -3039.57359 -4.43479 -4919.19770 168.76536 173.86552 2154744.57152
9.45000 -3027.93896 0.11643 -96665.37397 165.47057 173.37699 2342933.10984
9.55000 -3007.33235 -1.59837 -10023.40804 165.00304 164.20760 2299879.81874
9.65000 -3000.06195 -5.39128 31379.61930 170.70043 167.22726 2205757.24646
9.75000 -2988.82008 -2.25175 -79273.29392 164.62287 166.93595 1987272.64808
9.85000 -2961.83039 -1.31471 20940.75712 160.32270 162.31438 2200128.29395
9.95000 -2953.17269 1.45159 -41497.98956 170.41242 161.94147 2532306.79938
10.05000 -2941.90061 3.03255 -26015.05628 160.10407 156.28042 2341360.89522
10.15000 -2926.90733 -3.29430 94416.61577 166.52178 159.11007 2245842.12514
10.25000 -2903.63057 -0.29408 -8637.74978 164.07738 149.69884 2022263.05902
10.35000 -2894.34373 2.76861 39255.62449 159.43964 146.33488 2165470.09477
10.45000 -2876.15439 3.47771 23364.96005 163.48566 151.40630 2308114.68423
10.55000 -2857.90894 -0.89027 14734.24091 160.26909 149.02257 2115358.04081
10.65000 -2852.23023 -3.33177 19914.28039 161.90630 148.46051 2238182.28688
10.75000 -2830.96662 -4.44682 5693.06662 156.88458 143.95926 2208463.91158
10.85000 -2818.28849 0.56325 -9574.68477 162.10749 138.27249 2323729.47428
10.95000 -2810.05625 0.38854 -1035.16211 160.87315 141.21412 2006777.99142
11.05000 -2789.69257 -3.00312 65488.98781 160.96057 136.40111 2118795.89053
11.15000 -2775.08487 -3.18449 -61875.97402 159.15567 139.94746 2271315.51413
11.25000 -2760.66786 -0.35204 -34154.89965 157.12073 131.79328 2093013.15476
11.35000 -2747.65160 -1.08027 -17385.52172 157.57657 128.88864 2035121.12962
11.45000 -2731.48540 0.10484 -26510.04328 155.43198 130.12888 2113821.89234
11.55000 -2723.44759 -3.00836 -7966.45795 159.17986 127.33682 2089034.15368
11.65000 -2707.89141 1.49576 -9768.28705 153.29339 122.91909 2086179.43135
11.75000 -2693.96632 1.16713 -19700.66213 151.73664 125.19416 2201282.68595
11.85000 -2682.17124 2.17417 -32020.97625 157.01002 120.49807 2050385.63800
11.95000 -2672.23811 -2.09731 13898.62340 149.45146 125.81379 2237330.79491
12.05000 -2653.24664 2.60429 364.10335 149.78662 125.87611 2126638.12855
12.15000 -2640.66940 -0.78939 6001.32364 145.86431 114.81043 2145979.54730
12.25000 -2623.51113 -2.10635 70664.92831 148.72145 115.84742 2205896.60635
12.35000 -2611.67344 0.19645 -38071.19331 144.06810 114.88930 2143953.36604
12.45000 -2602.58443 0.36348 15377.77761 147.09036 121.13947 2082079.29943
12.55000 -2589.61462 0.42006 -8385.65826 146.07691 111.74374 2212842.12609
12.65000 -2583.23826 -0.76880 48999.31465 137.76989 114.86324 2109811.14972
12.75000 -2562.32983 0.98521 19734.77735 142.20904 113.75135 2091131.59755
12.85000 -2548.81839 -3.13257 -7298.44496 135.79246 107.88753 2010774.90078
12.95000 -2539.44657 -0.04605 -11343.94809 136.04666 106.67342 1883378.50904
13.05000 -2529.64703 0.04544 -5398.76824 136.93396 108.90079 2013306.57593
13.15000 -2512.01485 3.57872 93406.43324 137.33362 101.02611 2035830.01620
13.25000 -2501.28871 2.18144 69469.26520 133.70072 102.85159 1922922.71873
13.35000 -2487.53673 1.48874 -54272.90517 134.23961 103.74044 2109293.61698
13.45000 -2478.55829 0.65056 26209.55658 135.32639 102.18211 2062725.41426
13.55000 -2460.89900 -3.91003 8152.51947 129.93469 100.10976 2101673.71027
13.65000 -2450.87465 4.36977 23930.33292 130.73834 101.44478 2335753.87271
13.75000 -2437.21675 -1.64836 -55165.09825 128.48323 94.87724 1993098.05191
13.85000 -2427.75544 0.26299 33787.37480 133.32175 99.25918 1819367.01745
13.95000 -2415.24067 1.86205 20083.14779 129.54976 101.36452 1882035.07215
14.05000 -2404.77382 -1.67480 -9217.77440 131.33380 101.21956 2141707.83538
14.15000 -2393.87900 0.93755 -5401.09228 126.98251 97.27309 1905453.49804
14.25000 -2374.64648 -0.98840 -8774.02196 128.03310 98.15000 2157736.22725
14.35000 -2373.20019 -0.00503 -12604.04003 125.54736 94.62293 2110210.84158
14.45000 -2357.25390 1.97494 29257.51091 120.16073 90.34275 2109538.07212
14.55000 -2340.56483 1.87386 56705.89109 123.33176 89.46508 1899608.51882
14.65000 -2334.19818 -0.37377 15481.76661 121.32551 88.59513 2008048.75076
14.75000 -2321.43785 2.34466 -8411.09680 119.67947 85.14334 1936639.82621
14.85000 -2310.39128 0.04701 56537.24341 122.96826 81.86064 1974611.77776
14.95000 -2301.87897 -0.92223 -27417.61438 121.82610 80.69921 1995848.37993
15.05000 -2290.50995 -1.29620 19519.35341 117.30643 88.07157 1833676.73967
15.15000 -2276.82254 0.54999 90323.81652 119.44495 86.36157 1885578.48284
15.25000 -2271.42372 0.30253 -38038.58761 119.18420 83.32847 1819714.16085
15.35000 -2258.70601 -0.84795 -33736.62467 122.24538 93.68967 2174119.95165
15.45000 -2245.12146 -3.14169 30260.56700 117.94363 84.43841 1759195.54105
15.55000 -2237.69929 0.45407 15583.24458 118.81986 88.17818 2030781.48814
15.65000 -2223.92828 0.78543 43649.95507 113.53765 82.03782 1891354.11684
15.75000 -2219.02207 -0.43045 60906.92365 111.44159 80.58988 1843527.95805
15.85000 -2207.09317 -0.75018 35819.39653 111.97417 85.09410 2183833.40115
15.95000 -2196.72255 -1.47440 15214.77682 110.17668 77.66346 1963084.92592
16.05000 -2179.96672 -0.38320 -9389.39591 109.60825 74.38551 2203687.86648
16.15000 -2176.51427 -0.60786 1100.19630 114.09978 76.99223 2023018.56187
16.25000 -2169.50801 0.88369 23617.97035 108.75935 79.33532 1953745.94512
16.35000 -2156.54394 0.21637 -14717.88835 111.64307 78.64078 2112269.77853
16.45000 -2147.92127 -0.87035 -8106.25399 104.91211 72.73821 2047646.54710
16.55000 -2140.72548 1.63076 -52511.34117 106.65906 74.12623 2029244.33852
16.65000 -2132.81498 -1.45640 28347.70337 108.60862 81.67721 1999102.64790
16.75000 -2121.27536 0.76198 34007.14485 104.06256 79.03970 2224961.22456
16.85000 -2111.14374 1.32605 -19844.04025 105.34139 69.06168 1949065.96311
16.95000 -2102.63196 1.61364 -59948.05905 101.92340 73.11257 1925963.00468
17.05000 -2090.99458 -1.12447 -44775.35266 102.91699 73.90718 1909166.52199
17.15000 -2079.12109 -0.22958 20379.83801 102.30119 72.99627 1920083.65820
17.25000 -2071.21458 -0.95334 -37857.86956 103.95944 72.74535 2087901.41065
17.35000 -2063.98756 2.26126 -39856.32413 101.62423 69.04065 1714533.20157
17.45000 -2054.83278 -1.03987 25460.57659 96.34023 65.33162 1911694.01909
17.55000 -2043.59944 1.02770 6964.71045 97.10252 67.10950 1831622.10364
17.65000 -2036.77916 -0.91552 144798.47836 101.46582 63.15538 1920881.74098
17.75000 -2021.35437 1.42342 2359.39492 94.83729 63.30196 1809694.34307
17.85000 -2019.03307 -0.57327 28709.46255 94.38425 66.76184 1876763.28450
17.95000 -2008.27210 -1.98091 31761.47761 96.85079 61.68291 1846552.53345
18.05000 -2001.54088 0.14887 -31117.75991 95.23511 65.56529 2050926.31599
18.15000 -1990.35410 -0.52781 -94965.03402 92.77175 60.44467 1783908.78230
18.25000 -1981.97469 1.64143 13055.72541 98.20280 64.00129 1945541.09513
18.35000 -1971.99212 -0.86286 54447.88389 95.73778 64.77127 1944345.96703
18.45000 -1963.41977 0.48144 -11682.50185 97.33733 63.33613 1856594.52222
18.55000 -1955.30858 0.41762 48439.56525 91.14735 61.39872 1929450.44525
18.65000 -1947.12213 1.09390 4108.40353 94.74227 67.12282 1815261.38265
18.75000 -1939.02339 1.20380 -44061.22228 91.83962 66.06519 1947620.75437
18.85000 -1930.93182 -0.90639 -36899.94702 94.93827 61.44103 1800181.76148
18.95000 -1924.27662 -0.64247 55369.34472 90.66594 59.25284 1610177.51434
19.05000 -1915.98415 1.03918 3725.15735 91.12895 56.69955 1840041.40785
19.15000 -1905.84768 0.86605 -16304.06900 87.18706 62.67402 1888022.73939
19.25000 -1894.84353 -0.57723 2977.98837 87.60583 56.46938 1729068.15941
19.35000 -1887.97042 -0.30520 16144.22317 91.84162 56.31129 1754386.36578
19.45000 -1878.85879 0.40196 -7849.37252 84.72189 60.38228 1811747.82944
19.55000 -1872.27780 0.15789 -23902.12266 87.40557 63.53857 1731620.29327
19.65000 -1866.28350 -1.15645 53810.55956 88.53951 52.04209 1985768.83706
19.75000 -1856.62039 1.27040 32377.04330 84.88318 57.81570 1829079.90348
19.85000 -1848.17492 2.79209 29431.72496 85.21989 57.76007 1816541.59997
19.95000 -1838.12242 0.37188 41018.92246 91.34634 56.74968 1685205.21017
