0.05000 -2545.85891 -1089.05412 2463.26462 3555.13774 1513.26335 2301.40169
0.15000 -3224.51314 571.40182 1421.32021 3157.71892 2077.91814 4333.52996
0.25000 -4249.46342 -419.00857 66.01870 2893.75478 2565.81871 5507.63397
0.35000 -5338.10668 70.36046 -325.80725 3093.40708 2315.63397 7081.37528
0.45000 -6347.07250 96.68399 286.57827 2912.04488 2357.01167 7666.99458
0.55000 -6892.10771 -139.15530 -189.14188 2684.90991 1964.57109 8012.12952
0.65000 -7303.63044 -130.68602 -303.97903 2623.64537 1650.74552 8200.13056
0.75000 -7405.82195 39.06714 -219.86020 2346.12634 1422.49922 7826.84611
0.85000 -7579.47728 29.76006 -142.03311 2292.47575 1506.39014 7978.75098
0.95000 -7634.19928 -7.27253 69.94490 2224.68914 1357.68622 7799.33688
1.05000 -7890.30372 20.55500 331.40810 2117.06057 1349.22991 7466.34550
1.15000 -7804.76004 -33.63409 641.13481 2016.11455 1316.79431 7412.17644
1.25000 -7930.32531 -15.40641 433.75220 1882.65359 1380.54379 7192.83773
1.35000 -8003.84805 -14.78708 55.84335 1892.80337 1234.87383 6998.37563
1.45000 -8036.15663 -56.17169 40.02173 1844.27103 1254.41448 6678.88200
1.55000 -7975.81938 14.50827 162.12633 1666.54990 1081.93332 6565.80708
1.65000 -8008.30670 -14.53347 120.52359 1575.32351 1218.26159 6262.00709
1.75000 -7996.30416 -14.36936 -166.16665 1536.14795 993.55046 5972.74925
1.85000 -7997.45755 -34.91394 -42.36806 1422.36209 1011.71483 5800.99030
1.95000 -7909.92967 -27.64233 32.15056 1331.97526 960.89508 5573.10281
2.05000 -7939.77886 13.09918 -110.81849 1314.23984 962.28964 5390.87942
2.15000 -7958.78482 -8.15637 -203.95820 1245.20586 957.62659 5226.35579
2.25000 -7978.93488 6.12262 -83.10278 1212.83602 1133.34231 4990.10483
2.35000 -7944.00976 -14.01777 -7.41921 1149.63439 858.40792 4875.22670
2.45000 -7961.67255 2.69210 11.14947 1074.36295 862.18585 4705.34251
2.55000 -7935.82121 16.43517 146.16063 1115.83588 742.13199 4590.33760
2.65000 -7905.67128 -10.81707 -114.86470 1106.74853 925.48192 4481.65808
2.75000 -7828.86689 1.77086 12.95125 977.64514 864.31463 4352.32760
2.85000 -7762.89668 16.01844 40.90515 948.90283 667.95524 4161.44326
2.95000 -7755.92941 -20.49432 -147.90101 931.76816 771.67321 4081.14245
3.05000 -7761.57281 -12.10538 37.75854 843.16891 599.26964 3962.19499
3.15000 -7711.95018 13.89009 -66.57529 994.26787 806.53574 3803.89512
3.25000 -7644.59819 -5.08408 -221.83997 814.09371 658.76737 3723.68674
3.35000 -7580.23024 -28.85640 -194.43685 824.42010 708.07182 3628.62294
3.45000 -7546.59916 -10.32040 -78.70933 806.25973 574.41428 3462.62648
3.55000 -7481.75716 -9.24636 -56.07860 790.51026 527.73950 3468.10023
3.65000 -7457.30773 -13.93080 -137.11606 714.58881 512.03199 3303.66012
3.75000 -7385.41544 15.39411 -73.50252 670.71879 515.74968 3207.38940
3.85000 -7321.30842 0.00559 -47.26808 660.29613 478.91222 3117.31003
3.95000 -7266.23235 -14.89209 -159.55652 826.66303 611.35877 3059.43475
4.05000 -7208.19104 -16.23483 -155.41507 762.80041 534.96362 3016.65988
4.15000 -7149.79465 4.74129 -54.45913 725.84928 585.97816 2916.38996
4.25000 -7070.92108 -6.60208 -66.62923 647.21343 521.31689 2880.93727
4.35000 -7040.88263 7.48634 43.40264 585.47723 515.91880 2759.39257
4.45000 -6979.65957 19.77548 4.88845 600.36024 596.46192 2755.20102
4.55000 -6919.35426 -14.49899 13.99620 740.28641 570.18065 2673.34281
4.65000 -6897.19293 15.64799 -39.25360 686.72244 522.29263 2621.69462
4.75000 -6892.88367 0.51265 -18.50682 585.52234 594.70918 2493.97395
4.85000 -6804.23359 2.28280 51.94729 647.58384 536.25569 2486.64304
4.95000 -6748.44128 -9.47655 14.85609 534.08485 473.98663 2414.64379
5.05000 -6748.51088 -12.09371 -7.40727 723.26862 576.50028 2308.08013
5.15000 -6667.99604 4.27977 58.74628 535.25322 428.31955 2304.77228
5.25000 -6649.49802 7.20577 69.21178 554.58822 525.40031 2226.05730
5.35000 -6583.60159 -0.04147 88.82376 571.06892 519.30069 2207.42096
5.45000 -6532.08594 16.51678 27.79501 597.38941 439.56254 2108.74715
5.55000 -6498.21737 -3.45934 10.53296 571.46146 614.61476 2069.16390
5.65000 -6456.23329 8.03152 64.54078 573.17948 375.23529 2057.95259
5.75000 -6410.81490 4.17140 16.61628 698.85987 523.44789 1967.34649
5.85000 -6356.27609 7.41884 21.51854 503.44980 574.53563 1950.81619
5.95000 -6297.74159 2.90787 78.20023 667.39759 454.96832 1959.43023
6.05000 -6226.71256 -0.21122 78.95608 445.00979 312.74124 1841.63647
6.15000 -6182.73457 -7.50860 -40.88171 462.17521 354.43391 1765.00234
6.25000 -6117.64390 2.56892 91.33202 507.93210 420.75610 1748.16686
6.35000 -6091.31685 3.61836 34.48692 418.67495 328.94897 1719.66111
6.45000 -6035.67291 11.05956 140.96361 531.77348 379.33052 1682.01599
6.55000 -5990.24407 20.13173 -3.07273 447.41046 448.62072 1633.33719
6.65000 -5949.16653 -5.96524 -13.11867 407.32810 424.07608 1636.74526
6.75000 -5919.68555 4.66117 52.13230 384.38047 323.00598 1525.33434
6.85000 -5859.92019 6.05608 7.00645 491.68233 351.62871 1515.35767
6.95000 -5806.65442 10.40718 -8.82390 405.39478 383.53973 1468.08264
7.05000 -5735.74312 6.48398 -5.36892 455.41376 385.45896 1466.72806
7.15000 -5682.71251 -0.52731 22.53428 309.12902 272.34388 1418.53173
7.25000 -5645.85070 7.78804 2.61546 369.68100 349.67400 1419.17189
7.35000 -5613.60069 4.42812 -37.21748 378.53403 277.23037 1353.19394
7.45000 -5540.77389 5.20281 -26.61362 488.95914 281.34384 1326.60626
7.55000 -5517.12808 -4.91443 -5.84714 349.07572 306.60214 1273.47138
7.65000 -5476.97959 17.68803 -29.00398 336.99551 321.52047 1288.79902
7.75000 -5431.61824 10.51173 2.49480 327.61150 285.83021 1233.21152
7.85000 -5380.14999 5.75544 50.67827 259.64637 287.07682 1177.34946
7.95000 -5333.73166 7.55408 -15.62062 402.92556 424.51891 1184.91811
8.05000 -5290.51896 7.56989 49.78968 290.70177 228.83583 1122.75700
8.15000 -5246.95386 2.61542 -20.56277 487.86644 321.68370 1122.81664
8.25000 -5208.96541 12.46510 -20.52240 280.69319 273.23007 1092.94354
8.35000 -5171.45231 2.06649 -27.79396 273.71771 205.29168 1059.43032
8.45000 -5132.03466 5.13415 -25.60528 280.77263 236.58706 1050.49206
8.55000 -5099.85075 13.34995 -8.00319 419.06978 649.53446 1024.70332
8.65000 -5044.78897 2.84414 -19.51657 280.82501 368.76572 1006.09773
8.75000 -5021.07528 -12.00160 4.45920 376.21607 430.15262 999.55775
8.85000 -4968.22747 4.79446 -1.50108 249.16493 299.66248 953.56955
8.95000 -4931.65541 9.69087 23.10173 233.63882 242.30341 935.12612
9.05000 -4891.57932 -13.45353 -26.14584 236.59255 485.83135 917.30162
9.15000 -4862.43439 -4.12028 16.88395 330.67338 246.06439 920.69639
9.25000 -4825.21564 2.04006 12.23736 405.58510 257.86113 949.04938
9.35000 -4770.04198 -9.00857 21.41384 214.08811 318.44041 848.54785
9.45000 -4727.27832 -1.57607 7.81593 225.28266 209.97051 835.20947
9.55000 -4680.81273 0.83675 36.10870 223.57184 205.38616 839.92360
9.65000 -4651.65507 6.88613 10.99626 187.12665 338.52768 887.09830
9.75000 -4601.15948 -9.17046 0.69090 282.82624 243.77370 769.74741
9.85000 -4584.73653 4.42476 58.84598 543.57698 201.69350 775.55944
9.95000 -4554.16294 5.85607 39.75269 277.82748 236.99515 770.41628
10.05000 -4509.82512 -9.07342 53.11803 256.47160 501.61003 738.92347
10.15000 -4479.06529 -2.68715 27.45353 457.97584 483.76274 735.11412
10.25000 -4454.11894 -0.19370 -14.90652 233.86885 176.07546 708.74572
10.35000 -4411.46337 -5.85524 23.24199 318.26777 184.94014 710.54391
10.45000 -4412.21493 4.31433 51.04535 213.06467 201.76693 667.31699
10.55000 -4377.57579 0.75383 50.65430 233.73285 216.57667 685.78294
10.65000 -4335.00463 0.10814 59.71612 200.17130 179.95484 654.14876
10.75000 -4306.40496 0.77953 33.72544 193.90811 165.39591 635.86804
10.85000 -4272.68108 0.39308 6.25348 173.13448 163.33314 624.22481
10.95000 -4243.88013 8.62450 51.10980 262.74478 152.96177 605.51405
11.05000 -4223.67800 -0.62071 25.07223 153.90043 224.29105 587.33906
11.15000 -4182.85714 14.37770 31.59690 336.32625 717.63118 588.41605
11.25000 -4146.07776 -7.02907 47.98802 275.65058 177.81740 572.27308
11.35000 -4118.94763 12.73900 2.47366 211.07649 149.79008 625.63778
11.45000 -4077.33949 7.55387 4.96591 146.92263 137.78292 538.53060
11.55000 -4045.20580 18.42570 10.38496 142.57620 286.87777 584.43140
11.65000 -4021.90584 -3.14728 30.32996 190.78356 118.14449 543.99264
11.75000 -3973.86319 -3.59681 -14.68812 165.96237 161.69120 548.67253
11.85000 -3934.62846 -0.51188 -10.53385 163.55607 123.56084 496.67469
11.95000 -3908.03407 0.37388 16.96052 129.59970 107.98457 488.82224
12.05000 -3873.72303 3.99024 23.04591 160.76590 117.08245 473.94215
12.15000 -3828.01024 -1.52247 -64.44986 203.26047 149.32806 551.11976
12.25000 -3821.09939 20.38613 -6.26129 221.86276 242.42329 466.43768
12.35000 -3782.67816 1.78181 -18.89262 132.28035 118.83304 446.54680
12.45000 -3732.30392 -0.41708 -41.83947 151.25408 110.88987 446.96346
12.55000 -3726.57785 -2.21852 -9.49705 127.30887 128.36868 454.65448
12.65000 -3691.01904 -4.95081 -13.07260 183.59277 192.27364 438.44140
12.75000 -3662.31219 -4.86529 -13.26580 129.91182 112.04986 417.23114
12.85000 -3623.34350 1.44274 -47.27869 177.24077 127.89497 419.56414
12.95000 -3615.90384 4.08102 -35.96053 118.49501 104.88226 370.78982
13.05000 -3559.12312 1.44963 -19.02052 141.95123 148.18278 383.45623
13.15000 -3537.72791 -4.45353 -13.05797 181.27135 138.74949 377.89945
13.25000 -3513.23526 3.33159 -33.04900 135.44859 195.99264 356.12093
13.35000 -3480.86089 0.69374 -32.02561 170.73535 101.75377 365.93863
13.45000 -3458.14929 -3.67635 1.58355 124.62007 121.38190 343.71938
13.55000 -3418.24107 5.58808 -10.37281 222.18003 132.25638 366.27944
13.65000 -3405.28477 7.01525 -21.08257 166.01712 136.28112 365.87557
13.75000 -3369.41918 6.90825 -24.62659 124.40091 110.53399 332.99106
13.85000 -3351.94828 1.63813 7.68035 96.44899 109.54948 320.29692
13.95000 -3347.64437 -27.05451 7.26237 352.40066 672.94095 371.39487
14.05000 -3324.09183 11.03201 12.79953 110.04388 89.36713 318.89605
14.15000 -3284.54161 -11.05649 -20.67528 114.96735 240.42695 298.10770
14.25000 -3265.75156 8.83901 -13.56385 112.55267 89.36899 298.88962
14.35000 -3242.29330 10.67886 22.04776 144.41233 134.13660 305.00923
14.45000 -3223.79251 11.97977 15.98084 115.08105 107.04771 294.93955
14.55000 -3202.10145 8.75502 21.44624 102.10990 99.50668 288.93001
14.65000 -3183.85402 11.83403 16.52977 201.81770 150.83283 298.04935
14.75000 -3153.72869 3.08710 2.86834 194.03414 170.85485 329.45867
14.85000 -3133.19438 7.39516 7.21957 110.02187 112.31784 277.79981
14.95000 -3095.16915 18.14904 30.20379 367.92454 243.53133 272.07495
15.05000 -3114.62718 4.80185 18.45967 208.76789 141.46099 310.61995
15.15000 -3078.22237 13.25492 6.98010 65.84943 76.29746 255.71303
15.25000 -3055.10326 -0.67746 1.53765 72.37097 115.94757 265.91442
15.35000 -3037.08360 2.25371 13.19308 94.77738 81.13135 260.76448
15.45000 -3023.82391 7.56536 29.04632 207.88005 98.62195 368.51026
15.55000 -2992.09777 7.93113 5.33393 70.02017 65.06125 255.12324
15.65000 -2961.97256 -4.13736 16.87248 143.12219 128.64591 267.49852
15.75000 -2947.88522 13.28883 4.96615 155.03995 115.37661 266.80969
15.85000 -2935.96624 12.15640 -25.60564 66.13492 72.27103 243.09718
15.95000 -2921.26261 6.47358 -17.93341 133.06517 75.80438 241.22906
16.05000 -2891.90789 8.72912 -17.23221 81.60720 70.72861 215.36093
16.15000 -2880.46816 7.48819 -0.34870 64.95888 65.38178 212.52105
16.25000 -2861.83751 6.49089 -25.48138 62.61757 63.95519 200.25208
16.35000 -2840.25122 5.69755 -40.03329 77.39985 87.47278 205.08768
16.45000 -2824.43620 7.38280 -30.74472 67.43438 80.21021 216.73396
16.55000 -2814.19294 6.10803 -27.12736 83.75938 74.76713 200.23181
16.65000 -2795.69396 -2.45996 -38.79806 73.74764 104.03119 199.36875
16.75000 -2774.01391 6.12939 -18.14997 79.77336 64.70634 199.99877
16.85000 -2757.11743 3.91780 -20.54194 76.98678 138.74878 192.58066
16.95000 -2740.66072 7.40273 -23.60482 74.21405 70.33121 234.94630
17.05000 -2717.31489 5.86949 -24.77947 141.83349 85.16373 223.19730
17.15000 -2711.41925 10.95117 -49.66805 200.43865 137.01870 178.87918
17.25000 -2688.05027 6.53420 -37.48295 52.44404 57.15462 197.53762
17.35000 -2674.40385 2.18622 -34.67744 71.12596 73.42512 193.76415
17.45000 -2656.71683 -2.30485 -48.54976 64.63680 93.55544 200.51692
17.55000 -2665.10584 -1.61297 -12.56876 353.58655 183.02461 475.44826
17.65000 -2628.16490 2.87981 -61.25935 54.40194 59.63182 163.47349
17.75000 -2604.69833 4.69765 -38.87951 66.47884 96.97230 182.92883
17.85000 -2585.57302 5.80051 -17.79640 123.52330 114.30476 209.78880
17.95000 -2576.80949 4.58476 -44.03639 52.85083 46.75777 167.76479
18.05000 -2557.48219 3.02289 -22.57482 57.87340 70.03993 148.49309
18.15000 -2539.07723 9.27506 -58.99483 51.33419 44.86315 146.39912
18.25000 -2526.82842 -1.08861 -47.02888 164.47198 231.10639 205.41348
18.35000 -2507.84068 -4.06066 -19.65695 68.34832 66.18539 147.25117
18.45000 -2496.72512 12.20923 -26.14203 67.31853 128.77086 143.22438
18.55000 -2480.21338 7.81848 -40.21552 80.18862 113.92208 151.64679
18.65000 -2471.22334 -2.76107 -38.59534 72.78175 93.82702 142.62400
18.75000 -2450.33653 0.06214 -41.81129 276.92182 117.06743 148.50622
18.85000 -2436.46906 -3.80256 -36.97432 70.67581 57.19237 142.88134
18.95000 -2411.91047 0.44678 0.49578 95.04098 52.96633 140.33365
19.05000 -2405.39943 4.46001 -23.71152 33.27142 39.46395 108.08126
19.15000 -2389.42605 8.34336 -19.06978 63.22614 55.79782 129.06798
19.25000 -2372.32210 4.67445 -30.93386 54.70959 40.00877 137.46669
19.35000 -2367.36398 0.44973 -42.49064 48.10533 83.08136 167.48826
19.45000 -2344.11844 3.59266 -16.53658 41.64356 79.37501 116.27663
19.55000 -2337.66628 7.41740 -25.26948 70.04144 77.38820 127.74918
19.65000 -2321.13456 8.15327 -27.98565 34.91682 38.30648 108.77949
19.75000 -2306.44153 8.30241 -1.39123 78.72494 91.69695 121.67388
19.85000 -2290.56843 4.22296 -12.79767 61.66312 73.99049 125.60742
19.95000 -2280.75532 7.13048 -19.78661 45.80825 43.25018 110.17947
