0.120000 2.717270
0.380000 2.628780
0.620000 2.616750
0.880000 2.671820
1.120000 2.684990
1.380000 2.717700
1.620000 2.732590
1.880000 2.712020
2.120000 2.706870
2.380000 2.739030
2.620000 2.779560
2.880000 2.770970
3.120000 2.815560
3.380000 2.857780
3.620000 2.909570
3.880000 3.015010
4.120000 3.063090
4.380000 3.122480
4.620000 -3.132030
4.880000 -3.102330
5.120000 -3.140080
5.380000 -3.094580
5.620000 -3.130330
5.880000 3.070880
6.120000 3.089910
6.380000 2.845300
6.620000 2.967690
6.880000 2.782700
7.120000 2.715890
7.380000 2.728890
7.620000 2.593830
7.880000 2.540140
8.120000 2.440780
8.380000 2.449610
8.620000 2.437940
8.880000 2.384420
9.120000 2.343080
9.380000 2.296970
9.620000 2.215100
9.880000 2.299950
10.120000 1.951770
10.380000 1.735070
10.620000 1.219350
10.880000 0.711440
11.120000 0.408730
11.380000 0.266490
11.620000 -0.056090
11.880000 0.008410
12.120000 -0.162430
12.380000 -0.757490
12.620000 -0.815410
12.880000 -0.941460
13.120000 -1.207920
13.380000 -0.470070
13.620000 -1.512470
13.880000 -0.509350
14.120000 1.669190
14.380000 0.660240
14.620000 1.322130
14.880000 1.156130
