0.05000 -60327.31483 4915.46577 -26649.34676 58143.02940 75878.78465 71318.04140
0.15000 -72076.19102 -325.51012 -4500.24657 32815.74546 38287.19508 64623.66831
0.25000 -58632.18297 -123.56910 -1284.17714 23455.90163 16280.86967 48307.54653
0.35000 -45788.06309 175.74372 251.99243 15486.36310 10087.30931 37493.91526
0.45000 -37248.52735 -115.54173 576.29509 12580.19880 6254.31473 30432.99553
0.55000 -31328.30015 186.62276 505.88933 9298.50499 4631.50085 26070.06405
0.65000 -27765.06300 110.87016 18.99354 7848.19144 4304.60577 22369.94290
0.75000 -25197.40745 10.81323 -235.07511 6808.74593 3677.84287 18939.28818
0.85000 -22920.84256 19.25017 277.38237 6234.61160 3649.08438 17037.40160
0.95000 -21014.60295 17.04890 513.70960 5480.53611 2846.43422 15506.40333
1.05000 -19252.05891 66.37959 132.93876 5096.15555 3450.20432 14281.02741
1.15000 -18145.35083 -15.89526 545.77602 4375.48792 2537.91335 12688.46999
1.25000 -16818.08116 -131.55395 64.90834 4108.20960 2535.52516 12108.87537
1.35000 -15989.43163 121.71741 475.91478 3559.09072 2610.63259 11239.70077
1.45000 -15287.26582 0.06838 94.44858 3675.35130 2361.84230 10266.03969
1.55000 -14530.33938 43.25027 -71.93810 2960.40924 1950.94688 9492.17782
1.65000 -13835.37524 -18.04805 76.45751 2559.91592 1801.65224 8903.35427
1.75000 -13285.51207 43.58857 209.09035 2173.70484 1598.96447 8210.32144
1.85000 -12842.58492 11.06298 -56.32705 2551.81166 1790.18708 7801.14997
1.95000 -12343.49576 30.24016 255.17278 1866.14883 1689.17444 7372.42160
2.05000 -12028.57879 0.22758 1.29082 1757.39431 1639.87005 7006.10371
2.15000 -11673.16954 17.03479 169.20836 1658.52770 1355.23813 6375.71580
2.25000 -11362.48272 -13.40163 268.26838 1599.49479 1583.71024 6143.83109
2.35000 -11060.12348 49.65599 62.81131 2008.65694 1210.79990 5753.97931
2.45000 -10763.54440 40.99267 -152.03091 1344.11951 1240.98848 5350.04438
2.55000 -10526.30196 41.47272 5.64973 1250.69316 1097.94737 5048.72158
2.65000 -10266.17383 23.71190 -17.59978 1185.82720 1175.79926 4885.12387
2.75000 -10133.83242 15.55065 260.89893 2435.08699 1195.85795 4544.79790
2.85000 -9931.29317 -11.53542 98.32101 1372.30994 1156.77279 4385.82548
2.95000 -9758.59546 31.27741 7.54240 1002.14667 983.10584 4253.07046
3.05000 -9573.84037 -15.46624 96.63967 1410.92585 1292.76187 4022.51743
3.15000 -9443.97348 57.38190 1.67995 1227.26408 904.77654 3878.28629
3.25000 -9345.77858 7.31546 -6.21632 1119.58191 1371.84398 3725.35173
3.35000 -9183.13582 1.02451 67.54146 946.60390 796.49072 3587.00710
3.45000 -9050.33483 18.48686 142.32895 1098.64837 1017.51322 3371.45572
3.55000 -8906.00421 31.34475 36.76666 871.60424 698.44726 3291.21791
3.65000 -8783.87304 30.34905 -20.95433 829.22926 773.90638 3223.38301
3.75000 -8671.90646 32.84881 12.57634 815.61699 782.24359 3088.45410
3.85000 -8538.83009 17.39146 -25.75578 755.62117 839.68506 2961.23376
3.95000 -8408.52856 31.43627 -69.21833 764.46873 618.23897 2852.07448
4.05000 -8275.45497 14.51729 57.71014 865.45716 637.07474 2774.56034
4.15000 -8165.57821 21.49529 -12.84066 730.39750 623.89647 2666.44632
4.25000 -8055.49144 26.74200 52.20770 919.56918 753.65995 2587.17462
4.35000 -7953.29513 37.29732 88.87684 689.82719 565.97572 2535.27822
4.45000 -7882.58633 34.24093 111.35902 664.10784 558.24917 2459.49187
4.55000 -7776.82317 49.25994 66.01560 702.49266 526.20406 2349.43012
4.65000 -7717.70267 28.04067 40.31848 779.66722 720.26281 2290.09697
4.75000 -7601.15937 15.89602 14.41883 936.22896 590.73098 2258.23974
4.85000 -7532.92483 34.41684 119.56016 678.68487 516.22639 2158.90717
4.95000 -7443.17508 36.11149 32.05060 654.92347 593.79777 2119.15390
5.05000 -7351.66845 24.14924 35.10217 570.92969 558.21975 2069.15322
5.15000 -7259.98198 20.82492 57.12860 583.35444 460.41257 1958.56001
5.25000 -7188.45404 18.79521 104.28300 471.82253 447.27925 1934.25111
5.35000 -7099.97411 15.59478 40.99213 529.73447 558.75070 1900.81688
5.45000 -6997.63587 28.60488 1.91466 600.24951 709.50180 1829.96081
5.55000 -6947.01174 9.08586 41.36298 1065.75467 509.07725 1792.57267
5.65000 -6864.66598 26.05032 -49.91435 559.74222 367.52283 1770.49618
5.75000 -6774.31588 2.78752 61.56234 726.79468 618.99145 1783.62904
5.85000 -6692.14674 20.42595 -19.76545 566.93938 516.99693 1642.58251
5.95000 -6634.39395 4.43296 14.91484 449.69957 403.12047 1566.51647
6.05000 -6537.59361 12.16674 4.78927 1074.12463 376.79317 1806.64342
6.15000 -6473.74109 5.94668 36.61638 435.69006 315.63942 1512.40786
6.25000 -6400.48456 6.64749 20.26557 465.04749 505.22592 1480.85817
6.35000 -6298.20188 10.76604 18.57164 420.96530 384.85311 1473.35921
6.45000 -6218.06127 7.18452 14.69526 409.02945 761.60701 1401.33740
6.55000 -6134.05617 7.19914 -81.08005 527.68318 272.05109 1375.72018
6.65000 -6089.59643 16.80507 39.95653 463.05346 467.37244 1368.99747
6.75000 -6012.77598 4.49307 60.77259 392.71572 297.02632 1298.61002
6.85000 -5931.94949 14.84724 58.44467 335.47749 373.48902 1267.69094
6.95000 -5899.31232 12.73373 -38.87353 498.39095 395.15525 1198.87230
7.05000 -5802.37256 5.81975 -9.39584 751.63180 600.82783 1399.17257
7.15000 -5761.59207 5.90425 37.17929 454.34166 637.67061 1185.25136
7.25000 -5701.69623 7.82106 10.03784 424.71782 528.14249 1252.47652
7.35000 -5658.18386 16.07333 4.38678 287.09290 284.71640 1114.45562
7.45000 -5629.87428 0.16034 0.28799 382.14863 386.96736 1131.23235
7.55000 -5563.09126 3.83382 -11.03005 289.02240 281.62995 1070.76566
7.65000 -5503.64081 16.05534 -0.69044 306.39419 265.75629 1082.30127
7.75000 -5464.38088 12.75569 -6.14606 370.79359 502.87679 1066.81880
7.85000 -5422.16377 15.09831 24.87998 296.97617 238.76941 1041.59238
7.95000 -5363.95610 -2.13245 -34.31921 359.14287 437.04499 1070.36226
8.05000 -5336.00456 2.29302 -42.14204 444.20709 384.39619 1035.11144
8.15000 -5285.55734 0.92683 -15.16187 430.71150 473.35864 991.61363
8.25000 -5221.07426 -27.92465 -16.85835 528.44034 1156.14027 950.04046
8.35000 -5192.07737 10.39928 -8.82050 382.14617 397.77743 933.58180
8.45000 -5148.06096 17.46227 -61.47663 268.19491 266.98127 906.07424
8.55000 -5104.12286 4.93109 21.65321 285.07296 214.64091 869.21329
8.65000 -5050.25934 11.37999 -29.08639 366.61224 245.71875 906.29366
8.75000 -5004.32957 17.75620 -15.97172 319.05356 428.23776 831.92968
8.85000 -4960.42396 10.94266 -7.03156 282.53914 198.54709 771.84467
8.95000 -4897.70350 12.82192 -55.18889 212.57848 329.42907 819.53740
9.05000 -4857.22235 22.70186 -9.12045 359.95920 723.59408 1341.24358
9.15000 -4818.79254 5.53203 -34.03668 212.49382 212.08721 759.34625
9.25000 -4766.94423 7.50620 -6.58483 256.66446 232.46535 779.61287
9.35000 -4712.11751 -0.68076 -32.37054 359.80074 443.95855 772.66300
9.45000 -4683.81197 16.44611 -32.79345 244.51927 159.52161 712.31611
9.55000 -4658.73009 14.16821 -4.72381 395.77114 252.57982 723.43429
9.65000 -4600.29700 8.82660 -4.92965 202.42894 162.94651 694.54698
9.75000 -4557.24590 22.41451 -36.63741 537.83771 521.68225 891.77310
9.85000 -4534.51491 1.53309 -21.74966 226.69141 180.84298 708.17243
9.95000 -4443.86254 -13.25121 -57.74714 1987.60161 622.85136 1309.65098
10.05000 -4461.30152 4.49978 18.12116 209.68048 192.12342 634.02669
10.15000 -4424.32955 13.73816 11.74897 322.78382 317.84374 633.41342
10.25000 -4388.30454 -0.28143 -6.87562 183.31998 185.29310 574.25644
10.35000 -4348.26247 -3.01262 12.86068 145.96106 197.83349 566.93149
10.45000 -4293.66552 8.66092 60.36405 279.90857 194.84776 590.65625
10.55000 -4268.18460 6.58733 -6.14681 861.16811 289.85648 621.80823
10.65000 -4241.50592 2.38110 -26.21704 645.66811 287.71560 654.52053
10.75000 -4194.77940 13.77166 14.36187 126.16270 144.83402 533.94841
10.85000 -4160.15361 5.46400 -7.56459 160.29998 150.15213 510.28669
10.95000 -4138.36881 -4.27625 -39.14328 238.97708 131.95550 518.05020
11.05000 -4098.84829 5.82237 -13.92694 122.83512 117.15561 467.73993
11.15000 -4060.24214 13.18660 -3.38788 243.73208 634.76284 851.54131
11.25000 -4029.70948 -2.30148 21.69372 160.01184 171.61609 465.73306
11.35000 -3982.63240 6.12604 -14.88671 130.52471 120.46292 469.87481
11.45000 -3975.22225 8.51138 -18.73729 344.85471 120.79009 484.71657
11.55000 -3926.86341 -1.18336 25.46973 583.62638 322.67044 961.39836
11.65000 -3890.26519 3.37416 -3.98587 267.98397 224.55699 462.53156
11.75000 -3852.74794 3.66895 16.91901 139.14679 165.55610 397.84461
11.85000 -3830.03642 5.92805 -0.67571 122.67542 119.53987 402.22656
11.95000 -3767.71399 -86.73361 -0.75617 659.83130 1911.34604 464.44566
12.05000 -3768.98952 17.76970 9.59384 219.04028 334.52639 457.80500
12.15000 -3742.99991 1.58989 10.54097 353.98705 107.12347 362.71066
12.25000 -3699.05505 5.42555 15.35587 152.23582 135.13656 359.24156
12.35000 -3665.25605 12.13399 -6.36457 111.30934 97.39274 357.35426
12.45000 -3640.51899 8.63206 51.45952 172.34507 238.96451 464.90066
12.55000 -3602.36450 -0.32420 30.09471 102.87217 91.54585 360.40934
12.65000 -3580.17900 8.48135 11.10599 128.65907 105.03509 403.49781
12.75000 -3531.04984 39.36996 -8.24830 357.70016 882.58131 398.18332
12.85000 -3519.14560 7.92974 0.44722 99.93236 84.25327 328.58843
12.95000 -3493.43537 3.69874 1.18499 183.13793 116.26853 341.09153
13.05000 -3473.77900 1.73295 9.22755 333.38455 130.11983 327.26271
13.15000 -3446.34488 0.97339 18.20164 173.46707 120.31557 295.31185
13.25000 -3392.23215 10.97344 25.40979 589.42166 340.24049 322.65030
13.35000 -3394.71598 6.84102 26.75898 129.49919 123.51975 298.49905
13.45000 -3358.98044 7.81959 24.17538 86.46217 82.32128 295.78108
13.55000 -3330.05885 0.75661 38.54480 74.63684 72.06164 339.61296
13.65000 -3310.61659 7.46012 8.39287 93.85710 122.93202 275.61661
13.75000 -3239.70321 24.01381 30.94079 730.92051 282.90688 303.51837
13.85000 -3255.84790 4.02157 -4.61471 91.49014 78.96849 285.92038
13.95000 -3237.68048 3.23893 -15.52592 467.03349 101.90395 385.37964
14.05000 -3188.04526 4.95143 11.91691 360.35036 89.56506 264.53010
14.15000 -3180.11305 1.31949 34.90902 101.59385 116.58299 265.62496
14.25000 -3151.75172 0.85331 6.46532 149.59355 129.66791 273.51285
14.35000 -3116.94631 10.64298 -6.06767 215.64786 147.58727 304.22209
14.45000 -3121.69416 -1.93752 -25.40816 220.45408 148.71524 291.79272
14.55000 -3100.64947 -0.07272 -31.81488 82.89854 74.27455 243.43815
14.65000 -3073.92284 7.97558 -13.45977 76.68855 70.49463 247.19372
14.75000 -3065.40928 9.07160 -59.20001 190.45461 182.37221 679.94483
14.85000 -3031.68100 16.25221 6.93969 66.21388 156.27841 242.52949
14.95000 -3010.78164 4.98471 2.50798 86.19349 103.75800 245.81022
15.05000 -2988.60222 1.87186 -22.78627 91.23074 65.00121 251.49827
15.15000 -3022.29261 -15.63920 26.42218 814.52463 283.14583 531.66471
15.25000 -2940.20333 4.79505 -9.22394 90.15195 71.58085 230.81886
15.35000 -2931.94401 24.62390 -19.95827 87.30995 261.84536 253.14153
15.45000 -2909.82946 -0.92009 -9.53630 57.67370 103.97539 222.91060
15.55000 -2888.11544 -10.33153 -4.29038 68.68063 220.22828 233.40220
15.65000 -2861.49022 2.86186 -37.41847 112.22098 79.83944 227.95174
15.75000 -2847.07411 -2.02582 2.13514 69.73722 155.90328 253.21256
15.85000 -2803.40415 8.47716 12.77976 310.17418 114.51677 224.56014
15.95000 -2805.87660 -7.52347 -15.58031 66.97812 163.90511 258.06050
16.05000 -2789.13820 0.73552 17.57480 66.96232 95.66459 204.38015
16.15000 -2757.80516 3.03276 5.99543 68.28799 86.68373 213.66598
16.25000 -2743.07362 6.41434 -11.15282 99.99193 105.71214 205.41403
16.35000 -2729.71287 -9.08287 12.41267 99.54241 114.61145 216.13442
16.45000 -2704.45823 -4.06698 -3.85057 126.77827 88.24914 210.89074
16.55000 -2693.82541 3.49467 31.81861 68.83268 74.13562 201.93117
16.65000 -2679.35217 2.55665 -11.78209 64.17264 94.56105 181.42455
16.75000 -2668.41753 -3.96426 18.17458 78.48922 40.17870 182.69020
16.85000 -2608.89961 -54.87093 -34.46247 169.87570 519.37895 359.09781
16.95000 -2652.58868 15.25400 48.52652 420.44203 74.69289 604.07737
17.05000 -2595.87301 8.43278 3.17408 63.21900 65.79863 175.27946
17.15000 -2593.90867 -19.66993 -11.60050 126.88269 211.25331 201.75803
17.25000 -2553.96774 -3.25974 -0.75122 88.49377 88.46313 183.81637
17.35000 -2571.41807 15.26218 29.35074 126.00614 125.97732 269.53024
17.45000 -2539.31928 -11.91950 -3.29706 53.02334 49.78863 181.35294
17.55000 -2500.29320 -21.81695 -52.63149 236.24576 268.08791 450.32155
17.65000 -2510.26193 -0.43446 -6.08593 72.16250 44.70104 177.41221
17.75000 -2481.19264 -10.66037 10.86420 62.37184 63.84525 186.39319
17.85000 -2479.18951 -2.86271 25.53250 66.73248 54.00382 165.50453
17.95000 -2472.81294 -8.12464 11.82438 61.41176 69.08735 151.37071
18.05000 -2450.12666 -9.75635 11.06663 60.88330 51.44449 171.91756
18.15000 -2434.21799 -1.83769 47.05323 53.61281 61.64745 156.57110
18.25000 -2426.24698 4.73404 -11.89844 83.43795 56.79906 170.66884
18.35000 -2419.49385 -2.36929 27.30034 52.47466 47.90017 152.02878
18.45000 -2398.25398 8.78880 21.53857 52.51364 63.69692 144.88997
18.55000 -2389.88860 9.09220 14.35791 66.09152 81.46058 138.13173
18.65000 -2361.48526 -0.08123 45.66489 67.12648 48.47460 150.30950
18.75000 -2361.00245 -7.51327 11.31549 63.18104 38.23827 132.14630
18.85000 -2343.60897 -4.60297 19.84662 40.31463 50.61949 124.75722
18.95000 -2325.46283 7.78442 -4.30550 39.31467 42.05078 126.32770
19.05000 -2325.62545 -5.99489 3.96888 60.24401 58.42227 123.56496
19.15000 -2298.22300 0.99497 -6.11770 58.47324 41.77106 126.10740
19.25000 -2308.26301 10.56439 18.47763 48.45755 66.56419 132.88175
19.35000 -2275.56695 4.10544 -0.34512 37.23916 34.63086 111.03782
19.45000 -2257.60612 1.41888 31.02145 52.69089 45.78842 125.45211
19.55000 -2251.43405 -0.09207 16.51798 56.53812 40.75643 112.84258
19.65000 -2235.75917 -3.28667 34.34789 40.33144 35.50367 124.02434
19.75000 -2228.40562 7.70858 31.17998 58.43607 40.67456 120.42066
19.85000 -2214.72442 4.05849 15.72260 36.57149 40.76934 86.48929
19.95000 -2198.16323 3.31385 26.06442 60.54818 37.35966 99.67530
