0.05000 -1055.43910 -55.03464 1083.83166 3285.31049 3117.61984 1671.89441
0.15000 -3219.66476 20.30344 851.52435 3280.99757 3333.63621 3272.92907
0.25000 -4285.92860 244.47702 445.59905 3500.77026 3324.28227 4935.56432
0.35000 -5567.95244 -140.95808 -48.49838 3348.10852 3520.90517 6313.62179
0.45000 -6474.89794 121.75982 223.22502 3287.44511 3347.75552 7357.24311
0.55000 -7385.35995 133.08558 286.77825 3247.47152 3276.95507 8354.51165
0.65000 -8107.45476 138.57923 275.57246 3082.37658 3191.20428 8968.78090
0.75000 -8620.54080 31.09748 55.86079 3115.61905 3057.67834 9360.36624
0.85000 -8964.05219 58.17023 55.71448 3107.16300 2951.81703 9432.62305
0.95000 -9152.73196 74.39428 245.07380 3120.81823 2863.59814 9441.74328
1.05000 -9283.88767 96.89956 10.24593 3071.20848 2770.05374 9333.94450
1.15000 -9399.46814 72.20181 6.56063 2987.74940 2702.43216 9218.35105
1.25000 -9558.85396 70.01210 -162.04942 2897.87312 2644.46541 8906.76115
1.35000 -9472.58958 46.98954 150.55230 2833.74527 2605.67488 8735.67811
1.45000 -9511.32823 20.83197 69.93600 2659.08539 2530.34746 8514.85872
1.55000 -9508.99396 74.80990 106.58567 2602.62731 2458.37341 8340.04660
1.65000 -9540.95163 78.69037 -118.04766 2472.48649 2427.04130 8006.44877
1.75000 -9464.10867 60.54783 -67.30012 2368.07660 2321.25242 7808.56094
1.85000 -9431.38957 107.23903 -136.69932 2216.24285 2264.54473 7423.84407
1.95000 -9359.08603 113.23567 -43.74190 2105.90668 2179.27405 7151.09782
2.05000 -9228.17309 50.95654 202.11807 2077.17421 2098.21414 6957.15150
2.15000 -9121.71281 98.38181 44.94910 1965.31660 2023.98265 6751.87888
2.25000 -9008.29779 76.82618 144.83286 1859.50459 1944.50519 6489.81992
2.35000 -8933.14038 59.35879 218.48129 1746.34630 1892.38004 6233.45573
2.45000 -8759.61825 59.55288 192.26224 1689.85798 1811.43455 6072.81387
2.55000 -8643.63491 21.60141 120.09381 1591.34890 1757.25028 5880.95381
2.65000 -8525.85965 57.73292 -39.02833 1501.81384 1698.33627 5674.77359
2.75000 -8380.72259 20.56304 -6.11853 1429.53585 1638.37846 5523.22985
2.85000 -8288.13436 47.47792 -128.83444 1314.58785 1588.06732 5238.50468
2.95000 -8183.34077 42.62569 -179.15387 1260.98738 1549.31868 5067.39544
3.05000 -8053.93675 31.38993 -289.40181 1231.71121 1487.75830 4913.85841
3.15000 -7960.36645 27.65833 -335.86690 1113.68063 1431.98194 4730.11211
3.25000 -7850.23731 41.13149 -383.28285 1096.13530 1401.40426 4584.17354
3.35000 -7733.68876 34.41214 -378.62222 1040.24485 1353.54355 4457.26775
3.45000 -7679.48874 55.38494 -462.51459 973.84120 1310.78146 4211.32483
3.55000 -7564.54141 24.32006 -458.68267 947.02488 1267.53627 4101.60681
3.65000 -7438.07670 47.17155 -455.88350 888.43101 1221.41704 4018.72380
3.75000 -7359.88117 63.36835 -412.66174 824.66509 1186.35775 3853.19549
3.85000 -7274.69959 56.14466 -480.02113 791.94477 1160.68816 3718.89813
3.95000 -7181.82296 62.35044 -450.15786 736.53490 1122.73540 3563.34778
4.05000 -7082.23054 56.88961 -194.10279 706.78828 1093.64057 3437.01005
4.15000 -6998.78094 65.00166 -332.25137 676.31198 1049.83399 3387.09372
4.25000 -6930.05743 22.70854 -282.45615 646.97833 1027.18755 3249.49905
4.35000 -6882.17039 31.96741 -252.90529 622.22591 998.86466 3158.15684
4.45000 -6802.56021 -5.25158 -284.75847 633.31484 969.55391 3080.19617
4.55000 -6747.42932 -7.95052 -130.82940 603.67360 944.20795 2983.72314
4.65000 -6691.75133 -10.00007 -125.69275 581.23531 903.01219 2910.18513
4.75000 -6628.51922 12.39651 -15.89798 573.24785 884.45189 2834.27470
4.85000 -6579.11135 -6.86926 52.22897 551.59528 859.84044 2709.19242
4.95000 -6549.93603 -17.26523 106.03828 550.66326 826.35866 2618.49000
5.05000 -6499.22607 -2.88776 153.66717 552.34472 797.76453 2486.24385
5.15000 -6433.04411 -11.27927 196.01364 546.42368 763.09436 2407.98294
5.25000 -6375.22494 -9.65898 231.53164 558.15254 730.71573 2352.06627
5.35000 -6345.78927 -5.28904 201.58855 562.62475 707.85898 2266.01590
5.45000 -6295.65566 2.35239 216.55590 568.79213 665.69487 2201.92330
5.55000 -6260.01312 21.72890 230.64575 579.33378 645.41637 2124.38062
5.65000 -6206.25033 15.30388 191.60577 575.98106 606.54320 2085.66282
5.75000 -6142.48220 32.50880 224.72491 564.25861 584.90330 2007.72579
5.85000 -6121.37481 47.04409 181.36801 558.69544 558.96903 1963.91821
5.95000 -6069.08859 58.09580 168.66297 538.17804 529.07310 1907.03887
6.05000 -6028.78949 54.34321 149.79875 526.34764 509.08489 1877.75821
6.15000 -5987.64121 53.91268 149.67195 513.24772 483.56795 1812.74066
6.25000 -5942.78964 58.10573 76.24703 487.56093 460.04343 1762.22665
6.35000 -5912.63144 62.28938 71.08237 473.92749 436.60960 1736.04506
6.45000 -5881.71867 56.57958 120.17004 473.00382 420.80982 1670.76352
6.55000 -5834.89714 59.10033 83.50627 459.81358 404.52689 1633.25990
6.65000 -5811.03506 56.74091 42.50690 444.19933 388.70113 1576.34387
6.75000 -5766.12297 56.22805 21.93799 434.44635 368.21844 1560.79907
6.85000 -5731.38374 53.81472 60.59479 433.10700 357.32424 1538.36988
6.95000 -5686.59550 49.54347 54.81363 417.40522 338.14281 1486.44076
7.05000 -5649.63653 58.44799 62.20037 413.64669 328.54951 1436.44110
7.15000 -5601.12180 54.20016 10.07152 399.43095 317.55928 1402.08214
7.25000 -5547.27094 50.94751 79.58535 406.33334 301.95472 1377.54870
7.35000 -5517.15994 45.39071 26.64443 386.78206 287.36299 1347.76279
7.45000 -5472.16759 45.44025 64.89216 372.68509 277.21299 1330.07611
7.55000 -5426.52990 44.90119 70.83825 360.93574 263.90682 1277.88252
7.65000 -5378.37685 43.76831 40.45130 347.95557 254.08484 1261.06840
7.75000 -5337.67086 40.06629 18.43365 335.79234 241.89262 1227.31400
7.85000 -5292.18226 44.68981 44.41662 329.91760 234.97477 1198.10148
7.95000 -5250.23006 41.45142 36.64245 309.51815 225.23708 1162.64009
8.05000 -5210.47489 43.37849 56.72454 306.45649 215.51548 1133.14344
8.15000 -5170.80713 38.54138 43.30814 296.72469 209.95434 1115.86062
8.25000 -5123.14113 41.09909 34.78529 288.09248 195.26210 1093.61657
8.35000 -5085.67023 39.58257 36.39006 279.18837 196.06826 1075.95867
8.45000 -5040.06851 41.82555 45.58741 260.29238 190.31516 1028.79060
8.55000 -5004.30496 46.47714 30.82233 264.51173 182.02953 1019.42526
8.65000 -4972.03865 38.26929 51.04143 253.07173 180.14524 986.39740
8.75000 -4930.84962 39.38378 44.08679 254.54767 174.47542 966.75320
8.85000 -4890.76394 36.43861 47.08614 235.16112 167.44203 942.80923
8.95000 -4853.53072 37.00458 19.24605 239.30975 162.81549 934.52074
9.05000 -4813.71687 34.80959 24.25755 239.77381 156.34173 926.08438
9.15000 -4777.32889 30.73146 16.16901 223.89515 155.40402 884.44273
9.25000 -4733.92089 31.49593 -3.95295 218.13205 145.90902 884.77060
9.35000 -4699.63330 35.26251 49.62843 208.58477 146.15343 854.69871
9.45000 -4655.77556 33.38235 8.03458 206.90335 142.42948 833.98082
9.55000 -4631.44837 30.03456 57.82744 200.72610 139.79730 801.82245
9.65000 -4587.69223 26.87787 37.16294 196.30718 133.82402 793.00110
9.75000 -4558.80624 29.80171 36.89281 184.03476 130.59370 773.94540
9.85000 -4521.04882 29.02405 12.65789 180.88428 130.09644 765.69090
9.95000 -4484.43836 27.54463 32.94413 166.68421 123.96358 744.01964
10.05000 -4447.90297 29.40726 46.70744 165.92993 119.80149 730.46864
10.15000 -4414.03568 28.91127 33.15741 158.85422 115.88397 707.95021
10.25000 -4377.72838 24.24070 28.61402 155.46906 115.05132 697.85288
10.35000 -4341.19461 29.00192 30.79244 152.18618 112.59668 679.99289
10.45000 -4306.59795 24.44561 37.68845 152.30975 112.28904 661.82353
10.55000 -4269.57475 27.40935 33.64975 145.25738 110.62776 661.59592
10.65000 -4233.57487 25.98386 17.54182 142.51331 103.71811 634.65187
10.75000 -4200.81256 25.41972 29.10382 143.31584 108.25866 629.58527
10.85000 -4163.84329 25.68515 27.25357 131.72331 105.45091 608.51242
10.95000 -4137.80721 21.69980 54.06471 145.29892 110.38290 595.44746
11.05000 -4107.04365 24.09169 33.22364 142.24643 107.86577 585.73626
11.15000 -4076.82183 20.77340 17.49745 136.52716 100.06343 570.37392
11.25000 -4045.13988 19.45595 43.82437 133.15043 100.09740 564.22392
11.35000 -4014.24362 19.02812 39.21667 131.92177 96.75419 543.03897
11.45000 -3982.63148 21.03865 23.34542 135.66323 102.64766 527.64342
11.55000 -3946.04016 21.23101 28.25836 128.86162 98.38143 529.10872
11.65000 -3914.73317 21.25649 33.50953 126.39650 91.57064 503.29559
11.75000 -3883.63689 17.50186 41.12579 124.53151 91.81407 499.54595
11.85000 -3849.38095 15.62830 26.40611 120.64733 91.27167 496.78374
11.95000 -3816.88635 23.44578 26.94912 129.98797 88.93396 491.96590
12.05000 -3785.79527 19.90549 42.20140 118.51096 96.26955 481.11432
12.15000 -3758.41681 15.66171 17.36020 112.34383 89.35385 471.14770
12.25000 -3727.81846 18.48160 37.25973 108.26135 85.10046 450.08665
12.35000 -3693.80910 18.61574 27.07127 110.33833 86.61383 451.59984
12.45000 -3664.22295 21.22905 15.44568 111.86211 80.69655 447.67030
12.55000 -3641.20042 20.13557 15.28079 110.46629 86.26918 427.88524
12.65000 -3606.15927 15.44584 0.79150 111.73195 78.87522 431.97901
12.75000 -3576.79064 20.69578 9.01219 108.06343 79.69794 421.87377
12.85000 -3552.96649 18.72673 21.15069 99.24567 75.26414 407.01799
12.95000 -3519.63124 19.00116 4.91719 109.23794 76.54605 411.09694
13.05000 -3503.06155 18.86400 -9.34941 104.35228 81.28187 404.00184
13.15000 -3472.35343 19.75355 0.57150 102.18161 77.74063 405.68940
13.25000 -3448.35360 16.54715 1.05017 103.69603 74.38511 394.24456
13.35000 -3422.92566 20.03004 -6.71837 103.44211 84.09540 392.38668
13.45000 -3398.00785 15.97473 -21.52693 94.85428 73.45997 377.00951
13.55000 -3375.48612 16.66931 -26.83684 100.28860 79.20137 369.54530
13.65000 -3350.74408 16.18155 -16.28412 96.53874 73.19284 367.78877
13.75000 -3328.47198 19.16522 -1.00143 91.89078 73.93420 364.21905
13.85000 -3308.02057 16.21484 -12.37188 88.10034 69.90246 358.60401
13.95000 -3282.23625 16.95342 -12.50849 96.80188 71.53192 364.20306
14.05000 -3264.38677 16.43001 -19.47385 91.82396 73.14737 343.79053
14.15000 -3243.56894 21.74047 -12.98555 91.98434 70.25699 346.74489
14.25000 -3223.49438 16.33494 -0.98593 89.53359 69.25966 329.49941
14.35000 -3201.46942 14.48943 -23.73304 90.01966 68.38666 323.32328
14.45000 -3177.71274 19.13183 -1.09557 87.07529 66.01431 331.71224
14.55000 -3161.57272 15.54422 -19.36685 91.93590 69.67968 327.00216
14.65000 -3141.79592 15.55350 -20.12972 83.71370 65.28885 308.76524
14.75000 -3124.22589 14.97344 -20.82712 87.04136 65.99130 305.76611
14.85000 -3099.45562 17.80515 -35.86414 85.22493 69.59823 311.74853
14.95000 -3076.90689 14.56702 -13.47656 82.98270 61.38308 310.75141
15.05000 -3059.45498 15.85510 -13.71157 85.04006 66.77420 301.00668
15.15000 -3042.68962 13.96074 -25.41216 88.99830 66.49330 286.10202
15.25000 -3029.01358 14.01559 -20.97420 85.10288 61.90439 283.87489
15.35000 -3010.20950 14.58616 -25.63297 80.48719 66.28877 270.58634
15.45000 -2991.43111 15.60203 -15.78730 79.22191 64.81677 277.03800
15.55000 -2971.89311 14.60168 -17.74928 72.75359 57.36216 269.93316
15.65000 -2948.49686 12.91042 -39.02728 83.90082 56.48894 269.97298
15.75000 -2933.58264 14.91193 -26.39597 79.97541 61.41699 261.48263
15.85000 -2918.31913 13.73259 -13.71152 74.91573 56.37313 254.82039
15.95000 -2896.18896 15.39587 -24.76493 79.03901 62.77156 253.54788
16.05000 -2876.14569 12.23235 -20.14261 72.26328 62.31183 234.83654
16.15000 -2860.60783 13.33852 -24.33725 75.95732 59.22503 245.50163
16.25000 -2838.43274 14.49361 -28.46981 73.12401 61.87511 237.59625
16.35000 -2823.32659 14.06279 -22.94715 74.33014 64.67280 225.70379
16.45000 -2804.07990 15.09748 -10.60478 66.17070 52.48507 227.25526
16.55000 -2787.00621 10.85455 -21.45048 74.25322 68.03487 224.03297
16.65000 -2765.06092 11.60302 3.20381 78.52053 59.27266 223.99025
16.75000 -2750.48772 14.33406 -27.18246 76.11222 53.27122 215.05672
16.85000 -2731.07112 14.10296 -26.53741 69.50002 49.05088 212.98094
16.95000 -2715.08816 10.98633 -21.96730 80.19517 58.04704 203.98734
17.05000 -2699.38959 10.44803 -23.09695 71.13107 61.17849 207.31229
17.15000 -2682.49923 11.94818 -12.55177 64.61977 52.64640 192.66500
17.25000 -2665.08414 11.41641 -27.91965 60.78853 50.40564 194.64865
17.35000 -2645.50478 8.85948 -2.39464 74.78617 65.27181 191.51315
17.45000 -2628.48402 10.31705 -9.27454 71.61868 50.89697 194.39143
17.55000 -2614.84879 9.33012 -4.10361 64.74979 54.87442 184.64541
17.65000 -2595.49847 11.72673 -10.69058 60.47801 48.87320 184.63226
17.75000 -2583.47227 8.57923 -7.48429 57.41345 51.26240 177.58134
17.85000 -2565.99444 11.90780 -7.28546 66.69424 67.39126 175.43957
17.95000 -2543.75792 7.21831 4.47858 65.13596 51.84270 181.16482
18.05000 -2530.95754 8.37816 -3.28314 59.20022 51.35981 172.97784
18.15000 -2519.38316 7.45365 -0.31093 57.36777 46.07731 170.19089
18.25000 -2501.17977 7.46036 -5.67517 57.01597 52.93374 165.37315
18.35000 -2487.26307 8.37252 1.42111 58.19652 50.70326 160.36691
18.45000 -2473.06942 11.41187 -7.88364 74.17698 59.59220 154.94825
18.55000 -2454.66355 7.71173 -15.64100 54.97081 50.73141 163.29089
18.65000 -2441.60014 3.84328 -10.14006 50.37759 52.96666 161.38829
18.75000 -2427.78071 8.02579 -4.98214 60.65594 55.19960 159.72194
18.85000 -2413.56154 6.19438 -4.01814 51.64219 51.07705 148.13911
18.95000 -2399.13158 9.72370 -5.11973 49.91076 42.17878 151.91819
19.05000 -2385.51432 5.03320 11.08916 51.63816 46.92883 150.85323
19.15000 -2369.38853 6.09530 -15.37179 53.74134 49.23405 144.73273
19.25000 -2353.18685 8.68286 -8.72258 57.09422 48.15874 149.18990
19.35000 -2343.25391 9.33155 -7.51285 59.36442 42.77748 140.67283
19.45000 -2333.73940 8.82403 -2.40712 77.30978 48.44908 139.65142
19.55000 -2324.34142 9.03295 -6.13558 62.34173 56.87913 141.46860
19.65000 -2307.85117 4.43624 3.87457 49.90256 42.52275 134.75346
19.75000 -2294.86271 9.25708 5.67958 49.68859 49.70971 151.64248
19.85000 -2282.65197 4.88516 3.13516 51.22438 49.70769 136.10888
19.95000 -2270.59091 7.73980 4.61224 60.47597 62.40664 137.33810
