0.12500 0.02624
0.37500 0.01375
0.62500 0.02338
0.87500 0.00452
1.12500 0.00923
1.37500 0.00956
1.62500 0.00957
1.87500 0.00337
2.12500 0.01436
2.37500 0.01465
2.62500 0.01555
2.87500 0.00684
3.12500 0.01872
3.37500 0.01492
3.62500 0.01623
3.87500 0.01276
4.12500 0.01200
4.37500 0.01354
4.62500 0.01279
4.87500 0.00911
5.12500 0.01828
5.37500 0.00739
5.62500 0.02189
5.87500 0.02263
6.12500 0.03068
6.37500 0.04311
6.62500 0.03663
6.87500 0.02625
7.12500 0.02729
7.37500 0.01490
7.62500 0.01493
7.87500 0.01449
8.12500 0.04110
8.37500 0.03338
8.62500 0.03373
8.87500 0.01929
9.12500 0.02111
9.37500 0.01318
9.62500 0.01599
9.87500 0.00794
10.12500 0.00855
10.37500 0.01125
10.62500 0.01005
10.87500 0.02118
11.12500 0.03119
11.37500 0.04656
11.62500 0.02652
11.87500 0.02437
12.12500 0.02207
12.37500 0.03541
12.62500 0.03896
12.87500 0.01020
13.12500 0.00699
13.37500 0.02081
13.62500 0.01976
13.87500 0.02036
14.12500 0.01673
14.37500 0.01346
14.62500 0.01523
14.87500 0.02352
