0.05000 1429.31506
0.15000 3137.96231
0.25000 5166.92627
0.35000 6239.58158
0.45000 7370.74625
0.55000 8139.00787
0.65000 8697.82829
0.75000 8920.54467
0.85000 8923.44606
0.95000 8928.65195
1.05000 8911.44812
1.15000 8557.20718
1.25000 8329.28370
1.35000 8109.56819
1.45000 7824.15009
1.55000 7661.29422
1.65000 7387.81020
1.75000 7065.07893
1.85000 6852.60932
1.95000 6571.14919
2.05000 6395.35741
2.15000 6082.75705
2.25000 5957.23809
2.35000 5728.91371
2.45000 5414.88400
2.55000 5278.23072
2.65000 5093.84255
2.75000 4839.22589
2.85000 4689.69123
2.95000 4519.00443
3.05000 4339.99072
3.15000 4184.38418
3.25000 4038.72906
3.35000 3904.58888
3.45000 3710.90975
3.55000 3624.74240
3.65000 3519.74159
3.75000 3397.01339
3.85000 3269.16712
3.95000 3112.74420
4.05000 3094.24596
4.15000 2948.24951
4.25000 2861.05834
4.35000 2817.41251
4.45000 2664.70513
4.55000 2582.21424
4.65000 2492.80495
4.75000 2425.55689
4.85000 2328.08733
4.95000 2288.38273
5.05000 2208.33114
5.15000 2164.86874
5.25000 2084.75086
5.35000 1979.17209
5.45000 1927.08588
5.55000 1887.27435
5.65000 1850.54387
5.75000 1741.95179
5.85000 1703.09707
5.95000 1668.29931
6.05000 1607.70070
6.15000 1565.02992
6.25000 1556.47844
6.35000 1517.66528
6.45000 1475.25162
6.55000 1482.39693
6.65000 1440.72379
6.75000 1404.42781
6.85000 1353.20501
6.95000 1365.41236
7.05000 1333.43487
7.15000 1287.66040
7.25000 1248.07329
7.35000 1227.99900
7.45000 1189.21505
7.55000 1176.72177
7.65000 1141.26126
7.75000 1099.38843
7.85000 1089.85556
7.95000 1063.92183
8.05000 1041.16209
8.15000 1009.20239
8.25000 974.76008
8.35000 944.62750
8.45000 922.61743
8.55000 903.92321
8.65000 881.20459
8.75000 862.14414
8.85000 845.04387
8.95000 825.69768
9.05000 801.35616
9.15000 789.29255
9.25000 757.71592
9.35000 743.23408
9.45000 730.75808
9.55000 716.69340
9.65000 693.60941
9.75000 681.32779
9.85000 658.23886
9.95000 642.50453
10.05000 632.21066
10.15000 616.06730
10.25000 596.85320
10.35000 595.67176
10.45000 584.76924
10.55000 565.46100
10.65000 550.72297
10.75000 541.01119
10.85000 540.24218
10.95000 523.25246
11.05000 497.39430
11.15000 479.36719
11.25000 472.94590
11.35000 476.93796
11.45000 457.64647
11.55000 461.85554
11.65000 439.90760
11.75000 439.69049
11.85000 429.48351
11.95000 420.05711
12.05000 415.05256
12.15000 405.99918
12.25000 397.07947
12.35000 380.84292
12.45000 377.43898
12.55000 363.84566
12.65000 363.68476
12.75000 360.64864
12.85000 350.72027
12.95000 342.47037
13.05000 331.69771
13.15000 336.11545
13.25000 323.78498
13.35000 318.96651
13.45000 322.27804
13.55000 317.48443
13.65000 299.66410
13.75000 309.70046
13.85000 304.49140
13.95000 290.98371
14.05000 287.96181
14.15000 286.93933
14.25000 277.41719
14.35000 280.71169
14.45000 269.26812
14.55000 266.72903
14.65000 254.52333
14.75000 266.71365
14.85000 260.01709
14.95000 251.45950
15.05000 245.70094
15.15000 234.75084
15.25000 238.75802
15.35000 233.91540
15.45000 230.51212
15.55000 232.87609
15.65000 213.27761
15.75000 216.43113
15.85000 216.41715
15.95000 211.58775
16.05000 211.94178
16.15000 217.36703
16.25000 203.69039
16.35000 202.05037
16.45000 197.11395
16.55000 196.95373
16.65000 193.08683
16.75000 198.43493
16.85000 181.15918
16.95000 183.64766
17.05000 175.46347
17.15000 178.93981
17.25000 174.90424
17.35000 173.96715
17.45000 162.61179
17.55000 161.58877
17.65000 161.78078
17.75000 161.95722
17.85000 166.51744
17.95000 151.71174
18.05000 158.00700
18.15000 147.59160
18.25000 154.32269
18.35000 152.76070
18.45000 147.74650
18.55000 142.58227
18.65000 150.46876
18.75000 139.65250
18.85000 127.32103
18.95000 131.86594
19.05000 128.94829
19.15000 135.45434
19.25000 128.95682
19.35000 139.78776
19.45000 126.68003
19.55000 126.77806
19.65000 125.01775
19.75000 127.27083
19.85000 126.34997
19.95000 124.58977
