0.12500 0.04517
0.37500 0.03309
0.62500 0.10629
0.87500 0.16581
1.12500 0.21302
1.37500 0.25121
1.62500 0.28022
1.87500 0.32410
2.12500 0.34318
2.37500 0.34879
2.62500 0.36327
2.87500 0.38487
3.12500 0.40478
3.37500 0.41894
3.62500 0.43906
3.87500 0.45026
4.12500 0.46522
4.37500 0.46920
4.62500 0.47388
4.87500 0.47653
5.12500 0.46914
5.37500 0.45056
5.62500 0.42828
5.87500 0.39014
6.12500 0.34347
6.37500 0.29448
6.62500 0.23420
6.87500 0.19433
7.12500 0.15498
7.37500 0.14387
7.62500 0.11488
7.87500 0.11093
8.12500 0.12555
8.37500 0.13955
8.62500 0.16654
8.87500 0.18167
9.12500 0.18354
9.37500 0.19105
9.62500 0.18524
9.87500 0.17307
10.12500 0.16153
10.37500 0.15892
10.62500 0.16536
10.87500 0.14101
11.12500 0.10267
11.37500 0.09566
11.62500 0.08170
11.87500 0.06517
12.12500 0.06314
12.37500 0.03226
12.62500 0.03071
12.87500 0.02120
13.12500 0.01392
13.37500 0.00580
13.62500 0.01009
13.87500 0.02321
14.12500 0.03302
14.37500 0.03518
14.62500 0.04851
14.87500 0.04036
15.12500 0.05348
15.37500 0.04676
15.62500 0.06395
15.87500 0.08900
16.12500 0.09928
16.37500 0.12014
16.62500 0.13110
16.87500 0.13834
17.12500 0.10758
17.37500 0.11875
17.62500 0.08747
17.87500 0.07891
18.12500 0.06431
18.37500 0.03523
18.62500 0.06227
18.87500 0.04884
19.12500 0.02119
19.37500 0.02651
19.62500 0.03141
19.87500 0.03229
