0.05000 23028.34585
0.15000 29220.32295
0.25000 28620.36296
0.35000 24367.59200
0.45000 20948.79614
0.55000 18233.70127
0.65000 16954.45794
0.75000 15015.56310
0.85000 13673.84053
0.95000 12382.12832
1.05000 11360.49989
1.15000 10646.79067
1.25000 9785.26999
1.35000 9240.14893
1.45000 8643.99385
1.55000 8029.76610
1.65000 7322.19254
1.75000 7211.52199
1.85000 6812.72769
1.95000 6416.25517
2.05000 6023.13027
2.15000 5770.10087
2.25000 5538.65020
2.35000 5208.96576
2.45000 5047.49686
2.55000 4803.46890
2.65000 4534.33157
2.75000 4250.49125
2.85000 4143.55501
2.95000 4002.38527
3.05000 3861.53626
3.15000 3666.88587
3.25000 3467.51129
3.35000 3398.43525
3.45000 3214.97523
3.55000 2974.32092
3.65000 2906.99283
3.75000 2771.86110
3.85000 2721.91235
3.95000 2596.15807
4.05000 2544.33849
4.15000 2505.75134
4.25000 2418.12456
4.35000 2317.04274
4.45000 2292.78930
4.55000 2216.94998
4.65000 2140.77750
4.75000 2070.35757
4.85000 2076.10212
4.95000 1973.90346
5.05000 1952.72478
5.15000 1888.35796
5.25000 1821.30057
5.35000 1794.49233
5.45000 1720.19416
5.55000 1641.69540
5.65000 1583.33373
5.75000 1521.52003
5.85000 1550.60668
5.95000 1432.91179
6.05000 1394.47193
6.15000 1343.61306
6.25000 1332.74817
6.35000 1293.95449
6.45000 1252.59390
6.55000 1169.40712
6.65000 1136.34545
6.75000 1114.13571
6.85000 1096.51666
6.95000 1084.89837
7.05000 1065.66390
7.15000 987.12173
7.25000 973.85937
7.35000 937.99717
7.45000 890.68188
7.55000 872.83923
7.65000 894.54089
7.75000 870.23494
7.85000 828.45250
7.95000 826.69821
8.05000 776.28105
8.15000 740.27269
8.25000 736.30979
8.35000 749.64866
8.45000 711.98445
8.55000 687.27652
8.65000 669.55625
8.75000 664.32353
8.85000 658.16887
8.95000 628.01571
9.05000 655.94739
9.15000 608.86650
9.25000 606.78895
9.35000 594.31126
9.45000 561.19175
9.55000 598.35294
9.65000 515.65431
9.75000 582.77706
9.85000 530.94659
9.95000 541.54836
10.05000 521.15526
10.15000 494.57645
10.25000 504.11609
10.35000 466.59879
10.45000 496.63833
10.55000 491.38046
10.65000 473.56251
10.75000 437.60311
10.85000 441.18993
10.95000 450.71722
11.05000 417.94121
11.15000 419.60593
11.25000 406.62081
11.35000 405.62266
11.45000 393.69501
11.55000 392.13254
11.65000 381.85478
11.75000 360.86444
11.85000 368.72731
11.95000 339.67790
12.05000 340.30249
12.15000 359.41727
12.25000 330.78390
12.35000 335.01652
12.45000 308.06927
12.55000 305.65063
12.65000 302.62363
12.75000 301.64623
12.85000 300.75801
12.95000 287.22176
13.05000 289.62316
13.15000 285.84821
13.25000 271.49031
13.35000 267.97775
13.45000 268.68275
13.55000 264.75300
13.65000 253.83983
13.75000 277.99983
13.85000 252.64841
13.95000 232.68905
14.05000 234.00411
14.15000 213.59752
14.25000 222.95297
14.35000 221.34557
14.45000 221.69143
14.55000 207.65349
14.65000 188.36127
14.75000 197.10187
14.85000 205.16435
14.95000 237.09493
15.05000 199.15880
15.15000 192.80473
15.25000 228.81116
15.35000 179.20604
15.45000 190.72455
15.55000 180.66824
15.65000 193.21133
15.75000 201.71713
15.85000 171.92710
15.95000 162.04219
16.05000 166.21424
16.15000 205.13940
16.25000 191.81673
16.35000 179.01957
16.45000 153.98793
16.55000 168.02166
16.65000 186.82462
16.75000 168.47383
16.85000 160.01872
16.95000 167.06853
17.05000 171.93515
17.15000 154.34734
17.25000 172.18264
17.35000 142.51202
17.45000 139.18879
17.55000 147.43748
17.65000 153.39492
17.75000 156.38676
17.85000 171.06403
17.95000 146.30740
18.05000 130.70846
18.15000 135.63289
18.25000 143.88764
18.35000 122.36455
18.45000 134.76532
18.55000 137.67650
18.65000 123.92411
18.75000 117.04553
18.85000 126.51897
18.95000 140.97968
19.05000 118.14688
19.15000 126.40890
19.25000 112.52893
19.35000 111.24126
19.45000 105.37392
19.55000 109.35365
19.65000 114.29825
19.75000 117.53445
19.85000 117.87451
19.95000 129.81093
