0.05000 -1475.69147 -190.49658 -1457.17838 3436.61483 2030.35150 3436.17870
0.15000 -4578.48503 -1366.34023 -1124.16041 7433.61621 6619.34273 6461.21655
0.25000 -5670.62691 -203.81267 -1029.81008 4996.14504 4500.74069 8786.97835
0.35000 -6213.23152 -88.42918 -979.52607 3452.78445 3662.50396 8102.74704
0.45000 -6748.78584 64.89291 -163.35331 3613.41602 2456.04837 8686.18647
0.55000 -7112.03815 12.92520 -305.99948 2790.89805 2005.36809 8556.39282
0.65000 -7326.27445 48.10561 -93.12540 2806.98077 2271.40057 8963.41220
0.75000 -7462.16601 40.15716 -150.42909 2203.82598 2025.26451 8630.70107
0.85000 -7826.94998 -89.70562 19.52023 2497.49600 2151.91875 8706.84323
0.95000 -8044.64167 31.52241 -231.20444 3194.95341 2167.82803 8343.50566
1.05000 -8348.15702 52.96814 305.80883 2615.95420 2477.14405 8225.42760
1.15000 -8497.44637 15.10190 -325.40355 2048.75420 1472.02109 7744.65026
1.25000 -8604.30129 -8.64300 336.81512 2086.17076 1465.42386 7541.59177
1.35000 -8642.42584 30.88018 269.93330 1964.05792 1810.41995 7294.75385
1.45000 -8840.20782 27.56310 165.53553 1816.47504 1242.95365 6730.75105
1.55000 -8903.06968 28.70542 -23.79541 1886.55006 1322.74965 6707.48072
1.65000 -9038.78310 21.36254 252.50496 2029.23223 1454.01130 6452.84078
1.75000 -9118.61473 55.58332 156.70502 1636.55599 1943.09377 6097.07080
1.85000 -9035.23316 46.70806 157.59540 2231.88309 1577.84692 6003.00486
1.95000 -9055.16150 53.39386 141.05316 1479.34522 1059.09986 5621.67578
2.05000 -8988.71208 37.82265 -75.13189 1451.51380 1093.83038 5734.58010
2.15000 -8884.94897 29.44122 173.13464 1294.32999 945.84185 5253.58942
2.25000 -8832.42241 -0.39536 -234.94841 1429.51206 1415.59907 4958.79903
2.35000 -8737.39695 49.26584 116.63818 1345.09459 1282.46998 4878.48530
2.45000 -8645.59359 26.71766 114.76088 1007.80331 1023.64024 4633.71846
2.55000 -8661.44777 23.30038 -15.27020 1302.11621 1050.54463 4503.43089
2.65000 -8522.01162 48.45024 -70.86552 1250.05028 1073.10316 4381.98566
2.75000 -8463.12612 38.59740 134.16722 1450.17112 1478.88759 4229.61300
2.85000 -8393.84194 16.54016 -13.75332 1072.27678 990.80157 4033.48373
2.95000 -8323.14263 52.95147 107.95237 1003.04806 734.65378 3951.27587
3.05000 -8259.72869 9.22768 58.83174 912.89179 641.15226 3766.71410
3.15000 -8170.26392 39.74819 7.86760 1413.74440 771.64920 3803.34308
3.25000 -8134.05397 37.08177 30.98570 1027.32959 708.56997 3506.07199
3.35000 -8039.49581 6.47907 75.47800 1167.43740 1473.92135 3664.82936
3.45000 -7947.97824 13.40727 86.87634 1133.09934 643.97278 3313.18096
3.55000 -7877.04584 26.79957 44.53798 753.05007 589.82302 3213.20594
3.65000 -7795.94365 7.56460 -69.34731 892.68430 751.86472 3116.25861
3.75000 -7736.30955 17.69233 -45.94022 715.32397 993.41365 3039.27190
3.85000 -7662.39807 33.73482 41.92681 652.05607 629.13729 2875.48826
3.95000 -7533.99646 41.10694 31.29399 1415.75509 2203.28898 3031.18589
4.05000 -7504.34348 13.47671 7.79515 634.14441 606.54859 2707.42162
4.15000 -7417.31535 21.60772 58.30132 758.44135 615.81774 2656.20917
4.25000 -7344.26108 35.93900 17.52300 853.15715 890.89913 2609.16398
4.35000 -7264.27402 15.69657 20.90474 604.38953 533.51625 2527.00798
4.45000 -7159.37434 8.24769 -7.06687 648.46488 466.56837 2445.97774
4.55000 -7139.26516 18.17249 11.45826 704.75647 506.21699 2364.47390
4.65000 -7097.44924 13.00629 -33.45281 562.13385 528.33091 2268.92469
4.75000 -7034.58432 9.07335 51.24357 944.56312 778.10162 2248.95466
4.85000 -6968.77224 22.00134 -19.71288 534.51917 574.84264 2203.48358
4.95000 -6930.18192 7.07899 1.02440 943.76344 769.13169 2143.20409
5.05000 -6877.67222 12.41122 -4.66318 597.65580 550.40048 2055.19453
5.15000 -6818.09281 19.34656 -22.68815 624.12824 746.08073 2108.44032
5.25000 -6749.07777 2.99054 -9.07113 660.17435 736.14583 2590.81235
5.35000 -6694.72071 9.62069 -32.73467 543.82334 850.74032 1906.94045
5.45000 -6626.83751 25.15652 -105.48048 575.58827 544.33080 1888.78308
5.55000 -6567.36108 7.77427 -58.89237 489.05650 478.01095 1811.22599
5.65000 -6484.89020 3.27615 -56.01352 547.66752 421.50117 1746.17291
5.75000 -6413.88408 11.65921 -101.02657 475.18646 381.77380 1657.66189
5.85000 -6374.78551 14.45982 -85.87641 399.27910 410.54937 1643.75733
5.95000 -6282.95731 12.52001 -36.23142 580.37514 479.92086 1661.32522
6.05000 -6226.57830 11.13140 -53.08210 357.56182 361.64504 1541.96387
6.15000 -6160.53864 8.64131 -71.79268 394.92280 399.74298 1542.52315
6.25000 -6100.29666 30.24147 -31.84590 416.32331 474.12282 1531.44040
6.35000 -6063.05365 18.63214 -86.85814 558.74252 550.93888 1542.38161
6.45000 -6028.75572 18.43745 -76.85059 405.92569 376.71366 1380.39804
6.55000 -5990.03374 17.12259 -45.54060 434.56302 504.21613 1381.79930
6.65000 -5977.85094 14.81399 -66.48593 514.67466 375.78106 1311.10432
6.75000 -5960.00076 6.14672 -35.64948 509.81618 540.37143 1353.51157
6.85000 -5920.35957 13.91504 -20.17611 390.22205 358.51333 1270.47758
6.95000 -5893.44874 15.67499 -3.02628 495.43577 448.96164 1457.89952
7.05000 -5864.36081 13.88414 -18.94424 368.64390 592.40794 1324.46614
7.15000 -5814.00925 0.81030 -9.26462 321.88622 275.83274 1177.19918
7.25000 -5788.49183 9.36153 -20.53836 351.93415 259.56616 1126.62306
7.35000 -5737.26833 14.06268 8.14952 447.65471 335.65114 1116.21562
7.45000 -5667.47085 25.97240 -1.67019 326.26369 313.80165 1078.20290
7.55000 -5610.88922 22.86631 -13.21946 372.10157 387.52858 1057.28225
7.65000 -5551.49117 18.83892 18.58306 273.23324 226.92197 999.02866
7.75000 -5495.78528 9.83450 45.85216 316.82254 241.49892 947.70336
7.85000 -5428.11841 16.56020 42.57101 417.61743 273.06943 997.36764
7.95000 -5373.62870 13.25873 59.09231 357.68935 421.13643 988.31774
8.05000 -5294.07488 9.89552 89.33486 310.59532 204.18351 858.63414
8.15000 -5215.58062 13.36147 102.70368 431.56698 216.03418 861.02083
8.25000 -5155.12130 23.85839 98.60483 273.48798 226.65613 819.91630
8.35000 -5050.16628 7.80590 74.78731 505.58849 355.11482 1636.70580
8.45000 -5017.56184 26.41108 23.65571 248.76537 209.21637 773.78110
8.55000 -4954.79507 20.19018 56.32438 287.21544 275.17081 769.42936
8.65000 -4898.45118 5.54498 30.13268 294.39239 244.39416 739.73966
8.75000 -4859.36369 14.91599 0.85477 290.66973 231.95420 743.24858
8.85000 -4806.17167 15.26691 33.91086 273.29704 271.90985 702.61412
8.95000 -4750.38903 7.89483 -2.96262 400.07939 468.97443 693.97980
9.05000 -4718.01589 17.52306 3.51160 318.64189 442.12557 759.56284
9.15000 -4664.15903 3.79254 15.33205 253.60828 249.50274 636.38970
9.25000 -4646.03055 3.46124 33.21838 632.96617 392.64933 659.77777
9.35000 -4589.24484 1.43181 -37.08447 182.22775 208.67836 659.90577
9.45000 -4557.36780 0.17028 -7.22907 302.18722 373.47327 726.25790
9.55000 -4518.66290 28.06367 -5.21991 216.03857 418.38730 608.81830
9.65000 -4484.51004 15.75270 -22.00265 205.52250 177.60284 584.43262
9.75000 -4470.47952 -45.76989 -51.53617 448.56380 1928.93985 2067.23368
9.85000 -4430.10296 11.24980 -56.71171 218.38032 195.45419 578.09980
9.95000 -4416.92102 -8.51642 18.95735 412.16487 555.63223 1401.43746
10.05000 -4332.79264 11.13903 12.62538 941.21870 369.71366 1123.75838
10.15000 -4329.10926 0.74640 -33.21151 303.63861 304.22080 540.83974
10.25000 -4300.62939 10.22473 -45.66463 326.66086 172.81473 516.51885
10.35000 -4274.83601 -6.47512 -68.89319 383.31210 308.44781 648.10436
10.45000 -4236.67825 15.88547 -38.65394 154.17256 127.77181 468.94538
10.55000 -4181.97211 14.26521 -42.47676 287.63800 199.16800 480.08909
10.65000 -4165.66734 6.99346 -52.92232 261.49951 180.40012 487.68252
10.75000 -4116.23231 9.84587 -56.10022 209.57004 121.14977 441.11143
10.85000 -4077.02258 8.58154 -46.32937 325.37009 127.20700 447.28797
10.95000 -4046.71841 12.52112 -37.18657 193.01371 199.66990 431.22562
11.05000 -4021.27164 16.02000 -59.69673 140.46852 171.81903 428.39621
11.15000 -3975.24331 6.94242 -53.86774 184.42886 135.02959 447.12556
11.25000 -3937.23980 11.56388 -53.04609 310.74899 364.15839 491.13270
11.35000 -3916.51718 -0.73948 -18.99083 134.27158 245.12171 436.10328
11.45000 -3875.96624 9.08571 -28.82518 126.62002 157.26844 372.90029
11.55000 -3851.76202 11.78021 -74.00644 129.43113 114.77442 381.25514
11.65000 -3822.34525 8.69591 -51.60975 149.01729 127.86639 379.47274
11.75000 -3784.13349 11.19035 -74.01930 181.04294 137.30333 386.87385
11.85000 -3755.94195 17.27355 -46.53024 196.95786 218.69785 395.83710
11.95000 -3721.79176 12.21445 -79.75747 279.25873 147.51672 352.41464
12.05000 -3707.03343 11.96510 -57.73196 122.61018 211.83809 377.19128
12.15000 -3660.62720 0.93650 -100.65268 118.86267 126.28119 314.03830
12.25000 -3634.79464 10.46366 -60.05360 159.74122 189.21994 330.97197
12.35000 -3605.06955 12.03142 -57.43455 246.30703 91.07885 334.16686
12.45000 -3571.92062 6.13966 -85.12569 119.90947 115.95406 295.14009
12.55000 -3568.04322 -3.19743 -85.65767 270.40537 180.46343 382.69412
12.65000 -3506.72238 -7.70221 -47.79486 157.17826 113.19857 295.15781
12.75000 -3480.40698 7.78336 -57.41583 266.42199 329.67212 277.57470
12.85000 -3451.53238 19.61671 -40.63378 123.26061 182.17976 276.61164
12.95000 -3408.64275 -1.57806 -44.43473 135.31368 105.40477 294.28169
13.05000 -3381.48777 6.14686 -98.50699 104.32352 122.08882 275.97004
13.15000 -3359.57182 9.56781 -67.49990 125.11530 109.56257 249.83054
13.25000 -3330.40882 3.78935 -59.40166 104.15956 204.80555 245.81340
13.35000 -3277.27200 6.86334 -72.40701 136.15938 112.81103 253.13677
13.45000 -3271.56054 6.31181 -57.77099 88.22579 114.53068 217.80920
13.55000 -3258.54566 0.87025 -49.80863 107.43764 128.88081 246.36597
13.65000 -3222.53958 9.22005 -49.21390 150.47784 140.20321 230.34688
13.75000 -3216.91163 2.00822 -50.04344 184.30155 112.71366 250.79657
13.85000 -3186.22158 3.26253 -65.79392 151.34913 128.80645 227.93438
13.95000 -3163.19571 8.13660 -30.37098 94.19613 186.65293 237.77545
14.05000 -3143.06908 4.20487 -38.25480 146.36638 103.36084 229.95146
14.15000 -3108.52153 -1.69824 -44.02113 133.03796 91.89132 223.43626
14.25000 -3097.71240 7.36127 -42.54513 232.21499 161.23202 271.75969
14.35000 -3080.34001 19.79048 -41.09110 81.09604 150.66620 210.81055
14.45000 -3062.22859 -9.31720 -59.50199 88.07434 101.61931 192.58265
14.55000 -3034.58387 3.13404 -37.59130 235.21787 149.14678 217.27299
14.65000 -3004.96869 1.27247 -28.94945 88.92287 151.30934 194.70116
14.75000 -3002.63206 9.78127 -26.73876 70.90296 125.96785 200.76373
14.85000 -2975.09733 -1.19212 -21.71012 66.38040 105.57438 183.82279
14.95000 -2935.37156 10.89807 -10.52273 212.42627 112.11766 184.18633
15.05000 -2934.46526 -3.13988 -20.59942 75.25520 111.92769 174.27166
15.15000 -2909.77920 14.20024 -12.55997 132.64648 103.23421 217.54807
15.25000 -2890.79879 13.84014 -28.34841 92.05438 105.86983 186.68221
15.35000 -2896.74680 -8.65480 -49.44648 192.94721 230.15129 603.16328
15.45000 -2844.10809 9.40998 -34.93815 137.26263 58.22552 190.76505
15.55000 -2850.54215 -8.30109 -31.75522 120.03519 100.19424 148.52005
15.65000 -2823.64549 1.52202 -36.41886 164.35788 82.34344 177.97799
15.75000 -2799.52438 0.97708 -27.00724 67.89556 67.60267 159.12324
15.85000 -2783.39830 9.20490 -25.03746 112.05197 110.11147 172.05125
15.95000 -2768.97351 11.41563 -6.95523 72.62198 81.12466 149.06232
16.05000 -2747.35970 -2.64805 -20.06450 95.40179 59.41415 153.72573
16.15000 -2722.73768 22.29019 -23.63404 56.20854 115.30535 150.20418
16.25000 -2697.84220 -4.44363 -21.46616 69.47060 65.07958 141.05049
16.35000 -2697.18253 14.98032 -20.58320 86.45632 133.46146 149.50642
16.45000 -2686.35236 2.87639 -25.76113 65.97429 58.66530 141.00847
16.55000 -2664.56576 5.73756 -38.15249 123.74241 69.46757 193.15845
16.65000 -2633.44895 11.33376 -8.51249 65.30467 65.10905 151.28330
16.75000 -2618.41986 8.84823 -22.33905 54.30885 62.79532 148.87000
16.85000 -2603.93563 9.43884 -29.38267 48.11196 37.37904 119.46994
16.95000 -2589.66057 5.77171 -0.22986 56.69054 45.30381 123.19147
17.05000 -2563.66548 5.30443 -1.27064 63.97469 74.72639 118.28003
17.15000 -2547.78002 8.85934 -24.64255 77.32686 77.50494 121.89961
17.25000 -2527.38996 15.13094 -19.88573 57.32665 79.47220 128.88640
17.35000 -2516.23897 0.92746 -21.73273 54.93709 43.84939 114.41240
17.45000 -2496.17847 7.52033 -26.29091 73.18580 44.44827 119.06764
17.55000 -2485.75435 4.39172 -21.34392 62.42921 43.47164 127.14983
17.65000 -2472.56293 13.19661 -22.01733 73.70430 85.40425 125.98117
17.75000 -2472.82955 4.62728 -43.15579 60.73423 46.41772 105.33938
17.85000 -2452.87986 -5.28783 -25.85117 61.21820 59.49033 139.40688
17.95000 -2448.37268 11.48876 -35.98289 61.19475 82.55463 155.55348
18.05000 -2416.79398 1.31408 -18.68540 57.88852 48.56585 96.72151
18.15000 -2409.89919 12.57718 -31.74421 56.87650 62.47362 106.07580
18.25000 -2394.78391 7.24681 -18.11982 43.24034 36.97248 101.47887
18.35000 -2378.50178 1.08361 -42.72896 40.25259 43.76114 94.70294
18.45000 -2359.34725 -6.82312 -28.41668 58.14760 50.33224 109.37401
18.55000 -2360.96804 16.49198 -20.19158 42.49816 51.50885 112.27709
18.65000 -2332.26311 9.07483 -32.46090 48.22742 40.14809 95.45502
18.75000 -2338.52461 -6.17749 -31.61476 245.09083 523.01738 152.36110
18.85000 -2304.96647 0.17362 -30.34924 55.23107 44.94005 93.96694
18.95000 -2294.33645 8.66224 -33.92123 71.71591 60.98539 99.23717
19.05000 -2284.81596 5.08762 -18.07520 86.62682 84.53193 99.78669
19.15000 -2277.88726 -2.69834 -28.92649 63.05082 68.50423 91.31607
19.25000 -2287.66887 9.41407 -61.52064 369.49963 104.55877 175.85377
19.35000 -2277.23159 0.31550 -10.21045 136.32278 35.74974 146.49058
19.45000 -2230.90678 2.95386 -14.00994 59.39222 79.28541 88.09823
19.55000 -2228.26597 -5.07178 -16.82591 58.45731 56.74460 84.12281
19.65000 -2219.07941 3.37004 -49.54291 42.98492 38.64938 91.78312
19.75000 -2202.69708 1.56769 -27.42207 34.15277 30.99684 82.99340
19.85000 -2185.68867 3.29869 -11.82735 46.67393 51.62715 77.39753
19.95000 -2189.29239 6.85715 -27.41023 64.64915 51.09429 136.50240
