0.05000 -1312.31003 119.67018 -60752.07148 1388.78382 835.31628 610839.27279
0.15000 -2819.33012 20.51035 36040.76103 1317.96259 1123.55162 708220.50199
0.25000 -4527.16694 44.60522 4094.16221 1614.26189 1337.24248 728725.51090
0.35000 -6143.17903 31.97137 30314.92074 2093.51577 1370.39900 591942.98868
0.45000 -7405.54890 49.64879 -5376.10971 2216.99220 1533.95659 565729.16767
0.55000 -8342.47909 14.11096 -1148.87377 2194.32625 1760.60693 528084.45106
0.65000 -8892.54673 16.47523 -6388.52410 2125.62770 1885.58855 529205.92632
0.75000 -9342.28199 35.84516 -13835.07805 2174.91079 1974.89974 505235.36576
0.85000 -9636.27271 82.11603 -2330.64650 2069.61035 2041.20615 468490.58083
0.95000 -9705.12241 5.86707 -8117.07291 2074.89224 2137.77840 490229.83050
1.05000 -9835.93657 -8.92486 2548.29444 2041.54765 2247.36857 441594.79862
1.15000 -9870.65071 47.38534 -10576.51829 1943.57103 2312.69766 394509.44325
1.25000 -9889.77412 50.47685 -16451.85031 1848.36392 2350.74243 402815.62505
1.35000 -9741.41643 58.10881 3568.45306 1739.92186 2432.24740 457762.47920
1.45000 -9718.69354 76.78859 1653.65845 1630.25493 2417.42055 381199.32903
1.55000 -9581.01975 68.81941 -7903.44649 1621.24119 2445.84516 367116.98101
1.65000 -9516.98678 38.38045 -9156.08601 1542.76171 2487.48475 322334.66451
1.75000 -9374.55288 16.30668 -273.90603 1465.55758 2480.74951 325392.70154
1.85000 -9294.08574 75.75990 -13915.80667 1351.12753 2519.86850 333731.66759
1.95000 -9171.50487 53.19447 -895.48705 1311.90407 2514.80638 271332.65465
2.05000 -9033.18470 64.49236 2212.08088 1272.56971 2556.99389 290415.08909
2.15000 -8983.36599 79.03618 -3465.47147 1178.27964 2544.24966 248438.96360
2.25000 -8891.95152 112.69563 -1731.57924 1094.92319 2559.70711 269383.78001
2.35000 -8808.26598 72.71172 1157.22570 994.04743 2527.55268 257645.29619
2.45000 -8716.58217 -8.90673 -3458.54810 908.32208 2535.89637 264792.91802
2.55000 -8623.35895 25.21558 5811.07320 862.20227 2492.07176 243143.33122
2.65000 -8541.58688 55.19484 -132.14442 787.48951 2503.55585 231427.17946
2.75000 -8462.26876 17.80304 1073.81265 729.11890 2477.32444 209589.08389
2.85000 -8398.35715 36.44636 -3568.47193 645.58693 2443.32865 197463.83495
2.95000 -8270.48974 -8.04193 2567.80944 654.31482 2424.44777 201442.11905
3.05000 -8176.45817 5.22350 3315.43380 610.57566 2356.17695 196955.14201
3.15000 -8079.35161 -45.24252 -4404.84716 578.84786 2343.87148 179876.15182
3.25000 -8017.02502 -67.87185 -907.47492 563.80264 2290.89937 169583.11713
3.35000 -7921.77855 34.18608 1022.47196 521.50683 2271.08309 162916.67872
3.45000 -7862.27287 -4.20093 -4982.43702 500.83223 2209.62842 160063.61434
3.55000 -7782.67413 -53.86514 1672.03921 455.39051 2180.54744 154305.96546
3.65000 -7702.88608 -27.12261 1194.83813 469.66055 2126.73159 159213.14195
3.75000 -7644.53610 -8.25002 -1151.92334 452.56940 2092.09186 146086.03165
3.85000 -7554.60392 -60.39938 -872.93796 432.52404 2040.75138 153975.56894
3.95000 -7494.54917 -14.04011 4390.28077 454.21415 2007.53414 132729.04647
4.05000 -7439.64850 -46.46734 1045.23954 471.60860 1949.83908 139499.11146
4.15000 -7352.95240 -57.75825 4550.88862 450.52347 1915.70667 166369.51286
4.25000 -7284.05385 -51.85358 -2421.84973 461.19101 1858.41551 154653.03190
4.35000 -7202.58574 -16.34446 2744.28811 456.59339 1810.99895 122665.33350
4.45000 -7109.84602 -33.80853 1608.80501 479.72019 1735.65658 128353.13544
4.55000 -7041.92661 -27.51563 1185.56691 496.50833 1726.70137 111666.43393
4.65000 -6983.20544 -65.53208 1084.99003 508.97235 1660.21767 117439.68838
4.75000 -6911.56103 -40.04085 -2158.13372 517.65830 1609.05611 118000.34304
4.85000 -6852.66389 -48.02342 1026.46472 503.95802 1546.24258 107464.87362
4.95000 -6782.46887 -9.38763 1357.67381 557.53310 1514.44105 123785.09558
5.05000 -6737.80770 -52.06129 -1409.90921 554.55608 1483.16812 113144.13264
5.15000 -6699.48616 -56.46535 158.73452 570.38904 1425.74008 135560.37384
5.25000 -6619.55699 -6.22836 -394.50551 606.01021 1390.87526 90979.78108
5.35000 -6573.84965 2.55068 1687.44430 606.39990 1347.84489 119028.81668
5.45000 -6543.85787 -21.62548 -966.71060 613.09168 1302.33072 86910.49954
5.55000 -6502.11039 2.94295 495.34004 637.57173 1249.49862 85478.53764
5.65000 -6450.04187 15.15027 -804.08636 681.76852 1205.35910 92675.77692
5.75000 -6401.78828 -14.47251 -860.12415 671.24166 1150.32918 87501.12556
5.85000 -6365.22330 -13.12897 -1010.25494 678.12121 1102.79701 80523.91164
5.95000 -6355.80171 -5.91085 -695.15292 697.33023 1072.52468 75891.82146
6.05000 -6354.42409 7.24056 -242.69311 717.24033 1038.37045 76093.90041
6.15000 -6308.63367 -12.74679 99.55076 740.38624 994.78843 69677.10329
6.25000 -6261.51022 -1.40919 758.54119 747.12065 944.05524 67779.36402
6.35000 -6232.47745 -17.07093 -1060.07430 761.03143 911.64679 65523.71233
6.45000 -6197.02919 -22.71740 617.56864 749.77213 848.04420 59936.88212
6.55000 -6147.89829 10.65221 -978.61686 733.86701 819.41054 67040.66455
6.65000 -6108.65689 -1.53008 -641.52364 730.29493 783.58198 59402.25312
6.75000 -6085.36487 1.54003 -333.37139 742.30174 748.88468 59831.14569
6.85000 -6026.89576 15.62044 478.54131 713.51024 711.48244 70803.53666
6.95000 -5986.32296 8.82853 -11.27324 716.52599 687.13613 61678.22187
7.05000 -5950.61316 4.88767 174.54525 698.36219 654.72948 50270.57141
7.15000 -5888.48203 23.49137 547.00835 673.23668 612.93131 59791.00020
7.25000 -5828.63577 7.57371 -386.15927 651.27941 577.31553 60680.41272
7.35000 -5783.77546 31.54083 -142.12796 635.23750 563.22648 45639.12001
7.45000 -5725.95430 13.58818 715.41792 618.47943 540.12205 51961.48134
7.55000 -5672.25701 13.61570 -448.07683 590.04586 502.22812 48735.65251
7.65000 -5605.62508 22.44380 -143.00300 565.67036 489.27825 47946.05028
7.75000 -5570.68610 9.28198 -1045.27155 540.95006 469.26554 53993.69489
7.85000 -5511.24047 19.28391 16.58816 544.72152 450.63535 40087.43740
7.95000 -5471.44056 15.52946 -1103.71752 502.47908 439.13470 43683.04931
8.05000 -5424.24136 9.27725 20.30783 490.86835 415.90384 33230.32709
8.15000 -5376.76013 15.17195 -714.64088 485.25624 416.41697 38828.12296
8.25000 -5316.22919 14.55370 312.24647 461.52278 391.91405 38400.63442
8.35000 -5277.21897 24.59692 -28.85112 449.10694 365.53609 38092.14364
8.45000 -5233.94372 18.84218 -569.91406 417.21091 338.52354 31776.56544
8.55000 -5188.50604 19.21666 -473.79847 402.06607 339.01403 35018.52821
8.65000 -5137.99177 16.62555 -472.32483 389.45369 317.21637 28347.78982
8.75000 -5096.70528 17.75996 -564.64498 389.38153 326.88008 44007.63965
8.85000 -5057.48642 13.24818 165.19589 361.54970 294.08839 25494.01628
8.95000 -5014.91681 18.41902 186.54357 361.27621 293.83763 28198.30776
9.05000 -4972.84179 10.05366 -571.31158 369.30537 290.11480 27754.22125
9.15000 -4927.17255 17.42975 203.70513 348.45038 281.90848 23512.39953
9.25000 -4900.49178 16.92686 250.73570 332.97767 268.65110 23200.55398
9.35000 -4846.85346 14.05053 -396.96274 321.13088 263.13179 24237.27922
9.45000 -4818.29813 13.31495 -547.30393 308.40710 268.90027 25163.82073
9.55000 -4765.12236 16.62978 -417.74807 300.82775 240.99040 31326.70313
9.65000 -4745.71012 9.86273 66.20698 305.03925 252.25523 22230.86904
9.75000 -4702.38284 4.80570 -145.88693 298.96786 239.71782 24414.54178
9.85000 -4682.74437 14.18187 -209.10288 278.91242 253.61473 21007.14948
9.95000 -4641.52617 4.94466 -336.80789 258.72049 238.12672 23428.92453
10.05000 -4606.65770 12.28570 -562.22158 248.78635 203.82750 22145.51314
10.15000 -4582.47882 10.33351 -220.88471 250.74537 219.37528 19529.72182
10.25000 -4530.16031 6.50421 -281.49861 245.26400 206.15826 21278.96050
10.35000 -4495.21679 6.58919 322.75802 254.55730 205.31758 21532.53632
10.45000 -4463.36990 6.34181 -384.48876 242.05306 192.46548 19738.00828
10.55000 -4423.59443 4.78879 501.31915 238.79378 206.20302 18515.17308
10.65000 -4388.34415 8.87514 -387.01499 222.58742 188.73846 21537.72093
10.75000 -4346.04616 10.87775 -196.64897 216.54832 205.24039 17851.05851
10.85000 -4310.70304 2.78279 -285.86144 215.55280 171.03764 17085.34923
10.95000 -4288.60765 6.67955 4.06917 213.69473 170.69625 14943.03925
11.05000 -4249.04214 -3.08143 326.72553 216.15535 177.78502 17211.84871
11.15000 -4210.88222 0.46377 -237.74949 230.92413 173.24255 14171.57823
11.25000 -4173.49370 -1.19056 -244.52884 237.22010 176.44540 16106.84837
11.35000 -4136.65637 -3.32711 125.12883 202.00341 177.57671 13895.70392
11.45000 -4104.15177 -1.06372 -10.38438 215.88810 163.56962 12998.08347
11.55000 -4075.95281 8.29384 -176.68443 202.73754 180.92206 15013.81753
11.65000 -4042.05389 8.71629 -229.19380 207.92181 191.10519 14560.04832
11.75000 -3998.65546 4.53594 -90.78444 207.00981 160.23894 12466.31597
11.85000 -3970.78520 8.94600 70.23349 184.78214 156.29370 12126.20035
11.95000 -3934.95221 9.06470 -284.98048 193.54018 151.55282 14458.43675
12.05000 -3904.06729 4.89077 -22.60653 186.68389 133.31168 11434.92229
12.15000 -3877.13837 15.09552 -359.30731 210.93692 179.77268 9140.89593
12.25000 -3847.12259 9.16219 -316.11936 182.28599 117.59526 10812.08224
12.35000 -3811.45183 9.34560 -112.08561 173.26005 122.96766 10360.32888
12.45000 -3777.33064 9.17045 -37.93662 181.98153 109.20641 11299.83247
12.55000 -3753.56017 9.42893 148.94358 181.74864 134.85860 12985.53118
12.65000 -3717.58755 11.46052 -86.25791 179.35327 113.61377 11417.28294
12.75000 -3692.77373 14.43677 46.28445 165.82907 114.76530 11124.23134
12.85000 -3656.23024 16.13586 -160.71171 198.31646 123.82949 10207.90072
12.95000 -3632.42591 15.49823 321.75973 156.88014 115.35169 9457.38571
13.05000 -3608.27819 17.27165 402.47069 153.82149 110.63818 18425.19012
13.15000 -3575.76375 15.06815 187.92484 141.35154 97.84416 10161.84852
13.25000 -3548.67775 11.06281 145.97457 163.46728 105.26131 15979.03403
13.35000 -3528.43548 14.04826 94.58285 174.15002 100.26542 11478.77356
13.45000 -3498.78890 19.60560 -69.24113 158.52024 125.70939 7997.72685
13.55000 -3471.50633 14.95054 -136.66800 166.07654 130.17448 8002.97276
13.65000 -3444.92318 13.14916 202.63374 138.12502 84.84357 7426.41505
13.75000 -3427.23973 16.09821 -123.67485 125.83119 84.83338 8841.04203
13.85000 -3397.63456 16.23000 -226.57766 126.34140 92.17215 8679.50965
13.95000 -3382.69756 12.95117 -225.13971 130.65575 93.41965 7404.22925
14.05000 -3354.20942 14.21153 -22.78176 127.86933 92.04906 8739.91315
14.15000 -3329.58653 15.87694 48.35999 116.48304 85.45460 6551.65787
14.25000 -3312.19816 15.54925 -61.47048 120.45360 91.25367 7183.18835
14.35000 -3281.30711 15.54175 251.61845 152.39209 76.04403 7057.76941
14.45000 -3267.49666 14.07572 151.53096 115.33396 84.29325 6236.31599
14.55000 -3247.90066 14.99680 20.97488 115.70307 83.30583 6600.18434
14.65000 -3221.04408 14.26255 495.92843 108.69522 77.40828 16025.14293
14.75000 -3202.50912 11.66746 -10.38046 113.18910 81.40085 5923.52326
14.85000 -3185.33268 7.80475 168.83735 115.77712 123.08419 6217.06464
14.95000 -3162.07854 13.01967 208.56989 99.35611 82.06267 5694.99180
15.05000 -3143.58717 12.97879 -237.56236 121.47427 104.21706 6486.06489
15.15000 -3124.83129 12.20851 214.82435 91.31240 87.05569 6062.05162
15.25000 -3103.09695 9.54059 259.69087 102.91803 86.71957 6280.63837
15.35000 -3088.18782 9.19383 -42.76554 85.25870 80.13225 5653.92520
15.45000 -3066.35889 12.21516 -109.12487 90.70131 104.24249 5390.00426
15.55000 -3044.80948 10.11966 213.50692 85.27975 65.49554 7369.35745
15.65000 -3025.97868 12.85369 -12.63561 94.87210 94.73840 5108.10888
15.75000 -3013.26519 14.29624 120.04508 153.91690 73.11418 5414.30739
15.85000 -2992.69588 10.30741 108.60689 74.70882 71.21845 5326.55887
15.95000 -2974.51094 11.32893 -80.60632 89.06807 70.62549 5552.58003
16.05000 -2953.12906 11.87133 -54.45493 99.59156 80.85272 7493.30288
16.15000 -2938.38899 14.40633 179.00655 89.27896 87.71205 5755.82498
16.25000 -2915.65889 11.67986 -56.50181 116.99898 91.98056 5475.70595
16.35000 -2901.70267 12.46154 156.25784 88.43153 90.26614 5244.31906
16.45000 -2885.43587 7.89504 -72.33833 144.20260 79.00841 5154.35831
16.55000 -2868.14473 8.96169 -52.45416 79.55064 64.08816 5457.88082
16.65000 -2848.78461 11.50238 140.80190 93.95930 74.61371 4131.40916
16.75000 -2832.66029 10.18730 93.42449 75.07048 76.07966 4030.86958
16.85000 -2816.68697 11.32175 20.81396 73.84523 58.35786 4746.66796
16.95000 -2795.80386 11.57457 -60.12184 78.05422 56.38250 4965.87639
17.05000 -2775.93358 10.56475 136.97941 101.54309 114.02349 4343.68262
17.15000 -2756.77070 9.13219 289.90304 178.14961 68.53326 5335.06010
17.25000 -2743.07844 6.90170 -6.61095 69.53250 58.83921 4099.73029
17.35000 -2725.56989 7.57962 117.34292 90.07697 84.43200 4046.84132
17.45000 -2708.38961 10.38146 122.34719 63.55040 63.56772 3515.75359
17.55000 -2690.34568 12.55322 154.58170 142.34349 78.21372 3460.69557
17.65000 -2673.39946 7.06357 -57.64049 89.37469 52.45347 3678.27396
17.75000 -2661.22293 8.37028 59.13498 57.01486 58.62058 3081.28429
17.85000 -2640.43516 6.48857 -38.84903 64.18499 64.57292 2995.01797
17.95000 -2621.49274 9.98751 30.52192 69.58831 57.98241 3786.25037
18.05000 -2606.47301 5.84458 50.67748 59.58948 59.92080 4283.51604
18.15000 -2591.86319 6.12714 10.80133 53.55925 64.77098 2885.94411
18.25000 -2574.04541 8.33670 267.98576 76.38186 77.91793 3088.95263
18.35000 -2560.34360 8.34273 -109.53127 55.21498 71.97946 3654.14170
18.45000 -2545.51509 8.70101 -3.67669 56.10178 72.65060 2199.21242
18.55000 -2529.15385 7.40656 -194.15707 62.22827 57.47857 3975.61231
18.65000 -2514.02915 7.86578 -183.86386 62.23296 52.35416 3054.15439
18.75000 -2498.99069 3.01689 152.40960 58.07412 58.83284 2376.84223
18.85000 -2488.11059 11.41977 12.54439 54.55139 59.05106 2163.81884
18.95000 -2473.38026 6.05208 -25.97403 63.38929 44.79470 2158.34250
19.05000 -2452.33369 7.40593 282.71686 193.46877 70.12122 3861.73265
19.15000 -2440.10882 7.86925 273.46316 71.36423 53.50342 2754.75550
19.25000 -2429.67644 7.08866 -86.10550 55.14101 49.87496 2515.27308
19.35000 -2413.93274 11.00009 -172.22836 55.62173 51.82123 1947.79864
19.45000 -2403.99589 5.14669 78.64538 58.59323 63.55526 2068.89831
19.55000 -2384.55662 8.87418 -104.17316 64.13750 52.98285 2119.93079
19.65000 -2376.02212 5.86649 26.67229 64.10292 48.64467 2222.95151
19.75000 -2361.71932 5.82873 -166.13475 51.60385 67.61811 2313.60777
19.85000 -2349.23927 7.35183 -21.79141 50.22040 54.37303 2348.58722
19.95000 -2331.96371 5.87282 -41.36410 52.48197 54.20848 2230.61290
