0.12500 0.04735
0.37500 0.03151
0.62500 0.02169
0.87500 0.01938
1.12500 0.02378
1.37500 0.05512
1.62500 0.07729
1.87500 0.09442
2.12500 0.09093
2.37500 0.10988
2.62500 0.12500
2.87500 0.11586
3.12500 0.12047
3.37500 0.12357
3.62500 0.10554
3.87500 0.09817
4.12500 0.07812
4.37500 0.08321
4.62500 0.08040
4.87500 0.05990
5.12500 0.05580
5.37500 0.05055
5.62500 0.04163
5.87500 0.03630
6.12500 0.03513
6.37500 0.02522
6.62500 0.01984
6.87500 0.02671
7.12500 0.03590
7.37500 0.02478
7.62500 0.02206
7.87500 0.01999
8.12500 0.03669
8.37500 0.02225
8.62500 0.03163
8.87500 0.02699
9.12500 0.02130
9.37500 0.03932
9.62500 0.05972
9.87500 0.05640
10.12500 0.05287
10.37500 0.04845
10.62500 0.04811
10.87500 0.05568
11.12500 0.03937
11.37500 0.03823
11.62500 0.05948
11.87500 0.05317
12.12500 0.03803
12.37500 0.04536
12.62500 0.04795
12.87500 0.03525
13.12500 0.02929
13.37500 0.03492
13.62500 0.05788
13.87500 0.03464
14.12500 0.02336
14.37500 0.02574
14.62500 0.03072
14.87500 0.00145
