0.05000 1244.80088
0.15000 2209.77216
0.25000 3119.08849
0.35000 3693.42708
0.45000 4254.70302
0.55000 4645.09614
0.65000 4955.35476
0.75000 5118.67578
0.85000 5224.10319
0.95000 5270.39215
1.05000 5274.80125
1.15000 5222.52758
1.25000 5157.74536
1.35000 5088.20569
1.45000 5060.46121
1.55000 4898.68148
1.65000 4726.99030
1.75000 4694.16559
1.85000 4552.35380
1.95000 4466.92053
2.05000 4325.11582
2.15000 4259.08985
2.25000 4197.11454
2.35000 4063.00193
2.45000 3968.05514
2.55000 3851.70916
2.65000 3722.70041
2.75000 3654.20228
2.85000 3593.06810
2.95000 3446.67646
3.05000 3342.27845
3.15000 3293.49840
3.25000 3219.87693
3.35000 3131.94973
3.45000 3083.52784
3.55000 2975.02353
3.65000 2912.84367
3.75000 2815.44099
3.85000 2796.44528
3.95000 2695.09875
4.05000 2679.26390
4.15000 2575.07260
4.25000 2525.92115
4.35000 2470.79484
4.45000 2396.96369
4.55000 2346.49329
4.65000 2272.98597
4.75000 2208.72376
4.85000 2180.73744
4.95000 2110.36714
5.05000 2089.43839
5.15000 2025.84830
5.25000 1979.90729
5.35000 1924.19048
5.45000 1890.25410
5.55000 1836.70858
5.65000 1796.27997
5.75000 1767.03396
5.85000 1708.80699
5.95000 1650.47645
6.05000 1647.05014
6.15000 1598.88169
6.25000 1574.66854
6.35000 1545.04641
6.45000 1490.94250
6.55000 1454.21424
6.65000 1440.02414
6.75000 1406.94475
6.85000 1367.23249
6.95000 1355.12608
7.05000 1313.97225
7.15000 1279.35253
7.25000 1286.55471
7.35000 1226.43026
7.45000 1196.44278
7.55000 1172.03238
7.65000 1155.71005
7.75000 1145.68554
7.85000 1101.38460
7.95000 1072.00149
8.05000 1062.65102
8.15000 1023.29936
8.25000 1020.87685
8.35000 1013.57947
8.45000 971.46563
8.55000 951.22063
8.65000 918.03394
8.75000 930.46572
8.85000 897.50636
8.95000 884.68622
9.05000 864.58801
9.15000 833.61929
9.25000 823.49822
9.35000 800.92874
9.45000 773.68221
9.55000 755.70277
9.65000 740.05938
9.75000 742.74432
9.85000 722.65346
9.95000 710.06844
10.05000 692.76129
10.15000 673.38717
10.25000 669.22047
10.35000 648.28346
10.45000 644.42472
10.55000 620.46279
10.65000 619.07959
10.75000 605.61543
10.85000 580.53644
10.95000 588.79593
11.05000 569.17084
11.15000 559.49246
11.25000 538.80560
11.35000 540.81862
11.45000 533.68117
11.55000 504.62224
11.65000 508.58986
11.75000 491.05073
11.85000 487.26519
11.95000 482.83669
12.05000 476.26232
12.15000 454.79448
12.25000 453.78083
12.35000 446.73490
12.45000 450.20974
12.55000 438.10061
12.65000 428.51346
12.75000 419.32872
12.85000 405.91260
12.95000 392.28146
13.05000 387.65912
13.15000 381.98009
13.25000 370.14612
13.35000 365.15896
13.45000 357.84698
13.55000 353.31538
13.65000 342.20606
13.75000 342.43088
13.85000 336.18666
13.95000 327.19446
14.05000 315.35463
14.15000 313.11752
14.25000 305.14794
14.35000 303.22245
14.45000 302.14800
14.55000 296.99345
14.65000 283.79293
14.75000 271.99397
14.85000 275.94132
14.95000 264.72237
15.05000 269.81085
15.15000 258.92749
15.25000 247.05587
15.35000 252.44287
15.45000 247.85637
15.55000 238.49030
15.65000 233.82713
15.75000 229.71487
15.85000 227.31922
15.95000 222.97966
16.05000 218.73188
16.15000 219.72573
16.25000 216.03257
16.35000 203.92215
16.45000 200.54107
16.55000 197.30125
16.65000 198.92170
16.75000 196.50177
16.85000 188.43554
16.95000 194.91577
17.05000 185.17349
17.15000 180.24678
17.25000 183.81172
17.35000 176.60381
17.45000 169.40664
17.55000 173.12643
17.65000 173.11365
17.75000 160.67380
17.85000 159.96238
17.95000 158.28485
18.05000 157.08186
18.15000 153.03215
18.25000 152.15432
18.35000 153.28885
18.45000 153.57905
18.55000 147.91069
18.65000 151.99333
18.75000 138.82996
18.85000 143.66298
18.95000 145.67921
19.05000 134.63390
19.15000 134.99388
19.25000 127.18689
19.35000 131.62912
19.45000 131.86142
19.55000 118.59332
19.65000 126.20767
19.75000 117.86059
19.85000 116.33223
19.95000 121.07385
