0.05000 -1048.69044 -1344.21111 140850.66667 746.78169 144.35101 101286.29776
0.15000 -651.14779 -82.89767 -1381202.19842 2661.18338 1188.69885 3275640.90742
0.25000 182.16936 -161.05443 -182688.38644 2655.61984 1091.46355 697530.07349
0.35000 -68.99776 67.45503 -22183.28738 2284.82967 1046.08715 989825.52610
0.45000 -211.47922 -91.29855 60863.09925 2870.33768 1204.67602 908438.44536
0.55000 -646.36271 7.90061 2937.25703 2508.91831 1170.47127 859923.49924
0.65000 -471.26503 -54.94507 -58927.96829 2531.28875 1258.31090 940090.46697
0.75000 -796.70919 -35.25795 -109031.54831 2403.57357 1176.75327 1740831.35887
0.85000 -786.71519 32.60983 -38915.73244 2334.75732 1242.47732 1492868.66935
0.95000 -967.48776 -54.55049 53700.57087 2297.03992 1288.61143 1768398.76482
1.05000 -1342.15208 132.69989 -15329.24519 2140.39479 1256.74917 1226126.97440
1.15000 -1489.08777 0.45939 -100363.67653 1923.72429 1338.81600 1139776.56968
1.25000 -1669.51670 -24.25903 -112602.44035 1735.28591 1389.33009 1478493.95031
1.35000 -2037.29506 25.94629 -62244.37990 1427.30610 1373.98677 1500007.82735
1.45000 -2513.82328 49.09196 -53922.31965 1114.85598 1286.30387 1577208.40150
1.55000 -2794.80623 -40.51797 -40200.15359 888.38751 1213.60494 1928920.78189
1.65000 -2980.30832 1.86377 3997.16274 719.48816 1187.00177 1395070.78805
1.75000 -3195.18523 -9.46426 -100452.76659 579.15376 1042.51251 1728671.87377
1.85000 -3382.80704 1.33336 -7703.85121 496.15204 1057.22768 1201421.83262
1.95000 -3510.25145 40.93915 28356.83677 424.29177 913.74193 1777629.75617
2.05000 -3611.39718 -4.24939 127417.80833 376.66493 869.71630 2195623.39347
2.15000 -3707.91283 12.03667 -119394.90797 316.60787 846.70452 1692983.18920
2.25000 -3759.99961 -20.41018 -48739.62604 276.29110 771.84034 1741727.54247
2.35000 -3852.56022 13.12813 45588.78247 249.00177 714.34663 1903227.50093
2.45000 -3921.91748 9.95213 -90862.61611 232.75400 684.34172 1679425.33410
2.55000 -3971.86101 -20.46109 41431.26513 228.13213 669.31076 1507728.58244
2.65000 -4001.03615 -28.21241 -25211.01770 233.77916 629.16001 2091347.28702
2.75000 -4034.13826 12.55514 24745.37454 231.63495 588.45323 2090355.05465
2.85000 -4064.64680 -2.05345 28546.27743 227.95275 568.27792 1861681.52461
2.95000 -4065.77622 -2.39556 13591.07277 234.58260 536.71287 2380636.89822
3.05000 -4081.52654 -9.58177 33789.43410 240.39513 522.24817 2056494.47859
3.15000 -4085.63892 12.38829 -41828.97541 235.59202 498.57639 2382213.72689
3.25000 -4095.09152 14.68070 34531.11901 244.99253 469.19828 2097783.23025
3.35000 -4095.99107 -3.98429 3714.10692 250.14416 463.58138 1974387.80466
3.45000 -4064.37255 -12.92004 126546.71286 239.79875 442.16544 2790041.00421
3.55000 -4078.80594 -6.35597 -60056.54738 244.10242 440.29268 2526450.41392
3.65000 -4046.94958 -26.35278 68482.25557 237.94686 411.84749 2310749.56031
3.75000 -4051.98477 -0.97454 3675.83870 255.45928 406.33452 1998413.28503
3.85000 -4032.21941 1.36058 -12322.20108 256.41430 394.55859 2175878.16425
3.95000 -4013.89326 5.85393 6113.73678 250.70143 379.67771 2226241.33214
4.05000 -4003.66526 -24.48265 6820.26849 253.08675 368.97087 2157291.07684
4.15000 -3986.73565 -12.41342 -75104.19469 262.25702 357.17977 2429022.13040
4.25000 -3955.09365 18.51239 32474.17894 250.32053 342.52236 2200719.63993
4.35000 -3942.06778 1.12818 45809.36048 251.72287 333.00734 2486859.01844
4.45000 -3921.99659 -3.90273 -65252.30736 242.33142 320.43691 2147718.67806
4.55000 -3893.68005 8.61268 14805.58797 233.76850 313.99095 2207440.25963
4.65000 -3867.51818 -3.03506 32326.90096 221.96319 304.36332 2234667.27352
4.75000 -3857.56182 -4.19253 -30975.08140 214.90542 295.09804 2245987.24942
4.85000 -3839.54072 -6.81619 14461.29979 211.42904 289.88327 2311542.66139
4.95000 -3825.44779 12.18959 47476.28783 209.02644 281.62551 2398545.00234
5.05000 -3808.72831 -1.74347 -43260.46851 202.78567 277.79754 2216962.73708
5.15000 -3786.45432 12.60574 61322.17637 201.64647 266.27625 1983074.85203
5.25000 -3765.03649 -7.84615 -47815.52536 197.31547 258.70875 2237090.51415
5.35000 -3743.74905 -3.20843 -22449.34830 197.73481 252.08113 2475203.12085
5.45000 -3727.35068 8.84434 7732.25964 195.47629 246.28582 2221709.98254
5.55000 -3713.12907 3.76906 24679.60902 191.10037 239.89080 2307310.79228
5.65000 -3687.55410 5.49273 -45308.75593 187.00874 237.85667 2233399.27716
5.75000 -3679.67971 -8.38242 31353.47013 194.55402 235.36399 2317196.91665
5.85000 -3650.25462 3.74576 -20228.50107 195.19267 226.38239 2268787.19628
5.95000 -3638.73713 3.72629 45344.28434 184.76744 221.88266 2559289.61632
6.05000 -3618.18930 -2.74759 -66539.30843 190.59094 219.47254 2377272.66479
6.15000 -3591.45050 -7.01656 10972.76535 183.57165 207.12798 2387377.66353
6.25000 -3578.39186 2.05386 -86746.16304 178.01382 208.56277 2300792.97991
6.35000 -3556.00569 -5.30293 -27440.27653 178.45585 203.43860 2396313.59624
6.45000 -3533.43011 1.17023 -16491.62824 172.46762 201.72545 2160792.45017
6.55000 -3512.80118 -0.47044 -36863.26236 167.62551 191.94813 2537984.93160
6.65000 -3498.19675 0.01305 24371.24121 167.44023 193.46147 2488597.56323
6.75000 -3477.90612 1.79143 4992.96759 167.61425 187.05605 2138328.28255
6.85000 -3455.83489 1.96349 109572.34529 159.60232 185.13588 2315433.78533
6.95000 -3449.74714 0.66887 -38333.68681 156.79033 181.87022 2223984.36784
7.05000 -3427.88679 2.25716 24935.86436 158.38759 180.74908 2519329.81011
7.15000 -3411.24178 -1.58201 5316.60840 156.34567 175.87218 2300678.85009
7.25000 -3397.03518 6.69847 -76427.93271 151.81408 173.99113 2504457.19830
7.35000 -3376.62630 -0.09524 -35070.38110 151.12064 170.71856 2182620.61375
7.45000 -3357.35539 -1.40582 10630.21891 152.34181 165.24485 2356994.71701
7.55000 -3344.01055 -1.03818 -33512.13753 148.63028 163.52133 2340209.02427
7.65000 -3335.04768 6.59727 -29366.32384 147.22552 162.64693 2248357.88958
7.75000 -3311.18995 7.74335 -23432.20340 149.57750 159.52805 2266891.61541
7.85000 -3299.40805 1.06500 -29863.31251 152.25589 155.29765 2201778.05333
7.95000 -3280.52315 2.00711 49769.36324 152.29279 153.51731 2561779.57804
8.05000 -3269.40012 -0.72708 91093.14441 152.29830 150.49726 2313263.68866
8.15000 -3247.64918 -4.68809 -67269.52312 144.55806 145.54748 2269066.85700
8.25000 -3237.26954 -5.48191 -20360.26914 151.34092 148.24613 2339688.21098
8.35000 -3212.65027 0.06254 -44147.94134 153.63533 144.95440 2357869.25078
8.45000 -3197.35340 1.95905 38290.81926 150.38435 141.38568 2301612.19161
8.55000 -3181.77621 1.56110 41025.00729 150.38948 139.27740 2428291.94351
8.65000 -3165.43554 0.19143 57005.55737 151.97636 138.16885 2123378.34231
8.75000 -3149.88155 1.92850 34716.79920 149.20574 133.96497 2282873.71211
8.85000 -3134.77055 3.83664 -24931.34738 148.49763 133.90946 2335789.92836
8.95000 -3124.63137 2.90633 4460.82069 149.78200 134.62026 2378182.86125
9.05000 -3107.29373 2.58297 -19876.98809 151.92537 129.57392 2358141.81474
9.15000 -3088.90242 -0.57103 -5774.54024 147.99151 127.27403 2222957.94519
9.25000 -3073.59562 1.27995 53011.11836 148.16974 124.51058 2112939.82174
9.35000 -3058.33910 3.00915 -139335.74905 145.90454 124.73287 2320100.80298
9.45000 -3037.60025 2.77451 -87514.40584 144.51502 120.18498 2122162.01155
9.55000 -3032.30724 6.14089 -45673.89127 144.30852 123.70911 2395556.79530
9.65000 -3009.03141 0.25372 37520.33260 141.38603 119.82977 2142853.84931
9.75000 -2993.29099 -1.14679 11017.94666 141.72339 115.35602 2193859.34565
9.85000 -2978.96500 1.00084 35907.85713 140.75833 115.36403 2403267.38293
9.95000 -2961.68961 -0.99164 -54559.57356 140.06077 112.96382 2373349.82237
10.05000 -2946.47021 1.04967 93413.74419 138.18917 109.82846 2066482.03823
10.15000 -2945.00073 1.68647 80353.23743 141.06751 111.28012 2363091.53040
10.25000 -2919.66745 -3.14377 55429.62910 138.29680 108.64288 2463290.77637
10.35000 -2900.95934 -0.02008 -16764.90236 136.18555 106.94900 2258477.26803
10.45000 -2885.04685 -0.81330 40492.15265 134.66429 105.32114 1969878.91228
10.55000 -2873.62447 -0.71405 -73395.94220 133.93138 103.72647 2370296.41080
10.65000 -2857.93700 -2.46439 4616.76843 135.80406 103.28700 2182488.65754
10.75000 -2849.02366 3.32656 -30137.59062 134.53780 101.17386 2143863.22685
10.85000 -2831.20714 -3.45153 67696.91967 131.50583 100.43278 2201361.96206
10.95000 -2818.09371 3.61613 -44284.42758 131.95975 100.00002 2165186.29621
11.05000 -2800.25157 -0.10224 34799.69052 129.22215 95.06084 2182318.31620
11.15000 -2779.47883 2.33096 -44070.89912 128.68363 97.15579 2101281.68158
11.25000 -2770.72164 0.38702 53830.32500 126.28669 94.74182 2156558.06736
11.35000 -2756.84728 1.79135 -22312.89479 128.70949 95.55937 2199494.26846
11.45000 -2743.82716 0.29899 24979.49221 128.59086 90.68172 2379587.75329
11.55000 -2730.66373 1.20790 -12552.83304 126.05883 92.94173 2014178.95711
11.65000 -2713.18443 0.42061 -63070.34237 130.20107 91.85925 2169302.73129
11.75000 -2703.31539 -0.56385 12291.19590 124.90165 92.38874 2233890.65997
11.85000 -2683.99269 -3.78128 27789.56460 122.94868 89.08668 2378864.91774
11.95000 -2675.78995 -1.07949 -64906.01435 123.34735 87.76470 2142727.09561
12.05000 -2659.63490 -0.57538 -1197.60963 122.02486 87.21053 2189247.03931
12.15000 -2647.64566 0.63057 17527.58723 118.84490 84.41590 2137114.85650
12.25000 -2635.76988 -0.36518 -27615.75952 120.39216 87.03300 2081059.55295
12.35000 -2623.64874 -0.64868 77894.90075 119.00234 80.94660 2204446.97165
12.45000 -2607.84210 0.69467 -22350.92292 118.49297 81.40926 2252659.81089
12.55000 -2599.63979 -0.02408 94698.46127 117.43301 82.09920 2102122.86618
12.65000 -2583.54832 -0.47362 77841.13408 117.46113 79.06596 2076214.22931
12.75000 -2574.01813 0.94432 -81721.06652 117.54269 80.08125 2252949.51112
12.85000 -2557.25447 0.34406 -18890.76430 114.65377 80.36619 2197957.50167
12.95000 -2544.73169 0.26484 5338.64725 115.61681 77.78068 2023511.10804
13.05000 -2532.76397 -2.07840 25382.43876 114.42701 75.52922 1986005.40821
13.15000 -2515.56006 0.70757 -27839.45344 110.39087 76.75212 2187085.68826
13.25000 -2504.80477 -1.47995 40961.97030 112.59782 78.42108 2032137.13459
13.35000 -2492.03302 -0.19283 47248.93188 110.82292 76.71390 2236798.78684
13.45000 -2474.88838 1.41795 -21450.31177 111.06618 74.38569 1984450.34215
13.55000 -2469.55449 -1.35549 11217.82563 109.51438 73.97978 2030238.68782
13.65000 -2456.78077 -0.69000 44967.54430 108.25884 72.11325 2040519.40659
13.75000 -2445.23439 0.09179 -25238.47808 106.98428 70.71303 2303467.80813
13.85000 -2429.10256 -0.31815 -1461.17954 106.50758 71.22691 2087834.42536
13.95000 -2418.96520 0.40144 1399.03999 105.90848 70.53958 2127721.90146
14.05000 -2408.87251 -1.42400 -32938.42843 105.31355 69.45162 2119595.98989
14.15000 -2400.06631 -2.27027 -5057.50381 107.00741 69.12834 2146538.24423
14.25000 -2386.91160 0.03722 -5517.24111 106.60974 72.06879 2241369.67175
14.35000 -2375.81123 -0.57092 -1269.90097 101.74893 69.13656 2110760.26935
14.45000 -2359.76260 -1.20201 76741.14800 103.35404 67.30850 2219303.58807
14.55000 -2354.54247 0.57057 -64917.80297 104.32272 67.20295 1912872.51656
14.65000 -2336.88926 1.00140 -11678.92081 100.17717 67.33703 1928042.98555
14.75000 -2326.43875 -0.01837 129373.32062 98.96993 65.50538 1965571.70680
14.85000 -2316.98412 0.91953 -10639.32051 97.94418 63.57479 2138480.86996
14.95000 -2305.95525 0.43441 16169.22516 98.76421 63.73746 2105779.99309
15.05000 -2297.23860 0.12295 -35760.05714 96.54085 62.43546 2076651.66810
15.15000 -2285.88800 0.82161 -52009.56438 95.37811 63.18296 1964955.07337
15.25000 -2273.14247 0.29338 -33323.16049 95.85303 61.58341 2091174.33398
15.35000 -2262.45984 0.91230 -6514.85985 93.58256 62.47131 2021552.50341
15.45000 -2250.82345 0.29620 -9555.90754 93.73762 60.27144 1981967.37686
15.55000 -2241.16496 0.22266 43296.75461 92.74161 60.41832 1984218.97780
15.65000 -2228.27749 0.70644 26875.95217 91.16809 59.22755 2013094.15118
15.75000 -2220.42086 2.95461 63558.32371 91.17455 59.81215 1907929.21065
15.85000 -2209.22857 -0.66506 -11916.38752 92.23953 60.22404 1891436.10907
15.95000 -2201.20457 -1.71022 36192.14601 90.00264 58.76903 1995605.60452
16.05000 -2190.59604 1.05996 6462.16085 88.93874 58.26956 1685018.87287
16.15000 -2180.03119 -1.15385 5324.63580 89.76721 57.49324 2176253.45558
16.25000 -2168.43710 0.56424 -1059.45128 87.87563 57.44871 1828179.52829
16.35000 -2163.81010 0.71396 -22057.91015 89.22713 56.42176 2128111.45481
16.45000 -2151.20561 1.38671 -25553.18392 88.23243 55.04424 2098681.11650
16.55000 -2139.14612 0.41952 -29877.94654 86.74761 54.73959 2000202.68603
16.65000 -2130.19991 -0.89927 -40741.00426 85.95970 53.80312 2064661.90485
16.75000 -2118.23103 2.29215 2673.93517 83.63778 53.94073 1970117.51521
16.85000 -2111.82391 0.45282 20658.03793 83.56921 54.51303 1861428.57404
16.95000 -2102.72010 0.79482 -28495.18845 85.44752 52.92513 1897814.00204
17.05000 -2090.79225 -0.02467 -6589.41262 82.21841 54.20265 2150194.93845
17.15000 -2084.22759 1.78341 -4002.72039 81.77721 51.27555 1979086.74781
17.25000 -2073.42614 0.40427 25553.93682 79.74844 50.26557 1757943.96721
17.35000 -2066.05051 -0.24987 -11667.29478 81.09294 52.55324 1962049.55520
17.45000 -2053.89202 -0.68089 -3514.47508 79.56737 51.63712 1832787.01154
17.55000 -2046.90545 -0.22767 34296.99344 80.81292 49.96948 1810111.45763
17.65000 -2037.00072 -1.02121 8277.54274 79.52975 48.02718 2066342.66612
17.75000 -2027.40755 -1.14070 -35710.59026 78.49752 52.25959 1809007.91315
17.85000 -2016.29587 0.22696 -6219.99198 77.41831 50.09966 2080876.18006
17.95000 -2009.81070 -0.58908 -15047.45280 75.71828 48.88769 1782467.18111
18.05000 -1999.52083 1.78480 27292.87000 75.59559 48.32040 2015679.13703
18.15000 -1990.11166 0.48604 -8691.43130 76.91053 48.75171 2037655.80097
18.25000 -1981.98865 -1.13059 11006.32629 75.92601 47.18903 1750296.48725
18.35000 -1973.66360 -1.45458 -14405.92679 73.96917 48.37962 2029099.39652
18.45000 -1964.59833 -0.35251 25580.61419 74.53278 48.91946 1942712.46042
18.55000 -1956.43811 0.50597 -26737.33211 73.95309 47.23103 1832947.98720
18.65000 -1945.70542 0.66796 -60392.32711 72.94287 46.69940 1834687.90133
18.75000 -1938.19047 0.61507 47143.28066 73.27645 45.95052 1665230.60663
18.85000 -1931.71182 -0.65872 38354.24655 73.65054 46.56548 1883551.54828
18.95000 -1921.60262 1.04423 13271.76458 73.22457 45.96701 1578522.81227
19.05000 -1916.11978 -0.64991 -27838.29717 70.87410 46.17676 1967399.79139
19.15000 -1905.83548 0.33379 -21153.56579 71.57957 43.77717 1782702.63031
19.25000 -1897.33592 0.02574 18464.28629 72.18991 43.54018 1785308.00630
19.35000 -1889.82092 -0.79675 -49976.88030 72.67857 44.91600 1954121.76483
19.45000 -1879.46851 -0.21711 7093.63534 70.42720 45.43604 1887339.61419
19.55000 -1874.46896 1.04617 25609.64055 68.71148 44.60526 1902119.92138
19.65000 -1865.57447 0.98334 59722.51015 71.52548 45.06229 1962527.42290
19.75000 -1855.31646 1.12276 -19088.05712 70.02414 42.98594 1886551.84205
19.85000 -1848.84131 -0.98498 53358.88951 67.91597 45.31413 1618274.10235
19.95000 -1840.60370 -1.57714 59997.33643 68.66846 43.84755 1955452.47536
