0.05000 1544.05339
0.15000 2785.35513
0.25000 4170.65784
0.35000 5171.27816
0.45000 6209.86642
0.55000 6811.22601
0.65000 7291.94091
0.75000 7620.94182
0.85000 7738.33531
0.95000 7807.72393
1.05000 7918.11023
1.15000 7923.30292
1.25000 7723.29332
1.35000 7433.98045
1.45000 7249.46975
1.55000 7142.80005
1.65000 6763.85248
1.75000 6552.81408
1.85000 6368.64244
1.95000 6144.72189
2.05000 5921.11340
2.15000 5684.98622
2.25000 5504.11999
2.35000 5274.00181
2.45000 5172.27336
2.55000 4956.81003
2.65000 4730.16201
2.75000 4556.90130
2.85000 4401.95651
2.95000 4240.66291
3.05000 4125.75612
3.15000 3943.99290
3.25000 3862.26922
3.35000 3728.98667
3.45000 3640.86530
3.55000 3510.87026
3.65000 3385.99626
3.75000 3338.86438
3.85000 3184.79892
3.95000 3068.10776
4.05000 2981.82681
4.15000 2840.02377
4.25000 2747.86442
4.35000 2652.43922
4.45000 2634.60916
4.55000 2532.88084
4.65000 2426.58267
4.75000 2355.19749
4.85000 2302.49860
4.95000 2162.99979
5.05000 2143.32668
5.15000 2049.85272
5.25000 1998.11295
5.35000 1970.60677
5.45000 1913.31183
5.55000 1839.47957
5.65000 1753.76194
5.75000 1731.25207
5.85000 1679.36587
5.95000 1625.98586
6.05000 1620.08854
6.15000 1527.25406
6.25000 1507.43308
6.35000 1467.11574
6.45000 1430.46789
6.55000 1409.66915
6.65000 1371.02783
6.75000 1338.16007
6.85000 1301.88898
6.95000 1275.64441
7.05000 1220.02959
7.15000 1183.90256
7.25000 1168.05830
7.35000 1144.60411
7.45000 1124.70337
7.55000 1089.29599
7.65000 1045.05772
7.75000 1034.68970
7.85000 992.65290
7.95000 968.11811
8.05000 958.53635
8.15000 924.17227
8.25000 899.47576
8.35000 874.67996
8.45000 865.86933
8.55000 841.48476
8.65000 840.82409
8.75000 812.16750
8.85000 792.57565
8.95000 767.49056
9.05000 743.95819
9.15000 741.14433
9.25000 717.28610
9.35000 708.19972
9.45000 684.25061
9.55000 696.24888
9.65000 671.83536
9.75000 648.96099
9.85000 632.68611
9.95000 618.19682
10.05000 605.36753
10.15000 598.98708
10.25000 584.53389
10.35000 573.82886
10.45000 559.32143
10.55000 544.70902
10.65000 533.91137
10.75000 524.46139
10.85000 501.16509
10.95000 498.20712
11.05000 479.81440
11.15000 477.45572
11.25000 456.50595
11.35000 448.22941
11.45000 447.57050
11.55000 431.76229
11.65000 422.49974
11.75000 420.80448
11.85000 408.43976
11.95000 401.20040
12.05000 388.75300
12.15000 388.97528
12.25000 382.98439
12.35000 359.74612
12.45000 349.38124
12.55000 348.02460
12.65000 343.53574
12.75000 339.48425
12.85000 328.60251
12.95000 332.48671
13.05000 337.48562
13.15000 319.82080
13.25000 316.29660
13.35000 308.17192
13.45000 306.56055
13.55000 305.71156
13.65000 290.00330
13.75000 291.59960
13.85000 287.91819
13.95000 288.51224
14.05000 273.52733
14.15000 268.84250
14.25000 266.73077
14.35000 268.83189
14.45000 265.10062
14.55000 252.97735
14.65000 252.74995
14.75000 254.60614
14.85000 243.68530
14.95000 243.32295
15.05000 241.99434
15.15000 233.15227
15.25000 223.16951
15.35000 217.77131
15.45000 213.32612
15.55000 212.20474
15.65000 213.13849
15.75000 209.32154
15.85000 192.81809
15.95000 196.30253
16.05000 183.00754
16.15000 183.44782
16.25000 188.66093
16.35000 176.27041
16.45000 175.18571
16.55000 174.13594
16.65000 170.77268
16.75000 165.71745
16.85000 160.77493
16.95000 166.92817
17.05000 158.00612
17.15000 150.27894
17.25000 153.16959
17.35000 157.04720
17.45000 147.45368
17.55000 146.82100
17.65000 143.63107
17.75000 137.98105
17.85000 134.63773
17.95000 136.64091
18.05000 126.82838
18.15000 127.88077
18.25000 130.02744
18.35000 122.51439
18.45000 121.68263
18.55000 124.63895
18.65000 117.51767
18.75000 115.51025
18.85000 121.29616
18.95000 114.79986
19.05000 107.89412
19.15000 104.20513
19.25000 104.81155
19.35000 104.73381
19.45000 110.32933
19.55000 107.06001
19.65000 107.04626
19.75000 97.79348
19.85000 90.98731
19.95000 94.14337
