0.05000 1981.58546
0.15000 3117.38260
0.25000 4547.40391
0.35000 5782.14614
0.45000 6922.18408
0.55000 7762.99149
0.65000 8447.69245
0.75000 8687.81427
0.85000 8924.49933
0.95000 9011.15357
1.05000 9049.11605
1.15000 8894.90941
1.25000 8703.92156
1.35000 8485.56029
1.45000 8266.63624
1.55000 7920.85325
1.65000 7680.82018
1.75000 7445.30213
1.85000 7285.37581
1.95000 6967.13218
2.05000 6645.90248
2.15000 6388.44657
2.25000 6223.96915
2.35000 5996.09629
2.45000 5818.10296
2.55000 5547.79636
2.65000 5366.28071
2.75000 5185.44165
2.85000 5018.37366
2.95000 4845.29975
3.05000 4691.36189
3.15000 4533.94058
3.25000 4384.05475
3.35000 4289.16611
3.45000 4162.78699
3.55000 4000.76569
3.65000 3913.50752
3.75000 3806.03999
3.85000 3709.22186
3.95000 3646.68625
4.05000 3509.13792
4.15000 3397.30524
4.25000 3271.05924
4.35000 3233.27178
4.45000 3168.79126
4.55000 3027.86593
4.65000 2947.29725
4.75000 2894.53190
4.85000 2815.65099
4.95000 2708.30940
5.05000 2697.12695
5.15000 2551.19072
5.25000 2484.48873
5.35000 2462.32765
5.45000 2329.39608
5.55000 2266.65521
5.65000 2242.79395
5.75000 2162.63429
5.85000 2094.82107
5.95000 2055.67819
6.05000 1980.47632
6.15000 1940.13404
6.25000 1871.67400
6.35000 1802.12379
6.45000 1725.63441
6.55000 1620.41096
6.65000 1608.41753
6.75000 1533.05713
6.85000 1467.35471
6.95000 1442.94032
7.05000 1387.13023
7.15000 1334.60694
7.25000 1346.53265
7.35000 1255.51818
7.45000 1249.27074
7.55000 1181.92561
7.65000 1139.48769
7.75000 1135.83002
7.85000 1099.26525
7.95000 1089.44733
8.05000 1047.70629
8.15000 1015.10615
8.25000 994.16702
8.35000 998.25654
8.45000 959.35960
8.55000 939.83975
8.65000 916.70226
8.75000 897.87177
8.85000 883.38086
8.95000 863.75275
9.05000 852.26532
9.15000 826.50383
9.25000 804.47799
9.35000 787.08088
9.45000 774.55552
9.55000 766.59251
9.65000 725.58005
9.75000 736.13413
9.85000 708.75578
9.95000 705.72127
10.05000 683.45222
10.15000 680.71802
10.25000 650.54545
10.35000 638.14868
10.45000 635.40139
10.55000 617.50045
10.65000 608.06137
10.75000 600.18969
10.85000 586.04458
10.95000 574.82493
11.05000 556.68641
11.15000 552.23894
11.25000 555.55686
11.35000 543.69334
11.45000 517.15251
11.55000 528.78713
11.65000 508.84117
11.75000 509.99931
11.85000 497.75041
11.95000 484.17171
12.05000 471.33565
12.15000 470.61037
12.25000 460.92684
12.35000 451.15805
12.45000 438.18462
12.55000 422.50639
12.65000 428.97413
12.75000 421.54385
12.85000 420.82294
12.95000 404.51247
13.05000 388.32397
13.15000 390.96597
13.25000 389.16791
13.35000 387.00506
13.45000 383.04461
13.55000 372.96061
13.65000 362.32718
13.75000 366.74909
13.85000 354.85794
13.95000 345.71891
14.05000 347.97623
14.15000 340.59380
14.25000 329.38491
14.35000 327.29175
14.45000 314.29621
14.55000 327.19493
14.65000 311.40029
14.75000 307.36124
14.85000 296.34711
14.95000 298.12566
15.05000 294.63055
15.15000 293.91565
15.25000 286.26024
15.35000 284.75979
15.45000 275.99645
15.55000 270.39250
15.65000 270.94909
15.75000 265.49465
15.85000 253.47714
15.95000 249.44389
16.05000 254.53171
16.15000 244.58162
16.25000 245.66279
16.35000 240.83464
16.45000 237.26177
16.55000 228.75654
16.65000 228.25522
16.75000 221.08856
16.85000 223.16562
16.95000 222.84916
17.05000 223.68945
17.15000 212.55874
17.25000 206.90635
17.35000 210.43578
17.45000 206.06632
17.55000 201.74160
17.65000 200.33327
17.75000 193.01368
17.85000 195.81739
17.95000 192.69422
18.05000 188.38238
18.15000 191.57741
18.25000 184.76949
18.35000 184.26216
18.45000 179.50244
18.55000 176.13454
18.65000 174.89251
18.75000 171.91109
18.85000 158.73294
18.95000 162.09099
19.05000 159.97188
19.15000 161.91649
19.25000 153.07904
19.35000 155.67971
19.45000 146.69820
19.55000 148.11316
19.65000 143.74928
19.75000 137.89613
19.85000 142.07065
19.95000 130.15982
