0.2 -0.90984 23.78873 0.86778 87.68414 87.449 69.44146
0.6 -0.25944 52.90702 -0.09115 88.15843 82.87726 65.7177
1.0 0.01246 72.61724 -0.10468 88.18767 76.19241 61.66383
1.4 -1.50257 85.01112 -0.0704 86.48008 70.71191 57.96962
1.8 -1.19495 93.4995 0.75955 85.35171 65.79514 55.18742
2.2 -0.82856 102.44834 1.22965 81.13745 62.59375 52.15182
2.6 -0.99814 112.80664 1.36306 74.59908 58.68619 49.43424
3.0 -1.63065 124.01317 0.48733 68.40251 55.21946 46.6547
3.4 -2.46742 135.62528 0.59343 60.87596 51.63423 43.95558
3.8 -1.57277 146.98578 0.23933 54.37036 48.1976 41.52798
4.2 -0.78445 157.22875 0.48566 48.62898 43.36285 38.86378
4.6 0.23208 165.49182 0.12342 44.19752 38.88661 36.18527
5.0 -0.23981 172.9645 0.00523 41.06161 34.89085 33.46726
5.4 -0.67454 178.44687 0.00442 38.34584 31.56593 31.57168
5.8 -0.76349 182.72168 -0.54139 35.88139 29.96751 29.80793
6.2 -0.51723 186.02569 -0.23431 34.18556 28.10153 28.53869
6.6 -0.23299 189.13507 -0.81775 32.56306 26.67418 26.68648
7.0 0.27746 191.26402 -0.56536 30.89866 25.1739 25.4651
7.4 0.40924 193.63655 -0.6226 29.92551 24.2079 23.60082
7.8 0.0045 195.97469 -0.50976 27.97316 22.98617 22.6453
8.2 0.06944 198.03913 -0.56886 26.99275 21.46281 21.35201
8.6 -0.59802 199.99286 -0.49165 25.48222 20.09871 20.52152
9.0 -0.57503 201.08702 -0.82439 24.46849 18.89957 19.39501
9.4 -0.25476 201.88503 -0.7552 23.8181 17.85077 18.7017
9.8 -0.95718 202.40666 -0.40043 23.04398 17.01603 18.29723
10.2 -0.47348 202.71524 -0.45669 22.72716 16.22969 17.59313
10.6 -0.52725 202.6459 -0.78929 21.60059 15.81984 16.47395
11.0 0.23775 202.71326 -0.41889 20.93234 15.72801 15.78336
11.4 0.54963 203.12843 -0.12406 19.99854 15.89002 15.06402
11.8 1.19494 203.88132 0.23553 19.36098 15.45137 14.44246
12.2 1.43907 204.4222 0.29215 18.5163 14.56248 13.65375
12.6 1.2166 204.80046 0.74953 17.24067 14.03435 13.16563
13.0 0.78567 205.49287 -0.08974 16.85697 13.11484 12.40914
13.4 0.45654 205.51749 -0.59157 15.91717 12.66362 11.76456
13.8 0.36795 206.08192 -1.40119 14.96332 12.9589 11.3554
14.2 0.19424 207.41725 -1.95406 14.83237 11.82634 10.67914
14.6 0.24729 208.15907 -1.85456 13.95798 11.23797 10.05337
15.0 -0.09804 207.85344 -1.73349 13.66134 10.60874 9.94218
15.4 -0.66104 207.83033 -1.48845 13.46385 10.60776 9.51111
15.8 -0.86958 207.23112 -1.72583 12.95795 9.54068 9.52353
16.2 -1.26312 206.51757 -1.44091 12.87291 9.06962 8.66984
16.6 -1.82775 206.36407 -1.24623 11.77796 8.7584 8.42057
17.0 -1.6858 206.07883 -0.87512 11.73689 8.84651 8.03922
17.4 -1.51382 206.93932 -0.2039 10.92649 8.33671 7.97646
17.8 -1.24481 206.17842 -0.1071 10.18736 7.17766 7.88076
18.2 -1.12025 205.47271 -0.56903 10.17341 7.45557 7.63318
18.6 -0.50929 205.79109 0.3947 10.06155 7.54007 7.49337
19.0 0.31296 206.68762 0.09615 9.44761 7.47422 7.10679
19.4 0.67058 206.87903 0.917 9.23693 6.79562 6.97421
19.8 0.69263 206.16203 0.30248 9.26534 6.59172 6.72429
