0.05000 16571.84598 -13329.77202 48577.21000 300321.14341 388933.64979 275416.39247
0.15000 -193276.10087 -1883.79123 2640.72407 163950.44851 206499.26398 248615.06961
0.25000 -132919.52179 654.03794 932.59687 74189.02361 59229.23947 117738.87904
0.35000 -91661.95622 -50.60044 845.51843 38550.21784 27383.17701 74514.80565
0.45000 -68857.18757 130.65498 -2378.08488 25203.85371 16101.11213 55767.20045
0.55000 -55849.24412 363.75093 -1870.63409 19202.77308 11309.93631 43595.65146
0.65000 -46382.20724 151.49664 -957.30917 15561.25092 8778.07448 37043.10027
0.75000 -40291.42091 11.67495 36.31605 12731.26122 5678.58547 30654.53491
0.85000 -35432.64392 105.39131 38.24749 10311.31978 4437.49778 26540.18651
0.95000 -31611.17258 98.06357 -194.69611 9110.98332 4879.19129 23797.12480
1.05000 -28487.75028 117.09662 -483.89610 7535.92493 3098.67655 20495.57465
1.15000 -26060.56436 37.82669 87.09137 6935.51128 2797.65083 18333.31496
1.25000 -23821.49053 102.76322 -395.80651 6075.65483 2206.08069 16691.40807
1.35000 -22001.04213 12.03494 -454.72055 5422.00473 2003.86144 15208.82772
1.45000 -20306.99498 -39.89720 -574.65897 7692.15358 6295.27348 14601.43657
1.55000 -19415.63703 57.68364 59.25189 4205.51357 1815.58154 12488.49389
1.65000 -18155.78648 0.09550 -349.12097 4159.36326 1579.14647 11776.08899
1.75000 -17253.97655 42.67354 -234.08128 3668.78730 1404.79072 10882.45632
1.85000 -16550.68637 30.93019 75.22327 3511.07931 1486.94785 10010.68049
1.95000 -15714.58706 17.92088 -202.65758 3055.16692 1367.99379 9505.91235
2.05000 -15128.12109 10.41431 -21.41391 2879.67800 1354.59617 8736.76917
2.15000 -14543.78852 -3.97244 34.79659 2719.41474 1491.42883 8314.79682
2.25000 -13974.72627 -16.71919 -112.91791 2566.27053 1676.74917 7743.12557
2.35000 -13508.03260 -25.88473 -34.98936 3298.93224 1234.57892 8307.51942
2.45000 -13068.15922 47.67328 139.42498 2015.31342 2001.71597 7043.58366
2.55000 -12709.75010 -24.10807 146.05307 2051.31640 1535.24332 6576.67490
2.65000 -12390.55794 47.48808 171.51135 1783.89904 1077.16795 6125.01831
2.75000 -12077.21990 -6.75820 152.82700 1884.26491 1099.58164 5714.42765
2.85000 -11848.49935 24.84970 -30.97255 1611.42422 720.90238 5362.06435
2.95000 -11484.13550 79.27224 147.57293 3162.28053 3837.82468 5674.40412
3.05000 -11235.89372 79.34796 -40.31098 1867.86627 2534.89542 5010.84570
3.15000 -11045.70289 36.16073 47.06395 1264.30977 972.43429 4746.39718
3.25000 -10843.45490 7.41758 131.28610 1466.30977 914.06991 4461.83392
3.35000 -10552.04876 48.36322 -50.54556 2332.03173 1882.94619 4601.38297
3.45000 -10379.71170 36.40409 66.99622 1253.78269 788.42404 4282.02436
3.55000 -10299.77611 75.31754 91.28125 1617.41998 1698.77565 3923.71043
3.65000 -10020.42290 71.67197 236.49276 4463.31880 2658.12564 6511.34333
3.75000 -9940.93936 31.01387 4.47672 1156.41691 944.75000 3650.56087
3.85000 -9759.25254 27.52223 131.49655 836.93184 535.06784 3471.15271
3.95000 -9625.42012 34.89023 -49.70544 1044.39432 578.38817 3340.10112
4.05000 -9463.14130 38.65280 -91.66647 985.48521 935.96129 3377.31754
4.15000 -9305.70402 20.88613 76.65992 785.48908 540.46925 3090.24378
4.25000 -9158.24630 7.58992 27.50562 1243.66650 1105.04194 2991.82155
4.35000 -9032.56667 2.82023 9.80437 722.08945 501.19931 2895.19286
4.45000 -8931.44647 31.26437 17.59432 694.45393 423.54564 2760.10663
4.55000 -8781.82494 -11.92114 -71.02882 1687.73673 1470.90108 2779.20669
4.65000 -8669.08780 0.53878 73.76253 857.81088 704.66565 2546.06882
4.75000 -8509.81043 11.64453 107.46083 708.31677 451.47547 2518.90041
4.85000 -8399.38310 12.42438 -12.46442 750.89831 995.47339 2408.90321
4.95000 -8238.49777 18.72922 -44.10216 1087.10902 439.61258 2355.97268
5.05000 -8174.74458 34.90825 -11.98590 672.91096 651.97695 2280.88965
5.15000 -8045.98944 8.65195 -115.13812 570.99562 376.42577 2172.16790
5.25000 -7898.94788 22.43408 -48.98219 656.67605 392.64071 2154.62011
5.35000 -7829.94802 35.82315 -103.03970 768.09501 625.71698 2095.84061
5.45000 -7666.12307 -16.97799 -39.94396 610.19090 892.38654 2092.82426
5.55000 -7582.41435 24.17056 -48.92604 542.33210 540.21380 2005.80564
5.65000 -7463.84592 12.10228 -30.17309 494.20744 424.52667 1983.05292
5.75000 -7360.94567 26.37803 -7.41579 532.89732 797.71816 1951.05838
5.85000 -7286.65257 60.72104 -35.84003 1241.42873 1715.29250 2103.95929
5.95000 -7156.37545 18.16463 -157.22339 437.01678 333.32283 1710.05317
6.05000 -7047.90972 13.94003 -54.90499 386.47088 307.97175 1694.34602
6.15000 -6962.58917 7.90847 -64.82099 503.60250 472.19241 1705.89880
6.25000 -6966.12912 -41.01338 -81.82352 2631.90677 2153.26858 1607.49255
6.35000 -6814.55508 8.46171 -87.01578 452.68554 389.72099 1574.38003
6.45000 -6725.27923 7.58277 -39.62712 435.90693 361.32362 1510.36922
6.55000 -6609.03465 24.30033 -76.45661 538.61948 552.03116 1544.41623
6.65000 -6534.22048 14.62915 -89.75119 443.48929 485.92911 1505.45221
6.75000 -6466.80089 26.94970 -64.00963 318.51796 727.55450 1387.21644
6.85000 -6372.74600 -4.65591 -8.49964 435.28798 596.40444 1379.36168
6.95000 -6313.52801 16.76720 18.39777 395.83351 313.96275 1326.91481
7.05000 -6225.91771 17.51568 -26.06166 418.37169 379.46263 1338.81318
7.15000 -6145.74626 10.19816 -22.90937 340.40877 359.31081 1318.46648
7.25000 -6074.32977 5.36335 16.53725 340.95697 291.47482 1245.31920
7.35000 -6016.59988 7.25986 18.49780 466.95648 332.86839 1233.04628
7.45000 -5941.38029 -6.95480 57.70605 1499.49048 1186.90283 1351.10495
7.55000 -5886.35128 2.54063 -50.91442 395.64067 228.23567 1628.31259
7.65000 -5804.37243 16.53304 15.91026 335.43150 284.33220 1156.71719
7.75000 -5739.18417 11.33622 53.36278 299.77376 296.23898 1131.61865
7.85000 -5686.11075 5.57189 15.84297 346.58363 237.91448 1085.13370
7.95000 -5636.16001 17.46170 18.64035 332.42829 421.48024 1072.83567
8.05000 -5584.51695 9.06794 28.78093 263.43811 210.94483 1026.93106
8.15000 -5525.07596 16.61215 -21.49743 443.81621 296.35121 1092.00458
8.25000 -5476.15874 18.45281 59.42906 251.06041 203.47992 987.84958
8.35000 -5425.98630 7.82481 65.06637 254.08809 277.77627 963.41044
8.45000 -5348.04917 -10.44043 84.97967 304.40856 324.95137 954.92152
8.55000 -5294.51157 7.56298 26.22005 393.23764 200.59366 972.64523
8.65000 -5257.30091 18.99104 -10.30024 263.95128 271.57027 927.84768
8.75000 -5186.65496 35.26429 2.14234 1003.47922 744.03216 899.01958
8.85000 -5161.32944 -7.97568 18.92490 289.21948 303.46848 933.48094
8.95000 -5113.62730 13.91889 101.32743 279.02001 219.84572 846.10052
9.05000 -5046.63418 11.36945 53.64738 211.51453 166.39941 845.88733
9.15000 -5015.11602 1.72494 47.32562 247.77174 275.21941 871.06147
9.25000 -4966.98702 5.07201 -2.64062 210.02565 207.44286 840.83345
9.35000 -4947.22998 7.16448 53.14075 218.53654 243.69364 760.79915
9.45000 -4898.36369 -3.63081 28.65900 258.07923 264.36253 763.52932
9.55000 -4846.65294 14.22736 28.46897 207.53128 171.51857 755.68158
9.65000 -4621.23236 -131.36770 29.97533 4989.84241 4090.39110 813.86964
9.75000 -4740.50175 6.89326 3.03039 195.03090 209.12827 706.49518
9.85000 -4691.18810 10.37218 60.40214 194.14824 163.80931 714.49860
9.95000 -4650.70279 1.02805 54.07321 219.00297 186.27886 682.26459
10.05000 -4598.11064 11.29012 67.82240 205.42623 217.51248 704.65428
10.15000 -4566.69232 5.86389 -3.15979 166.08675 132.27886 650.21853
10.25000 -4508.73787 2.45246 59.44755 247.36690 114.86628 638.43178
10.35000 -4476.42475 13.17870 6.67158 146.41865 135.72446 637.29165
10.45000 -4430.30635 12.26387 -19.46806 170.41988 101.56750 629.41644
10.55000 -4383.07917 8.79232 33.69135 165.35754 252.45860 638.39756
10.65000 -4347.15334 7.16416 44.26076 144.05536 133.75594 612.02933
10.75000 -4345.19529 16.25158 -4.71801 791.46566 462.49612 842.80694
10.85000 -4280.38351 6.34399 31.15256 134.68859 119.13432 576.06285
10.95000 -4248.12824 0.65295 16.08693 174.73825 118.02485 555.15173
11.05000 -4206.74358 4.24735 2.37484 176.68586 127.72793 545.14524
11.15000 -4168.78356 8.22953 49.62233 148.01696 113.66375 570.03755
11.25000 -4139.71278 0.68855 -50.73776 237.88795 124.18550 533.08289
11.35000 -4093.64001 10.35358 30.62368 145.94316 113.92058 535.32761
11.45000 -4066.05827 4.57485 4.10000 152.99486 193.24415 516.81547
11.55000 -4031.17682 3.50154 28.21038 517.64867 212.63680 657.50625
11.65000 -4001.97365 6.74094 45.65560 304.66644 150.37515 534.43703
11.75000 -3964.57772 -3.92050 -13.84255 181.61376 116.27631 474.50645
11.85000 -3930.20622 -6.16253 34.50498 187.13295 289.59771 496.82877
11.95000 -3900.79116 2.17556 12.57202 112.71188 95.97268 467.22243
12.05000 -3864.54224 1.37926 14.02018 118.83370 103.07265 439.86197
12.15000 -3822.92823 11.92570 -17.58950 159.47112 138.29646 476.63268
12.25000 -3801.82841 5.02163 16.97909 142.11901 107.48250 441.36479
12.35000 -3792.27456 -10.68786 43.75071 465.53351 170.33189 1294.55245
12.45000 -3752.21880 0.71604 11.84674 163.37851 109.65148 413.34245
12.55000 -3742.33190 33.11324 -21.25586 751.97867 585.02746 543.01306
12.65000 -3681.35512 1.11920 14.93378 144.38603 127.96202 442.15976
12.75000 -3634.81190 -1.10679 -2.18068 152.07016 137.70541 406.45624
12.85000 -3614.59676 14.96767 24.78951 136.08656 88.81822 406.53854
12.95000 -3584.72010 5.73711 2.78403 102.90365 93.25469 371.93001
13.05000 -3552.59214 12.61681 72.90906 93.78116 81.12715 368.63954
13.15000 -3517.40504 17.08231 39.32008 140.71145 198.34859 389.78799
13.25000 -3499.23591 -5.11227 21.47108 118.45396 133.20857 389.08300
13.35000 -3467.91061 0.31859 48.93798 140.46600 81.68326 377.29875
13.45000 -3434.80327 -10.15694 38.10323 165.76404 288.82875 375.89375
13.55000 -3398.45801 -9.17543 46.28009 330.62364 170.60253 351.23430
13.65000 -3389.73711 -2.21764 59.37456 105.19056 145.28892 339.76721
13.75000 -3366.49170 3.44012 11.34893 89.99923 84.01538 322.32799
13.85000 -3326.88211 -3.69126 14.88109 283.48609 99.86180 341.92702
13.95000 -3307.12455 9.26153 54.45448 125.87972 128.27075 466.81126
14.05000 -3284.47457 11.81007 62.21487 122.09028 107.96411 346.74749
14.15000 -3268.16978 8.13457 14.14607 158.20215 178.03454 337.52093
14.25000 -3250.21153 16.48085 7.93808 257.91568 197.73128 311.22714
14.35000 -3215.16153 4.87316 23.64447 136.03922 265.37535 309.80384
14.45000 -3271.49125 -61.09227 -42.22163 1050.16146 853.43641 1830.56683
14.55000 -3174.98482 -8.83619 -1.54677 156.82526 357.48281 483.93090
14.65000 -3142.20548 -0.76892 25.67993 102.91258 76.92354 289.50096
14.75000 -3111.51747 8.30056 40.42499 144.72968 80.07720 317.47883
14.85000 -3090.70202 7.01367 37.59743 103.36948 115.97612 415.31066
14.95000 -3068.99107 -1.90938 36.21667 91.82874 125.31889 293.18496
15.05000 -3059.52198 9.02754 64.35333 160.88866 90.25615 277.19373
15.15000 -3019.50263 -0.59830 19.45104 72.01419 71.06921 289.59717
15.25000 -3017.16239 9.33714 43.32429 142.17167 65.93135 258.62272
15.35000 -2986.78356 -8.42221 19.20032 78.40834 112.18637 283.59870
15.45000 -2970.73828 -6.58705 -4.04830 82.99668 76.15377 248.71283
15.55000 -2942.99950 3.41335 47.60703 89.16581 103.80401 280.18523
15.65000 -2920.07958 1.26408 70.26992 81.75404 56.17566 267.02488
15.75000 -2900.73190 4.06508 31.32905 68.47956 63.51941 246.45805
15.85000 -2884.97827 3.17197 41.87563 121.40776 80.56460 270.90829
15.95000 -2862.53415 1.51625 35.37738 91.95620 72.20786 252.51730
16.05000 -2847.26788 4.54168 -17.02824 83.96046 77.91389 240.30125
16.15000 -2815.99165 0.78663 20.08573 111.47639 106.26118 250.24574
16.25000 -2798.69218 0.00999 -0.48724 93.73509 78.74770 258.93135
16.35000 -2790.18303 -4.32966 29.43967 72.06477 82.90624 204.61568
16.45000 -2774.22043 -4.50578 -23.44209 83.93052 85.22553 243.49833
16.55000 -2745.69001 -2.49288 20.68058 219.04569 72.80756 236.57327
16.65000 -2730.25455 2.48111 42.99270 81.18096 87.86607 232.24592
16.75000 -2725.64132 9.03490 15.52091 143.43823 62.50341 229.73862
16.85000 -2695.28755 -3.27977 25.21717 109.88212 59.10593 228.73143
16.95000 -2685.19754 -5.19962 2.31138 75.96836 55.26843 220.62186
17.05000 -2664.99448 -9.76783 6.82292 73.49200 93.88095 229.79264
17.15000 -2639.78071 2.69102 26.17428 59.47803 51.39898 211.19092
17.25000 -2632.22626 4.75223 30.80327 61.49930 52.55937 206.54963
17.35000 -2608.89670 0.42581 19.12686 65.38087 48.80512 206.45221
17.45000 -2594.66890 -5.32809 4.24501 78.99654 85.19773 238.49707
17.55000 -2577.41061 -2.53571 31.93157 60.32019 50.49585 215.33682
17.65000 -2551.39114 1.96982 -0.11784 87.51769 71.25125 198.29157
17.75000 -2544.34963 -7.02142 40.54169 104.09666 67.18494 210.36281
17.85000 -2539.62074 9.08540 25.04332 160.11537 194.06972 233.66266
17.95000 -2507.71958 -5.78950 42.20229 58.11316 54.71812 206.55419
18.05000 -2498.31341 -0.25430 34.55940 78.04913 45.55828 222.86112
18.15000 -2459.16521 -9.07606 -4.61643 348.81598 123.32232 426.08672
18.25000 -2451.84945 -1.97044 78.35854 139.52085 84.79801 207.37848
18.35000 -2472.63362 -10.22738 24.32285 96.32705 67.36834 188.99517
18.45000 -2441.03142 19.27517 55.39709 81.00593 59.28140 185.48982
18.55000 -2421.58712 -1.94468 15.64720 77.40911 49.63438 184.50227
18.65000 -2406.20998 -4.90996 63.13516 59.27442 68.16669 191.74426
18.75000 -2397.46141 1.95225 31.67835 60.38262 66.32681 184.83324
18.85000 -2390.98767 8.20196 14.47557 71.38116 57.89614 174.08540
18.95000 -2368.32218 -6.77205 61.84350 48.15372 45.47872 172.56067
19.05000 -2380.67927 2.04337 52.12952 191.00084 54.80632 170.08112
19.15000 -2352.47464 7.07462 41.49274 59.52270 58.22611 171.20762
19.25000 -2326.62141 1.15350 22.77998 54.75090 55.03736 156.29892
19.35000 -2343.14408 -6.64660 31.17710 146.99055 90.56894 176.99414
19.45000 -2274.92092 -9.12761 46.32759 66.77926 82.10590 183.96077
19.55000 -2297.27003 7.56067 48.86737 70.29542 44.62399 144.31710
19.65000 -2289.38717 10.41193 39.78744 73.88917 63.86186 146.68602
19.75000 -2257.94231 4.95352 22.41218 59.52183 53.35926 146.08480
19.85000 -2253.92897 6.70452 0.60945 73.84376 57.21456 274.97452
19.95000 -2256.24911 12.54065 4.92936 90.48244 53.60893 154.09552
