0.120000 -1.809100
0.380000 1.733810
0.620000 -0.294980
0.880000 -2.117470
1.120000 1.382900
1.380000 -1.516570
1.620000 -2.901370
1.880000 -0.955060
2.120000 1.087110
2.380000 0.790140
2.620000 -1.284090
2.880000 0.174380
3.120000 0.008620
3.380000 -0.625530
3.620000 -0.118800
3.880000 -2.104560
4.120000 2.889480
4.380000 3.118510
4.620000 -1.161080
4.880000 -3.028370
5.120000 -2.561910
5.380000 -3.085320
5.620000 -2.044890
5.880000 1.368080
6.120000 -0.278430
6.380000 -0.781340
6.620000 -0.378140
6.880000 -1.006770
7.120000 -2.486260
7.380000 2.132570
7.620000 1.579890
7.880000 1.878510
8.120000 1.007820
8.380000 1.199090
8.620000 1.265590
8.880000 2.037170
9.120000 1.655210
9.380000 0.719380
9.620000 2.860080
9.880000 0.837540
10.120000 1.659370
10.380000 2.190530
10.620000 0.633880
10.880000 1.124350
11.120000 -0.180960
11.380000 -0.360610
11.620000 -0.925110
11.880000 -0.332150
12.120000 -3.100460
12.380000 -1.050290
12.620000 -1.624360
12.880000 -2.826540
13.120000 1.531090
13.380000 1.236180
13.620000 1.910200
13.880000 1.218670
14.120000 1.932460
14.380000 0.039500
14.620000 -2.661350
14.880000 -0.116230
15.120000 -1.350990
15.380000 -0.549340
15.620000 -2.484130
15.880000 -0.734840
16.120000 3.090610
16.380000 -1.694540
16.620000 -2.822670
16.880000 -2.148690
17.120000 2.744030
17.380000 -2.536600
17.620000 1.562060
17.880000 2.807630
18.120000 3.034450
18.380000 2.437360
18.620000 2.158260
18.880000 0.902760
19.120000 1.148720
19.380000 1.824120
19.620000 1.130460
19.880000 -0.062550
