0.15 -1.17525 16.54276 -0.32562 85.54584 84.16062 68.97648
0.45 -0.83823 34.97729 -1.50403 85.15885 83.11486 69.73234
0.75 -0.56425 51.37261 -0.09238 84.05499 80.97979 67.80338
1.05 -1.15475 67.4344 -0.31819 84.08616 78.05003 66.16382
1.35 -2.28865 81.23016 -1.02961 83.09278 75.51989 63.93447
1.65 -2.07954 91.02768 -0.73562 83.00076 72.87584 61.94871
1.95 -1.46165 97.37865 0.19449 82.33074 70.70329 59.67379
2.25 -1.02161 103.64025 -0.23686 80.36167 67.35014 58.50256
2.55 -3.10058 109.55641 0.82777 79.07333 64.34408 56.58452
2.85 -2.62367 116.08778 0.22065 76.43196 62.73159 54.93197
3.15 -2.67613 121.85314 -0.41039 74.5431 60.28182 53.40424
3.45 -1.90235 128.00713 0.29927 71.94472 57.623 51.59015
3.75 -1.41877 133.87504 0.62362 68.62489 56.75405 49.53961
4.05 -1.90928 140.11502 0.63765 65.79623 54.37363 48.60394
4.35 -1.73438 146.25839 0.72258 62.4314 52.49831 47.1294
4.65 -1.89196 151.75529 0.9355 58.56911 51.36944 45.29816
4.95 -2.0917 158.57915 0.9942 55.26749 48.67828 43.57035
5.25 -1.36025 164.15491 0.95802 52.23463 45.71898 42.25369
5.55 -0.64967 170.26721 0.98735 49.26682 43.02045 40.87696
5.85 -0.68998 174.22036 0.20483 46.79947 41.03702 38.95394
6.15 -0.70748 178.20886 0.55817 44.77733 38.72092 37.31792
6.45 -1.10068 182.28137 0.5767 42.78931 36.83508 35.86246
6.75 -0.74314 185.42188 1.02338 41.15549 34.84244 35.08583
7.05 -1.3551 187.98585 0.50521 39.85932 33.14395 33.5358
7.35 -1.22401 190.50284 0.18213 39.34797 31.23838 32.14657
7.65 -1.84411 192.70378 0.0092 37.35627 30.6929 31.10012
7.95 -1.91394 194.65123 0.04134 35.95245 29.60358 30.15498
8.25 -2.10315 196.12979 -0.69054 35.20865 28.28911 29.4869
8.55 -1.82517 197.93789 -0.36788 33.90983 27.71639 28.20367
8.85 -2.07531 198.94103 -0.61859 33.30768 26.56189 27.37492
9.15 -1.60336 200.50477 -0.60222 32.23731 25.80004 26.69906
9.45 -1.77077 201.55244 -0.78333 31.50369 24.8907 25.80628
9.75 -0.75654 202.60299 -0.71973 31.02715 23.72356 25.50451
10.05 -1.08367 203.2279 -0.71833 30.29279 23.21233 24.57799
10.35 -0.91972 203.81039 -0.75554 29.14669 22.72156 23.79041
10.65 -0.78456 204.67693 -0.65719 28.55603 22.51213 22.91572
10.95 -0.28382 204.67839 -0.94328 27.84212 21.79061 22.03523
11.25 0.2539 205.88099 -0.85828 27.38178 21.79545 21.67624
11.55 0.08747 206.37606 -1.22026 26.30816 20.89775 21.19098
11.85 0.39666 207.24153 -1.33345 26.05172 20.2069 20.43474
12.15 -0.70562 207.75236 -0.97017 25.30532 19.98183 20.25877
12.45 -0.08702 208.32138 -1.04873 24.86348 19.17076 19.16315
12.75 -0.73527 208.61101 -0.62322 24.42594 18.51562 18.89698
13.05 -0.06518 208.70113 -0.89914 24.18358 17.49474 18.58715
13.35 -0.06472 208.82762 -0.32527 23.32178 17.6257 18.40347
13.65 0.65336 209.16236 0.16964 22.79097 16.89624 17.45743
13.95 -0.34852 208.81462 0.14967 22.18861 15.99093 16.97817
14.25 -0.17006 208.56964 -0.00986 22.0785 16.08352 16.70834
14.55 0.14918 208.52248 0.18942 21.74379 15.68125 16.59474
14.85 0.28929 208.26064 -0.04212 20.9092 15.06689 16.04042
15.15 0.29364 208.203 0.45952 20.70465 15.11644 15.66387
15.45 0.02415 207.74704 0.69979 20.41421 15.05007 15.22802
15.75 0.1972 208.27237 0.37529 20.05824 14.27288 14.6118
16.05 0.18618 207.49272 0.17125 19.55142 14.53859 14.00019
16.35 0.56162 207.97495 0.09245 19.32 14.3296 13.84536
16.65 -0.81162 207.73902 -0.30287 18.56629 13.7888 13.42439
16.95 -0.52388 207.86111 0.37889 18.24644 13.70462 13.051
17.25 -0.58243 208.21384 -0.71069 17.67876 13.70347 13.00953
17.55 -0.6535 208.36498 -0.7615 17.47849 13.59471 12.81164
17.85 -0.88774 208.87375 -0.80037 16.82693 12.65264 12.13901
18.15 -0.27953 208.8488 -1.2086 16.29075 12.27561 11.96481
18.45 -0.69354 208.66359 -0.6897 16.01817 12.3056 11.6806
18.75 -0.20097 208.43553 -0.7302 16.16665 12.28531 11.33339
19.05 -0.1478 208.65206 -0.24842 15.80907 12.08485 11.09852
19.35 -0.34544 208.45265 -0.10478 14.87011 12.51284 10.88083
19.65 0.02184 209.41145 0.13336 14.82173 12.11319 10.27732
19.95 0.55379 208.92861 -0.13883 13.8243 11.45242 10.09794
20.25 0.63088 208.66925 0.29895 14.19783 10.83659 10.28875
20.55 0.57466 208.32781 0.39177 14.63354 10.03958 9.83562
20.85 -0.6234 207.64384 0.37972 14.17439 9.48667 9.61164
21.15 -0.22239 206.34562 0.25868 14.12429 9.45504 9.7787
21.45 -1.00249 205.68057 0.05963 13.18146 9.43647 9.41871
21.75 -1.42935 205.50852 0.19969 13.81641 9.6311 9.4361
22.05 -1.46154 206.18906 -0.01573 13.63324 10.45434 9.20257
22.35 -1.02775 206.78345 -0.07636 13.15252 9.79052 8.80665
22.65 -0.19433 206.89512 -0.2425 13.08289 9.51794 8.55624
22.95 -0.34149 207.55091 -0.65541 12.22711 8.80047 8.39761
23.25 0.27257 207.44993 -0.57972 11.45025 7.88219 8.0166
23.55 0.94928 206.16752 -0.8899 11.68529 8.2209 7.98106
23.85 0.39003 205.35318 -0.50085 11.92005 7.73486 7.68771
24.15 0.33748 204.70321 -0.08306 11.35013 7.72594 7.59123
24.45 -0.91231 203.88821 -0.31042 11.32143 8.56162 8.27947
24.75 -0.94395 204.1312 0.45996 11.75904 7.93933 7.41819
25.05 -1.06522 204.28605 0.16247 10.3454 8.836 7.62217
25.35 -2.93089 204.64768 0.616 11.06294 8.64537 6.91183
25.65 -2.42805 206.35264 0.27261 9.65603 8.00529 7.45241
25.95 -1.43416 206.93017 -0.15289 10.43892 8.10594 7.03264
26.25 0.481 206.59102 0.56731 10.15031 6.9199 6.32715
26.55 0.77425 206.11724 -0.10771 9.43904 6.6909 6.45796
26.85 1.6107 204.98661 0.12818 9.85487 6.33597 6.2843
27.15 1.25448 204.61373 -0.46528 9.59225 6.59525 6.47405
27.45 0.83358 203.77882 -0.17796 10.08218 6.66214 6.27764
27.75 0.83964 203.75601 -0.92453 9.22573 7.06396 6.21462
28.05 -1.23671 203.83369 -0.22734 9.31054 6.95464 6.35008
28.35 -3.62471 203.75951 -1.11158 9.60119 6.14811 6.10033
28.65 -3.01796 203.44144 -0.44149 8.82816 6.53945 6.12117
28.95 -4.49981 204.09663 -1.31105 8.35827 5.50736 5.56165
29.25 -4.21962 204.85065 -0.79687 8.6174 5.09457 5.44112
29.55 -2.99185 204.18098 -0.3238 7.64926 5.54485 5.78553
29.85 -2.44517 204.86193 0.41921 7.76445 5.60251 5.30306
