0.12500 0.00144
0.37500 0.01014
0.62500 0.00488
0.87500 0.04923
1.12500 0.02780
1.37500 0.03498
1.62500 0.05464
1.87500 0.04197
2.12500 0.04636
2.37500 0.04697
2.62500 0.06133
2.87500 0.04969
3.12500 0.04370
3.37500 0.03098
3.62500 0.03571
3.87500 0.02062
4.12500 0.02725
4.37500 0.01842
4.62500 0.02172
4.87500 0.02107
5.12500 0.02074
5.37500 0.01149
5.62500 0.01979
5.87500 0.00858
6.12500 0.02275
6.37500 0.00507
6.62500 0.02041
6.87500 0.02700
7.12500 0.02874
7.37500 0.04782
7.62500 0.03584
7.87500 0.03180
8.12500 0.03830
8.37500 0.01680
8.62500 0.03301
8.87500 0.01997
9.12500 0.03138
9.37500 0.00477
9.62500 0.02729
9.87500 0.06636
10.12500 0.05943
10.37500 0.05341
10.62500 0.02485
10.87500 0.04163
11.12500 0.01107
11.37500 0.01723
11.62500 0.03356
11.87500 0.01905
12.12500 0.01660
12.37500 0.01304
12.62500 0.01432
12.87500 0.02500
13.12500 0.03966
13.37500 0.01988
13.62500 0.02385
13.87500 0.03374
14.12500 0.03066
14.37500 0.02997
14.62500 0.04392
14.87500 0.08082
