0.6 3.65656
1.2 2.73719
1.8 2.27993
2.4 2.18344
3.0 2.3464
3.6 2.66749
4.2 2.479
4.8 3.33929
5.4 2.70853
6.0 3.52548
6.6 3.39786
7.2 3.52164
7.8 3.31796
8.4 3.98292
9.0 4.63474
9.6 5.29212
10.2 5.69633
10.8 5.6902
11.4 5.11661
12.0 3.81841
