0.05000 -3696.90669 -34.64135 -29039.15242 2566.05039 2346.58946 1064224.21017
0.15000 -8323.39378 107.92181 -40142.20253 3721.34871 3062.68370 1137732.74203
0.25000 -12155.00502 -43.91833 -20682.03872 3836.27414 3695.57838 1033382.92016
0.35000 -14605.61321 68.09521 19333.52907 4163.91385 4415.69335 973350.72436
0.45000 -16631.25402 36.94102 -1303.58246 3933.15028 4773.33024 945105.03098
0.55000 -17705.37292 -16.40813 -12581.04586 3861.73942 5056.18239 890731.78784
0.65000 -18313.67837 -43.20239 13485.65990 3600.93485 5192.18051 800799.95535
0.75000 -18458.33873 33.24210 11141.54760 3313.44152 5232.91181 774007.33366
0.85000 -18445.51512 55.21326 -14459.29493 2991.45729 5263.78170 707248.76053
0.95000 -18075.43437 111.18704 2679.25198 2747.75090 5229.87957 645027.79099
1.05000 -17713.46173 25.07310 895.68866 2488.93927 5204.59009 607790.31382
1.15000 -17364.72296 68.36095 -2552.54302 2143.58110 5069.52703 576436.74616
1.25000 -16945.97177 7.29523 4738.32724 1824.22581 4949.65919 522574.11037
1.35000 -16490.34201 52.63578 942.81549 1583.79379 4848.35721 472476.75226
1.45000 -16058.45298 9.51324 -1500.31379 1391.82840 4695.22047 468112.02417
1.55000 -15678.28673 -15.96468 -2084.90339 1169.17986 4566.45036 414475.75488
1.65000 -15308.90348 35.50213 -979.48444 1016.89814 4388.39274 397784.33464
1.75000 -14927.09190 5.06835 -7742.26726 884.39348 4267.14373 365784.00917
1.85000 -14560.89077 30.55399 -6747.78143 805.23322 4114.93910 348626.63385
1.95000 -14198.01829 69.88582 2855.44587 686.73150 3919.86801 302523.06357
2.05000 -13851.72899 4.85268 -1519.40535 621.32350 3780.69541 300383.41373
2.15000 -13507.27520 144.47253 -1021.74573 624.82555 3672.06461 263702.16238
2.25000 -13215.03474 -35.79000 115.64678 584.40036 3504.28796 273154.59700
2.35000 -12930.32517 56.24885 -1133.77415 589.65680 3402.97267 249768.82319
2.45000 -12650.56416 18.94314 -6526.62557 555.95091 3254.28502 235526.95108
2.55000 -12348.72435 0.88728 1238.00018 570.14352 3120.86747 231748.69253
2.65000 -12034.47179 73.18093 -5564.85815 589.00294 2991.83568 200210.63471
2.75000 -11759.40854 38.10488 -178.55401 582.13600 2879.26659 211120.52662
2.85000 -11482.16604 58.63561 -866.14932 595.97417 2766.65751 184010.97325
2.95000 -11209.14186 50.79986 5289.21104 577.23107 2674.59935 187912.67035
3.05000 -10979.51660 15.72005 -1334.29808 586.18471 2550.84878 166591.62872
3.15000 -10765.73627 60.10281 -3053.41154 587.74750 2487.94058 159973.78026
3.25000 -10558.21575 52.64929 -3754.60813 584.37971 2346.86147 156044.13680
3.35000 -10369.89415 19.83168 -2486.87789 607.25363 2276.48937 150731.91170
3.45000 -10185.37650 9.92589 -1246.67686 613.98775 2193.67221 153884.07266
3.55000 -10012.62601 58.60214 -1260.48015 623.28602 2114.73798 127672.68170
3.65000 -9812.80781 22.41149 -436.10457 650.55936 2018.21598 124406.19175
3.75000 -9651.73114 28.44021 -634.11032 672.61928 1934.08997 126705.79158
3.85000 -9472.89893 -26.60394 -3048.52575 717.26160 1874.31471 129467.96286
3.95000 -9318.18787 71.65314 -2606.39073 699.65683 1775.51460 122458.04479
4.05000 -9112.62408 2.99717 -1588.25168 723.16741 1703.25817 123770.72913
4.15000 -8959.04310 28.39553 -470.71578 734.47151 1624.44715 114504.39354
4.25000 -8788.14458 26.24082 864.54395 715.27677 1560.19823 111828.97946
4.35000 -8602.80614 10.43829 -83.38904 720.42317 1480.17311 100941.51097
4.45000 -8438.79017 -16.42530 650.12080 721.32428 1411.49634 102781.52743
4.55000 -8247.92287 3.72602 1502.73110 722.28103 1329.44562 96601.48496
4.65000 -8086.23584 8.23365 -1638.00241 745.01360 1257.01587 102379.42749
4.75000 -7914.39080 26.42650 656.95129 718.76843 1217.42360 97435.59941
4.85000 -7728.01320 18.04197 2439.06603 712.98807 1148.56173 104902.22404
4.95000 -7559.04852 11.45817 -380.29561 691.00997 1101.96581 98092.93284
5.05000 -7411.46938 24.24006 -579.27016 676.83525 1030.83555 95882.87796
5.15000 -7246.42335 -20.22498 -1009.79672 660.02716 1006.61934 94872.81582
5.25000 -7096.39897 -0.99308 -1459.10361 634.58382 956.06820 87888.15496
5.35000 -6936.95029 15.84208 -1697.17376 617.00812 917.91919 108541.71731
5.45000 -6781.53141 8.65018 -512.38589 590.50374 866.77648 84153.54158
5.55000 -6668.61331 -4.75231 -798.46109 565.74876 874.23574 96529.39400
5.65000 -6515.66911 10.17176 -1899.20052 538.14530 807.48968 86662.78154
5.75000 -6414.19962 -4.23192 204.91277 502.18178 777.56796 80090.10350
5.85000 -6305.96752 16.25589 -455.58969 512.27597 764.63770 75894.24782
5.95000 -6223.60324 -13.39881 -244.67783 485.90861 751.03551 80239.51715
6.05000 -6112.11614 6.33045 -704.65036 462.83511 726.43626 74453.24273
6.15000 -6037.50648 -6.91944 98.53841 472.01691 702.70465 68620.32432
6.25000 -5948.25489 -16.72467 -607.40327 422.29585 685.47573 66005.66171
6.35000 -5876.36664 -11.84316 257.27687 404.90219 668.86054 59644.45790
6.45000 -5800.21949 -32.47840 -217.42369 409.12452 651.86086 62254.75626
6.55000 -5740.63836 -40.06931 -278.77758 386.82045 632.76184 59548.63996
6.65000 -5670.56628 -13.29437 1529.82936 392.07174 624.24562 54312.88982
6.75000 -5626.04684 -24.76324 1769.45297 399.40678 604.77096 51277.99959
6.85000 -5581.32689 -37.51749 747.99389 383.08668 595.43484 52752.71770
6.95000 -5541.98506 -30.88917 1222.43432 402.71090 592.69170 44446.45764
7.05000 -5511.00466 -28.98716 166.45209 404.24696 577.41809 46881.22645
7.15000 -5470.48792 -15.96837 854.75178 413.46419 552.17182 39052.18102
7.25000 -5450.82976 -19.44074 1598.69220 422.39932 549.05939 57387.06290
7.35000 -5427.33748 -17.29925 1229.36480 436.45626 523.39234 37083.38760
7.45000 -5386.99939 7.06499 1429.42016 474.69430 504.87072 36534.81661
7.55000 -5358.22145 5.96100 924.21106 471.40961 483.06713 35515.25623
7.65000 -5314.57496 4.46294 1189.40977 476.92407 478.20618 31121.96611
7.75000 -5296.23572 1.23729 1747.58111 483.65913 463.51812 37681.62033
7.85000 -5239.11061 14.77554 1397.95721 488.63489 450.01564 29421.70383
7.95000 -5210.59925 19.72371 820.41103 492.16702 407.47760 29701.42758
8.05000 -5147.97763 20.93115 1376.80761 491.28847 393.09136 30382.12553
8.15000 -5103.64273 36.77151 850.46973 482.30022 385.59298 25929.67741
8.25000 -5041.75588 22.50909 1814.45664 463.47798 350.58126 26050.35446
8.35000 -4992.14548 32.10135 1893.74802 463.36575 345.34304 25031.51084
8.45000 -4929.79415 34.28230 533.46407 444.72105 329.62894 24491.60938
8.55000 -4873.31040 42.46379 510.44833 428.38616 314.86912 24771.78666
8.65000 -4832.74073 35.64692 734.72280 409.44931 292.67236 21487.14835
8.75000 -4784.01828 39.48483 729.99248 396.23603 302.70522 22691.61578
8.85000 -4721.37967 43.64778 1341.89498 384.18782 279.84211 18802.74458
8.95000 -4677.71547 32.03516 722.65447 373.85573 282.26783 20860.75563
9.05000 -4639.61643 27.79991 1273.40120 364.65160 258.89166 20513.51327
9.15000 -4585.47294 29.75246 1176.65400 359.18452 256.85342 22481.55367
9.25000 -4540.65044 29.84552 650.58663 348.07227 262.47588 18472.51876
9.35000 -4512.11867 31.75047 886.64095 314.56018 231.78384 17572.55192
9.45000 -4464.16106 30.38297 1224.10933 297.38242 223.86666 17040.18816
9.55000 -4412.50458 28.62497 772.01758 284.55282 233.69196 15981.29021
9.65000 -4385.26504 22.22199 728.78918 266.07929 204.07250 16148.62247
9.75000 -4334.13996 19.09334 -262.83958 267.56966 208.16053 36480.89883
9.85000 -4295.96969 21.34462 786.94341 237.78510 179.68911 14273.03489
9.95000 -4262.91029 19.59864 573.74779 245.84182 199.05123 14397.87264
10.05000 -4229.76830 19.52224 167.71939 236.04316 192.89286 30562.52110
10.15000 -4200.00937 11.00288 547.36312 231.38939 176.39720 12420.23294
10.25000 -4173.80104 12.19334 413.07655 205.29413 183.93461 12341.11625
10.35000 -4138.27588 18.68065 274.85761 220.12791 185.06173 15029.70883
10.45000 -4110.63410 14.67331 572.97702 225.81187 174.15116 14004.61605
10.55000 -4076.63484 16.72913 366.21837 185.51028 168.75055 12413.56279
10.65000 -4050.68416 14.28840 419.56318 198.58928 165.01839 10043.31996
10.75000 -4023.85463 15.63476 645.10827 215.78822 185.83602 11778.67926
10.85000 -4001.43149 12.48767 261.40901 174.65513 175.39553 10404.44541
10.95000 -3972.78429 16.03651 264.46258 178.77345 163.20590 9788.78258
11.05000 -3931.47431 12.49757 70.52629 168.14227 162.05920 11495.07027
11.15000 -3904.78487 10.35514 496.86457 167.74785 175.59476 9149.53550
11.25000 -3873.22256 12.91905 -62.40409 166.26190 183.39045 8818.63077
11.35000 -3850.46323 16.80642 200.04695 199.28601 215.60638 9418.05396
11.45000 -3819.95564 12.41941 137.64164 151.63271 140.26854 8706.35007
11.55000 -3793.61197 12.92552 69.81912 148.11769 143.60839 8633.31138
11.65000 -3762.81396 15.05413 127.22543 138.98501 150.06571 8142.81662
11.75000 -3735.15809 11.04210 388.87622 145.43192 131.26642 8092.52479
11.85000 -3715.06423 13.08469 -0.76004 126.65021 122.51962 9921.03700
11.95000 -3683.77832 8.78143 73.83404 135.78812 130.08070 9474.68110
12.05000 -3661.89748 15.07714 185.42507 172.09934 173.76120 8968.52173
12.15000 -3634.61234 13.02142 26.05807 160.08717 143.12220 9799.26010
12.25000 -3609.43776 8.29543 224.04843 145.77036 164.11074 7334.75516
12.35000 -3586.83854 11.09215 288.44956 134.58253 150.76143 15163.41770
12.45000 -3563.53314 7.83756 47.07027 125.58366 114.36875 8569.03187
12.55000 -3532.91472 11.97845 241.17750 121.92271 121.60810 7179.04228
12.65000 -3514.13296 6.86216 93.62961 140.81527 163.86380 7169.80404
12.75000 -3487.42514 10.11157 31.29566 130.79627 119.20286 7587.19103
12.85000 -3461.01786 7.68635 -380.46514 129.74613 111.63989 21055.70772
12.95000 -3437.31383 8.73546 285.55841 133.71072 96.47866 8323.95647
13.05000 -3413.98440 7.11611 377.01599 110.52711 104.99732 7738.29219
13.15000 -3384.76538 8.23712 264.04600 128.60683 116.91914 7098.28318
13.25000 -3362.53240 3.13934 364.19890 121.48580 151.80920 5922.89316
13.35000 -3342.24618 7.79911 379.39770 119.16177 117.39058 6958.93309
13.45000 -3318.39807 4.86544 297.58765 113.89349 93.79420 6399.20194
13.55000 -3292.71609 6.43906 -15.86705 129.43252 84.09704 7213.91104
13.65000 -3265.35403 4.20226 209.39276 114.12602 89.63156 5526.61155
13.75000 -3247.10033 6.68642 232.54797 99.28289 90.12660 5443.08651
13.85000 -3226.35725 -2.52614 259.92657 104.35340 125.36755 6376.28600
13.95000 -3200.47113 8.06139 457.41218 110.61240 101.78110 5899.48997
14.05000 -3181.93241 0.27752 -9.27098 87.60013 92.50791 6242.92724
14.15000 -3164.75385 3.19394 -34.45884 99.40839 87.00567 5798.98583
14.25000 -3138.85208 1.83825 112.67993 151.29868 82.93241 5324.63144
14.35000 -3119.10453 3.25453 398.54036 145.56931 120.89308 5967.96749
14.45000 -3098.38627 2.85196 -22.01431 77.35185 68.55974 4897.89221
14.55000 -3077.27262 2.95288 211.67069 99.08765 81.16283 4070.19072
14.65000 -3061.86801 11.71302 -63.39745 142.80326 139.44305 5430.55104
14.75000 -3029.70052 2.77645 142.41192 156.93965 90.82016 5416.98256
14.85000 -3016.45551 -1.43253 -74.09186 129.82706 112.79971 5216.66790
14.95000 -2994.10235 0.36243 326.61191 82.75996 76.82286 6620.64372
15.05000 -2968.27931 7.47265 216.59687 86.91894 67.68117 4534.86666
15.15000 -2951.76778 2.84979 4.94479 76.45242 71.98630 5296.53896
15.25000 -2929.84357 1.25049 121.02024 221.89809 96.92874 4850.22324
15.35000 -2917.08627 2.48854 231.72842 108.14484 83.39963 3859.28029
15.45000 -2893.89198 1.91228 -143.11472 85.75388 114.70999 4730.72245
15.55000 -2875.32475 7.95735 64.31661 77.41152 62.87567 3635.67520
15.65000 -2853.29989 2.76259 125.41957 80.07165 80.64712 5466.06690
15.75000 -2822.84741 6.29292 187.63980 89.33120 56.34159 3876.77088
15.85000 -2809.64487 7.65130 173.36466 84.89599 63.61683 4613.43024
15.95000 -2786.94967 6.50101 -80.71917 101.18600 81.96539 4567.18054
16.05000 -2766.76620 6.10633 44.14864 95.67189 70.23207 4768.60914
16.15000 -2754.33443 7.33835 7.71099 86.96149 64.26011 4858.80016
16.25000 -2734.57314 8.47854 -18.35716 97.32776 88.27355 3730.18464
16.35000 -2713.58869 9.44365 -226.37527 63.11384 71.24505 4326.35378
16.45000 -2695.22169 9.75512 18.29542 67.76475 82.96631 4191.75805
16.55000 -2675.85184 4.04459 -29.01360 87.38064 146.63189 4288.53612
16.65000 -2662.95159 11.04050 -148.03250 62.66338 60.30595 4515.53694
16.75000 -2648.34340 9.58217 140.82502 54.39474 62.14334 4559.84513
16.85000 -2631.45376 15.08832 196.31510 78.31349 81.86522 3967.28415
16.95000 -2612.61601 15.35429 -440.72971 113.67803 114.37560 4762.25057
17.05000 -2595.77578 8.40731 110.78659 72.86574 52.05169 3953.73755
17.15000 -2580.72588 8.64897 -9.72732 73.48868 88.96016 4095.44877
17.25000 -2565.55402 10.10077 -88.39631 68.63950 67.10626 4305.22997
17.35000 -2554.32492 13.06327 -25.48776 79.49038 58.69426 3568.04978
17.45000 -2539.98637 12.54566 -155.97812 57.93806 52.55233 3445.49566
17.55000 -2521.40667 11.37011 -16.18881 60.48455 69.93841 3078.07708
17.65000 -2510.38398 9.72401 21.94661 53.30692 40.54903 3089.55667
17.75000 -2493.95122 9.05260 -171.22620 61.97293 46.31211 3008.52512
17.85000 -2481.80513 11.04958 53.32007 59.24489 54.56271 3245.34359
17.95000 -2466.99258 10.55239 135.06847 52.23485 49.31240 2665.54391
18.05000 -2447.27486 12.75409 -159.81770 113.22166 76.07661 3880.79454
18.15000 -2433.24844 10.12367 -267.71188 72.63038 54.15145 2634.60987
18.25000 -2425.33859 8.89936 98.68773 55.17880 47.98401 3248.71743
18.35000 -2406.70948 1.43904 -26.79819 116.86486 152.98566 3342.16997
18.45000 -2398.45585 11.09017 -15.94494 102.57543 157.78292 2592.94352
18.55000 -2390.83807 11.04615 -56.63882 71.84853 64.64742 2697.32241
18.65000 -2377.26992 6.41289 -47.87620 46.65847 44.07178 2451.81792
18.75000 -2355.68200 9.88007 88.18973 45.06653 48.12118 2513.30614
18.85000 -2347.78225 4.61942 44.79207 65.66221 42.22904 2465.79057
18.95000 -2333.32441 11.00145 219.11707 77.03150 64.04695 2570.24265
19.05000 -2313.91771 6.04955 -84.42139 51.24510 65.31047 2829.06790
19.15000 -2303.10022 6.84307 230.71946 60.94435 91.39469 4913.23571
19.25000 -2278.08950 5.08235 -128.40662 181.28834 83.98680 2156.00862
19.35000 -2281.84231 4.45468 28.92036 130.41724 169.02444 2592.68499
19.45000 -2268.65692 8.58829 -66.94862 39.30373 75.11187 2386.57260
19.55000 -2254.95728 4.51867 -62.32962 36.41955 38.76660 2153.45769
19.65000 -2242.76570 4.30789 130.59495 61.44168 55.59151 1877.20441
19.75000 -2227.78935 9.85216 158.27033 62.96587 51.79623 2064.68383
19.85000 -2216.52002 1.35297 -78.29172 60.72446 47.95767 2041.62377
19.95000 -2206.51774 5.56380 -83.28525 44.11669 32.55888 2090.00846
