0.05000 -820.05728 347.10164 -612.28342 1295.34006 1273.08202 1035.43201
0.15000 -1579.69120 86.34080 147.64619 1535.56186 1280.97635 2727.97754
0.25000 -2518.70806 -30.60721 -336.60100 1308.56206 1274.18430 3954.41302
0.35000 -3530.45484 -35.39652 200.00290 1458.01173 1181.85501 4860.24105
0.45000 -4067.25844 -12.70610 -58.37097 1526.39652 1132.63082 5661.51548
0.55000 -4559.85786 -45.19137 168.58806 1626.57021 1152.87287 6133.02087
0.65000 -5026.78027 24.79540 11.92230 1672.81487 1215.46153 6488.71007
0.75000 -5504.27722 10.69953 157.31952 1762.39655 1254.21919 6676.89593
0.85000 -5713.34855 18.02461 27.14786 1818.44654 1287.59869 6959.61326
0.95000 -6064.70700 3.04325 164.09460 1763.94357 1318.93843 6859.94697
1.05000 -6295.22149 -7.00870 101.84648 1845.48160 1363.92676 6931.48925
1.15000 -6548.25761 2.01810 -27.78391 1799.52737 1412.86658 6773.71277
1.25000 -6683.55195 48.50904 -50.72887 1767.85750 1450.56678 6729.73635
1.35000 -6878.13933 25.13852 53.58643 1757.84187 1445.22388 6610.06642
1.45000 -6990.12755 45.97246 97.61060 1717.27118 1479.12326 6489.40396
1.55000 -7040.01555 22.54256 -15.61710 1669.22081 1503.88548 6325.37296
1.65000 -7073.69664 28.46136 -4.11733 1611.50123 1528.81953 6138.33749
1.75000 -7136.51859 43.36178 -51.86543 1500.00697 1536.64473 5921.55342
1.85000 -7148.71784 30.74360 -64.05054 1443.03196 1539.34942 5838.13208
1.95000 -7175.98683 -1.42886 -1.45766 1373.63999 1516.44421 5699.89587
2.05000 -7230.36681 10.17997 8.10525 1322.99716 1545.63371 5454.41020
2.15000 -7238.17727 8.32420 -74.69174 1253.62568 1540.61398 5319.86512
2.25000 -7205.64826 100.98880 -41.63734 1168.05986 1534.29520 5232.18271
2.35000 -7214.52965 -9.80734 45.06227 1109.48868 1536.71572 5024.70467
2.45000 -7180.06711 55.79646 -32.79001 1041.95408 1512.34300 4932.38255
2.55000 -7163.11845 45.17848 68.54841 999.38816 1504.16775 4798.63280
2.65000 -7168.53480 25.22409 -36.52762 953.49005 1484.74897 4687.76060
2.75000 -7161.55627 6.60938 -121.28141 925.17050 1474.51784 4598.56599
2.85000 -7170.30381 19.92924 11.32079 849.20984 1442.09742 4488.73792
2.95000 -7129.54939 28.13851 -27.06006 860.40164 1414.17653 4386.55849
3.05000 -7137.92732 47.12508 50.28983 779.56410 1403.40630 4262.65665
3.15000 -7116.61137 50.26280 93.47396 731.98556 1353.13022 4152.16919
3.25000 -7092.16985 35.28903 73.94937 693.82461 1314.06829 4036.34331
3.35000 -7070.52923 -2.49368 34.91039 635.07346 1296.45748 3891.19084
3.45000 -7018.70307 -2.45097 40.37329 621.52617 1247.58280 3876.92091
3.55000 -6991.88967 8.57426 57.71328 599.10173 1234.33317 3796.26818
3.65000 -6971.28193 -17.69060 49.21727 572.94682 1191.60534 3668.77281
3.75000 -6966.40837 -17.81844 9.30230 558.60507 1159.94770 3577.92395
3.85000 -6924.13482 2.15235 -23.17701 579.09409 1115.28056 3516.80313
3.95000 -6904.41874 -2.02310 59.49272 568.26894 1077.64578 3402.21262
4.05000 -6864.83599 15.13397 85.66446 558.30415 1042.94737 3372.72808
4.15000 -6826.01784 19.62863 55.58863 573.10863 1000.78165 3265.68671
4.25000 -6813.17482 8.70103 47.09365 575.66838 966.27635 3179.44134
4.35000 -6778.84606 7.06233 -39.79510 578.44118 938.37609 3096.77513
4.45000 -6755.02147 6.79771 19.96735 565.45683 898.31115 2994.82127
4.55000 -6716.41683 1.44210 -59.75704 574.96079 866.00342 2920.93586
4.65000 -6682.14482 6.38987 62.01678 603.54789 827.38987 2836.69972
4.75000 -6643.72231 6.12804 26.79818 593.56800 785.14693 2761.66976
4.85000 -6608.95535 -6.78360 -34.88049 587.82714 756.97791 2684.77936
4.95000 -6588.71362 -10.17093 21.57982 585.64223 724.43224 2653.47232
5.05000 -6544.91185 -8.81971 -3.00956 576.53984 689.93056 2580.32695
5.15000 -6503.48382 8.89019 21.61136 560.06254 660.64315 2502.75710
5.25000 -6474.25243 2.19920 -10.63064 564.27281 629.04178 2428.42794
5.35000 -6427.60637 3.61791 -55.31477 552.73744 604.98709 2366.64448
5.45000 -6402.12173 -15.56980 -14.32960 545.89979 584.21098 2313.61262
5.55000 -6359.84893 4.21127 31.23219 538.42446 555.33253 2246.39468
5.65000 -6308.26503 7.38285 -14.82437 525.23590 523.02745 2197.15453
5.75000 -6265.68857 7.83276 -34.84617 524.60418 502.86506 2144.82776
5.85000 -6233.99512 8.98999 9.25800 510.67991 480.62839 2081.51015
5.95000 -6185.11443 14.11538 -18.24154 508.91741 453.90370 2039.40299
6.05000 -6155.09452 12.98514 33.92876 491.00143 441.13544 1977.79938
6.15000 -6093.60304 17.46080 -11.20103 479.16837 414.00723 1958.13318
6.25000 -6059.91906 2.35215 -55.39577 452.45605 399.22274 1879.12216
6.35000 -6015.27285 5.49199 5.88189 444.26108 380.43158 1863.44928
6.45000 -5965.92511 6.27637 -12.68534 428.41096 361.11354 1836.03007
6.55000 -5932.80172 6.01028 -16.62305 423.79126 354.13091 1761.20613
6.65000 -5898.80519 11.00448 17.46027 406.21271 338.32743 1719.86240
6.75000 -5868.21135 10.52633 -17.18738 396.96623 325.20097 1697.74011
6.85000 -5830.24536 13.09894 -33.93800 388.18897 309.09287 1642.36003
6.95000 -5796.28142 3.12499 -6.69557 376.18631 297.53178 1607.80890
7.05000 -5748.77185 6.24188 -10.06223 361.40418 284.23353 1576.33012
7.15000 -5705.59044 0.95985 -27.36699 343.89244 276.09290 1531.00981
7.25000 -5661.73066 3.06667 -2.36459 323.86686 264.93303 1501.25498
7.35000 -5617.62909 -0.27814 -4.38552 316.84284 258.50060 1463.63682
7.45000 -5569.02768 0.62346 -24.91122 313.74901 247.34510 1451.29327
7.55000 -5543.59029 4.33321 -32.91903 305.94705 241.76144 1403.46302
7.65000 -5492.92426 -0.46798 -40.40417 298.20323 235.55357 1388.91762
7.75000 -5454.39432 -0.80166 -24.39148 285.43872 222.27099 1346.67332
7.85000 -5421.71016 -1.58783 -9.65198 275.18396 219.93330 1315.42442
7.95000 -5373.91487 0.97485 3.61174 270.41044 212.37525 1279.29203
8.05000 -5327.87263 -1.75886 -5.06275 265.11392 205.72263 1274.10604
8.15000 -5288.96225 0.30259 -35.90956 256.01141 202.70930 1240.05673
8.25000 -5251.62479 4.57948 -6.86388 243.58588 196.80617 1217.57169
8.35000 -5208.03415 2.70774 -12.30963 241.82727 189.90077 1174.83782
8.45000 -5160.49260 4.09549 3.17856 239.87702 182.36683 1164.65566
8.55000 -5121.66105 0.77541 -14.34203 235.43374 179.43899 1125.30526
8.65000 -5083.07405 3.66879 -50.20560 224.74321 172.50134 1105.34830
8.75000 -5046.05321 6.46259 -32.56541 216.96640 168.38288 1079.56475
8.85000 -5000.54686 4.09713 21.72068 212.82250 158.67044 1071.12349
8.95000 -4965.85753 3.31252 -14.24441 204.73544 164.11285 1037.65042
9.05000 -4925.59580 7.84181 -2.45441 201.43001 157.95665 1016.85145
9.15000 -4883.93536 8.46896 -34.99628 200.08654 155.62269 997.69286
9.25000 -4854.81708 5.32586 19.39136 194.61256 149.14686 964.33620
9.35000 -4811.63126 10.31316 -22.82082 192.50072 145.37485 951.60406
9.45000 -4779.11144 9.14716 -0.39787 186.12018 144.42539 923.82561
9.55000 -4734.06740 1.21105 0.87983 185.46873 141.14847 910.43001
9.65000 -4698.61911 6.19808 -30.21608 180.13538 140.33806 896.03973
9.75000 -4663.51399 6.16475 6.71133 176.60925 132.71022 871.70321
9.85000 -4631.29204 4.51688 -9.12535 174.24392 130.25258 867.30968
9.95000 -4597.73494 6.51915 -20.28672 171.86838 132.11213 842.89693
10.05000 -4555.10157 7.70741 -24.78982 173.62962 125.63195 833.73139
10.15000 -4525.71123 5.87483 -4.59180 161.22280 124.58852 804.47085
10.25000 -4493.49820 8.41882 10.95542 159.81120 120.96250 789.46439
10.35000 -4455.85650 7.62381 -14.78018 164.37004 120.51172 789.06785
10.45000 -4430.23306 6.29189 -4.56362 157.34445 120.56376 748.03540
10.55000 -4389.81662 7.19136 -9.42373 153.07312 115.22536 750.60109
10.65000 -4360.60648 6.90153 1.44300 156.29734 112.84531 737.52133
10.75000 -4327.19415 0.28025 9.60364 157.13176 110.93635 726.18710
10.85000 -4291.66284 4.37926 21.80131 147.61204 106.72685 712.53620
10.95000 -4263.40620 0.66530 -12.72840 145.44804 106.11232 675.02759
11.05000 -4224.67249 6.70669 -10.91463 156.55371 106.74724 681.00339
11.15000 -4188.94929 7.28594 7.42270 158.43252 105.87077 665.91637
11.25000 -4154.67410 2.75990 2.13306 135.46760 100.41944 644.30390
11.35000 -4127.09399 5.01737 -21.02606 142.22410 100.39743 633.28813
11.45000 -4096.91773 2.32162 3.21558 136.85703 97.22820 620.33857
11.55000 -4061.13349 5.53386 15.49557 138.91425 101.16573 608.72749
11.65000 -4032.78553 6.74059 -6.93057 140.22054 100.87179 586.76701
11.75000 -3993.73040 4.46101 -3.77707 132.86535 91.62028 585.25476
11.85000 -3965.89917 5.40940 19.82411 129.40625 97.42991 568.37131
11.95000 -3934.81845 3.14066 18.13047 124.58248 89.99225 565.76678
12.05000 -3905.61472 6.09136 2.09121 122.04408 86.70841 554.12156
12.15000 -3881.64808 3.97245 -6.56987 122.13606 87.89056 539.12501
12.25000 -3849.60847 8.14060 9.26307 124.72129 85.61390 531.69120
12.35000 -3817.93767 4.41473 25.12508 119.28532 79.37907 521.74884
12.45000 -3791.66762 8.06972 1.87676 119.39917 87.38513 509.25787
12.55000 -3764.40719 3.80764 -10.07728 111.19982 77.33278 512.43742
12.65000 -3739.87479 3.36477 8.21985 113.91739 76.20855 488.44808
12.75000 -3705.72625 2.98224 1.87382 114.20620 87.10654 495.29162
12.85000 -3679.46494 6.69949 6.54422 106.14240 79.88650 481.17356
12.95000 -3653.45848 4.91377 0.33274 107.63902 77.48943 464.28290
13.05000 -3620.79660 4.45391 -16.69302 105.59941 73.97327 463.53865
13.15000 -3593.09127 4.78267 -2.65145 103.35821 76.44403 459.09766
13.25000 -3572.74291 4.35015 11.10478 103.92842 82.95305 442.56852
13.35000 -3548.98697 3.55030 -13.99623 98.23678 76.09083 434.96600
13.45000 -3519.22301 6.49988 4.05290 94.87191 72.57722 424.73053
13.55000 -3496.75582 4.91169 -19.34409 97.16448 75.03515 427.38484
13.65000 -3475.52677 4.70705 -10.47368 97.63583 71.93128 415.15844
13.75000 -3451.71424 5.64304 -25.63352 88.81613 66.91148 408.56263
13.85000 -3431.42598 3.39641 -18.26668 88.28116 68.70420 398.32899
13.95000 -3398.23133 4.06158 -14.01532 84.46847 70.15343 405.48924
14.05000 -3375.90613 3.52656 -20.62287 81.65545 61.72128 394.19123
14.15000 -3357.60268 4.08527 -14.93684 85.22929 64.24117 374.07698
14.25000 -3333.50872 4.17435 -30.20079 80.24262 64.58076 373.07186
14.35000 -3315.40960 5.19439 -23.59719 82.66395 64.53974 367.80106
14.45000 -3288.94441 5.61581 -6.34275 78.79944 61.89468 362.66460
14.55000 -3263.90107 4.23835 -26.99337 82.61391 66.73069 364.03845
14.65000 -3245.67736 5.58208 -6.20645 77.68355 63.16150 346.45500
14.75000 -3223.89636 4.87855 -28.13919 78.71541 59.69753 334.08512
14.85000 -3199.15304 1.61049 -12.25792 73.46095 64.65935 338.29025
14.95000 -3176.78609 3.70667 -15.92564 70.60979 51.13901 328.83801
15.05000 -3160.10655 1.08356 -27.65096 70.73882 67.83940 323.46667
15.15000 -3139.00368 4.61107 -26.78737 67.25334 55.11902 313.14773
15.25000 -3118.24078 3.33526 -20.08088 72.16710 64.48639 312.07528
15.35000 -3100.64319 0.24640 -12.76983 70.87974 62.00008 310.89812
15.45000 -3075.86772 1.60395 -14.93929 66.53882 62.87079 294.23015
15.55000 -3060.41176 3.08352 -20.75015 65.57953 62.14723 299.97916
15.65000 -3036.21099 2.39188 -23.36347 69.21039 52.58689 294.19021
15.75000 -3018.54582 5.33889 -18.59287 69.44243 53.19226 285.80288
15.85000 -3001.30227 2.42889 -8.22597 73.78102 64.58877 287.24995
15.95000 -2984.20363 2.25760 -24.83019 69.80267 58.49505 275.55136
16.05000 -2963.89870 2.58118 -13.83377 66.21722 56.98471 276.05901
16.15000 -2946.55524 1.87318 -24.01126 64.37018 50.09927 260.63255
16.25000 -2925.93916 2.71402 -16.28985 72.51724 54.70977 270.24414
16.35000 -2908.49014 4.12794 -8.75997 69.48260 60.17356 259.22109
16.45000 -2892.02422 4.40276 -8.77311 67.24366 52.07134 253.66883
16.55000 -2870.95015 3.19071 -24.23332 60.79423 56.47796 258.64011
16.65000 -2848.13681 2.03509 -11.70934 58.62841 51.63399 246.67987
16.75000 -2834.42285 1.55543 -25.48167 63.63960 56.94438 238.10690
16.85000 -2820.11259 4.67181 2.72581 56.01795 56.34559 230.24457
16.95000 -2798.55848 1.73009 -8.42024 63.54288 55.68489 240.54371
17.05000 -2784.34010 1.25113 -18.05174 69.74966 55.64605 231.21002
17.15000 -2764.30695 2.19862 -16.93404 49.35845 40.78140 224.47373
17.25000 -2747.46978 1.85213 -24.96270 55.45426 54.45393 225.90816
17.35000 -2731.22388 2.77565 -1.98694 63.10997 53.90213 222.48545
17.45000 -2714.24344 3.96620 -4.52440 46.86201 51.88618 218.52412
17.55000 -2696.25864 0.14625 -8.46802 55.64852 46.58536 216.02155
17.65000 -2675.55514 1.19788 -16.78699 59.94862 43.42089 209.68877
17.75000 -2661.96039 5.36377 -10.06411 61.85447 47.72816 203.85996
17.85000 -2640.57073 0.73926 -7.56631 67.25358 52.39321 198.78574
17.95000 -2629.69553 3.27946 -1.65124 45.28126 44.41378 193.37376
18.05000 -2611.47808 0.65364 0.07359 60.11260 43.09079 195.02722
18.15000 -2595.54976 3.95516 5.75762 58.89908 57.00102 193.52880
18.25000 -2585.49995 2.54954 -4.37729 52.44520 39.32255 189.95129
18.35000 -2565.58455 1.66722 -2.87604 54.95416 43.61885 175.29112
18.45000 -2549.53551 -0.40612 -10.37119 55.55621 46.25568 188.85126
18.55000 -2538.31540 -0.04070 -18.54760 46.09206 43.58019 177.99986
18.65000 -2517.96955 1.15278 14.78049 52.04412 48.23101 173.96659
18.75000 -2501.73145 0.99887 -3.98018 60.50809 52.32232 179.88264
18.85000 -2497.52603 6.03492 5.90935 52.50403 53.61864 168.73874
18.95000 -2477.12375 1.96287 -14.48232 60.67521 39.48751 171.63995
19.05000 -2465.20259 -0.09691 -0.92547 54.80221 44.12578 172.44363
19.15000 -2448.03751 -1.65283 14.03315 44.90746 37.91708 166.95284
19.25000 -2433.96643 1.48366 -1.15375 45.60558 47.19169 165.05137
19.35000 -2415.54585 1.33069 -8.99124 55.11765 44.09689 168.10816
19.45000 -2406.54962 0.52066 -4.86687 49.14688 45.08024 150.48678
19.55000 -2396.01528 0.92467 1.06703 50.31507 41.05372 161.02466
19.65000 -2378.67544 2.71942 4.90207 43.22028 39.49306 149.38422
19.75000 -2367.39777 3.43496 -5.58185 59.16152 41.90392 152.64564
19.85000 -2345.78727 3.80755 5.67758 42.53993 45.87469 158.85982
19.95000 -2338.16330 5.25337 -8.73474 44.37119 51.27161 145.39614
