0.1875 0.62334 24.11913 -1.32395 112.32943 109.49351 96.96613
0.5625 1.24009 49.99334 -3.53969 104.84473 94.02448 86.23407
0.9375 1.89601 69.27692 -2.50012 95.14166 82.00942 76.41607
1.3125 1.90961 82.79181 -0.51636 87.01426 74.96307 69.78731
1.6875 0.95815 96.80488 -1.60247 78.29848 71.08384 65.54062
2.0625 0.81923 110.36001 -0.30071 72.00187 67.50756 61.85201
2.4375 -0.6726 127.9462 -0.48097 65.1854 62.36311 56.50646
2.8125 -0.41149 141.12115 -0.80155 59.82527 55.91982 51.32727
3.1875 0.53734 149.46674 -0.41958 55.40035 49.59085 46.54558
3.5625 -0.37792 157.0359 -0.04335 51.41166 44.76578 43.19585
3.9375 -1.13173 163.62517 0.26244 48.58443 41.05746 40.74285
4.3125 -1.47121 169.9719 0.44176 45.79091 38.66976 38.40193
4.6875 -1.01992 174.59679 1.68659 43.6187 36.38207 36.3337
5.0625 -0.28501 178.28068 0.42462 42.22256 33.84782 34.92437
5.4375 -0.67993 181.43869 1.17017 39.48231 32.66086 32.80119
5.8125 -0.41665 184.5087 -0.34557 38.45112 31.52177 31.3948
6.1875 -0.3878 186.80199 -0.47361 36.42923 29.70508 29.34358
6.5625 -0.3048 189.0269 -0.15489 35.65103 28.74662 28.40945
6.9375 0.72871 190.61266 -0.38575 34.35129 27.52219 27.28502
7.3125 0.64114 192.63043 -0.20914 32.68465 27.02643 26.37503
7.6875 1.10879 195.5679 -0.28434 31.78462 26.95546 25.45258
8.0625 1.89209 197.69068 -0.33842 30.83217 25.31054 24.98254
8.4375 1.72361 199.52851 0.85143 30.41134 24.05477 23.64207
8.8125 1.87167 200.21248 1.47061 29.10082 22.48333 22.99859
9.1875 3.09567 200.08998 1.31376 28.47491 21.45038 22.27559
9.5625 3.06271 200.44725 2.24977 27.38376 20.34889 21.1369
9.9375 2.92462 201.53574 2.41529 26.74032 20.43793 20.19036
10.3125 2.87125 201.76437 2.80634 26.10893 20.03687 19.4107
10.6875 2.81617 202.82015 2.70858 24.47471 20.00391 18.31172
11.0625 1.33649 204.14516 3.0414 23.33554 18.79346 17.86899
11.4375 1.12922 205.1182 2.22064 22.96176 17.57287 17.65666
11.8125 0.93093 205.25929 2.32973 21.90042 16.69093 17.34452
12.1875 0.31437 205.53189 3.28269 21.32174 17.08422 16.67461
12.5625 -0.10773 207.0024 2.48596 20.16487 15.46635 16.05655
12.9375 -0.14852 206.91503 1.38157 19.37651 15.72509 15.6651
13.3125 -1.34717 207.02761 1.66075 19.35229 14.61899 15.32778
13.6875 -0.62286 206.94289 0.29089 18.47417 14.0192 14.80371
14.0625 -0.92587 206.97965 -0.51078 17.87336 12.91989 14.64226
14.4375 -2.80405 207.06488 -2.31628 18.20048 12.57855 12.86783
14.8125 -1.46876 207.50356 -2.28148 17.65523 11.83914 13.58613
15.1875 -1.18502 207.79637 -1.07769 15.80424 11.82078 12.11407
15.5625 -1.12312 207.14932 -0.99681 16.19847 12.08656 11.38155
15.9375 0.1385 207.38238 0.58753 16.056 12.00908 11.89352
16.3125 -0.98341 207.2105 1.28341 15.62867 10.97107 11.28365
16.6875 0.26378 207.29644 2.18921 14.77715 10.08105 10.70878
17.0625 1.56561 206.9232 3.12846 13.68422 10.49778 9.95084
17.4375 0.1459 206.08816 3.59228 14.18317 10.78065 9.90529
17.8125 1.62097 206.56264 2.76112 14.33643 10.19913 10.55408
18.1875 -0.72959 206.92918 3.10546 13.38156 10.56179 10.422
18.5625 -0.39579 206.39642 2.06413 11.24186 8.772 9.82754
18.9375 0.23225 206.28399 2.74567 12.56196 9.35046 9.56847
19.3125 0.43383 206.04095 2.61801 12.51577 9.24048 9.01702
19.6875 -0.65297 206.69634 1.65178 10.96425 8.75257 9.092
20.0625 -1.063 205.74434 2.42104 10.65615 8.86105 8.64277
20.4375 1.79349 206.57325 2.19971 10.87567 7.41952 8.74923
20.8125 3.70255 206.07518 3.29415 10.9391 8.09374 8.88964
21.1875 2.63853 205.32567 2.47666 10.37955 7.17586 9.09912
21.5625 2.93143 204.67369 2.83457 11.72168 7.93198 9.57938
21.9375 2.47971 204.13998 3.19077 12.01981 7.55663 9.49424
22.3125 -0.30645 205.62003 1.69416 9.89084 7.92301 8.11039
22.6875 1.97481 205.97156 2.82203 11.50355 7.11512 8.61497
23.0625 1.59888 204.97519 0.74541 8.50953 5.4719 8.848
23.4375 0.72877 206.52954 -0.28082 9.752 5.84274 6.25311
23.8125 -1.14473 205.79217 1.16898 9.50058 6.08931 6.90072
24.1875 2.89831 204.50543 2.2833 10.07449 7.01753 7.64158
24.5625 1.92983 202.72013 2.05545 9.00295 6.74281 7.91472
24.9375 0.35577 204.4576 3.30139 9.10463 5.89531 7.27638
25.3125 3.01805 204.66883 3.15128 6.12391 5.9946 8.39015
25.6875 2.44448 203.86479 3.1992 8.11654 7.22118 7.34281
26.0625 3.06536 205.27581 3.51637 8.48023 4.97882 6.5127
26.4375 5.54462 205.18443 4.24455 9.32177 4.64174 7.00036
26.8125 1.07493 205.47006 4.1546 7.29874 5.17487 7.47629
27.1875 1.2832 203.75956 3.82337 7.99772 4.49156 6.27291
27.5625 1.44418 203.72506 4.93225 6.63436 6.36226 6.94486
27.9375 -6.6194 202.92297 2.84233 6.43835 5.85495 6.73465
28.3125 -2.26421 202.313 4.1271 7.80959 5.8185 7.75989
28.6875 -3.35806 203.1732 3.6677 5.66893 4.41731 7.67138
29.0625 -1.7755 202.55249 3.51018 4.72232 3.29301 5.43228
29.4375 0.54313 200.49016 4.57658 7.20476 5.08578 8.14017
29.8125 1.53978 203.01039 1.21816 4.56964 3.11502 2.85967
