0.05000 3899.83265 499.03425 -2005.91845 0.00000 0.00000 0.00000
0.15000 -1047.37303 696.87289 -1272.32290 2580.56669 2976.26513 347.77428
0.25000 909.79610 -906.56051 -1676.57914 2847.88853 2464.27327 634.86017
0.35000 227.54910 69.51489 -1534.13952 2517.15932 3025.80695 1108.58713
0.45000 -240.68985 474.33022 -1363.50508 2667.20199 2816.77189 950.80451
0.55000 -534.34825 14.58827 -1421.41081 2576.47825 2706.61939 1297.96492
0.65000 -257.18060 -180.23861 -1090.18118 2615.44395 2801.12165 1429.68661
0.75000 -331.23401 -36.32098 -1177.76363 2408.07854 2740.46090 1533.68224
0.85000 -591.84800 -144.10332 -1098.85880 2324.22823 2692.05668 1678.85695
0.95000 -978.66229 -14.86267 -1105.01451 2227.99302 2568.78377 1690.04131
1.05000 -927.57707 -58.94843 -957.65002 2091.91122 2582.84912 1955.98612
1.15000 -1153.14689 -6.25773 -808.41735 1980.67840 2512.20441 2103.11736
1.25000 -1311.43584 -5.08956 -813.67489 1861.47736 2432.56010 2215.96861
1.35000 -1621.44610 -13.20505 -716.15401 1588.00206 2416.23358 2298.91165
1.45000 -1954.86634 7.99922 -512.78971 1602.96536 2279.25570 2339.09882
1.55000 -2168.03155 -110.49999 -402.52092 1454.20668 2166.68871 2421.78296
1.65000 -2284.49664 -46.79583 -506.59181 1418.61241 2038.10313 2456.53256
1.75000 -2461.84731 -2.55481 -327.34691 1378.12694 1983.86493 2450.81174
1.85000 -2535.42157 48.37068 -222.78912 1381.56360 1880.17010 2500.40758
1.95000 -2677.35751 -56.62161 -332.98686 1265.95226 1823.57109 2461.56950
2.05000 -2718.60256 9.40497 -183.24090 1280.37019 1713.49257 2507.63771
2.15000 -2869.94123 -53.22093 -53.58400 1240.06460 1653.19875 2457.44585
2.25000 -2846.74386 27.76925 -130.73066 1240.83438 1543.31873 2480.25134
2.35000 -2892.56936 59.96209 -235.05224 1257.85704 1459.78609 2418.22467
2.45000 -2882.46888 -11.32742 -91.39316 1239.65841 1441.10253 2503.97366
2.55000 -2901.71321 -54.83541 -247.01924 1217.74070 1341.65642 2534.82406
2.65000 -2961.51130 -3.04232 -142.57688 1153.48272 1336.99709 2469.09797
2.75000 -2985.61366 18.64721 -262.86324 1186.50948 1263.54788 2438.79033
2.85000 -2998.07666 2.51201 -69.32481 1136.77887 1218.91832 2416.05162
2.95000 -2994.03550 4.58748 -180.74368 1176.10664 1173.47112 2444.78468
3.05000 -3033.85797 -50.60764 -94.72976 1118.56016 1130.76319 2436.44821
3.15000 -3068.87790 -27.39204 -110.15849 1048.60931 1095.94582 2383.48186
3.25000 -3028.08093 27.83548 -10.83569 1080.89064 1066.87621 2444.63925
3.35000 -3034.47698 -28.61560 -50.55875 1093.86276 1028.89297 2405.33967
3.45000 -3067.80182 21.65821 -107.73937 1055.55549 986.78463 2349.14202
3.55000 -3097.57575 21.41618 -127.45937 1008.09165 959.11448 2334.23378
3.65000 -3018.25054 6.86383 -109.41544 1076.76739 920.16407 2381.06684
3.75000 -3029.55820 -38.97861 -72.60709 1073.20216 882.43447 2375.43372
3.85000 -3088.44070 33.41781 -37.43482 1008.05573 859.51813 2267.32098
3.95000 -3023.05029 24.36761 3.08387 1046.06562 835.23598 2322.17309
4.05000 -2995.92753 -40.48017 -76.49872 1040.97711 799.48619 2328.20556
4.15000 -3019.37902 -19.19727 -111.75063 1032.14752 826.18200 2306.71087
4.25000 -3017.28246 -6.11137 60.07710 977.88397 763.71551 2281.51189
4.35000 -2990.17302 -10.46509 -51.57094 1016.21860 748.59313 2284.57112
4.45000 -2984.77140 5.98611 -72.32951 990.29777 727.47678 2278.85245
4.55000 -3018.63486 6.37036 -23.82237 926.66383 728.79559 2207.86943
4.65000 -2946.45192 8.15587 -93.85056 965.45608 673.84102 2264.52023
4.75000 -2931.13311 -1.35698 11.80304 986.77211 671.03342 2257.86954
4.85000 -2925.23444 7.16651 15.37433 968.84356 663.93075 2235.00824
4.95000 -2932.92568 13.61363 -131.17217 948.07850 642.27003 2209.24948
5.05000 -2937.55580 -2.73167 44.72154 933.75989 625.05032 2199.13665
5.15000 -2902.49807 3.51513 -51.95298 937.10998 624.09030 2205.25117
5.25000 -2874.14975 3.40756 -89.75880 922.14052 597.81672 2186.56954
5.35000 -2922.65260 -5.90962 6.36720 901.40867 580.82407 2135.04852
5.45000 -2886.45478 -5.01146 -90.08555 882.61546 579.66046 2161.46788
5.55000 -2860.57248 8.87862 -71.28619 903.57479 589.99377 2151.95349
5.65000 -2828.97397 -24.74662 -66.04133 919.34647 544.43921 2160.40581
5.75000 -2810.82517 -10.75743 -28.42440 897.63391 526.57204 2154.26671
5.85000 -2815.71012 11.79427 23.70305 896.09760 514.61563 2139.95501
5.95000 -2798.07340 4.23765 -65.41641 890.74250 498.20774 2137.30574
6.05000 -2799.79308 3.96907 -7.12833 874.31197 494.68248 2128.80135
6.15000 -2773.08420 4.03133 -25.19690 882.85536 514.01402 2128.91778
6.25000 -2779.13533 -1.95904 -31.09736 872.88318 465.15977 2080.97813
6.35000 -2756.51833 -2.46416 -33.16348 854.36532 462.38776 2087.80189
6.45000 -2742.83580 5.14800 -15.67378 828.58740 465.86133 2078.53404
6.55000 -2753.80332 -10.35609 -65.54192 826.96586 453.46106 2062.02509
6.65000 -2726.06870 18.42121 22.21469 838.56231 451.08214 2064.99249
6.75000 -2723.24679 8.26742 48.62082 843.34254 442.73578 2043.17143
6.85000 -2710.49987 5.98644 34.49584 833.05427 414.91179 2038.11867
6.95000 -2673.18648 -6.23672 3.11897 825.63782 413.73532 2051.54046
7.05000 -2697.69909 -0.02003 -29.01015 817.70505 423.45058 2009.39748
7.15000 -2692.81449 4.36570 -15.88505 792.21174 405.69472 1988.12436
7.25000 -2658.70887 0.41690 -39.75597 786.88796 381.92134 1987.90415
7.35000 -2609.98144 -6.80016 -15.88598 821.88955 380.07029 1999.87059
7.45000 -2629.28890 -1.75988 11.36023 791.42160 374.54024 1962.07966
7.55000 -2627.26284 -3.95088 -14.70294 789.80412 364.08356 1941.10765
7.65000 -2575.37365 4.97851 -3.46849 787.62327 359.53955 1975.33096
7.75000 -2601.41964 -8.78965 -65.85461 783.87960 354.19603 1915.44285
7.85000 -2571.23812 12.64459 -23.48303 789.84342 345.79781 1925.91707
7.95000 -2565.93039 -1.87422 -46.18431 753.78970 344.11821 1901.00599
8.05000 -2554.48945 2.13922 83.59640 741.60153 329.35083 1894.14286
8.15000 -2538.47124 -8.81702 36.22240 755.43687 323.71671 1893.96569
8.25000 -2498.72639 3.64840 -14.34615 757.48035 320.33212 1897.87447
8.35000 -2504.59141 7.24383 -6.76366 739.91793 318.96627 1880.10776
8.45000 -2503.98581 -7.55998 -50.99299 749.76081 312.52831 1836.92022
8.55000 -2471.45001 -1.88977 -17.11881 745.71566 305.61140 1848.51406
8.65000 -2473.39670 -5.40306 -1.84736 730.81168 303.11962 1827.49364
8.75000 -2469.35518 -3.06811 3.15029 725.14919 295.11815 1815.03916
8.85000 -2430.25202 -3.66881 -25.48380 731.35268 292.05558 1830.43520
8.95000 -2437.36992 -3.30851 -39.81647 730.09020 300.64401 1802.45883
9.05000 -2441.99027 -2.55759 22.14464 719.73169 286.47168 1760.19844
9.15000 -2386.76970 3.07229 27.96333 727.12873 296.15922 1788.92567
9.25000 -2385.97411 -4.23411 -5.99743 715.08565 271.66386 1770.53223
9.35000 -2372.00729 0.89436 1.40564 704.79792 264.95842 1780.34004
9.45000 -2342.81746 -0.91964 26.94543 692.92679 264.54010 1784.79669
9.55000 -2325.25746 1.06963 -7.95755 712.58517 262.68703 1777.43579
9.65000 -2341.93904 1.66673 1.51641 689.57632 251.09964 1740.73206
9.75000 -2330.60493 -3.95212 26.57508 691.69688 251.99805 1730.52139
9.85000 -2337.40535 9.55551 25.65975 661.83343 247.11099 1697.93247
9.95000 -2314.30443 7.55819 15.30359 669.82575 248.16570 1693.29159
10.05000 -2297.73064 2.98163 -3.60180 667.67798 239.13526 1699.76812
10.15000 -2259.51587 -4.08545 -8.77221 691.09486 233.97756 1709.97904
10.25000 -2276.19137 0.41394 -50.85744 660.56007 243.29788 1665.95825
10.35000 -2237.93202 4.85441 25.89831 675.99332 226.85782 1686.26658
10.45000 -2275.88092 1.10976 48.62041 637.98815 226.79860 1628.50807
10.55000 -2234.12866 0.58003 45.86841 670.76532 224.92805 1644.12537
10.65000 -2240.51711 -1.91513 -12.48012 643.36502 223.13129 1610.71629
10.75000 -2196.86468 -7.98336 -29.55756 664.96790 225.35229 1648.27800
10.85000 -2175.44035 -1.98480 0.11518 663.68357 220.25564 1646.96490
10.95000 -2180.42789 -7.17511 16.36040 635.78891 216.39706 1632.13359
11.05000 -2178.65443 -4.31573 50.94943 638.40255 217.53633 1603.28194
11.15000 -2163.09658 3.77813 29.86203 639.49024 213.03301 1596.65850
11.25000 -2156.17955 -1.57733 37.13686 626.65371 201.11895 1592.66700
11.35000 -2148.58239 1.93732 8.23967 640.99314 216.61964 1575.35688
11.45000 -2138.71820 3.96860 48.40645 618.69818 205.78618 1568.89610
11.55000 -2114.08784 1.24859 9.06262 633.34544 193.46653 1571.96939
11.65000 -2099.99529 6.52431 52.29340 625.04221 193.62406 1567.34306
11.75000 -2111.20447 3.46230 3.29138 600.97457 183.49539 1543.02074
11.85000 -2088.07053 0.01116 4.45237 602.80536 188.33338 1540.44369
11.95000 -2074.97872 -3.81073 24.01762 616.04052 178.79527 1537.37185
12.05000 -2089.93604 -0.85315 0.45661 582.48118 183.12275 1503.80233
12.15000 -2057.04781 -3.16359 0.30949 595.70028 180.64514 1515.30858
12.25000 -2061.69087 0.72292 -5.46683 588.22569 182.43012 1489.75782
12.35000 -2026.37260 0.04173 53.06338 602.17888 181.83565 1517.42412
12.45000 -2026.49153 0.72485 -6.78720 591.53685 182.33723 1498.68158
12.55000 -2033.19696 2.29144 40.23637 584.37358 168.37358 1463.22192
12.65000 -2011.31643 3.38646 0.75728 581.86917 166.96554 1475.52925
12.75000 -2020.29497 -2.16577 21.76309 571.23432 174.80957 1441.66538
12.85000 -1996.10719 1.33011 43.98635 575.33977 178.34242 1457.55663
12.95000 -1965.56693 2.98452 16.50097 594.78571 162.54607 1466.38900
13.05000 -1960.18730 -0.67739 -14.73413 589.20483 156.18701 1450.04186
13.15000 -1954.43919 -0.99674 51.35300 585.95775 163.58781 1443.99501
13.25000 -1929.35108 -3.66004 16.78034 576.19989 154.80251 1461.66259
13.35000 -1941.02516 -1.39949 -0.82755 556.57900 161.19666 1425.05596
13.45000 -1924.53278 1.61644 26.54802 557.09486 153.08602 1423.15037
13.55000 -1922.11858 -3.26115 -0.32396 560.50184 176.02246 1412.54548
13.65000 -1909.53406 -4.41557 26.23259 559.67394 152.70948 1406.28842
13.75000 -1883.11551 2.51798 13.34013 570.40058 155.65367 1418.46396
13.85000 -1893.10771 -4.78021 0.06680 541.15071 148.49153 1395.18950
13.95000 -1877.82496 -0.86869 4.01519 553.82039 156.31669 1396.35636
14.05000 -1874.62374 -1.06267 15.17985 533.67919 148.72393 1379.18203
14.15000 -1860.50267 -2.42505 22.13482 532.54642 141.52538 1386.56429
14.25000 -1849.05893 4.84683 11.22169 535.48865 137.69388 1376.97401
14.35000 -1849.96272 0.28653 45.52008 536.17820 136.80020 1361.80121
14.45000 -1841.17665 -7.52374 8.81699 541.50139 150.61459 1347.42810
14.55000 -1837.94287 -1.38992 29.38317 524.46504 137.03381 1340.01762
14.65000 -1808.90656 1.27729 -29.54653 546.58486 142.02395 1347.78842
14.75000 -1801.51980 -0.82451 -21.89635 530.02520 138.78392 1349.08389
14.85000 -1797.59568 -4.57457 12.85840 527.99181 135.89512 1335.59106
14.95000 -1789.49225 -0.10891 16.92851 534.40522 127.81809 1329.53184
15.05000 -1809.47318 -0.93358 -5.05827 512.06926 152.20528 1289.37790
15.15000 -1787.28516 6.10544 23.55490 517.77369 127.29561 1305.32430
15.25000 -1775.11333 1.44608 5.82340 502.07462 134.79475 1304.87657
15.35000 -1769.91275 2.50217 -9.77315 507.38618 121.78623 1292.92713
15.45000 -1756.28345 0.20250 11.63030 507.50861 124.98912 1294.13431
15.55000 -1742.30529 0.99700 46.62099 517.74355 129.71432 1287.99569
15.65000 -1726.52989 1.76995 28.00410 519.31260 122.09079 1296.34086
15.75000 -1733.77106 0.27049 55.83533 510.66998 131.65948 1269.60160
15.85000 -1716.30246 3.05294 23.11749 502.30554 132.49400 1277.00509
15.95000 -1720.45089 2.63927 3.94397 496.40801 123.89028 1265.68049
16.05000 -1709.84454 -0.21422 17.13977 496.54565 120.72803 1253.55266
16.15000 -1699.80498 1.87408 11.71726 495.34708 116.71072 1249.33416
16.25000 -1701.33301 -3.33513 -15.28836 487.07945 123.92127 1235.50725
16.35000 -1683.39993 -0.99350 10.10882 485.45436 111.05800 1246.63029
16.45000 -1670.23593 1.31985 96.28787 487.84134 114.70070 1239.20928
16.55000 -1649.79561 0.96935 -12.62451 493.84762 115.27155 1250.31272
16.65000 -1648.69120 0.15411 -2.31088 488.24808 111.03918 1236.05222
16.75000 -1655.30067 4.16672 11.74620 477.59312 106.73287 1215.67308
16.85000 -1639.21714 1.01757 46.54190 485.83224 134.01434 1219.67496
16.95000 -1636.97961 -2.60862 32.12911 471.98321 107.13285 1208.49858
17.05000 -1617.94694 2.82668 13.84739 480.63740 114.40205 1213.48802
17.15000 -1629.72561 1.83638 16.06966 466.23574 120.01663 1187.39060
17.25000 -1621.74032 2.44720 20.48923 456.22902 109.45431 1183.67400
17.35000 -1603.97883 3.52033 -18.21587 473.74772 107.46114 1186.54480
17.45000 -1610.64869 -0.11433 23.77592 453.49634 106.72339 1170.05455
17.55000 -1598.63625 -1.44744 7.89974 454.39160 102.60093 1172.18296
17.65000 -1576.82879 1.07817 -20.95012 460.56397 100.32558 1183.62180
17.75000 -1576.95332 0.06627 -7.97788 464.65051 102.78268 1165.99060
17.85000 -1564.23984 2.71088 5.29393 460.25848 94.56726 1167.24807
17.95000 -1545.32021 1.79685 26.04154 475.12243 106.59443 1172.32623
18.05000 -1558.84207 1.70850 25.92570 445.68504 96.24519 1153.70517
18.15000 -1548.04897 -0.11665 -11.67425 460.97529 93.52482 1148.24875
18.25000 -1532.97168 -0.92415 53.12790 457.61982 95.10100 1153.23401
18.35000 -1543.07196 1.81394 16.85721 446.92970 93.09488 1128.17766
18.45000 -1533.35972 -4.48741 -2.62401 439.37238 89.29727 1129.98158
18.55000 -1536.98725 -0.41512 -20.14851 436.82895 105.34495 1110.68714
18.65000 -1523.20418 -3.22930 20.13645 437.05481 92.63099 1119.89834
18.75000 -1505.13733 0.50671 2.08724 445.76812 87.42092 1120.26474
18.85000 -1506.15760 0.06546 20.89670 427.32787 101.50598 1108.98261
18.95000 -1502.06050 0.21754 50.95280 428.98525 92.84609 1103.95682
19.05000 -1488.40782 0.41657 33.72393 438.58587 90.55550 1108.29612
19.15000 -1483.44261 0.50297 64.89672 430.70837 83.84137 1100.65336
19.25000 -1477.15523 0.70584 27.01565 431.01122 92.98724 1098.44625
19.35000 -1480.71488 2.96310 7.03529 424.23264 105.52193 1078.32432
19.45000 -1476.34191 -1.53510 38.51230 416.79920 88.07435 1076.70215
19.55000 -1452.06688 0.42542 35.53812 433.21030 89.33200 1085.76073
19.65000 -1462.96598 -1.16626 6.56785 420.22047 85.36422 1063.26268
19.75000 -1455.01427 0.53186 8.12282 420.59927 90.05381 1061.84893
19.85000 -1433.33240 -1.98215 -10.24067 423.95054 86.17878 1070.08583
19.95000 -1445.27317 -0.91601 46.38513 406.85473 80.36299 1053.42448
