0.05000 -2528.30422 22.18525 -12126.53568 2583.28771 2379.37203 2438.81474
0.15000 -4563.29421 182.98063 -10892.21361 3168.64926 2672.21297 4043.03659
0.25000 -6840.32483 -35.58080 -8245.90735 3626.04181 3169.63191 6275.75929
0.35000 -8253.65858 -197.97073 -5902.82058 3766.07287 3287.35526 7766.16475
0.45000 -9136.87840 127.95168 -3375.85712 3732.70443 3094.97680 9123.80100
0.55000 -9777.03125 10.69942 -1774.54599 3660.84176 3160.68431 9855.18609
0.65000 -9900.56803 28.51740 -873.06309 3562.36787 3100.12247 10119.06057
0.75000 -10018.67717 -12.25282 42.07544 3503.31377 3172.03326 10121.81201
0.85000 -10073.41139 55.97081 219.89278 3533.14957 3078.55865 10045.18063
0.95000 -9919.43731 -50.11866 813.06569 3411.73228 3083.51062 9890.99044
1.05000 -9826.80686 -3.57264 930.24318 3340.65578 3156.44136 9747.33897
1.15000 -9909.69707 16.35757 899.07351 3192.13490 3130.71617 9353.23293
1.25000 -9861.84263 -39.21506 1011.55743 3074.81551 3167.92931 9087.24199
1.35000 -9715.38988 -40.32385 1093.48415 2990.48648 3125.57655 8872.52588
1.45000 -9679.60545 -52.33280 1044.62496 2850.52432 3179.37247 8586.39529
1.55000 -9647.84708 -31.50795 963.06719 2704.50209 3110.12397 8137.25637
1.65000 -9508.30681 -38.20670 1085.31666 2673.32033 3097.41091 8027.42054
1.75000 -9372.56249 -58.51261 1097.70311 2541.00645 3069.99647 7761.96046
1.85000 -9317.66550 -67.98097 863.69905 2455.80272 3086.28400 7510.90511
1.95000 -9237.84662 -129.35658 917.28063 2333.16506 3026.11186 7277.62780
2.05000 -9131.60999 -73.38935 1038.49044 2229.33738 2983.49760 7055.75456
2.15000 -9047.01194 -67.17221 749.56982 2159.84723 2924.66456 6794.44188
2.25000 -8888.09057 -111.03299 756.38229 2048.98378 2850.56240 6624.95934
2.35000 -8772.49330 -91.19620 568.80269 1977.64659 2843.45014 6438.02767
2.45000 -8619.89026 -101.31390 602.11629 1861.82421 2805.79012 6275.97586
2.55000 -8520.65359 -149.32120 512.51632 1841.04543 2770.22420 6159.00692
2.65000 -8377.93285 -103.84970 347.49083 1764.49416 2732.71659 6000.42377
2.75000 -8290.01891 -140.93131 253.52006 1672.60055 2688.91124 5781.78972
2.85000 -8145.17973 -175.56703 220.36320 1646.76136 2617.26654 5719.66993
2.95000 -8100.14888 -171.90440 148.50202 1557.91225 2625.56211 5493.18800
3.05000 -8006.95797 -149.82471 127.48745 1480.34026 2544.27917 5366.98797
3.15000 -7871.64768 -187.73688 45.85214 1461.22452 2493.73469 5299.99022
3.25000 -7764.33975 -163.51077 -84.43409 1440.99670 2479.35861 5173.07805
3.35000 -7692.27641 -201.30557 -34.63582 1379.04746 2431.37160 5068.03756
3.45000 -7609.26516 -151.45701 -199.69543 1314.71002 2348.24690 4901.09400
3.55000 -7542.25509 -181.70303 -274.39336 1277.83021 2333.77466 4832.99905
3.65000 -7503.40985 -166.90294 -192.46550 1207.41103 2288.12550 4664.04540
3.75000 -7416.21739 -159.97089 -251.53073 1151.85553 2201.43598 4627.21601
3.85000 -7345.19304 -185.09118 -349.48154 1172.54022 2200.01479 4509.92384
3.95000 -7304.19578 -130.30978 -354.80280 1132.02710 2140.21004 4439.94461
4.05000 -7274.49903 -131.80069 -406.88277 1033.91198 2101.78666 4321.47603
4.15000 -7226.45331 -94.83968 -468.01401 1071.22604 2054.80449 4258.70150
4.25000 -7188.23851 -136.57401 -375.79854 1031.23358 2016.77237 4164.92126
4.35000 -7126.63408 -81.16536 -346.13547 1015.72113 1938.26012 4077.87874
4.45000 -7084.42518 -121.46201 -478.27259 921.59775 1901.19171 3938.10397
4.55000 -7035.20109 -37.55126 -458.19128 907.55215 1839.03786 3797.83388
4.65000 -6997.82398 -51.62675 -545.96959 921.52056 1809.91758 3737.24498
4.75000 -6929.18985 -28.13826 -486.82092 882.50642 1767.28102 3651.99008
4.85000 -6876.25180 4.07998 -488.23026 842.43235 1682.16237 3569.09123
4.95000 -6819.36334 27.29155 -557.00852 871.74632 1674.29156 3462.17119
5.05000 -6748.43685 16.58542 -508.59550 834.38521 1609.79697 3398.93883
5.15000 -6689.86202 21.14755 -535.18187 804.01023 1554.95550 3263.64220
5.25000 -6655.90139 28.88230 -504.02772 755.68696 1525.94501 3194.76443
5.35000 -6618.12977 24.81130 -524.20127 776.78739 1502.13930 3099.57096
5.45000 -6569.26905 7.82758 -428.86577 755.21413 1433.43730 3044.99938
5.55000 -6569.11244 11.99827 -403.67658 759.23972 1392.11669 2942.04685
5.65000 -6514.68925 20.07536 -315.10201 748.80503 1371.61719 2832.36174
5.75000 -6514.60264 21.78828 -294.61797 800.50343 1312.90306 2736.97342
5.85000 -6512.28899 -5.35820 -263.51772 770.39489 1275.23211 2637.43674
5.95000 -6483.30645 24.38314 -230.25114 837.59570 1221.98470 2670.47688
6.05000 -6496.52255 16.11365 -216.28299 821.06982 1204.05769 2566.30522
6.15000 -6474.34088 38.85826 -106.03624 819.25855 1135.99835 2440.51638
6.25000 -6458.26669 32.38537 -115.18185 861.34691 1102.47744 2408.48333
6.35000 -6447.07057 46.33532 -87.92097 854.81706 1049.22873 2300.44359
6.45000 -6416.16215 58.74711 -35.66644 868.75058 1018.08447 2270.60632
6.55000 -6397.35832 73.41318 -35.89345 890.05142 961.60318 2154.38737
6.65000 -6376.34722 48.64334 -61.56865 938.94564 938.91215 2123.91324
6.75000 -6347.32539 80.63478 30.62081 919.48898 879.58202 2022.00590
6.85000 -6310.68976 51.54625 -22.43139 952.13239 870.14117 1944.17191
6.95000 -6242.77612 56.31740 35.58989 920.37643 798.99857 1879.39894
7.05000 -6211.28183 49.99811 36.46866 935.25363 755.28444 1785.31525
7.15000 -6099.56323 42.34825 6.72760 935.59539 702.96711 1743.25107
7.25000 -6043.61099 57.77372 -2.34393 903.75167 682.10978 1673.11678
7.35000 -5939.51830 59.24622 17.47940 885.32645 640.69950 1592.86894
7.45000 -5872.84424 53.98456 8.28136 863.98555 614.70005 1551.91152
7.55000 -5775.79411 58.67549 -1.30761 843.04915 573.70157 1456.64248
7.65000 -5684.99036 39.89077 9.58010 835.81082 595.77540 1411.29005
7.75000 -5598.53736 45.53881 -7.78728 811.12667 577.18695 1356.57165
7.85000 -5511.96077 53.03641 15.38251 764.94429 486.99282 1304.98827
7.95000 -5426.17745 58.79742 -29.77299 749.83830 495.09729 1247.68190
8.05000 -5343.38503 44.56043 -50.63386 764.04207 449.23302 1220.67124
8.15000 -5259.53536 47.86929 -37.35245 657.14268 459.72285 1203.90702
8.25000 -5208.30542 53.45696 -23.89653 632.77009 430.13014 1154.70066
8.35000 -5148.83620 52.85594 -70.35313 575.21777 386.47710 1119.24314
8.45000 -5089.55820 42.48304 -70.56563 637.02813 397.19211 1055.86602
8.55000 -5063.17570 43.99534 -13.44403 594.51564 357.94573 1076.73231
8.65000 -5001.27021 27.83457 -44.97272 619.73901 402.35066 1078.61980
8.75000 -4970.50436 38.93642 -42.52931 492.15814 353.27473 1007.21484
8.85000 -4925.62047 38.10776 -64.73549 470.03214 320.98296 992.91388
8.95000 -4879.84228 33.30914 -61.79882 497.42827 328.72908 988.61030
9.05000 -4836.50915 28.68225 -47.68718 432.92673 408.67416 967.15897
9.15000 -4804.41923 29.60573 -51.39015 412.71163 279.25486 956.63354
9.25000 -4762.05665 16.05209 -59.77301 371.82143 266.33610 926.20305
9.35000 -4730.11682 18.37673 -69.35066 351.88179 269.59209 897.71143
9.45000 -4709.07923 10.91575 -62.46878 369.03820 370.17670 900.82240
9.55000 -4667.46993 13.26162 -58.41473 314.88173 249.24953 846.72415
9.65000 -4634.69960 9.25610 -47.52346 347.48902 280.41659 851.97048
9.75000 -4593.90664 2.05686 -67.10478 307.45947 282.88130 813.21388
9.85000 -4567.80621 0.41373 -32.76031 321.04087 255.63258 824.87043
9.95000 -4532.06112 3.97646 -82.51739 303.51394 319.13577 796.90011
10.05000 -4494.00854 2.74889 -49.57583 274.62272 236.82868 784.12478
10.15000 -4462.34534 -2.59334 -38.94078 256.52560 192.19113 759.20783
10.25000 -4433.93370 -1.95092 -72.09782 302.12735 244.83597 736.17913
10.35000 -4392.89698 1.74433 -43.58814 262.82385 412.93884 744.06414
10.45000 -4368.78221 2.20962 -54.36287 241.22681 220.89162 698.74826
10.55000 -4324.83195 -7.14407 -39.38350 384.43052 313.95858 708.62532
10.65000 -4290.90939 5.72154 -27.36790 242.20792 298.56997 690.46502
10.75000 -4265.05542 -1.40577 0.88335 325.73901 185.06617 711.41926
10.85000 -4238.65311 -10.03862 -26.21819 284.05835 239.01931 669.71924
10.95000 -4200.37502 -2.13857 -15.75322 231.32894 243.12364 645.10219
11.05000 -4170.18266 -0.53460 -11.79506 201.91680 173.04728 671.14677
11.15000 -4131.65062 2.60791 -7.15952 185.90869 152.82488 620.74777
11.25000 -4098.26069 0.18314 -22.71028 224.49615 179.32939 601.72849
11.35000 -4061.68361 -3.36610 -28.00641 195.88165 177.05118 594.28550
11.45000 -4034.36541 -4.87543 -16.92363 210.21004 185.76391 592.50664
11.55000 -4004.26868 -5.09406 -16.11479 195.38514 201.40730 596.39381
11.65000 -3974.83398 5.84761 -20.51657 285.63772 222.77189 553.39174
11.75000 -3943.19951 -3.84954 -8.23200 231.95432 326.71079 591.27300
11.85000 -3914.62595 2.63346 -15.78866 174.85732 148.86413 546.10949
11.95000 -3873.75498 1.10345 -2.36632 209.07198 204.38863 521.03504
12.05000 -3848.57255 -3.51589 -7.72029 212.65456 285.25426 530.22300
12.15000 -3816.58618 3.60877 -29.38054 172.16324 164.62567 506.86262
12.25000 -3792.39301 2.09344 -10.21542 176.38201 130.47658 484.00288
12.35000 -3757.82049 4.12521 -13.30826 172.40479 174.03838 496.46200
12.45000 -3724.95949 11.50833 -30.01765 197.03960 167.62879 487.78737
12.55000 -3702.28228 7.38565 12.10491 153.62412 105.96194 455.35099
12.65000 -3669.34968 7.16681 -9.33888 160.58522 126.45203 468.22488
12.75000 -3641.64016 3.33983 -29.41890 174.50716 139.80266 446.66862
12.85000 -3609.43635 9.00740 -28.66219 172.24595 114.60661 466.85041
12.95000 -3582.37644 5.83603 -24.59358 168.58982 150.70079 494.11036
13.05000 -3562.05199 9.29883 8.92985 208.75522 122.53004 419.21440
13.15000 -3544.06420 12.07354 -4.00777 474.77872 236.06357 428.22625
13.25000 -3493.87017 7.00727 -25.03635 176.73585 118.26508 420.92301
13.35000 -3480.10108 8.76826 5.85666 237.64621 282.49087 451.75340
13.45000 -3444.68550 10.03062 -27.27659 127.08286 102.44499 384.15530
13.55000 -3411.74089 8.70907 -22.71024 172.48155 101.01216 385.18338
13.65000 -3395.59035 9.48462 -12.60043 174.14592 145.90069 382.80923
13.75000 -3363.99448 9.77728 -12.95361 190.93123 102.93496 376.02010
13.85000 -3338.54013 10.34860 -15.20029 173.89040 98.49663 376.39095
13.95000 -3312.16829 8.92031 -20.08731 134.80748 94.99863 375.89638
14.05000 -3283.20677 2.91642 0.13310 119.59067 173.61181 366.79155
14.15000 -3264.20086 9.07761 -20.27382 184.71350 178.90922 371.13503
14.25000 -3242.56048 12.59708 -12.76051 140.50187 119.87410 353.90524
14.35000 -3215.67182 15.45793 -6.50022 163.95945 214.19472 348.26054
14.45000 -3190.31988 8.67767 -0.80691 120.28701 82.67288 343.43729
14.55000 -3170.20049 8.02649 -5.23333 112.00606 82.52956 351.57319
14.65000 -3143.02628 7.57175 -9.21995 124.21094 90.19013 337.05059
14.75000 -3131.60500 7.51356 -19.34512 169.04708 90.59919 343.35729
14.85000 -3110.52926 13.21294 -7.16748 279.78276 204.88541 337.36113
14.95000 -3089.20387 14.42324 -6.63647 112.55423 102.26471 323.11067
15.05000 -3065.38898 9.27660 -21.37723 134.49815 116.40690 331.22868
15.15000 -3051.85321 7.60540 -20.47751 107.73358 80.06881 307.00363
15.25000 -3032.77298 11.44740 -23.82505 130.99841 95.09955 310.95830
15.35000 -3011.53269 9.59986 -21.53474 122.60120 64.08625 311.68089
15.45000 -2991.86189 8.40341 -23.83329 113.75179 80.49894 310.55293
15.55000 -2980.81324 9.77822 -24.33129 94.07279 89.63036 302.56428
15.65000 -2956.12578 8.65835 -26.77592 126.13028 78.28466 309.59019
15.75000 -2935.85866 6.45852 -19.15666 99.47972 150.73244 298.72699
15.85000 -2920.31390 9.04960 -26.89931 104.38861 92.27256 295.06831
15.95000 -2901.72070 9.08897 -21.97355 93.13946 67.00841 280.41225
16.05000 -2884.90063 7.81133 -29.66995 117.15089 83.80448 281.61995
16.15000 -2883.02126 7.09456 -24.24429 301.35913 78.37273 276.12648
16.25000 -2860.47524 5.19975 -20.12440 98.99126 106.43765 312.96615
16.35000 -2840.70073 8.05698 -21.05553 86.27334 77.16675 268.16603
16.45000 -2822.42310 8.24731 -29.94470 81.28569 80.09820 267.35236
16.55000 -2807.64703 8.92161 -30.51489 69.48080 62.13727 263.34573
16.65000 -2791.72522 7.26498 -25.92860 76.40190 55.37554 255.53745
16.75000 -2775.71948 3.85805 -28.15946 120.23490 122.99084 250.84494
16.85000 -2767.24515 1.60025 -50.24040 336.26560 155.20137 489.78819
16.95000 -2750.02346 19.22483 -24.31531 110.03604 418.98665 256.54655
17.05000 -2726.58503 5.89301 -40.21125 63.76956 47.64701 231.97546
17.15000 -2712.11130 5.55341 -20.60280 80.70109 70.13255 233.82552
17.25000 -2692.17161 5.51061 -33.69651 88.51369 56.88083 224.55044
17.35000 -2675.42124 6.37449 -19.02346 199.24072 61.10309 298.84288
17.45000 -2658.68067 5.16801 -30.40995 123.21092 60.45822 227.82213
17.55000 -2646.22759 9.71384 -29.26896 127.60663 153.88872 219.90212
17.65000 -2624.99167 5.98471 -27.21700 65.00208 43.06244 210.65815
17.75000 -2616.22506 1.87520 -22.98777 104.77815 131.08630 227.66232
17.85000 -2596.60360 5.40922 -5.75111 97.71644 55.84054 206.02954
17.95000 -2580.25362 2.04679 -16.31283 68.68711 51.98645 202.65856
18.05000 -2566.38570 6.71784 -13.62347 70.16768 85.04048 199.19775
18.15000 -2551.66334 -0.00962 -8.01213 89.59205 78.78961 184.71129
18.25000 -2545.62198 3.17905 -22.08783 149.74679 48.31375 190.07706
18.35000 -2529.55684 7.03726 -21.21951 62.56349 92.54255 189.00187
18.45000 -2505.71328 3.20450 -19.27511 56.99061 48.19581 199.96970
18.55000 -2493.90558 17.33851 -23.49307 95.18045 398.28950 332.80658
18.65000 -2480.00933 4.47202 -31.71213 49.11545 59.35188 181.71221
18.75000 -2470.08001 8.77053 -21.53395 52.80327 93.24465 166.49457
18.85000 -2454.85971 3.46805 -29.17402 112.94467 177.23284 209.71024
18.95000 -2435.87357 4.90564 -17.97891 136.91631 59.24411 174.59634
19.05000 -2422.38488 2.17051 -12.73023 54.98529 82.13048 175.90122
19.15000 -2420.22085 5.17891 -21.92464 158.39522 83.42330 281.02340
19.25000 -2406.53384 2.33905 -14.06604 190.32945 44.33267 175.85643
19.35000 -2383.34531 1.54051 -24.48740 63.96683 51.84121 153.19724
19.45000 -2369.97624 6.30464 -14.12669 62.89014 54.14143 155.10352
19.55000 -2352.01247 3.61164 -21.85113 77.84801 38.44237 160.81625
19.65000 -2341.75158 -0.69796 -20.60050 49.96679 64.91138 144.50789
19.75000 -2326.31511 0.58373 -21.21951 47.85165 29.52685 142.66410
19.85000 -2315.41075 2.73685 -10.04262 38.79141 53.12590 142.80718
19.95000 -2325.86735 25.51125 -21.31738 528.82655 525.83696 166.36941
