0.125 -0.000 0.008 0.055
0.375 -0.001 0.021 0.406
0.625 0.010 0.042 0.877
0.875 0.004 0.072 1.293
1.125 -0.016 0.072 1.760
1.375 0.020 0.108 2.148
1.625 0.020 0.133 2.701
1.875 -0.002 0.131 3.385
2.125 0.019 0.170 4.264
2.375 -0.013 0.197 5.269
2.625 -0.004 0.184 6.471
2.875 0.003 0.211 7.549
3.125 -0.025 0.282 8.641
3.375 -0.032 0.293 9.894
3.625 -0.063 0.322 11.483
3.875 -0.064 0.357 13.198
4.125 -0.082 0.402 15.432
4.375 -0.101 0.518 17.651
4.625 -0.079 0.498 19.544
4.875 -0.076 0.607 20.927
5.125 -0.143 0.608 21.585
5.375 -0.180 0.595 22.536
5.625 -0.127 0.584 22.673
5.875 -0.140 0.560 22.910
6.125 -0.158 0.581 22.909
6.375 -0.146 0.585 23.723
6.625 -0.123 0.614 23.359
6.875 -0.156 0.605 23.608
7.125 -0.153 0.592 24.193
7.375 -0.148 0.612 24.060
7.625 -0.120 0.550 23.970
7.875 -0.154 0.567 24.433
8.125 -0.107 0.590 24.605
8.375 -0.112 0.627 24.718
8.625 -0.126 0.611 24.891
8.875 -0.106 0.626 24.814
9.125 -0.126 0.608 24.883
9.375 -0.078 0.607 24.558
9.625 -0.066 0.614 24.231
9.875 -0.053 0.599 24.426
10.125 -0.072 0.619 24.105
10.375 -0.025 0.556 23.260
10.625 -0.075 0.616 23.026
10.875 -0.029 0.557 22.606
11.125 0.006 0.579 21.339
11.375 -0.036 0.602 20.689
11.625 -0.015 0.544 19.086
11.875 0.022 0.563 18.499
12.125 0.008 0.551 17.642
12.375 0.009 0.551 16.600
12.625 0.011 0.583 16.023
12.875 -0.025 0.573 15.512
13.125 -0.057 0.571 15.017
13.375 -0.049 0.576 14.761
13.625 -0.115 0.572 14.236
13.875 -0.131 0.555 13.675
14.125 -0.152 0.551 13.163
14.375 -0.138 0.489 11.547
14.625 -0.169 0.446 11.615
14.875 -0.203 0.436 10.544
