0.12500 0.00911
0.37500 0.02781
0.62500 0.03203
0.87500 0.07857
1.12500 0.10473
1.37500 0.13650
1.62500 0.17914
1.87500 0.22173
2.12500 0.24271
2.37500 0.27971
2.62500 0.29468
2.87500 0.27681
3.12500 0.24744
3.37500 0.23847
3.62500 0.22925
3.87500 0.21389
4.12500 0.20726
4.37500 0.17928
4.62500 0.15982
4.87500 0.12825
5.12500 0.10838
5.37500 0.09135
5.62500 0.08875
5.87500 0.06123
6.12500 0.06212
6.37500 0.04128
6.62500 0.04410
6.87500 0.05416
7.12500 0.04102
7.37500 0.03582
7.62500 0.03317
7.87500 0.05503
8.12500 0.03658
8.37500 0.04104
8.62500 0.03021
8.87500 0.01786
9.12500 0.01543
9.37500 0.01321
9.62500 0.01945
9.87500 0.01761
10.12500 0.03265
10.37500 0.01688
10.62500 0.04313
10.87500 0.04494
11.12500 0.01794
11.37500 0.03688
11.62500 0.05513
11.87500 0.05355
12.12500 0.03493
12.37500 0.04049
12.62500 0.01789
12.87500 0.03537
13.12500 0.02899
13.37500 0.00833
13.62500 0.02470
13.87500 0.02290
14.12500 0.03613
14.37500 0.03446
14.62500 0.02492
14.87500 0.00553
15.12500 0.03181
15.37500 0.01366
15.62500 0.02097
15.87500 0.01407
16.12500 0.01638
16.37500 0.02382
16.62500 0.02040
16.87500 0.02310
17.12500 0.00812
17.37500 0.01745
17.62500 0.02510
17.87500 0.03500
18.12500 0.00387
18.37500 0.01582
18.62500 0.02554
18.87500 0.02928
19.12500 0.01558
19.37500 0.00960
19.62500 0.03081
19.87500 0.01119
