0.05000 1280.58357 -1734.02201 3739.42099 0.00000 0.00000 0.00000
0.15000 -155.40871 -108.10734 4107.34498 1221.85450 1184.25596 304.56953
0.25000 -367.48552 366.85900 3958.98400 1061.99526 1521.14767 365.30265
0.35000 -630.80389 230.74718 3983.68175 1143.85733 1410.17750 410.22006
0.45000 -824.11986 372.66496 3914.99668 1200.78419 1298.49158 441.18071
0.55000 -1239.15302 -185.41692 3820.90497 1195.80282 1305.50478 527.42490
0.65000 -1330.76763 12.64017 3764.96617 1250.24260 1354.88628 636.04749
0.75000 -1673.48001 -17.09020 3533.27538 1369.35491 1381.88669 764.85545
0.85000 -1875.93969 112.64395 3429.70013 1431.42872 1404.77426 843.70070
0.95000 -1735.66254 -12.01310 3408.65842 1366.22557 1507.73791 921.43886
1.05000 -1998.98702 103.13660 3210.85112 1420.12087 1523.84902 990.54040
1.15000 -2053.44659 -35.83636 3057.42952 1384.73107 1599.48780 1019.63181
1.25000 -2333.17414 -129.51428 2801.64493 1376.11885 1602.56894 1130.03129
1.35000 -2431.81382 39.80959 2539.41923 1438.66799 1648.19503 1248.78025
1.45000 -2646.37277 -110.34723 2307.85760 1356.47517 1626.26146 1388.86184
1.55000 -2736.23783 51.89810 1910.94951 1482.83866 1610.31147 1536.74798
1.65000 -2898.98921 -46.48842 1863.04232 1316.33213 1522.77636 1637.17484
1.75000 -2945.01863 4.70876 1501.33638 1432.35082 1541.33359 1855.06382
1.85000 -3080.26057 2.74043 1344.33794 1289.47187 1411.00608 2033.92146
1.95000 -3212.80641 -82.03308 1219.44988 1208.18292 1297.92650 2103.97689
2.05000 -3175.44789 31.63514 1018.12221 1277.61179 1281.09203 2267.07409
2.15000 -3269.53336 -59.75153 1052.32463 1188.28191 1183.38334 2229.82399
2.25000 -3311.68896 -15.16292 866.70952 1142.14791 1120.26790 2320.36944
2.35000 -3338.58926 5.66359 714.21562 1152.89319 1057.54485 2329.18888
2.45000 -3295.24114 -40.25507 760.32918 1182.08301 987.10470 2387.83059
2.55000 -3369.82199 -7.28763 609.86830 1086.75705 945.89597 2392.57291
2.65000 -3321.51803 -14.65188 624.70751 1128.30556 873.17135 2405.54161
2.75000 -3363.53558 31.05029 550.84729 1087.09111 841.79730 2358.35674
2.85000 -3300.76945 22.17803 543.95933 1095.73743 814.19848 2427.68228
2.95000 -3308.22379 5.39066 529.05539 1075.60896 783.09260 2422.43829
3.05000 -3355.68881 -18.18585 345.62977 1035.79723 748.21521 2401.53668
3.15000 -3346.86663 -28.19042 383.55614 1068.45793 700.25751 2372.91390
3.25000 -3316.41851 34.53829 389.96704 1060.69967 669.57752 2395.93812
3.35000 -3272.00981 -1.92414 425.47653 1036.18223 640.71840 2402.36212
3.45000 -3289.50371 9.21464 245.25526 1046.33283 623.94907 2383.00158
3.55000 -3282.80456 -2.11758 389.33127 1004.57377 610.62706 2322.05029
3.65000 -3244.62751 -15.33746 358.11948 992.68004 575.21428 2355.12869
3.75000 -3228.43191 -3.92728 249.63755 993.37664 552.33502 2357.18463
3.85000 -3201.36503 19.67729 262.45640 1023.02544 537.30268 2361.55712
3.95000 -3171.20752 -9.05287 189.53787 997.69560 522.17028 2381.36981
4.05000 -3212.63110 -4.37027 274.96286 976.45206 524.24555 2291.21824
4.15000 -3205.29482 3.80297 187.50810 946.31627 485.26589 2281.13046
4.25000 -3209.57166 1.30017 219.24376 929.39624 476.07771 2244.29692
4.35000 -3172.07659 16.24820 75.87774 953.12278 468.03771 2285.81720
4.45000 -3118.10026 10.69971 90.50925 952.73519 452.11757 2315.41453
4.55000 -3095.86281 6.00875 102.64302 943.71231 438.16460 2322.71949
4.65000 -3126.33074 -11.61735 56.49744 915.00456 421.93291 2251.70434
4.75000 -3052.38864 2.29348 244.59956 948.75933 407.97412 2268.89418
4.85000 -3034.96886 5.21971 165.92430 911.46921 398.14203 2273.81446
4.95000 -3046.25140 -11.73054 161.07386 931.23049 383.96558 2225.17015
5.05000 -3017.77330 -8.88097 61.84210 922.35542 378.98508 2222.90035
5.15000 -2991.72747 17.23301 102.85683 909.91879 358.11040 2229.46463
5.25000 -2993.60906 5.83027 88.98384 897.07517 352.93532 2190.99666
5.35000 -2973.80536 -1.57357 95.93136 879.61733 343.38785 2171.37721
5.45000 -3000.68508 -12.13495 107.55691 864.76310 331.48017 2123.15277
5.55000 -2950.92501 0.94023 145.29272 892.50349 323.92726 2129.11902
5.65000 -2961.38326 -8.11431 119.45052 863.96059 320.03124 2093.68997
5.75000 -2899.93418 6.99550 87.87471 865.37932 309.84871 2145.01789
5.85000 -2910.44477 -3.58521 100.76948 853.86590 301.72977 2094.02682
5.95000 -2893.86543 7.67314 91.37316 833.47249 299.24983 2092.69054
6.05000 -2872.27280 3.08628 111.04725 841.71049 286.16050 2076.86146
6.15000 -2841.24340 -6.28171 132.52576 849.03069 280.40910 2071.24906
6.25000 -2818.47586 3.53185 101.89665 843.84045 282.76662 2079.35738
6.35000 -2832.56085 -0.03168 89.04951 834.77428 268.43762 2040.99765
6.45000 -2812.23636 2.39795 100.33443 830.42433 268.89679 2035.23010
6.55000 -2775.64391 -11.16801 23.61810 836.83600 265.77342 2046.69635
6.65000 -2746.53156 -4.99262 19.00511 839.72867 264.47294 2059.74980
6.75000 -2755.73970 1.53331 -45.38798 821.74326 257.53653 2031.09858
6.85000 -2732.75653 -8.62518 -36.00774 827.28518 251.00622 2036.40743
6.95000 -2747.58540 2.50812 14.13507 783.83620 243.85439 1980.24553
7.05000 -2729.59752 1.30915 -47.46493 785.01188 245.63666 1985.76594
7.15000 -2694.53806 1.75020 82.57563 796.90331 236.73956 1977.86455
7.25000 -2714.72994 2.56562 27.77643 783.55048 229.35102 1938.46928
7.35000 -2698.17214 0.14361 19.04182 773.72126 226.63487 1923.69954
7.45000 -2633.40048 -2.96093 60.57569 791.62661 220.50016 1976.35980
7.55000 -2628.23552 3.42782 9.58122 781.53536 220.33228 1957.29716
7.65000 -2634.97156 -0.55901 25.87779 776.43561 212.00741 1930.68394
7.75000 -2635.40034 -2.42892 -2.20566 753.11897 207.08449 1905.64430
7.85000 -2588.66677 5.95424 8.54855 777.54649 206.64744 1929.58617
7.95000 -2597.57481 -0.32024 -95.08302 744.75877 206.67364 1906.71324
8.05000 -2570.94063 -4.87981 -28.72556 752.31058 203.70866 1905.38799
8.15000 -2567.46637 7.03131 10.17677 748.09711 193.37359 1877.97328
8.25000 -2555.14517 5.32190 10.52748 739.10163 195.25875 1865.23085
8.35000 -2533.84787 -2.11967 36.44916 748.28973 188.15839 1864.30403
8.45000 -2549.99001 3.58530 -40.72496 719.45659 192.81753 1825.20118
8.55000 -2524.75034 -4.56594 15.82140 721.64122 183.49293 1822.68414
8.65000 -2484.25602 -2.81764 -41.43703 743.87424 182.87185 1850.71537
8.75000 -2519.49898 -2.19061 -19.82588 720.30852 177.57033 1783.63127
8.85000 -2476.59381 2.27316 -40.40203 719.55147 176.93769 1810.73154
8.95000 -2461.38528 -0.24323 -35.17878 726.04858 177.32828 1802.35183
9.05000 -2431.24890 -0.64891 37.09826 716.00508 167.18227 1809.20704
9.15000 -2439.86058 1.74081 -83.93377 708.46920 173.05400 1782.89958
9.25000 -2423.09848 6.01338 -118.68162 711.22126 165.72117 1780.45070
9.35000 -2400.83749 -0.31067 17.11145 709.45600 161.66012 1769.85151
9.45000 -2403.53500 1.12232 -20.12615 693.54577 160.54228 1751.99354
9.55000 -2386.88024 3.52509 -40.19722 693.49082 153.59342 1741.77649
9.65000 -2365.75621 1.43239 -27.73838 697.08014 154.29711 1743.05398
9.75000 -2343.37823 -1.75980 -131.25128 687.68554 162.31449 1763.95046
9.85000 -2350.37798 4.53576 -24.20509 674.20955 152.45982 1722.15871
9.95000 -2349.85759 -1.89302 -29.94459 668.49226 149.61545 1699.63224
10.05000 -2329.42152 3.00935 -24.02990 673.45152 147.62950 1691.23198
10.15000 -2327.54861 -3.23293 -15.48425 664.70005 141.35065 1668.51134
10.25000 -2304.89795 0.22324 -39.49520 657.77868 141.43594 1680.48694
10.35000 -2284.45557 -0.53024 -68.57042 667.05588 142.07439 1680.27583
10.45000 -2272.27531 0.09669 -48.50275 660.91105 134.45326 1670.23449
10.55000 -2242.12328 -1.46105 -51.53512 666.15964 140.97391 1680.98737
10.65000 -2249.86404 0.73895 -45.71351 656.67755 130.64721 1647.38418
10.75000 -2227.27428 -3.25216 -43.46905 660.30221 139.71928 1654.50853
10.85000 -2240.82749 1.26738 -128.22414 634.36700 136.56519 1620.33302
10.95000 -2210.23424 -1.04424 -65.48612 641.11315 139.67311 1634.66589
11.05000 -2214.88010 1.20476 -77.61358 635.01915 137.01360 1600.96354
11.15000 -2166.80647 3.99759 -42.22209 636.48331 122.49966 1635.75386
11.25000 -2162.31103 -1.69705 -90.58249 633.24891 124.09592 1625.27579
11.35000 -2188.26875 0.28533 -72.70053 622.04249 117.28548 1570.43969
11.45000 -2175.10004 0.86738 -10.51314 608.15752 122.01423 1564.46895
11.55000 -2134.20094 -1.62662 -18.13990 632.14519 120.20049 1581.84538
11.65000 -2117.58631 -0.02951 -96.90176 633.81666 119.86759 1580.47687
11.75000 -2144.55093 -1.08761 -80.44677 606.88005 115.28284 1540.61335
11.85000 -2109.35148 -0.31241 -19.53404 625.92509 113.38236 1551.32755
11.95000 -2112.15520 2.03072 -57.31964 590.36459 120.10836 1534.73655
12.05000 -2093.35039 0.26651 -74.56671 606.09417 114.00989 1534.63518
12.15000 -2097.43570 -1.66070 -70.02097 598.27010 115.29076 1510.70203
12.25000 -2055.89132 -1.31666 -37.26389 603.83562 113.74091 1539.45802
12.35000 -2070.06535 3.00327 -75.07467 577.59845 111.85417 1512.62161
12.45000 -2043.36615 2.12318 -28.99157 594.32946 112.67935 1514.80721
12.55000 -2046.34228 0.29960 -87.39573 604.04596 113.97827 1491.39241
12.65000 -2016.90532 0.76198 -77.46004 596.89690 111.87008 1506.15527
12.75000 -2024.05784 -1.72182 -67.05859 582.69037 106.05803 1483.23863
12.85000 -2002.02441 0.31034 -34.85084 583.46584 103.61191 1482.17389
12.95000 -2008.58778 0.03399 -51.64422 578.30578 103.21012 1458.52080
13.05000 -1990.59315 0.96458 -72.87016 573.05717 96.69956 1462.59666
13.15000 -1985.40174 -2.74138 -49.06536 579.79738 99.04760 1445.30533
13.25000 -1951.08766 2.11002 -52.22183 556.49127 99.57183 1473.90870
13.35000 -1975.02347 0.41679 -28.36967 560.36147 99.23325 1420.11555
13.45000 -1938.90481 1.00372 -114.58497 560.95559 97.36174 1449.57959
13.55000 -1932.85455 1.50886 2.18914 569.63498 96.28646 1434.13137
13.65000 -1947.50983 -1.72954 -45.53044 542.13439 101.32701 1399.21307
13.75000 -1920.75719 -1.93787 -75.24768 558.58727 100.58637 1415.28984
13.85000 -1903.61799 1.16906 -98.30767 548.84106 95.66819 1421.41588
13.95000 -1903.53389 -1.40306 -75.75434 542.72985 92.89251 1402.57721
14.05000 -1904.19969 2.14820 -62.14288 543.91889 90.65058 1380.64757
14.15000 -1870.12093 -0.84332 -126.66167 542.43635 89.28931 1410.73449
14.25000 -1865.37244 1.53753 -55.97329 546.27707 86.62984 1392.81660
14.35000 -1852.10829 -0.35995 -53.39948 542.95564 86.27785 1392.23196
14.45000 -1864.67734 0.06557 -72.07249 534.57684 88.21075 1362.32694
14.55000 -1840.38613 0.95146 -54.05246 537.70272 94.86009 1374.71781
14.65000 -1848.06641 -0.78189 -98.79412 527.90538 86.50864 1351.43284
14.75000 -1815.82634 0.41062 -77.05070 533.32872 85.68313 1369.81708
14.85000 -1819.32914 -2.25536 -51.94138 528.42943 83.06836 1349.12702
14.95000 -1826.18922 -0.35909 -45.88125 527.13184 79.10246 1320.32179
15.05000 -1813.77754 -0.03989 -61.09760 512.83832 78.45756 1325.27123
15.15000 -1806.68341 -0.06564 -83.56238 518.36977 80.24657 1314.08104
15.25000 -1789.34776 0.04999 -58.44044 506.86347 82.07418 1316.84510
15.35000 -1784.94423 -1.76162 -43.27167 514.59822 77.81455 1303.45648
15.45000 -1781.81173 -0.99070 -27.92351 505.18496 77.99258 1286.91006
15.55000 -1776.83236 -0.41679 -73.70405 499.90558 84.93725 1286.53573
15.65000 -1760.53006 -1.04820 -8.19874 493.98033 80.56750 1282.73384
15.75000 -1752.84003 -0.12274 -57.03588 498.59092 73.88768 1276.64698
15.85000 -1753.09290 0.05425 -47.86567 491.71289 80.18795 1263.95530
15.95000 -1731.40676 -0.11814 -77.68892 497.40625 75.54190 1276.88090
16.05000 -1731.20975 1.98169 -99.15771 487.99750 83.86303 1264.06282
16.15000 -1717.27687 -0.90671 -92.22334 496.65703 68.15582 1264.88057
16.25000 -1693.26446 0.58852 -81.18048 502.15454 73.28131 1273.17273
16.35000 -1698.39031 0.45927 -109.41167 479.32695 70.61036 1259.78996
16.45000 -1694.13424 -0.96362 -6.51957 486.29391 75.98181 1235.79608
16.55000 -1683.33333 1.41454 -79.15676 479.26143 74.70133 1242.99208
16.65000 -1657.75233 -0.07200 -53.20409 500.37458 68.19426 1254.71983
16.75000 -1664.62099 -0.29529 -60.38292 493.52327 68.72085 1232.61252
16.85000 -1645.30327 -0.01351 -41.14942 487.87905 77.06129 1237.02655
16.95000 -1652.30231 1.23461 -35.00743 478.87001 70.49474 1216.75641
17.05000 -1645.70140 0.23962 -32.44398 468.75203 67.25936 1211.69641
17.15000 -1638.91810 -1.46816 -46.90275 465.20941 62.41197 1206.04071
17.25000 -1635.35218 -0.90706 -58.56937 465.33099 65.96094 1196.63848
17.35000 -1616.83127 0.84714 -79.18032 468.35628 69.84646 1205.39969
17.45000 -1622.23397 0.67793 -38.87183 457.31123 66.66440 1185.10933
17.55000 -1600.01705 -0.87917 -62.38232 466.85974 68.12085 1195.74107
17.65000 -1592.96300 -0.66043 -62.48504 464.76377 62.68723 1189.26087
17.75000 -1587.87314 0.89885 -77.49326 461.80696 62.38288 1185.58917
17.85000 -1598.24251 0.05953 -68.23140 445.02435 66.52683 1161.80174
17.95000 -1574.34112 -1.22914 -79.19863 453.76513 69.13092 1174.23788
18.05000 -1577.22763 2.01778 -71.54007 454.25828 70.59369 1154.75431
18.15000 -1564.82549 -0.94487 -61.69686 452.38294 63.61744 1154.61836
18.25000 -1563.79914 -0.93682 -0.56950 442.78312 65.13396 1140.35940
18.35000 -1565.45652 1.07971 -24.43025 434.64221 65.56573 1128.33955
18.45000 -1560.42900 -0.89060 -49.30629 440.49262 55.54569 1118.72361
18.55000 -1528.41732 -0.35790 -64.00967 449.43622 58.91872 1144.55814
18.65000 -1532.89897 -0.87541 -62.50573 440.28349 58.24822 1123.09293
18.75000 -1516.72832 1.98853 -63.78865 442.70669 66.08567 1134.69686
18.85000 -1519.24969 0.62209 -65.11677 429.69451 65.62264 1121.47435
18.95000 -1521.12539 1.08012 -32.57817 428.43724 66.46008 1101.07672
19.05000 -1496.65328 -1.65861 -69.83486 436.64398 63.71676 1118.55416
19.15000 -1494.47259 -0.01822 -0.18383 436.25825 58.80002 1103.79882
19.25000 -1497.17094 1.02197 -47.22621 422.25358 57.16365 1095.08417
19.35000 -1482.95211 -1.30933 -23.05022 424.05800 68.28746 1095.77060
19.45000 -1470.48251 -0.50591 -62.82286 428.92542 51.96607 1100.12666
19.55000 -1470.03278 -0.60619 -28.00340 422.20787 54.62136 1085.83843
19.65000 -1464.93598 -0.80457 -31.64520 424.46009 56.54907 1078.62908
19.75000 -1463.90119 0.09882 -26.39788 420.32916 51.72712 1069.98110
19.85000 -1454.54218 -0.99845 -51.64484 415.88059 52.95598 1068.84676
19.95000 -1453.71453 3.27392 2.29012 414.32412 53.42553 1052.56082
