0.05000 -1120.98645 -178.06211 676.73789 1516.05306 1409.08072 2373.84681
0.15000 -2784.26313 -0.58224 968.52010 1839.40297 1611.39836 4516.26334
0.25000 -4454.02483 153.83799 317.58977 2006.55288 1699.22182 5950.15120
0.35000 -5395.54347 105.93383 405.16237 2161.99765 1769.16911 7241.97684
0.45000 -6434.32629 76.33860 170.07709 2137.03218 1825.12500 7791.75661
0.55000 -6815.40515 132.90088 136.31648 2184.52834 1839.61208 8342.72733
0.65000 -7252.04430 119.03802 264.08577 2198.49177 1910.47110 8439.13905
0.75000 -7688.49428 73.37816 227.23591 2211.19658 1896.51734 8451.64072
0.85000 -7977.85561 118.45088 78.14298 2227.16815 1954.82262 8339.87655
0.95000 -8066.45511 75.43366 171.40886 2246.82498 2007.73308 8282.55400
1.05000 -8274.31584 58.89146 32.66675 2175.74078 2071.90876 7987.11812
1.15000 -8355.84020 66.67547 112.31310 2124.84794 2109.09299 7801.60372
1.25000 -8436.10429 55.29861 27.97673 2052.97933 2156.12400 7527.54091
1.35000 -8441.01117 59.00149 202.00272 1942.73856 2143.20897 7257.03884
1.45000 -8488.46551 114.81947 -20.96365 1766.54536 2169.14749 6893.33575
1.55000 -8395.75814 70.05475 37.25525 1706.78651 2187.18594 6718.60142
1.65000 -8381.41622 128.53876 34.44958 1607.15082 2154.86415 6487.04961
1.75000 -8379.39332 114.01850 11.14034 1480.91690 2173.87379 6171.27862
1.85000 -8305.68309 125.97987 39.68347 1368.67381 2165.14748 6070.37253
1.95000 -8265.56475 57.35713 115.23297 1241.61970 2120.90834 5838.74841
2.05000 -8210.72860 52.03905 5.63531 1158.63399 2115.13835 5643.74933
2.15000 -8159.16682 98.31160 -10.57223 1072.68489 2072.32833 5476.95055
2.25000 -8148.78008 64.60868 90.64204 999.71664 2063.65796 5209.33367
2.35000 -8078.64328 98.15956 -155.51413 938.94434 1999.87140 5166.95534
2.45000 -8052.33000 90.84861 -132.12953 856.03521 1970.81524 4994.05667
2.55000 -8021.15573 63.06753 -7.59706 811.98396 1919.59235 4848.58512
2.65000 -8012.91472 87.50893 -35.53238 778.72042 1894.74039 4675.02147
2.75000 -7964.59444 47.60825 -103.84781 721.72641 1811.10385 4584.39220
2.85000 -7929.59765 45.50802 -84.70525 714.77384 1761.83474 4478.37034
2.95000 -7891.70671 69.91021 -92.24910 692.65484 1700.99258 4328.73117
3.05000 -7852.98397 92.40603 3.94665 683.70954 1634.15792 4203.03677
3.15000 -7829.01632 51.57038 25.44806 649.31670 1589.67735 4078.97036
3.25000 -7776.85962 54.83004 -85.94927 689.56165 1515.39090 3994.80442
3.35000 -7733.52263 65.58868 -46.80362 636.28299 1457.21029 3841.30585
3.45000 -7667.35853 69.95670 15.61794 638.35384 1399.05586 3723.60009
3.55000 -7630.35301 24.82575 -7.75797 619.50696 1349.92764 3580.94776
3.65000 -7581.11974 37.09623 4.79053 655.24621 1285.79785 3530.87107
3.75000 -7518.37711 48.00492 -37.47187 666.78619 1227.98877 3389.30462
3.85000 -7479.58977 67.51762 -74.69578 670.52961 1158.75192 3290.06726
3.95000 -7429.69145 62.02272 -2.16535 669.25339 1105.69768 3183.92202
4.05000 -7388.61793 58.54358 -86.67446 698.46240 1057.29297 3084.61310
4.15000 -7365.47582 51.52574 -38.85112 704.86572 992.77098 2993.37323
4.25000 -7341.43030 64.55549 16.10262 729.03998 939.56592 2899.92523
4.35000 -7266.75250 73.08262 -17.71053 741.80138 885.92511 2796.12392
4.45000 -7230.48774 56.14092 -38.23837 740.61613 835.07586 2733.33257
4.55000 -7207.16209 62.52962 -82.91930 743.19877 791.79819 2642.99385
4.65000 -7153.74118 72.00806 -21.96316 743.79072 744.34347 2554.09817
4.75000 -7116.60863 64.71643 -47.53531 730.27328 697.14261 2487.78937
4.85000 -7055.72384 77.38721 6.15489 716.97103 647.80173 2440.42439
4.95000 -7007.82879 84.61807 -49.38658 708.45340 620.48661 2309.06711
5.05000 -6950.00553 76.17704 -65.87199 707.26041 583.00837 2259.14807
5.15000 -6899.00374 74.94669 -64.79007 693.34028 543.95527 2194.52097
5.25000 -6843.39658 83.95750 -30.14707 669.30574 507.36096 2108.11314
5.35000 -6767.06949 73.19512 -27.25781 642.69990 475.20016 2029.57936
5.45000 -6701.72196 77.37192 9.03297 616.19583 445.91047 1989.55463
5.55000 -6652.61644 67.85997 -50.18053 590.17151 419.29504 1928.86206
5.65000 -6587.56971 75.46323 -24.52796 565.98213 397.93179 1851.27762
5.75000 -6534.77817 69.05049 -61.33397 548.89266 373.97373 1812.83452
5.85000 -6465.28153 62.82556 -20.61103 533.33134 350.53879 1760.43950
5.95000 -6398.97861 78.06800 -20.72588 494.69795 333.60834 1702.52044
6.05000 -6333.18529 71.20384 -51.41293 459.42772 312.92068 1667.78264
6.15000 -6273.96994 76.84524 -39.07782 444.86642 299.84260 1606.59105
6.25000 -6222.12287 71.41010 -59.04586 427.46612 285.55699 1560.56512
6.35000 -6157.61747 69.84340 -13.87276 418.30079 272.15193 1549.97534
6.45000 -6083.78059 65.24047 -32.61029 398.68026 253.41677 1488.90312
6.55000 -6028.51776 60.13694 22.08904 378.28688 249.72630 1457.01252
6.65000 -5982.05427 66.74809 6.58826 355.34958 238.61014 1411.42431
6.75000 -5926.70443 70.08828 -6.81461 344.76740 231.92329 1367.00139
6.85000 -5872.52573 59.07337 8.12339 324.05653 218.61670 1335.97263
6.95000 -5823.36860 66.37544 35.40314 311.13712 213.90005 1293.69329
7.05000 -5772.28762 62.01372 41.18811 300.16914 207.40674 1263.09750
7.15000 -5726.27712 57.03726 14.85572 285.98642 193.87756 1221.94870
7.25000 -5668.37096 59.30962 21.15102 286.90995 192.83906 1205.34103
7.35000 -5620.85567 59.08805 28.76762 266.45758 184.92436 1163.81083
7.45000 -5572.15742 55.12945 25.08335 254.00832 184.37338 1140.13061
7.55000 -5528.31892 53.14281 44.47363 240.11683 173.18648 1106.94659
7.65000 -5488.93079 53.21065 26.26935 232.32230 170.12743 1079.13019
7.75000 -5437.93479 47.26018 9.24828 215.88312 162.64384 1041.16724
7.85000 -5401.13585 49.17373 43.07003 213.30890 161.07850 1013.86787
7.95000 -5356.11803 45.81941 32.10262 212.71361 161.26450 1000.81254
8.05000 -5309.70742 45.34180 56.12213 209.16821 153.23708 975.85122
8.15000 -5261.94759 39.37989 47.74910 198.96631 155.24133 956.97560
8.25000 -5211.61457 43.65917 19.81385 192.23997 146.55287 915.13007
8.35000 -5156.49882 42.50563 40.87704 193.92762 139.70326 892.01052
8.45000 -5105.43639 39.44302 31.40601 200.56621 141.84676 885.35412
8.55000 -5058.49087 44.75435 48.12041 184.10180 140.73282 847.17752
8.65000 -5016.71313 38.64784 42.58518 184.22562 136.08939 832.37286
8.75000 -4971.35101 39.06593 19.81690 194.28703 133.69810 807.86284
8.85000 -4923.64929 39.52142 18.79396 181.18359 131.26606 779.28250
8.95000 -4879.84385 39.26302 18.38165 177.12151 131.20955 759.24102
9.05000 -4836.67317 34.97755 0.11799 173.89463 124.39743 728.05445
9.15000 -4786.26183 36.84906 8.13211 179.07803 127.13310 737.80918
9.25000 -4745.88058 33.32659 17.58786 172.59283 122.44038 705.00915
9.35000 -4691.46983 36.30746 -0.80754 163.26109 111.01254 691.93187
9.45000 -4639.28290 35.07336 21.33492 168.71808 112.98014 697.15099
9.55000 -4600.88443 37.62342 25.17779 167.53202 115.50745 644.45260
9.65000 -4556.03206 33.96094 6.79916 153.17127 106.17250 643.59330
9.75000 -4509.85839 32.50559 6.03264 150.32691 104.36885 635.94407
9.85000 -4470.78914 33.32829 9.00852 146.51713 100.60683 614.86492
9.95000 -4426.01043 29.02635 11.88492 143.81626 106.33928 607.45887
10.05000 -4384.43662 29.22658 -24.52946 134.31036 92.98908 582.06170
10.15000 -4342.89021 30.00457 -0.95109 133.96479 91.55453 581.40437
10.25000 -4300.87607 29.15727 -22.65448 127.26491 99.31968 562.25264
10.35000 -4272.35143 32.14239 -13.89993 133.94708 92.57236 559.94514
10.45000 -4239.98546 30.57132 0.88655 121.50120 97.43130 533.33332
10.55000 -4201.98303 27.24208 -28.25220 120.51573 96.81254 527.04551
10.65000 -4162.62933 25.25664 2.70056 123.65000 93.46429 524.00163
10.75000 -4130.09851 29.47844 -6.29863 112.88757 88.97832 509.81904
10.85000 -4095.25315 24.62656 -0.32751 115.96339 90.32560 497.86651
10.95000 -4061.76772 23.98135 -10.27552 109.83948 88.96228 481.26776
11.05000 -4027.48102 25.44276 -19.79301 108.28440 86.05585 470.13406
11.15000 -3993.72329 22.57576 6.10460 102.95209 79.49715 468.17484
11.25000 -3965.92611 23.77694 -5.70138 103.48462 79.32968 443.82090
11.35000 -3933.44272 20.18920 13.34862 101.44969 88.01900 441.75664
11.45000 -3902.97121 24.13921 -17.02971 97.40556 81.02064 427.33941
11.55000 -3871.90593 22.86492 -3.95620 102.60152 80.17402 424.56056
11.65000 -3842.82889 21.12192 10.13106 95.30603 78.20811 408.15819
11.75000 -3817.41856 22.57175 5.21120 94.42809 81.62855 402.16627
11.85000 -3790.57464 18.64201 0.51575 94.60149 79.06310 384.97198
11.95000 -3757.55720 22.63946 -6.44048 98.69625 86.48551 382.79724
12.05000 -3733.08924 20.07100 -7.34766 89.00649 75.94794 373.35039
12.15000 -3708.61753 16.43244 -6.14448 85.88597 76.64644 360.89785
12.25000 -3679.97151 21.09490 -20.60188 87.05106 71.52147 354.73033
12.35000 -3650.14781 20.71562 -36.00863 79.70317 76.38089 350.80769
12.45000 -3625.75890 18.06269 -30.12684 84.11992 76.84539 340.98547
12.55000 -3599.94313 16.54038 -9.16937 82.38533 68.50725 334.72686
12.65000 -3572.10762 17.50658 -9.11421 84.12255 69.77160 332.57498
12.75000 -3545.49731 21.26915 -28.51445 84.28975 72.67676 318.13579
12.85000 -3519.32524 17.41841 -35.68486 86.22287 74.37690 319.56754
12.95000 -3488.69537 16.77022 -30.19624 75.32532 71.70486 307.28138
13.05000 -3461.30166 17.64486 -31.85121 81.47860 69.57545 307.08130
13.15000 -3435.96579 16.32462 -46.66024 80.41579 62.79496 291.39480
13.25000 -3412.36748 14.35102 -34.30070 75.50001 69.72731 289.93245
13.35000 -3383.96991 15.75832 -40.09036 78.41725 67.97909 284.71507
13.45000 -3356.27303 15.94193 -33.00877 72.57717 63.37877 268.77244
13.55000 -3333.77322 18.56255 -44.74775 74.69383 63.49272 264.73734
13.65000 -3314.96561 15.73120 -36.68221 80.09035 65.56391 267.36233
13.75000 -3288.16219 15.62522 -50.19028 76.16684 62.74265 260.68400
13.85000 -3261.72706 16.88284 -37.96542 73.74054 61.88017 262.28061
13.95000 -3235.13230 13.52705 -39.16777 72.05701 60.30065 252.36910
14.05000 -3211.30821 14.04661 -37.12234 66.11290 58.76483 246.76549
14.15000 -3187.21773 15.24898 -34.04301 72.90955 64.63143 247.74596
14.25000 -3164.69618 15.73846 -29.69859 72.81699 63.29537 239.78934
14.35000 -3144.18050 16.22011 -33.42789 64.26998 58.19031 229.36894
14.45000 -3120.55140 13.75912 -26.92485 70.56739 56.51211 229.32447
14.55000 -3101.69695 16.58865 -9.48947 62.77836 55.30169 213.45884
14.65000 -3075.68051 14.56632 -9.63836 70.80609 68.43501 224.37482
14.75000 -3054.40610 9.57565 -16.93180 62.51623 64.67745 221.03280
14.85000 -3035.95095 15.12108 -15.46553 65.05646 50.53406 208.39518
14.95000 -3012.45605 14.70057 -4.18692 63.66028 49.16959 202.60760
15.05000 -2996.64455 15.12386 -11.12790 57.57124 53.64190 200.55747
15.15000 -2972.95315 11.36422 -8.54983 62.59737 54.31901 189.48810
15.25000 -2949.68429 15.09023 -1.11452 58.32362 49.62598 198.03631
15.35000 -2931.84066 13.32854 -5.61641 62.75894 62.03925 186.23908
15.45000 -2919.20701 12.81077 -9.27054 80.32174 62.67801 181.38502
15.55000 -2898.07660 13.44490 -6.45338 72.11615 51.78580 179.74947
15.65000 -2875.38047 12.29461 -17.47014 53.59259 44.30283 165.82267
15.75000 -2852.69525 16.63499 -4.30580 53.72804 50.58189 177.94614
15.85000 -2830.59614 13.34854 -8.46709 61.57919 64.83515 174.97487
15.95000 -2813.13555 13.65610 -9.72347 64.91737 47.02304 172.91476
16.05000 -2795.15777 12.63113 -22.87488 54.53592 42.88584 157.16798
16.15000 -2772.47455 12.55774 -27.34648 68.20550 66.77279 164.12827
16.25000 -2759.09654 13.24198 -14.45019 52.63101 39.69922 150.05833
16.35000 -2733.63003 12.23571 -21.83945 57.76004 41.38559 153.97621
16.45000 -2715.12578 14.59556 -13.77937 56.60508 41.69957 156.62318
16.55000 -2698.47257 12.42033 -18.18510 61.07384 48.36414 141.34840
16.65000 -2680.43753 9.21862 -27.93259 51.31702 45.95535 151.58791
16.75000 -2663.08349 8.31724 -26.26110 64.45659 56.41547 143.31153
16.85000 -2647.10906 9.33172 -32.73314 55.62119 43.52343 142.95750
16.95000 -2626.83640 8.79669 -17.72289 51.81250 45.30234 141.17063
17.05000 -2608.76123 8.69571 -25.49075 48.11949 50.73057 136.58196
17.15000 -2593.73067 11.46205 -24.59065 50.19645 52.49455 128.74856
17.25000 -2575.82123 9.24903 -15.40439 55.29661 59.29700 137.89262
17.35000 -2557.80885 12.00358 -24.16659 47.15777 46.67821 133.96991
17.45000 -2545.40118 9.19748 -15.85263 45.39930 42.85695 120.93414
17.55000 -2525.81960 8.78891 -16.29225 65.49410 39.25244 120.92507
17.65000 -2517.12008 11.35923 -16.94425 51.66761 62.72727 126.28688
17.75000 -2502.05890 11.26737 -11.57607 59.91771 48.51738 128.52874
17.85000 -2486.08527 11.60492 -14.63597 47.38038 45.65980 121.61015
17.95000 -2472.48295 9.82176 -7.41978 70.95457 56.21951 113.16767
18.05000 -2453.20831 9.74426 -2.86575 55.73537 37.48467 121.39583
18.15000 -2443.95578 11.69756 -4.37837 42.19991 42.85718 111.01782
18.25000 -2422.30574 14.09657 -15.59319 53.34563 44.80983 110.54414
18.35000 -2414.02241 9.62451 -7.29569 57.01028 58.84635 111.58513
18.45000 -2392.72337 7.89691 -5.49172 52.31735 49.14393 113.27797
18.55000 -2380.81441 8.66166 -5.53171 54.35396 43.18011 109.29102
18.65000 -2368.84260 11.45623 -7.93040 46.44560 37.35557 109.58774
18.75000 -2353.43601 8.99865 -17.12890 58.77018 55.34494 105.65071
18.85000 -2343.67616 9.65413 -11.31482 41.04447 44.67523 105.25331
18.95000 -2325.86251 16.72563 -16.66363 37.07892 47.30541 106.43117
19.05000 -2316.74814 15.88293 -14.17925 50.37157 39.67621 100.70661
19.15000 -2294.33991 12.66923 -6.45487 49.94006 46.46846 105.60179
19.25000 -2284.00686 10.55594 -8.51337 33.78823 38.53540 102.01093
19.35000 -2267.02218 14.72764 1.19258 56.64896 39.50560 92.47734
19.45000 -2258.49852 16.83401 -4.94226 53.68649 43.74800 98.64771
19.55000 -2246.04505 14.75716 2.55687 36.77300 34.76698 91.15852
19.65000 -2235.75195 18.34796 -5.56276 30.40548 36.88054 95.97235
19.75000 -2224.64876 15.85993 -0.09381 40.79795 45.36088 86.22179
19.85000 -2211.39292 16.05649 -7.18607 30.04965 30.51870 92.73903
19.95000 -2194.99043 13.16055 -10.06848 41.26009 43.14267 94.53956
