0.12500 0.00838
0.37500 0.04178
0.62500 0.07930
0.87500 0.14849
1.12500 0.20541
1.37500 0.23908
1.62500 0.28007
1.87500 0.31299
2.12500 0.35224
2.37500 0.37197
2.62500 0.41357
2.87500 0.44970
3.12500 0.46424
3.37500 0.48660
3.62500 0.51038
3.87500 0.51922
4.12500 0.51562
4.37500 0.49358
4.62500 0.50676
4.87500 0.46778
5.12500 0.47494
5.37500 0.45409
5.62500 0.41873
5.87500 0.41145
6.12500 0.37736
6.37500 0.37296
6.62500 0.34423
6.87500 0.32847
7.12500 0.33050
7.37500 0.28738
7.62500 0.29675
7.87500 0.24788
8.12500 0.23345
8.37500 0.16843
8.62500 0.15526
8.87500 0.12699
9.12500 0.07499
9.37500 0.07522
9.62500 0.04594
9.87500 0.01016
10.12500 0.01843
10.37500 0.01789
10.62500 0.00230
10.87500 0.02402
11.12500 0.05992
11.37500 0.03127
11.62500 0.07998
11.87500 0.06871
12.12500 0.06338
12.37500 0.09082
12.62500 0.06476
12.87500 0.07136
13.12500 0.09400
13.37500 0.11223
13.62500 0.06140
13.87500 0.07845
14.12500 0.12039
14.37500 0.10157
14.62500 0.10099
14.87500 0.13401
15.12500 0.11306
15.37500 0.14076
15.62500 0.10462
15.87500 0.17125
16.12500 0.13781
16.37500 0.16898
16.62500 0.20651
16.87500 0.18277
17.12500 0.20765
17.37500 0.22827
17.62500 0.15487
17.87500 0.16645
18.12500 0.13932
18.37500 0.12960
18.62500 0.13252
18.87500 0.07920
19.12500 0.11883
19.37500 0.13265
19.62500 0.08086
19.87500 0.15881
