0.12500 0.02854
0.37500 0.03277
0.62500 0.07220
0.87500 0.08419
1.12500 0.12063
1.37500 0.12291
1.62500 0.14589
1.87500 0.14513
2.12500 0.13222
2.37500 0.13401
2.62500 0.13087
2.87500 0.10925
3.12500 0.08194
3.37500 0.07373
3.62500 0.06824
3.87500 0.02967
4.12500 0.02622
4.37500 0.01519
4.62500 0.03290
4.87500 0.03234
5.12500 0.04593
5.37500 0.06767
5.62500 0.07860
5.87500 0.06581
6.12500 0.06922
6.37500 0.07460
6.62500 0.04490
6.87500 0.07357
7.12500 0.07411
7.37500 0.07631
7.62500 0.06176
7.87500 0.05154
8.12500 0.06292
8.37500 0.04525
8.62500 0.03869
8.87500 0.02847
9.12500 0.03807
9.37500 0.02465
9.62500 0.01142
9.87500 0.06077
10.12500 0.07267
10.37500 0.06055
10.62500 0.07102
10.87500 0.06974
11.12500 0.05607
11.37500 0.08136
11.62500 0.07360
11.87500 0.05657
12.12500 0.09172
12.37500 0.08171
12.62500 0.08857
12.87500 0.07791
13.12500 0.09414
13.37500 0.07182
13.62500 0.07503
13.87500 0.06424
14.12500 0.01477
14.37500 0.02588
14.62500 0.08527
14.87500 0.03956
15.12500 0.03433
15.37500 0.03511
15.62500 0.08507
15.87500 0.03336
16.12500 0.09308
16.37500 0.07369
16.62500 0.10103
16.87500 0.11193
17.12500 0.05921
17.37500 0.07926
17.62500 0.08314
17.87500 0.08751
18.12500 0.06009
18.37500 0.04499
18.62500 0.04089
18.87500 0.02286
19.12500 0.12124
19.37500 0.04372
19.62500 0.05689
19.87500 0.02406
