0.05000 -429391.44482 -6449.89142 199043.44078 252990.20193 205810.88333 325753.74679
0.15000 -262664.65839 2074.58895 7533.22620 124522.86180 55524.60555 203410.82476
0.25000 -145357.47233 665.71809 -6839.80390 53911.22104 24334.96033 112476.19327
0.35000 -97388.23199 75.56754 -1873.72072 31905.15055 9154.18729 75337.12277
0.45000 -73724.06524 176.58532 -1430.04013 23542.39917 10827.90198 56791.40690
0.55000 -58801.72975 193.21750 -1162.19445 17713.77402 4320.19529 44981.25168
0.65000 -48601.47577 -121.86784 -2001.61091 14500.27259 7026.49075 37237.79450
0.75000 -41343.97552 -42.14047 -718.44514 11738.53882 3518.86495 31686.83149
0.85000 -36444.04735 -3.98495 -1810.30799 10268.33397 2992.09026 27340.18192
0.95000 -32607.05101 -52.90261 -773.67092 8858.02986 2825.96825 23942.50366
1.05000 -29263.29842 -2.14664 -872.24175 8576.28066 2447.59231 21121.30681
1.15000 -26735.71508 25.43870 -571.28289 6732.75856 1761.02590 18985.47466
1.25000 -24501.54780 49.86180 -277.39900 5867.03669 1483.42991 17002.10550
1.35000 -22612.47214 59.99479 -585.41949 5499.70936 1728.13225 15443.26970
1.45000 -20980.37490 34.53943 -462.00835 5181.37687 1736.59428 14346.00592
1.55000 -19903.86710 -14.55319 -791.74455 4251.02534 1439.30953 12940.83281
1.65000 -18816.02585 18.87286 -392.87425 4155.05473 1360.50776 11995.50816
1.75000 -17894.90452 22.08665 -166.45132 4225.89791 1835.32715 10995.54805
1.85000 -16955.60388 12.66025 -493.92224 3363.26248 1353.99842 10503.59708
1.95000 -16209.58693 2.07682 -111.06817 5079.14969 1891.00457 9896.23328
2.05000 -15663.47060 22.60238 -494.42582 2727.31900 873.80944 8854.60987
2.15000 -14987.04802 8.15573 -265.52841 2858.55349 1281.57593 8444.92372
2.25000 -14417.85577 1.21936 -82.05273 2649.69782 841.27419 8014.26355
2.35000 -13942.58059 5.76294 -364.96738 2541.75030 835.48825 7521.32497
2.45000 -13478.14775 18.25488 -57.49102 2879.26051 2338.56097 7069.92841
2.55000 -13202.79350 35.28585 -284.15642 2115.25056 895.36373 6769.02420
2.65000 -12819.93335 34.98711 -329.93139 2186.84884 1204.32447 6680.45411
2.75000 -12516.74035 25.86949 -215.65181 1812.29506 1165.68412 5993.72653
2.85000 -12131.64444 -18.28500 -47.92755 1988.18958 979.11088 5747.12141
2.95000 -11892.34807 18.47298 -215.83467 1519.54786 727.22458 5299.92748
3.05000 -11667.98608 2.28302 -83.80259 1509.84460 822.48807 5093.88183
3.15000 -11414.46416 -2.42232 -89.00691 1413.15555 932.65642 4862.85773
3.25000 -11200.34867 27.46780 -151.91482 1584.60128 653.80357 4588.20870
3.35000 -10924.60854 4.61698 -146.34039 1275.33683 854.02313 4383.05293
3.45000 -10766.14104 -8.53798 -134.22276 1357.73415 1076.44674 4209.10549
3.55000 -10601.33906 13.75434 -78.45690 1247.73842 1099.75967 4093.09303
3.65000 -10418.07403 21.44444 -188.92621 1361.35097 711.43170 3981.63036
3.75000 -10183.79184 14.13228 -100.08991 1248.14220 560.76329 3743.89130
3.85000 -10013.99187 59.50470 -58.31177 1179.40630 1070.42769 3701.75426
3.95000 -9816.75100 8.06352 -197.41693 1785.45233 1087.47088 3735.47483
4.05000 -9714.92543 13.80216 -218.35944 873.65780 647.05981 3273.38437
4.15000 -9554.19135 26.60184 -71.63394 878.05129 485.51102 3119.74444
4.25000 -9399.96927 20.96158 19.35106 1116.42466 514.92949 3102.11875
4.35000 -9224.31326 26.30975 -168.69150 801.44383 432.69441 2921.78081
4.45000 -9089.28170 27.75173 -93.32605 790.74563 512.08348 2814.86916
4.55000 -8940.42437 30.99189 -10.00325 637.57104 475.53206 2701.24383
4.65000 -8797.11555 18.52389 33.62331 708.57054 604.47140 2622.18654
4.75000 -8652.89382 1.26343 -76.65637 894.82132 457.21331 2513.35550
4.85000 -8514.35873 3.80456 -141.90495 616.30130 904.97343 2500.98982
4.95000 -8392.11906 30.18913 -121.05774 605.49180 573.44708 2511.36856
5.05000 -8256.40019 15.77324 -164.74555 937.95180 477.73749 2452.86762
5.15000 -8151.31978 4.29530 -91.02964 593.28212 376.95163 2228.18582
5.25000 -8048.49952 14.46781 -127.25923 633.26691 389.80455 2293.08765
5.35000 -7918.86250 13.60555 -76.46047 691.28959 672.14245 2182.17436
5.45000 -7791.42789 13.12438 -67.44220 460.02981 305.93701 1995.72303
5.55000 -7678.24701 11.32761 -6.32581 627.52982 459.96741 2019.02532
5.65000 -7557.97783 2.28151 -62.86788 675.20094 432.98260 2291.32342
5.75000 -7474.61227 16.02190 -67.39148 391.83854 306.23733 1830.43015
5.85000 -7340.00144 10.63061 -95.12144 519.09738 382.96325 1819.97518
5.95000 -7253.45173 17.69617 -99.64852 513.76596 593.21114 1744.13369
6.05000 -7146.72954 12.81819 -117.52022 493.35462 394.74819 1713.66218
6.15000 -7059.67368 124.83650 -116.64599 724.71234 4680.32455 1975.10678
6.25000 -6959.07952 -1.56933 -116.20181 387.97269 359.55744 1584.84095
6.35000 -6873.15827 13.53093 -59.85661 375.75807 395.72603 1589.61513
6.45000 -6785.86992 6.24654 -93.89480 563.14128 402.12913 1546.29566
6.55000 -6711.33553 11.64322 -23.60178 348.70381 306.47695 1495.87688
6.65000 -6614.42881 15.52871 -59.94007 410.75991 319.43451 1492.01573
6.75000 -6541.90192 18.86178 -91.04630 524.51805 402.24866 1598.81276
6.85000 -6457.51061 10.97679 -95.70349 466.93024 273.26995 1380.22558
6.95000 -6398.66708 1.93706 -31.91426 499.97859 416.67699 1353.15545
7.05000 -6302.77094 2.54068 -14.85054 383.03815 295.65609 1334.39074
7.15000 -6244.95631 12.74981 -66.47273 444.00995 286.12699 1311.04219
7.25000 -6171.23383 5.43553 33.06937 706.16252 337.27390 1355.32266
7.35000 -6113.80772 20.22509 -61.46358 313.20799 327.12276 1252.26415
7.45000 -6049.39951 15.67731 -42.35793 331.85481 311.92510 1201.52905
7.55000 -5957.70065 11.99088 -90.04891 412.06669 355.29746 1193.40406
7.65000 -5933.14036 22.77462 -57.93749 373.75809 291.20396 1151.52119
7.75000 -5840.08023 3.94067 -111.31822 351.66886 346.33047 1187.77905
7.85000 -5802.94912 11.20106 -66.55903 277.09862 195.32132 1091.62976
7.95000 -5722.80066 10.28066 -82.58990 270.13209 199.64202 1062.19815
8.05000 -5655.00849 0.23992 -71.69356 343.79352 375.59188 1120.68651
8.15000 -5595.57712 -0.28547 -48.38087 466.50937 327.29951 1365.49638
8.25000 -5549.87629 23.87374 -92.47928 301.00877 379.51422 1014.44366
8.35000 -5507.01323 30.71090 -117.33269 398.81348 262.48277 989.31798
8.45000 -5424.40062 12.14191 -109.66402 567.92060 1677.45242 1558.79658
8.55000 -5382.50890 6.85630 -107.39658 292.26713 237.47599 924.38509
8.65000 -5302.76895 8.89754 -177.95975 466.70105 366.68346 958.41545
8.75000 -5267.00103 13.76400 -151.40148 261.38787 273.67261 919.57368
8.85000 -5229.74232 23.73745 -158.30573 1062.89477 343.59798 1796.63263
8.95000 -5159.51788 8.64617 -109.55555 267.77675 195.33430 922.16693
9.05000 -5091.07001 10.47627 -132.08779 1098.91339 1305.37853 934.25283
9.15000 -5049.65178 1.95509 -140.50968 220.19729 168.77341 836.27923
9.25000 -5015.14069 15.57579 -167.15375 249.43238 235.14847 828.22856
9.35000 -4965.57767 3.84965 -137.47631 314.11960 200.33245 814.36551
9.45000 -4928.96181 9.76097 -149.84639 210.53179 202.79720 789.09938
9.55000 -4876.01183 -5.20954 -120.45348 212.50230 252.37807 787.98759
9.65000 -4837.09442 1.43641 -150.37615 186.52783 254.72951 774.85853
9.75000 -4780.96273 8.48918 -103.66261 244.42873 262.34109 737.72395
9.85000 -4744.68267 9.10732 -82.25641 225.38107 193.19871 708.16273
9.95000 -4690.46016 8.05862 -82.87555 186.59309 202.91178 705.87788
10.05000 -4653.14686 -5.13998 -100.19402 208.00611 255.83799 664.98648
10.15000 -4619.70573 1.73256 -123.92267 269.68466 230.07528 684.29720
10.25000 -4558.28228 5.96940 -119.00691 308.64936 384.54319 774.55519
10.35000 -4521.39990 2.77076 -65.17428 286.02267 249.14351 705.51897
10.45000 -4474.15024 -6.78365 -86.35228 199.83565 245.78122 641.77458
10.55000 -4381.61190 -173.23600 -52.22109 1302.32030 5157.52015 1045.69023
10.65000 -4390.25698 6.23445 -44.72120 165.14737 217.06172 617.34322
10.75000 -4358.03222 5.18117 -77.00873 201.63628 137.99053 609.08862
10.85000 -4317.57455 17.91766 -60.21778 185.95378 178.05617 605.77726
10.95000 -4280.47863 16.71675 -50.04928 191.61567 159.01040 582.43920
11.05000 -4240.51934 13.50045 -46.71526 229.23653 156.29080 606.04081
11.15000 -4199.50412 -13.32973 -54.10007 311.59414 406.62983 677.75564
11.25000 -4177.03549 5.04887 -75.41239 202.70707 283.03763 584.09844
11.35000 -4131.15390 5.75521 -27.26214 228.44941 154.16655 625.43441
11.45000 -4096.15122 5.11616 -95.22841 184.21027 131.24152 521.25262
11.55000 -4045.78776 -2.17188 -34.74372 226.64656 183.55176 533.11686
11.65000 -4019.42364 3.29341 -52.80934 141.35967 125.15340 513.99865
11.75000 -3986.45012 -2.92523 -30.47134 135.88107 127.77115 482.25790
11.85000 -3947.36027 7.13673 -88.67620 204.83573 168.84062 491.81495
11.95000 -3929.10319 17.03870 -28.08447 208.04474 167.06280 540.49109
12.05000 -3883.99397 2.97663 -88.37212 135.50099 156.11899 491.64141
12.15000 -3857.36492 2.22122 -74.95234 134.47069 111.63554 461.05235
12.25000 -3835.29463 -8.35557 -35.14162 274.66104 277.76094 539.67004
12.35000 -3798.82909 -6.55794 -75.62097 144.08271 134.10355 448.04300
12.45000 -3748.56154 -6.09393 -59.58398 124.09470 121.41837 446.07433
12.55000 -3730.32030 -17.73198 -72.05147 218.99481 173.92380 428.22586
12.65000 -3702.29527 4.12909 -78.85254 135.24566 201.26605 447.54860
12.75000 -3676.77482 -0.16477 -34.08802 137.82747 142.16104 407.30611
12.85000 -3646.43498 -2.71781 -108.33853 176.94258 207.39636 425.32887
12.95000 -3618.00381 -13.54777 -105.83874 129.78482 132.39113 408.30483
13.05000 -3582.56271 4.07550 -93.67507 158.40576 136.42944 389.72787
13.15000 -3553.65672 -6.38293 -115.76280 122.71110 108.27195 392.49026
13.25000 -3516.91397 -15.07205 -91.71522 121.19492 201.80079 394.26475
13.35000 -3496.47288 -9.26881 -71.01024 159.42654 157.94324 388.46680
13.45000 -3484.49759 4.18352 -84.92742 145.28183 201.12546 364.01523
13.55000 -3454.42046 3.46178 -97.02924 113.00653 118.68755 361.20414
13.65000 -3434.55127 -1.78220 -113.53796 118.73274 110.71629 374.49097
13.75000 -3416.05293 3.13590 -68.37934 117.13879 99.58200 360.50866
13.85000 -3383.90741 5.47819 -84.94607 117.44863 110.99074 347.70668
13.95000 -3347.21462 16.91440 -118.62106 206.42476 263.99086 367.09783
14.05000 -3322.61555 7.23393 -98.95426 184.97148 171.28803 388.56130
14.15000 -3311.04670 5.46610 -116.60826 94.41465 98.37730 330.42735
14.25000 -3287.07439 -4.79639 -95.20868 131.87909 142.52893 331.83399
14.35000 -3248.26114 -8.34170 -95.52866 117.52042 179.38892 334.72495
14.45000 -3210.05476 -8.28328 -87.98371 254.65170 128.31005 343.25480
14.55000 -3209.60488 -0.09378 -73.66676 116.88829 96.11303 316.22279
14.65000 -3183.59491 1.97400 -105.72869 110.85967 97.61381 310.58333
14.75000 -3149.49132 1.99922 -102.20318 126.26425 110.14964 310.22624
14.85000 -3141.92944 -4.59819 -90.47194 103.64575 98.75491 308.68313
14.95000 -3110.21586 18.63585 -140.41384 138.04890 365.20186 302.35004
15.05000 -3128.11402 8.72333 -95.89766 454.17796 164.79523 365.89979
15.15000 -3075.30368 12.62080 -66.83335 112.99215 108.46521 281.12237
15.25000 -3049.30459 3.35367 -84.13383 104.49668 129.73737 302.80751
15.35000 -3027.36564 17.08638 -87.94469 151.91327 190.11537 288.90658
15.45000 -2997.84379 -2.64013 -67.88211 199.81917 144.88078 274.17893
15.55000 -2983.46848 9.25551 -107.47816 101.22062 105.07719 258.94702
15.65000 -2944.33851 -0.17691 -78.95480 121.56839 106.43984 291.40287
15.75000 -2932.87114 3.47812 -73.18993 121.24835 89.44759 256.21195
15.85000 -2910.61565 12.13848 -71.57955 138.42649 126.79295 260.38501
15.95000 -2878.27402 8.48924 -117.84856 110.03597 106.85766 258.89641
16.05000 -2860.75949 -0.42107 -108.57797 109.65229 104.33220 249.75366
16.15000 -2847.28772 0.07330 -113.96608 108.45385 96.72348 238.38677
16.25000 -2839.00374 -12.69674 -107.16716 122.25233 194.48556 243.10089
16.35000 -2816.08610 -0.26872 -91.60073 132.49855 112.07680 266.74126
16.45000 -2789.02948 35.81722 -97.44972 126.55349 410.92542 232.69823
16.55000 -2788.28930 7.67222 -102.98270 99.73905 104.95679 242.45615
16.65000 -2761.70003 -11.48991 -91.09337 103.13478 96.14052 254.45779
16.75000 -2759.57251 7.55796 -77.70186 141.97447 104.40157 244.77009
16.85000 -2716.04580 19.35406 -132.33458 122.72694 238.23614 312.38614
16.95000 -2711.21848 -7.84888 -115.05635 105.49139 98.71207 231.13103
17.05000 -2693.06478 -6.86967 -122.25507 100.65583 129.72652 219.44331
17.15000 -2659.42846 9.00862 -46.69783 237.37481 142.89215 245.31276
17.25000 -2651.45902 4.19965 -96.25494 137.72459 96.09390 207.95471
17.35000 -2636.76534 -0.74276 -77.29076 105.28109 92.23183 222.49363
17.45000 -2598.49884 -4.94272 -102.87916 99.23681 100.80180 221.36596
17.55000 -2599.78020 -11.52118 -111.63446 108.88981 97.42249 213.32080
17.65000 -2595.85256 -2.26478 -72.89763 103.49978 98.72328 200.76555
17.75000 -2591.19634 -10.06844 -109.34622 96.94303 115.30667 176.35884
17.85000 -2558.54888 6.78575 -102.64377 106.28378 103.26635 202.70263
17.95000 -2554.46223 3.75016 -110.95469 95.29279 95.78860 191.17384
18.05000 -2545.63051 -7.98963 -63.83487 104.22440 94.80251 198.88538
18.15000 -2523.04902 -1.13515 -123.06861 108.69322 99.37913 200.38246
18.25000 -2486.40500 15.78326 -100.83326 96.63355 85.76895 188.88360
18.35000 -2468.00107 11.10431 -107.81268 102.41964 109.83852 167.25811
18.45000 -2460.42742 -5.82406 -105.23405 99.27200 93.40993 204.42827
18.55000 -2452.69872 -4.44405 -104.96926 107.46917 137.36583 194.20178
18.65000 -2427.86500 -13.68298 -143.79959 168.71514 154.24049 181.79455
18.75000 -2426.47247 2.93316 -116.93203 147.75871 86.50050 191.71555
18.85000 -2434.26974 11.62898 -87.30757 112.59899 94.53838 149.65627
18.95000 -2387.14170 -10.73986 -119.76404 128.20510 83.57660 179.23453
19.05000 -2375.41495 -2.68055 -86.49703 108.49257 102.56107 224.93775
19.15000 -2369.49160 9.95416 -119.63651 90.43682 94.36791 156.68926
19.25000 -2344.10264 24.59315 -65.27624 119.22538 178.82415 217.56775
19.35000 -2349.80839 8.11561 -112.37334 96.75982 96.25992 175.91809
19.45000 -2323.28197 -10.90370 -174.08822 94.38119 100.12132 164.74522
19.55000 -2297.10845 -0.88090 -85.98084 106.33859 83.47001 150.74301
19.65000 -2310.29122 -1.78971 -175.88495 104.64772 81.74113 155.13795
19.75000 -2281.09281 -12.36581 -103.15138 95.34457 91.42849 139.68154
19.85000 -2265.63639 -5.00793 -140.10397 113.75670 109.76994 149.44276
19.95000 -2255.21420 6.19935 -125.79714 112.75922 92.16403 163.01625
