0.15 0.50202 7.70492 0.92024 63.41709 62.7086 60.89151
0.45 1.10307 22.66927 0.58889 62.61797 61.93079 59.68017
0.75 0.26002 36.69683 0.77996 62.5774 62.18011 58.68723
1.05 -0.45592 51.07982 0.19326 62.33008 62.02897 58.74702
1.35 -0.31642 63.70011 -0.02644 61.95109 60.74968 57.26196
1.65 0.65207 76.80734 0.66088 60.99838 58.35582 56.21149
1.95 -0.21064 88.8069 0.41697 59.91596 57.65215 55.28837
2.25 -1.22698 98.84336 0.47473 58.02029 55.85034 53.96392
2.55 -0.88944 109.72467 0.05278 56.41694 53.72473 51.95957
2.85 -1.03579 120.12298 -0.29707 54.45366 52.2376 51.3138
3.15 -0.34748 128.49311 0.31111 52.53824 50.85072 50.47572
3.45 -0.46083 138.06999 0.68375 51.00632 49.3462 48.69622
3.75 -0.28482 145.44384 0.01765 49.72343 47.60105 46.6399
4.05 -0.42097 153.05938 -0.02843 47.52232 46.39955 45.36486
4.35 -0.9326 159.90178 -0.01498 46.71778 43.94564 43.59163
4.65 0.0467 166.36199 -0.10043 45.75917 42.3561 42.25729
4.95 0.31406 172.54751 0.60972 44.27736 40.27651 40.41988
5.25 -0.04135 177.60824 -0.06398 43.37063 38.49999 39.26476
5.55 0.43021 181.38402 0.18244 42.31591 36.80318 38.30743
5.85 0.02036 185.42506 0.54828 41.39897 36.37914 37.44789
6.15 0.10065 189.36734 0.58217 40.2923 35.08573 36.04451
6.45 0.24514 192.76063 0.2781 39.5178 33.63792 35.20879
6.75 0.42081 196.4271 0.60588 38.40151 32.60627 33.76662
7.05 -0.40669 199.28376 0.10079 37.08234 31.6379 33.04086
7.35 -0.33418 201.98936 0.07521 36.46417 30.09016 31.98089
7.65 -0.11513 204.48032 -1.01145 35.29873 29.20343 31.01651
7.95 -0.45653 206.40069 -0.70756 34.47739 28.2145 29.86701
8.25 -0.88769 207.60152 0.00615 33.35008 27.38771 29.17818
8.55 -0.9278 209.51288 -0.53125 33.17641 26.40829 28.11617
8.85 -0.50306 211.20009 -0.01695 32.19711 26.10919 27.56968
9.15 -1.05478 212.54117 0.09417 31.36188 25.44676 26.73359
9.45 -0.58594 214.1273 -0.30539 30.60773 24.44531 25.80605
9.75 -0.5972 215.35457 -0.29342 30.21619 23.58977 25.11795
10.05 -0.51699 215.80746 -0.02939 29.51024 22.8977 24.24335
10.35 0.05333 216.72665 -0.6051 28.99953 22.40339 23.48139
10.65 -0.22961 217.85901 -0.45612 27.68977 21.84151 22.61738
10.95 -0.0896 218.16883 -0.95199 27.39073 21.07434 22.135
11.25 0.13275 218.57241 -0.84548 26.73203 20.69969 21.53594
11.55 0.27581 219.30916 -0.6308 26.12162 20.54833 20.99132
11.85 -0.06989 220.19864 -1.12499 25.35489 19.74958 20.2286
12.15 0.33367 220.20763 -1.36774 25.11829 19.26247 19.74835
12.45 0.16893 220.78178 -0.81221 24.53056 18.30957 18.96168
12.75 0.31863 220.51411 -1.32073 23.77847 18.28606 18.84991
13.05 0.45232 220.98142 -0.60805 23.23522 17.67117 17.90243
13.35 0.1177 221.21039 -0.96582 22.93509 17.30163 17.90422
13.65 1.01246 221.48411 -0.49281 22.36158 17.07936 17.11163
13.95 0.33043 221.60227 -0.92492 21.84481 16.18665 16.28251
14.25 0.33394 221.8286 -0.54164 21.42685 16.24901 16.34919
14.55 0.47401 221.49371 -0.51934 21.10158 15.62529 15.7996
14.85 0.28755 220.99623 -0.58027 20.82172 15.28358 15.49201
15.15 0.10587 221.58427 0.0232 20.18822 14.7512 15.18447
15.45 -0.06442 221.32455 0.12657 20.04696 14.05479 14.4792
15.75 -0.49474 220.76144 0.16888 19.75813 14.26057 14.44684
16.05 -0.33282 220.65566 0.59842 19.4435 14.01624 13.75921
16.35 0.3359 220.80537 0.21649 19.05919 13.40898 13.09242
16.65 0.09129 220.30767 0.56509 18.60154 13.33683 13.16864
16.95 0.57793 219.92717 0.54341 18.21117 12.93004 12.68581
17.25 0.39781 219.49503 0.26579 17.54604 12.56686 12.35777
17.55 0.54913 218.67042 0.0157 17.41167 12.49002 12.2526
17.85 0.64518 218.34517 0.74648 17.14711 11.90097 12.05338
18.15 0.30925 218.03139 0.25649 16.455 11.65966 11.5112
18.45 1.12837 218.09061 0.75844 15.79386 11.88348 11.13198
18.75 0.75352 218.03176 0.38673 16.30432 11.8854 11.13579
19.05 1.03117 217.39212 0.60144 15.28527 11.33398 10.84054
19.35 0.48806 217.64381 0.28527 14.73124 11.13462 10.44278
19.65 1.40749 217.20101 0.53026 14.56217 10.82283 10.1939
19.95 1.08115 216.81086 1.14188 14.17894 11.24679 10.08634
20.25 1.35713 216.84516 0.28138 14.18415 10.57326 9.67967
20.55 0.95104 216.706 0.46477 13.92764 10.4572 9.57843
20.85 0.60955 216.29789 0.38758 14.0255 9.60597 9.1561
21.15 1.27611 215.59666 0.17916 13.98715 8.9264 9.62367
21.45 0.0936 214.98548 0.25296 14.25521 8.41683 8.64668
21.75 -0.84975 214.07169 0.30649 13.85859 8.32987 8.93155
22.05 -0.4537 213.15951 0.58563 13.66501 9.44254 9.07063
22.35 -0.59784 213.6512 0.4828 12.73334 9.22525 8.77952
22.65 -0.61332 213.57882 0.20953 13.22102 8.73212 8.65114
22.95 0.40828 213.4735 -0.2064 12.3782 7.97507 8.50125
23.25 0.08883 213.21932 0.09257 11.83246 7.44354 8.05468
23.55 -0.41107 212.05699 0.1147 12.33108 7.15385 7.9665
23.85 -0.23196 210.8524 0.22105 11.74502 7.01394 7.63752
24.15 -0.70964 210.6275 -0.12046 11.76898 7.53517 7.5757
24.45 -0.13735 210.53378 -0.51928 10.86378 8.45246 7.35485
24.75 -0.53246 210.79239 0.35939 10.27109 7.92862 6.96571
25.05 -0.0417 210.71146 -0.36824 10.74439 8.12831 7.12123
25.35 0.07423 210.50643 0.18601 10.07602 7.69857 6.67787
25.65 0.71489 210.14016 -0.82749 10.20052 6.68299 6.85131
25.95 0.93198 208.74361 -0.15699 10.35955 6.13927 6.63272
26.25 -0.25488 208.09396 0.50253 10.4209 6.44493 6.4545
26.55 -1.01731 206.70545 0.38266 10.63678 6.12516 6.45232
26.85 -3.40573 206.60901 0.36119 10.27268 7.04623 6.93376
27.15 -2.95469 206.65944 -0.12116 10.04885 6.4915 6.67789
27.45 -4.34485 206.70065 -0.45769 10.00717 5.97787 6.43891
27.75 -2.39762 207.79718 -0.77805 9.97395 6.6347 5.32756
28.05 -0.4024 208.18207 -0.11741 9.79695 6.24358 5.75715
28.35 -1.40663 206.98331 -0.44967 9.2055 5.67445 5.71373
28.65 0.28404 205.8774 -0.11023 8.76986 5.92194 5.4879
28.95 0.53532 205.5946 -0.16963 9.43322 5.5701 5.42018
29.25 1.85498 203.94197 0.00427 9.04159 4.94447 5.56242
29.55 0.4171 203.22582 -0.55512 7.98256 5.41934 5.63465
29.85 -0.14477 202.16208 0.76942 9.15561 5.37404 5.40607
