0.05000 -1859.08678 -1261.94394 -1559.30619 2237.57660 2963.65442 2180.72113
0.15000 -4519.87755 183.22091 -1372.42779 2892.54760 2682.21377 5335.63582
0.25000 -5290.46581 92.01800 120.86966 2921.64796 3366.81033 7324.51172
0.35000 -6518.40196 210.57034 -95.59266 3376.71775 2851.92288 8176.17182
0.45000 -7564.60594 93.87211 -369.28700 3216.06284 2357.75688 8846.67774
0.55000 -7935.43505 126.05623 1.74533 3046.98041 2026.43221 9011.74820
0.65000 -8287.65386 112.22377 -20.48467 2986.84541 2173.58599 9304.82104
0.75000 -8821.67496 44.89518 129.02704 2662.90874 1988.55528 9052.08058
0.85000 -8808.69625 65.14234 597.49069 2742.22072 2118.02222 9043.65157
0.95000 -9030.62759 109.19140 156.86386 2539.22415 1823.10980 8742.72072
1.05000 -9062.97953 137.55710 95.70734 2217.23611 1737.59409 8333.38281
1.15000 -9033.05703 145.60689 -118.33322 2225.80007 1623.58051 7974.82922
1.25000 -8940.29980 107.78512 823.86260 2038.19707 1630.20930 7701.16772
1.35000 -8975.47249 65.11311 328.71411 2018.13700 1515.88478 7396.51840
1.45000 -8864.08613 79.34555 -100.09760 2020.24711 1792.28551 7207.84838
1.55000 -8790.90553 40.65934 -90.49940 1880.55233 1747.70274 6917.68835
1.65000 -8685.42956 63.52311 -59.22637 1566.06763 1354.21339 6563.79060
1.75000 -8597.81827 96.95675 197.92573 1574.57115 1452.96003 6282.64489
1.85000 -8623.42309 84.13332 -28.46327 1462.64739 1373.52940 6034.67274
1.95000 -8534.98950 49.47641 73.27597 1372.99403 1269.99368 5954.09227
2.05000 -8506.46803 64.00947 137.25220 1317.64434 1362.46880 5727.73516
2.15000 -8466.70835 55.74804 129.70251 1370.73736 1269.62043 5558.72084
2.25000 -8469.08180 42.01214 -26.86468 1283.20140 1238.82343 5366.81151
2.35000 -8481.39633 59.16693 -70.76576 1197.42264 1146.25446 5160.13158
2.45000 -8438.22344 34.44400 102.20559 1118.73833 1064.03632 4992.58112
2.55000 -8380.10419 44.94132 -7.18076 1135.70531 1064.81141 4761.85066
2.65000 -8325.86325 87.45385 -79.98676 1131.19469 1038.33401 4786.47879
2.75000 -8325.48903 55.56853 51.73527 1006.40618 988.49617 4544.45179
2.85000 -8236.27394 59.64429 19.51969 1097.37362 931.47244 4402.45692
2.95000 -8192.85981 64.43879 -55.78354 1040.14062 843.21685 4249.17880
3.05000 -8150.90196 54.99471 -73.78995 1016.58672 880.40324 4106.31123
3.15000 -8078.13129 44.43876 105.80595 1051.93765 827.47099 3987.27491
3.25000 -8027.78478 74.64320 -93.42683 948.74111 794.05467 3889.94377
3.35000 -7967.53043 84.24482 135.65774 822.11348 714.83154 3713.71877
3.45000 -7899.23918 51.33328 -15.90736 881.88673 744.05560 3638.75765
3.55000 -7833.02231 43.21034 -87.78999 832.12238 653.33639 3547.48506
3.65000 -7790.20645 46.70743 -45.83007 794.86265 620.55389 3444.73653
3.75000 -7733.16235 58.19420 -40.38622 753.74409 644.76443 3299.21217
3.85000 -7635.14891 53.31323 -100.67435 773.12066 572.64913 3257.40402
3.95000 -7601.93201 42.93617 -51.25844 699.75483 627.40595 3060.79106
4.05000 -7494.07093 42.02220 48.42483 775.81471 614.64320 3086.84025
4.15000 -7432.61418 42.07773 35.09101 653.15052 521.27799 2925.35020
4.25000 -7364.92907 47.23907 46.18362 659.14423 513.55607 2825.08811
4.35000 -7265.10425 30.85964 21.11621 637.61428 553.75625 2770.95298
4.45000 -7212.14585 42.57904 -60.05694 638.12840 489.00172 2708.60743
4.55000 -7141.07712 17.18613 -17.65026 666.06189 681.64239 2660.61984
4.65000 -7053.87465 49.32664 -59.72240 769.85835 586.92178 2596.94657
4.75000 -7061.61615 45.08300 26.47730 624.95508 469.90780 2503.71654
4.85000 -6990.56190 54.48834 -61.38901 546.27337 458.25854 2432.00126
4.95000 -6936.62874 66.36401 10.59210 571.55618 461.38893 2384.55510
5.05000 -6892.34227 33.10510 -5.62315 537.44114 406.53418 2310.24951
5.15000 -6859.42678 50.21657 47.17185 507.86869 460.47181 2251.56578
5.25000 -6797.57148 48.51535 -14.70232 587.89084 473.49588 2220.85141
5.35000 -6725.70064 39.50380 -82.74492 595.24403 426.19581 2165.16743
5.45000 -6699.12807 48.74597 -76.81665 498.78550 425.96644 2101.91792
5.55000 -6638.68703 36.29594 -4.93014 476.94590 397.35194 2035.00563
5.65000 -6586.19176 37.15868 -109.83686 524.86747 373.69082 1999.54791
5.75000 -6520.06785 43.61938 -77.37534 489.22738 439.54436 1988.08586
5.85000 -6455.01340 41.53607 -26.03987 482.91944 368.69822 1939.65127
5.95000 -6421.66439 25.96520 -31.18674 423.37405 382.95598 1861.46675
6.05000 -6366.60817 34.87117 -122.99889 530.75547 335.82105 1825.45635
6.15000 -6319.60156 36.21902 -57.86282 520.82972 395.82713 1789.10059
6.25000 -6242.24365 24.22054 -54.20603 589.16250 437.26747 1707.12525
6.35000 -6194.05672 29.52696 -78.22596 549.13914 435.42426 1744.37913
6.45000 -6176.53775 37.74479 -15.62130 512.94621 387.10558 1676.47252
6.55000 -6127.48022 24.33350 -66.77689 381.84820 354.97442 1627.01923
6.65000 -6059.45210 23.12412 -66.66614 491.46653 432.81245 1605.02107
6.75000 -6011.27706 19.36452 -26.30494 380.34733 298.48134 1546.25224
6.85000 -5951.89463 33.56332 -55.85813 369.33616 339.88370 1535.78170
6.95000 -5908.57231 29.74194 10.27139 374.35006 286.72659 1498.02533
7.05000 -5844.01740 27.08558 -46.18500 466.98606 293.24737 1449.63667
7.15000 -5818.19678 35.76414 -7.09195 357.74441 298.60510 1376.35311
7.25000 -5752.45794 21.97699 67.84037 325.56679 316.49813 1365.49967
7.35000 -5701.68804 27.03991 -13.19328 332.50104 344.47480 1342.19227
7.45000 -5639.61396 29.70210 -119.31698 345.96682 359.18597 1351.43184
7.55000 -5608.93815 18.23386 0.32721 419.49963 352.50074 1287.01287
7.65000 -5561.06093 17.43141 -14.51765 331.23427 336.93995 1232.60168
7.75000 -5498.94149 20.52682 59.88014 301.26135 240.74966 1186.89548
7.85000 -5462.80398 21.33769 -21.33767 353.36122 345.78037 1211.31353
7.95000 -5417.62468 3.38606 -2.09328 295.52957 419.65252 1143.28744
8.05000 -5374.47730 25.98386 -32.91312 260.23558 265.36268 1120.28803
8.15000 -5310.60024 25.10720 33.16469 346.72125 282.58746 1146.91664
8.25000 -5293.18437 22.58306 -4.74335 332.61032 374.99224 1076.47083
8.35000 -5226.64527 22.65008 -46.07691 257.02083 216.76539 1086.85450
8.45000 -5192.89355 19.33870 -33.86367 268.57715 228.20150 1030.18445
8.55000 -5147.42348 25.09582 -9.25595 610.64122 405.96821 1011.77716
8.65000 -5099.64386 28.27069 -77.05751 273.64335 240.72822 993.10625
8.75000 -5057.47177 18.88615 -21.99457 297.60205 327.87866 979.13597
8.85000 -5010.70000 19.40383 -82.26883 261.84407 223.65018 981.43003
8.95000 -4973.72282 23.36329 -39.53460 300.19444 224.20512 952.16926
9.05000 -4932.43029 20.64856 -36.07828 266.69035 193.88670 896.09005
9.15000 -4881.76074 14.16725 -15.78105 256.22661 287.14695 896.49848
9.25000 -4843.65892 28.52385 19.12777 334.52367 246.76087 894.01695
9.35000 -4815.28908 16.00342 -36.66363 259.61562 268.12309 832.77383
9.45000 -4769.52946 33.65137 -66.88308 270.37925 277.24321 844.58046
9.55000 -4722.28436 10.21813 -67.13944 211.39657 191.62215 801.61801
9.65000 -4688.52824 14.76028 -10.23948 196.84525 204.25758 813.31765
9.75000 -4647.24754 17.56733 20.13743 228.62124 300.34122 844.85773
9.85000 -4606.82011 10.16731 -36.15181 277.36120 214.75794 775.72362
9.95000 -4573.33795 30.91760 -49.14002 296.78028 300.81323 731.54637
10.05000 -4520.15716 16.99867 -32.47778 205.85379 227.15622 741.89778
10.15000 -4488.14501 23.15657 -14.22568 204.56666 258.42440 720.61896
10.25000 -4460.54872 16.93412 -35.52727 194.31677 224.56537 707.02455
10.35000 -4418.82575 22.82239 -17.52848 165.76238 166.53680 716.94459
10.45000 -4382.97800 14.52294 -30.41470 145.76707 162.62652 663.31518
10.55000 -4347.50757 21.77286 -0.95412 194.07766 240.45001 669.66356
10.65000 -4316.24307 10.52821 -14.75782 182.25603 272.41340 642.57247
10.75000 -4284.59896 16.17554 23.96491 350.16393 210.36284 688.94046
10.85000 -4229.71233 20.81229 9.26826 283.61899 180.89893 600.32735
10.95000 -4194.59262 21.79287 -10.72928 286.68784 171.92132 603.89666
11.05000 -4169.41550 10.38590 -1.59991 154.69138 181.29121 616.95762
11.15000 -4133.02668 10.02086 -20.66406 147.51259 128.56594 593.79870
11.25000 -4117.02593 10.08084 18.79880 293.88502 156.96955 592.48125
11.35000 -4074.43373 12.40436 54.89263 128.23504 150.94985 542.94120
11.45000 -4033.95432 5.92840 16.22432 215.03627 275.40115 539.75562
11.55000 -4013.60206 2.35913 50.98143 232.43194 164.84336 666.60579
11.65000 -3984.76744 14.42577 17.59533 159.62798 154.15431 494.69929
11.75000 -3944.15996 1.96619 28.92026 158.28147 319.53352 527.17617
11.85000 -3916.18408 6.19229 58.76046 186.83738 231.03274 505.85822
11.95000 -3889.85466 13.93453 52.68661 251.55185 179.54127 486.90154
12.05000 -3849.55734 21.06507 46.01255 122.01475 211.34481 484.09628
12.15000 -3833.66992 6.67314 32.63924 117.29970 136.77669 449.40476
12.25000 -3810.29419 8.38966 39.02514 157.55518 208.11932 446.37493
12.35000 -3775.53492 10.44822 62.75979 188.84206 131.10105 469.77234
12.45000 -3747.89977 0.72566 39.29397 154.70056 227.24817 467.15612
12.55000 -3716.53144 18.18731 24.87173 98.01860 177.30034 445.54937
12.65000 -3690.98057 12.00129 36.28307 133.83439 114.54336 430.37935
12.75000 -3676.32216 14.22921 21.24554 177.18117 128.27077 443.52548
12.85000 -3625.68231 19.26761 35.28308 191.23552 150.19805 460.32011
12.95000 -3612.39542 6.44901 32.51335 193.35354 155.17588 439.98775
13.05000 -3580.44417 14.79403 26.67778 133.78303 114.91049 400.71336
13.15000 -3551.27848 8.33310 23.25539 163.72732 158.93629 417.05135
13.25000 -3527.09378 9.67533 36.58212 105.39162 133.94526 409.72189
13.35000 -3492.38497 15.49222 5.04750 147.27978 204.71559 492.37095
13.45000 -3474.98987 8.17968 -0.73942 139.26014 231.17282 381.14191
13.55000 -3444.26946 6.96790 41.19318 109.61235 94.56926 373.93084
13.65000 -3435.36975 8.85439 16.24923 259.84400 116.63834 355.31841
13.75000 -3400.66842 12.00906 1.98749 110.22958 102.20825 351.28928
13.85000 -3374.63633 7.30175 6.72742 103.62760 96.62153 354.13857
13.95000 -3347.73156 4.85716 22.29513 85.76344 86.65652 335.51570
14.05000 -3324.18588 5.99314 -0.75911 82.72439 86.02367 319.17669
14.15000 -3299.32419 -10.75672 36.38929 224.48071 194.02244 322.94378
14.25000 -3279.80837 8.37946 8.90362 105.09333 94.45297 325.32484
14.35000 -3252.52404 11.81886 -7.54588 226.01773 138.39941 322.42846
14.45000 -3227.87534 6.04366 -7.87764 90.55941 65.50148 307.31957
14.55000 -3206.41193 8.49904 -14.55966 136.88315 191.79699 326.10540
14.65000 -3188.09604 3.66335 29.63622 121.57642 102.45305 293.32650
14.75000 -3165.24047 12.48670 -23.82457 128.69982 115.66426 353.50106
14.85000 -3147.65327 3.58814 -3.23083 152.48235 163.28375 288.65385
14.95000 -3118.94500 8.59475 -12.53496 164.85209 93.43429 281.99488
15.05000 -3111.20414 5.72290 -31.81544 101.41662 98.01618 284.90062
15.15000 -3088.81989 7.41625 -35.43047 94.01667 121.34361 309.06163
15.25000 -3059.27730 15.54819 -10.64889 192.93193 148.52706 273.66280
15.35000 -3043.73514 16.69345 -29.41218 130.70978 246.43402 307.58485
15.45000 -3029.49979 4.53195 -64.53448 167.72077 194.71328 302.75457
15.55000 -3010.13271 12.55790 -32.75973 158.40751 175.10914 360.18246
15.65000 -2986.34646 14.26694 -38.60179 91.49860 160.47582 294.46150
15.75000 -2971.15222 10.83532 -27.76546 103.49595 78.34134 262.81544
15.85000 -2943.98463 14.54706 -20.97367 131.83621 121.21365 243.15612
15.95000 -2941.70028 -4.19778 -69.20957 97.67970 210.99928 474.91255
16.05000 -2930.77525 7.71171 -43.32468 116.88960 118.21052 243.68084
16.15000 -2903.18041 5.15931 -59.18254 79.59718 88.77864 246.71049
16.25000 -2879.16426 6.21915 -47.95135 110.53462 75.26434 224.36517
16.35000 -2882.59602 5.36399 -59.69862 366.13461 143.15070 432.64525
16.45000 -2835.96121 1.10270 -46.87996 98.38936 63.86350 215.69065
16.55000 -2826.23069 8.25423 -44.92746 82.21650 71.91929 217.69659
16.65000 -2797.01261 9.53056 -61.15098 80.73930 84.55164 220.26379
16.75000 -2788.91324 12.78112 -25.58110 119.06553 119.25573 230.93741
16.85000 -2761.73840 4.94435 -26.16462 74.34403 69.56040 195.12091
16.95000 -2750.78261 10.98215 -45.51864 96.60220 59.39592 193.21391
17.05000 -2723.64488 8.95037 3.45898 61.03772 45.91605 180.89031
17.15000 -2696.00929 0.30798 -31.66951 75.87379 55.08944 188.37249
17.25000 -2682.07324 0.57142 -28.14767 49.21603 86.38466 196.94909
17.35000 -2661.59796 5.85127 -35.48245 61.83796 64.68744 180.51594
17.45000 -2641.85757 16.96696 -15.01356 96.60648 107.02117 186.63967
17.55000 -2629.50405 2.65954 -11.60466 55.53452 51.30571 164.32068
17.65000 -2615.99870 57.07093 7.63863 153.34345 635.48432 176.34732
17.75000 -2598.24669 6.96112 4.32905 87.16734 73.63694 163.71096
17.85000 -2594.33533 15.45293 6.22066 174.42314 137.96209 170.99550
17.95000 -2555.76237 9.13042 17.35852 197.14435 54.02770 142.12721
18.05000 -2549.78392 -0.14866 5.08270 57.78370 130.45523 202.95386
18.15000 -2537.48017 0.73335 -26.96277 59.55849 52.54840 167.24069
18.25000 -2527.00250 8.09437 6.33885 87.63276 130.31341 159.52681
18.35000 -2497.04261 23.46636 17.05858 65.91177 264.24202 201.48895
18.45000 -2483.17067 4.36261 -4.31712 123.47639 53.14377 156.68607
18.55000 -2473.35040 -1.50519 -11.00106 70.88936 128.80699 162.04580
18.65000 -2443.89766 -6.94937 -13.51690 132.90702 96.63972 144.47010
18.75000 -2450.24536 10.73275 -4.23427 65.17395 69.09072 141.91651
18.85000 -2436.98675 13.12562 -2.45999 59.10687 104.72541 136.39021
18.95000 -2423.84977 11.63145 -0.77483 66.37831 57.65237 143.12706
19.05000 -2400.99951 3.66794 0.36368 49.14577 49.68500 138.05586
19.15000 -2378.66928 -4.75746 -13.77931 70.56677 100.34190 223.35178
19.25000 -2352.62934 -13.09760 30.26376 188.34149 278.26037 381.15932
19.35000 -2388.36644 -16.85895 -23.20815 276.77503 194.88322 180.82368
19.45000 -2353.01035 5.15434 -26.70233 47.93975 44.74572 130.51084
19.55000 -2339.44277 -3.68692 -10.12339 53.75849 76.19427 123.95965
19.65000 -2321.13887 9.85620 -16.53731 72.66164 53.74407 118.73791
19.75000 -2301.92531 10.13623 -35.63075 70.63296 46.31034 165.82232
19.85000 -2304.71217 7.98313 -11.19521 75.11896 57.00826 142.23812
19.95000 -2283.58008 1.96057 -17.87085 53.74026 74.71006 118.84522
