0.120000 -1.409040
0.380000 -2.091360
0.620000 -2.081390
0.880000 -2.041050
1.120000 -2.044870
1.380000 -2.040490
1.620000 -2.036970
1.880000 -1.989010
2.120000 -1.979820
2.380000 -1.979680
2.620000 -1.967310
2.880000 -2.001780
3.120000 -1.995010
3.380000 -2.021690
3.620000 -2.030480
3.880000 -2.016850
4.120000 -2.036610
4.380000 -2.033920
4.620000 -2.047140
4.880000 -2.042750
5.120000 -2.008940
5.380000 -2.005320
5.620000 -1.989130
5.880000 -1.964510
6.120000 -1.964710
6.380000 -1.959490
6.620000 -1.936960
6.880000 -2.007080
7.120000 -2.070530
7.380000 -2.042670
7.620000 -2.203900
7.880000 -2.288590
8.120000 -2.298610
8.380000 -2.193770
8.620000 -2.162460
8.880000 -2.180790
9.120000 -2.095120
9.380000 -2.084140
9.620000 -2.183250
9.880000 -2.291910
10.120000 -2.476060
10.380000 -2.693790
10.620000 -2.679820
10.880000 -2.913360
11.120000 -2.901640
11.380000 -2.855250
11.620000 -3.073080
11.880000 -3.139900
12.120000 2.514880
12.380000 2.164080
12.620000 2.392060
12.880000 2.150880
13.120000 1.539610
13.380000 2.281270
13.620000 2.070360
13.880000 2.122470
14.120000 2.063430
14.380000 1.872840
14.620000 1.919660
14.880000 1.805380
