0.12500 0.02800
0.37500 0.05947
0.62500 0.13155
0.87500 0.21292
1.12500 0.26784
1.37500 0.31129
1.62500 0.35531
1.87500 0.38972
2.12500 0.42192
2.37500 0.45215
2.62500 0.48536
2.87500 0.51226
3.12500 0.54533
3.37500 0.55763
3.62500 0.57075
3.87500 0.58192
4.12500 0.56983
4.37500 0.54462
4.62500 0.51877
4.87500 0.45929
5.12500 0.39650
5.37500 0.32717
5.62500 0.27038
5.87500 0.24647
6.12500 0.23811
6.37500 0.24152
6.62500 0.25464
6.87500 0.26297
7.12500 0.29247
7.37500 0.28631
7.62500 0.27265
7.87500 0.24212
8.12500 0.21078
8.37500 0.16960
8.62500 0.15645
8.87500 0.11490
9.12500 0.10992
9.37500 0.08983
9.62500 0.07524
9.87500 0.04737
10.12500 0.04536
10.37500 0.06213
10.62500 0.08071
10.87500 0.09186
11.12500 0.08623
11.37500 0.07856
11.62500 0.08731
11.87500 0.08595
12.12500 0.06308
12.37500 0.05162
12.62500 0.05098
12.87500 0.05877
13.12500 0.07496
13.37500 0.06495
13.62500 0.07552
13.87500 0.06430
14.12500 0.06189
14.37500 0.09065
14.62500 0.11362
14.87500 0.09343
