0.12500 0.03371
0.37500 0.04910
0.62500 0.09966
0.87500 0.14079
1.12500 0.18094
1.37500 0.21984
1.62500 0.27531
1.87500 0.33200
2.12500 0.36163
2.37500 0.37999
2.62500 0.39338
2.87500 0.39395
3.12500 0.38830
3.37500 0.36616
3.62500 0.34635
3.87500 0.32135
4.12500 0.31546
4.37500 0.31852
4.62500 0.31568
4.87500 0.29195
5.12500 0.25136
5.37500 0.21552
5.62500 0.17981
5.87500 0.15377
6.12500 0.12985
6.37500 0.10399
6.62500 0.09437
6.87500 0.08596
7.12500 0.08702
7.37500 0.07401
7.62500 0.06507
7.87500 0.06864
8.12500 0.06971
8.37500 0.07797
8.62500 0.08973
8.87500 0.09683
9.12500 0.09233
9.37500 0.09017
9.62500 0.08254
9.87500 0.07312
10.12500 0.07451
10.37500 0.06583
10.62500 0.05622
10.87500 0.05230
11.12500 0.05269
11.37500 0.04099
11.62500 0.06556
11.87500 0.06899
12.12500 0.09178
12.37500 0.12112
12.62500 0.12371
12.87500 0.13490
13.12500 0.12568
13.37500 0.09150
13.62500 0.10497
13.87500 0.06173
14.12500 0.05243
14.37500 0.05404
14.62500 0.05004
14.87500 0.01792
