0.125 -0.000 -0.000 0.002
0.375 -0.000 0.001 0.047
0.625 0.007 0.012 0.238
0.875 0.005 0.006 0.619
1.125 -0.006 -0.006 1.183
1.375 -0.001 -0.016 1.962
1.625 -0.019 0.007 2.915
1.875 0.011 0.000 3.956
2.125 0.007 0.008 5.046
2.375 0.015 0.005 6.223
2.625 0.043 0.002 7.567
2.875 0.047 0.010 9.006
3.125 -0.009 0.027 10.656
3.375 -0.021 0.031 12.192
3.625 -0.001 0.043 13.603
3.875 0.037 0.018 15.011
4.125 -0.027 0.064 16.709
4.375 -0.046 0.008 17.856
4.625 -0.053 0.029 18.792
4.875 -0.043 0.029 19.641
5.125 -0.020 0.017 20.394
5.375 -0.052 0.024 21.472
5.625 -0.030 0.029 22.305
5.875 -0.066 0.013 23.266
6.125 -0.063 0.013 24.320
6.375 -0.052 0.059 24.802
6.625 -0.020 0.019 25.618
6.875 -0.058 0.034 26.084
7.125 -0.038 0.001 26.594
7.375 -0.078 0.051 26.571
7.625 -0.052 0.006 27.245
7.875 -0.068 0.086 26.303
8.125 -0.075 0.059 26.904
8.375 -0.083 0.041 25.825
8.625 -0.082 0.046 26.029
8.875 -0.089 0.037 25.439
9.125 -0.097 0.013 25.087
9.375 -0.085 0.070 24.163
9.625 -0.066 0.010 23.498
9.875 -0.098 0.008 23.399
10.125 -0.094 0.030 23.930
10.375 -0.080 -0.016 23.272
10.625 -0.069 0.042 23.154
10.875 -0.058 0.017 23.091
11.125 -0.034 -0.003 22.658
11.375 -0.043 -0.009 22.089
11.625 -0.038 -0.013 21.998
11.875 -0.043 0.016 21.728
12.125 -0.037 -0.011 21.445
12.375 -0.028 0.025 21.227
12.625 -0.051 0.018 19.929
12.875 -0.011 0.001 18.530
13.125 0.025 0.038 18.240
13.375 0.002 0.023 17.325
13.625 0.011 0.041 15.993
13.875 0.012 0.035 15.101
14.125 0.004 0.043 14.460
14.375 0.032 0.070 14.280
14.625 0.024 0.070 13.550
14.875 0.005 0.055 13.473
