0.125 0.000 -0.000 0.006
0.375 -0.003 0.001 0.081
0.625 -0.003 0.005 0.323
0.875 -0.006 0.021 0.765
1.125 -0.011 0.020 1.356
1.375 -0.014 0.022 2.076
1.625 -0.030 0.025 2.903
1.875 -0.048 0.022 3.865
2.125 -0.066 0.003 4.999
2.375 -0.076 0.069 6.218
2.625 -0.126 0.038 7.579
2.875 -0.129 0.037 8.926
3.125 -0.091 0.070 10.322
3.375 -0.140 0.046 11.676
3.625 -0.100 0.082 13.023
3.875 -0.138 0.046 14.419
4.125 -0.153 0.093 14.970
4.375 -0.129 0.045 16.328
4.625 -0.087 0.066 17.324
4.875 -0.088 0.093 18.387
5.125 -0.094 0.051 19.684
5.375 -0.120 0.157 20.666
5.625 -0.150 0.058 21.300
5.875 -0.122 0.038 22.155
6.125 -0.111 0.084 22.437
6.375 -0.084 0.113 22.929
6.625 -0.120 0.158 23.536
6.875 -0.119 0.087 23.292
7.125 -0.074 0.102 23.804
7.375 -0.126 0.183 24.546
7.625 -0.082 0.091 24.319
7.875 -0.119 0.123 24.640
8.125 -0.156 0.086 24.656
8.375 -0.112 0.109 25.976
8.625 -0.119 0.066 25.760
8.875 -0.168 0.141 26.140
9.125 -0.107 0.109 26.168
9.375 -0.122 0.055 26.253
9.625 -0.165 0.151 26.442
9.875 -0.149 0.154 26.595
10.125 -0.142 0.142 26.380
10.375 -0.189 0.129 26.318
10.625 -0.155 0.134 24.871
10.875 -0.142 0.120 25.053
11.125 -0.096 0.139 23.914
11.375 -0.127 0.123 23.090
11.625 -0.165 0.079 23.219
11.875 -0.182 0.148 22.678
12.125 -0.160 0.052 21.823
12.375 -0.125 0.098 22.267
12.625 -0.115 0.099 21.911
12.875 -0.180 0.085 20.798
13.125 -0.163 0.128 21.193
13.375 -0.158 0.080 20.295
13.625 -0.161 0.080 19.697
13.875 -0.143 0.059 19.731
14.125 -0.158 0.067 19.428
14.375 -0.191 0.044 18.853
14.625 -0.168 0.095 18.455
14.875 -0.162 0.099 18.103
15.125 -0.145 0.066 17.912
15.375 -0.128 0.080 17.327
15.625 -0.128 0.053 16.525
15.875 -0.155 0.064 15.459
16.125 -0.166 0.080 14.670
16.375 -0.162 0.030 14.540
16.625 -0.165 0.041 13.421
16.875 -0.150 0.014 13.202
17.125 -0.170 0.024 13.084
17.375 -0.154 -0.005 12.834
17.625 -0.131 -0.017 11.705
17.875 -0.151 -0.038 11.508
18.125 -0.112 -0.048 10.978
18.375 -0.088 -0.044 10.517
18.625 -0.088 -0.045 10.221
18.875 -0.061 -0.025 9.781
19.125 -0.075 -0.015 9.710
19.375 -0.059 -0.002 9.151
19.625 -0.048 0.005 9.369
19.875 -0.053 0.012 9.228
