0.120000 -2.796420
0.380000 1.345960
0.620000 0.550210
0.880000 1.303950
1.120000 1.077170
1.380000 1.275970
1.620000 1.182950
1.880000 1.344080
2.120000 1.374040
2.380000 1.358170
2.620000 1.341040
2.880000 0.950350
3.120000 1.029630
3.380000 0.863700
3.620000 0.817050
3.880000 0.766450
4.120000 0.504220
4.380000 0.188150
4.620000 0.138400
4.880000 -0.272360
5.120000 0.042800
5.380000 -0.713470
5.620000 -0.270430
5.880000 -2.599440
6.120000 -3.139520
6.380000 2.127720
6.620000 2.291200
6.880000 1.816910
7.120000 1.437340
7.380000 1.132030
7.620000 1.009050
7.880000 1.449320
8.120000 0.962890
8.380000 1.308080
8.620000 1.463460
8.880000 2.519210
9.120000 1.010760
9.380000 -2.290650
9.620000 0.270710
9.880000 0.738830
10.120000 -0.356190
10.380000 -0.357890
10.620000 -0.744980
10.880000 -1.031250
11.120000 -0.692380
11.380000 -1.535910
11.620000 -1.874140
11.880000 -1.422980
12.120000 -2.576520
12.380000 -2.475610
12.620000 -1.792970
12.880000 -2.525710
13.120000 -2.584470
13.380000 -2.929950
13.620000 -0.908850
13.880000 0.583080
14.120000 0.109410
14.380000 -0.606290
14.620000 -2.485510
14.880000 -0.485140
