0.05000 -2730.49885 -37.64228 -55526.60368 1967.61183 1605.13082 1282684.06320
0.15000 -5685.16352 28.86831 122458.26724 2230.05255 1788.46343 1251092.44689
0.25000 -8791.86981 1.87639 41342.78813 2459.57652 2332.19853 1330512.61196
0.35000 -11292.44422 22.64169 10384.59190 2623.19063 2777.29711 1445362.12927
0.45000 -13012.53559 157.45753 9643.09113 2776.74921 3141.12804 1134752.33170
0.55000 -14253.30628 -43.72516 -9146.24637 2779.38288 3407.62793 1154632.00188
0.65000 -15074.40943 -1.38138 -2295.74658 2811.83383 3550.12495 1195019.03370
0.75000 -15603.46507 138.89986 -4835.08971 2737.99316 3739.94863 1139790.76929
0.85000 -15859.89124 70.01977 -2116.25171 2608.98974 3831.69064 1119949.93080
0.95000 -15994.98271 152.67430 25880.89832 2412.39440 3857.49692 1048388.68447
1.05000 -15836.59339 102.43448 5085.22260 2218.38728 3869.86634 943580.80115
1.15000 -15692.06818 112.81515 18021.50612 1908.82495 3861.34026 954176.56458
1.25000 -15468.88367 52.55440 1022.52627 1698.17483 3807.32926 953182.57283
1.35000 -15144.49539 27.20838 -21091.75771 1533.25442 3744.32445 866747.59199
1.45000 -14864.43407 103.61049 11065.74820 1350.59841 3612.57455 822427.28234
1.55000 -14540.45381 84.59705 1033.84667 1156.80066 3569.71387 783497.57829
1.65000 -14218.42508 110.10355 -5175.79654 1033.59277 3475.36852 755839.66015
1.75000 -13915.01010 106.17019 -467.72935 890.38113 3366.96526 681002.52904
1.85000 -13637.82230 100.88544 2342.19630 755.85454 3309.21428 677667.92664
1.95000 -13331.85854 115.86803 13655.45401 655.99225 3194.87901 625446.12852
2.05000 -13040.91846 71.47681 6075.77904 557.43650 3119.91391 572808.82131
2.15000 -12772.72751 92.48311 -5468.49755 488.22418 3012.22938 583195.98776
2.25000 -12481.74159 76.66557 -251.54022 456.24525 2910.14243 533140.73138
2.35000 -12213.49639 86.33409 -5427.24587 394.74257 2792.98971 535260.30066
2.45000 -11932.29366 -3.04270 -5190.36798 358.70436 2703.52246 473158.70831
2.55000 -11679.09727 104.89827 6415.16531 335.66894 2624.52779 478738.71618
2.65000 -11446.03589 127.31193 -2190.83749 310.67451 2523.01317 438642.28224
2.75000 -11207.44454 86.18345 -4331.50154 309.16088 2457.74146 426580.05251
2.85000 -10988.97523 102.19422 2250.35648 312.94372 2385.42985 405929.06862
2.95000 -10770.45169 104.03074 3175.86548 330.13505 2305.62235 406869.13112
3.05000 -10579.23259 71.67909 5919.27962 339.45751 2227.62898 361336.81815
3.15000 -10378.85420 94.80591 -5577.24028 351.94417 2137.74851 358197.42553
3.25000 -10192.58695 75.11681 3796.34609 373.84470 2091.55854 325351.04312
3.35000 -10008.10857 78.76661 1292.52665 404.68628 1995.58519 328082.98235
3.45000 -9825.13516 72.56546 -4428.12782 414.40712 1935.74581 316146.40853
3.55000 -9653.56385 106.58119 -2260.27518 424.13056 1882.05082 294870.80827
3.65000 -9504.16427 92.58549 1449.13978 443.41892 1806.34170 272935.58194
3.75000 -9348.95251 107.43514 -4000.21162 463.76469 1746.81895 283413.87076
3.85000 -9190.49763 52.04394 4212.76092 462.55929 1685.16336 244048.38721
3.95000 -9026.71070 79.26695 -6819.56545 484.63434 1615.85027 239910.78828
4.05000 -8864.08242 31.42358 -4655.46686 498.25542 1549.74500 248005.36883
4.15000 -8726.93449 13.73966 3423.89559 499.11487 1514.48091 219333.63981
4.25000 -8605.42515 86.80929 -2126.71256 511.16884 1457.75396 223150.71824
4.35000 -8478.67786 72.73912 1147.26094 523.05377 1402.17014 214194.05410
4.45000 -8342.65812 98.64352 -2625.80473 545.39825 1347.54862 203974.51117
4.55000 -8207.81710 56.37767 1868.11963 558.48853 1283.72216 187618.44489
4.65000 -8093.08472 18.99088 5808.61915 566.60672 1231.27615 185160.67262
4.75000 -7968.42965 24.89416 1543.31394 580.67756 1180.07595 168590.85342
4.85000 -7864.07264 11.60982 -439.88627 599.01413 1143.85067 168999.23898
4.95000 -7737.74704 11.54986 283.27416 606.63616 1084.54061 171477.15562
5.05000 -7618.13111 -32.54891 4156.49329 616.85632 1041.71300 175610.69580
5.15000 -7482.30683 -25.82576 -954.00228 632.20395 1001.87768 146721.48395
5.25000 -7375.49868 -47.81590 442.70126 635.77420 951.40417 135242.34359
5.35000 -7258.54475 -53.81844 1384.56306 645.11996 905.41107 141357.85810
5.45000 -7132.23307 -66.38335 1165.76630 643.32720 858.17803 138141.06039
5.55000 -7031.40923 -80.75727 -1243.84134 652.39832 813.20096 138505.93848
5.65000 -6873.72563 -82.51936 -581.99590 667.15264 767.14435 121883.17036
5.75000 -6777.84749 -55.81128 -1915.20095 654.71669 739.25309 125313.62683
5.85000 -6658.90407 -39.97240 1039.24614 649.69709 691.42248 121073.10732
5.95000 -6522.33677 -33.41584 -2794.03097 649.62749 653.81975 114717.00955
6.05000 -6406.91406 -41.27161 2700.34049 632.43461 624.87920 107423.02388
6.15000 -6296.51114 -43.53178 -884.10673 617.37152 591.15561 99108.30370
6.25000 -6198.22428 -59.00518 -1904.54466 595.97235 551.14506 112527.90316
6.35000 -6068.90761 -51.44395 621.99110 556.62269 532.15906 92229.94744
6.45000 -5972.65437 -53.11525 -2740.52242 527.27837 505.72517 87887.84696
6.55000 -5896.19881 -42.44202 952.22112 502.24170 488.65040 85909.57536
6.65000 -5791.71240 -65.71350 -2594.84615 478.52062 459.89657 93262.59571
6.75000 -5704.43699 -54.62438 435.33459 456.33982 441.22053 80498.48048
6.85000 -5623.28662 -52.35579 -995.48599 428.09253 431.08298 80662.86052
6.95000 -5553.86801 -44.62226 -4419.02908 413.93838 407.30076 80710.94452
7.05000 -5498.05675 -38.80093 -643.80526 395.37929 397.91403 64466.00241
7.15000 -5431.01572 -44.74647 -1835.79925 371.53541 377.56595 64608.71136
7.25000 -5365.98843 -38.30155 49.23852 354.45358 370.76529 64089.07981
7.35000 -5315.50913 -31.70781 -1318.90624 347.16427 354.56303 56033.97578
7.45000 -5272.62475 -30.04562 -1201.92630 336.75042 348.07305 55299.44075
7.55000 -5223.16394 -24.81528 -847.17458 330.76606 336.23257 61607.32570
7.65000 -5177.39535 -14.84725 -1734.55464 328.29998 328.15924 50941.47051
7.75000 -5127.16564 -2.99948 -429.48573 317.74854 318.47751 47975.07939
7.85000 -5097.30061 -3.01792 -1770.40255 311.08890 308.05909 50790.05762
7.95000 -5043.95827 8.29032 -1334.93238 304.54855 301.28680 43233.04898
8.05000 -5008.51661 5.37429 -654.06657 298.96600 294.28266 42444.49123
8.15000 -4971.34987 13.29638 -1445.57703 297.95580 292.43984 38478.93189
8.25000 -4926.53868 24.59057 -1935.30654 290.01343 280.59754 37451.27956
8.35000 -4900.06033 14.35886 -2214.46529 281.70408 274.99198 36954.90958
8.45000 -4849.58959 28.67106 -1977.51038 269.49495 267.80709 77246.08346
8.55000 -4818.20134 31.06499 -1183.83412 258.57078 262.38400 32459.26300
8.65000 -4790.24312 32.88063 -351.42243 257.34543 259.65377 29989.83627
8.75000 -4763.32771 34.38443 -920.91232 254.13308 250.32133 29734.70072
8.85000 -4723.95910 44.84407 -1545.40965 248.49487 245.69313 33678.66163
8.95000 -4692.66151 42.18358 -1577.65472 245.93534 238.65003 28068.40150
9.05000 -4663.27645 44.43354 -830.92549 240.67900 231.08377 22999.75929
9.15000 -4643.83366 42.53983 -1605.97432 241.10649 224.57295 27044.34232
9.25000 -4606.52947 49.91663 -1027.16468 241.80995 217.06141 23504.64267
9.35000 -4574.75471 47.65151 -1754.00689 241.47881 210.84448 22239.64858
9.45000 -4536.95807 50.13784 -884.52822 241.04998 202.42628 25556.92815
9.55000 -4511.63297 55.94446 -121.63067 235.38403 196.81253 22662.94912
9.65000 -4465.88461 43.81921 -308.72096 227.44170 190.34055 19523.99921
9.75000 -4436.08703 42.57679 -210.89939 224.56749 182.76736 21039.95628
9.85000 -4390.63797 51.66372 -776.19281 217.18472 174.88864 19805.36865
9.95000 -4354.63294 51.32928 -1062.74256 214.53463 168.80439 17895.20698
10.05000 -4326.82807 44.64319 -716.58764 213.28176 164.91096 18800.10996
10.15000 -4280.60929 49.47013 -817.08135 206.12625 162.44292 19767.49522
10.25000 -4249.71147 51.17193 -431.20079 205.91247 153.11060 17349.95213
10.35000 -4210.70351 48.22585 -1239.67159 195.00924 146.91211 15254.25436
10.45000 -4173.88633 55.08034 -146.97300 193.39878 142.50409 13501.92778
10.55000 -4143.57098 48.31416 -801.83931 187.11373 140.06717 21546.47253
10.65000 -4102.23984 46.22569 -1379.71847 183.38845 135.18651 17555.87620
10.75000 -4061.73254 40.21424 -715.68261 175.39575 128.98215 14426.38225
10.85000 -4032.22347 43.72565 -162.72612 166.97754 127.49274 21601.83679
10.95000 -4008.31076 41.72017 -627.13443 159.53444 126.73725 12888.39625
11.05000 -3980.86827 45.78225 -557.98139 155.45239 119.80248 12896.99604
11.15000 -3944.91408 47.44745 -707.89887 145.64546 118.24814 10923.89563
11.25000 -3912.79233 42.70550 -615.67050 137.22506 116.56368 12417.30453
11.35000 -3891.43939 39.07784 165.89935 136.07566 111.53092 43745.76326
11.45000 -3864.29955 37.18444 -529.23011 130.39083 111.98572 13693.04361
11.55000 -3835.86132 39.46147 -61.35110 124.21550 108.05868 12404.59254
11.65000 -3810.44747 32.24458 -172.98214 118.16203 105.80236 20883.17876
11.75000 -3784.73370 36.41851 795.92846 116.02422 103.13986 51208.33018
11.85000 -3758.41377 33.54686 -288.91100 114.08926 99.10546 11706.49390
11.95000 -3729.33110 28.09546 -171.15883 110.01838 100.51430 12364.05927
12.05000 -3705.29465 27.80252 -641.79595 103.80926 96.99468 10282.53506
12.15000 -3681.02000 29.29376 -205.56295 102.75381 93.74730 9721.80482
12.25000 -3657.72973 26.50263 -216.42515 96.79763 90.24829 9967.06846
12.35000 -3631.48515 29.10171 -260.27082 99.59167 89.15275 10015.03488
12.45000 -3604.78834 24.75174 28.05231 99.52383 88.76507 11264.92599
12.55000 -3584.62932 21.82850 159.74757 98.80912 86.57242 9735.46138
12.65000 -3561.42216 24.16053 -529.27291 97.31669 84.87281 8779.33706
12.75000 -3536.39917 21.53888 429.31424 90.94112 81.57780 10792.02818
12.85000 -3518.14923 22.92108 237.66706 93.59386 81.23821 11453.76765
12.95000 -3492.10446 21.48687 114.13448 90.01666 77.08450 9720.76425
13.05000 -3469.17269 23.13358 -203.31969 86.35671 77.42822 9433.93819
13.15000 -3444.86561 22.39202 21.25061 84.79927 74.95399 8225.19229
13.25000 -3420.06905 20.35847 48.49046 83.84077 74.35432 8036.25080
13.35000 -3398.14258 24.67057 29.61528 82.56975 74.02479 9255.57148
13.45000 -3376.47599 21.68146 90.04313 81.90533 73.76228 8658.28967
13.55000 -3351.81545 21.27163 186.41141 80.67853 70.33186 6914.81600
13.65000 -3335.94594 22.95825 -197.15090 81.63031 70.83359 6175.68983
13.75000 -3312.12564 23.43115 -448.72862 79.43797 69.49736 7072.98159
13.85000 -3290.74736 23.86105 -55.05049 76.46210 69.23355 6591.81818
13.95000 -3272.54634 22.38818 61.69192 76.41990 64.14399 9367.84998
14.05000 -3255.99149 22.31553 362.11990 81.30705 66.64918 7503.53299
14.15000 -3235.91339 23.31019 19.08126 79.57834 65.06410 5935.87497
14.25000 -3211.96017 24.25935 136.41850 78.59030 63.01963 5866.96735
14.35000 -3191.80564 22.74970 -30.76539 75.58505 61.73569 7176.14930
14.45000 -3172.57914 21.53880 25.64907 77.50556 63.22588 5617.15067
14.55000 -3150.42227 23.41131 -146.00313 80.05863 60.08821 5077.83896
14.65000 -3131.58310 25.77291 80.47649 74.52021 57.35891 5634.05184
14.75000 -3112.10690 21.96571 -226.76079 74.19381 60.40223 5293.91646
14.85000 -3090.61537 19.40876 -56.95614 71.23631 58.71347 6377.05687
14.95000 -3065.72189 19.63398 -115.43562 73.02576 57.68893 6252.27535
15.05000 -3044.94180 21.65502 -217.47236 72.04739 52.25507 5701.13977
15.15000 -3024.90307 22.71444 125.37819 72.43369 53.06360 5137.52034
15.25000 -3002.50521 21.46494 -45.37228 71.10274 55.21180 5278.21993
15.35000 -2986.88201 21.85224 -174.04918 72.27428 51.03079 5464.15770
15.45000 -2965.39148 20.68038 -1424.99705 70.71414 51.57252 48502.43071
15.55000 -2944.60638 19.90898 -187.28248 68.10316 49.27465 5793.37507
15.65000 -2926.47497 19.37079 87.76870 68.94301 48.65450 5001.87616
15.75000 -2904.43783 20.95174 -6.01165 69.49512 48.45451 5447.80410
15.85000 -2888.86206 17.69845 -113.34579 63.96687 47.95153 4798.59851
15.95000 -2869.67240 19.32205 -24.38259 65.78491 50.69937 5046.54331
16.05000 -2853.15309 20.21770 98.26737 68.20324 48.55785 4366.39569
16.15000 -2835.63120 17.93235 -131.12371 68.80633 46.62049 3741.30952
16.25000 -2816.83384 19.59994 85.53808 69.66444 49.84545 3844.03414
16.35000 -2794.92858 19.67718 -11.02808 68.70206 44.01851 3714.09951
16.45000 -2779.79758 20.04729 36.00095 67.69211 45.40274 3636.01952
16.55000 -2760.28249 20.50354 -33.12918 67.83024 47.01989 3900.76839
16.65000 -2744.35499 19.56743 -13.14439 66.31982 44.80864 4279.77946
16.75000 -2725.66680 19.23095 -206.99692 64.53219 42.14709 3951.75114
16.85000 -2708.89786 20.74798 26.90637 63.01223 42.88930 4060.74107
16.95000 -2688.64322 17.27281 116.84175 59.62393 42.50146 3750.94783
17.05000 -2673.48394 22.02633 127.07451 62.53512 40.28763 3557.75707
17.15000 -2658.51296 23.48834 -161.05381 62.32845 41.29355 5656.84047
17.25000 -2643.29649 18.76879 141.01013 59.54378 42.99167 4010.46850
17.35000 -2626.33313 19.70308 -5.18735 59.19703 38.98425 3609.85670
17.45000 -2610.53240 21.47862 202.58381 58.42913 38.03785 3932.91845
17.55000 -2596.60244 17.45688 191.41694 58.66326 38.37707 5156.53008
17.65000 -2579.05368 19.28999 110.23530 56.54229 39.48535 4245.57704
17.75000 -2563.52887 17.95112 370.95957 50.48478 37.22186 4342.45048
17.85000 -2550.35160 18.76626 -83.64890 54.31558 40.22620 4016.97156
17.95000 -2534.84136 18.43680 6.79062 52.15394 38.85485 4004.35913
18.05000 -2518.10260 15.65310 276.85683 52.25385 38.16936 4170.17506
18.15000 -2508.18012 17.96558 46.02853 48.50601 38.91722 3400.94221
18.25000 -2492.02572 16.53322 45.02337 46.40275 34.75280 3227.09356
18.35000 -2480.81204 16.82792 103.01167 43.95009 38.27296 3838.53627
18.45000 -2467.46258 14.33801 116.01163 41.70773 32.70294 3338.35772
18.55000 -2449.66094 16.91991 14.34153 43.61317 38.07809 3969.63000
18.65000 -2438.87344 18.28178 -72.45937 42.01903 34.98534 4350.26980
18.75000 -2422.93344 17.00927 90.02959 41.62457 33.38827 3956.32799
18.85000 -2409.07750 15.64019 19.13000 40.31076 35.12846 3380.31623
18.95000 -2396.83066 16.22842 105.64065 38.34642 38.35307 3439.04607
19.05000 -2382.65218 15.41720 -56.16507 40.00853 30.34844 2839.53312
19.15000 -2365.59992 15.14491 -82.12841 41.20434 32.77738 3656.01710
19.25000 -2353.90876 13.78784 -494.12902 38.30538 34.11421 3902.88375
19.35000 -2342.80097 14.52595 61.51189 40.17506 36.51995 3161.72574
19.45000 -2327.42712 12.20500 -288.01333 38.23257 32.56551 3158.33326
19.55000 -2317.57047 14.15558 -49.13245 35.60788 32.83866 2871.06404
19.65000 -2304.24200 14.58784 -90.37981 36.27091 29.65068 2735.78743
19.75000 -2290.41896 14.49616 113.88079 33.94885 33.22965 1773.32991
19.85000 -2274.03850 12.12801 5.20010 36.64923 31.78858 1782.22841
19.95000 -2266.51414 12.67191 -124.25255 30.57161 27.58240 3070.95202
