0.2 -0.21256 28.84301 1.05736 110.99974 106.97529 90.98577
0.6 0.02374 56.98514 1.25813 105.83118 91.89438 82.15543
1.0 -0.70122 71.85536 1.00167 97.94876 80.05807 74.23736
1.4 -0.86543 81.20521 0.84953 90.20141 72.87015 68.63147
1.8 -0.47126 91.66875 0.72148 83.54091 68.0804 63.96438
2.2 -0.06492 105.42878 -0.43242 76.52077 65.82093 59.84398
2.6 0.26376 120.53405 -2.12757 68.52025 63.47895 54.26003
3.0 0.52883 137.49974 -3.27529 60.89637 55.64575 49.21962
3.4 0.95216 149.50135 -2.20138 54.17855 48.57977 44.34582
3.8 -0.4683 158.48439 -1.17429 47.9148 43.16857 40.24067
4.2 -1.61356 167.43009 -0.18429 43.36342 37.7661 36.84861
4.6 -2.33937 174.65942 0.45007 40.03828 33.41057 35.11265
5.0 -1.5883 179.1297 0.84532 37.97541 31.03594 32.9432
5.4 -0.58727 181.83105 -0.02206 36.09936 29.97248 30.95503
5.8 -0.02063 184.898 0.15559 34.76729 28.69124 29.4648
6.2 -0.59445 187.81179 -0.25936 33.54555 27.40196 27.66445
6.6 -0.32437 191.14245 -0.24697 32.28125 26.72635 26.41233
7.0 0.05997 194.48831 0.0268 30.51445 25.64048 24.97821
7.4 0.43044 197.43779 0.35689 29.53078 24.68838 24.02464
7.8 0.30549 200.23842 1.032 28.2322 22.43293 23.12051
8.2 0.32931 201.57361 0.9573 27.63487 20.99861 22.37068
8.6 0.61128 202.29767 1.12882 26.3234 19.61174 21.58344
9.0 0.37669 202.30686 0.69231 25.88436 18.57601 20.84084
9.4 0.14842 202.35503 0.44113 24.72693 18.36442 19.91063
9.8 0.2814 203.04022 0.00754 23.90206 18.23273 19.00083
10.2 -0.21233 203.6377 -0.79365 23.10549 17.90802 17.44672
10.6 0.05436 204.04812 -0.92201 22.01832 17.55876 16.91893
11.0 -0.56736 205.36071 -1.15396 21.42368 16.45466 16.09973
11.4 -0.5606 206.25868 -0.69539 20.08203 15.69811 15.07802
11.8 -0.46508 206.97941 -0.12265 19.46485 15.03822 14.59814
12.2 -0.85439 206.91368 0.197 18.75015 14.31283 14.05714
12.6 -1.05176 207.27033 0.15951 18.12019 13.96472 13.72334
13.0 -1.47733 207.09736 0.38683 17.89111 13.44538 13.17212
13.4 -1.78316 207.6841 0.64136 17.65036 12.82116 13.09305
13.8 -0.84363 206.97804 0.64272 17.17437 12.01194 12.41922
14.2 -0.67079 207.33579 0.36957 16.36253 11.38662 12.53957
14.6 -0.95831 207.38402 0.48443 15.37852 10.9028 12.12518
15.0 -0.62586 206.86158 -0.07663 15.05927 10.74317 11.97657
15.4 -0.34712 206.45348 0.10443 14.21085 10.66325 11.43329
15.8 -0.08358 206.93246 0.35996 13.44085 10.93722 11.16312
16.2 0.56134 207.29041 0.26566 12.94374 9.99767 10.28277
16.6 0.4792 206.65086 -0.33097 12.34121 9.86919 9.91805
17.0 0.48155 206.82312 0.73119 12.13608 9.12692 9.08332
17.4 0.27695 207.31959 0.68489 11.48946 8.97395 9.11993
17.8 0.19999 207.73305 0.33539 11.0927 7.9029 8.7497
18.2 0.05425 207.23617 0.31008 10.78284 7.60236 8.60381
18.6 0.45485 207.28612 -0.2835 10.33063 7.10644 7.93324
19.0 0.53665 207.23836 -0.70196 10.05068 7.97537 7.98342
19.4 1.08807 207.4954 -0.41747 10.05843 8.02482 7.98875
19.8 1.4317 208.02855 -1.22829 9.797 7.20887 8.15494
