0.05000 -113916.56203 7707.41076 29224.60018 161460.93499 219632.00462 206603.22269
0.15000 -121032.81890 1338.36675 -1001.20624 64082.90132 58624.48876 110059.71681
0.25000 -78834.53327 -152.17991 -591.18345 30028.70762 19561.61151 64535.23393
0.35000 -58977.62313 29.45787 -659.08404 18756.49381 10540.15658 47096.05193
0.45000 -47575.62425 9.78335 -490.25741 15186.07936 7095.59069 37295.89504
0.55000 -40002.94826 126.47332 -585.84621 11784.68719 5596.36396 30561.06109
0.65000 -34554.78769 53.41498 -178.53440 10447.54527 4252.95194 25895.21539
0.75000 -30624.43242 29.20184 -435.67148 8164.56767 3769.35585 22174.86384
0.85000 -27509.10686 55.96742 -648.70796 6988.54067 4239.84494 19584.73987
0.95000 -25111.92641 -2.11563 -414.26822 6079.44472 3121.64923 17261.17425
1.05000 -23033.07327 28.16262 -178.58024 5433.21397 2733.02162 15688.79893
1.15000 -21388.91945 3.84445 -345.38227 4956.38814 2414.34646 14198.67699
1.25000 -19912.15196 -21.43116 -483.51732 4392.70580 2233.22888 12975.99912
1.35000 -18606.83837 14.82364 -116.91619 4092.05184 2525.38715 11967.07760
1.45000 -17491.28795 6.13159 -182.45402 3597.22765 1835.34427 11036.82803
1.55000 -16486.32859 37.91346 -125.53573 3232.55163 1792.73997 10189.44204
1.65000 -15580.97459 14.57576 -236.65136 3422.42047 2132.05415 9629.73818
1.75000 -14818.30576 -47.00792 -274.66798 2929.83430 2684.53333 8915.15428
1.85000 -14013.73875 19.46357 -8.40259 3112.82264 1665.22489 8428.20729
1.95000 -13403.98565 3.24334 -156.44769 2350.44077 1412.61066 7986.28167
2.05000 -12847.13268 -11.60413 -13.54287 2286.50193 1408.15594 7530.37149
2.15000 -12364.77064 -20.06731 86.42897 1936.88633 1283.84245 7085.40138
2.25000 -11842.11005 19.89786 -103.31699 1930.13640 1378.91928 6810.94029
2.35000 -11459.18542 -2.70975 -79.78759 1768.87176 1267.05623 6400.57876
2.45000 -11151.06860 -20.08354 -70.81432 1703.39922 1208.99171 5982.92335
2.55000 -10762.03726 14.41438 43.16484 1434.82803 973.54690 5790.03562
2.65000 -10507.79906 0.26329 71.11977 1353.81768 1092.56646 5427.47594
2.75000 -10218.14925 6.10193 79.45649 1154.36621 853.36667 5110.21758
2.85000 -9972.69455 10.38861 194.97756 1129.78435 1140.30540 4966.29053
2.95000 -9771.66483 -1.83859 217.42346 3649.22222 1507.17318 5618.05372
3.05000 -9480.19021 -6.70779 87.69096 952.43477 883.46319 4230.15789
3.15000 -9250.59453 11.01900 192.99562 917.70264 729.99681 3913.61320
3.25000 -9000.55530 27.51668 59.64468 1061.18286 992.27463 3864.52831
3.35000 -8821.80094 21.33155 82.24011 782.50155 699.71156 3532.29458
3.45000 -8613.21215 10.77574 147.14097 703.58922 679.80117 3346.81217
3.55000 -8416.75410 17.80285 27.38375 953.56166 1120.16697 3388.61673
3.65000 -8249.77896 21.56168 61.73359 768.55463 695.07152 3044.14785
3.75000 -8071.96672 12.28242 93.47275 854.13497 1275.67611 2938.31466
3.85000 -7981.72588 4.88522 69.21395 988.66148 634.94326 2912.17746
3.95000 -7846.38168 19.58364 36.80688 594.45700 522.64260 2715.53763
4.05000 -7759.31558 9.18141 58.89439 623.41238 691.96337 2626.75270
4.15000 -7667.50605 10.04592 27.39393 521.57897 591.63290 2708.63650
4.25000 -7587.87636 9.29246 34.60683 651.23680 484.01482 2470.61968
4.35000 -7510.72559 6.93056 67.87885 994.99301 732.19806 2490.54383
4.45000 -7444.69788 3.65070 56.54119 697.44605 1156.70175 2533.13893
4.55000 -7377.56929 10.45392 36.78853 832.78841 558.73777 2260.73040
4.65000 -7327.85425 9.79548 18.88663 570.97238 575.78365 2212.42458
4.75000 -7264.51727 1.48938 32.06007 546.66815 521.01304 2165.21760
4.85000 -7216.02714 6.31030 23.87837 712.99852 557.89637 2169.05856
4.95000 -7141.11793 -2.04840 7.88513 416.55904 504.89084 2058.75168
5.05000 -7077.40621 3.28892 2.70994 601.20005 443.64641 2097.06672
5.15000 -7033.62734 -0.44077 -20.38155 455.39191 480.80248 2116.16333
5.25000 -6972.08990 5.03073 -39.67621 440.15219 398.35045 1894.63582
5.35000 -6923.92493 -4.65345 -11.76768 512.71454 443.24768 1885.80910
5.45000 -6851.55122 -0.80860 5.29919 490.64566 376.42786 1803.86096
5.55000 -6789.66865 5.57010 10.42873 503.78502 393.17516 1797.91765
5.65000 -6717.25739 7.84926 -18.15511 536.17638 617.46760 1723.44065
5.75000 -6665.10842 7.86586 -28.60135 782.24784 738.74238 1700.38759
5.85000 -6601.82704 1.37372 10.52694 469.22169 510.39480 1948.21829
5.95000 -6538.82216 1.84421 -12.18486 371.88157 357.48404 1582.06331
6.05000 -6477.59353 4.58151 16.17952 455.46004 388.28051 1561.33105
6.15000 -6406.92810 2.97381 5.57410 492.60527 292.34739 1511.81150
6.25000 -6353.10962 7.59989 -30.99542 368.08547 296.13578 1450.28158
6.35000 -6289.01600 -0.73878 -50.07781 628.04732 538.36289 1699.04821
6.45000 -6224.42063 -0.43868 -11.66725 353.61437 388.03432 1357.41580
6.55000 -6138.34879 3.44615 -49.78579 1980.02746 421.30518 1871.00701
6.65000 -6101.04521 3.34446 -28.49004 365.09055 365.14426 1295.96590
6.75000 -6025.71821 -23.04089 17.03973 887.81181 2028.03568 4115.74025
6.85000 -5975.86726 9.25448 -23.32291 367.80812 440.67285 1301.27864
6.95000 -5927.98191 1.02664 -26.14459 322.86827 240.78385 1168.83942
7.05000 -5852.25881 0.35799 -23.41976 326.92675 258.38646 1164.60974
7.15000 -5815.15140 0.30833 4.69814 372.47438 273.97920 1181.21326
7.25000 -5748.33107 1.35810 -41.66506 472.69926 719.28234 1170.36964
7.35000 -5671.68526 -4.41036 -49.29937 430.92740 281.86342 1055.46245
7.45000 -5617.82187 2.72525 -3.80252 329.33881 334.03364 1046.04127
7.55000 -5563.25139 13.08728 -38.22929 463.90733 621.31755 1326.76885
7.65000 -5505.27877 -1.67838 -8.39689 303.84606 225.89688 981.36092
7.75000 -5447.63442 3.59510 1.11867 235.02041 186.98896 950.73514
7.85000 -5385.16133 -1.87874 -14.67962 214.11574 302.61978 2239.02772
7.95000 -5345.30843 31.47409 -8.34802 709.08484 1351.31913 1151.88135
8.05000 -5290.28728 -1.33303 -9.63174 246.18487 281.01213 915.69894
8.15000 -5236.41845 0.52835 -21.03612 301.83828 533.89210 1009.78923
8.25000 -5178.12518 10.87375 12.21316 420.43367 317.77870 891.18611
8.35000 -5127.15155 -31.90106 -25.92293 474.09456 2342.40172 1460.03595
8.45000 -5098.91796 1.41215 -11.53492 402.11100 295.94600 1000.28498
8.55000 -5040.30758 3.24764 -7.20289 245.70075 268.23821 818.64375
8.65000 -4986.23451 0.31651 -1.31218 227.34335 183.65349 775.18347
8.75000 -4954.84011 0.96229 -21.74926 194.89499 514.35894 767.71001
8.85000 -4910.17840 4.42162 -9.05088 182.42840 157.36407 755.45753
8.95000 -4869.74126 1.49063 4.50505 386.79043 283.57682 783.77413
9.05000 -4817.22538 0.83930 17.14951 402.09925 316.81068 750.19181
9.15000 -4768.85351 3.14385 3.74627 295.09361 426.60028 735.03611
9.25000 -4725.07670 4.22337 -7.59164 300.42302 263.19920 702.36750
9.35000 -4679.76929 -7.43265 -3.69212 363.86789 568.16664 714.21567
9.45000 -4647.56448 2.50450 6.00442 165.14111 129.01846 657.75986
9.55000 -4611.39258 6.39125 -2.57171 176.86924 122.87759 639.74241
9.65000 -4569.58136 -1.27846 -14.54840 316.42360 326.28318 1270.25447
9.75000 -4534.57827 1.95141 -13.60375 207.66619 305.56358 626.44961
9.85000 -4498.40434 4.88936 -22.37652 283.61573 273.33715 620.73357
9.95000 -4455.65093 2.85797 3.28738 183.19124 142.33159 603.74081
10.05000 -4417.64520 3.05575 -20.05863 143.59577 108.51710 581.86472
10.15000 -4371.55256 -16.98256 -80.97704 504.69362 799.39869 2198.57797
10.25000 -4346.86329 3.67866 -46.68631 131.34564 111.32705 549.42410
10.35000 -4307.07925 -2.84707 -7.37920 443.16489 340.08695 603.17055
10.45000 -4285.32473 1.42535 -42.97741 147.28709 117.68287 520.32891
10.55000 -4266.20925 -3.26473 -25.06711 1192.12793 435.14048 534.35645
10.65000 -4207.81173 2.63419 -20.70001 143.37133 111.06746 490.97077
10.75000 -4170.22797 -0.68255 -33.69599 139.86812 117.44741 493.48350
10.85000 -4136.86104 2.27538 -22.00788 177.10588 155.93996 583.53047
10.95000 -4112.78697 -1.55411 -43.00364 416.85512 171.52085 639.62068
11.05000 -4076.32526 4.98958 -29.18093 115.99478 100.50002 441.10128
11.15000 -4035.73557 1.64210 -38.08182 107.20728 88.23619 443.47124
11.25000 -4006.74569 3.67228 -35.48739 162.76199 230.10395 470.61638
11.35000 -3959.42911 -2.70449 -39.53648 389.55858 337.63141 462.93455
11.45000 -3944.35304 6.05467 -20.69817 175.73849 167.31037 410.94491
11.55000 -3910.21976 6.18311 -29.03295 173.43157 200.63147 408.73446
11.65000 -3879.82935 2.81800 -20.45647 1347.15320 1051.74932 468.08500
11.75000 -3850.11019 3.73884 -37.31113 152.02084 120.14452 427.90013
11.85000 -3816.44434 -3.51547 -28.21907 118.68854 108.74377 374.08718
11.95000 -3786.00854 1.73960 -29.47313 114.66235 69.98889 372.01529
12.05000 -3749.18972 -5.53514 -8.44234 116.89793 228.35342 362.83869
12.15000 -3720.86674 -5.12255 -20.79189 96.08880 221.96890 456.69254
12.25000 -3687.53888 0.82755 -27.43330 213.52456 125.39700 348.71982
12.35000 -3656.02121 5.12084 -9.24368 93.91948 79.81748 341.53386
12.45000 -3623.56004 1.37115 -31.60543 101.19870 78.32316 329.45590
12.55000 -3596.21867 2.64875 -16.50570 112.76579 80.38693 325.52979
12.65000 -3570.99748 4.91379 -5.28320 143.06647 245.81556 343.17649
12.75000 -3541.14471 0.77386 -31.51863 143.67743 77.82407 313.57440
12.85000 -3506.01646 1.82839 -20.85840 134.54932 83.15874 312.28411
12.95000 -3478.97410 2.24098 -22.48021 102.87925 82.04812 295.99076
13.05000 -3462.78142 10.71397 -29.86731 178.53165 293.54200 496.65409
13.15000 -3430.95416 4.38420 -18.71514 65.08576 58.11257 289.80311
13.25000 -3409.28628 -2.93958 -24.72085 128.06362 103.24042 306.68596
13.35000 -3383.76941 2.40788 -20.79771 113.31548 109.08559 284.29800
13.45000 -3351.25911 -3.75439 -24.91663 119.88841 139.66178 271.69540
13.55000 -3332.58517 1.63009 -15.85204 166.15535 74.09045 386.97997
13.65000 -3307.54039 -1.62791 -4.13093 126.71655 347.73033 265.21481
13.75000 -3279.11870 0.39467 -27.98831 93.89165 86.28998 259.90783
13.85000 -3257.87189 -0.89843 -34.61417 84.53740 75.18518 247.13821
13.95000 -3227.50819 4.51928 -21.17177 162.97549 136.44728 248.03559
14.05000 -3201.63986 1.64496 -30.63219 196.71381 169.55789 244.53450
14.15000 -3190.21870 -3.21845 -43.26512 83.76796 90.97043 253.56838
14.25000 -3168.77879 1.80690 -30.62369 67.02410 63.25297 240.39933
14.35000 -3137.07673 6.24990 -34.82344 78.11162 101.88926 228.19436
14.45000 -3120.75118 -2.65757 -19.96666 74.89123 201.86334 382.14994
14.55000 -3097.38977 1.25537 -33.07517 64.80150 52.05240 230.39691
14.65000 -3073.40592 2.91401 -46.93743 67.53824 51.02820 210.58775
14.75000 -3058.32960 1.59596 -32.81941 64.99571 57.06030 220.41873
14.85000 -3028.72186 -0.04122 -41.92952 77.41321 161.02263 268.09657
14.95000 -3007.18937 0.87776 -46.25086 99.94540 65.82950 651.95220
15.05000 -2985.96813 2.45901 -48.24490 117.34099 52.69925 262.87362
15.15000 -2965.93995 0.75741 -30.24537 239.61573 288.48397 631.33579
15.25000 -2947.30299 3.90935 -47.78094 136.08439 78.25152 240.65759
15.35000 -2924.26816 1.68732 -37.03189 82.05564 57.85634 203.93468
15.45000 -2898.22482 -1.50672 -39.43735 155.16407 81.82147 259.49899
15.55000 -2884.39627 -0.74303 -36.03293 52.57076 53.98973 188.36193
15.65000 -2856.31680 -9.10225 -29.18016 228.19608 216.78140 205.49553
15.75000 -2844.24882 4.28870 -23.66666 61.97585 52.50011 177.62075
15.85000 -2823.26101 0.53557 -21.15364 49.55300 57.85328 196.01290
15.95000 -2809.52492 2.28494 -20.38747 70.76863 55.81419 174.50108
16.05000 -2786.03938 -3.52065 -25.78047 60.80998 86.81148 200.27873
16.15000 -2773.68533 1.41743 -48.36107 45.80721 41.15155 167.24987
16.25000 -2753.61359 2.57559 -33.30241 64.08560 61.06899 158.00620
16.35000 -2725.48033 -1.37280 -21.82580 161.38807 69.16031 165.99944
16.45000 -2717.47782 2.60941 -37.01927 43.41844 47.59071 159.09441
16.55000 -2702.74696 8.20641 -30.95584 57.63399 108.40347 186.40897
16.65000 -2674.95420 1.95196 -41.31294 49.20199 47.51165 159.41285
16.75000 -2659.91500 -2.51875 -42.66400 57.59964 38.74955 173.94749
16.85000 -2645.02028 0.88250 -24.52058 55.82833 46.44356 155.94596
16.95000 -2628.59528 -3.17142 -28.86846 65.59673 63.40287 150.58900
17.05000 -2611.05770 5.18365 -24.29823 52.77635 48.91169 152.70422
17.15000 -2593.50589 -1.94336 -40.33886 39.61217 37.87476 146.35522
17.25000 -2573.30434 -0.29888 -32.60373 55.24527 40.32596 155.03552
17.35000 -2561.26764 1.57201 -45.39106 41.52479 36.30236 147.34979
17.45000 -2549.21476 1.04895 -18.10764 41.46091 39.91659 134.35495
17.55000 -2530.24218 3.50630 -32.00189 52.91536 36.71154 139.28726
17.65000 -2514.09660 3.41946 -23.65395 52.35735 53.29689 156.59131
17.75000 -2499.17126 -0.30396 -24.88430 54.01003 49.03078 139.23655
17.85000 -2477.03742 -4.44551 -17.93660 52.21385 60.15821 128.72751
17.95000 -2459.91550 -0.38288 -20.55429 45.33720 38.91507 130.56763
18.05000 -2446.46851 -0.90105 -41.59769 44.37945 58.43175 140.25952
18.15000 -2441.23932 -5.76882 -6.17301 103.30592 86.59718 157.04902
18.25000 -2420.11688 0.30867 -14.91487 48.48058 29.30495 134.74580
18.35000 -2402.85808 -4.92637 -9.29391 129.37847 70.05400 146.43917
18.45000 -2394.03917 4.41650 -10.47083 56.63058 39.60110 117.77621
18.55000 -2380.52554 -3.11180 -18.58834 45.90087 41.70095 129.56852
18.65000 -2364.13979 2.49530 -15.44426 43.83455 36.70484 121.11662
18.75000 -2350.47749 6.55460 -23.61198 37.14065 51.07302 121.94030
18.85000 -2335.99065 -1.85465 -9.56802 74.69796 64.96155 127.79291
18.95000 -2322.87853 3.73388 1.19711 82.27598 43.56977 119.56194
19.05000 -2309.00867 2.68945 -10.76028 39.47851 35.35951 110.17138
19.15000 -2299.73527 2.14787 -25.18761 57.07824 41.71341 110.80171
19.25000 -2277.90089 5.98551 -19.28190 119.39213 71.84616 124.82985
19.35000 -2267.26175 -0.11105 -27.17817 79.80724 51.98936 121.63973
19.45000 -2256.60219 -1.65238 -18.08811 71.53738 55.56364 109.72591
19.55000 -2249.03212 0.88664 -31.13752 42.43774 30.73268 104.58268
19.65000 -2209.95431 15.01576 -12.61009 197.47221 124.24580 115.97113
19.75000 -2222.55618 3.68555 -21.33953 34.89388 30.46892 98.62143
19.85000 -2240.90160 -10.97144 -11.63393 435.40002 174.38963 187.13656
19.95000 -2194.66233 1.04645 -17.86828 42.04168 36.90809 101.43625
