0.12500 0.01129
0.37500 0.01233
0.62500 0.03545
0.87500 0.04206
1.12500 0.06155
1.37500 0.07802
1.62500 0.11270
1.87500 0.13372
2.12500 0.15607
2.37500 0.17475
2.62500 0.18570
2.87500 0.19972
3.12500 0.20784
3.37500 0.23040
3.62500 0.22474
3.87500 0.22708
4.12500 0.20431
4.37500 0.19895
4.62500 0.18908
4.87500 0.15632
5.12500 0.13677
5.37500 0.11566
5.62500 0.11097
5.87500 0.06615
6.12500 0.07080
6.37500 0.04750
6.62500 0.03959
6.87500 0.03033
7.12500 0.03142
7.37500 0.02243
7.62500 0.02888
7.87500 0.02992
8.12500 0.02508
8.37500 0.03813
8.62500 0.02524
8.87500 0.04346
9.12500 0.02879
9.37500 0.01755
9.62500 0.02720
9.87500 0.03391
10.12500 0.04930
10.37500 0.03232
10.62500 0.04241
10.87500 0.05161
11.12500 0.03410
11.37500 0.05316
11.62500 0.03265
11.87500 0.03624
12.12500 0.03818
12.37500 0.04616
12.62500 0.04538
12.87500 0.02502
13.12500 0.04839
13.37500 0.04378
13.62500 0.05710
13.87500 0.03344
14.12500 0.05292
14.37500 0.03537
14.62500 0.04408
14.87500 0.04866
