0.120000 0.235700
0.380000 -0.669660
0.620000 -0.973020
0.880000 -0.850580
1.120000 -0.952880
1.380000 -0.953520
1.620000 -0.940310
1.880000 -0.899890
2.120000 -0.960750
2.380000 -0.898490
2.620000 -0.956480
2.880000 -0.939560
3.120000 -0.943690
3.380000 -0.899930
3.620000 -0.924420
3.880000 -0.933430
4.120000 -0.917800
4.380000 -0.913530
4.620000 -0.916060
4.880000 -0.905410
5.120000 -0.866380
5.380000 -0.884910
5.620000 -0.808430
5.880000 -0.870050
6.120000 -0.851240
6.380000 -0.877190
6.620000 -0.847790
6.880000 -0.794710
7.120000 -0.861500
7.380000 -0.821520
7.620000 -0.835310
7.880000 -0.807610
8.120000 -0.801350
8.380000 -0.845120
8.620000 -0.807750
8.880000 -0.908730
9.120000 -0.871520
9.380000 -0.924620
9.620000 -1.102940
9.880000 -1.255970
10.120000 -1.445640
10.380000 -1.685950
10.620000 -1.235140
10.880000 -1.026320
11.120000 -1.821930
11.380000 -0.983190
11.620000 0.007830
11.880000 -1.681220
12.120000 -0.779730
12.380000 -1.347910
12.620000 -0.676640
12.880000 0.222840
13.120000 -0.880430
13.380000 2.526910
13.620000 -0.881190
13.880000 -0.250410
14.120000 -1.766850
14.380000 -1.126790
14.620000 -2.399750
14.880000 -1.459320
15.120000 -1.875640
15.380000 -1.846290
15.620000 -2.519340
15.880000 -2.253120
16.120000 -2.870980
16.380000 -2.545400
16.620000 -2.928490
16.880000 -3.074890
17.120000 -2.931920
17.380000 3.034410
17.620000 -3.074990
17.880000 2.601650
18.120000 2.757640
18.380000 2.668720
18.620000 3.004650
18.880000 3.017940
19.120000 2.691260
19.380000 2.992820
19.620000 2.431980
19.880000 2.065110
