0.12500 0.01987
0.37500 0.06647
0.62500 0.12207
0.87500 0.16732
1.12500 0.18605
1.37500 0.21981
1.62500 0.24438
1.87500 0.27436
2.12500 0.29195
2.37500 0.28766
2.62500 0.27160
2.87500 0.25356
3.12500 0.23824
3.37500 0.21974
3.62500 0.22537
3.87500 0.21241
4.12500 0.18717
4.37500 0.17186
4.62500 0.14868
4.87500 0.12965
5.12500 0.10166
5.37500 0.09349
5.62500 0.07007
5.87500 0.05871
6.12500 0.04943
6.37500 0.04015
6.62500 0.04022
6.87500 0.03339
7.12500 0.03015
7.37500 0.02569
7.62500 0.02298
7.87500 0.02708
8.12500 0.03051
8.37500 0.02193
8.62500 0.02732
8.87500 0.01439
9.12500 0.02149
9.37500 0.01692
9.62500 0.00833
9.87500 0.00681
10.12500 0.02055
10.37500 0.01794
10.62500 0.02195
10.87500 0.03152
11.12500 0.03076
11.37500 0.04874
11.62500 0.05617
11.87500 0.05310
12.12500 0.04770
12.37500 0.04604
12.62500 0.04670
12.87500 0.04584
13.12500 0.03821
13.37500 0.04367
13.62500 0.03351
13.87500 0.01530
14.12500 0.01715
14.37500 0.02852
14.62500 0.00591
14.87500 0.00447
