0.05000 -60512.19341 4147.93831 -30799.12637 50533.11632 70167.39781 60274.69312
0.15000 -69209.93721 -282.47758 -7107.86244 32461.42683 36696.19483 61815.74571
0.25000 -56633.00896 301.61869 -824.16737 22707.42111 16596.53457 46547.30117
0.35000 -43757.48322 -271.75719 1671.41007 15049.54148 9920.34949 36524.04627
0.45000 -35957.58660 213.65846 554.75992 12333.40118 7780.96789 30069.80947
0.55000 -31388.94669 48.29215 651.64748 9865.94814 4990.03226 25426.95052
0.65000 -27670.28443 203.22271 367.95992 7998.51658 4054.14909 22084.73003
0.75000 -24885.46428 -26.12493 735.77360 7190.52215 3406.26748 19219.87855
0.85000 -22536.23914 24.67509 766.53568 5814.89942 4528.98853 17238.76855
0.95000 -20549.10378 -146.40549 -139.37633 6316.04401 3707.38479 15495.46524
1.05000 -19314.99344 -49.35738 841.23550 4878.34593 3598.22054 13825.19775
1.15000 -17959.54917 31.37277 381.18112 4509.12645 2737.18109 12732.84294
1.25000 -16792.56354 -31.43336 -142.22847 4233.36312 3539.29344 11752.75851
1.35000 -15828.10794 -25.96564 -63.83275 3380.68228 2372.08962 10947.25389
1.45000 -15140.80538 -16.94003 717.68110 2990.44491 2081.65640 9945.79487
1.55000 -14325.65988 -46.30607 379.77209 2801.87434 2212.18933 9354.67995
1.65000 -13786.31673 14.26461 168.80924 2626.97706 2065.38396 8899.58459
1.75000 -13186.67841 65.67127 194.86148 2445.73769 1815.34270 8386.78839
1.85000 -12706.14342 0.95124 54.64988 2169.74002 2354.06274 7746.83079
1.95000 -12309.56465 19.45606 273.93534 2191.69833 1702.72831 7401.18913
2.05000 -11889.28819 55.94621 -49.39206 2545.81851 1532.03431 7161.60100
2.15000 -11615.71800 95.28305 193.62515 2227.76935 2856.79244 6464.01843
2.25000 -11239.47569 36.48510 86.79521 1606.65486 1254.74771 6107.21836
2.35000 -10986.66847 42.06773 167.54587 1485.59408 1315.29607 5721.88522
2.45000 -10693.58877 24.51942 -41.44335 1284.37609 1254.29052 5300.16414
2.55000 -10457.13717 40.81935 68.85662 1348.11022 1347.44615 5035.58154
2.65000 -10235.94510 56.99678 60.08755 1160.28318 1222.77928 4688.32673
2.75000 -9989.49954 63.96807 -34.92915 1735.54772 1125.97772 4628.05023
2.85000 -9827.36047 53.13680 159.33549 1334.78908 1817.83151 4334.65844
2.95000 -9612.57084 46.10942 16.50227 1103.56608 1136.77535 4161.74029
3.05000 -9417.19537 -21.20018 86.22553 1097.35697 1174.86533 4145.47283
3.15000 -9307.06489 37.77752 -4.11829 963.50710 958.07178 3842.02286
3.25000 -9111.50529 -23.94895 41.75680 2686.50717 1960.14380 4018.99465
3.35000 -9060.09837 20.05414 -53.35177 1507.64325 961.60027 3698.33225
3.45000 -8876.67972 29.77120 93.37260 841.12490 788.83901 3409.12281
3.55000 -8735.29232 10.57239 127.13948 907.70238 781.62141 3322.36162
3.65000 -8632.69665 20.19429 7.50590 954.30341 924.57085 3194.66739
3.75000 -8564.40638 30.72889 68.66629 742.88213 907.36985 3078.20819
3.85000 -8435.17281 23.79539 -62.59248 845.96936 716.49950 3386.30068
3.95000 -8333.74260 -1.46581 20.44687 911.01783 1008.08594 3016.82625
4.05000 -8201.42193 32.32752 11.61012 836.52758 748.83762 2843.37327
4.15000 -8141.32486 23.44712 -108.46790 937.72463 844.02262 2755.29500
4.25000 -8052.51470 -11.96332 -35.30589 851.47454 870.16884 2662.96044
4.35000 -7952.20112 -8.09053 -13.38140 975.73158 874.08214 2617.78391
4.45000 -7849.77454 20.16847 26.57815 687.01117 610.98822 2469.85972
4.55000 -7759.40817 20.22047 -9.75650 732.91896 565.20854 2478.39183
4.65000 -7683.43876 25.93671 11.78908 767.98480 909.17208 2344.19025
4.75000 -7576.18258 40.53919 -39.10658 593.04615 583.94723 2274.57847
4.85000 -7488.75092 2.54552 -18.68493 606.42475 733.41284 2175.83510
4.95000 -7404.31790 18.37221 14.00136 540.07296 595.35153 2102.30811
5.05000 -7332.82618 23.26757 -64.93285 690.58859 497.08589 2132.63551
5.15000 -7177.99131 16.69147 45.07930 1548.24830 580.77378 2145.87140
5.25000 -7165.06403 5.56734 -50.09457 831.49781 836.42908 1984.55709
5.35000 -7093.27357 23.01751 24.29094 911.13714 741.16556 1935.38575
5.45000 -6998.90918 12.47672 71.16334 802.84846 754.27407 2008.23415
5.55000 -6876.91541 4.95530 -34.98686 554.89663 588.36316 1854.27605
5.65000 -6786.50725 5.75671 -3.31301 659.11491 621.43125 1764.79657
5.75000 -6703.39193 29.01657 -56.84680 613.27454 555.10352 1691.60151
5.85000 -6613.87101 11.35775 -63.28121 510.31456 372.67612 1678.48663
5.95000 -6556.02977 8.95217 -89.14042 488.98976 427.10270 1631.03506
6.05000 -6471.73430 2.48556 -57.94554 601.00772 464.43658 1603.78508
6.15000 -6402.47972 -3.10577 -39.71492 432.98129 508.72785 1596.08576
6.25000 -6330.03577 18.40171 -6.40424 496.69371 379.19592 1510.59707
6.35000 -6211.43290 45.61201 -71.40867 1892.62520 1285.65385 1593.83273
6.45000 -6203.55277 6.23581 -59.68285 367.59486 349.68031 1382.06463
6.55000 -6119.61766 23.21671 -58.31763 530.98710 424.38463 1441.70649
6.65000 -6062.05778 -3.35887 -124.87996 569.52148 610.49849 1377.70177
6.75000 -6012.64462 18.59688 -84.79745 526.82924 383.39663 1403.42375
6.85000 -5977.04106 -6.50860 -55.77096 894.26749 1124.02960 2450.77228
6.95000 -5873.86169 8.30589 -114.38211 356.35286 295.59403 1272.39440
7.05000 -5824.41308 1.53552 -114.24071 490.38287 462.06756 1337.15317
7.15000 -5805.41089 -41.15521 -99.07237 1383.69181 1925.13436 1815.59881
7.25000 -5722.99817 51.28716 -103.95500 766.54697 1402.04723 1314.52710
7.35000 -5653.90926 12.19460 -133.86559 712.00355 376.90216 1261.37082
7.45000 -5632.73849 12.25427 -53.19520 280.89869 199.45239 1124.24593
7.55000 -5503.85520 -57.78363 -32.04879 2105.56144 2502.55859 2429.23626
7.65000 -5527.81859 -2.42091 -77.75999 383.23084 275.58917 1167.83157
7.75000 -5491.71879 -3.35918 -99.44753 326.07499 299.16562 1070.56961
7.85000 -5409.97514 12.27125 -132.98461 460.04537 357.73647 1088.85843
7.95000 -5379.81488 -8.71381 -102.76261 578.53970 511.77644 1076.58082
8.05000 -5339.37470 -5.25640 -82.76070 262.91548 234.97051 991.08832
8.15000 -5278.65110 -4.54492 -73.00387 291.63403 289.29533 961.46430
8.25000 -5259.29722 7.45062 -72.31879 321.85038 330.21733 944.61877
8.35000 -5187.77986 18.67750 -68.88256 222.27967 380.05422 918.17858
8.45000 -5177.40145 0.77881 -71.46333 405.16769 430.02402 916.72082
8.55000 -5123.73642 20.19903 -91.45830 387.01207 623.52230 897.84479
8.65000 -5077.28250 -1.06857 -12.04655 235.90342 227.15291 857.94218
8.75000 -5030.10221 6.89199 16.38147 364.52500 472.80977 857.03882
8.85000 -4988.35210 6.41543 -59.59392 229.27187 270.84020 841.31124
8.95000 -4948.96099 2.96606 -9.33005 270.39020 168.91668 802.81941
9.05000 -4909.07431 2.43452 -54.15138 224.89559 181.23736 818.84344
9.15000 -4864.77903 18.41233 -23.18747 292.82875 371.38766 775.81810
9.25000 -4819.14432 -0.52616 -28.46061 197.10646 179.68481 761.20142
9.35000 -4776.70244 7.02371 -55.48735 228.50412 168.39185 722.24684
9.45000 -4733.93697 5.09539 -104.62971 185.79154 178.42338 696.96200
9.55000 -4685.38372 9.29824 -77.41918 306.75766 280.98907 690.73812
9.65000 -4638.95072 4.82414 -55.19965 174.59388 174.29422 664.64803
9.75000 -4602.64965 3.12148 -63.98672 150.48642 153.63271 657.25752
9.85000 -4551.65641 9.36048 -58.72887 238.16332 333.66405 825.02098
9.95000 -4525.22572 5.16982 -46.06701 386.61307 337.64260 740.68059
10.05000 -4486.08500 2.75680 -67.16086 226.46959 303.15636 616.64167
10.15000 -4453.51391 2.99818 -72.63661 232.41340 160.11219 643.01405
10.25000 -4398.44357 7.90307 -71.61974 130.48218 120.85789 571.56552
10.35000 -4356.16292 2.25528 -78.98981 222.61820 281.54996 592.27777
10.45000 -4320.36680 3.59383 -64.87113 938.48372 307.96028 597.78129
10.55000 -4287.99590 0.59264 -44.91951 372.04011 173.30479 585.32207
10.65000 -4248.01296 -6.67654 -93.80037 302.48344 366.35670 600.91333
10.75000 -4216.72373 -16.27056 -42.18238 284.45785 334.38674 639.34724
10.85000 -4165.12731 -18.20752 -27.99786 174.94224 664.97754 976.53007
10.95000 -4143.81863 2.68588 -67.81311 152.39684 114.56555 514.77303
11.05000 -4108.61961 8.77509 -46.67396 204.08981 170.44989 481.03472
11.15000 -4057.72065 -1.82662 -86.54278 318.00804 289.72943 529.60693
11.25000 -4052.65952 9.75173 -68.36786 373.44840 208.88168 513.66664
11.35000 -3995.72651 0.14551 -40.52586 183.21046 171.93542 489.10738
11.45000 -3937.03162 89.58863 -152.52903 533.59003 2208.20476 1463.36523
11.55000 -3930.90839 10.04640 -72.56599 152.21748 152.07802 502.45439
11.65000 -3893.37462 -6.39725 -68.09975 140.35040 139.24583 454.60136
11.75000 -3856.05654 1.55189 -65.53745 184.17908 108.40978 441.25943
11.85000 -3835.28278 3.46240 -61.88027 129.44390 129.93954 416.29950
11.95000 -3818.62643 9.78703 -28.36643 300.81086 407.98194 541.55146
12.05000 -3763.98228 5.41352 -42.90045 131.23544 140.45352 421.48606
12.15000 -3751.31516 19.02018 -54.99933 197.27501 225.22674 434.23114
12.25000 -3710.82640 2.75591 -38.58786 196.31836 124.30625 384.80471
12.35000 -3682.20204 4.12397 -40.21863 132.77957 101.36743 381.97942
12.45000 -3636.75559 1.76782 -63.08486 132.78786 101.59039 365.82120
12.55000 -3624.69335 6.64659 -63.57476 161.01180 92.36745 350.38420
12.65000 -3593.57461 6.14946 -38.79081 132.23730 131.77208 359.00706
12.75000 -3560.95350 -5.40736 -56.33215 275.16327 111.12852 339.40716
12.85000 -3551.11547 15.02507 -43.50920 330.64948 123.08036 605.61785
12.95000 -3510.00386 -2.40272 -42.19491 163.84499 134.73699 343.05635
13.05000 -3464.76590 -8.95038 -37.52789 375.44252 262.33037 558.94409
13.15000 -3448.61036 0.09422 -53.86517 94.60382 99.84218 305.21242
13.25000 -3427.71018 -8.88808 -30.71340 182.49230 238.67881 334.52363
13.35000 -3394.20741 21.64511 -60.77151 105.92617 357.09687 287.50447
13.45000 -3380.13422 -5.74484 -66.66020 118.59796 90.52601 303.22101
13.55000 -3336.99294 0.97766 -60.19458 362.29270 167.96133 319.22280
13.65000 -3315.38847 -5.86797 -62.82510 80.15773 78.54824 275.31350
13.75000 -3291.50669 -2.74484 -62.56342 118.09031 90.12539 282.24213
13.85000 -3270.99283 6.01123 -73.60892 108.48139 109.91885 269.84830
13.95000 -3238.69639 0.27481 -59.32261 93.43266 69.98094 277.80598
14.05000 -3217.12667 -2.49024 -97.50031 120.15832 189.35108 303.73058
14.15000 -3194.03925 3.34484 -58.51617 74.71660 61.39396 258.13958
14.25000 -3172.06646 -7.66471 -93.64750 116.65237 191.23642 253.67415
14.35000 -3138.12675 5.69419 -106.39854 279.10734 105.88906 292.11876
14.45000 -3128.26459 -1.32024 -57.10885 84.29749 86.90355 231.08892
14.55000 -3089.94442 5.55985 -93.22684 122.36660 148.66575 249.72565
14.65000 -3081.44030 2.36714 -75.62672 75.44656 62.40331 242.29731
14.75000 -3058.60741 -4.30062 -77.79457 67.50304 109.96245 247.43121
14.85000 -3033.05290 3.06496 -75.31364 63.78080 62.25222 242.55454
14.95000 -3021.72586 5.34439 -58.16237 70.47759 72.51167 232.83892
15.05000 -2991.29306 4.46682 -88.85853 71.83997 66.17593 225.93178
15.15000 -2965.70858 -0.26393 -78.83056 69.74224 53.24653 208.14766
15.25000 -2954.88349 20.59231 -58.84069 165.29710 185.32231 259.14767
15.35000 -2916.93221 -16.38885 -85.71949 125.98046 216.70539 225.45369
15.45000 -2906.05998 2.52729 -40.41053 65.54498 140.11912 221.81640
15.55000 -2876.38041 10.18767 -52.26812 91.32300 175.85281 234.58020
15.65000 -2853.50252 -4.08582 -56.48162 69.54366 165.87675 222.83866
15.75000 -2847.10191 24.80821 -41.91182 74.29970 206.32261 223.26041
15.85000 -2827.31254 -1.35560 -63.93296 53.45260 59.36227 214.38235
15.95000 -2804.54584 8.86059 -62.28764 68.13285 73.40782 213.61019
16.05000 -2777.35154 -3.15804 -66.45738 83.01998 193.31984 331.38597
16.15000 -2769.37960 -0.14671 -63.86402 99.40684 69.14186 197.24569
16.25000 -2753.42951 -1.41805 -43.44621 71.94669 78.47003 195.31913
16.35000 -2722.13127 -4.57143 -56.07104 45.26279 69.22346 204.78171
16.45000 -2708.95565 -6.28008 -44.77292 78.89877 78.92850 202.81834
16.55000 -2691.42018 1.59095 -27.51184 56.85256 45.93822 215.35289
16.65000 -2659.35015 -15.77585 -51.61637 207.04085 285.61771 330.96883
16.75000 -2656.37062 -3.67959 -76.90844 84.19999 62.59961 184.55665
16.85000 -2633.02102 -9.85076 -42.54516 94.45032 115.99177 199.98658
16.95000 -2629.12399 2.39534 -59.60290 47.42178 62.06457 168.50164
17.05000 -2601.36388 -8.13672 -20.63667 118.78655 102.87792 201.22239
17.15000 -2602.95995 -0.01615 -50.95842 50.83678 50.91848 177.81827
17.25000 -2573.15530 4.88026 -64.35702 55.31969 66.43595 196.76766
17.35000 -2573.58189 -6.16577 -56.93145 88.47223 70.42453 173.05210
17.45000 -2543.27373 4.31189 -46.32918 38.87311 58.27831 164.46485
17.55000 -2540.55062 -8.56795 -50.90002 118.23304 113.53804 182.71345
17.65000 -2520.59211 -1.01487 -66.46230 119.41819 66.91290 159.00460
17.75000 -2504.01205 2.32258 -51.42991 46.11800 43.72351 173.25742
17.85000 -2483.88430 9.00983 -48.23337 46.07843 44.65992 164.98587
17.95000 -2546.44994 -22.78653 -31.90473 701.69479 223.19502 286.74483
18.05000 -2466.18935 -4.58445 -50.19418 116.77008 85.32193 156.93761
18.15000 -2427.66619 7.27543 -39.57975 213.92967 58.32757 179.01245
18.25000 -2422.78214 23.34070 -48.56766 41.39879 92.12161 144.61697
18.35000 -2421.21002 8.28614 -47.47955 45.67119 50.21135 142.04316
18.45000 -2416.77920 15.08279 -39.95572 66.09731 93.23410 166.44866
18.55000 -2393.83567 18.76782 -45.23126 99.29867 71.92002 133.00160
18.65000 -2379.70439 7.68378 -36.79273 48.60914 66.05976 134.38266
18.75000 -2367.27971 7.50462 -64.44944 41.72649 53.18116 123.82438
18.85000 -2337.46831 -7.16138 -66.71807 66.94944 62.75398 154.95221
18.95000 -2332.66403 5.26355 -39.40227 37.79715 42.93245 140.53535
19.05000 -2316.27327 5.78723 -36.47348 56.24865 61.66772 134.73631
19.15000 -2302.89588 -5.42430 -47.64611 50.47590 40.34332 143.30672
19.25000 -2295.87495 9.81998 -44.93966 67.08877 46.91514 142.08346
19.35000 -2273.46976 3.56099 -51.08620 43.11538 40.04646 129.64578
19.45000 -2301.30448 52.31353 -39.01079 203.60044 257.87206 158.08543
19.55000 -2253.31908 5.30126 -28.23550 28.87536 42.11189 125.62867
19.65000 -2249.05008 1.23841 -37.30379 40.85772 73.52275 92.26757
19.75000 -2243.19494 -7.21707 -48.74440 60.73589 54.53936 120.68732
19.85000 -2218.66632 1.50659 -52.98523 31.94704 33.67168 104.18079
19.95000 -2209.13926 4.58450 -25.91078 43.18901 40.22542 109.27550
