0.120000 3.004500
0.380000 -1.718450
0.620000 -1.861590
0.880000 -1.956770
1.120000 -1.900350
1.380000 -1.920350
1.620000 -1.918480
1.880000 -1.936810
2.120000 -1.952130
2.380000 -1.937090
2.620000 -1.935950
2.880000 -1.917360
3.120000 -1.940150
3.380000 -1.939690
3.620000 -2.024690
3.880000 -1.991800
4.120000 -2.031350
4.380000 -2.075660
4.620000 -2.107340
4.880000 -2.083800
5.120000 -2.080760
5.380000 -2.057810
5.620000 -2.071600
5.880000 -2.098510
6.120000 -2.079770
6.380000 -2.198310
6.620000 -2.262860
6.880000 -2.346880
7.120000 -2.309900
7.380000 -2.402270
7.620000 -2.228910
7.880000 -2.198740
8.120000 -2.195530
8.380000 -2.254570
8.620000 -2.183340
8.880000 -2.095770
9.120000 -1.976220
9.380000 -2.061140
9.620000 -1.800480
9.880000 -1.223480
10.120000 -1.835140
10.380000 -1.196450
10.620000 -2.081910
10.880000 -2.233140
11.120000 -2.513860
11.380000 -3.071830
11.620000 -2.958560
11.880000 -3.023550
12.120000 -3.129330
12.380000 2.893530
12.620000 2.674140
12.880000 2.680760
13.120000 2.602280
13.380000 2.320880
13.620000 2.141860
13.880000 2.082680
14.120000 1.844330
14.380000 1.802690
14.620000 1.861390
14.880000 1.359970
