0.12500 0.02097
0.37500 0.05031
0.62500 0.12611
0.87500 0.19475
1.12500 0.25053
1.37500 0.29029
1.62500 0.33783
1.87500 0.36801
2.12500 0.39094
2.37500 0.41030
2.62500 0.43580
2.87500 0.45889
3.12500 0.48368
3.37500 0.50598
3.62500 0.51813
3.87500 0.53590
4.12500 0.55502
4.37500 0.55340
4.62500 0.56676
4.87500 0.56792
5.12500 0.56294
5.37500 0.56799
5.62500 0.54105
5.87500 0.51474
6.12500 0.49612
6.37500 0.46917
6.62500 0.45624
6.87500 0.42982
7.12500 0.40847
7.37500 0.40013
7.62500 0.39621
7.87500 0.39134
8.12500 0.39247
8.37500 0.40549
8.62500 0.39076
8.87500 0.36688
9.12500 0.34837
9.37500 0.28514
9.62500 0.22606
9.87500 0.16285
10.12500 0.14840
10.37500 0.09727
10.62500 0.08471
10.87500 0.07539
11.12500 0.05090
11.37500 0.05544
11.62500 0.05984
11.87500 0.03092
12.12500 0.04327
12.37500 0.02080
12.62500 0.03040
12.87500 0.02904
13.12500 0.04746
13.37500 0.02904
13.62500 0.03306
13.87500 0.02516
14.12500 0.04784
14.37500 0.06954
14.62500 0.07905
14.87500 0.12244
