0.05000 -1467.03995 198.25911 -130331.41347 1001.66311 1641.15844 433632.69240
0.15000 -2706.82069 -24.67965 10560.73131 1448.49588 1449.12341 486726.58181
0.25000 -3875.98408 92.06119 -17690.49363 1422.87394 1304.46372 413361.09920
0.35000 -5021.43787 75.26855 -9115.27809 1357.53817 1217.67415 445079.31746
0.45000 -6091.66994 73.02053 -5094.45402 1188.77006 1106.73909 360481.02848
0.55000 -6809.98938 62.75614 -468.65884 1242.72546 1001.82732 461551.70726
0.65000 -7204.05427 68.29175 8257.52363 1376.79220 917.47245 402599.84019
0.75000 -7571.30164 119.65902 1234.95633 1420.84091 880.33588 368395.41776
0.85000 -7919.71625 111.47025 -2520.53491 1420.06489 781.49892 300317.45967
0.95000 -8035.87811 106.33486 3832.43628 1344.41955 756.59356 329407.45536
1.05000 -8163.76108 115.72350 -5993.62363 1284.87824 724.86947 314768.76875
1.15000 -8300.76516 115.05223 -3790.91023 1235.87389 685.81232 295774.03248
1.25000 -8309.18475 130.29957 -3422.08602 1208.07534 669.69859 307347.40952
1.35000 -8325.08281 124.24550 516.47260 1158.48737 659.72105 296828.93186
1.45000 -8273.71466 131.67747 1765.16644 1118.51004 657.03255 259948.95308
1.55000 -8227.20998 105.22128 3978.33314 1060.60481 657.35544 262539.85179
1.65000 -8216.67993 105.99946 -1648.54043 1006.15851 659.20294 242382.45764
1.75000 -8165.40757 124.53649 -2593.88468 970.88776 651.88457 252925.91047
1.85000 -8112.88304 123.49162 -4378.92368 870.17810 653.09511 222761.60676
1.95000 -8129.46023 109.60867 1833.41928 793.99217 647.37706 221171.40182
2.05000 -8106.37710 133.02248 1030.51664 745.52944 635.47597 241632.48334
2.15000 -8064.98797 113.05706 6500.46638 686.53021 636.49857 201456.84412
2.25000 -8040.90544 115.79724 -966.85577 626.23527 616.71968 191174.86689
2.35000 -8017.52966 116.72750 3107.49131 588.59794 612.45127 200043.24982
2.45000 -7966.25223 106.39108 -3093.69924 547.64891 607.66708 197064.42120
2.55000 -7932.34555 102.40173 -1819.47075 524.46869 600.78368 176118.28896
2.65000 -7887.04541 111.85111 2561.60285 496.65208 585.93468 204957.19897
2.75000 -7833.41829 113.23544 5219.14409 457.11679 579.50132 164028.47549
2.85000 -7782.27056 103.97583 -1546.97402 437.14919 572.62968 167919.08931
2.95000 -7728.63008 111.69052 -2022.49438 397.10063 556.10593 152548.98661
3.05000 -7687.37871 94.82456 -466.50447 374.29260 545.20270 157123.97673
3.15000 -7663.00359 99.10019 -3119.91664 348.84134 525.30123 143063.61166
3.25000 -7629.02355 96.48810 -1672.31518 333.90377 509.69557 131479.16012
3.35000 -7560.96307 94.18958 -1075.48325 328.61349 489.88290 124395.31064
3.45000 -7494.92327 86.43270 -173.00436 325.09161 485.43276 132185.08568
3.55000 -7438.59735 92.92901 1105.88130 322.66034 461.17715 122722.44342
3.65000 -7387.66131 97.34126 -1370.11791 311.21124 449.56920 123917.61829
3.75000 -7334.65514 93.84626 1844.29959 292.46848 440.50478 119538.96951
3.85000 -7296.74597 88.09601 800.92694 285.69568 424.86317 114869.24757
3.95000 -7262.98477 96.67220 622.49018 286.98633 406.34197 106100.03960
4.05000 -7218.87052 86.01871 -1832.07576 279.18683 390.18816 100971.20056
4.15000 -7160.06779 82.91811 -1108.52998 277.17152 379.19049 103085.07321
4.25000 -7103.49580 83.13210 344.50988 269.46619 364.97081 100648.85697
4.35000 -7055.28927 81.12248 876.97236 275.35580 354.49601 104201.25844
4.45000 -7011.83040 76.45998 713.59655 276.71446 342.60553 89883.08057
4.55000 -6964.51393 79.13930 378.87248 280.23671 326.78475 87316.22295
4.65000 -6928.96722 78.85047 2302.46348 276.44011 318.24593 95128.30626
4.75000 -6881.76749 80.58092 -743.05755 272.69468 305.85503 96786.16359
4.85000 -6849.77870 83.69099 366.90998 263.02763 301.97106 84281.32154
4.95000 -6803.86222 79.36542 -609.71997 266.63120 281.47381 83988.79189
5.05000 -6751.96065 80.43068 -365.96549 267.64095 272.92455 77596.51271
5.15000 -6707.61172 83.66892 1438.83537 275.31526 266.50680 87365.50130
5.25000 -6647.87442 82.31596 -782.77567 269.33249 251.25457 71083.18299
5.35000 -6608.30763 83.59151 2202.05589 265.24699 246.84862 74054.14726
5.45000 -6565.72666 75.92536 203.11292 261.61704 239.03570 67213.46412
5.55000 -6523.67552 72.71404 1357.40496 248.88813 226.62322 77378.46212
5.65000 -6471.74867 66.23662 -1416.06129 246.05922 217.30688 67763.75176
5.75000 -6421.13893 71.89017 656.27674 241.16917 209.81788 65116.92381
5.85000 -6362.38781 68.04512 -598.79321 241.10466 201.34691 72722.69091
5.95000 -6314.58127 69.94047 939.42136 234.97271 203.80512 52578.93963
6.05000 -6265.60237 68.91622 1684.43225 229.11177 195.40850 54958.99645
6.15000 -6213.91402 64.77563 -485.76677 231.75489 191.72285 54436.76693
6.25000 -6175.04340 69.14145 -90.86759 223.34750 189.30520 61437.79670
6.35000 -6139.40141 60.38487 -192.32181 217.89556 183.06525 65488.83581
6.45000 -6084.56816 64.94078 -924.06539 205.50725 175.76304 47828.94574
6.55000 -6047.71671 57.93739 1360.01692 196.23677 171.49862 47527.12785
6.65000 -5996.60438 59.82573 -383.11901 195.32181 165.64639 56413.69774
6.75000 -5955.59903 61.02977 462.83180 195.61649 159.21638 44726.16140
6.85000 -5907.79831 61.75953 -722.27816 193.97981 161.61016 57108.23551
6.95000 -5859.73229 61.11296 150.67820 191.40847 156.28410 42590.91028
7.05000 -5818.44406 56.93263 9.89970 185.94242 155.49443 43312.57054
7.15000 -5779.03607 55.30543 -251.69891 184.34074 150.30244 45173.17471
7.25000 -5736.44762 57.09168 135.57325 183.12996 146.95247 46146.96586
7.35000 -5695.14266 55.87621 -139.79556 181.32166 145.72027 38019.86232
7.45000 -5653.81045 52.69085 -838.94321 176.37492 143.84041 37850.98077
7.55000 -5607.81536 55.43061 619.55164 167.42220 135.99446 36292.30422
7.65000 -5561.65567 54.69776 -701.04631 164.93328 131.95888 33111.45747
7.75000 -5517.28879 54.18771 -60.97542 161.97310 130.85016 44278.39077
7.85000 -5472.95460 49.44212 384.41558 163.64799 128.59357 31832.49580
7.95000 -5424.14848 49.37776 24.21732 157.46289 129.68009 33443.39558
8.05000 -5380.38431 47.65501 192.36626 151.34879 127.87840 32822.75363
8.15000 -5333.16631 50.58891 238.89099 144.99568 121.46665 28783.32146
8.25000 -5293.60774 47.17178 231.42203 139.34404 122.43716 42105.48505
8.35000 -5251.53907 46.06971 -515.49232 131.66057 125.14250 28061.55615
8.45000 -5207.58803 44.81343 -790.35797 129.30933 115.02091 28556.60374
8.55000 -5165.35144 43.82465 1022.05326 131.04609 117.10521 28976.14269
8.65000 -5120.10533 45.17566 -157.72964 128.84533 115.27329 29303.59056
8.75000 -5079.18049 42.91515 51.74290 120.66120 117.02761 26241.66175
8.85000 -5035.08909 41.85746 -907.31085 122.59118 111.82646 25824.41860
8.95000 -4996.27290 40.67665 -198.78794 119.74619 109.20170 25888.47360
9.05000 -4952.92452 41.03203 -678.34091 113.87321 104.21208 53169.81198
9.15000 -4909.79640 40.68926 -226.47195 119.39083 103.89769 30821.70557
9.25000 -4872.65158 38.85405 -154.41729 116.09569 106.73046 27087.87661
9.35000 -4831.13561 38.36780 -201.14869 119.41501 102.17719 23377.33596
9.45000 -4792.69763 36.16338 166.12629 116.23311 105.08188 27649.09097
9.55000 -4757.12629 35.73017 -222.23474 112.32092 98.32918 22392.25624
9.65000 -4715.28184 33.64452 -428.48144 113.18673 107.53807 22288.44810
9.75000 -4681.40275 35.65581 445.34216 113.20499 100.61611 21530.88126
9.85000 -4647.37388 35.72007 -56.32026 105.37863 95.85500 20675.63793
9.95000 -4610.79888 34.58680 -201.96915 107.64331 97.52306 19429.67156
10.05000 -4577.17091 34.83996 250.65131 95.62824 95.10695 16452.24234
10.15000 -4540.91821 33.53603 -837.89334 97.20176 97.85124 18080.11915
10.25000 -4506.23723 27.16781 -299.60839 95.31154 93.47288 18850.80463
10.35000 -4473.66324 31.56362 -134.60725 91.89668 94.15632 15899.01893
10.45000 -4438.80591 32.50044 -221.82270 96.40168 90.79196 15899.90496
10.55000 -4410.24689 27.23961 -558.10016 95.73190 95.28627 15419.86470
10.65000 -4372.98463 30.77982 60.85890 92.51539 86.01900 16247.72364
10.75000 -4336.01537 33.19071 -288.38585 88.61005 88.67184 15361.97043
10.85000 -4302.02375 29.06481 -197.15924 94.18808 92.01570 13923.88513
10.95000 -4268.98636 29.70575 -385.67357 92.09484 89.71842 13930.78630
11.05000 -4235.81152 26.26203 53.09200 98.29399 89.76680 13799.82276
11.15000 -4206.72492 28.58487 -175.10534 90.39832 86.77491 19993.19216
11.25000 -4176.13143 25.78825 -416.87831 89.75806 85.65287 14276.95320
11.35000 -4141.44478 26.90337 -327.90148 90.87784 82.18372 15567.08265
11.45000 -4111.83251 26.70303 -249.41962 93.17911 86.67219 12286.56731
11.55000 -4082.00606 28.15760 -317.47650 94.32020 91.86092 32524.37015
11.65000 -4050.82596 26.99694 -308.69026 90.94194 83.43182 10260.69942
11.75000 -4020.88635 26.29812 -206.37127 87.61351 79.02141 11034.48542
11.85000 -3992.09049 26.26258 -182.87423 90.63444 85.13236 11482.77950
11.95000 -3961.81910 26.84915 -304.45784 85.93447 82.28377 12266.87497
12.05000 -3936.24900 23.06269 -175.55373 87.37809 76.25450 10348.91858
12.15000 -3902.99897 25.86219 -294.65963 82.82392 74.97855 10750.60599
12.25000 -3875.07382 23.33685 -267.11123 76.81884 74.84913 11722.95233
12.35000 -3845.05746 24.70631 -539.85592 91.06913 81.64717 10717.03091
12.45000 -3820.78391 24.52035 -344.84045 84.50375 77.29174 21251.73267
12.55000 -3796.00141 27.13863 -322.17578 81.81519 79.24673 8859.85855
12.65000 -3773.43582 22.81827 -380.23593 79.82411 74.82690 8455.54723
12.75000 -3749.42748 23.30778 -116.91591 84.12817 78.89375 9524.98739
12.85000 -3720.54213 22.72510 129.20072 86.02602 70.56995 9515.07388
12.95000 -3692.01772 19.89107 -401.59455 79.84489 69.40376 9774.37944
13.05000 -3669.97183 22.30021 -243.10579 77.30203 69.19948 8311.16606
13.15000 -3643.41377 21.26965 -202.71175 79.99388 77.56867 7988.10216
13.25000 -3621.77765 20.34657 -257.84316 87.73257 77.67413 8673.99328
13.35000 -3594.68057 19.57760 -62.68423 76.00283 66.94435 7096.58880
13.45000 -3568.59197 21.72489 79.51416 80.17569 68.44448 6955.66803
13.55000 -3548.58997 18.78547 -145.78837 78.96371 75.52832 7759.45479
13.65000 -3525.69943 19.85869 -117.18941 74.88807 70.84621 8029.62030
13.75000 -3499.99840 21.40358 -115.68906 75.65658 71.43387 6880.24344
13.85000 -3478.01701 19.49574 -102.38540 73.84536 58.58417 6893.85627
13.95000 -3451.10029 19.26348 196.12355 72.86827 70.66503 7078.19176
14.05000 -3424.63396 18.28623 -350.77338 75.97282 63.78883 6729.65492
14.15000 -3398.38700 19.01775 -122.17816 72.28760 66.13639 6024.15976
14.25000 -3372.04337 18.35028 -6.88943 69.67471 60.26521 7052.22048
14.35000 -3346.58541 17.74985 -112.29289 61.61432 56.02868 6611.05691
14.45000 -3323.36563 18.21728 -134.47978 72.11662 66.89311 7186.33876
14.55000 -3297.51474 17.07003 -188.13003 61.00214 58.68122 5533.26293
14.65000 -3276.70798 17.05203 149.10723 59.02802 58.33078 5560.60785
14.75000 -3251.93716 14.23302 -42.84046 59.65739 64.68384 6159.96024
14.85000 -3229.39958 19.56940 17.73610 60.47856 60.17181 6283.04133
14.95000 -3205.66106 16.01529 -61.21023 66.08347 58.91892 5613.32160
15.05000 -3181.15973 17.01587 -125.51081 62.22321 55.69348 5045.96829
15.15000 -3157.72133 14.92139 -138.03215 61.87126 56.53770 5836.96182
15.25000 -3133.57953 17.61847 148.91605 66.68697 57.51236 5020.52555
15.35000 -3117.60763 18.67364 -51.13293 61.60344 52.39399 4359.95537
15.45000 -3093.55716 15.64269 12.74283 55.02086 62.91440 6316.70136
15.55000 -3070.77762 15.70627 -26.61582 70.41389 55.53684 5829.95106
15.65000 -3049.48614 15.36420 19.53564 51.08267 48.87971 4563.52791
15.75000 -3024.91716 16.57909 -91.26501 56.62219 62.96698 4127.10483
15.85000 -3001.45437 12.97068 42.90935 65.17596 67.88535 4137.27314
15.95000 -2988.02341 16.45897 -258.16118 61.82655 53.31772 5107.01015
16.05000 -2965.26864 15.52450 -276.24064 58.64221 51.23591 4026.17259
16.15000 -2945.79517 12.53576 -93.08502 50.99447 48.91043 5828.65209
16.25000 -2927.05379 13.27563 -69.26136 53.75235 51.81443 3781.78198
16.35000 -2908.49621 15.11367 23.71172 60.53580 52.23279 4140.68479
16.45000 -2888.00719 14.34472 30.94249 65.98592 48.72889 3565.78173
16.55000 -2869.64607 13.07934 182.37559 56.86979 51.18917 4439.84963
16.65000 -2850.95648 14.73596 -137.35331 56.84444 47.73454 3814.37940
16.75000 -2832.07612 11.90661 -1.90578 58.78386 55.87778 3209.86153
16.85000 -2814.21892 15.41822 76.53690 56.04216 44.01144 3392.55162
16.95000 -2793.34251 12.45466 46.39304 57.26790 54.90386 3987.18210
17.05000 -2777.40657 13.34388 -75.26542 55.94950 44.05631 3073.57213
17.15000 -2758.78599 12.88278 -175.93974 56.89442 47.27551 2896.47999
17.25000 -2745.67196 13.65984 -244.01595 59.13296 56.44222 3693.57565
17.35000 -2732.18930 14.25225 51.59165 56.53263 51.72445 2832.18838
17.45000 -2704.99514 13.82121 24.41347 55.69497 43.08769 2634.07355
17.55000 -2688.77908 10.39525 -154.22155 59.13399 52.04839 3406.85323
17.65000 -2677.12820 13.71096 -79.60620 60.82182 53.81020 4398.48927
17.75000 -2664.45224 10.96789 -68.82113 55.04484 44.49142 3230.25846
17.85000 -2648.81277 11.54017 21.56140 44.03056 37.72052 2235.78544
17.95000 -2633.92476 9.51815 -133.32170 54.81934 44.38737 2561.09838
18.05000 -2617.12030 11.37984 -39.39471 45.51426 37.92797 3442.61591
18.15000 -2598.18748 14.50625 -55.35090 60.41302 50.60829 2886.14234
18.25000 -2585.50897 12.35568 -47.33204 46.09628 42.17352 2425.89551
18.35000 -2572.06151 10.17069 -28.22228 45.17373 43.75522 2301.20701
18.45000 -2556.01300 9.44265 -37.59178 44.86646 36.30058 2363.75121
18.55000 -2538.92286 9.57007 -91.04725 44.00930 39.22259 2446.51347
18.65000 -2524.15106 9.98656 -7.05636 63.69493 52.20476 2125.86298
18.75000 -2510.97738 10.91072 -8.33605 38.79960 35.19492 2431.80462
18.85000 -2493.40121 11.34801 -28.35212 60.18583 53.20080 2878.68639
18.95000 -2481.27959 12.39302 21.44895 55.04551 54.05939 2114.81429
19.05000 -2462.02296 8.22984 -52.27742 53.40077 40.64505 2254.13392
19.15000 -2453.30465 11.71578 -8.81425 51.74421 49.77719 2732.50459
19.25000 -2437.64441 11.40815 -78.16050 63.82306 56.54764 1774.47662
19.35000 -2423.52920 12.48320 -55.97827 54.97925 47.27695 2291.37191
19.45000 -2406.44030 10.05896 -25.73516 58.35560 44.90324 2584.36078
19.55000 -2396.08561 11.69074 34.25993 36.63838 36.98354 2297.06871
19.65000 -2380.86867 11.43438 -30.41482 45.49410 47.16011 2673.48023
19.75000 -2363.30855 11.92216 -8.86606 48.00893 47.40216 2728.51676
19.85000 -2351.60076 12.21409 -181.77307 45.85829 48.34081 2531.17938
19.95000 -2340.63878 9.11176 139.46990 33.98614 36.91401 3303.81868
