0.12500 0.01194
0.37500 0.07245
0.62500 0.15887
0.87500 0.23588
1.12500 0.29992
1.37500 0.35494
1.62500 0.40195
1.87500 0.43766
2.12500 0.46711
2.37500 0.51045
2.62500 0.52737
2.87500 0.54518
3.12500 0.56763
3.37500 0.58969
3.62500 0.59442
3.87500 0.58614
4.12500 0.57348
4.37500 0.55013
4.62500 0.51571
4.87500 0.47147
5.12500 0.40998
5.37500 0.34730
5.62500 0.29182
5.87500 0.25985
6.12500 0.24436
6.37500 0.23825
6.62500 0.24181
6.87500 0.24581
7.12500 0.24437
7.37500 0.23680
7.62500 0.21003
7.87500 0.19029
8.12500 0.17023
8.37500 0.12274
8.62500 0.10458
8.87500 0.07916
9.12500 0.05649
9.37500 0.06007
9.62500 0.05376
9.87500 0.03776
10.12500 0.03438
10.37500 0.06099
10.62500 0.05716
10.87500 0.06070
11.12500 0.07428
11.37500 0.05616
11.62500 0.05746
11.87500 0.05273
12.12500 0.06129
12.37500 0.04343
12.62500 0.06926
12.87500 0.09188
13.12500 0.09640
13.37500 0.10746
13.62500 0.12105
13.87500 0.13728
14.12500 0.15385
14.37500 0.17680
14.62500 0.15064
14.87500 0.13495
