0.05000 837.86095
0.15000 2290.53976
0.25000 3668.03342
0.35000 4628.07106
0.45000 4999.91920
0.55000 5675.19613
0.65000 5912.24202
0.75000 6048.79406
0.85000 6014.33241
0.95000 6076.34385
1.05000 5938.59347
1.15000 5908.99861
1.25000 5780.95551
1.35000 5608.61689
1.45000 5470.90688
1.55000 5345.97587
1.65000 5136.91458
1.75000 5041.46754
1.85000 4908.20089
1.95000 4752.57912
2.05000 4650.54453
2.15000 4475.71751
2.25000 4359.86596
2.35000 4269.29978
2.45000 4156.69017
2.55000 3994.25618
2.65000 3852.81430
2.75000 3769.00718
2.85000 3662.71045
2.95000 3538.34281
3.05000 3431.60090
3.15000 3370.79119
3.25000 3209.53253
3.35000 3155.38798
3.45000 3063.49429
3.55000 2967.99396
3.65000 2859.27731
3.75000 2797.38498
3.85000 2700.82998
3.95000 2667.50833
4.05000 2557.52628
4.15000 2495.17196
4.25000 2420.20095
4.35000 2342.50276
4.45000 2289.17493
4.55000 2287.04725
4.65000 2174.22691
4.75000 2128.15147
4.85000 2059.21986
4.95000 2020.36730
5.05000 1971.30271
5.15000 1931.26358
5.25000 1874.49743
5.35000 1848.42887
5.45000 1795.77697
5.55000 1727.14959
5.65000 1698.77064
5.75000 1646.60640
5.85000 1623.09471
5.95000 1570.35464
6.05000 1523.81620
6.15000 1485.63455
6.25000 1455.64263
6.35000 1411.03896
6.45000 1375.80517
6.55000 1369.04049
6.65000 1315.38869
6.75000 1300.24036
6.85000 1274.23008
6.95000 1213.44389
7.05000 1192.48849
7.15000 1169.01012
7.25000 1152.77923
7.35000 1104.82382
7.45000 1072.89752
7.55000 1062.83384
7.65000 1047.73559
7.75000 1012.23495
7.85000 1000.04968
7.95000 969.14880
8.05000 952.32756
8.15000 920.63889
8.25000 899.34153
8.35000 882.47580
8.45000 867.08552
8.55000 850.32963
8.65000 817.84092
8.75000 813.51312
8.85000 793.47422
8.95000 768.74356
9.05000 753.48785
9.15000 738.00003
9.25000 727.26877
9.35000 698.81163
9.45000 675.58503
9.55000 680.55335
9.65000 663.26356
9.75000 630.27346
9.85000 628.05380
9.95000 629.87344
10.05000 611.05231
10.15000 603.58243
10.25000 587.10089
10.35000 573.49659
10.45000 554.89326
10.55000 543.36772
10.65000 538.44178
10.75000 522.10080
10.85000 514.86007
10.95000 500.48146
11.05000 485.54950
11.15000 476.64499
11.25000 470.55253
11.35000 455.91459
11.45000 443.61152
11.55000 435.01116
11.65000 427.43785
11.75000 417.55020
11.85000 409.74090
11.95000 405.44221
12.05000 403.79674
12.15000 386.38690
12.25000 379.43840
12.35000 373.11744
12.45000 372.79859
12.55000 359.11132
12.65000 344.99526
12.75000 343.87358
12.85000 338.98920
12.95000 325.06491
13.05000 326.67323
13.15000 315.25973
13.25000 304.91472
13.35000 297.48904
13.45000 298.12420
13.55000 292.85861
13.65000 275.45358
13.75000 282.61962
13.85000 271.67067
13.95000 266.18709
14.05000 264.08352
14.15000 252.49153
14.25000 262.51080
14.35000 255.07986
14.45000 247.17927
14.55000 234.29217
14.65000 233.84084
14.75000 228.00090
14.85000 226.18045
14.95000 217.59357
15.05000 219.67237
15.15000 210.47078
15.25000 199.93097
15.35000 208.95692
15.45000 195.45322
15.55000 200.39477
15.65000 190.18414
15.75000 185.35409
15.85000 178.94606
15.95000 180.48601
16.05000 180.63002
16.15000 173.99497
16.25000 177.36172
16.35000 170.57431
16.45000 164.74095
16.55000 164.11981
16.65000 158.13605
16.75000 162.64641
16.85000 160.04678
16.95000 159.28961
17.05000 145.37941
17.15000 144.86539
17.25000 147.61339
17.35000 141.64818
17.45000 137.43476
17.55000 141.72580
17.65000 139.85613
17.75000 138.53446
17.85000 133.91917
17.95000 129.80646
18.05000 121.41829
18.15000 131.02774
18.25000 120.97507
18.35000 119.09691
18.45000 119.91663
18.55000 118.77706
18.65000 119.47917
18.75000 109.36949
18.85000 110.44264
18.95000 114.74187
19.05000 120.62677
19.15000 105.61188
19.25000 104.90781
19.35000 104.98956
19.45000 102.83361
19.55000 105.65907
19.65000 105.32857
19.75000 105.20450
19.85000 105.25581
19.95000 96.30663
