0.450000 0.091590
1.350000 1.279750
2.250000 2.367170
3.150000 2.297690
4.050000 1.223130
4.950000 1.301500
5.850000 0.672380
6.750000 0.682630
7.650000 0.097120
8.550000 -0.785070
9.450000 0.370110
10.350000 2.732190
11.250000 2.380490
12.150000 2.265280
13.050000 1.501990
13.950000 1.754240
14.850000 1.890500
15.750000 2.121400
16.650000 2.783690
17.550000 2.456730
