0.120000 0.271880
0.380000 0.612620
0.620000 0.476130
0.880000 0.667910
1.120000 0.625860
1.380000 0.641920
1.620000 0.665090
1.880000 0.641690
2.120000 0.653940
2.380000 0.638900
2.620000 0.630670
2.880000 0.634630
3.120000 0.649750
3.380000 0.646690
3.620000 0.630790
3.880000 0.631540
4.120000 0.637170
4.380000 0.602520
4.620000 0.606480
4.880000 0.571790
5.120000 0.564650
5.380000 0.525620
5.620000 0.505010
5.880000 0.489990
6.120000 0.486140
6.380000 0.473830
6.620000 0.476950
6.880000 0.501500
7.120000 0.484230
7.380000 0.448400
7.620000 0.442450
7.880000 0.376150
8.120000 0.432210
8.380000 0.443940
8.620000 0.601720
8.880000 0.669760
9.120000 0.795760
9.380000 0.843920
9.620000 0.959430
9.880000 1.074920
10.120000 1.169410
10.380000 1.287270
10.620000 1.448610
10.880000 1.325370
11.120000 1.295940
11.380000 1.525000
11.620000 1.409870
11.880000 1.399310
12.120000 1.183900
12.380000 1.282880
12.620000 1.233100
12.880000 2.064070
13.120000 1.355240
13.380000 2.111540
13.620000 1.583590
13.880000 1.977550
14.120000 1.951810
14.380000 3.066020
14.620000 1.656110
14.880000 0.607900
