0.2 2.54621 19.27483 1.87441 70.49812 68.02862 68.0875
0.6 1.48521 41.17187 2.27166 65.84605 66.58234 64.84598
1.0 0.11897 65.40407 1.77025 61.54948 62.19396 61.09373
1.4 -0.69538 87.26612 -0.57087 58.34223 58.19916 57.89234
1.8 -3.35558 103.18773 -0.8731 55.36368 54.89143 54.30622
2.2 -3.55683 116.91585 -0.25428 53.932 52.42081 52.23268
2.6 -3.15361 128.83836 -0.81621 52.44803 50.07492 50.051
3.0 -1.45142 137.46697 -2.45591 51.5164 48.08729 48.05348
3.4 -1.11015 143.76666 -3.62453 49.32442 45.85347 45.71912
3.8 -2.57173 150.51207 -4.58694 46.26441 43.83083 43.23866
4.2 -4.21743 157.50062 -4.93668 43.00231 39.72985 40.59816
4.6 -4.42248 163.53541 -4.22672 40.58805 36.15039 38.67696
5.0 -3.02692 169.44471 -2.59842 39.70897 33.1409 36.91419
5.4 -1.57848 173.96031 -0.97307 38.45394 31.34811 34.77549
5.8 0.80097 177.94073 -0.07387 37.82099 30.10742 33.0959
6.2 1.77498 182.57377 0.83311 36.86585 28.55553 31.61246
6.6 1.92771 186.61924 1.72113 35.82529 27.35925 30.51313
7.0 1.42264 191.15115 2.32673 34.21228 25.9718 28.9176
7.4 0.15192 194.05949 2.48631 32.40336 24.99832 27.43284
7.8 -0.30895 196.96186 3.18443 30.50548 24.19341 26.02743
8.2 -1.14514 198.91783 3.01441 28.7455 23.5192 25.11788
8.6 -1.98066 200.29115 3.42434 27.21449 23.20772 24.19716
9.0 -2.00665 201.35031 2.85699 25.1983 22.5936 23.18136
9.4 -1.93256 202.50007 2.49089 23.4687 22.04649 22.16145
9.8 -2.6061 202.92278 1.96509 22.35771 21.76857 21.49798
10.2 -2.15268 203.45979 2.01263 21.24659 21.08578 20.73539
10.6 -1.80159 203.9383 1.97983 19.97159 20.7431 19.80274
11.0 -1.44355 204.16988 1.70179 19.24187 20.59189 19.10358
11.4 -0.85399 204.53339 1.71 18.7958 19.79073 18.424
11.8 0.07127 204.8468 1.67209 17.97991 19.43909 17.49108
12.2 0.46586 205.6285 1.45948 17.73302 18.47472 16.60796
12.6 1.09613 205.98402 1.48131 17.75784 17.71784 16.20248
13.0 1.62715 206.38324 1.25276 17.47407 17.11456 15.42453
13.4 2.24856 206.28709 1.21644 17.52626 16.56877 14.99209
13.8 3.04188 206.84153 1.36305 17.65504 15.62036 14.22466
14.2 3.44495 207.28771 1.01548 17.37407 15.14812 13.5553
14.6 3.82737 207.65211 1.0428 17.28144 14.01321 12.96934
15.0 3.97608 207.99607 1.14546 17.11662 12.87569 12.52125
15.4 4.15825 208.5023 0.92391 16.97385 12.29557 12.04333
15.8 4.28688 209.12503 0.63393 16.87452 11.38829 11.54702
16.2 3.84846 209.2353 1.08117 16.80729 10.69037 11.04917
16.6 4.65563 209.00609 1.02475 16.31932 10.55014 10.77018
17.0 4.18765 209.48518 0.68217 15.87896 9.20572 10.56326
17.4 3.98383 209.84647 0.57736 15.58787 8.50569 9.98154
17.8 3.79086 209.9771 0.79546 15.08773 7.8666 9.65968
18.2 3.99288 209.8291 0.89991 14.4298 7.24952 9.38808
18.6 3.1352 210.11045 0.53228 13.82981 7.01078 9.0082
19.0 3.41811 210.1216 0.78022 13.24564 6.55493 8.89538
19.4 2.92347 210.17266 0.77646 13.01352 6.14828 8.23458
19.8 3.26968 209.90592 0.94715 13.14738 6.29413 8.20998
