0.05000 -3268.63142 46.63797 24858.40902 4040.48475 4521.57677 959614.97613
0.15000 -7501.55575 97.78528 -16144.69895 3656.14654 4234.83219 815161.86129
0.25000 -10912.94128 75.62455 3423.78829 3355.58763 4100.66532 763021.75438
0.35000 -13674.51290 156.66076 -14217.81795 3179.38184 3965.70564 735107.51847
0.45000 -15576.87152 243.14012 -4126.08784 2958.84526 3954.20088 644027.80968
0.55000 -16852.29441 217.55834 -10268.79153 2911.96303 3932.73212 596528.10988
0.65000 -17380.50403 157.65505 -1936.87328 2821.74128 3876.36746 549679.46727
0.75000 -17638.56533 201.04932 -491.62161 2579.70870 3823.00136 523542.94697
0.85000 -17501.68057 182.18843 -3240.52168 2371.03781 3781.23588 450980.64235
0.95000 -17183.68399 189.98575 -156.79490 2156.94540 3666.85934 422101.08305
1.05000 -16862.13766 160.59191 2175.93570 1869.24875 3600.10531 381697.94089
1.15000 -16437.90791 163.29696 4002.90729 1593.83934 3532.81980 371089.87004
1.25000 -15993.25319 145.52530 -1148.85143 1440.91698 3441.21200 346987.89548
1.35000 -15530.21247 141.48319 1119.95360 1275.31918 3329.62926 326548.91122
1.45000 -15139.38171 148.24338 -1786.72024 1112.13809 3242.26545 307079.00419
1.55000 -14769.44004 112.43941 -5711.53783 978.80674 3135.92838 284116.05601
1.65000 -14381.49898 151.91385 -26.49253 841.19451 3004.03104 278802.18576
1.75000 -14048.70284 160.71724 619.51257 728.36443 2887.60889 264148.99532
1.85000 -13702.62630 132.60972 -906.56441 636.91147 2804.96947 247370.45669
1.95000 -13344.30617 131.62507 896.85441 572.34399 2687.86963 206503.70451
2.05000 -13006.22105 158.13365 403.41511 538.99198 2592.61986 209046.92915
2.15000 -12693.72632 154.79113 -2656.32460 497.80691 2476.16333 208311.67484
2.25000 -12389.79407 87.81519 -2762.09195 460.02242 2375.84361 188532.67268
2.35000 -12122.81658 75.61063 22.99466 422.94939 2294.17850 171122.41971
2.45000 -11853.24771 129.82514 -996.61686 420.40112 2202.58095 159280.07259
2.55000 -11581.07010 91.14774 365.04514 414.19286 2115.76860 157187.23854
2.65000 -11328.64728 84.18589 -337.52566 410.30895 2022.10277 163987.99811
2.75000 -11090.06312 91.24330 -1494.47935 425.51862 1958.02074 136416.71895
2.85000 -10881.66822 105.59189 -408.11166 424.39245 1895.57772 134025.23366
2.95000 -10644.91063 75.49454 1124.38182 427.94133 1811.15926 142170.78552
3.05000 -10432.60998 86.05440 1148.02062 444.61720 1741.92301 134919.90542
3.15000 -10227.53124 34.82378 1090.04586 452.53519 1644.76831 126081.33275
3.25000 -10021.74526 34.44733 198.91309 475.52550 1593.33934 120214.17034
3.35000 -9853.65213 69.25034 2156.62932 498.83862 1499.52348 107942.85830
3.45000 -9667.38895 42.62983 -834.73358 521.84121 1442.89993 111491.15131
3.55000 -9503.00443 59.08919 -1618.39669 536.41536 1374.38187 117443.99754
3.65000 -9325.77323 82.08221 585.24241 554.98937 1320.26351 121718.49593
3.75000 -9160.14539 75.88805 -627.07150 570.48512 1260.34024 100839.44407
3.85000 -8974.58933 20.62075 -1412.50574 583.61808 1195.64326 103604.14085
3.95000 -8814.77528 32.95004 -299.95876 587.86767 1142.98204 99443.03129
4.05000 -8665.25105 46.56754 -1337.83111 616.05989 1085.92886 96074.52973
4.15000 -8488.06405 17.46067 -173.26654 637.24639 1020.22420 93491.38144
4.25000 -8342.88959 -12.27455 -1635.22684 643.47335 961.67315 87237.11622
4.35000 -8144.96509 16.88731 -156.28349 660.82504 923.85981 85722.36598
4.45000 -7984.64170 -11.80263 -1084.35017 654.26843 870.36108 90767.77193
4.55000 -7806.76463 -39.26209 -861.65259 657.25642 819.30947 79793.07426
4.65000 -7613.39140 -46.06402 1211.02636 636.14284 765.12365 82312.46680
4.75000 -7427.46599 -54.63222 -1556.62337 614.64651 727.63102 85534.81643
4.85000 -7270.11182 -43.45863 -1027.02876 599.58506 686.02996 73416.39188
4.95000 -7110.32711 -40.82325 215.58393 582.93788 654.87902 81894.01040
5.05000 -6972.91042 -40.55046 -1281.67547 561.77744 626.86261 79236.54515
5.15000 -6811.86504 -56.63141 -403.11625 549.26762 578.81810 70929.06516
5.25000 -6687.44044 -45.04670 -427.29822 519.50092 561.18864 63685.04485
5.35000 -6566.06033 -41.84038 -2447.74836 497.13753 535.13205 61215.62961
5.45000 -6454.88132 -36.86711 -1835.40859 471.72204 505.11782 55008.70766
5.55000 -6352.20800 -23.61813 -1454.49207 447.15159 482.18289 51697.59216
5.65000 -6261.19398 -36.95645 -2592.56817 423.73485 466.23442 65750.14193
5.75000 -6190.10758 -17.02381 -1942.93542 400.60927 447.27567 49012.72094
5.85000 -6119.99649 -5.71998 -519.53425 387.86241 433.27038 43508.14838
5.95000 -6053.67249 -10.96816 -1360.92689 376.30517 413.60164 40735.68755
6.05000 -5991.43534 -11.30824 -687.83151 364.95474 402.19163 39115.39786
6.15000 -5936.36024 -10.21890 -465.45073 352.21066 384.69401 38458.14715
6.25000 -5877.69269 9.86900 -261.40970 346.26578 373.93336 37703.03608
6.35000 -5826.21998 20.17441 303.42655 337.81124 362.30391 40236.14695
6.45000 -5775.87025 16.02098 -256.86069 331.03060 346.17298 30361.30920
6.55000 -5711.62240 29.06951 -672.08702 325.84935 335.37625 27037.36866
6.65000 -5672.06724 22.91433 -642.43350 309.12942 324.38918 27220.16471
6.75000 -5601.80192 38.80776 345.58433 297.43418 316.19763 39850.00516
6.85000 -5559.07280 40.52024 -362.15167 292.84938 303.85493 25552.25888
6.95000 -5514.97263 45.17865 -419.71797 287.42260 294.84074 23837.64741
7.05000 -5482.94895 42.44203 -274.91672 281.99034 287.75518 22223.92645
7.15000 -5431.52378 41.98380 -440.47305 269.09563 278.95566 41103.02525
7.25000 -5372.46697 34.29282 -499.29290 262.11796 267.29616 19963.27350
7.35000 -5329.48815 40.10553 67.21018 254.41011 257.63858 18706.91353
7.45000 -5276.97185 41.24304 -235.99346 245.50840 247.77407 18034.05311
7.55000 -5230.74431 43.51426 -87.85263 245.15687 240.33634 16510.13479
7.65000 -5185.85757 31.58699 347.80686 239.57342 231.78550 19313.79298
7.75000 -5138.50394 35.60138 404.90115 237.30578 225.08176 16383.16400
7.85000 -5085.93109 26.13176 -230.58295 238.09852 217.27951 16689.06814
7.95000 -5033.23527 39.01321 76.12963 238.88443 209.95107 16403.52990
8.05000 -4980.77681 28.37265 -22.31964 230.16310 206.36572 18531.95742
8.15000 -4927.05790 31.46826 -109.44673 225.37075 196.87048 16493.05055
8.25000 -4883.99015 29.08071 -297.30381 222.72248 192.34173 15197.58771
8.35000 -4832.36756 35.84344 -269.14503 216.62172 183.44309 15892.57859
8.45000 -4784.08747 33.49487 319.95606 216.04528 177.07739 15716.19527
8.55000 -4734.86095 33.43771 446.35126 209.31499 174.03932 14780.34748
8.65000 -4690.70186 37.07851 -192.62187 206.45129 170.11571 14307.13932
8.75000 -4644.21724 30.68907 20.95064 205.08812 163.58521 12614.20910
8.85000 -4599.19365 37.21411 251.25781 210.28802 155.40279 11878.00558
8.95000 -4563.21308 34.46198 165.84823 197.89934 150.52515 13621.58061
9.05000 -4523.22877 36.24792 -68.90166 194.64910 144.95986 13020.97053
9.15000 -4479.98977 39.70144 603.52695 198.79872 134.55377 33048.98547
9.25000 -4446.33510 44.26643 -304.30304 187.31487 132.73824 12876.70278
9.35000 -4417.29057 44.13813 -193.07727 189.58599 126.05835 11599.65196
9.45000 -4382.92339 41.38554 455.16481 182.77398 121.93489 17436.65159
9.55000 -4349.30184 44.61212 -168.00149 184.57940 116.02031 10305.42666
9.65000 -4316.18364 47.04427 -27.96321 175.26444 112.13965 9815.05446
9.75000 -4284.78959 45.19132 96.15345 173.13737 107.31434 10222.25268
9.85000 -4258.61184 45.70586 143.52549 164.42949 104.83494 8779.92584
9.95000 -4233.43504 45.89317 -166.78660 164.83946 98.77771 8581.33383
10.05000 -4203.13684 42.93337 -169.95510 162.22029 98.84986 9441.44900
10.15000 -4168.95156 43.90369 -24.28679 157.53449 91.96519 7614.37212
10.25000 -4142.21322 43.58383 164.93640 151.76993 89.71182 8550.36721
10.35000 -4115.18796 41.42425 32.00094 141.40622 87.91232 7738.00748
10.45000 -4090.40495 39.85415 37.31213 139.43637 83.64756 8808.61137
10.55000 -4058.95015 41.66906 367.55553 133.27715 80.44682 8864.85035
10.65000 -4031.10725 40.15896 -112.29710 128.91004 80.18581 8485.13056
10.75000 -4002.04112 40.73300 -51.75474 126.33186 76.92912 7757.31758
10.85000 -3971.52408 37.47762 -532.32536 121.38764 73.90898 21191.28295
10.95000 -3942.57289 38.68726 -13.12411 114.79770 76.65262 6920.36008
11.05000 -3915.28871 38.82080 -8.14863 114.05992 71.12665 7735.85340
11.15000 -3880.95998 36.07220 -119.87081 114.05665 71.21706 6483.07381
11.25000 -3851.85245 38.41276 -110.18030 107.86718 70.37229 5727.45838
11.35000 -3827.01340 36.01815 -165.10305 106.85191 66.06682 12779.25068
11.45000 -3799.31871 34.23905 255.40052 104.75589 66.69417 6377.27293
11.55000 -3760.63288 35.31257 -40.63976 101.73322 65.64404 6305.18323
11.65000 -3736.66986 33.42097 -205.01008 103.01138 61.80642 5883.54032
11.75000 -3703.02430 34.97491 -400.46273 96.56693 60.24106 20375.05170
11.85000 -3668.38041 34.82617 -192.38070 97.53497 58.72366 5682.57925
11.95000 -3642.34910 34.94901 -30.10268 89.24144 60.61153 5692.94165
12.05000 -3617.35638 32.57967 23.17935 88.82855 56.55683 5166.65555
12.15000 -3584.77593 31.95525 207.80797 84.68128 55.43998 5779.05364
12.25000 -3558.69982 32.36009 -173.27508 80.77197 53.42393 5812.89178
12.35000 -3528.68376 31.00197 -63.45935 79.07828 52.72554 6129.17116
12.45000 -3504.33414 30.86463 -73.24291 77.42175 53.94088 3991.27810
12.55000 -3473.22799 30.80314 58.52614 73.60876 53.81344 4545.09016
12.65000 -3447.25399 29.54023 -234.79816 72.56927 51.93458 4569.29252
12.75000 -3421.97105 29.54998 -66.98198 72.70934 51.94148 5210.27570
12.85000 -3398.23534 26.89377 81.90420 67.90935 55.11862 3914.39413
12.95000 -3374.61360 29.82052 -115.25184 69.18056 51.63489 4186.36832
13.05000 -3353.57337 29.91066 -107.34170 67.40644 51.17033 4121.92709
13.15000 -3324.68845 27.22972 -189.60076 64.12066 49.00685 3662.54305
13.25000 -3304.47090 28.50144 -65.55827 63.58952 48.88215 3784.44394
13.35000 -3282.30816 27.98516 -172.99352 63.44132 49.94112 3540.58073
13.45000 -3262.76045 27.05627 -56.13658 59.97146 48.43999 3587.11244
13.55000 -3239.38081 24.24277 -292.96328 60.45796 48.06552 3780.67320
13.65000 -3221.26209 24.58701 -52.72663 59.48291 47.44679 3219.70274
13.75000 -3199.16663 25.10571 -69.19161 60.00395 47.22837 3413.61176
13.85000 -3176.50916 26.65044 -137.92717 58.88185 44.83356 3669.38517
13.95000 -3154.11065 25.50502 43.14823 57.40877 47.39183 4054.15923
14.05000 -3138.32183 26.77981 -223.33204 57.56995 46.52637 3482.35345
14.15000 -3118.80412 26.69232 -102.82835 52.39154 42.59747 3045.29843
14.25000 -3095.25375 27.02394 -98.82127 50.61791 45.97029 3433.06271
14.35000 -3076.31231 26.38219 -111.57260 51.01670 42.77675 2921.71212
14.45000 -3056.48853 24.98483 -153.14412 49.35638 42.80969 3690.34927
14.55000 -3036.01707 24.87571 -118.96408 49.86842 41.31207 2977.85340
14.65000 -3015.30291 24.52144 -102.17771 53.83859 47.56000 2483.75901
14.75000 -2995.07619 23.61752 -155.02672 49.35033 42.42093 2581.10569
14.85000 -2974.44728 23.08188 -166.91043 48.09231 46.12671 3637.62149
14.95000 -2955.25642 23.18316 8.69150 45.14640 42.48578 3341.98202
15.05000 -2936.63631 23.27279 -11.91379 44.30743 40.64801 2010.63308
15.15000 -2918.26139 23.24692 -67.18212 44.70989 39.36610 2246.46200
15.25000 -2897.00667 19.93817 -6.18227 44.08270 40.81129 2037.50347
15.35000 -2877.18969 20.16686 -39.29639 43.23652 38.30651 1823.04892
15.45000 -2854.93675 17.65469 -16.75008 45.28274 38.59428 2298.47765
15.55000 -2834.80336 20.03840 -48.99943 41.12154 36.90259 1724.15951
15.65000 -2818.10516 18.79588 100.74293 43.24395 39.51762 1944.05825
15.75000 -2798.99306 17.97325 -20.03147 43.71872 39.08201 1730.33306
15.85000 -2781.40899 19.83244 -65.23593 37.71655 35.78000 1860.40650
15.95000 -2760.85749 19.50808 27.95021 39.53348 39.07838 1907.85276
16.05000 -2744.35766 16.49387 -149.58790 41.82263 36.83751 2489.54745
16.15000 -2725.50992 21.29478 -94.08126 38.57538 38.66708 1717.82704
16.25000 -2706.70518 18.16319 -13.37272 37.57161 36.46346 1599.64649
16.35000 -2686.55918 14.42278 -136.49235 36.47442 39.03215 1553.48776
16.45000 -2668.71528 15.36340 -69.30554 38.25450 34.01054 1936.76735
16.55000 -2656.05187 13.74069 110.44991 35.26806 36.08569 1550.06367
16.65000 -2634.72462 15.80416 -54.73260 38.32476 35.42409 1400.53515
16.75000 -2623.66991 14.37922 -139.61308 34.24130 41.98509 1390.51508
16.85000 -2603.34837 17.10462 -100.24711 32.84464 33.99362 1780.23886
16.95000 -2584.91939 15.60131 -19.08736 39.47105 34.77576 1687.64652
17.05000 -2568.41512 17.49302 72.27447 32.90789 37.14565 1582.01163
17.15000 -2551.16725 15.36062 -81.41544 38.10709 35.43865 1261.93365
17.25000 -2534.18267 17.74191 13.89502 34.13397 33.23936 1127.31208
17.35000 -2518.96555 15.18776 -59.30460 35.16873 33.27290 1221.54632
17.45000 -2502.80888 15.71460 -42.05303 32.46141 37.73391 1669.74327
17.55000 -2484.22154 16.31767 -0.62597 34.59511 34.57016 1796.42064
17.65000 -2471.21894 14.76433 95.10521 40.20232 38.77125 1399.50206
17.75000 -2461.56339 15.70072 -85.65991 36.42997 33.97511 1138.19162
17.85000 -2444.37376 17.34659 66.67568 35.74509 32.89434 1839.96593
17.95000 -2430.43290 14.97302 -131.31986 33.02713 31.54479 1056.53942
18.05000 -2416.15684 13.97076 49.60261 35.47710 31.05714 1984.11874
18.15000 -2401.52457 14.41848 25.38397 30.53626 33.28525 1043.57061
18.25000 -2386.82993 18.10243 26.02822 31.12523 31.33924 918.27077
18.35000 -2371.58293 13.13456 1.19945 34.37564 27.40032 702.94055
18.45000 -2359.22891 12.47899 12.45894 31.16763 30.36764 999.21099
18.55000 -2346.57923 18.05206 62.08444 29.15716 30.15220 787.97013
18.65000 -2330.56351 16.93663 -59.89667 34.50415 34.51981 1102.62909
18.75000 -2317.71065 14.90911 -7.55819 28.49507 38.11065 650.47712
18.85000 -2307.14412 16.52859 -24.97819 38.77307 36.45249 854.07931
18.95000 -2292.93018 12.15161 -85.88899 31.02345 31.37949 1360.14236
19.05000 -2277.36699 15.18983 39.14384 27.10469 29.28532 731.97947
19.15000 -2269.67313 13.43972 -69.53527 35.43698 32.22163 892.51871
19.25000 -2257.92675 13.45091 -72.97652 24.87263 26.27113 996.74022
19.35000 -2243.54413 13.88888 -19.31464 26.73005 37.07381 874.15976
19.45000 -2229.94327 14.28308 63.16248 28.84599 28.32886 652.44531
19.55000 -2217.61332 14.11617 4.62644 28.74305 27.17935 585.35162
19.65000 -2205.30607 13.93049 -6.88642 33.76390 28.82314 681.95382
19.75000 -2195.98126 15.64767 -131.36749 24.96218 26.78339 718.02674
19.85000 -2183.53999 12.56416 -32.63373 33.50131 28.42198 642.34422
19.95000 -2169.64544 13.00336 7.73905 22.93978 25.02820 427.98740
