0.05000 1878.83629
0.15000 2704.92612
0.25000 4008.42026
0.35000 5277.36288
0.45000 6292.63750
0.55000 7057.23846
0.65000 7806.62530
0.75000 8208.30529
0.85000 8408.80274
0.95000 8447.95677
1.05000 8507.60949
1.15000 8412.94225
1.25000 8367.29026
1.35000 8138.64459
1.45000 7880.27293
1.55000 7555.70595
1.65000 7460.56367
1.75000 7257.13367
1.85000 7006.18411
1.95000 6666.60979
2.05000 6395.67769
2.15000 6231.06635
2.25000 5986.17098
2.35000 5904.66046
2.45000 5590.90435
2.55000 5453.69983
2.65000 5265.71952
2.75000 5122.79791
2.85000 4937.31684
2.95000 4721.39154
3.05000 4559.00954
3.15000 4394.67836
3.25000 4344.62291
3.35000 4199.96927
3.45000 4090.62911
3.55000 3956.97162
3.65000 3794.19619
3.75000 3747.16458
3.85000 3666.55692
3.95000 3521.95167
4.05000 3431.88408
4.15000 3289.36958
4.25000 3174.09234
4.35000 3154.93641
4.45000 3085.19422
4.55000 3033.65482
4.65000 2971.85033
4.75000 2802.04348
4.85000 2797.05841
4.95000 2725.07479
5.05000 2688.20216
5.15000 2590.65117
5.25000 2521.31869
5.35000 2456.47927
5.45000 2409.89481
5.55000 2288.92447
5.65000 2264.37414
5.75000 2148.57229
5.85000 2052.34757
5.95000 2005.23193
6.05000 1922.66368
6.15000 1850.83488
6.25000 1789.15559
6.35000 1737.85263
6.45000 1685.81162
6.55000 1610.04158
6.65000 1585.53094
6.75000 1557.99468
6.85000 1509.27397
6.95000 1412.31881
7.05000 1411.02169
7.15000 1374.97229
7.25000 1319.03172
7.35000 1279.88921
7.45000 1249.35757
7.55000 1197.35701
7.65000 1174.22875
7.75000 1131.98071
7.85000 1092.05396
7.95000 1075.91264
8.05000 1055.67376
8.15000 1028.20226
8.25000 993.79034
8.35000 976.65587
8.45000 965.83820
8.55000 932.37854
8.65000 914.48439
8.75000 882.65859
8.85000 868.97853
8.95000 848.41170
9.05000 827.80049
9.15000 815.10001
9.25000 803.96686
9.35000 773.19173
9.45000 763.64744
9.55000 770.06126
9.65000 730.42649
9.75000 710.69344
9.85000 722.26904
9.95000 700.60861
10.05000 683.33546
10.15000 671.06503
10.25000 643.52805
10.35000 642.26815
10.45000 619.01338
10.55000 620.61080
10.65000 607.47457
10.75000 592.04152
10.85000 583.27271
10.95000 582.28659
11.05000 555.15351
11.15000 554.16253
11.25000 542.08083
11.35000 545.75341
11.45000 516.33654
11.55000 514.65595
11.65000 506.15387
11.75000 499.87206
11.85000 488.87684
11.95000 478.36024
12.05000 472.01381
12.15000 468.36726
12.25000 468.21917
12.35000 446.41614
12.45000 440.61366
12.55000 441.56161
12.65000 433.14889
12.75000 423.27426
12.85000 406.99973
12.95000 408.00333
13.05000 404.41272
13.15000 400.30382
13.25000 385.67098
13.35000 386.26765
13.45000 377.10481
13.55000 365.77911
13.65000 366.62175
13.75000 368.05584
13.85000 357.60561
13.95000 337.08754
14.05000 349.74455
14.15000 331.93767
14.25000 327.61615
14.35000 320.38424
14.45000 316.10084
14.55000 321.20901
14.65000 301.85854
14.75000 304.11550
14.85000 301.71755
14.95000 297.96625
15.05000 293.11329
15.15000 288.58162
15.25000 280.70071
15.35000 273.37924
15.45000 270.48012
15.55000 273.33507
15.65000 265.15698
15.75000 247.92431
15.85000 248.43692
15.95000 249.05629
16.05000 242.43613
16.15000 244.32453
16.25000 237.15297
16.35000 234.62970
16.45000 238.10204
16.55000 231.46897
16.65000 230.27305
16.75000 219.28854
16.85000 214.83864
16.95000 213.34447
17.05000 211.10954
17.15000 222.74401
17.25000 207.34544
17.35000 209.85051
17.45000 201.00593
17.55000 198.54106
17.65000 193.20234
17.75000 192.20264
17.85000 187.95459
17.95000 181.03648
18.05000 181.44537
18.15000 185.68513
18.25000 183.79718
18.35000 171.61132
18.45000 171.79600
18.55000 166.39993
18.65000 155.81869
18.75000 158.57169
18.85000 156.41770
18.95000 161.97240
19.05000 160.56724
19.15000 151.28357
19.25000 151.54516
19.35000 139.34647
19.45000 141.37149
19.55000 138.80672
19.65000 136.98054
19.75000 126.00070
19.85000 126.65453
19.95000 134.86128
