0.05000 469.97249 724.89146 231759.59341 2833.88816 503.55229 310994.09157
0.15000 -374.47744 345.67443 50321.90184 2877.30916 905.40202 847518.78528
0.25000 -578.76256 228.04239 420754.55422 2469.87611 1080.30322 1181163.98376
0.35000 -915.49292 -66.42367 615731.80376 2750.27552 1210.64958 2683998.17763
0.45000 -493.60857 -130.31968 116130.19225 2759.38600 1263.73319 769413.88345
0.55000 -861.95678 -21.24442 49370.81272 2656.11649 1269.62107 747875.47054
0.65000 -851.94629 -1.79539 6903.38934 2393.33482 1331.73552 1242102.26112
0.75000 -791.06554 -131.24993 12804.57219 2347.62584 1461.80510 1070828.35978
0.85000 -789.82660 -23.81375 -72828.80321 2320.14301 1595.74168 1533053.31997
0.95000 -1238.64417 77.99795 50677.57328 2304.32854 1557.72621 1227348.48581
1.05000 -1494.54596 -79.31433 -129501.71348 1990.64559 1606.01009 1587776.31353
1.15000 -1574.01486 -93.83067 -9219.88463 1957.67208 1610.28347 1167680.51156
1.25000 -1896.39002 -77.23848 -16245.27183 1615.01793 1679.09910 1451942.09519
1.35000 -2276.38575 -50.29055 -63660.18306 1284.13275 1639.35089 1391084.42516
1.45000 -2567.42557 69.12223 35858.25080 972.92889 1591.55072 1264421.07340
1.55000 -2904.86901 53.38250 -27285.45122 731.44430 1461.35319 1502682.35799
1.65000 -3152.11178 130.81664 258.14651 597.57980 1363.34178 1275480.20302
1.75000 -3365.20241 86.08304 14291.37747 470.37266 1285.21494 1801092.51312
1.85000 -3493.45330 -25.66283 -47093.33896 399.98681 1207.44417 1778832.27893
1.95000 -3617.12925 -29.88846 -5792.68345 335.11825 1129.65817 1717787.20792
2.05000 -3698.81783 18.58356 -5818.14255 294.89257 1053.34709 1753859.65270
2.15000 -3774.35060 -24.21258 17849.80894 257.70916 997.68824 1472518.40570
2.25000 -3825.89730 -30.51838 85480.58622 237.13157 917.73906 1853079.77860
2.35000 -3855.49292 -6.42025 -44521.50195 226.74397 897.95381 2157852.47186
2.45000 -3882.33485 1.42739 49046.79848 203.89794 819.56176 1692630.60134
2.55000 -3899.52494 -8.64388 16684.64461 189.21723 797.53131 2062589.19489
2.65000 -3925.72886 1.40680 5444.14608 172.27126 749.11203 2129950.10471
2.75000 -3953.60434 18.56783 17716.46818 178.78531 727.28100 2055211.93809
2.85000 -3954.11707 -2.99812 19777.24393 167.58561 681.95167 1963712.95709
2.95000 -3957.64377 -11.49251 22834.74154 169.61116 663.16604 1857090.36291
3.05000 -3967.51365 -39.42428 -41538.22562 176.70443 653.19092 2275381.88303
3.15000 -3954.16398 6.26187 -1390.53143 173.44445 583.96425 1826145.33504
3.25000 -3962.62066 0.47524 -28806.79389 190.27077 583.26662 2028418.79274
3.35000 -3959.36302 1.13526 43619.67414 182.70136 551.00799 2085398.20272
3.45000 -3962.07281 30.37598 9048.17617 185.38165 523.70710 1907216.00511
3.55000 -3961.74360 -5.02437 -65797.75487 197.34469 513.11014 1900378.80929
3.65000 -3952.64253 4.83153 26713.62632 196.08988 488.05207 1939654.39585
3.75000 -3944.21594 -3.34898 33710.17128 206.74067 479.30641 1875520.12532
3.85000 -3929.39270 5.95669 -64432.75333 207.63178 451.46560 2176861.31085
3.95000 -3920.56967 -0.05961 -134325.44134 207.31702 439.27169 2522402.64612
4.05000 -3904.70094 -0.62556 -48116.84832 207.34057 430.31827 2146753.48378
4.15000 -3890.88383 -5.92686 -22494.54219 208.80576 409.08676 2519585.72241
4.25000 -3874.00788 -0.50743 61928.73212 207.62846 394.61109 2390432.89904
4.35000 -3864.34434 5.54979 -30609.23619 202.85180 393.33126 2139609.52461
4.45000 -3851.40583 -2.00902 -26711.90662 206.95369 369.75966 2501133.26149
4.55000 -3829.26222 18.08369 42784.11069 199.05962 360.69266 2000354.76741
4.65000 -3810.59484 10.90742 -14754.09155 194.20667 357.49979 2941101.48995
4.75000 -3792.13901 7.99938 16988.30982 196.61285 340.45214 2060272.15947
4.85000 -3773.56044 3.83952 -61208.60424 191.55818 338.43176 2287830.17463
4.95000 -3756.26246 -7.32062 -39094.79525 190.75160 324.93334 2458852.49342
5.05000 -3744.09007 -10.31202 127442.57449 187.55135 315.57082 2688645.50902
5.15000 -3726.12832 -3.47440 24797.88993 186.64619 312.21018 2196009.77048
5.25000 -3701.95915 6.00927 -97265.67034 183.29178 296.18194 2204165.82999
5.35000 -3687.81494 -4.01067 28241.34260 178.67096 292.27116 2086849.30706
5.45000 -3676.56261 -5.97074 -34733.89453 177.88641 281.84916 2432047.69373
5.55000 -3656.96472 -5.95733 101405.77408 175.09769 279.12498 2191339.54938
5.65000 -3639.79466 0.21610 -5572.37072 171.90952 268.39168 2342523.49151
5.75000 -3622.53528 7.48536 90409.08104 173.46142 265.30202 2256973.24849
5.85000 -3597.27292 -6.99675 72301.07455 172.30644 256.80882 2015588.21937
5.95000 -3587.03426 -1.26906 15128.68282 170.39129 250.59069 2432119.75091
6.05000 -3561.21582 3.84625 1954.39939 171.73736 248.12440 2379700.42151
6.15000 -3547.98529 -4.98741 2308.71778 164.59312 239.10582 2264549.38994
6.25000 -3535.56488 -5.90905 -19408.26659 168.54279 235.44056 2400966.15382
6.35000 -3510.92792 4.31960 -9718.34415 164.25828 231.92407 2358857.22143
6.45000 -3500.14643 11.27289 -26846.54591 168.43536 224.27570 2214843.79161
6.55000 -3472.66022 -1.24717 41306.26002 163.88378 224.82811 2324104.77411
6.65000 -3461.69815 1.45031 -1255.04192 162.34546 217.56688 2464635.60993
6.75000 -3441.30658 -4.04297 47836.98624 159.98478 213.45487 2325092.35178
6.85000 -3433.98919 2.18473 36421.24620 160.76363 212.17636 2411841.36159
6.95000 -3414.41789 4.58358 47932.08602 160.71416 204.75366 2281651.51157
7.05000 -3393.14330 -0.06029 638.27030 158.13528 201.45173 2252639.83984
7.15000 -3381.58889 -0.01740 -110322.06008 158.71960 199.29686 2487227.79552
7.25000 -3368.93641 -1.66512 -17200.34652 157.47498 194.57849 2206002.71944
7.35000 -3345.88599 -1.66212 11117.51427 153.10892 189.41829 2190649.97384
7.45000 -3326.30959 2.82023 -82928.49802 150.10807 191.27584 2333710.55005
7.55000 -3318.13655 1.97895 -76964.04797 150.80715 185.37817 2057927.50827
7.65000 -3296.00029 -3.84446 -26450.54836 150.14393 180.64529 2161347.39090
7.75000 -3285.44863 -1.64088 13732.44451 149.94845 178.18077 2144392.58847
7.85000 -3265.09948 -3.28722 -19213.62605 147.25785 172.54595 2309679.16130
7.95000 -3241.56182 5.34939 -32476.70209 142.82630 168.39281 2254287.56374
8.05000 -3236.61159 4.48058 -43214.92532 141.17723 168.58754 2054179.81230
8.15000 -3218.06579 -0.60269 -58234.98988 140.94427 163.36557 2320180.70985
8.25000 -3201.99616 0.31150 69790.84033 140.21406 163.10302 2260520.86249
8.35000 -3187.51343 -0.86090 -25180.47223 139.95894 160.93562 2057252.90259
8.45000 -3175.11722 -1.58828 -7.55763 140.30560 162.24571 2258443.29459
8.55000 -3159.23649 -1.31876 -8227.95066 141.84176 154.75191 2126833.97608
8.65000 -3144.93049 2.03561 29147.99561 141.72707 156.90416 2449923.26623
8.75000 -3119.65757 -0.57681 21151.67742 142.09298 150.39788 2341017.65756
8.85000 -3110.31373 -0.15358 -25493.23203 141.09703 147.14953 2363426.98409
8.95000 -3095.93774 -0.83282 38796.39661 140.47799 147.20381 1885358.51614
9.05000 -3081.40054 1.35456 -9257.41179 139.87836 143.83206 2379056.64240
9.15000 -3061.91895 -0.97632 -43662.67394 139.56783 143.19003 2326224.01235
9.25000 -3052.35739 3.63222 42612.16510 137.10479 142.07522 2037554.06551
9.35000 -3030.69175 -4.73157 30307.53491 139.23970 134.68297 2186371.71509
9.45000 -3016.84136 -0.24960 -35256.59827 137.87953 136.02442 2221503.16468
9.55000 -2997.78161 1.14517 -127441.66955 135.87283 132.71085 2388393.99870
9.65000 -2990.25752 -3.01595 18.17531 135.89458 132.17122 2018428.48412
9.75000 -2970.65333 -2.98288 -61768.64423 132.43577 130.00140 1994575.86270
9.85000 -2959.82264 1.04811 19303.74973 134.36522 126.29780 1974142.01645
9.95000 -2938.70509 -6.86295 17947.92854 131.86969 126.92638 2260533.40917
10.05000 -2926.23340 4.34729 -88619.63595 133.98210 125.60000 2290018.52092
10.15000 -2908.37147 -0.48416 -12680.00286 130.65291 123.35764 2275443.65538
10.25000 -2891.29367 0.72307 -62452.30411 131.17614 119.52140 2090232.29934
10.35000 -2873.69656 0.56600 -47476.52264 128.82817 117.71949 2155870.97558
10.45000 -2863.91894 -2.72163 -21406.02539 130.27839 116.08289 2197999.39246
10.55000 -2850.23579 4.08459 -11170.14285 128.78917 115.59491 1982128.35939
10.65000 -2834.97447 4.36725 -48382.12154 126.87753 114.41006 2557474.11952
10.75000 -2820.17810 4.13584 -65745.35680 124.93971 113.45622 2015045.82322
10.85000 -2805.22340 -2.87915 5969.05989 124.46591 107.55319 2109037.43655
10.95000 -2793.69316 0.29820 42356.07888 123.29380 109.76034 2132319.77668
11.05000 -2774.45385 -1.61269 14391.83282 119.95450 108.57475 2235683.50783
11.15000 -2765.18989 -1.73293 83554.17563 121.21998 103.71359 2211942.92731
11.25000 -2749.44106 3.43306 -20673.95513 123.00714 104.34777 2268832.91460
11.35000 -2736.50560 4.83426 50744.25175 119.85550 101.30014 1983330.60450
11.45000 -2722.78274 -0.75458 -11142.17470 119.53584 101.82478 1948574.28397
11.55000 -2713.51651 -0.29602 -8611.90803 121.84052 99.88196 2442031.85427
11.65000 -2690.64323 -5.55229 -53382.34440 117.62036 99.30869 1944271.93965
11.75000 -2680.09936 2.55650 -81919.71926 115.57051 98.07073 2124832.64108
11.85000 -2669.23530 0.24025 -29656.33233 115.59031 99.18715 2104343.97291
11.95000 -2654.04358 0.17312 -67133.70171 114.71107 95.71997 2280968.77999
12.05000 -2638.72090 1.26676 95329.10281 111.70012 94.08287 2186693.07901
12.15000 -2630.59173 -0.51650 33872.03753 112.85069 94.22257 2064883.76754
12.25000 -2615.36911 1.67654 -1388.89264 112.21645 92.79817 1986275.49486
12.35000 -2603.27081 -1.79908 33800.65790 110.87821 92.11602 2239810.84917
12.45000 -2587.85330 -0.37479 -72439.52358 108.20727 90.64933 2115489.71245
12.55000 -2577.75919 -1.95024 -1136.46994 107.97700 88.24858 2422825.68925
12.65000 -2564.83750 -2.25943 -58169.17185 103.97379 87.20009 2173633.23861
12.75000 -2554.42448 0.92753 44703.56716 106.63810 88.31814 2092205.54461
12.85000 -2541.37173 2.01862 -38491.94744 105.31610 84.83816 2013584.46566
12.95000 -2527.90861 -0.83422 47448.00182 102.55679 84.43430 2095362.23027
13.05000 -2513.69787 -4.23314 -45285.89862 103.08671 84.79177 2199250.54668
13.15000 -2503.72774 1.44827 -12157.57927 102.53987 82.02450 1893544.37229
13.25000 -2489.98156 0.52120 64440.77681 102.88171 82.21343 2128858.13081
13.35000 -2480.96917 -1.16653 30757.43096 101.95715 80.94514 2246597.58533
13.45000 -2467.01085 1.86508 5192.04899 100.62604 81.44011 2063545.12669
13.55000 -2456.57402 -0.08476 -4839.89293 98.59125 80.08085 2054739.67094
13.65000 -2441.60608 -1.76386 -17216.51553 100.29710 77.54102 1886861.07935
13.75000 -2429.19472 -0.36578 36896.17974 97.97617 77.94516 1952743.71584
13.85000 -2417.89525 1.66571 66601.91562 98.85023 77.80737 2090585.66568
13.95000 -2408.98435 1.12235 49600.05055 97.77158 76.34610 2053731.30695
14.05000 -2396.12003 -2.66536 90981.62949 96.17196 75.79209 2000410.59147
14.15000 -2383.51391 0.60143 8032.77449 95.75029 74.30544 1931801.85462
14.25000 -2373.44321 -2.10262 20777.58854 96.77473 73.05054 2057254.26628
14.35000 -2362.39481 0.35629 3467.11133 96.24692 72.97013 2067095.93673
14.45000 -2346.80001 -1.53567 -21839.82042 94.16512 73.18864 2007319.79592
14.55000 -2338.48833 -1.19090 31399.21596 94.53108 70.96894 2039068.82193
14.65000 -2327.38214 1.92311 -32637.28765 94.16606 70.20750 1908836.78713
14.75000 -2316.13036 0.25807 -18786.92953 91.47323 70.64445 1993703.98769
14.85000 -2303.00421 -0.23037 -6207.92474 91.84336 69.33707 1845274.62075
14.95000 -2295.74990 0.05978 6854.51406 91.34690 68.82654 1757961.63040
15.05000 -2281.88057 -2.72369 43308.77358 89.71881 68.12272 1985885.69659
15.15000 -2271.79626 0.79752 -5903.79464 90.42020 67.52676 2006884.50501
15.25000 -2260.87473 0.78598 25336.75681 87.07456 66.61420 1904751.45059
15.35000 -2251.84180 0.62588 47906.32755 90.74718 65.98863 2170706.95660
15.45000 -2238.63399 0.69275 -16058.58869 86.20838 66.73772 2067558.59980
15.55000 -2231.04127 0.24758 45063.60272 87.74205 64.68650 2171791.10914
15.65000 -2219.87787 -0.89243 6805.69320 85.55481 63.31078 1812487.58517
15.75000 -2208.21757 -0.38887 4497.51650 87.93614 63.32352 1898957.71401
15.85000 -2201.82942 -0.03527 25718.65145 86.00586 63.16860 1977468.95766
15.95000 -2192.07767 0.64042 -26058.81192 86.19748 61.45091 2024829.07307
16.05000 -2180.67452 1.02037 9905.45553 84.21939 61.73047 1888267.62005
16.15000 -2172.29019 -0.26594 -45872.23708 83.02245 60.52170 1861195.26226
16.25000 -2161.34313 0.69616 7216.51824 83.41640 61.06274 1914360.98594
16.35000 -2151.54817 -0.35699 -70229.31976 82.31661 61.13301 2108970.44692
16.45000 -2140.55490 0.19229 60738.30740 84.63517 60.00678 1980484.80585
16.55000 -2133.11635 -0.60203 -31737.82202 82.52593 59.10945 2147645.70397
16.65000 -2121.49527 -0.01243 -10879.34376 84.26271 58.88210 1941213.83123
16.75000 -2110.90464 -0.86903 64632.04696 83.27483 57.30648 1957227.44743
16.85000 -2101.41719 -1.88410 39906.31249 83.98558 56.52218 2009320.25206
16.95000 -2093.17039 1.36202 -27933.48426 83.73730 57.26739 1897941.91108
17.05000 -2083.79905 0.69028 -12144.02254 81.86584 56.20972 1866761.10260
17.15000 -2070.47682 -0.35970 -4292.43190 80.20844 55.55627 1976951.52723
17.25000 -2061.70153 0.76040 -45547.26547 81.17432 54.75598 1844617.11080
17.35000 -2056.82074 0.80551 31815.45253 81.42569 54.48260 2005803.43360
17.45000 -2047.00035 0.16903 40389.73934 80.57000 53.23294 1782340.13184
17.55000 -2035.45057 1.28965 -6977.31959 78.44566 54.57403 1773910.60095
17.65000 -2028.34636 0.98553 -38057.19537 79.02307 53.69762 1924517.25849
17.75000 -2016.61640 -2.24113 -9009.05351 78.51720 52.66561 1747002.95028
17.85000 -2009.07241 0.31131 -21683.04674 78.40543 51.72565 1898120.65950
17.95000 -2002.39077 -1.08502 1406.47587 79.53623 50.95654 1749371.04835
18.05000 -1993.62911 1.21743 -2998.18214 77.98151 51.60052 2094378.27398
18.15000 -1980.40335 0.29233 40363.36273 77.66455 50.40329 1807462.88196
18.25000 -1974.31207 0.96240 1223.17588 77.15012 50.11522 1883645.27758
18.35000 -1967.10241 -0.84652 11807.99064 76.23580 49.08666 1817262.29028
18.45000 -1959.16779 1.52039 -4343.77902 75.77096 48.43573 1677304.10492
18.55000 -1948.39187 -2.50330 -45400.25805 76.65756 49.04064 1830021.59820
18.65000 -1939.07652 0.66587 18638.47288 75.39642 48.06086 1890563.41824
18.75000 -1928.74445 0.26658 16731.20516 74.09513 47.69638 1666233.39057
18.85000 -1923.29956 -0.32251 45619.69401 75.47796 47.52203 1996751.02294
18.95000 -1912.06322 -0.47581 -22941.99978 74.89110 48.42042 1785730.20323
19.05000 -1904.30800 -1.06239 -25039.34170 73.97513 46.71666 1892240.70016
19.15000 -1893.51252 2.50428 -7807.49201 73.03283 46.33287 1896889.55057
19.25000 -1886.27235 0.89138 5989.75598 72.35163 45.70972 1767612.22680
19.35000 -1881.30477 1.94666 23625.53630 71.24392 45.64393 1787955.61542
19.45000 -1869.42325 0.64485 -41927.98415 70.26336 44.92543 2069635.38001
19.55000 -1862.04102 -1.70066 16893.43427 70.88143 44.76595 1765657.21408
19.65000 -1855.20067 0.60581 27619.16676 69.62041 43.73038 1778387.03535
19.75000 -1845.66696 0.52532 -31095.62194 70.21215 44.05544 1781143.10919
19.85000 -1837.92260 0.28374 25692.28884 68.40510 43.24052 1702071.21329
19.95000 -1829.34927 0.58260 20707.22081 67.83970 43.13304 1910684.94458
