0.12500 0.00811
0.37500 0.02648
0.62500 0.04576
0.87500 0.07096
1.12500 0.08406
1.37500 0.11940
1.62500 0.11551
1.87500 0.14109
2.12500 0.15585
2.37500 0.15405
2.62500 0.18656
2.87500 0.17805
3.12500 0.18458
3.37500 0.18140
3.62500 0.16755
3.87500 0.18685
4.12500 0.19191
4.37500 0.20732
4.62500 0.20095
4.87500 0.17342
5.12500 0.16524
5.37500 0.14715
5.62500 0.12372
5.87500 0.11141
6.12500 0.11213
6.37500 0.09312
6.62500 0.08643
6.87500 0.08355
7.12500 0.05149
7.37500 0.05689
7.62500 0.04071
7.87500 0.05331
8.12500 0.04649
8.37500 0.04426
8.62500 0.05401
8.87500 0.04461
9.12500 0.04630
9.37500 0.04165
9.62500 0.02267
9.87500 0.02788
10.12500 0.01094
10.37500 0.00424
10.62500 0.01117
10.87500 0.02514
11.12500 0.01138
11.37500 0.01281
11.62500 0.02069
11.87500 0.01461
12.12500 0.03564
12.37500 0.01234
12.62500 0.01343
12.87500 0.01973
13.12500 0.03329
13.37500 0.03789
13.62500 0.02966
13.87500 0.03875
14.12500 0.05058
14.37500 0.04190
14.62500 0.03671
14.87500 0.02960
15.12500 0.02219
15.37500 0.03166
15.62500 0.05546
15.87500 0.02950
16.12500 0.05642
16.37500 0.02181
16.62500 0.05066
16.87500 0.04130
17.12500 0.02896
17.37500 0.04168
17.62500 0.01935
17.87500 0.02179
18.12500 0.03409
18.37500 0.04559
18.62500 0.03327
18.87500 0.02691
19.12500 0.03201
19.37500 0.02273
19.62500 0.02804
19.87500 0.03443
