0.05000 -2021.71605 -504.43203 -126033.12290 2178.63736 2308.31467 647098.57698
0.15000 -4517.97822 -10.98911 -8306.45209 2502.53595 2407.84605 417296.39006
0.25000 -6699.75688 92.33065 -641.13608 2731.81715 2583.44394 381972.67267
0.35000 -8449.25473 126.96277 -3313.59193 2942.48609 2767.51818 410921.43005
0.45000 -9885.42644 191.81451 -7132.39672 3074.16079 2936.35385 423588.15713
0.55000 -10774.90978 87.92122 2391.13693 3020.59593 3134.83572 407640.92242
0.65000 -11411.17659 186.26295 3715.58310 2899.67541 3268.06788 336865.96650
0.75000 -11702.52784 154.49197 1428.97352 2780.02087 3365.63392 323417.61507
0.85000 -11817.11692 124.05025 -1415.61435 2645.33946 3456.40554 303047.86981
0.95000 -11854.10604 202.76541 -1532.98080 2482.10502 3536.12345 294856.94061
1.05000 -11659.71384 193.39576 10752.93913 2308.76208 3634.35287 272732.21778
1.15000 -11558.33683 170.41107 7547.09065 2168.73333 3668.42348 235458.09044
1.25000 -11493.16003 196.50925 313.13074 1920.70252 3692.45898 260527.90217
1.35000 -11440.85767 241.28922 2463.51452 1666.47714 3722.05836 211788.81246
1.45000 -11448.10811 253.38262 456.04695 1424.89955 3718.61930 211686.24980
1.55000 -11443.38839 277.60305 1837.46760 1215.66639 3670.85761 189699.57731
1.65000 -11397.90706 309.18756 3834.23252 1068.44091 3613.11228 176859.73157
1.75000 -11356.86967 370.69506 3448.74292 963.11154 3552.61411 169846.28125
1.85000 -11234.32476 336.46340 -818.96761 913.47573 3476.41695 160209.73471
1.95000 -11093.97944 290.49516 1013.15197 868.10566 3407.10519 147055.38759
2.05000 -10950.26812 224.04304 -581.91079 855.77506 3319.73833 145826.05745
2.15000 -10791.51799 125.84497 639.62381 895.88366 3173.66494 126818.00911
2.25000 -10611.01760 135.66692 399.75964 962.42312 3069.58792 135284.93165
2.35000 -10403.06432 20.81538 2456.96278 1004.02715 2939.49654 125770.41726
2.45000 -10165.88793 -17.23636 170.35545 989.41530 2798.07121 118022.47151
2.55000 -9968.72069 -69.86434 2029.06143 987.61014 2709.47979 112814.75702
2.65000 -9786.73493 -124.53228 469.68195 974.73767 2588.09809 108808.77195
2.75000 -9618.67154 -40.71690 505.69543 946.24990 2508.08874 107557.11760
2.85000 -9468.12264 -42.44918 1098.54396 922.78000 2424.37411 112015.67764
2.95000 -9304.52932 -62.10437 3436.07214 889.25535 2302.08548 105782.85587
3.05000 -9105.46767 -66.36255 -1016.13894 852.98916 2178.31361 104902.32575
3.15000 -8909.70646 -33.24452 -952.15570 826.39520 2087.55661 95156.62758
3.25000 -8778.56814 -31.63152 921.04046 789.16201 2025.11011 94954.68543
3.35000 -8628.79327 -16.74976 246.27962 758.25293 1932.84858 85000.39568
3.45000 -8496.55427 28.09212 1038.78985 730.07336 1823.80097 94240.46334
3.55000 -8368.94124 12.74732 645.77234 731.06284 1768.39435 76227.91515
3.65000 -8250.20192 2.57311 171.25227 715.69770 1669.05370 75315.03025
3.75000 -8151.11297 -1.57366 348.00323 706.54429 1611.07989 72889.91811
3.85000 -8044.04364 60.17246 1055.46492 709.46315 1522.70123 75548.50732
3.95000 -7976.93528 53.80709 -505.30242 712.95880 1461.36509 68456.25251
4.05000 -7907.48373 80.22013 195.20876 724.22724 1405.32851 66044.08676
4.15000 -7830.90966 57.14640 602.50033 749.73557 1338.92631 68476.17210
4.25000 -7748.82454 113.39492 1501.54203 773.14587 1275.68314 58517.00892
4.35000 -7668.44003 134.18511 1296.47880 795.57282 1231.53375 56047.52768
4.45000 -7602.82457 141.86401 879.33998 817.07945 1153.25202 58608.03014
4.55000 -7550.04672 154.97621 541.27271 833.53692 1108.96378 56005.23034
4.65000 -7474.67265 143.38006 852.21743 846.67058 1059.07572 53497.41946
4.75000 -7421.83313 133.44583 111.29283 856.78279 1038.55105 48634.48380
4.85000 -7373.34355 105.93574 1531.31659 880.68899 982.65431 64321.98711
4.95000 -7305.62220 115.63355 1952.60545 908.71850 914.95810 46524.88114
5.05000 -7238.87294 109.77036 381.30119 916.41971 857.15508 41371.05935
5.15000 -7153.69727 105.28187 498.60587 937.74566 793.79426 43641.64368
5.25000 -7066.93520 108.95838 1107.69127 925.96166 744.14681 37514.92530
5.35000 -6983.72893 87.95834 426.44726 922.18513 695.59073 38449.11767
5.45000 -6891.45608 88.95736 1257.69306 899.35039 631.09907 39387.73236
5.55000 -6811.61088 77.31043 740.27008 875.47812 577.45769 34531.35355
5.65000 -6698.19989 71.81644 393.94108 831.56716 518.83865 39660.98625
5.75000 -6597.31651 81.16809 845.09544 790.33872 469.31488 30741.55100
5.85000 -6519.14312 60.16933 937.93360 755.74543 433.76893 42323.11286
5.95000 -6433.11826 75.43006 563.75401 714.14961 392.33767 50588.45981
6.05000 -6357.84453 61.41283 639.21048 666.24986 365.99986 28683.40203
6.15000 -6286.27473 60.52859 12.16186 615.26566 335.15005 28248.20181
6.25000 -6207.55071 63.32086 1486.04798 568.43771 303.63112 72595.06956
6.35000 -6135.67785 69.50849 320.62440 523.93225 279.80265 24780.08908
6.45000 -6072.85765 58.51926 483.24381 495.45688 261.52508 29020.56755
6.55000 -6014.72549 56.34894 -234.74000 466.57993 246.03415 22256.50661
6.65000 -5934.50963 54.01059 163.20123 428.66391 227.74543 22945.10178
6.75000 -5867.49557 53.08138 131.01925 397.34478 214.34491 20879.59373
6.85000 -5788.77954 49.56145 -326.10945 358.19597 198.78366 24055.78989
6.95000 -5731.33053 47.08004 -171.91915 335.99997 190.14707 19201.70488
7.05000 -5671.04535 41.53174 -407.88592 303.28167 178.59604 23214.07630
7.15000 -5611.26526 37.85914 -435.34592 268.32582 170.35233 17024.35040
7.25000 -5560.65380 31.64016 -702.32450 252.04424 159.93140 20569.20990
7.35000 -5513.43078 37.35332 -478.74209 231.84628 150.92506 16010.69834
7.45000 -5459.48587 35.51006 -501.60121 207.56036 143.55454 18571.05476
7.55000 -5410.35739 32.38926 -200.77135 195.73014 136.75120 16707.65076
7.65000 -5353.96264 27.37693 376.30542 184.09052 131.14687 45349.72525
7.75000 -5302.05729 30.19993 -66.37587 177.17651 124.08194 17334.12592
7.85000 -5249.46126 29.59621 326.85043 169.53269 118.59929 17278.20470
7.95000 -5206.57098 25.88268 119.00384 170.38535 114.23027 18927.20889
8.05000 -5157.57474 23.92112 81.29815 171.92610 111.43367 12257.19812
8.15000 -5118.80254 24.95178 45.67599 176.55709 105.69373 15952.31110
8.25000 -5068.04369 27.18729 -645.92292 177.15963 100.65592 25612.56251
8.35000 -5019.79057 29.19291 -383.28560 175.28164 99.57260 13470.84818
8.45000 -4975.39071 24.42115 51.51259 176.23448 95.46083 12797.61489
8.55000 -4929.36563 28.48414 400.85503 170.88693 92.45547 10956.10897
8.65000 -4887.97718 26.09953 61.07662 170.94047 88.63496 9675.75432
8.75000 -4840.53571 26.85102 14.14392 164.13704 84.56096 10659.49404
8.85000 -4796.02914 26.85649 -217.72770 165.10154 85.03317 11381.03562
8.95000 -4746.31061 27.46517 -27.51649 164.31178 80.30813 9962.65411
9.05000 -4702.21303 28.59843 -91.63069 163.89249 81.24377 8734.60526
9.15000 -4660.53400 28.38403 -76.65715 160.18815 77.09151 9240.52229
9.25000 -4612.91141 27.39777 -183.58083 151.60184 75.94755 7384.71410
9.35000 -4560.87305 28.36388 29.49992 145.66724 72.66553 7810.05212
9.45000 -4516.13710 27.33704 663.89400 145.80464 71.53649 44317.13182
9.55000 -4476.21461 28.33405 87.95600 138.10977 71.76633 7927.62643
9.65000 -4432.51884 26.27478 110.88970 131.57546 72.26212 7425.74147
9.75000 -4391.68431 31.15935 -165.55310 124.11530 70.86293 7513.78384
9.85000 -4357.10215 27.46664 74.66096 117.18489 69.14291 8687.69243
9.95000 -4315.67241 26.60618 370.62071 114.65899 69.40415 14878.76315
10.05000 -4277.44113 25.31736 104.35495 110.76695 69.15919 8131.76661
10.15000 -4240.50288 26.12137 -43.61248 108.28886 66.60218 7260.43495
10.25000 -4208.33501 26.16905 -90.98051 106.75989 68.06112 7553.68320
10.35000 -4168.76692 25.19263 -66.28068 104.35647 66.26737 6612.38167
10.45000 -4134.75438 23.17756 -172.64995 99.14091 65.62431 7295.95283
10.55000 -4101.73628 25.53006 -155.45917 93.24210 67.91946 9063.56507
10.65000 -4070.33518 23.64503 81.95119 94.32892 67.43226 6644.45801
10.75000 -4039.94182 23.81687 218.98465 93.42264 69.06292 6395.55872
10.85000 -4015.96703 20.10851 126.31131 92.10123 68.48451 4963.91203
10.95000 -3981.62353 21.78837 136.56274 92.51074 66.95496 5535.49341
11.05000 -3954.13800 19.49049 138.33990 92.04897 66.69598 5868.50482
11.15000 -3926.04457 21.72234 119.97762 90.57049 66.17486 5593.54447
11.25000 -3897.61142 21.53498 67.29708 89.86350 66.01260 5222.48611
11.35000 -3865.78618 20.24804 177.48831 88.23613 64.19898 5582.63431
11.45000 -3840.91837 19.00568 -36.58990 88.40507 64.90911 4509.06054
11.55000 -3813.47321 19.40755 276.73683 85.01916 63.46738 5056.73145
11.65000 -3785.34830 18.69562 166.12790 85.47605 63.03524 4406.57363
11.75000 -3756.01142 19.64574 -60.78426 86.44215 64.59999 4021.00230
11.85000 -3727.27117 20.87037 115.78728 88.35782 64.36986 4177.35698
11.95000 -3702.49683 17.17618 85.11813 84.65026 63.54100 4167.85031
12.05000 -3675.83008 18.44547 130.95801 83.35965 61.38697 6207.81740
12.15000 -3644.26472 20.83589 212.54305 82.56560 63.38979 3928.14676
12.25000 -3615.15723 18.65520 21.49483 83.20889 59.27165 3613.02225
12.35000 -3589.24263 20.46353 66.82401 77.93282 62.13821 3704.86586
12.45000 -3560.87001 16.93785 -33.69866 80.95910 60.36338 4373.67628
12.55000 -3536.31517 21.96510 85.43354 80.03950 58.54084 3660.91846
12.65000 -3501.63070 20.14223 -26.74267 81.19879 59.84931 3818.67343
12.75000 -3483.21134 21.54116 48.31129 83.26558 60.71250 3171.77113
12.85000 -3450.30789 17.98770 134.41950 85.29584 59.83120 4229.38344
12.95000 -3424.45552 17.86831 31.11221 81.79943 60.75260 3457.34942
13.05000 -3398.21603 19.57503 7.44383 81.21817 61.71133 3355.19389
13.15000 -3367.41205 16.42077 -7.28883 79.24733 59.58714 2463.81159
13.25000 -3340.88195 21.86998 170.71013 77.27876 59.90600 3141.36980
13.35000 -3310.25695 16.71074 -28.01154 79.15140 60.32128 3232.99847
13.45000 -3287.22587 17.29473 51.78217 76.98782 58.50546 2728.34528
13.55000 -3262.31175 18.16807 198.51825 79.78985 59.90455 3362.05443
13.65000 -3241.58880 15.82053 114.40553 79.14664 59.85460 2835.51834
13.75000 -3217.25585 16.20843 -25.62255 80.31150 58.81237 2478.13812
13.85000 -3193.16342 21.05879 -17.17683 78.22253 59.15653 2651.01154
13.95000 -3168.65114 18.73303 47.14910 77.16890 57.43309 2537.24983
14.05000 -3142.75288 16.76686 -102.10732 79.69455 57.00063 2348.40631
14.15000 -3122.89786 17.34118 4.42014 77.55823 58.77601 2209.03040
14.25000 -3100.75543 14.40439 18.45839 77.35939 59.18671 2120.77727
14.35000 -3077.19775 14.78557 6.33589 75.95134 56.92022 1910.44426
14.45000 -3055.96526 16.75200 -18.19902 76.32744 59.37514 2574.86196
14.55000 -3042.48481 17.49365 62.30074 74.22139 56.56264 2041.73762
14.65000 -3010.85285 12.63983 -6.95161 77.14095 58.03120 1630.57372
14.75000 -2983.17469 12.85932 -212.59713 77.17423 57.34354 2803.54256
14.85000 -2970.06919 9.60063 -94.00352 78.54513 57.18598 2039.50749
14.95000 -2945.89712 15.66392 -41.18419 74.83718 60.09225 1920.61003
15.05000 -2924.75213 13.32661 -102.78288 78.07843 59.73109 1465.58282
15.15000 -2906.62371 14.89402 -6.74511 77.17427 57.98287 1638.66843
15.25000 -2882.45107 14.04307 -50.47534 76.15128 57.99319 1503.81147
15.35000 -2860.95647 10.94764 -181.17369 78.67487 59.57333 1542.07430
15.45000 -2837.74137 14.04955 -85.73487 78.58201 58.73791 1440.89805
15.55000 -2823.52088 14.55194 -98.78760 76.11530 59.21798 1429.92818
15.65000 -2807.52087 10.15428 -149.99521 71.37351 59.36019 1744.26520
15.75000 -2779.72797 16.73090 -34.72362 74.24303 58.94807 1264.45300
15.85000 -2766.28142 14.98373 -76.36289 71.30567 60.23743 1453.64255
15.95000 -2750.28589 11.02157 -39.87326 69.98807 62.07699 1312.87688
16.05000 -2727.40084 12.16297 -20.00220 71.47055 61.86060 1419.76008
16.15000 -2713.58277 10.54115 6.07916 69.75464 60.34470 2768.69247
16.25000 -2692.61420 15.59202 -95.15433 66.58665 61.40336 1565.65585
16.35000 -2670.71363 12.09898 31.07683 67.52483 62.36611 1178.59694
16.45000 -2661.09893 5.34206 -109.86312 66.10488 61.11006 1208.23997
16.55000 -2642.37739 10.19068 -75.65038 62.39637 62.51455 1004.15988
16.65000 -2624.32259 10.65420 -133.57717 63.91631 62.92403 1336.56865
16.75000 -2603.43631 6.32373 -0.94168 64.03712 61.04824 1003.68707
16.85000 -2582.11930 10.07838 22.61339 66.33281 61.94604 968.85423
16.95000 -2573.66906 5.51610 -39.61173 66.75041 62.94117 1019.94914
17.05000 -2562.35906 2.01568 -66.13124 66.86630 59.26058 894.12684
17.15000 -2543.08806 3.84782 39.93502 66.56458 60.18035 1196.00507
17.25000 -2521.89376 1.56865 34.56006 66.78638 57.85706 979.11873
17.35000 -2513.98831 5.81831 -101.56064 64.26914 61.34520 1097.61560
17.45000 -2498.88324 6.33941 -16.56442 68.16002 61.45519 802.46290
17.55000 -2489.73211 8.10008 -73.17714 68.24895 61.66146 852.16302
17.65000 -2465.71911 5.65800 22.36821 65.49547 60.69357 1672.80627
17.75000 -2449.19298 11.28224 -10.29063 67.05221 59.30384 870.32489
17.85000 -2430.39457 5.05433 -102.93159 67.13677 57.62030 1187.01768
17.95000 -2425.58544 3.66601 -28.28984 66.49776 59.96377 703.06709
18.05000 -2408.60760 7.23561 24.65246 67.76772 59.00850 1021.56632
18.15000 -2387.49313 1.79653 -4.27848 67.93832 56.87290 635.16226
18.25000 -2386.24626 5.33693 -43.94858 67.68837 60.23291 790.55411
18.35000 -2361.50069 9.34920 -50.68656 68.29532 57.05152 826.09472
18.45000 -2350.02823 7.14471 -134.57820 65.13119 59.62735 1000.93112
18.55000 -2334.97828 11.39011 0.27156 68.59229 60.26811 825.07091
18.65000 -2323.30245 3.92325 -9.73689 67.33758 60.50150 587.57924
18.75000 -2312.62051 14.19364 9.23327 66.44881 60.16638 380.14152
18.85000 -2297.31049 5.67080 -72.94914 66.75566 55.96798 1074.07213
18.95000 -2285.63984 2.82777 -76.96769 65.48200 56.54995 791.67245
19.05000 -2265.55678 -1.56831 -7.68306 64.07120 58.59340 938.57991
19.15000 -2257.51404 5.03822 -55.97695 64.90616 58.08723 1280.51741
19.25000 -2253.59485 5.13188 19.47911 66.27391 59.78540 565.47825
19.35000 -2232.33145 5.13510 -33.52145 67.79012 56.89314 663.32980
19.45000 -2219.63743 2.29802 85.61862 68.51205 55.51495 1075.16280
19.55000 -2205.26569 4.36936 -29.56167 69.16249 53.57400 916.38613
19.65000 -2188.48602 3.15790 15.91604 70.76172 56.96581 909.97625
19.75000 -2182.44553 2.66164 -24.15986 69.61589 54.67945 516.67575
19.85000 -2172.35772 2.12315 -57.61895 67.01804 54.24789 610.74304
19.95000 -2159.94672 0.53749 -38.44355 69.28891 54.58599 438.30919
