0.05000 15063.42062
0.15000 25983.97970
0.25000 26012.06646
0.35000 24797.13698
0.45000 23499.34308
0.55000 21335.41822
0.65000 19409.97715
0.75000 17537.39260
0.85000 15841.77888
0.95000 14709.17864
1.05000 13762.29067
1.15000 12749.82579
1.25000 12105.30780
1.35000 11314.16369
1.45000 10363.90749
1.55000 9662.09888
1.65000 9155.74836
1.75000 8636.21994
1.85000 8428.65910
1.95000 7864.84560
2.05000 7557.23213
2.15000 7125.94131
2.25000 6828.44745
2.35000 6508.44105
2.45000 6308.81715
2.55000 6077.14870
2.65000 5905.88723
2.75000 5595.34807
2.85000 5374.37446
2.95000 5170.28795
3.05000 5044.82177
3.15000 4889.44886
3.25000 4675.08572
3.35000 4520.93447
3.45000 4409.44811
3.55000 4171.38609
3.65000 4076.52944
3.75000 4059.20675
3.85000 3974.72987
3.95000 3788.06105
4.05000 3759.83764
4.15000 3577.80318
4.25000 3525.82270
4.35000 3476.38426
4.45000 3325.07003
4.55000 3269.67315
4.65000 3290.92726
4.75000 3134.45391
4.85000 2987.88614
4.95000 2953.22499
5.05000 2752.82866
5.15000 2750.41050
5.25000 2657.47055
5.35000 2625.64795
5.45000 2504.88706
5.55000 2380.38304
5.65000 2363.16190
5.75000 2287.06297
5.85000 2160.63961
5.95000 2116.15818
6.05000 2099.27664
6.15000 1991.71496
6.25000 1946.02797
6.35000 1843.93760
6.45000 1678.45097
6.55000 1748.20007
6.65000 1665.23016
6.75000 1596.66895
6.85000 1531.21023
6.95000 1461.23998
7.05000 1410.98705
7.15000 1429.21659
7.25000 1320.96756
7.35000 1254.19342
7.45000 1242.03497
7.55000 1235.68921
7.65000 1169.55678
7.75000 1148.90393
7.85000 1104.07987
7.95000 1075.08978
8.05000 1002.45799
8.15000 1008.54703
8.25000 976.79427
8.35000 980.39866
8.45000 915.69287
8.55000 920.34699
8.65000 915.70781
8.75000 876.41909
8.85000 838.52762
8.95000 846.20164
9.05000 822.80328
9.15000 820.67919
9.25000 767.58159
9.35000 745.54330
9.45000 742.56173
9.55000 717.79913
9.65000 691.35875
9.75000 672.37031
9.85000 670.05985
9.95000 685.41423
10.05000 638.34914
10.15000 623.01409
10.25000 595.61137
10.35000 605.39210
10.45000 591.62564
10.55000 598.32042
10.65000 579.20507
10.75000 547.14171
10.85000 549.13095
10.95000 543.70903
11.05000 524.33352
11.15000 529.16465
11.25000 523.65047
11.35000 494.98559
11.45000 506.46045
11.55000 449.63288
11.65000 466.43717
11.75000 460.34186
11.85000 439.86827
11.95000 467.05840
12.05000 434.90844
12.15000 403.00116
12.25000 422.96617
12.35000 395.87759
12.45000 394.47866
12.55000 374.77451
12.65000 395.66898
12.75000 381.26689
12.85000 374.97426
12.95000 376.40974
13.05000 348.28877
13.15000 376.29238
13.25000 329.81624
13.35000 350.19608
13.45000 342.71885
13.55000 349.13360
13.65000 318.74045
13.75000 312.87101
13.85000 340.82889
13.95000 308.44583
14.05000 328.07391
14.15000 300.86008
14.25000 301.19220
14.35000 288.31438
14.45000 270.31246
14.55000 275.98091
14.65000 281.03701
14.75000 285.98025
14.85000 263.08577
14.95000 257.08970
15.05000 251.46330
15.15000 280.35787
15.25000 258.09257
15.35000 248.49052
15.45000 258.63417
15.55000 252.84780
15.65000 238.79132
15.75000 240.81395
15.85000 226.42499
15.95000 233.30621
16.05000 214.80715
16.15000 218.25706
16.25000 226.50035
16.35000 224.94905
16.45000 218.81380
16.55000 216.25387
16.65000 217.36515
16.75000 197.03911
16.85000 198.11811
16.95000 192.43428
17.05000 196.75014
17.15000 199.53650
17.25000 196.58063
17.35000 193.38112
17.45000 196.65427
17.55000 198.26962
17.65000 189.14540
17.75000 183.94024
17.85000 179.39295
17.95000 193.46881
18.05000 178.09072
18.15000 183.21638
18.25000 178.43213
18.35000 179.15476
18.45000 173.16823
18.55000 182.48693
18.65000 177.95975
18.75000 163.07233
18.85000 150.13553
18.95000 144.94503
19.05000 161.05906
19.15000 168.32120
19.25000 154.94522
19.35000 144.38307
19.45000 142.20079
19.55000 157.82016
19.65000 140.00211
19.75000 157.85072
19.85000 150.22537
19.95000 159.62768
