0.120000 -1.965170
0.380000 0.939960
0.620000 0.938060
0.880000 0.925560
1.120000 0.884610
1.380000 0.884530
1.620000 0.873650
1.880000 0.850930
2.120000 0.867680
2.380000 0.854380
2.620000 0.840860
2.880000 0.845920
3.120000 0.849300
3.380000 0.858540
3.620000 0.831900
3.880000 0.834860
4.120000 0.818790
4.380000 0.815430
4.620000 0.803860
4.880000 0.838640
5.120000 0.840710
5.380000 0.872880
5.620000 0.840310
5.880000 0.832380
6.120000 0.806250
6.380000 0.735090
6.620000 0.682750
6.880000 0.667380
7.120000 0.674700
7.380000 0.699980
7.620000 0.708990
7.880000 0.720640
8.120000 0.849060
8.380000 0.826470
8.620000 1.023880
8.880000 1.164060
9.120000 1.164290
9.380000 1.260220
9.620000 1.090900
9.880000 0.998750
10.120000 1.029440
10.380000 0.359810
10.620000 0.010390
10.880000 0.386000
11.120000 -0.098750
11.380000 0.028700
11.620000 0.031350
11.880000 -0.097790
12.120000 -0.651320
12.380000 -0.498290
12.620000 -1.153890
12.880000 -2.624710
13.120000 -1.955490
13.380000 2.149510
13.620000 -0.318020
13.880000 1.456420
14.120000 1.041450
14.380000 0.533400
14.620000 0.270360
14.880000 0.440880
