0.12500 0.02356
0.37500 0.03564
0.62500 0.02921
0.87500 0.01347
1.12500 0.02236
1.37500 0.02710
1.62500 0.03795
1.87500 0.04184
2.12500 0.04824
2.37500 0.04566
2.62500 0.03933
2.87500 0.03386
3.12500 0.01363
3.37500 0.02323
3.62500 0.00940
3.87500 0.03381
4.12500 0.01387
4.37500 0.02481
4.62500 0.04589
4.87500 0.03817
5.12500 0.03718
5.37500 0.04407
5.62500 0.03323
5.87500 0.02307
6.12500 0.00541
6.37500 0.00723
6.62500 0.01522
6.87500 0.02267
7.12500 0.03015
7.37500 0.01990
7.62500 0.03446
7.87500 0.02182
8.12500 0.03475
8.37500 0.02247
8.62500 0.03088
8.87500 0.02951
9.12500 0.00388
9.37500 0.03866
9.62500 0.01336
9.87500 0.01897
10.12500 0.03418
10.37500 0.02625
10.62500 0.04579
10.87500 0.02503
11.12500 0.03564
11.37500 0.02967
11.62500 0.01104
11.87500 0.01436
12.12500 0.03623
12.37500 0.02316
12.62500 0.04560
12.87500 0.03277
13.12500 0.02166
13.37500 0.02696
13.62500 0.01634
13.87500 0.04010
14.12500 0.02226
14.37500 0.03555
14.62500 0.02902
14.87500 0.04640
15.12500 0.06441
15.37500 0.03746
15.62500 0.02860
15.87500 0.08862
16.12500 0.02803
16.37500 0.03092
16.62500 0.02856
16.87500 0.04652
17.12500 0.03852
17.37500 0.01351
17.62500 0.07272
17.87500 0.04845
18.12500 0.03152
18.37500 0.03752
18.62500 0.05405
18.87500 0.13598
19.12500 0.09488
19.37500 0.07517
19.62500 0.06912
19.87500 0.04001
