0.120000 0.557690
0.380000 1.479110
0.620000 1.243860
0.880000 1.231850
1.120000 1.279730
1.380000 1.315650
1.620000 1.274960
1.880000 1.296790
2.120000 1.327960
2.380000 1.299160
2.620000 1.352200
2.880000 1.372920
3.120000 1.378950
3.380000 1.351910
3.620000 1.401930
3.880000 1.326200
4.120000 1.321420
4.380000 1.285910
4.620000 1.239010
4.880000 1.221540
5.120000 1.104450
5.380000 0.998360
5.620000 0.908190
5.880000 0.877320
6.120000 0.845650
6.380000 0.851750
6.620000 0.830630
6.880000 0.891460
7.120000 0.808840
7.380000 0.651280
7.620000 0.793860
7.880000 0.749930
8.120000 0.840580
8.380000 0.791220
8.620000 0.901510
8.880000 0.761220
9.120000 0.685560
9.380000 0.570090
9.620000 0.637110
9.880000 0.415750
10.120000 0.407010
10.380000 0.598640
10.620000 0.216820
10.880000 -0.198500
11.120000 -0.756180
11.380000 -1.510210
11.620000 -2.362980
11.880000 -2.375330
12.120000 -2.194590
12.380000 -2.475350
12.620000 -2.458430
12.880000 -2.655710
13.120000 -2.502800
13.380000 3.105060
13.620000 -3.037700
13.880000 2.613080
14.120000 -2.952860
14.380000 3.033050
14.620000 -0.144080
14.880000 -2.606610
