0.12500 0.01757
0.37500 0.07133
0.62500 0.15596
0.87500 0.22584
1.12500 0.28721
1.37500 0.32747
1.62500 0.36247
1.87500 0.39089
2.12500 0.42681
2.37500 0.44059
2.62500 0.46470
2.87500 0.47360
3.12500 0.48498
3.37500 0.48483
3.62500 0.50010
3.87500 0.49329
4.12500 0.48097
4.37500 0.47690
4.62500 0.43237
4.87500 0.38878
5.12500 0.34169
5.37500 0.28201
5.62500 0.24854
5.87500 0.22969
6.12500 0.21653
6.37500 0.21402
6.62500 0.21617
6.87500 0.21001
7.12500 0.20002
7.37500 0.19710
7.62500 0.16232
7.87500 0.14404
8.12500 0.11964
8.37500 0.10670
8.62500 0.06605
8.87500 0.07902
9.12500 0.06981
9.37500 0.05601
9.62500 0.04707
9.87500 0.04288
10.12500 0.03580
10.37500 0.01419
10.62500 0.01416
10.87500 0.01394
11.12500 0.03881
11.37500 0.04583
11.62500 0.05353
11.87500 0.07102
12.12500 0.06215
12.37500 0.05444
12.62500 0.03503
12.87500 0.03257
13.12500 0.01019
13.37500 0.01839
13.62500 0.03071
13.87500 0.03364
14.12500 0.02075
14.37500 0.06252
14.62500 0.06942
14.87500 0.08013
