0.2 -1.31464 11.0534 -1.09699 115.11935 111.4848 95.81427
0.6 -0.54497 32.64846 0.33701 113.51542 108.70456 90.29708
1.0 2.37001 51.48988 0.8349 113.46631 100.32494 85.12777
1.4 1.10437 63.29731 -0.57547 112.72509 94.0541 80.08999
1.8 2.51576 70.50515 -0.54022 113.95676 87.72465 76.1343
2.2 3.50418 77.37123 0.59239 112.58061 82.93384 73.06466
2.6 -0.14499 83.05863 0.89635 109.78095 78.0739 69.9456
3.0 -0.80985 83.28746 0.3344 106.22259 72.39015 66.7169
3.4 1.43272 86.72123 0.92001 101.62974 68.48809 63.88939
3.8 -1.90383 89.2875 -0.24994 97.51718 65.12438 60.6434
4.2 -1.96134 96.48275 1.57757 91.4915 63.21754 58.91649
4.6 -3.43969 99.41882 0.63303 85.57455 62.34858 56.35642
5.0 -1.19956 106.62481 0.94261 78.87385 63.01638 53.41414
5.4 -4.05642 114.60474 -0.11796 71.60239 64.14961 51.44474
5.8 -4.33644 127.13847 -1.47036 64.6886 64.07094 49.27313
6.2 -2.19901 139.65765 -0.79288 58.17174 62.21583 45.93566
6.6 -2.92109 152.65133 0.19723 51.45181 57.87635 42.20931
7.0 -1.32139 163.13725 -0.07444 45.86737 52.0912 37.46062
7.4 -0.08726 169.79633 -0.48224 42.01865 45.46424 34.00598
7.8 -0.55469 175.64768 0.89079 38.25849 39.54995 30.54734
8.2 0.01417 180.17183 1.4668 35.96871 35.0344 26.95625
8.6 -0.60213 182.95951 0.58978 32.98979 32.73099 24.78516
9.0 -1.5193 188.34742 -0.43894 31.17841 28.90251 23.60891
9.4 -0.95197 192.19994 -1.67769 30.43918 25.04932 22.2129
9.8 -0.32952 193.88315 -1.77184 29.21783 23.64692 21.20105
10.2 -0.17752 195.12431 -1.62535 28.38566 22.02508 20.48772
10.6 0.38995 195.68477 -2.4253 27.61238 21.11967 19.05414
11.0 0.45908 196.402 -1.41323 25.92402 19.98403 18.76982
11.4 0.51644 197.18439 -1.06252 25.74242 19.31747 18.18965
11.8 0.84083 198.3225 -0.35206 24.29561 18.82095 17.37704
12.2 0.80668 198.5781 -0.72977 23.05332 17.86226 17.20844
12.6 1.30264 198.11301 -0.1464 22.46634 17.17332 16.35083
13.0 0.57985 198.97503 -0.37585 21.77895 17.13552 16.00727
13.4 1.13048 199.71178 1.07947 21.5351 16.72854 15.2682
13.8 1.17285 199.93161 1.54558 20.81231 16.224 14.87462
14.2 0.25579 200.35495 0.28718 19.31709 15.60299 14.22897
14.6 -0.07565 201.52818 0.78465 18.87794 15.33277 14.17559
15.0 0.26956 202.79041 -0.18006 18.70531 14.99424 13.50881
15.4 0.21316 203.90855 0.26092 18.30025 14.57427 13.26716
15.8 0.68061 204.88712 0.44228 17.94521 13.91171 13.57377
16.2 -0.4846 205.21087 -0.83432 17.55714 13.93092 13.3973
16.6 1.42529 206.80834 -1.17667 17.75069 13.08641 12.9781
17.0 1.21175 206.87792 -0.79755 17.43968 11.54719 12.60275
17.4 1.63388 206.97048 -1.71491 17.26263 11.2987 12.71746
17.8 1.72452 205.81056 -0.3124 17.24645 10.33685 12.83612
18.2 2.44225 204.65333 -0.16892 16.59836 8.89467 11.90891
18.6 1.73845 203.17671 -0.99013 16.3168 8.86075 11.85043
19.0 1.51696 201.2048 -0.81386 15.69495 9.27349 11.98848
19.4 1.60034 200.50008 -1.13261 16.80311 9.78561 11.20971
19.8 1.82267 198.96263 -0.28856 15.89802 10.17718 11.64713
