0.1875 0.21111 17.08069 0.93387 104.98866 102.78401 90.57648
0.5625 0.65492 37.42383 1.79334 102.05482 95.07974 84.41811
0.9375 -0.36287 59.17114 1.74228 97.60173 87.02299 78.95577
1.3125 0.56562 71.48259 0.95129 93.38237 81.67919 74.56182
1.6875 0.30436 82.95112 -0.15604 88.16113 76.41045 71.22318
2.0625 0.8048 90.19145 0.09875 83.91108 73.09833 67.6209
2.4375 -0.73999 99.89336 0.43312 78.58011 70.54773 65.32076
2.8125 0.38191 109.85729 -0.31851 74.64494 67.84212 62.41689
3.1875 1.02535 120.62162 -1.76526 69.82648 65.2372 59.66687
3.5625 -0.23304 132.41792 -0.64433 65.79505 61.8321 56.4124
3.9375 -0.45562 143.0122 -0.68525 61.98917 57.75596 52.62444
4.3125 0.46299 153.02709 -0.29163 57.27075 52.33959 48.67459
4.6875 -0.44518 160.01009 -0.93376 53.21585 48.40514 46.32706
5.0625 -1.04056 166.55878 -0.22935 50.12842 45.26944 43.42993
5.4375 -1.5044 171.76987 0.05454 47.84494 42.57324 41.72226
5.8125 -1.77726 177.2085 0.02457 45.95082 39.87611 39.45204
6.1875 -1.75496 181.94002 0.02244 44.31393 37.17548 37.83999
6.5625 -1.63833 185.64276 0.23339 42.4556 35.55142 36.17419
6.9375 -0.9428 188.85336 0.11226 41.5829 34.21093 34.55491
7.3125 -0.24073 191.72586 -0.08735 40.16671 32.83036 33.04732
7.6875 0.06924 194.74502 0.36507 38.60698 31.72198 31.81235
8.0625 0.33966 196.15791 -0.08923 37.50591 30.85104 30.38942
8.4375 0.49001 197.88583 -0.38831 36.16553 29.83315 29.44548
8.8125 0.48045 199.89153 -0.66574 35.1446 28.98213 28.39871
9.1875 -0.07544 201.70988 -0.61412 33.56675 28.11274 27.03135
9.5625 -0.22725 203.20229 -0.68586 32.91244 27.36187 25.97228
9.9375 -0.12179 205.40703 -0.29691 31.5465 25.99709 25.31242
10.3125 -0.28223 206.63638 -0.44381 30.42463 25.09853 24.33266
10.6875 -0.54533 208.20355 -0.2767 29.35525 24.20055 23.62383
11.0625 0.18401 209.9199 0.33834 28.34726 23.31153 22.51798
11.4375 0.38436 210.1807 0.28353 27.82321 22.27822 21.64061
11.8125 0.59411 211.79879 0.56814 26.54836 21.39836 20.96224
12.1875 0.69437 212.58395 0.29995 26.25215 20.83791 20.41733
12.5625 0.83154 213.5443 0.21275 25.47231 19.70407 19.72841
12.9375 0.2072 213.09049 0.03733 24.91432 19.38266 18.85388
13.3125 0.73284 213.73168 0.06689 24.71946 18.19816 18.73174
13.6875 0.83451 213.83273 -0.04314 24.0825 17.59038 18.06482
14.0625 -0.23271 213.64029 0.05262 23.48394 16.95533 18.07358
14.4375 0.25617 213.52038 -0.20676 23.17951 15.96631 17.41467
14.8125 0.09389 213.4492 0.20865 22.39406 15.77464 16.52176
15.1875 -0.22513 212.95434 0.52489 21.63158 15.75873 16.21496
15.5625 -0.98804 212.98185 0.51695 21.10408 15.58646 15.62547
15.9375 -0.05809 212.99008 0.07861 20.55025 15.198 14.91328
16.3125 0.26861 213.69026 0.00644 19.85552 14.76041 14.20377
16.6875 -0.21304 213.57709 0.10927 19.09284 14.52749 14.11602
17.0625 0.3173 213.55354 -0.01519 19.20381 14.1279 13.73876
17.4375 -0.1887 213.37328 -0.04601 18.18301 13.87955 13.24455
17.8125 -0.83291 213.53961 0.07256 17.88434 13.59194 12.86915
18.1875 -0.11022 213.00733 -0.15559 17.2934 13.43854 12.85808
18.5625 -0.17919 213.32534 -0.70526 17.22665 13.04117 12.29745
18.9375 -0.441 213.46615 -0.64928 16.90323 12.38116 11.69168
19.3125 -0.34481 213.15334 -0.52641 16.85759 11.84521 11.74958
19.6875 -0.07443 212.63935 -1.24336 15.80545 11.35528 11.62454
20.0625 -0.11132 212.31935 -0.04448 15.80251 11.28735 11.21211
20.4375 -0.01014 212.80952 0.12152 15.32665 10.54661 10.80052
20.8125 -0.10644 212.29038 -0.18737 14.96241 10.6748 10.47894
21.1875 -0.10468 212.1694 0.2131 15.07606 10.83161 10.50031
21.5625 -0.20861 212.37503 0.47933 14.53639 10.05713 10.46114
21.9375 0.61942 212.15312 0.57103 14.45402 10.3677 9.83473
22.3125 -0.1594 211.14553 0.38009 13.83064 9.5757 9.91956
22.6875 0.05801 210.90705 0.39943 13.40675 9.17468 9.83968
23.0625 0.68524 210.61899 -0.05269 13.15842 9.23035 9.38767
23.4375 0.30243 210.01101 0.67989 12.60214 8.86687 9.12497
23.8125 -0.37579 209.90279 -0.0983 11.98981 9.82174 8.2797
24.1875 0.31973 210.39953 -0.32129 11.69456 9.16736 8.52539
24.5625 -0.20317 210.08625 -0.17862 11.48239 8.62321 8.11744
24.9375 0.14912 209.86149 -0.22114 11.75757 8.19995 7.8309
25.3125 -0.85647 209.10355 -0.06828 10.1404 8.31739 7.43166
25.6875 -0.30781 209.20568 0.03428 10.73821 7.71612 7.33611
26.0625 0.03926 208.48003 -0.01993 10.14536 7.47595 7.43647
26.4375 0.27213 208.44118 0.44339 10.8121 7.03979 7.67344
26.8125 -0.44713 207.99735 -0.45369 9.53892 7.04778 6.97859
27.1875 -0.07197 207.77708 0.15643 10.29688 7.60127 6.94805
27.5625 -0.71058 207.9695 0.26173 9.93219 6.96143 6.78077
27.9375 -0.54218 208.33566 -0.10891 9.8945 6.4545 6.36616
28.3125 -0.38191 207.60284 0.58136 10.13777 6.39288 6.6415
28.6875 1.06811 207.21156 -0.06351 9.76049 6.03744 6.94952
29.0625 1.30793 206.04513 -0.48641 9.69563 6.02248 6.50447
29.4375 0.24891 205.23367 -0.63914 9.57026 6.07059 6.50947
29.8125 -0.06912 206.21891 -0.87165 8.99875 5.94899 6.13509
