0.125 0.000 0.000 0.004
0.375 -0.000 0.002 0.056
0.625 0.013 -0.004 0.295
0.875 0.018 -0.019 0.793
1.125 0.035 -0.041 1.563
1.375 0.052 -0.076 2.396
1.625 0.099 -0.085 3.218
1.875 0.103 -0.105 4.173
2.125 0.163 -0.120 4.764
2.375 0.188 -0.132 5.347
2.625 0.191 -0.218 6.087
2.875 0.165 -0.198 6.444
3.125 0.211 -0.165 6.922
3.375 0.236 -0.167 7.178
3.625 0.203 -0.234 7.606
3.875 0.223 -0.224 7.760
4.125 0.199 -0.164 8.207
4.375 0.220 -0.187 8.261
4.625 0.180 -0.151 8.641
4.875 0.208 -0.194 8.849
5.125 0.228 -0.152 9.210
5.375 0.225 -0.208 9.409
5.625 0.238 -0.157 9.869
5.875 0.222 -0.159 10.261
6.125 0.246 -0.172 10.916
6.375 0.175 -0.105 11.250
6.625 0.215 -0.163 12.053
6.875 0.239 -0.150 13.139
7.125 0.239 -0.160 14.367
7.375 0.231 -0.157 15.362
7.625 0.298 -0.220 16.771
7.875 0.251 -0.234 18.529
8.125 0.305 -0.113 20.555
8.375 0.317 -0.211 22.437
8.625 0.349 -0.323 23.660
8.875 0.399 -0.210 25.138
9.125 0.376 -0.235 25.144
9.375 0.380 -0.308 24.863
9.625 0.369 -0.331 24.172
9.875 0.358 -0.424 23.288
10.125 0.304 -0.413 22.317
10.375 0.344 -0.375 20.974
10.625 0.304 -0.401 20.343
10.875 0.339 -0.407 20.176
11.125 0.330 -0.381 19.453
11.375 0.277 -0.337 18.986
11.625 0.336 -0.389 18.827
11.875 0.341 -0.361 18.590
12.125 0.342 -0.364 18.750
12.375 0.377 -0.384 18.268
12.625 0.398 -0.359 18.083
12.875 0.406 -0.355 17.532
13.125 0.419 -0.311 17.137
13.375 0.431 -0.291 16.523
13.625 0.441 -0.278 16.192
13.875 0.444 -0.253 16.080
14.125 0.416 -0.183 15.851
14.375 0.424 -0.152 14.954
14.625 0.419 -0.134 15.223
14.875 0.343 -0.094 14.333
