0.05000 6670.29434
0.15000 11090.58942
0.25000 12756.10163
0.35000 12766.17356
0.45000 12069.12257
0.55000 11193.37680
0.65000 10747.25386
0.75000 9928.55652
0.85000 9424.01062
0.95000 8840.13582
1.05000 8359.82513
1.15000 7879.68618
1.25000 7522.94725
1.35000 7096.54919
1.45000 6830.94255
1.55000 6454.06067
1.65000 6175.36675
1.75000 5913.21053
1.85000 5739.07810
1.95000 5560.54359
2.05000 5295.18854
2.15000 5026.85021
2.25000 4876.16481
2.35000 4647.09679
2.45000 4462.50267
2.55000 4336.94558
2.65000 4168.94954
2.75000 4043.68756
2.85000 3899.24625
2.95000 3781.58244
3.05000 3607.92033
3.15000 3549.61884
3.25000 3437.44290
3.35000 3328.75979
3.45000 3176.78102
3.55000 3173.98180
3.65000 3009.14078
3.75000 2948.20305
3.85000 2875.06354
3.95000 2785.53141
4.05000 2701.76989
4.15000 2642.66464
4.25000 2583.48064
4.35000 2547.59863
4.45000 2423.25345
4.55000 2346.67290
4.65000 2296.16551
4.75000 2238.49296
4.85000 2156.43577
4.95000 2111.66581
5.05000 2070.57858
5.15000 2025.91962
5.25000 1977.55102
5.35000 1936.95107
5.45000 1878.76968
5.55000 1834.97076
5.65000 1839.36626
5.75000 1764.71501
5.85000 1733.42312
5.95000 1724.34905
6.05000 1672.72487
6.15000 1618.82094
6.25000 1585.66169
6.35000 1542.53614
6.45000 1508.85759
6.55000 1465.00323
6.65000 1438.67959
6.75000 1430.36705
6.85000 1402.22460
6.95000 1372.55601
7.05000 1323.74215
7.15000 1291.59664
7.25000 1284.30961
7.35000 1228.57496
7.45000 1223.36816
7.55000 1201.22572
7.65000 1181.17969
7.75000 1146.15591
7.85000 1128.76853
7.95000 1114.41071
8.05000 1085.42950
8.15000 1035.58236
8.25000 1042.99137
8.35000 1009.05358
8.45000 982.59209
8.55000 957.89989
8.65000 938.44975
8.75000 929.04283
8.85000 906.06466
8.95000 885.93620
9.05000 859.61172
9.15000 842.17730
9.25000 858.27637
9.35000 809.45983
9.45000 811.59779
9.55000 808.17687
9.65000 767.05929
9.75000 743.66901
9.85000 738.74753
9.95000 728.76329
10.05000 715.96902
10.15000 702.33368
10.25000 673.64391
10.35000 665.28377
10.45000 660.18331
10.55000 639.74111
10.65000 633.54407
10.75000 620.43978
10.85000 607.09004
10.95000 608.40103
11.05000 587.67582
11.15000 565.21918
11.25000 562.23131
11.35000 555.06329
11.45000 545.63136
11.55000 533.39878
11.65000 518.92593
11.75000 503.45273
11.85000 504.31555
11.95000 495.20726
12.05000 476.02532
12.15000 461.07968
12.25000 452.21344
12.35000 460.24166
12.45000 441.38685
12.55000 437.32365
12.65000 432.63776
12.75000 418.27973
12.85000 409.68896
12.95000 404.04381
13.05000 391.69814
13.15000 378.57735
13.25000 376.65896
13.35000 374.26629
13.45000 359.02910
13.55000 344.11744
13.65000 353.17574
13.75000 355.92260
13.85000 343.68292
13.95000 321.08632
14.05000 332.91485
14.15000 324.04314
14.25000 300.27871
14.35000 303.26013
14.45000 312.07871
14.55000 297.00477
14.65000 287.46611
14.75000 281.77632
14.85000 279.10680
14.95000 276.80991
15.05000 267.88297
15.15000 260.06481
15.25000 261.47854
15.35000 243.42213
15.45000 247.62151
15.55000 252.54934
15.65000 238.20012
15.75000 240.86243
15.85000 242.85553
15.95000 233.78906
16.05000 223.50650
16.15000 224.58528
16.25000 220.70600
16.35000 219.20199
16.45000 205.55719
16.55000 214.17849
16.65000 207.94790
16.75000 210.93160
16.85000 196.76716
16.95000 184.87143
17.05000 193.96150
17.15000 185.88688
17.25000 194.20019
17.35000 181.50057
17.45000 179.33913
17.55000 172.81055
17.65000 175.29290
17.75000 168.43593
17.85000 162.95876
17.95000 168.57821
18.05000 167.82986
18.15000 159.78411
18.25000 152.78876
18.35000 156.28799
18.45000 165.14909
18.55000 143.49796
18.65000 144.67661
18.75000 140.14235
18.85000 148.09567
18.95000 142.01709
19.05000 135.75043
19.15000 131.19396
19.25000 135.86046
19.35000 136.78846
19.45000 124.94822
19.55000 133.38520
19.65000 127.76602
19.75000 126.77966
19.85000 119.48657
19.95000 122.85166
