0.05000 11883.20888
0.15000 19688.85547
0.25000 19523.14827
0.35000 18564.05736
0.45000 16338.90403
0.55000 14918.29767
0.65000 14042.56126
0.75000 12535.52365
0.85000 11404.72955
0.95000 10796.24695
1.05000 9502.90092
1.15000 9267.38704
1.25000 8609.90783
1.35000 7941.84159
1.45000 7582.57195
1.55000 7052.86324
1.65000 6709.57901
1.75000 6360.57203
1.85000 6170.01727
1.95000 5716.52048
2.05000 5739.23586
2.15000 5484.89424
2.25000 5218.27946
2.35000 5032.15769
2.45000 4804.87430
2.55000 4739.96059
2.65000 4621.67622
2.75000 4313.03691
2.85000 4119.42709
2.95000 3974.30323
3.05000 3971.63080
3.15000 3687.38105
3.25000 3671.90045
3.35000 3572.51178
3.45000 3389.12654
3.55000 3277.70628
3.65000 3123.92871
3.75000 3080.09362
3.85000 3030.76274
3.95000 2926.65424
4.05000 2916.51532
4.15000 2872.73520
4.25000 2685.54441
4.35000 2696.28719
4.45000 2690.57928
4.55000 2525.23744
4.65000 2485.06216
4.75000 2411.73728
4.85000 2356.43059
4.95000 2305.63195
5.05000 2268.14022
5.15000 2224.15515
5.25000 2110.95406
5.35000 2054.76658
5.45000 2014.56939
5.55000 1972.97385
5.65000 1945.38898
5.75000 1894.47887
5.85000 1856.71496
5.95000 1798.13849
6.05000 1741.17659
6.15000 1715.97638
6.25000 1686.53713
6.35000 1600.02732
6.45000 1600.45665
6.55000 1557.14661
6.65000 1513.94043
6.75000 1455.07931
6.85000 1437.66279
6.95000 1423.87096
7.05000 1378.42359
7.15000 1341.55987
7.25000 1311.27870
7.35000 1277.52160
7.45000 1247.76766
7.55000 1211.22635
7.65000 1230.18884
7.75000 1147.55372
7.85000 1144.92016
7.95000 1105.80310
8.05000 1066.46467
8.15000 1062.06997
8.25000 1046.70033
8.35000 1004.69508
8.45000 991.68137
8.55000 973.50005
8.65000 964.17120
8.75000 902.42915
8.85000 922.55435
8.95000 911.34341
9.05000 857.37496
9.15000 837.08043
9.25000 834.83067
9.35000 825.41285
9.45000 788.16706
9.55000 748.30928
9.65000 743.57889
9.75000 766.42247
9.85000 714.48667
9.95000 679.89257
10.05000 700.18296
10.15000 668.43774
10.25000 656.43801
10.35000 646.21518
10.45000 655.56423
10.55000 643.97181
10.65000 637.41180
10.75000 606.83414
10.85000 615.92503
10.95000 605.32046
11.05000 550.81367
11.15000 574.19007
11.25000 540.98146
11.35000 533.80719
11.45000 542.36872
11.55000 527.39684
11.65000 515.68610
11.75000 505.58069
11.85000 501.54940
11.95000 495.42094
12.05000 501.28609
12.15000 479.16017
12.25000 462.89463
12.35000 468.00667
12.45000 449.25303
12.55000 433.11499
12.65000 445.38114
12.75000 436.69792
12.85000 410.37759
12.95000 398.01050
13.05000 402.55046
13.15000 389.31517
13.25000 388.97090
13.35000 374.75122
13.45000 384.52623
13.55000 375.45701
13.65000 361.19798
13.75000 346.31315
13.85000 396.45758
13.95000 359.18460
14.05000 338.64570
14.15000 359.56889
14.25000 332.52390
14.35000 322.45080
14.45000 314.83310
14.55000 341.23551
14.65000 309.08971
14.75000 284.42072
14.85000 296.57285
14.95000 288.61830
15.05000 270.03746
15.15000 283.53031
15.25000 262.17457
15.35000 271.06528
15.45000 250.22601
15.55000 255.46030
15.65000 255.87699
15.75000 246.79267
15.85000 290.29958
15.95000 236.91177
16.05000 248.31234
16.15000 238.69052
16.25000 230.99184
16.35000 223.88353
16.45000 217.42930
16.55000 235.97616
16.65000 221.03921
16.75000 211.42542
16.85000 207.69484
16.95000 209.02507
17.05000 204.22958
17.15000 203.68103
17.25000 214.18720
17.35000 200.91354
17.45000 189.20400
17.55000 182.72704
17.65000 175.58080
17.75000 240.91354
17.85000 179.63305
17.95000 191.87393
18.05000 176.73388
18.15000 192.31019
18.25000 168.37946
18.35000 173.84681
18.45000 163.70020
18.55000 157.25215
18.65000 174.33577
18.75000 163.28423
18.85000 159.95734
18.95000 190.53709
19.05000 151.39511
19.15000 160.80410
19.25000 156.90500
19.35000 144.47414
19.45000 149.19439
19.55000 158.25401
19.65000 135.93850
19.75000 145.97265
19.85000 170.99789
19.95000 157.43729
