0.2 -1.62228 16.37428 -1.16135 70.06777 70.4629 66.99062
0.6 -1.34574 38.77655 -0.47651 68.09797 69.01991 66.10091
1.0 -1.23905 59.35867 -0.58534 63.87954 65.43884 63.54324
1.4 -0.37464 78.37194 0.04489 61.32908 62.39364 59.95365
1.8 -0.49357 95.59671 -0.50675 59.50065 58.17059 56.91999
2.2 -0.20973 108.71291 -0.39363 56.91699 55.14443 55.56169
2.6 -0.17176 120.2809 -1.06284 54.97156 53.87938 52.25647
3.0 0.17524 131.76286 -1.05879 52.71686 50.87052 50.39821
3.4 0.74147 140.5757 -1.2741 51.22894 48.56105 48.60252
3.8 1.05335 148.3802 -0.99759 49.32833 46.60899 45.92046
4.2 1.17813 155.91516 -0.57348 47.42211 44.53758 44.27025
4.6 0.95734 162.75618 -0.1322 45.6848 42.10507 41.73773
5.0 0.42699 169.17544 -0.22163 44.40019 39.45388 40.51677
5.4 0.01961 174.42501 -0.09889 42.2504 37.43265 38.48205
5.8 -0.25128 179.32062 0.56951 41.16545 35.45928 36.827
6.2 -0.38423 183.92272 0.50593 39.65093 33.54266 35.16482
6.6 -0.75026 187.18981 0.3637 38.39506 31.84862 33.75708
7.0 -0.63885 189.77789 0.6851 37.19984 30.33423 32.34761
7.4 -0.88221 192.75294 0.62573 35.69197 29.0027 31.18459
7.8 -1.10184 195.79031 0.7481 34.37216 28.33675 29.92021
8.2 -0.47221 197.72986 1.14317 33.08225 27.18941 28.70807
8.6 -0.50953 199.81673 0.65588 32.06083 26.0034 27.97868
9.0 -0.83031 201.82263 0.74142 31.27905 25.23664 26.32653
9.4 -0.39036 203.39571 0.24419 30.16045 24.12442 25.17695
9.8 -0.61993 204.80759 0.38722 28.96837 23.33206 24.56648
10.2 -0.04927 205.9978 -0.11913 28.03436 22.35634 23.5487
10.6 -0.8126 206.66291 -0.22418 27.5026 21.714 22.68618
11.0 -0.7581 208.1799 -0.3228 26.73521 20.87014 21.70599
11.4 -0.79005 209.10252 -0.38075 25.48482 19.84714 20.85466
11.8 -0.52877 209.82582 -0.40948 24.72553 18.94024 20.15678
12.2 -0.77372 209.75893 -0.36699 24.01624 18.63038 19.5083
12.6 -0.57421 210.85583 -0.71321 22.79455 18.40434 18.24163
13.0 -0.12167 211.83748 -0.15792 22.5467 18.19895 17.92866
13.4 0.36536 212.95726 0.68204 21.79092 17.02072 17.36561
13.8 0.01276 212.60979 1.03423 20.92045 15.57338 16.13137
14.2 -0.25779 211.72649 1.03052 20.651 14.48449 16.0598
14.6 -0.65249 211.08275 0.74983 20.48163 14.97831 15.23159
15.0 -0.50324 212.07482 0.82873 19.75531 14.97259 15.14022
15.4 -0.50589 213.05399 0.80837 18.64156 14.78321 14.46179
15.8 0.03685 214.40216 1.39944 17.71084 13.58242 13.84433
16.2 0.76835 213.77423 1.05539 17.00025 12.83124 13.1722
16.6 0.93263 213.10671 1.1965 16.83055 12.28171 12.55819
17.0 0.644 212.07532 1.02297 16.68299 12.01078 12.30692
17.4 -0.72565 211.73596 1.61625 16.4513 11.71222 12.3589
17.8 -1.32657 211.07805 1.58753 16.46352 12.02797 12.29441
18.2 -0.66002 212.52162 2.02668 15.21033 11.74765 11.59326
18.6 0.123 212.86452 1.86462 14.50666 10.72608 11.00318
19.0 0.33905 212.72839 0.84493 13.92786 10.94199 10.93929
19.4 1.55371 213.07267 0.63289 12.87184 10.60888 9.93139
19.8 1.74849 213.2586 0.19081 12.63851 10.50111 10.16518
