0.12500 0.00906
0.37500 0.00724
0.62500 0.01762
0.87500 0.00277
1.12500 0.02409
1.37500 0.03763
1.62500 0.05030
1.87500 0.07692
2.12500 0.07397
2.37500 0.09643
2.62500 0.10028
2.87500 0.09434
3.12500 0.08837
3.37500 0.07538
3.62500 0.06151
3.87500 0.05052
4.12500 0.03294
4.37500 0.03600
4.62500 0.02912
4.87500 0.02983
5.12500 0.02318
5.37500 0.01756
5.62500 0.02175
5.87500 0.03290
6.12500 0.02469
6.37500 0.02147
6.62500 0.03246
6.87500 0.02725
7.12500 0.03639
7.37500 0.02802
7.62500 0.03010
7.87500 0.02064
8.12500 0.01220
8.37500 0.01172
8.62500 0.00862
8.87500 0.01569
9.12500 0.01549
9.37500 0.01505
9.62500 0.02182
9.87500 0.02058
10.12500 0.03523
10.37500 0.04121
10.62500 0.04830
10.87500 0.04038
11.12500 0.02522
11.37500 0.03645
11.62500 0.01771
11.87500 0.01882
12.12500 0.02228
12.37500 0.01554
12.62500 0.02518
12.87500 0.02201
13.12500 0.01824
13.37500 0.04709
13.62500 0.02900
13.87500 0.01522
14.12500 0.00957
14.37500 0.01343
14.62500 0.02262
14.87500 0.04246
