0.1875 -3.35426 11.79316 -1.16162 131.54309 131.39466 107.28019
0.5625 0.63853 31.03776 1.46569 132.46221 127.23922 101.0893
0.9375 0.62854 48.27895 -0.59854 130.78894 117.93165 94.46394
1.3125 1.17153 60.65324 -0.85193 128.31801 109.17493 88.27147
1.6875 -0.25112 69.44226 -0.25483 126.486 100.98557 82.50267
2.0625 0.15073 70.44122 0.25671 123.01101 93.56091 77.47068
2.4375 0.52886 74.03639 0.81669 121.15146 89.40881 73.28838
2.8125 0.15654 78.14544 0.29928 117.82462 84.67377 69.23421
3.1875 -1.43246 78.76789 -0.90679 116.52975 80.76365 65.47485
3.5625 -0.75486 81.81038 1.32668 113.35793 77.05966 62.39755
3.9375 -0.98508 83.37856 -0.06491 109.77249 74.40462 59.75061
4.3125 0.08417 87.66472 0.91235 106.97936 72.43648 56.76765
4.6875 -2.38109 91.7887 0.89295 105.44093 70.50744 54.90276
5.0625 -1.35495 94.89926 2.43454 99.90189 69.4028 52.25374
5.4375 0.99796 98.04776 1.67924 95.77962 67.79586 50.96294
5.8125 2.78814 104.05537 -0.65723 90.99193 68.38214 48.18823
6.1875 0.544 109.39157 0.43818 85.56677 68.60594 46.50359
6.5625 0.10734 116.83186 1.17155 79.47065 69.21719 44.5993
6.9375 0.45425 124.19392 0.78903 73.59293 69.02383 42.1927
7.3125 0.70782 133.42456 0.51918 67.18537 68.42908 40.6695
7.6875 -0.0017 143.28474 0.48867 61.14739 66.15699 38.30059
8.0625 -1.35079 151.56873 -0.33918 54.24948 63.73953 36.58324
8.4375 -1.227 161.27522 -0.22106 49.1971 59.04157 34.2662
8.8125 -1.10995 168.39497 -0.98279 43.41254 54.71457 31.96283
9.1875 -0.33358 174.85729 -0.8862 39.69896 48.61413 30.62194
9.5625 -0.57357 181.42953 -1.111 36.02791 43.0678 27.52246
9.9375 -2.01135 187.29947 -1.25233 33.05456 37.72491 25.84485
10.3125 -1.23474 191.39127 -1.22088 31.98622 32.18604 24.87525
10.6875 0.2934 195.10533 -1.0995 31.04626 26.27883 23.89235
11.0625 -0.31012 196.80078 -0.56266 30.42187 24.10829 23.02106
11.4375 -0.99756 197.11434 -0.52583 30.12341 22.97757 21.9852
11.8125 -0.17474 197.8745 -0.58744 28.54589 21.8469 21.29497
12.1875 0.27638 198.26076 -1.63459 27.71974 21.02587 20.70546
12.5625 0.99628 198.01481 -0.70865 27.06676 20.47485 20.18267
12.9375 1.04077 198.4597 -0.66648 27.79318 20.60522 18.89124
13.3125 1.76284 197.81109 0.16274 25.96687 19.20211 18.28698
13.6875 0.77228 198.68766 -0.1228 26.06071 19.31671 18.51124
14.0625 0.71329 197.68027 1.14257 24.45141 19.60414 17.46068
14.4375 1.72975 198.86435 0.69435 23.6286 18.23224 17.49143
14.8125 2.14647 198.68807 0.18813 23.56831 19.13949 16.41242
15.1875 0.9496 200.91579 0.92323 22.85566 18.66692 15.74755
15.5625 0.13918 200.96895 0.13805 22.81614 17.50782 15.74023
15.9375 -0.42729 202.50931 0.61927 21.69159 17.21733 15.26428
16.3125 -1.38249 201.96294 -0.33814 20.098 17.36784 14.56004
16.6875 -1.05314 203.9741 -1.80365 20.45621 16.48505 15.11279
17.0625 -0.64483 203.83461 -2.6217 19.42714 14.24128 14.29517
17.4375 1.11417 204.78275 -2.90075 20.1076 13.72287 15.21986
17.8125 1.05827 204.3372 -2.26321 18.67243 13.43981 14.78677
18.1875 0.44457 204.1218 -1.98013 18.06646 13.6113 15.71683
18.5625 0.46496 204.01307 -2.65736 18.80479 13.60834 14.36849
18.9375 0.23175 204.39527 -2.60305 18.35988 13.93119 15.92673
19.3125 1.37686 205.41455 -0.51143 17.04641 14.131 15.65291
19.6875 2.28877 203.58214 -1.73579 17.31903 13.54888 16.64949
20.0625 1.6821 205.53227 -0.62615 17.72681 14.90543 14.8781
20.4375 2.80528 205.53134 -2.63191 17.12874 14.39326 14.28579
20.8125 1.08322 206.01998 -1.78877 15.79131 13.80114 14.67047
21.1875 3.46773 208.68309 -2.23025 16.37053 11.27096 13.90807
21.5625 2.06433 207.11518 -1.30429 17.23407 11.18826 13.89555
21.9375 -0.43461 206.17208 -1.73953 16.44317 10.03225 13.71094
22.3125 0.47425 205.71573 -2.60003 16.4125 8.98915 11.99058
22.6875 -1.24618 204.15641 -1.16475 17.32062 8.87515 12.61956
23.0625 -0.7284 200.64146 -2.1489 15.70012 9.72205 12.78123
23.4375 1.26811 203.82341 -1.31191 16.00226 7.5338 11.83104
23.8125 -1.46076 200.14539 0.07753 15.50728 8.45574 13.05609
24.1875 -0.76728 198.78145 -1.3385 14.23805 8.32119 11.94321
24.5625 -0.6812 199.18018 1.0645 14.4596 10.19232 12.22876
24.9375 0.84095 199.19902 -3.03054 14.54544 10.47678 11.63363
25.3125 -0.92116 198.66782 -3.06718 11.8095 10.49237 12.09907
25.6875 -3.87645 201.72487 -0.9384 13.52402 9.90368 11.07059
26.0625 -1.42649 199.89609 -1.6467 14.43645 11.71515 9.18669
26.4375 2.34476 205.14421 -0.54917 11.77568 6.9931 10.7182
26.8125 1.69358 201.84386 -5.20638 12.87452 9.00539 10.84387
27.1875 1.51055 202.70409 -1.09844 13.1123 10.03469 11.18836
27.5625 1.36325 200.79713 1.1069 10.11037 8.49517 8.58652
27.9375 2.93491 204.70976 -5.69748 11.47613 5.66356 12.37185
28.3125 3.58292 202.15033 1.56637 11.59412 8.53521 8.27688
28.6875 -0.51892 200.26611 0.78594 12.0609 9.63162 8.42645
29.0625 2.78469 203.84663 1.11836 4.03406 3.61585 6.52426
29.4375 0.49859 200.45659 -1.21977 13.61358 10.90246 7.81603
29.8125 -3.31431 197.82635 -0.85627 9.77147 6.47452 8.88082
