0.05000 3695.64035
0.15000 3519.79185
0.25000 4359.23337
0.35000 5474.96334
0.45000 6326.50904
0.55000 6842.70107
0.65000 7534.96074
0.75000 7858.68868
0.85000 8030.77298
0.95000 8046.65258
1.05000 7924.74488
1.15000 8021.50681
1.25000 7883.75895
1.35000 7500.49034
1.45000 7488.71261
1.55000 7234.99181
1.65000 7060.83819
1.75000 6812.14595
1.85000 6526.32564
1.95000 6359.14548
2.05000 6125.13210
2.15000 5952.63773
2.25000 5707.93923
2.35000 5553.72311
2.45000 5355.85011
2.55000 5130.32795
2.65000 4963.89516
2.75000 4812.91837
2.85000 4653.61152
2.95000 4470.22268
3.05000 4333.93693
3.15000 4292.49919
3.25000 4101.61099
3.35000 4025.82809
3.45000 3926.31603
3.55000 3744.00655
3.65000 3702.61397
3.75000 3619.61874
3.85000 3488.98892
3.95000 3367.16402
4.05000 3315.93751
4.15000 3250.69950
4.25000 3114.45486
4.35000 3055.06407
4.45000 3055.70502
4.55000 2898.36612
4.65000 2874.68488
4.75000 2755.64406
4.85000 2687.52719
4.95000 2607.24236
5.05000 2570.56950
5.15000 2490.39417
5.25000 2364.41621
5.35000 2339.72926
5.45000 2250.87473
5.55000 2185.24963
5.65000 2108.10876
5.75000 2068.67080
5.85000 1985.30468
5.95000 1945.27841
6.05000 1880.95907
6.15000 1852.34925
6.25000 1805.03394
6.35000 1716.50843
6.45000 1643.20153
6.55000 1610.28333
6.65000 1566.21282
6.75000 1506.18931
6.85000 1494.47276
6.95000 1439.24894
7.05000 1377.80485
7.15000 1316.08685
7.25000 1286.25778
7.35000 1237.45558
7.45000 1231.20792
7.55000 1191.46602
7.65000 1167.78355
7.75000 1152.80114
7.85000 1119.81250
7.95000 1071.44918
8.05000 1064.98133
8.15000 1038.21664
8.25000 1005.68761
8.35000 1011.35207
8.45000 983.72835
8.55000 965.61626
8.65000 942.96486
8.75000 938.68605
8.85000 911.80236
8.95000 886.13777
9.05000 862.52150
9.15000 851.33878
9.25000 845.00835
9.35000 818.04661
9.45000 802.84117
9.55000 783.10134
9.65000 773.25580
9.75000 752.96611
9.85000 747.00136
9.95000 732.98722
10.05000 688.71276
10.15000 698.88416
10.25000 677.00165
10.35000 647.12105
10.45000 642.91547
10.55000 625.56266
10.65000 623.96669
10.75000 602.69317
10.85000 594.56782
10.95000 581.41630
11.05000 570.95535
11.15000 565.21674
11.25000 550.42575
11.35000 541.40914
11.45000 527.34445
11.55000 506.82657
11.65000 516.33630
11.75000 497.15950
11.85000 488.65825
11.95000 481.43536
12.05000 478.77935
12.15000 460.61032
12.25000 457.43039
12.35000 451.15822
12.45000 437.94058
12.55000 429.32787
12.65000 412.96460
12.75000 407.12314
12.85000 412.07388
12.95000 395.48673
13.05000 386.23535
13.15000 379.76520
13.25000 379.84697
13.35000 373.24299
13.45000 360.18403
13.55000 366.27842
13.65000 346.26139
13.75000 344.32603
13.85000 344.03452
13.95000 332.20210
14.05000 337.78243
14.15000 322.40315
14.25000 315.17012
14.35000 312.28780
14.45000 304.21283
14.55000 302.27246
14.65000 303.94675
14.75000 289.58027
14.85000 296.30037
14.95000 279.73709
15.05000 288.02114
15.15000 285.56882
15.25000 280.19003
15.35000 280.74513
15.45000 263.01006
15.55000 269.02349
15.65000 254.31004
15.75000 260.50178
15.85000 255.03444
15.95000 247.01753
16.05000 243.19553
16.15000 243.86763
16.25000 237.41507
16.35000 239.32883
16.45000 238.34820
16.55000 226.74073
16.65000 228.78308
16.75000 216.15345
16.85000 227.57360
16.95000 213.69666
17.05000 209.40530
17.15000 205.23379
17.25000 203.48277
17.35000 205.30760
17.45000 195.15955
17.55000 200.07180
17.65000 188.92712
17.75000 188.67036
17.85000 181.40337
17.95000 178.57373
18.05000 172.14594
18.15000 175.96923
18.25000 166.40134
18.35000 163.08270
18.45000 165.73570
18.55000 157.75418
18.65000 159.11314
18.75000 150.28502
18.85000 140.16131
18.95000 142.15881
19.05000 143.39004
19.15000 138.87666
19.25000 135.21537
19.35000 132.64823
19.45000 133.35370
19.55000 131.86512
19.65000 130.54620
19.75000 132.99652
19.85000 127.08044
19.95000 119.78248
