0.2 0.59988 19.71219 -0.78429 109.14416 107.89834 84.18297
0.6 1.08701 41.8826 -0.10129 108.96541 101.2982 81.85289
1.0 1.0576 64.41635 -0.03545 106.77799 92.46916 78.39367
1.4 -0.16972 78.65287 -0.13102 102.92708 85.41718 73.74478
1.8 -0.65265 88.24493 -0.00185 96.6731 79.61631 69.52067
2.2 1.1768 96.44274 0.90127 90.71949 75.43021 65.34252
2.6 0.76115 104.05545 -0.12941 85.49304 71.13911 61.15172
3.0 0.37481 111.02027 0.06961 78.52358 67.32689 58.05674
3.4 -0.05907 116.82466 -0.13962 71.96803 64.89034 54.59145
3.8 0.37017 124.80659 -0.51777 65.62346 61.63309 51.64601
4.2 -1.06344 132.92126 -0.82702 60.45922 60.01876 49.16905
4.6 -0.49706 145.82351 -0.03188 56.14961 56.77772 47.10003
5.0 -0.92006 159.40293 -0.38443 52.89945 54.27308 44.41225
5.4 -0.8541 171.67462 -0.8008 50.10936 49.22673 41.68059
5.8 -0.45325 180.26508 0.0695 48.90654 43.80057 38.75356
6.2 0.02315 184.40945 0.18851 47.56725 39.74339 35.74187
6.6 0.27906 186.00918 0.38718 46.56267 36.31245 33.12441
7.0 1.04785 186.59149 -0.1107 45.86626 34.66526 31.4234
7.4 -0.19531 186.67139 0.02971 45.02983 33.37482 29.22561
7.8 0.37238 187.02739 -0.12766 44.50582 32.41398 28.04118
8.2 0.05209 187.51158 -0.2008 43.86257 31.42893 26.80682
8.6 -0.38659 188.81246 0.09032 43.43263 30.81258 25.84652
9.0 0.45856 190.63895 0.07076 41.8403 30.91553 25.18984
9.4 0.69959 192.17815 -0.06684 40.50187 30.23705 24.07205
9.8 0.4537 193.72555 -0.00559 38.91146 29.70042 23.43269
10.2 -0.0025 194.70852 0.56831 37.55711 29.42948 22.24781
10.6 0.67721 195.34831 0.07339 35.83015 29.06835 21.67783
11.0 0.60155 196.5659 0.31115 34.41945 28.49101 21.24036
11.4 -0.00024 197.96023 0.40273 33.16947 28.55363 20.10026
11.8 0.16215 199.18161 0.54921 32.93675 27.65843 19.2584
12.2 0.17446 200.20667 0.93059 32.11984 26.319 18.61525
12.6 -0.08398 200.94017 0.69133 31.11161 24.76068 18.01668
13.0 -0.34256 201.79117 0.51502 30.38916 22.45672 17.53807
13.4 -0.40854 202.23917 0.14281 30.33225 21.12134 17.19435
13.8 -0.96165 201.81613 0.1204 28.40618 19.94709 16.46095
14.2 -1.1088 201.90646 -0.43705 27.28394 19.47779 15.89158
14.6 -1.40903 201.89488 -0.10528 25.96475 18.95029 15.42593
15.0 -1.06857 201.00249 -0.47881 25.05442 18.7244 14.97845
15.4 -0.22175 201.35594 -0.632 23.27739 18.54093 14.46007
15.8 -0.45957 202.00543 -0.33165 21.56625 18.35595 13.84629
16.2 -0.02415 202.48993 -0.47893 21.01375 17.96713 13.40095
16.6 0.55684 203.23124 -0.116 19.83503 17.6786 13.0274
17.0 -0.81788 203.62892 0.20195 19.03971 16.98241 12.2054
17.4 0.45295 204.48352 0.22275 18.10143 15.87618 11.49631
17.8 -0.84496 204.52255 0.03799 17.56632 15.96561 11.57162
18.2 -0.84736 205.54572 -0.04394 16.83794 14.73159 10.79071
18.6 -0.49557 206.41476 0.39809 15.91004 13.73731 10.84553
19.0 0.14446 206.63245 -0.12864 15.58739 13.3921 10.27483
19.4 -0.25711 207.31334 -0.64079 14.73002 12.76697 10.74576
19.8 -0.9575 207.73122 0.24922 14.03331 11.17716 10.38012
