0.12500 0.00910
0.37500 0.04766
0.62500 0.12716
0.87500 0.19983
1.12500 0.27526
1.37500 0.33194
1.62500 0.38716
1.87500 0.42939
2.12500 0.46873
2.37500 0.50386
2.62500 0.53815
2.87500 0.55788
3.12500 0.58772
3.37500 0.60875
3.62500 0.62237
3.87500 0.63335
4.12500 0.64109
4.37500 0.63369
4.62500 0.62491
4.87500 0.62813
5.12500 0.59831
5.37500 0.56146
5.62500 0.52680
5.87500 0.48387
6.12500 0.44372
6.37500 0.41922
6.62500 0.39430
6.87500 0.37085
7.12500 0.36861
7.37500 0.36979
7.62500 0.36900
7.87500 0.36608
8.12500 0.36986
8.37500 0.36447
8.62500 0.33640
8.87500 0.31886
9.12500 0.28992
9.37500 0.22777
9.62500 0.20493
9.87500 0.15865
10.12500 0.14265
10.37500 0.12334
10.62500 0.10351
10.87500 0.08513
11.12500 0.07925
11.37500 0.07012
11.62500 0.04671
11.87500 0.07863
12.12500 0.03871
12.37500 0.04808
12.62500 0.02889
12.87500 0.05084
13.12500 0.03527
13.37500 0.04638
13.62500 0.05592
13.87500 0.06421
14.12500 0.05303
14.37500 0.06250
14.62500 0.07802
14.87500 0.06468
