0.12500 0.01152
0.37500 0.04638
0.62500 0.10789
0.87500 0.15633
1.12500 0.22068
1.37500 0.25191
1.62500 0.28255
1.87500 0.30541
2.12500 0.31577
2.37500 0.34826
2.62500 0.37428
2.87500 0.40320
3.12500 0.44343
3.37500 0.45344
3.62500 0.47544
3.87500 0.48099
4.12500 0.46865
4.37500 0.46189
4.62500 0.42590
4.87500 0.40663
5.12500 0.39928
5.37500 0.38943
5.62500 0.36299
5.87500 0.35411
6.12500 0.34675
6.37500 0.33294
6.62500 0.31737
6.87500 0.28720
7.12500 0.25461
7.37500 0.23405
7.62500 0.20960
7.87500 0.18396
8.12500 0.16077
8.37500 0.14160
8.62500 0.10842
8.87500 0.10433
9.12500 0.08646
9.37500 0.09052
9.62500 0.06766
9.87500 0.08705
10.12500 0.09814
10.37500 0.09091
10.62500 0.11181
10.87500 0.08106
11.12500 0.09239
11.37500 0.08618
11.62500 0.09493
11.87500 0.09032
12.12500 0.10257
12.37500 0.09174
12.62500 0.08447
12.87500 0.07882
13.12500 0.06574
13.37500 0.07082
13.62500 0.05497
13.87500 0.07892
14.12500 0.09252
14.37500 0.09968
14.62500 0.09434
14.87500 0.12039
