0.2 0.07363 23.47307 0.0983 87.00193 86.17328 68.24439
0.6 0.10491 49.58382 0.02756 85.00919 81.16142 65.86849
1.0 0.04315 71.63988 0.36284 85.13694 76.43622 62.59452
1.4 -0.24333 84.3343 -0.28343 84.76661 71.94797 59.54752
1.8 0.33386 95.2236 0.88878 82.93304 68.29349 56.44252
2.2 1.35131 104.82877 0.34788 79.86682 63.86421 53.69201
2.6 0.03007 112.59213 0.5907 76.11404 61.19876 51.49367
3.0 0.7607 121.53056 -0.14293 71.3543 57.76058 49.08421
3.4 0.60591 130.07036 0.13045 66.40431 55.27048 46.87849
3.8 0.14699 140.53956 0.20368 61.19633 51.43939 44.81689
4.2 -0.046 150.29972 0.542 55.296 47.22648 42.45259
4.6 -0.27298 158.91211 0.17828 50.28581 43.70184 40.21119
5.0 0.30725 166.85461 0.56438 45.69261 39.81169 37.72833
5.4 -0.0592 174.06113 0.62675 42.36388 35.92531 35.0385
5.8 -0.19245 179.96928 0.46079 39.35006 33.24962 33.12729
6.2 -0.08027 184.621 0.41156 37.53228 30.92388 31.49896
6.6 -0.06335 188.27929 0.06 35.63176 29.245 29.99118
7.0 0.44002 190.74139 -0.22402 34.13248 28.10336 28.24204
7.4 0.02828 193.07491 -0.15739 32.87641 26.73973 27.22513
7.8 0.62113 195.41448 -0.69056 31.4765 25.50521 26.08899
8.2 0.43042 197.568 -0.91235 30.01544 24.06873 24.64452
8.6 0.81993 198.89291 -0.80818 29.08982 23.00566 23.45082
9.0 1.14371 200.84511 -0.66245 27.49927 22.24254 22.22542
9.4 1.26385 202.20045 -0.6627 26.55908 21.4092 21.26724
9.8 0.8003 203.60291 -0.79484 25.41787 20.26036 20.45394
10.2 0.70229 204.4753 -0.48289 24.53143 19.49948 19.62224
10.6 0.56632 205.79807 -0.31428 23.27022 18.74885 18.79503
11.0 0.8316 206.60457 0.09523 22.65015 18.00187 18.36415
11.4 0.88311 207.41391 0.39988 22.21189 16.63825 17.68054
11.8 0.50062 207.75649 0.11551 21.73666 15.80778 16.90078
12.2 0.21303 207.14518 -0.16195 21.3799 15.46064 16.51141
12.6 -0.02586 206.92662 -0.4202 20.56226 15.17367 15.84868
13.0 0.16323 207.0525 -0.57061 19.70791 15.25961 15.08358
13.4 -0.41343 207.55518 -0.82597 18.7765 14.8634 14.5155
13.8 -0.32299 208.03599 -1.20359 17.42722 14.41786 13.32747
14.2 0.11166 208.69038 -1.45069 17.22622 13.7294 13.27988
14.6 0.11631 208.66444 -1.34768 16.72582 13.1073 12.5698
15.0 -0.11405 209.26209 -1.5094 16.26089 12.57806 12.22992
15.4 0.04427 209.6619 -1.40931 15.87305 11.25531 11.82333
15.8 0.38377 209.69516 -0.37779 15.02017 11.12599 11.35514
16.2 0.21744 210.10543 0.07712 14.12442 11.18734 11.22703
16.6 0.60749 210.13631 0.24401 13.79484 10.63875 10.84082
17.0 0.4024 209.60605 0.42802 13.70783 9.76206 10.70916
17.4 0.46253 208.60544 0.62165 13.79755 9.77947 10.45649
17.8 0.25312 209.13673 0.09822 13.541 9.70876 10.14574
18.2 0.18979 209.63772 0.23404 12.79055 9.44798 9.27602
18.6 0.53212 209.81657 0.14854 12.22637 9.0601 8.98889
19.0 1.04686 209.07059 -0.0521 11.27366 8.09361 8.34452
19.4 0.55797 207.83453 0.02887 11.9766 7.88722 8.42638
19.8 0.10394 207.265 -0.75919 11.31796 7.98767 8.01902
