0.2 0.20749 12.44134 -1.06753 143.68365 142.66319 128.18337
0.6 -1.56443 35.2681 0.09739 139.06913 128.52491 114.27574
1.0 -1.41395 54.81122 -0.14213 133.9427 114.39116 101.24484
1.4 -1.57017 65.22142 0.44881 129.75012 102.26004 91.30682
1.8 -0.19931 75.36848 -0.5168 125.07178 97.55819 83.87983
2.2 -0.81044 80.07008 0.54951 122.22321 92.49509 78.04541
2.6 -0.89636 84.46038 -0.11328 117.42539 87.28781 74.16086
3.0 -1.79282 89.81873 1.79318 112.57267 82.95417 69.71347
3.4 -1.4693 92.05076 -0.61323 107.37389 80.19111 67.08167
3.8 -1.56043 96.3468 1.24331 102.89981 77.0821 63.40436
4.2 0.16071 102.25044 -0.87665 98.39488 75.00255 59.59095
4.6 -1.82676 107.8114 -0.75615 92.28704 73.65804 56.66051
5.0 -0.98971 112.77767 -0.38912 87.41542 72.47643 54.47766
5.4 -1.77943 123.60733 0.63833 81.80097 70.84236 52.03714
5.8 -1.33039 133.37283 0.34739 75.45386 68.6181 50.08326
6.2 -2.18513 143.20306 0.23396 69.15623 64.80174 45.81805
6.6 -2.8972 153.38903 0.61253 61.76331 62.30875 43.25034
7.0 -2.5254 160.4418 -0.47519 55.74964 58.51649 39.81135
7.4 -1.53659 168.28645 -0.96311 49.19145 53.67984 37.19758
7.8 -0.88951 174.84778 -0.95994 43.69432 49.30789 33.46599
8.2 -1.1417 182.36903 -0.38438 39.89517 43.13607 30.03138
8.6 -0.78647 188.39369 -0.66725 36.09619 38.32772 28.18236
9.0 -1.51192 193.44527 -0.57952 34.72654 32.60552 26.73093
9.4 -0.41482 196.12475 -1.40024 33.26927 30.00292 25.67988
9.8 -2.13398 199.00445 0.63347 32.96539 26.64455 24.56455
10.2 -0.9251 200.6312 -0.09265 31.33708 24.77187 23.88427
10.6 -1.38814 201.31939 -0.29069 31.00484 23.90168 22.38491
11.0 -1.94436 201.9431 0.67334 29.50471 23.20498 21.75407
11.4 -0.42212 203.05701 0.04126 28.96067 21.88247 20.84822
11.8 -1.14278 203.00532 0.83808 28.3297 20.20368 20.06131
12.2 -1.03716 203.34012 0.90548 27.17557 20.73094 19.24627
12.6 0.02206 202.41715 1.46527 27.6684 19.66279 19.19903
13.0 0.15218 204.07414 -0.01042 25.44484 19.04651 17.84909
13.4 1.0528 202.40592 -0.56262 25.33597 18.85145 17.51042
13.8 0.26821 204.13194 0.10699 24.94586 18.98932 17.20365
14.2 -0.19504 204.38911 0.26129 24.06972 19.1627 17.16378
14.6 0.87555 204.60848 -0.02429 22.89544 19.00509 16.55065
15.0 1.63832 204.18987 -0.14384 22.83557 18.1706 16.32914
15.4 2.07586 204.01542 0.93874 22.0178 18.61177 16.52032
15.8 0.70133 205.55289 1.01432 21.64162 18.12717 15.8662
16.2 -0.79458 206.64646 0.72067 21.33661 17.58395 15.82534
16.6 -0.03234 208.86436 0.98568 23.01407 17.45628 14.56967
17.0 -0.86783 208.57849 -0.19376 22.24592 16.58019 14.21621
17.4 -2.23764 208.89002 -0.33356 21.20709 15.24341 14.72548
17.8 -0.53593 209.22282 0.42863 20.13861 13.83219 13.633
18.2 -2.61099 207.96987 -0.84001 21.21834 12.45728 13.48012
18.6 -0.6786 207.66009 -1.12948 20.69125 10.3771 13.35764
19.0 -1.08132 204.81295 -0.27514 19.73364 11.50674 13.82724
19.4 -1.53394 203.83575 -0.52986 18.53589 10.19932 13.02972
19.8 -2.46972 201.28768 -1.15535 19.93529 10.51437 12.03086
