0.12500 0.03647
0.37500 0.03033
0.62500 0.09357
0.87500 0.15901
1.12500 0.21267
1.37500 0.26012
1.62500 0.29740
1.87500 0.34432
2.12500 0.36217
2.37500 0.38452
2.62500 0.40708
2.87500 0.41916
3.12500 0.46061
3.37500 0.47753
3.62500 0.49699
3.87500 0.52044
4.12500 0.53024
4.37500 0.54627
4.62500 0.56904
4.87500 0.58136
5.12500 0.58516
5.37500 0.59344
5.62500 0.57851
5.87500 0.57046
6.12500 0.52951
6.37500 0.48807
6.62500 0.42678
6.87500 0.34891
7.12500 0.30823
7.37500 0.26035
7.62500 0.22298
7.87500 0.19168
8.12500 0.17617
8.37500 0.16028
8.62500 0.17981
8.87500 0.15923
9.12500 0.13634
9.37500 0.13321
9.62500 0.10577
9.87500 0.08442
10.12500 0.06581
10.37500 0.04923
10.62500 0.05494
10.87500 0.08220
11.12500 0.06701
11.37500 0.06974
11.62500 0.06440
11.87500 0.05402
12.12500 0.05527
12.37500 0.06156
12.62500 0.05876
12.87500 0.06347
13.12500 0.04998
13.37500 0.01595
13.62500 0.01630
13.87500 0.04372
14.12500 0.04184
14.37500 0.05854
14.62500 0.07427
14.87500 0.07845
