0.05000 -2964.14668 2513.45632 -1563.43995 309.73085 10.62933 347.62622
0.15000 91.82518 -1708.63747 -1354.46474 2342.81653 2582.77057 662.09546
0.25000 15.12454 -730.24250 -1648.14761 2382.71694 2856.59857 759.20809
0.35000 -295.02439 -38.90913 -1515.69853 2606.77002 2789.12573 820.46230
0.45000 -248.93435 231.26298 -1378.52448 2584.07005 2771.70680 894.75686
0.55000 -311.21722 -20.62923 -1476.67146 2520.68717 2917.82429 1196.36068
0.65000 -451.86708 -227.72139 -1279.22179 2573.11375 2630.09877 1252.66413
0.75000 -437.36209 -135.67939 -1310.77060 2521.46430 2637.12686 1696.34902
0.85000 -534.67111 109.83331 -1136.14167 2351.00276 2663.46993 1668.51833
0.95000 -695.47594 79.71857 -1106.43631 2277.24530 2617.68587 1827.29520
1.05000 -980.44113 -154.13799 -873.19542 2102.32641 2620.87189 2091.60701
1.15000 -1359.40722 -96.12450 -718.30979 1821.10832 2530.30837 2255.89302
1.25000 -1813.68008 65.05740 -689.93102 1641.42533 2369.44899 2311.93831
1.35000 -2080.89873 95.90198 -646.56355 1457.87147 2266.03009 2332.88746
1.45000 -2198.87589 4.00473 -326.03400 1504.02003 2186.31099 2396.11505
1.55000 -2422.65123 -57.30623 -456.09449 1452.44534 2090.49286 2388.07090
1.65000 -2471.70665 57.89098 -518.79442 1383.38862 1915.10909 2447.81752
1.75000 -2614.24652 23.64701 -342.17768 1365.49185 1823.55136 2415.23768
1.85000 -2640.61047 -69.46464 -460.63057 1294.66572 1733.50219 2450.89777
1.95000 -2768.27938 -9.62241 -398.36261 1269.57377 1680.27102 2418.31209
2.05000 -2783.02920 21.76151 -243.86878 1261.19263 1561.43011 2504.68891
2.15000 -2941.40820 47.61422 -121.62318 1225.06407 1497.72913 2420.98403
2.25000 -2920.50238 -22.69911 -294.40008 1229.30803 1446.53039 2447.19326
2.35000 -2933.65639 -34.99985 -173.17384 1220.93546 1364.90059 2485.47528
2.45000 -3006.02664 65.98962 -144.45172 1153.74353 1359.34648 2419.73905
2.55000 -3016.40855 48.41213 -71.01631 1191.42479 1304.68431 2450.38821
2.65000 -2954.56850 -27.66243 -205.13824 1140.95213 1217.50512 2502.94481
2.75000 -3015.30916 45.07263 -97.28547 1133.37233 1179.05599 2436.22427
2.85000 -2985.46920 5.63577 -171.75448 1179.76133 1137.28967 2423.93391
2.95000 -3018.88939 0.39026 -235.69264 1114.08318 1081.50014 2388.63757
3.05000 -3013.17261 -26.70009 -225.74751 1126.07538 1087.20949 2399.75976
3.15000 -3038.26005 10.24859 -96.70890 1085.43220 1035.13681 2404.87082
3.25000 -3001.17194 -8.34602 -225.91827 1100.44811 977.19500 2392.95289
3.35000 -3022.55003 -30.95508 -64.11010 1053.61258 959.93741 2376.42190
3.45000 -3035.16356 7.41747 -85.95551 1036.67459 946.81086 2347.05553
3.55000 -3056.13630 -39.40412 -112.03109 1050.50896 900.53647 2326.76656
3.65000 -3010.89732 -0.59352 -56.42386 1005.51611 884.75046 2363.00113
3.75000 -3018.56388 12.41488 -147.23486 1034.51349 885.34080 2343.90709
3.85000 -3016.87032 28.26755 -112.97836 1000.87461 813.64937 2341.27460
3.95000 -3013.74940 -16.89815 -158.62239 1013.64286 822.17623 2305.18214
4.05000 -3001.93901 11.34865 -5.34157 1012.71866 818.02252 2325.25894
4.15000 -3008.97767 4.68024 -2.13298 1015.99830 748.95088 2311.31661
4.25000 -3014.68439 11.38553 -37.01066 996.76658 781.47489 2295.77247
4.35000 -2984.67883 1.30524 -122.45012 974.26775 740.21995 2299.23861
4.45000 -3006.17381 -4.51495 -2.20370 973.25775 709.95307 2258.76154
4.55000 -2962.55718 -17.26362 -101.32299 957.02225 716.20657 2275.83138
4.65000 -2969.99822 -7.83135 -60.13592 931.95452 674.52711 2235.19626
4.75000 -2932.41624 -0.77635 -108.71784 974.33706 664.45510 2257.72587
4.85000 -2961.76349 31.60381 -19.40898 936.57102 647.56568 2201.25201
4.95000 -2943.02549 -16.03546 -105.72776 924.04050 665.01155 2204.60289
5.05000 -2900.60675 -4.74767 -100.60328 909.65594 608.70262 2228.51256
5.15000 -2922.86803 0.76614 61.17289 894.75226 604.16021 2177.86926
5.25000 -2906.31101 13.44144 65.20438 925.99841 578.30180 2172.11668
5.35000 -2883.82254 -8.24169 43.68789 923.39177 583.53733 2181.34071
5.45000 -2874.63039 4.87596 -93.54004 929.15026 597.92212 2165.45145
5.55000 -2826.01983 7.69970 -31.01051 910.80896 584.02464 2183.73397
5.65000 -2864.90193 6.89079 10.62568 882.11885 527.51940 2128.88432
5.75000 -2837.98421 2.42088 -62.59503 855.27813 530.48261 2133.78131
5.85000 -2836.54265 3.31710 -7.73187 867.01221 507.29669 2113.06103
5.95000 -2803.88805 8.24708 -24.86060 875.97381 503.18130 2116.17503
6.05000 -2800.65889 9.22429 5.84121 880.47175 504.94164 2089.64141
6.15000 -2788.58354 8.71286 10.40747 860.33611 476.34206 2085.68881
6.25000 -2741.77491 -21.59698 -29.15887 881.60684 500.27817 2100.79143
6.35000 -2747.20323 -0.13095 43.00575 871.15785 482.68243 2080.54435
6.45000 -2701.90850 5.56685 -1.20784 858.34480 465.67084 2127.42541
6.55000 -2724.01639 1.80905 -0.38825 822.62900 444.73361 2073.36750
6.65000 -2712.14929 1.48404 10.41154 880.92826 433.12922 2065.84778
6.75000 -2704.17329 -2.51353 -27.24398 822.68317 465.32427 2032.23980
6.85000 -2679.99284 11.75446 -29.89582 826.61770 426.69057 2034.22828
6.95000 -2651.50018 -5.42274 -25.76903 812.49369 414.81918 2043.05337
7.05000 -2701.88926 -1.34593 11.62417 787.07032 401.18348 1976.07158
7.15000 -2612.42721 16.93810 6.71980 842.31571 393.57777 2034.24338
7.25000 -2655.12235 -4.24633 -8.66770 779.24746 391.42688 1960.08375
7.35000 -2621.31937 -8.12058 6.45133 798.52607 382.07499 1976.32325
7.45000 -2613.65004 3.63504 -59.20272 795.21768 376.15055 1977.67111
7.55000 -2621.63446 -10.43049 -34.61911 784.06362 387.29462 1926.01287
7.65000 -2598.47108 8.32009 33.13840 779.70140 388.84010 1943.59334
7.75000 -2555.84949 -2.10394 -3.64230 774.57870 352.42566 1954.86008
7.85000 -2591.12722 -1.78016 -16.18261 775.23583 386.75952 1887.04790
7.95000 -2552.57554 -7.80434 -5.78251 779.36843 402.21743 1907.52200
8.05000 -2538.85469 -0.39733 -5.06181 772.06570 371.16234 1901.87364
8.15000 -2540.23935 -7.38733 -28.59119 757.79385 359.89724 1878.48201
8.25000 -2525.18267 -1.05167 -82.71377 747.27294 324.98790 1856.94715
8.35000 -2494.13951 1.74183 36.22978 747.20448 323.00088 1879.15291
8.45000 -2488.49096 7.94811 -24.05214 750.10418 367.54606 1859.85847
8.55000 -2465.34260 -11.04256 -42.13949 784.76815 344.18875 1850.36387
8.65000 -2489.33313 1.90573 -16.67214 747.06330 326.66047 1802.23727
8.75000 -2444.53686 10.02594 -13.54549 733.64667 301.63263 1830.81563
8.85000 -2423.38174 -0.26782 -40.32647 739.17718 300.67362 1823.66813
8.95000 -2423.65407 2.74861 44.90426 736.54617 308.23737 1806.51571
9.05000 -2421.25989 -7.23380 29.44775 708.01164 284.43717 1785.54535
9.15000 -2414.42579 -3.14129 -30.38689 699.51845 306.82930 1772.92741
9.25000 -2411.91394 5.75732 49.00811 700.07290 289.48215 1761.63269
9.35000 -2352.48029 -12.60856 73.11416 727.67804 280.77432 1792.82927
9.45000 -2364.36786 8.00880 38.06348 713.17611 323.46179 1760.34667
9.55000 -2356.98649 1.42903 -10.47778 713.87145 285.84429 1746.66451
9.65000 -2329.34455 -1.22455 35.80372 704.56204 300.49879 1748.49231
9.75000 -2316.98025 -0.27462 -5.52358 704.11865 257.44369 1749.15003
9.85000 -2321.47505 1.79132 12.02741 665.57912 262.19774 1717.69479
9.95000 -2304.29477 2.36069 38.09113 678.93003 268.16493 1718.51827
10.05000 -2323.83516 0.58328 -12.46100 670.97472 284.80697 1658.62677
10.15000 -2283.84444 5.44599 -43.74065 686.77660 235.92928 1683.68950
10.25000 -2274.19303 4.18531 -45.67493 653.42087 230.75627 1680.03680
10.35000 -2279.34688 -2.14422 -35.41773 663.67704 255.70176 1648.36393
10.45000 -2243.33657 -1.33814 41.29916 656.19942 246.80617 1671.53402
10.55000 -2215.68804 2.26413 -12.29545 669.21096 230.50645 1678.54833
10.65000 -2229.44935 1.53340 37.01886 651.37727 222.22875 1634.66668
10.75000 -2225.17345 -4.25963 20.00480 632.08414 229.46852 1626.06209
10.85000 -2203.01103 -0.54767 53.86423 632.30346 225.92489 1632.02113
10.95000 -2186.71273 -1.98634 6.30301 644.54680 226.32352 1627.05558
11.05000 -2186.87770 -2.35634 -16.07432 644.47840 220.84058 1600.40869
11.15000 -2156.09926 -2.02465 37.74402 644.61835 215.61137 1612.65704
11.25000 -2158.97186 0.23200 48.58397 617.90181 202.66720 1586.18444
11.35000 -2156.97869 -0.86536 57.10791 648.12562 213.43984 1572.90505
11.45000 -2132.04122 0.59117 35.91344 647.10048 223.19292 1576.29074
11.55000 -2107.75290 -5.07445 29.25186 648.27363 210.09985 1580.93050
11.65000 -2103.78492 -2.83718 -49.43452 625.73204 221.63721 1572.33394
11.75000 -2112.90584 4.59355 25.72188 612.04775 206.34698 1541.39784
11.85000 -2095.37394 -1.99756 29.49114 617.17109 201.61410 1551.47680
11.95000 -2093.55179 -1.30935 46.21976 609.35942 186.30440 1524.61245
12.05000 -2078.90355 -0.04376 -12.35110 617.78302 216.60917 1521.85324
12.15000 -2051.06348 -0.55727 47.51520 621.40418 187.34758 1529.82466
12.25000 -2049.52667 2.54672 64.63325 620.03152 199.62998 1518.45049
12.35000 -2033.95859 3.67551 -21.65499 600.15501 181.03960 1513.09158
12.45000 -2026.14475 -1.12256 32.05020 591.94847 172.52176 1500.13470
12.55000 -2025.45182 2.38904 -12.05547 593.11086 172.90955 1478.26949
12.65000 -2000.61775 -5.73527 25.77355 596.69750 172.70865 1504.62675
12.75000 -2008.93916 -0.12432 3.28773 585.69928 181.56206 1464.44940
12.85000 -2013.66055 -3.63580 29.32953 571.89350 195.97384 1444.45216
12.95000 -1973.55003 -0.02846 5.13375 583.96299 223.59879 1465.89857
13.05000 -1979.33917 0.60669 11.45291 569.25835 196.14932 1451.10326
13.15000 -1943.60474 -3.29749 55.60921 602.59703 175.78620 1459.50045
13.25000 -1964.35004 -1.86969 -8.08849 586.55020 185.07866 1427.53543
13.35000 -1941.45506 -0.24396 9.35578 573.15032 154.70403 1435.74155
13.45000 -1914.75866 -2.45565 -10.90463 585.93516 166.75394 1446.80032
13.55000 -1927.23506 5.27161 42.97536 556.11980 152.15685 1422.39714
13.65000 -1914.50664 3.79592 57.32466 557.71253 153.42949 1418.21676
13.75000 -1901.42965 0.63881 -18.81814 546.96432 189.29573 1411.14011
13.85000 -1876.76294 1.00293 80.65476 574.53769 209.07879 1426.99530
13.95000 -1885.65231 -4.57852 39.01657 564.90499 171.63415 1397.72085
14.05000 -1892.32249 0.16906 29.59711 534.90998 140.45447 1370.68219
14.15000 -1858.88990 3.29618 19.85208 543.12997 147.00371 1394.06669
14.25000 -1854.28736 -0.87549 28.14231 540.51783 146.58852 1375.76858
14.35000 -1869.61387 -0.03378 22.96180 521.98170 147.90877 1348.60939
14.45000 -1823.24506 1.23356 17.98004 539.74496 136.87592 1379.45215
14.55000 -1819.39297 2.43934 41.77715 540.61875 173.87648 1368.37068
14.65000 -1830.88785 -2.28081 55.21288 544.45844 166.31312 1340.75159
14.75000 -1803.18631 -5.93023 -2.89438 541.34344 160.53124 1357.28914
14.85000 -1823.03227 0.98511 40.89900 521.59960 171.54754 1321.38238
14.95000 -1798.25339 4.31696 13.18121 520.25021 127.04869 1327.66497
15.05000 -1794.57359 -2.45212 18.59182 509.03992 129.52332 1320.43779
15.15000 -1780.25232 -1.07760 52.65805 516.90060 132.13891 1316.88506
15.25000 -1756.76729 1.74082 50.79265 540.09547 158.76244 1325.19737
15.35000 -1761.53246 -0.29102 10.44161 533.74950 165.24204 1307.37318
15.45000 -1757.20856 -2.95334 39.59837 525.52606 189.22787 1300.25554
15.55000 -1751.75474 0.96127 18.60434 516.41104 125.96702 1286.21840
15.65000 -1750.61340 -1.05869 18.98047 495.69725 126.49126 1274.75094
15.75000 -1723.20763 1.40916 14.22971 530.05520 202.34593 1291.65059
15.85000 -1715.83553 -0.28418 54.24331 506.04747 131.54790 1279.79742
15.95000 -1721.40746 -1.46316 -1.62249 492.90135 125.72203 1262.14837
16.05000 -1708.68016 2.97396 23.47627 499.68750 128.60271 1260.74111
16.15000 -1692.43392 -1.03186 -4.64673 509.56237 114.93527 1261.26356
16.25000 -1682.36898 3.77703 11.72307 502.86457 127.99133 1268.13274
16.35000 -1675.95133 1.21639 44.31198 507.17230 115.78357 1250.76918
16.45000 -1691.81515 -3.62622 36.53075 469.71829 124.85785 1227.59782
16.55000 -1673.51244 2.80246 -29.39661 489.99448 137.11911 1227.14353
16.65000 -1655.30718 -0.12020 39.08131 506.81153 116.03152 1239.39958
16.75000 -1663.35446 1.46877 13.99207 470.38960 140.40238 1211.58052
16.85000 -1662.22195 2.02547 -3.44916 472.38560 114.94189 1199.74077
16.95000 -1648.44569 1.26244 35.89306 473.04966 106.29364 1203.46953
17.05000 -1646.68519 -0.41110 41.15545 473.70392 146.38675 1199.41034
17.15000 -1623.05217 0.06712 4.67281 468.31174 109.12175 1205.52471
17.25000 -1615.79580 -1.14403 33.95849 470.23699 114.11868 1196.25784
17.35000 -1623.29418 -2.84782 -5.65150 483.47671 120.12251 1174.50904
17.45000 -1585.10823 2.58569 -6.73404 475.83762 163.36451 1209.93855
17.55000 -1592.59024 3.11459 -28.54890 471.38295 102.66182 1177.40208
17.65000 -1597.89639 -2.44734 20.39784 453.19438 98.92019 1163.96581
17.75000 -1583.16087 -2.38809 -0.75323 469.37683 99.57986 1165.02959
17.85000 -1580.10608 -0.88103 21.63823 464.35334 102.40604 1153.32985
17.95000 -1562.89363 0.03554 46.76358 465.38153 104.60373 1163.41585
18.05000 -1544.89475 -1.11492 22.37109 461.93644 101.75430 1172.81445
18.15000 -1564.66368 -2.37963 -27.40258 443.61025 107.43150 1138.83452
18.25000 -1551.75982 -1.01221 -7.41900 446.13789 99.58279 1141.09139
18.35000 -1540.81144 -0.55825 37.89725 459.11233 220.25828 1138.36265
18.45000 -1522.09124 -1.05108 39.72780 454.08494 92.06345 1147.37812
18.55000 -1519.75999 1.06474 34.66140 444.24003 89.62829 1138.09631
18.65000 -1515.17291 1.65302 30.55069 445.06580 90.70568 1128.20380
18.75000 -1506.87669 -4.93183 34.27230 452.09017 131.22882 1128.54506
18.85000 -1522.03041 0.30467 2.43480 426.15538 108.79214 1103.85197
18.95000 -1500.85417 0.94513 -11.41350 432.28329 101.91285 1115.23481
19.05000 -1480.87076 -0.74348 -2.83248 443.71332 97.79258 1119.21295
19.15000 -1500.58611 0.43555 46.71196 431.14920 93.71139 1083.07120
19.25000 -1485.64583 0.33761 5.42210 432.54562 137.95598 1088.17851
19.35000 -1473.84496 0.46807 27.17280 421.27879 84.71597 1094.89201
19.45000 -1462.40155 0.36092 33.67951 430.77303 81.79129 1089.46651
19.55000 -1460.42030 -1.19479 17.11032 430.17670 89.71826 1082.83903
19.65000 -1439.74917 1.19406 -2.74470 435.84317 79.69147 1091.61426
19.75000 -1454.57337 -2.75136 4.06915 417.44873 108.44552 1064.86892
19.85000 -1462.69184 0.20871 16.49583 400.38901 80.01628 1048.64356
19.95000 -1436.55917 -0.50512 30.55270 430.68046 83.34990 1061.78800
