0.10101 0.05265 0.05488
0.30303 0.04927 0.04197
0.50505 0.04613 0.03704
0.70707 0.04385 0.03096
0.90909 0.04148 0.02634
1.11111 0.03805 0.02153
1.31313 0.03658 0.01802
1.51515 0.03471 0.01529
1.71717 0.03331 0.01307
1.91919 0.03157 0.01105
2.12121 0.02984 0.00963
2.32323 0.02813 0.00821
2.52525 0.02662 0.00715
2.72727 0.02512 0.00623
2.92929 0.02401 0.00557
3.13131 0.02264 0.00494
3.33333 0.02127 0.00431
3.53535 0.02010 0.00389
3.73737 0.01906 0.00345
3.93939 0.01813 0.00311
4.14141 0.01712 0.00281
4.34343 0.01611 0.00249
4.54545 0.01548 0.00232
4.74747 0.01474 0.00209
4.94949 0.01412 0.00192
5.15152 0.01350 0.00175
5.35354 0.01283 0.00163
5.55556 0.01219 0.00149
5.75758 0.01132 0.00134
5.95960 0.01052 0.00119
6.16162 0.00991 0.00108
6.36364 0.00946 0.00100
6.56566 0.00894 0.00092
6.76768 0.00857 0.00085
6.96970 0.00814 0.00079
7.17172 0.00768 0.00072
7.37374 0.00717 0.00066
7.57576 0.00672 0.00060
7.77778 0.00630 0.00055
7.97980 0.00592 0.00050
8.18182 0.00576 0.00047
8.38384 0.00566 0.00045
8.58586 0.00561 0.00044
8.78788 0.00541 0.00041
8.98990 0.00529 0.00040
9.19192 0.00511 0.00037
9.39394 0.00479 0.00034
9.59596 0.00442 0.00031
9.79798 0.00412 0.00028
10.00000 0.00381 0.00026
10.20202 0.00336 0.00022
10.40404 0.00316 0.00020
10.60606 0.00291 0.00019
10.80808 0.00263 0.00017
11.01010 0.00261 0.00016
11.21212 0.00239 0.00014
11.41414 0.00223 0.00013
11.61616 0.00226 0.00013
11.81818 0.00224 0.00013
12.02020 0.00226 0.00013
12.22222 0.00225 0.00012
12.42424 0.00225 0.00012
12.62626 0.00225 0.00012
12.82828 0.00217 0.00011
13.03030 0.00203 0.00010
13.23232 0.00192 0.00010
13.43434 0.00177 0.00009
13.63636 0.00166 0.00008
13.83838 0.00154 0.00007
14.04040 0.00146 0.00007
14.24242 0.00134 0.00006
14.44444 0.00133 0.00006
14.64646 0.00129 0.00006
14.84848 0.00121 0.00006
15.05051 0.00118 0.00005
15.25253 0.00109 0.00005
15.45455 0.00100 0.00004
15.65657 0.00091 0.00004
15.85859 0.00082 0.00003
16.06061 0.00077 0.00003
16.26263 0.00069 0.00003
16.46465 0.00067 0.00003
16.66667 0.00060 0.00002
16.86869 0.00058 0.00002
17.07071 0.00056 0.00002
17.27273 0.00052 0.00002
17.47475 0.00051 0.00002
17.67677 0.00048 0.00002
17.87879 0.00050 0.00002
18.08081 0.00046 0.00002
18.28283 0.00046 0.00002
18.48485 0.00042 0.00002
18.68687 0.00042 0.00001
18.88889 0.00038 0.00001
19.09091 0.00036 0.00001
19.29293 0.00034 0.00001
19.49495 0.00034 0.00001
19.69697 0.00029 0.00001
19.89899 0.00029 0.00001
