0.12500 0.01244
0.37500 0.05967
0.62500 0.11776
0.87500 0.20266
1.12500 0.26910
1.37500 0.33335
1.62500 0.37804
1.87500 0.41187
2.12500 0.44906
2.37500 0.47581
2.62500 0.49034
2.87500 0.51466
3.12500 0.55016
3.37500 0.55754
3.62500 0.56467
3.87500 0.57661
4.12500 0.56714
4.37500 0.54030
4.62500 0.52302
4.87500 0.46678
5.12500 0.41315
5.37500 0.37173
5.62500 0.32885
5.87500 0.30293
6.12500 0.28762
6.37500 0.28015
6.62500 0.28334
6.87500 0.29990
7.12500 0.29382
7.37500 0.28681
7.62500 0.26762
7.87500 0.23003
8.12500 0.19651
8.37500 0.16766
8.62500 0.13900
8.87500 0.14877
9.12500 0.12273
9.37500 0.10734
9.62500 0.09083
9.87500 0.07516
10.12500 0.06370
10.37500 0.05057
10.62500 0.02100
10.87500 0.02361
11.12500 0.01804
11.37500 0.06716
11.62500 0.07975
11.87500 0.06794
12.12500 0.08660
12.37500 0.08105
12.62500 0.06517
12.87500 0.04484
13.12500 0.04120
13.37500 0.02501
13.62500 0.01236
13.87500 0.02460
14.12500 0.02153
14.37500 0.05021
14.62500 0.07256
14.87500 0.08128
