0.12500 0.02069
0.37500 0.02735
0.62500 0.01499
0.87500 0.02159
1.12500 0.02510
1.37500 0.03496
1.62500 0.04031
1.87500 0.05348
2.12500 0.03816
2.37500 0.05486
2.62500 0.02755
2.87500 0.00753
3.12500 0.01450
3.37500 0.03224
3.62500 0.02957
3.87500 0.03521
4.12500 0.03220
4.37500 0.02791
4.62500 0.02398
4.87500 0.00968
5.12500 0.00981
5.37500 0.01252
5.62500 0.02053
5.87500 0.02507
6.12500 0.01391
6.37500 0.01935
6.62500 0.04229
6.87500 0.04580
7.12500 0.04125
7.37500 0.02503
7.62500 0.00490
7.87500 0.01079
8.12500 0.02159
8.37500 0.01681
8.62500 0.01610
8.87500 0.02699
9.12500 0.02353
9.37500 0.03784
9.62500 0.02277
9.87500 0.03573
10.12500 0.01660
10.37500 0.03412
10.62500 0.02695
10.87500 0.02407
11.12500 0.03128
11.37500 0.01402
11.62500 0.02854
11.87500 0.02016
12.12500 0.01529
12.37500 0.04299
12.62500 0.00526
12.87500 0.01016
13.12500 0.00803
13.37500 0.02202
13.62500 0.00835
13.87500 0.01366
14.12500 0.01652
14.37500 0.00665
14.62500 0.01401
14.87500 0.03106
