0.05000 -1652.80611 138.66422 -6955.81504 1808.01603 2258.94619 294089.69495
0.15000 -3476.10782 -156.50637 -25608.26980 2241.42482 1929.96255 303801.44507
0.25000 -4930.15525 -41.69997 -23295.15063 2325.64980 2076.78144 425025.05176
0.35000 -5939.16632 56.48010 -3262.21094 1760.13733 1570.54866 360067.74053
0.45000 -6753.57827 28.81695 -13316.13412 1700.94649 1310.44529 403468.39743
0.55000 -7199.97934 6.24223 -10251.23076 1795.80463 1322.50285 353078.25482
0.65000 -7643.42150 14.22357 394.54175 1788.27564 977.18254 350925.42257
0.75000 -7911.64402 14.31071 1624.12181 1681.73300 1101.17413 298726.28350
0.85000 -8050.87669 27.83484 -2929.27082 1626.33789 1043.08379 392204.72589
0.95000 -8160.41440 31.88426 -5370.97449 1564.67538 975.03194 278261.56714
1.05000 -8249.48750 23.22974 398.79040 1520.26903 936.76409 298292.23755
1.15000 -8395.27282 20.09676 -4983.97031 1510.94593 950.07745 267293.15433
1.25000 -8421.80120 5.26207 -3336.11071 1386.33298 947.95420 239089.11560
1.35000 -8403.39169 12.52925 -4084.36675 1300.76995 757.48162 235521.52497
1.45000 -8416.09169 2.68910 -3420.00426 1268.32095 865.75829 244704.18095
1.55000 -8421.67724 27.59963 3148.09226 1157.77760 771.38348 208402.12209
1.65000 -8381.23383 29.95958 -3236.22302 1195.73047 830.06563 210198.68078
1.75000 -8330.89810 20.32127 -2581.87612 1076.79663 793.99702 201142.55504
1.85000 -8263.40613 25.12966 595.17161 1034.58474 799.43110 182601.85488
1.95000 -8238.36090 48.72896 -571.18220 974.79478 734.00437 190977.03480
2.05000 -8206.03942 33.75961 2164.89730 892.60748 706.09937 177354.67239
2.15000 -8144.93214 24.28355 -2167.42603 889.32962 693.24146 173747.53138
2.25000 -8082.76842 20.90498 814.62380 886.99940 676.53518 163069.76089
2.35000 -8064.43622 19.97388 -717.47573 835.59082 647.81690 158985.30778
2.45000 -8031.93081 31.72348 2989.25985 800.48516 616.46877 166755.53189
2.55000 -7989.31845 30.67109 2543.11588 658.99527 563.90033 151572.25513
2.65000 -7955.04183 19.65852 -1623.89237 738.13987 624.01265 165467.45770
2.75000 -7910.32483 26.39653 -2094.78408 625.62816 567.57434 147616.84110
2.85000 -7847.28958 23.73080 -676.81305 646.25476 606.76619 136643.48524
2.95000 -7805.15251 21.07212 703.57437 714.74883 504.47571 119966.19225
3.05000 -7766.99455 18.67759 922.20989 512.08166 457.50485 142226.27264
3.15000 -7706.56428 19.25539 -1336.16667 584.34919 550.67891 127588.52667
3.25000 -7666.64998 22.14684 654.71237 508.79469 456.74253 119993.76342
3.35000 -7623.61386 6.59595 -2015.58997 497.14643 566.60332 112456.15559
3.45000 -7576.21028 16.25238 -478.82007 543.52717 495.49680 120425.19150
3.55000 -7540.07347 23.37838 -1005.48970 533.73530 486.38929 106255.05679
3.65000 -7491.29713 14.83830 801.98361 522.63408 484.09622 105567.19476
3.75000 -7433.54552 11.83585 -2488.58594 437.89942 405.50175 96923.51665
3.85000 -7385.60598 18.17024 2255.43295 477.18680 487.92256 99613.79133
3.95000 -7344.46517 12.09368 -947.34251 456.76386 415.87203 103367.99379
4.05000 -7284.85485 -1.48215 -1128.56958 470.68723 515.60743 95003.30928
4.15000 -7246.85566 18.82183 -1944.50448 500.39671 452.57026 87441.93705
4.25000 -7207.39112 19.12100 -741.32150 475.54752 490.44941 84939.97194
4.35000 -7166.13468 10.63837 692.49728 445.28666 427.13895 88188.29509
4.45000 -7104.34407 5.46174 388.25070 475.84094 410.77344 82613.85921
4.55000 -7063.14813 16.44605 -3371.62018 379.91014 467.10237 88867.55833
4.65000 -7014.71527 15.80158 -904.34866 413.23661 363.71032 81850.36120
4.75000 -6954.12971 9.36642 -426.52141 438.13925 404.11974 74100.11871
4.85000 -6899.37437 13.21283 -167.17599 428.96608 369.64189 68429.28825
4.95000 -6862.00258 19.88911 121.81173 500.71281 430.17121 139257.74806
5.05000 -6824.41255 12.98438 -288.45732 423.84693 366.13691 64075.80004
5.15000 -6788.83550 11.94494 -1062.79123 342.65354 411.77502 60344.20723
5.25000 -6741.44916 15.91564 -1195.81374 314.85167 347.49447 60096.08119
5.35000 -6701.77972 8.43920 -72.65672 410.54825 306.39352 57085.84074
5.45000 -6657.70247 10.16242 -706.72284 340.01575 325.63622 65401.41676
5.55000 -6625.25273 10.88353 -979.13482 329.81592 280.24554 54874.87337
5.65000 -6567.88747 10.52141 -299.26169 347.37648 301.28880 51419.28604
5.75000 -6531.47384 10.63367 -130.31537 310.45630 288.95619 58130.64548
5.85000 -6480.62595 14.80059 290.06720 390.92238 407.36548 61723.12601
5.95000 -6430.13731 12.81209 -1273.00452 377.65305 380.42739 48684.04077
6.05000 -6381.35027 10.99330 -492.75684 427.48222 283.84338 47121.21603
6.15000 -6337.19071 16.63895 -637.79159 314.25641 272.22456 44969.38121
6.25000 -6289.28340 8.61628 -843.73048 298.17406 279.74515 40756.14276
6.35000 -6238.72121 7.93241 -506.00018 300.12945 352.86941 41992.10731
6.45000 -6190.74263 3.93953 -758.38895 265.47801 236.68981 37762.16718
6.55000 -6141.72523 10.24473 -1524.22709 303.45084 255.07273 68605.08697
6.65000 -6086.98585 14.22571 -1375.05437 356.05271 311.29706 53432.50332
6.75000 -6029.43987 5.44863 -2325.40091 285.05915 278.12035 98013.35186
6.85000 -5972.54545 9.37548 81.51461 260.85971 243.43623 65024.18928
6.95000 -5917.21049 5.34240 -589.34018 294.92584 279.76996 39674.99196
7.05000 -5857.92512 8.70735 -265.06223 236.85455 232.61544 36098.62206
7.15000 -5802.71467 10.83443 -645.78983 301.35693 292.74265 32687.57527
7.25000 -5748.55447 6.83737 -86.04293 212.48875 213.49872 35278.33709
7.35000 -5699.66884 4.51054 -1813.35841 306.57725 292.57159 85876.02648
7.45000 -5663.14907 9.14376 -83.82060 372.93135 372.82275 40323.80363
7.55000 -5614.30262 8.18591 -708.82738 238.71426 212.31692 31346.78171
7.65000 -5573.13085 9.23773 -139.57330 388.98908 359.26385 29523.64218
7.75000 -5512.65204 8.99261 167.16000 261.32130 215.64952 29249.28135
7.85000 -5473.18870 5.43901 -89.15371 281.70340 215.93339 31299.51568
7.95000 -5430.72531 4.16683 -540.50526 250.25369 221.22811 25918.17926
8.05000 -5384.74334 11.85643 -72.99302 211.93599 214.89502 26373.67273
8.15000 -5344.37188 9.07453 463.10264 191.02323 202.32623 30092.38347
8.25000 -5308.13500 6.48340 278.73168 256.11539 204.14267 24131.13712
8.35000 -5270.79641 5.73612 -84.17483 224.02972 229.91094 39077.34544
8.45000 -5229.01751 11.44631 754.34680 209.39624 208.44959 33310.32365
8.55000 -5185.50086 12.78482 -127.60126 243.64943 231.47058 21571.81678
8.65000 -5136.64825 6.45474 132.90948 199.80649 193.30434 26517.14605
8.75000 -5097.37419 9.70148 -305.06041 205.88947 220.13204 24903.32262
8.85000 -5052.17995 5.69045 159.18238 281.55415 184.10959 21931.66662
8.95000 -5008.11622 5.44874 177.27047 199.52322 343.34030 86937.75248
9.05000 -4966.06738 7.75585 111.24956 238.16152 220.57133 26791.70889
9.15000 -4922.17321 5.32252 -63.39039 208.48210 196.78523 18284.86987
9.25000 -4887.25272 3.55863 84.74475 207.54704 311.43361 17607.20818
9.35000 -4846.33386 5.24900 608.80646 164.01159 166.94900 16961.74534
9.45000 -4806.55490 10.38417 198.13102 189.01368 214.70651 15042.45155
9.55000 -4772.18087 4.09098 -135.20839 222.45030 171.89080 18875.58235
9.65000 -4722.98127 4.10335 525.66125 218.59524 158.59913 33577.37175
9.75000 -4690.12745 6.78775 247.02591 148.60978 119.47443 16190.69172
9.85000 -4657.33917 5.65308 72.16548 201.97363 141.93497 15387.95946
9.95000 -4623.38350 6.47082 -164.77081 230.71738 173.08055 13485.36606
10.05000 -4594.67943 8.01450 -39.42078 371.50286 157.85433 15439.85811
10.15000 -4554.78523 7.04753 -0.58359 173.40790 141.56958 14924.51253
10.25000 -4521.19133 6.21980 -154.47514 168.08238 122.44773 13880.02323
10.35000 -4495.17192 2.95458 81.49387 177.95927 204.94620 12849.85600
10.45000 -4462.04049 4.80171 -51.56595 198.20023 185.56004 11802.65362
10.55000 -4436.32023 3.06301 76.40646 463.12049 299.63282 10825.84277
10.65000 -4396.92454 5.24422 296.53455 136.12867 174.05933 12003.72798
10.75000 -4366.41566 6.87633 11.63812 143.16794 124.31178 10889.86242
10.85000 -4333.15047 8.97531 294.24410 155.55168 141.70105 11000.61537
10.95000 -4296.40669 4.61452 65.35160 141.01763 155.10395 14175.00594
11.05000 -4257.63007 9.09768 549.63492 192.99638 153.67184 14642.18395
11.15000 -4228.36752 7.68547 -61.80395 203.37929 138.32356 11311.75738
11.25000 -4184.27193 1.82685 157.44501 145.76788 170.12079 9640.86555
11.35000 -4142.53985 4.38115 170.40026 129.87368 170.15043 10782.45552
11.45000 -4103.55800 6.22967 94.94546 116.01024 139.81896 13485.44569
11.55000 -4073.02908 -2.80306 336.24902 178.03805 195.86336 10134.29300
11.65000 -4031.79161 5.01204 177.61811 125.59360 201.37754 8781.15475
11.75000 -3994.73266 -1.64017 211.50672 110.08779 253.75942 9682.87422
11.85000 -3953.73232 5.86368 311.87001 171.98662 132.42510 8670.84831
11.95000 -3918.54860 7.22221 11.46183 141.31885 178.45918 9784.46793
12.05000 -3890.00148 -0.16144 -134.92834 233.07979 144.66138 8693.58051
12.15000 -3850.46692 2.07445 -169.66847 83.82121 110.75842 7884.47925
12.25000 -3817.20614 5.20966 180.58424 122.35369 108.99735 8591.45481
12.35000 -3789.11488 3.35596 11.01980 223.36650 143.15169 7892.01049
12.45000 -3755.82860 3.36549 -156.84866 128.94980 89.59985 8079.20424
12.55000 -3726.31844 5.00795 102.94831 148.11046 176.75577 7363.44474
12.65000 -3702.07299 4.96548 -105.88410 113.14407 132.77842 9024.20910
12.75000 -3676.68441 4.07307 81.63055 245.76027 196.75369 8609.28657
12.85000 -3652.07278 5.08229 24.17764 202.13383 156.48651 6292.15719
12.95000 -3624.70299 2.61030 -83.08245 108.98539 120.82067 7020.56554
13.05000 -3600.64882 1.61002 102.83414 128.29268 117.46419 5977.84204
13.15000 -3575.69577 8.29595 104.79340 163.73066 275.10551 6228.99311
13.25000 -3554.38304 -3.40363 -110.20679 143.66471 236.21753 6915.15047
13.35000 -3532.72969 5.88063 199.80704 89.34014 108.39897 5254.20203
13.45000 -3516.06135 0.07781 2.03304 172.01031 283.35760 5298.63687
13.55000 -3490.33855 3.38441 165.44455 93.67125 122.71804 6656.48413
13.65000 -3478.70097 11.66402 -101.36041 465.83731 312.52927 5380.42257
13.75000 -3446.60589 3.94484 4.72511 91.70362 87.13207 5495.74583
13.85000 -3424.74321 11.16659 65.90490 125.65277 238.16955 4965.97798
13.95000 -3405.63032 -0.11296 -121.59964 145.55421 189.05915 5235.37645
14.05000 -3377.26100 1.41943 85.63863 85.45029 85.80823 5698.14985
14.15000 -3354.66376 4.70994 -36.01698 127.80947 113.13790 5125.14058
14.25000 -3334.05125 -3.17422 -10.59726 108.51008 197.76493 4733.48845
14.35000 -3313.51637 3.89206 41.43769 152.36567 109.41562 4565.55760
14.45000 -3289.49748 2.97991 -165.50324 131.93580 80.43124 4975.11624
14.55000 -3266.65288 3.35054 190.03936 77.69384 77.58662 4454.61448
14.65000 -3242.32261 5.22303 -95.61088 90.68348 67.31146 3891.27075
14.75000 -3212.85314 1.67494 130.30343 126.30077 104.82401 3787.44725
14.85000 -3194.15765 4.64568 75.07495 123.87590 72.17146 4148.05875
14.95000 -3166.57991 2.75139 31.39693 71.66598 103.50697 3829.42183
15.05000 -3145.82386 1.28130 -89.85820 102.94602 88.89571 4503.17746
15.15000 -3119.14881 3.83157 56.63459 82.06988 95.00160 3541.95349
15.25000 -3096.82656 -0.68121 229.02936 65.04144 132.05761 7422.28536
15.35000 -3074.44580 1.90841 207.15529 124.10212 118.58707 4377.32711
15.45000 -3050.69070 -1.15540 41.20914 69.30616 68.02684 3758.44131
15.55000 -3028.60214 4.47054 43.39735 133.79594 66.37859 4095.56983
15.65000 -3008.02771 1.05789 48.13762 86.42396 99.15463 3437.90655
15.75000 -2983.09494 3.30598 -81.97617 59.58743 50.11244 3020.44881
15.85000 -2958.93981 3.35564 -75.49802 126.52049 73.75842 3449.38662
15.95000 -2935.57123 -1.00482 113.77219 80.81528 80.18848 3672.88722
16.05000 -2912.19563 1.62875 -42.41848 119.93366 96.09870 3305.01607
16.15000 -2898.19048 2.89733 67.33763 76.73154 50.49727 3634.58007
16.25000 -2874.43068 1.18913 90.41872 76.86968 70.66386 2221.07263
16.35000 -2851.29621 6.50835 -187.21190 86.12185 60.75694 3747.92752
16.45000 -2829.93641 1.60854 -73.63796 77.46108 80.17496 2788.87145
16.55000 -2817.02144 2.50900 83.65418 91.38616 76.38148 2591.92656
16.65000 -2794.81167 1.90887 39.23474 89.53076 82.74746 2439.05526
16.75000 -2781.06492 0.80403 -3.52816 53.65731 51.71965 2398.76698
16.85000 -2763.49003 -0.06382 -69.30538 88.14451 90.48102 2376.94549
16.95000 -2748.91011 6.53746 -61.55947 66.61278 150.57803 2218.11545
17.05000 -2729.78741 3.27712 131.86533 59.90995 57.43932 3393.25841
17.15000 -2712.66263 7.07634 -14.61881 103.59158 97.55699 1583.33701
17.25000 -2696.64252 4.15395 -73.63555 73.30343 90.13466 2543.46502
17.35000 -2680.31961 5.66693 1.51841 83.41312 79.91461 2149.46323
17.45000 -2669.98391 3.31155 -27.71496 53.86599 61.09474 2712.17166
17.55000 -2648.11770 3.65853 124.05962 75.64343 56.42402 2007.01170
17.65000 -2634.14595 1.14645 -120.08109 88.35478 60.62132 1693.02124
17.75000 -2622.31546 0.77822 -43.95076 49.85991 61.53537 2337.36083
17.85000 -2606.89300 4.35589 61.76330 73.77288 65.78072 2283.85073
17.95000 -2587.64253 0.93195 -157.96064 57.73154 48.51166 4500.81600
18.05000 -2575.29233 0.87594 -36.50890 52.85004 63.49090 1611.41178
18.15000 -2558.38255 1.88671 -7.38106 108.31735 70.82147 1990.91728
18.25000 -2547.96459 2.07120 25.13223 78.08499 65.47877 1891.00491
18.35000 -2525.24404 2.74885 -227.21707 48.84277 65.18801 3145.79648
18.45000 -2513.12765 5.38327 -116.03140 56.04311 138.64770 1471.71259
18.55000 -2498.04621 -1.04911 -54.87402 45.74048 52.01778 1925.98365
18.65000 -2483.78013 3.44571 26.40542 58.57624 48.23122 1393.39365
18.75000 -2462.20728 4.16034 -127.95621 76.35910 59.61344 1646.03943
18.85000 -2452.97109 2.55279 -42.38304 50.30447 48.43388 1123.38394
18.95000 -2437.43059 1.00277 -22.94268 65.78784 71.14152 1336.80722
19.05000 -2421.05899 -1.23799 -101.39692 50.56057 41.52396 1572.68939
19.15000 -2414.73822 4.29182 -8.82057 94.24613 163.26257 1647.72819
19.25000 -2392.09656 1.54159 10.83922 46.95808 73.80696 1213.96163
19.35000 -2379.98893 -1.28140 -57.96816 50.20901 44.23488 1466.81841
19.45000 -2367.07690 2.68942 12.00906 65.50382 38.34924 1120.51580
19.55000 -2354.48222 7.39757 17.93316 76.28646 101.95475 1441.42946
19.65000 -2341.06539 3.52256 41.63729 39.64254 37.70746 1466.63963
19.75000 -2326.70332 2.70336 86.64186 36.32585 48.48946 1317.92684
19.85000 -2313.04734 1.03451 91.60201 41.39635 46.17552 2135.36218
19.95000 -2296.03760 1.01145 -31.71994 38.14629 38.21392 1142.35020
