0.12500 0.00829
0.37500 0.04821
0.62500 0.05817
0.87500 0.08286
1.12500 0.12066
1.37500 0.13979
1.62500 0.17085
1.87500 0.18774
2.12500 0.19640
2.37500 0.20877
2.62500 0.20107
2.87500 0.20950
3.12500 0.20868
3.37500 0.21379
3.62500 0.20095
3.87500 0.19457
4.12500 0.18717
4.37500 0.17441
4.62500 0.14982
4.87500 0.15022
5.12500 0.13298
5.37500 0.11319
5.62500 0.11361
5.87500 0.08303
6.12500 0.07899
6.37500 0.07624
6.62500 0.04805
6.87500 0.05944
7.12500 0.05993
7.37500 0.04749
7.62500 0.03616
7.87500 0.03833
8.12500 0.04711
8.37500 0.04556
8.62500 0.04446
8.87500 0.04018
9.12500 0.03473
9.37500 0.04591
9.62500 0.06437
9.87500 0.05974
10.12500 0.03870
10.37500 0.06335
10.62500 0.04577
10.87500 0.04364
11.12500 0.04112
11.37500 0.01565
11.62500 0.01843
11.87500 0.03010
12.12500 0.00774
12.37500 0.01344
12.62500 0.00832
12.87500 0.00832
13.12500 0.03478
13.37500 0.03426
13.62500 0.03273
13.87500 0.05493
14.12500 0.05735
14.37500 0.03492
14.62500 0.04715
14.87500 0.03906
15.12500 0.05190
15.37500 0.02452
15.62500 0.03160
15.87500 0.01932
16.12500 0.00960
16.37500 0.01621
16.62500 0.01842
16.87500 0.00963
17.12500 0.01197
17.37500 0.01020
17.62500 0.02409
17.87500 0.01826
18.12500 0.02360
18.37500 0.01297
18.62500 0.04414
18.87500 0.05061
19.12500 0.06665
19.37500 0.07015
19.62500 0.06334
19.87500 0.07711
