0.120000 -1.107480
0.380000 3.097980
0.620000 3.083790
0.880000 2.987200
1.120000 3.049440
1.380000 3.022130
1.620000 3.020360
1.880000 3.046550
2.120000 3.031460
2.380000 3.034520
2.620000 3.036000
2.880000 3.034110
3.120000 3.048240
3.380000 3.049150
3.620000 3.071840
3.880000 3.047520
4.120000 3.087200
4.380000 3.129980
4.620000 3.130480
4.880000 -3.082800
5.120000 -3.046550
5.380000 -2.979510
5.620000 -2.831950
5.880000 -2.713440
6.120000 -2.592070
6.380000 -2.510430
6.620000 -2.368220
6.880000 -2.438330
7.120000 -2.088580
7.380000 -2.108560
7.620000 -2.071800
7.880000 -1.832590
8.120000 -1.773630
8.380000 -1.213760
8.620000 -0.365730
8.880000 -0.393650
9.120000 -0.459740
9.380000 -0.497080
9.620000 -0.604640
9.880000 -0.274890
10.120000 -0.317700
10.380000 -0.579260
10.620000 -0.829990
10.880000 -1.061210
11.120000 -0.881000
11.380000 -0.522030
11.620000 -2.403260
11.880000 -2.204060
12.120000 0.670620
12.380000 -1.105760
12.620000 -1.832050
12.880000 -1.464430
13.120000 -1.698730
13.380000 -1.328930
13.620000 -1.613940
13.880000 -1.525450
14.120000 -1.792500
14.380000 -1.765710
14.620000 -1.982880
14.880000 2.310800
