0.120000 2.646400
0.380000 -1.563190
0.620000 -2.713590
0.880000 -2.949980
1.120000 -2.593380
1.380000 -2.696860
1.620000 -2.624540
1.880000 -2.604080
2.120000 -2.696060
2.380000 -2.732510
2.620000 -2.701620
2.880000 -2.653070
3.120000 -2.399900
3.380000 -2.441580
3.620000 -2.178250
3.880000 -2.362730
4.120000 -2.295670
4.380000 -2.263030
4.620000 -2.444380
4.880000 -2.334440
5.120000 -2.401160
5.380000 -2.588830
5.620000 -2.660690
5.880000 -2.700660
6.120000 -2.721240
6.380000 -2.796470
6.620000 3.118370
6.880000 2.676620
7.120000 -2.937150
7.380000 -2.641960
7.620000 -2.937760
7.880000 -2.489050
8.120000 -2.693460
8.380000 -2.736840
8.620000 2.909810
8.880000 -2.927550
9.120000 2.300930
9.380000 2.547770
9.620000 2.423120
9.880000 2.483760
10.120000 1.770160
10.380000 1.844570
10.620000 1.586390
10.880000 0.855580
11.120000 1.163450
11.380000 1.479240
11.620000 0.310670
11.880000 0.350400
12.120000 -0.356460
12.380000 -1.030830
12.620000 -0.960290
12.880000 -1.640500
13.120000 2.249000
13.380000 2.083380
13.620000 1.739190
13.880000 2.067980
14.120000 2.409050
14.380000 2.086590
14.620000 1.846670
14.880000 1.557070
