0.05000 -4367.76566 -504.65911 186.21986 3697.01789 4018.09509 4806.32732
0.15000 -6759.22145 48.72441 563.66227 3367.46202 3304.64655 7450.17522
0.25000 -9643.64379 158.70855 289.72194 3830.83697 3373.25223 9990.27962
0.35000 -11624.47529 75.87286 -145.35545 4405.99281 3634.78320 12514.12442
0.45000 -13159.53816 138.61046 -20.32852 4817.48730 3846.22130 14027.13789
0.55000 -13905.91475 61.75488 276.12639 5054.00168 4025.94512 14545.60863
0.65000 -14421.52343 -14.31333 0.47980 5114.77866 4123.81154 14662.16001
0.75000 -14391.42582 15.53484 -42.95333 5012.00833 4243.31492 14542.46855
0.85000 -14303.31641 67.15749 210.96982 4799.17355 4296.43083 14386.81603
0.95000 -14281.26336 52.13032 -72.53902 4467.85094 4322.41080 13816.13776
1.05000 -14219.81600 83.78356 79.83517 4209.84873 4298.67305 13191.31343
1.15000 -13949.13745 42.89438 34.30289 4020.33585 4179.15719 12718.70017
1.25000 -13753.71578 21.38187 18.84510 3832.43055 4117.50256 12065.74050
1.35000 -13500.77855 44.92295 -223.74043 3537.65688 4025.72574 11465.50916
1.45000 -13261.62775 53.88054 -79.09142 3307.86958 3925.64401 10912.47344
1.55000 -13028.32626 30.92506 17.68937 3099.46534 3834.91841 10286.45432
1.65000 -12767.85550 11.77923 -88.40024 2924.16744 3733.34343 9797.42740
1.75000 -12537.11545 -4.48292 -31.43129 2717.37088 3655.56658 9320.25401
1.85000 -12324.65999 -46.43976 39.10548 2607.25433 3520.19436 8861.82291
1.95000 -12059.12763 55.39692 -80.26272 2466.30467 3393.50528 8505.84127
2.05000 -11839.65737 93.74770 17.34444 2272.65285 3321.73855 8104.26791
2.15000 -11692.26495 43.49235 -0.68533 2112.90852 3226.17356 7712.77505
2.25000 -11479.41347 -28.49839 25.55219 2045.43594 3135.97137 7307.62504
2.35000 -11283.65167 37.13721 -45.69654 1907.73315 3025.56877 7030.15511
2.45000 -11065.47786 46.96153 -84.97011 1848.85815 2936.21708 6791.53227
2.55000 -10853.12368 33.59744 -44.22141 1726.07252 2841.16272 6510.24679
2.65000 -10682.48318 -30.48410 -70.38718 1628.99649 2748.16113 6241.92978
2.75000 -10468.63019 108.94224 61.03803 1607.51271 2634.35769 6045.52218
2.85000 -10330.61719 114.43542 -26.03307 1508.04047 2594.12457 5749.29525
2.95000 -10122.17080 81.01457 -76.09450 1463.18737 2471.42858 5616.76802
3.05000 -9998.76809 73.84534 68.28764 1398.20342 2383.68891 5317.85214
3.15000 -9797.92287 47.00052 -74.53236 1332.84344 2304.81463 5195.23068
3.25000 -9652.89886 28.85901 69.57661 1320.46478 2226.11066 5003.33102
3.35000 -9486.44722 59.72170 -32.60678 1267.29994 2162.16040 4827.54436
3.45000 -9330.34387 19.75376 5.12761 1226.53397 2062.81249 4697.85688
3.55000 -9229.55800 17.58218 -21.66678 1211.18086 1991.10777 4466.33130
3.65000 -9059.74075 63.28545 -8.01350 1157.09061 1911.26731 4392.77773
3.75000 -8916.32215 53.81259 28.20483 1129.87302 1844.29689 4255.66078
3.85000 -8803.83028 7.78562 -3.75139 1081.65583 1779.14753 4077.12742
3.95000 -8664.08925 25.10513 46.34059 1047.00670 1714.75304 3951.43809
4.05000 -8529.77442 11.35831 -42.85285 1022.57719 1640.05929 3806.72440
4.15000 -8372.86114 14.77098 -77.04154 989.38162 1566.37168 3704.05790
4.25000 -8242.59763 24.56748 -13.87016 986.67447 1509.36510 3591.59710
4.35000 -8114.87709 -14.04072 17.46038 930.72312 1460.04020 3437.40967
4.45000 -7975.63481 39.08116 -66.97959 902.74606 1401.66240 3323.92089
4.55000 -7879.66601 -12.08957 -32.83337 844.28050 1349.44462 3236.64271
4.65000 -7738.20053 8.40398 -98.27479 826.43810 1295.51185 3105.46082
4.75000 -7618.40341 -3.52463 70.87646 811.08700 1238.94676 2992.34619
4.85000 -7461.94974 7.56566 -13.04436 778.32712 1177.15064 2907.33070
4.95000 -7329.98984 0.72369 -44.72626 753.66478 1142.25188 2823.42143
5.05000 -7223.53572 20.37373 -12.19849 705.14760 1089.41211 2680.08986
5.15000 -7074.33177 24.19435 -20.09261 679.77442 1053.24043 2603.05385
5.25000 -6938.99397 5.54883 60.17700 669.63563 1025.70265 2523.63553
5.35000 -6803.51936 11.18129 -13.63700 653.69635 1000.69314 2465.50230
5.45000 -6649.41204 -3.96095 21.93857 617.77333 950.04018 2378.43143
5.55000 -6538.89392 30.55609 -7.69700 566.83194 922.80906 2283.50906
5.65000 -6436.55047 1.21504 17.04575 567.59252 880.87472 2228.91999
5.75000 -6316.94441 -8.24523 10.24456 526.90866 876.94803 2136.56116
5.85000 -6167.51099 2.55381 64.02478 522.45057 817.62657 2141.66494
5.95000 -6076.90007 9.55780 -13.75294 476.62216 812.31037 2075.46859
6.05000 -5973.10388 -7.62708 -2.51400 447.17565 789.69587 2030.16835
6.15000 -5878.48734 -13.98627 14.07577 413.79970 756.86511 1952.23113
6.25000 -5798.77183 -23.32358 -8.32936 438.15339 748.06788 1909.70711
6.35000 -5689.25422 -18.57912 28.08875 393.84181 724.68476 1843.62793
6.45000 -5616.98199 1.80306 18.32815 388.53987 729.92287 1806.98350
6.55000 -5538.27481 -6.46868 -23.41173 380.54644 705.45707 1783.81969
6.65000 -5470.74367 -3.51870 -12.20916 328.47144 685.62909 1731.19018
6.75000 -5417.49459 -28.47949 -3.65353 356.87812 685.81683 1678.57153
6.85000 -5373.51099 -11.75046 6.60971 347.81395 695.70529 1634.47894
6.95000 -5322.85568 -16.64434 29.52716 381.31781 642.76585 1639.44680
7.05000 -5272.40935 4.64715 -10.23960 373.22837 657.33654 1591.05642
7.15000 -5226.51461 -5.85798 20.80102 359.10692 629.33010 1564.22786
7.25000 -5171.80885 -13.72094 -7.18552 340.70706 616.78076 1503.28943
7.35000 -5134.70716 -3.15829 0.92563 333.40754 616.19844 1455.66919
7.45000 -5091.57227 -8.05354 -12.32163 342.20712 586.89924 1409.98762
7.55000 -5045.52934 0.56260 -10.51777 339.92821 578.21099 1380.20567
7.65000 -5006.39012 8.69457 3.69117 349.14424 576.53509 1354.77735
7.75000 -4973.45394 -6.77882 -25.26526 351.58213 566.05818 1315.89676
7.85000 -4947.92072 0.72238 -4.69761 362.93098 545.92348 1262.72388
7.95000 -4903.82973 5.77538 6.30278 412.42723 533.50424 1220.85857
8.05000 -4886.36581 6.39325 35.49642 430.72295 513.88244 1215.26162
8.15000 -4871.11079 -0.98752 22.31039 403.46765 497.66726 1161.55567
8.25000 -4843.55882 -1.55063 12.57672 428.72480 485.09044 1103.22124
8.35000 -4818.50001 8.88073 31.87447 447.28282 474.47694 1077.35574
8.45000 -4781.77302 3.26828 -10.62113 458.85512 447.52683 1014.03884
8.55000 -4750.65714 4.93787 43.28044 465.29325 429.27042 987.95740
8.65000 -4709.34616 -0.94093 -2.40323 473.68736 414.98010 960.86840
8.75000 -4675.34097 6.39700 -2.40296 483.95029 396.48790 929.49960
8.85000 -4630.58043 12.12798 -2.76764 498.89751 390.84231 886.18107
8.95000 -4590.98125 19.23757 29.24183 481.12468 364.61108 862.44940
9.05000 -4535.36690 19.06402 23.58188 471.10110 340.78157 840.79881
9.15000 -4497.05245 14.35287 12.48297 468.86945 328.05772 810.91821
9.25000 -4446.13373 22.18451 0.02922 469.70648 322.66002 779.32614
9.35000 -4386.84182 34.39993 31.85314 426.55630 311.77112 764.07168
9.45000 -4327.81145 16.24749 8.49955 400.08486 281.87174 721.33376
9.55000 -4292.90250 21.81527 7.01873 383.12135 254.10246 704.77166
9.65000 -4250.85263 26.51052 8.33744 385.05063 258.34042 687.88623
9.75000 -4206.41714 18.70948 3.76468 358.45531 245.99934 664.59095
9.85000 -4173.24559 14.20579 -16.90189 353.30581 244.72506 647.89071
9.95000 -4143.41046 19.66399 -6.61772 324.62365 228.84605 631.56619
10.05000 -4111.83025 17.33091 31.88177 308.47996 233.74992 618.29017
10.15000 -4068.34196 24.61881 10.96133 295.13606 242.70936 608.02744
10.25000 -4040.46030 17.17110 8.61273 301.30769 212.34484 596.68407
10.35000 -4007.68256 11.18777 28.78563 268.43781 188.35058 588.81122
10.45000 -3988.68014 19.48989 3.73440 269.33167 209.94058 581.13634
10.55000 -3956.16352 18.75664 -1.64608 245.83695 218.21722 570.00356
10.65000 -3938.48427 11.41372 3.66118 246.62152 185.75966 560.03249
10.75000 -3911.47452 9.72836 19.97481 255.89688 184.82090 548.48845
10.85000 -3884.78391 9.30152 19.09566 239.85356 182.68426 528.52072
10.95000 -3854.10386 10.55500 14.11727 205.83697 175.41422 500.40691
11.05000 -3836.11305 6.45371 4.38696 208.02504 149.12208 508.29697
11.15000 -3804.32789 12.83094 15.74584 206.56817 191.05225 500.60318
11.25000 -3779.69883 9.29363 6.96798 210.34920 150.62556 485.09575
11.35000 -3760.13217 10.31867 13.56947 219.50425 165.19195 478.87527
11.45000 -3742.16860 9.63032 7.38839 174.44502 151.63667 457.79339
11.55000 -3711.47423 12.07030 12.71442 179.76950 155.57683 450.29413
11.65000 -3684.93829 11.40145 23.99710 193.56410 174.38452 472.42611
11.75000 -3667.01217 13.03682 18.93163 172.71152 150.76145 441.93358
11.85000 -3632.86688 13.95211 7.88832 202.84044 155.99085 449.20828
11.95000 -3615.14690 9.81260 20.01246 208.47136 147.82459 423.17209
12.05000 -3592.21829 10.87516 15.32664 205.93901 123.89149 427.26027
12.15000 -3560.96060 10.83851 22.74473 158.42628 113.98300 397.18517
12.25000 -3528.72886 9.95017 14.11561 221.59790 136.72685 412.72948
12.35000 -3513.72677 9.35505 1.00725 178.29316 130.35397 390.71963
12.45000 -3497.13094 5.66618 14.72556 143.76333 118.29369 381.95002
12.55000 -3463.59449 12.25279 4.30348 142.86677 109.59788 378.13618
12.65000 -3439.71326 13.43696 5.64657 132.87677 118.78101 373.07194
12.75000 -3416.28651 4.22134 -0.59722 134.73609 117.33887 375.21253
12.85000 -3392.04330 14.36203 9.46266 176.14969 118.40654 364.85557
12.95000 -3367.19415 11.89890 7.50465 146.37009 103.29648 349.43736
13.05000 -3350.41742 13.62411 12.28227 151.64418 112.60392 334.96053
13.15000 -3319.31663 11.93202 5.91985 122.60476 100.59222 327.54153
13.25000 -3295.17673 11.99843 19.64448 120.27254 104.36983 329.84514
13.35000 -3270.99193 7.79796 13.38102 109.45613 108.89938 320.67040
13.45000 -3253.26125 7.15043 7.36223 132.26086 89.57541 316.12237
13.55000 -3225.72662 9.16855 8.39179 121.39216 83.65654 293.88056
13.65000 -3206.56577 11.71928 24.12064 156.58726 93.04710 322.73863
13.75000 -3177.75845 5.50558 15.13517 110.63993 81.86311 301.33615
13.85000 -3162.15680 8.97533 0.57039 111.62811 108.22991 280.06756
13.95000 -3144.20426 9.86541 1.84499 115.59524 84.99167 276.87368
14.05000 -3116.36950 9.31835 5.77548 111.86624 121.14506 265.45229
14.15000 -3092.01840 9.85730 -9.82253 149.23278 69.33516 296.08480
14.25000 -3066.60950 6.24749 6.90078 105.63213 73.46783 269.65757
14.35000 -3042.21633 6.32052 7.47631 91.18769 65.29023 255.68952
14.45000 -3026.43405 11.16169 6.63105 102.45412 128.20091 240.75610
14.55000 -2998.88155 2.92409 22.11082 86.58138 99.02244 259.09936
14.65000 -2978.47572 8.18444 14.84397 117.92809 62.81306 239.70769
14.75000 -2959.69089 3.30309 18.13383 103.65085 120.82495 260.05574
14.85000 -2942.44167 5.39672 16.64288 163.15103 150.41918 245.40624
14.95000 -2915.02540 3.84229 11.26124 92.18110 66.42133 232.09007
15.05000 -2899.80456 11.39774 1.90658 84.83913 116.67933 237.75294
15.15000 -2875.50453 6.73590 3.00375 85.51536 66.89296 220.83680
15.25000 -2859.40420 4.88138 20.92134 103.08225 74.45767 226.78931
15.35000 -2835.51783 7.02547 10.99531 186.88610 74.42953 222.18606
15.45000 -2828.56633 3.45943 25.74910 68.93805 60.83570 206.97122
15.55000 -2808.57383 -0.63137 8.31718 70.91060 61.02767 215.65987
15.65000 -2788.36554 1.40893 14.21331 66.62534 73.45527 232.59110
15.75000 -2772.00202 11.33750 0.87340 137.00740 145.91441 250.85020
15.85000 -2756.33695 3.98789 13.49259 68.56096 56.42203 192.96590
15.95000 -2735.08468 1.32619 24.20794 68.54640 51.93638 203.62414
16.05000 -2713.94965 11.32493 3.44778 91.36576 192.34488 200.29764
16.15000 -2702.22729 3.14739 21.44530 78.38631 59.57019 192.68243
16.25000 -2682.03502 2.82298 28.58804 85.93795 61.67954 196.28746
16.35000 -2664.18826 1.26079 10.75504 95.53826 180.01670 222.92156
16.45000 -2647.86348 5.19405 18.61354 61.34568 51.55102 171.11446
16.55000 -2629.90350 2.87076 14.88548 106.98954 58.59925 263.29217
16.65000 -2619.56501 8.36117 26.37453 88.57554 77.60650 171.89262
16.75000 -2608.21529 6.88318 22.46689 79.67445 54.40274 191.00977
16.85000 -2587.39915 4.73193 18.50062 108.76200 60.59951 184.65415
16.95000 -2569.09234 4.86063 21.95031 57.71361 40.80852 167.94435
17.05000 -2552.85701 16.72414 21.67816 72.95259 163.03076 182.24097
17.15000 -2536.63140 -1.24850 8.35399 55.25154 89.07651 203.27241
17.25000 -2522.01800 6.43850 12.82928 47.96931 59.56707 166.05668
17.35000 -2500.21932 4.41592 13.67356 64.62900 59.35514 166.53740
17.45000 -2485.96197 2.80066 20.41840 53.84493 51.54838 154.04843
17.55000 -2471.63345 8.41132 20.80596 62.33213 53.08614 166.69736
17.65000 -2459.58078 4.85394 18.03004 49.99789 46.03048 169.82015
17.75000 -2446.41251 6.69948 29.95483 54.22317 50.10242 170.02777
17.85000 -2427.83241 8.58198 23.71957 49.23082 56.28533 149.27094
17.95000 -2414.85811 4.97831 20.82714 60.58132 47.40199 160.04999
18.05000 -2402.45777 8.57982 25.39711 108.07825 60.79918 164.13797
18.15000 -2382.93543 -0.57664 7.64637 47.34105 112.21864 142.43270
18.25000 -2372.02068 7.78934 21.87781 88.29968 48.34232 156.26673
18.35000 -2356.21984 8.06449 14.84258 47.15347 35.66171 141.89244
18.45000 -2345.83893 5.03496 16.60562 162.08142 115.25201 156.94576
18.55000 -2331.53479 8.33140 21.60894 111.52893 33.51634 144.75424
18.65000 -2315.19907 6.20381 22.10910 43.53243 43.27890 141.33032
18.75000 -2297.67531 15.53043 17.84732 107.90668 122.92052 183.18982
18.85000 -2290.00134 11.12410 19.39433 70.02910 84.56693 147.88942
18.95000 -2275.78515 6.98465 23.18094 41.75861 27.35270 135.08105
19.05000 -2263.96782 8.38055 26.32290 49.87132 32.02415 136.34351
19.15000 -2250.37757 5.98634 28.14711 44.81191 44.40582 139.68164
19.25000 -2238.16845 3.08789 11.65253 71.56670 39.91728 129.56214
19.35000 -2223.67147 7.37785 20.29253 54.04390 40.07813 136.91287
19.45000 -2213.56372 8.95003 10.58484 34.29614 37.52659 133.70822
19.55000 -2206.86959 10.68060 17.89270 63.16823 47.59647 139.94224
19.65000 -2187.03737 -13.55917 17.64937 75.39617 296.22565 152.55943
19.75000 -2179.10528 8.65029 25.56541 46.19293 30.18190 133.36759
19.85000 -2169.64370 9.12474 3.61308 82.81413 69.45896 125.49722
19.95000 -2141.32459 -3.29685 14.64338 257.70835 181.76840 164.67376
