0.120000 -2.771100
0.380000 -2.499030
0.620000 -2.646030
0.880000 -2.625570
1.120000 -2.604100
1.380000 -2.606060
1.620000 -2.590070
1.880000 -2.609520
2.120000 -2.610170
2.380000 -2.624950
2.620000 -2.613420
2.880000 -2.647030
3.120000 -2.600420
3.380000 -2.632420
3.620000 -2.666330
3.880000 -2.658940
4.120000 -2.709770
4.380000 -2.719260
4.620000 -2.694260
4.880000 -2.640790
5.120000 -2.614390
5.380000 -2.580120
5.620000 -2.575560
5.880000 -2.558510
6.120000 -2.607390
6.380000 -2.711600
6.620000 -2.739910
6.880000 -2.742280
7.120000 -2.956470
7.380000 2.908670
7.620000 2.758670
7.880000 2.371480
8.120000 2.195540
8.380000 2.165660
8.620000 1.769290
8.880000 1.143520
9.120000 1.078990
9.380000 1.037160
9.620000 1.501290
9.880000 1.536900
10.120000 0.846140
10.380000 0.488890
10.620000 0.793840
10.880000 0.707750
11.120000 0.519590
11.380000 0.931000
11.620000 0.285080
11.880000 0.174520
12.120000 0.402930
12.380000 0.689210
12.620000 0.425070
12.880000 0.686860
13.120000 0.550460
13.380000 0.657720
13.620000 0.979700
13.880000 0.697950
14.120000 2.147680
14.380000 1.526330
14.620000 2.367680
14.880000 -0.069500
15.120000 1.835980
15.380000 -2.656140
15.620000 1.458410
15.880000 2.795980
16.120000 0.674770
16.380000 0.642070
16.620000 -1.382830
16.880000 0.189250
17.120000 -2.929220
17.380000 1.906300
17.620000 1.476410
17.880000 -2.196500
18.120000 1.036460
18.380000 -1.150770
18.620000 -2.968830
18.880000 2.230620
19.120000 2.792200
19.380000 -0.452780
19.620000 1.207400
19.880000 0.689380
