0.120000 2.005080
0.380000 -0.414360
0.620000 -2.155820
0.880000 -2.008690
1.120000 -1.992760
1.380000 -2.187130
1.620000 -2.011890
1.880000 -2.035990
2.120000 -1.929090
2.380000 -1.910170
2.620000 -1.907290
2.880000 -1.926140
3.120000 -2.038640
3.380000 -2.080490
3.620000 -2.227600
3.880000 -2.328240
4.120000 -2.256770
4.380000 -2.318190
4.620000 -2.403110
4.880000 -2.284480
5.120000 -2.229570
5.380000 -2.860320
5.620000 -1.875330
5.880000 -2.600230
6.120000 -2.493080
6.380000 -2.685050
6.620000 2.982460
6.880000 2.724150
7.120000 -2.360480
7.380000 -1.792420
7.620000 -1.692850
7.880000 -1.826330
8.120000 -2.431500
8.380000 -2.037450
8.620000 -2.341690
8.880000 -2.471510
9.120000 -2.506980
9.380000 -3.032310
9.620000 2.838270
9.880000 2.473650
10.120000 2.449820
10.380000 2.388080
10.620000 2.195730
10.880000 1.956900
11.120000 1.665920
11.380000 1.248260
11.620000 0.879410
11.880000 0.974350
12.120000 0.654060
12.380000 0.543060
12.620000 0.252260
12.880000 0.142710
13.120000 -0.644280
13.380000 -0.663060
13.620000 -0.530800
13.880000 -0.630950
14.120000 -1.594850
14.380000 -0.891240
14.620000 -1.205190
14.880000 -0.928180
