0.12500 0.02600
0.37500 0.03113
0.62500 0.05259
0.87500 0.07945
1.12500 0.10149
1.37500 0.14084
1.62500 0.19800
1.87500 0.23097
2.12500 0.26308
2.37500 0.28174
2.62500 0.30772
2.87500 0.32394
3.12500 0.34027
3.37500 0.36182
3.62500 0.36202
3.87500 0.36055
4.12500 0.35076
4.37500 0.34181
4.62500 0.32480
4.87500 0.30985
5.12500 0.28383
5.37500 0.27388
5.62500 0.26360
5.87500 0.21787
6.12500 0.18979
6.37500 0.16536
6.62500 0.12774
6.87500 0.10212
7.12500 0.08642
7.37500 0.07663
7.62500 0.08340
7.87500 0.08973
8.12500 0.07387
8.37500 0.06405
8.62500 0.06265
8.87500 0.05601
9.12500 0.04975
9.37500 0.05642
9.62500 0.07153
9.87500 0.10328
10.12500 0.10529
10.37500 0.09772
10.62500 0.08901
10.87500 0.06807
11.12500 0.07793
11.37500 0.07157
11.62500 0.06723
11.87500 0.05544
12.12500 0.05842
12.37500 0.06029
12.62500 0.05743
12.87500 0.04781
13.12500 0.06472
13.37500 0.06886
13.62500 0.08334
13.87500 0.09190
14.12500 0.09300
14.37500 0.11366
14.62500 0.10332
14.87500 0.07610
