0.12500 0.02393
0.37500 0.01082
0.62500 0.03424
0.87500 0.04257
1.12500 0.11961
1.37500 0.11984
1.62500 0.18006
1.87500 0.19485
2.12500 0.20755
2.37500 0.19788
2.62500 0.18798
2.87500 0.17711
3.12500 0.15598
3.37500 0.11095
3.62500 0.08063
3.87500 0.04079
4.12500 0.04430
4.37500 0.02467
4.62500 0.02252
4.87500 0.02660
5.12500 0.02071
5.37500 0.01548
5.62500 0.02897
5.87500 0.02040
6.12500 0.01242
6.37500 0.01992
6.62500 0.00592
6.87500 0.00822
7.12500 0.02983
7.37500 0.02858
7.62500 0.04023
7.87500 0.01607
8.12500 0.03504
8.37500 0.04575
8.62500 0.02180
8.87500 0.06958
9.12500 0.07086
9.37500 0.02575
9.62500 0.00343
9.87500 0.04043
10.12500 0.06241
10.37500 0.03081
10.62500 0.05536
10.87500 0.05608
11.12500 0.06482
11.37500 0.04621
11.62500 0.00917
11.87500 0.03603
12.12500 0.03446
12.37500 0.05770
12.62500 0.02256
12.87500 0.03935
13.12500 0.06389
13.37500 0.04338
13.62500 0.00079
13.87500 0.07623
14.12500 0.04240
14.37500 0.04378
14.62500 0.05136
14.87500 0.07602
