0.2 0.25935 18.67507 2.00226 141.07799 138.48002 136.63788
0.6 1.07666 47.75506 0.10679 123.30489 109.87088 107.97609
1.0 0.91339 67.72018 0.28711 108.29311 91.55123 88.24526
1.4 0.2831 82.52242 0.31634 95.36163 84.53634 78.11159
1.8 -0.67714 100.90224 -0.1196 82.56099 81.09353 70.8847
2.2 -0.03906 120.87578 -0.63303 71.56603 73.96781 66.06459
2.6 -0.40153 138.81739 -0.51156 62.67648 65.00564 59.93015
3.0 -0.22916 151.13235 -0.18893 57.14977 56.17301 54.74015
3.4 -1.02668 162.52723 -0.53357 52.92625 50.16125 49.84016
3.8 -0.85152 171.00621 -0.36342 49.49717 43.73286 46.02674
4.2 -0.90314 176.49686 0.16766 46.87639 38.93802 42.37858
4.6 -0.24818 179.74548 -0.22879 44.64675 36.62395 39.51973
5.0 -0.71309 182.50904 -0.40813 43.46926 35.36261 37.19801
5.4 -0.73389 186.17778 -0.04494 41.58244 33.92655 35.53448
5.8 -0.13198 189.69471 0.00494 40.20046 32.48222 33.86681
6.2 0.63994 192.03166 0.49543 39.42281 31.37288 32.61737
6.6 1.07244 194.19256 0.34735 38.20409 29.98832 31.27954
7.0 0.95314 195.99811 0.24135 37.07282 29.01721 29.86563
7.4 1.09959 197.52916 0.17681 35.98743 28.18969 28.35433
7.8 0.05182 199.5054 -0.37639 34.63069 27.97639 27.47756
8.2 0.15734 202.02035 -0.22552 33.22036 27.27086 26.20422
8.6 0.07835 204.05522 -0.25825 31.9502 26.22403 25.41435
9.0 -0.52181 205.78438 -0.12443 31.49932 24.28821 24.47222
9.4 -0.20683 206.73806 -0.44387 30.35386 22.92835 23.96815
9.8 0.29853 207.22268 -0.29659 29.49159 21.86382 23.01205
10.2 0.41036 207.5046 0.16753 28.76377 21.02693 22.01118
10.6 0.50153 207.73416 -0.13531 27.88465 20.70239 21.12873
11.0 0.15391 208.07578 -0.04034 26.8713 20.13438 20.58443
11.4 -0.06627 208.04211 0.24146 26.12556 19.86616 19.56412
11.8 -1.01511 208.69196 0.02163 25.38341 19.10552 19.14476
12.2 -0.22401 209.31034 -0.02206 24.34172 18.99555 18.00758
12.6 -0.35108 210.14683 0.10689 23.81849 18.15729 17.20491
13.0 -0.05977 210.05566 -0.64941 22.61868 18.06033 16.59239
13.4 0.6796 210.87142 -0.8478 21.91593 17.35039 15.99427
13.8 0.80482 211.21204 -1.11909 21.58795 16.62227 15.52271
14.2 1.1835 211.2368 -0.62667 21.06657 16.23662 14.99163
14.6 0.92689 211.17791 -0.77924 20.95036 15.71353 14.48691
15.0 1.18778 211.80302 -0.36751 20.24314 14.8942 14.01971
15.4 0.93002 210.81483 -0.48365 19.80874 14.45534 13.61266
15.8 0.26999 211.52634 -0.77601 19.27621 13.45874 13.21129
16.2 0.02553 211.03579 -1.01471 18.34011 13.72563 13.09112
16.6 -0.36879 210.95219 -1.30295 17.89464 13.08587 13.09803
17.0 -0.39799 210.88287 -0.77341 16.86874 12.47418 12.85956
17.4 -1.18727 210.88768 -1.91061 16.1146 11.93003 13.08801
17.8 -0.98149 210.78467 -1.32767 15.57789 11.22971 13.27574
18.2 -0.31894 210.03818 -0.90567 14.77895 10.93253 12.99919
18.6 -0.40998 210.26664 -0.58419 14.40561 10.49472 12.61222
19.0 -0.98425 209.95032 0.66128 14.14879 10.8777 13.15138
19.4 0.07214 209.80896 0.83937 13.5682 10.74562 12.58281
19.8 -0.69792 210.33706 0.72062 13.29778 10.34703 11.44035
