0.05000 -1946.81242 -165.83362 -5385.25226 1051.16090 937.37629 1209865.62004
0.15000 -4264.57801 66.44605 23046.37197 1339.01932 1276.07027 1034787.67458
0.25000 -6528.55886 91.33837 -23888.09837 1597.96125 1410.64852 1277450.49724
0.35000 -8343.68600 122.84559 -45243.64817 1801.20227 1702.34327 1082941.69273
0.45000 -9913.66730 88.72337 -9972.88762 1938.21476 1944.20937 1113901.13187
0.55000 -11211.07124 98.56061 10164.96375 2029.36110 2164.87978 1053459.13022
0.65000 -12123.35527 162.31760 -13162.82251 1940.19863 2352.23271 1097152.40009
0.75000 -12741.89811 89.33735 -826.53395 1907.53203 2481.49915 1013154.12124
0.85000 -13177.69782 192.49827 12617.34048 1845.86714 2534.81745 1037227.60959
0.95000 -13367.94851 143.38504 8020.82802 1767.56482 2571.44150 945176.69591
1.05000 -13479.26507 164.83348 4173.03731 1667.82447 2569.70580 923764.55203
1.15000 -13458.41867 201.28884 -6954.67807 1577.58598 2593.39878 835348.03769
1.25000 -13342.05884 137.17941 8912.57711 1448.71738 2560.80072 860938.13225
1.35000 -13210.90125 169.72711 -11579.26452 1294.70395 2551.30693 793574.68504
1.45000 -13058.26804 164.62844 3196.98391 1168.44199 2514.61132 731581.97152
1.55000 -12870.47585 155.71209 -2206.45345 1050.14144 2483.67283 735244.59406
1.65000 -12676.21847 129.26697 -3957.45760 934.61621 2428.08817 702566.16304
1.75000 -12467.94293 141.38179 3405.97696 837.79143 2378.74321 651088.47198
1.85000 -12264.61008 122.48800 -4231.55794 720.80247 2307.34233 638645.52184
1.95000 -12019.97067 111.00878 -839.48030 654.33548 2271.53299 635988.68333
2.05000 -11793.13916 114.00927 -9448.20986 578.93970 2225.57839 581761.51345
2.15000 -11565.59320 154.15605 6311.32210 528.35258 2138.31078 573595.37019
2.25000 -11333.34112 123.53909 2318.84848 485.80619 2095.55609 540699.07996
2.35000 -11108.57610 107.42414 -305.94460 428.89649 2047.18480 529602.45376
2.45000 -10894.61459 137.65077 1494.58069 386.99737 1987.54056 523319.49305
2.55000 -10666.29805 109.46337 -3898.18575 357.39231 1956.47103 504651.50988
2.65000 -10447.39471 119.94259 -435.97430 336.52063 1904.60955 478699.62692
2.75000 -10229.76919 117.67884 567.27777 314.50136 1841.99726 453396.01207
2.85000 -10022.37543 74.26980 741.65820 301.60099 1811.61766 439086.11651
2.95000 -9806.25507 54.64483 -13033.28993 287.93384 1750.23924 407780.82559
3.05000 -9594.59135 60.54596 -3415.32828 292.46360 1699.82420 406289.08620
3.15000 -9380.97269 68.30682 -4137.40735 301.39776 1659.48421 404358.80521
3.25000 -9175.58552 26.85215 -595.33375 296.98752 1609.59994 394897.56326
3.35000 -9011.50302 63.09940 -2561.25959 282.57183 1579.99117 370397.80012
3.45000 -8863.70008 82.37212 -4328.76418 282.52450 1568.78307 360664.24730
3.55000 -8719.71125 65.56110 -2782.93915 299.46415 1495.37314 332411.09558
3.65000 -8574.14097 -1.60259 -1041.40293 315.62486 1478.29039 320836.15611
3.75000 -8424.84025 42.65458 1005.42237 324.50373 1414.53081 329049.17559
3.85000 -8272.30608 40.70253 -1954.70523 328.10422 1403.26098 294359.90401
3.95000 -8142.94856 17.87632 -2086.91523 338.00916 1348.70571 286474.67200
4.05000 -8018.12371 4.02760 -8619.45660 342.11853 1307.75983 264121.40326
4.15000 -7878.87284 38.29889 3756.91332 360.81452 1277.80302 262586.78210
4.25000 -7765.38702 18.67907 4633.90615 362.85628 1244.12033 254747.34675
4.35000 -7629.47800 58.30808 -3834.23987 368.90332 1211.49325 231778.30867
4.45000 -7490.32673 -17.72208 1663.51611 366.53840 1169.58016 218283.90048
4.55000 -7361.17268 -0.28485 -291.71015 371.50131 1143.55388 206592.77577
4.65000 -7234.78353 -30.47534 -969.41582 372.84327 1119.57769 202132.53828
4.75000 -7115.52982 -37.95724 3875.83673 375.33799 1095.83083 205267.12165
4.85000 -6991.69869 -18.91127 1824.50260 378.48462 1056.81643 185708.16889
4.95000 -6879.77062 10.14718 -2451.28477 373.36302 1034.14678 171195.36766
5.05000 -6788.01837 16.08672 686.85333 376.87617 1014.20987 167521.96541
5.15000 -6685.90708 34.21296 2483.44482 373.18383 987.23069 170213.35974
5.25000 -6587.56389 12.94846 2749.94479 371.23967 954.89966 157077.92495
5.35000 -6488.12809 33.27148 -2489.59765 369.15589 945.80139 138824.51433
5.45000 -6387.36692 34.04687 2126.51934 359.65628 927.30573 129004.49344
5.55000 -6301.82990 30.47826 1469.36966 346.02150 912.48895 127377.40751
5.65000 -6224.31081 14.27689 2206.72426 348.32702 877.66968 158337.33013
5.75000 -6154.71994 21.72877 362.97902 341.08785 875.68998 106934.85577
5.85000 -6080.87333 39.44713 -415.38162 339.62785 863.13169 99947.72487
5.95000 -6023.94297 9.86057 608.65149 351.55566 827.52915 90051.17371
6.05000 -5976.56286 25.78202 596.56202 364.87410 809.78764 90203.74157
6.15000 -5929.22852 -0.68212 607.97755 375.71259 793.54715 77364.75013
6.25000 -5890.14985 5.67155 209.94280 392.48747 778.70496 72379.16204
6.35000 -5846.80733 24.75742 2560.46594 390.72188 767.34919 91703.85514
6.45000 -5810.94877 23.54369 -904.15627 405.62098 733.99440 63735.67984
6.55000 -5780.14891 33.77067 -529.35219 406.28915 712.09302 103140.52415
6.65000 -5760.11467 56.19869 -1797.85682 415.44240 689.68537 85855.75112
6.75000 -5744.70141 31.32877 -945.33609 427.27922 680.36582 59114.05823
6.85000 -5733.85617 49.33676 926.13970 445.66739 651.16403 51642.55835
6.95000 -5711.18534 53.13606 -887.70866 466.97865 629.53040 57243.74495
7.05000 -5700.06338 50.98084 -2812.09445 500.16909 597.58346 84264.13135
7.15000 -5681.57911 49.67145 -1088.50104 517.57444 582.09248 43792.62037
7.25000 -5654.41653 53.46569 -679.26417 536.08906 551.86074 51145.31487
7.35000 -5629.81517 53.37616 -42.26155 556.33507 526.83385 47363.68458
7.45000 -5590.16106 51.31645 -234.02627 567.19203 499.61669 43645.73724
7.55000 -5547.87423 48.54169 -484.20132 569.45607 474.27926 47105.17360
7.65000 -5508.23317 52.01064 219.60010 570.66807 453.60104 41416.43211
7.75000 -5456.52631 55.56558 42.48589 569.13708 429.26239 33814.76848
7.85000 -5387.86471 50.38832 -386.09010 552.57728 409.15860 34040.67422
7.95000 -5340.33752 48.99777 -1478.40070 537.62003 388.05104 33329.05271
8.05000 -5275.82256 55.78265 -491.56271 519.13030 368.12616 30474.44048
8.15000 -5204.64406 49.76732 -605.99565 488.94683 348.53783 31108.40288
8.25000 -5165.13857 53.35016 -691.32092 462.96289 334.27725 29727.66600
8.35000 -5101.92281 49.82745 -1189.85611 443.21067 314.82423 26046.45020
8.45000 -5062.66892 60.74503 -430.69037 424.31619 299.94521 30862.55763
8.55000 -5020.97308 49.48936 -54.06534 408.10480 291.03800 28375.88717
8.65000 -4970.62358 56.04758 -18.39140 389.09092 275.93245 26613.20795
8.75000 -4917.30651 47.30077 -352.61241 372.71987 262.46067 25499.85658
8.85000 -4876.77898 47.24393 -429.48954 358.64099 250.93506 23609.80526
8.95000 -4851.44827 45.23268 -117.87011 343.15978 241.28395 23072.24368
9.05000 -4818.71212 48.34667 -114.29011 333.54192 231.64313 22725.95354
9.15000 -4770.10672 50.47291 70.82210 321.91494 221.71663 23668.87577
9.25000 -4723.56818 39.11924 -8.67443 317.47105 209.42153 21108.03105
9.35000 -4684.77797 42.11699 387.20645 299.56766 203.56285 19799.87622
9.45000 -4648.83773 33.80352 131.56123 289.87108 195.76751 18657.26947
9.55000 -4613.60750 36.22130 130.60085 277.41262 188.20498 18386.88785
9.65000 -4573.37592 30.60303 -165.24674 264.73457 181.52549 17590.94271
9.75000 -4541.97465 33.41292 52.87582 258.03885 172.35141 21242.83370
9.85000 -4505.23281 31.82040 -225.73165 247.33201 168.34507 18259.65403
9.95000 -4470.70428 30.30641 220.01790 239.31158 159.53873 16206.08028
10.05000 -4436.95451 26.17593 221.63699 226.23093 153.47768 18556.78610
10.15000 -4400.39911 21.61096 -470.08284 215.39688 147.30251 39806.07898
10.25000 -4362.05682 19.99528 217.95809 206.53532 143.31268 13873.46310
10.35000 -4327.96940 21.37056 416.59801 199.98018 136.44931 14040.63264
10.45000 -4288.54104 22.20292 -349.23808 186.60601 133.86163 13808.43866
10.55000 -4256.20675 20.11441 -262.54712 175.22720 130.62198 14459.30412
10.65000 -4225.90017 18.34568 -1093.72131 172.94342 123.97016 55834.24794
10.75000 -4190.35527 16.86915 -346.79721 165.48707 120.67660 14132.33342
10.85000 -4158.24002 18.08592 -99.83317 156.10878 118.16084 12281.80602
10.95000 -4118.78607 15.97166 213.98320 150.04721 111.79056 12261.01864
11.05000 -4088.41230 12.25096 -38.14362 143.52180 108.38463 12128.66109
11.15000 -4055.35697 11.42675 475.18238 138.77888 106.12380 11262.76003
11.25000 -4023.71273 13.19559 396.79975 133.87597 102.49881 9574.54132
11.35000 -3984.58827 8.80579 21.46472 129.04354 98.63333 10444.28494
11.45000 -3962.70811 11.55110 270.53308 126.51541 97.60975 10025.90602
11.55000 -3927.65371 14.59867 85.54652 122.82829 94.53883 9609.08883
11.65000 -3895.30378 13.88693 110.98947 118.91236 91.16259 10547.59032
11.75000 -3866.39660 11.30926 176.04745 115.63090 88.65398 9993.46522
11.85000 -3839.36312 10.87694 298.11886 113.17347 85.09541 10290.51696
11.95000 -3808.03576 14.81108 -163.33188 110.85699 83.48301 8775.55440
12.05000 -3781.46030 11.37451 145.09565 109.01259 82.71855 8442.94224
12.15000 -3752.79994 15.19443 90.46869 107.30772 81.06568 8777.57198
12.25000 -3725.20437 16.02696 130.52921 105.28772 77.99225 10115.18953
12.35000 -3696.63051 14.25990 -390.42303 102.33432 77.30126 9444.40307
12.45000 -3665.76743 16.78619 51.74203 103.34555 74.57760 7715.90557
12.55000 -3636.20528 17.73550 228.17182 100.77261 72.43962 7665.15162
12.65000 -3601.80556 18.28574 -43.48461 97.62454 72.81072 8599.10452
12.75000 -3578.57387 16.00086 -89.25202 96.71087 71.07981 6505.77202
12.85000 -3552.89097 14.85596 78.76499 92.53727 69.32409 7228.15676
12.95000 -3522.03390 15.71260 40.46413 92.82483 67.19386 7613.03358
13.05000 -3496.04480 18.99270 117.61597 90.27766 64.21498 7819.25648
13.15000 -3472.32589 19.33430 67.79876 88.23380 65.52654 7605.80175
13.25000 -3444.78664 20.50621 15.60067 85.70442 63.12754 7450.28034
13.35000 -3419.34885 19.06831 -170.61238 87.02913 61.87828 6653.69286
13.45000 -3395.80044 18.60969 365.02189 84.80545 61.44031 7004.10734
13.55000 -3369.32707 16.44395 -100.96011 84.67467 60.78589 7025.36441
13.65000 -3346.92505 19.75196 -215.19885 82.11478 61.06783 8271.60984
13.75000 -3317.42546 18.10028 390.89006 81.99358 56.26156 5675.09649
13.85000 -3296.12107 15.97894 -211.22284 81.44180 56.49002 8220.54885
13.95000 -3274.77894 18.70948 -40.61980 79.86790 55.34293 6114.21386
14.05000 -3251.23771 16.37710 -57.18940 78.34496 56.34057 6963.21128
14.15000 -3221.63259 18.80633 234.74904 76.76319 52.40523 5633.36172
14.25000 -3201.36046 19.34888 190.44128 76.76924 53.09450 6068.31843
14.35000 -3180.37393 16.81186 -82.42700 78.17479 54.19970 5625.28497
14.45000 -3163.98254 18.72747 351.66571 78.61783 51.41283 7409.52259
14.55000 -3139.70586 17.65952 250.53330 78.49209 50.14169 6199.10769
14.65000 -3113.79745 17.92968 124.18098 75.45679 47.90306 4572.35103
14.75000 -3092.29459 16.22726 -81.31129 76.78038 46.70701 4773.52432
14.85000 -3069.18839 17.89238 157.09659 73.59654 47.80924 5026.73040
14.95000 -3044.28483 17.48710 43.99298 73.29316 44.76340 4798.02473
15.05000 -3021.40785 16.52141 160.22347 71.40085 44.16228 4482.83342
15.15000 -3009.04613 18.53006 333.53221 68.13104 45.61027 6671.08511
15.25000 -2987.94521 16.46798 88.39730 70.96884 44.21166 5175.99061
15.35000 -2966.08665 17.22490 -4.15651 69.18471 43.89201 5209.46912
15.45000 -2947.43431 16.36602 199.84222 68.90256 42.34980 4330.00950
15.55000 -2928.94430 17.34096 -95.33640 67.51973 41.34811 5103.01938
15.65000 -2908.82646 16.44436 -217.39736 66.36178 42.02672 6190.60712
15.75000 -2889.31962 17.91547 -7.33050 63.24175 39.90770 4889.46296
15.85000 -2874.94827 15.35900 17.44494 63.12559 41.36777 4174.88157
15.95000 -2855.95473 16.98518 -143.38953 61.14652 38.64825 5245.77734
16.05000 -2835.34558 14.03498 -74.22407 59.06409 39.71657 5078.29634
16.15000 -2821.51927 16.07019 -40.24121 57.45443 39.27544 3786.86796
16.25000 -2802.77252 14.98974 52.67148 57.87291 39.14414 3865.86042
16.35000 -2783.55470 14.59288 -2.56704 54.31285 39.63989 4611.51867
16.45000 -2769.86526 14.76101 -48.63531 52.38966 36.95225 3860.97726
16.55000 -2753.12180 13.96495 90.48272 50.19170 36.81052 3536.17074
16.65000 -2736.09854 13.91449 -87.49427 47.36466 35.42445 4198.31986
16.75000 -2720.39757 11.01697 -137.40423 46.25757 34.90008 4146.86433
16.85000 -2704.96082 13.01089 -20.58922 45.49381 35.80982 3913.86999
16.95000 -2686.52316 12.39700 -21.78609 45.41914 37.00505 4565.01768
17.05000 -2676.14235 12.47805 48.00631 42.69908 35.74540 3318.54354
17.15000 -2657.06056 12.44472 183.67608 42.41244 34.46702 3762.79245
17.25000 -2641.50503 12.31040 36.99549 43.87115 34.39494 3715.10379
17.35000 -2626.87876 9.57457 -267.19497 42.86044 34.24462 3936.95215
17.45000 -2614.00677 9.17143 -94.26451 41.90633 34.25012 3394.58983
17.55000 -2602.15298 9.73452 -1.46068 40.48286 32.69778 2446.92518
17.65000 -2588.94299 12.82045 18.22270 41.63564 33.77907 3198.18009
17.75000 -2570.67714 11.85888 10.15879 40.56317 34.01052 3243.45677
17.85000 -2557.92803 10.55025 79.31945 39.19265 33.32585 2761.93308
17.95000 -2542.20602 8.36024 -55.60678 37.81784 31.96797 2743.05250
18.05000 -2528.60631 10.66663 -54.55311 36.73615 33.07148 1968.80855
18.15000 -2515.69217 10.20725 -128.20951 35.82042 32.41440 2728.38446
18.25000 -2501.97840 12.18898 -59.17568 37.39648 32.38495 2139.04405
18.35000 -2489.34321 9.77618 -40.01195 34.56125 32.72197 2330.46853
18.45000 -2475.14979 11.33109 -187.98800 34.76778 30.75062 2685.06178
18.55000 -2462.92154 10.18929 -71.46536 34.49125 31.70328 2525.84177
18.65000 -2448.25355 8.78821 -99.83981 35.87642 31.65265 2063.62418
18.75000 -2434.14614 10.14303 7.50235 33.82512 30.41468 2512.99342
18.85000 -2418.23450 9.09896 -54.95097 35.11275 28.58703 2060.66198
18.95000 -2401.72417 10.19515 -230.06837 33.49890 29.16931 2621.02234
19.05000 -2391.39952 9.11180 -82.29150 33.19092 30.90286 1661.42185
19.15000 -2374.82141 7.75463 32.02359 32.42397 30.58869 1552.18307
19.25000 -2361.28100 10.16327 -58.41514 30.51659 29.71636 1940.40475
19.35000 -2346.46148 8.62527 -83.20265 32.19418 29.06066 2269.00405
19.45000 -2332.63348 9.68568 121.26330 34.01414 30.22388 2390.77276
19.55000 -2318.34993 11.39150 175.07080 31.92124 29.38327 2297.78778
19.65000 -2307.41492 8.52366 -52.86755 31.57754 29.69917 1372.03695
19.75000 -2292.92840 8.90716 -230.00859 33.11415 28.75834 2475.37932
19.85000 -2280.52648 9.29210 -19.24728 31.48580 27.63454 1847.89670
19.95000 -2265.05225 7.20178 -39.87692 30.85619 28.13937 1785.44896
