0.05000 59083.57460
0.15000 38614.83799
0.25000 38405.95581
0.35000 32659.74590
0.45000 28452.98351
0.55000 24850.41965
0.65000 21363.87508
0.75000 18614.60966
0.85000 16798.76114
0.95000 14437.43266
1.05000 13649.33203
1.15000 12031.15878
1.25000 11266.00577
1.35000 10503.75498
1.45000 9581.39029
1.55000 8909.96589
1.65000 8244.21889
1.75000 7875.45110
1.85000 7426.06507
1.95000 6923.44408
2.05000 6607.15168
2.15000 6447.86806
2.25000 5931.77516
2.35000 6026.80972
2.45000 5410.00877
2.55000 5147.53037
2.65000 5014.67141
2.75000 4674.51090
2.85000 4576.64597
2.95000 4430.85816
3.05000 4367.99107
3.15000 4024.58995
3.25000 3875.89909
3.35000 3695.84468
3.45000 3562.91722
3.55000 3417.82369
3.65000 3269.19839
3.75000 3238.09043
3.85000 3108.54670
3.95000 3030.01042
4.05000 2873.98076
4.15000 2789.02217
4.25000 2832.21707
4.35000 2600.57892
4.45000 2553.88305
4.55000 2500.29239
4.65000 2462.56102
4.75000 2348.89431
4.85000 2321.76229
4.95000 2283.45159
5.05000 2226.24232
5.15000 2142.54162
5.25000 2108.30418
5.35000 2067.03630
5.45000 2022.46153
5.55000 1948.06645
5.65000 1906.51513
5.75000 1858.31116
5.85000 1778.36432
5.95000 1765.69050
6.05000 1735.35449
6.15000 1690.66555
6.25000 1642.21645
6.35000 1611.76990
6.45000 1574.90416
6.55000 1580.91732
6.65000 1492.00946
6.75000 1491.86472
6.85000 1461.57736
6.95000 1385.12365
7.05000 1403.20294
7.15000 1388.29047
7.25000 1322.29425
7.35000 1282.88884
7.45000 1213.81842
7.55000 1241.00133
7.65000 1166.95447
7.75000 1218.42851
7.85000 1153.71435
7.95000 1251.78372
8.05000 1082.33432
8.15000 1062.79122
8.25000 1055.60300
8.35000 1007.76705
8.45000 981.59196
8.55000 970.72842
8.65000 981.03356
8.75000 987.12309
8.85000 932.08734
8.95000 912.81574
9.05000 879.77272
9.15000 843.80111
9.25000 862.61133
9.35000 855.05780
9.45000 814.29282
9.55000 829.64757
9.65000 786.72019
9.75000 782.45848
9.85000 782.52157
9.95000 752.62759
10.05000 730.95537
10.15000 703.16079
10.25000 705.41106
10.35000 710.46133
10.45000 682.95143
10.55000 673.49848
10.65000 690.28832
10.75000 646.41775
10.85000 614.21831
10.95000 606.17255
11.05000 627.37749
11.15000 609.71995
11.25000 600.09433
11.35000 581.95610
11.45000 598.09975
11.55000 566.46315
11.65000 551.12082
11.75000 538.75775
11.85000 513.30115
11.95000 537.98290
12.05000 529.25092
12.15000 488.56767
12.25000 499.29647
12.35000 478.66907
12.45000 474.81016
12.55000 447.69865
12.65000 439.06917
12.75000 431.10244
12.85000 447.56131
12.95000 456.55503
13.05000 442.07122
13.15000 408.79998
13.25000 433.63901
13.35000 408.08732
13.45000 396.58083
13.55000 405.77272
13.65000 371.25530
13.75000 359.33311
13.85000 354.53273
13.95000 412.22366
14.05000 362.40181
14.15000 339.89337
14.25000 346.59450
14.35000 333.26270
14.45000 354.50588
14.55000 324.36717
14.65000 301.75442
14.75000 315.39764
14.85000 319.22647
14.95000 304.42007
15.05000 323.27348
15.15000 303.67196
15.25000 281.69552
15.35000 276.35034
15.45000 286.57368
15.55000 279.79387
15.65000 285.52582
15.75000 268.69996
15.85000 255.17674
15.95000 257.57426
16.05000 251.13330
16.15000 266.37015
16.25000 238.88975
16.35000 293.76713
16.45000 259.04882
16.55000 231.40455
16.65000 237.92858
16.75000 217.80502
16.85000 229.55327
16.95000 213.83828
17.05000 214.82849
17.15000 212.14766
17.25000 215.27543
17.35000 207.73166
17.45000 232.94708
17.55000 210.81141
17.65000 199.00335
17.75000 198.07789
17.85000 210.22948
17.95000 201.09761
18.05000 203.69147
18.15000 196.79592
18.25000 188.59053
18.35000 198.14806
18.45000 193.78211
18.55000 185.63641
18.65000 189.62466
18.75000 181.25446
18.85000 170.04273
18.95000 174.49834
19.05000 196.11925
19.15000 171.66502
19.25000 171.22517
19.35000 166.77770
19.45000 165.79482
19.55000 180.63654
19.65000 165.01570
19.75000 155.61500
19.85000 147.56113
19.95000 152.67479
