0.05000 771.26175
0.15000 1308.08899
0.25000 1927.31410
0.35000 2635.25772
0.45000 3038.05315
0.55000 3459.43065
0.65000 3926.36446
0.75000 4154.97295
0.85000 4363.99961
0.95000 4526.70178
1.05000 4533.09630
1.15000 4654.49060
1.25000 4686.65991
1.35000 4621.60972
1.45000 4592.18337
1.55000 4491.62418
1.65000 4475.46205
1.75000 4358.48519
1.85000 4275.76030
1.95000 4229.51583
2.05000 4104.01966
2.15000 4101.50675
2.25000 3964.23010
2.35000 3966.79301
2.45000 3827.05965
2.55000 3810.13334
2.65000 3680.55250
2.75000 3642.82688
2.85000 3521.62976
2.95000 3470.45913
3.05000 3379.86504
3.15000 3331.09365
3.25000 3255.67576
3.35000 3171.27858
3.45000 3086.17293
3.55000 3043.57630
3.65000 2968.82140
3.75000 2918.26004
3.85000 2801.49047
3.95000 2757.18277
4.05000 2687.97099
4.15000 2648.25105
4.25000 2535.68476
4.35000 2498.58128
4.45000 2453.99682
4.55000 2362.24846
4.65000 2303.26714
4.75000 2250.51339
4.85000 2218.94122
4.95000 2140.03935
5.05000 2103.54728
5.15000 2045.96811
5.25000 2019.51342
5.35000 1955.87537
5.45000 1900.42494
5.55000 1870.01829
5.65000 1825.75079
5.75000 1833.70083
5.85000 1745.81374
5.95000 1688.22750
6.05000 1676.77505
6.15000 1664.16961
6.25000 1601.55172
6.35000 1556.65178
6.45000 1512.81558
6.55000 1495.32601
6.65000 1465.48327
6.75000 1426.64065
6.85000 1406.70214
6.95000 1386.47884
7.05000 1337.02073
7.15000 1318.20398
7.25000 1289.16144
7.35000 1265.83630
7.45000 1235.84362
7.55000 1189.47700
7.65000 1177.33864
7.75000 1166.00515
7.85000 1123.04577
7.95000 1087.73021
8.05000 1082.59107
8.15000 1058.85708
8.25000 1028.09769
8.35000 1028.91516
8.45000 979.70509
8.55000 978.16870
8.65000 953.98054
8.75000 924.29749
8.85000 918.21837
8.95000 894.85725
9.05000 875.65264
9.15000 855.19872
9.25000 829.80949
9.35000 813.42885
9.45000 799.89352
9.55000 779.83115
9.65000 764.31100
9.75000 745.10077
9.85000 746.98450
9.95000 722.79509
10.05000 703.63387
10.15000 696.80536
10.25000 683.78613
10.35000 666.65412
10.45000 657.82900
10.55000 637.43242
10.65000 617.96117
10.75000 625.70401
10.85000 582.93737
10.95000 591.49331
11.05000 568.83876
11.15000 568.97846
11.25000 547.81626
11.35000 540.19037
11.45000 523.93216
11.55000 514.20206
11.65000 499.09465
11.75000 489.43639
11.85000 482.29307
11.95000 480.63498
12.05000 457.90037
12.15000 454.24033
12.25000 440.85457
12.35000 442.69373
12.45000 425.50963
12.55000 421.91500
12.65000 404.87312
12.75000 402.93087
12.85000 400.02110
12.95000 388.45150
13.05000 384.12783
13.15000 377.38679
13.25000 368.83416
13.35000 357.97993
13.45000 349.93767
13.55000 350.72076
13.65000 346.31832
13.75000 337.63581
13.85000 329.64934
13.95000 322.83562
14.05000 322.14136
14.15000 310.94498
14.25000 306.41992
14.35000 296.59988
14.45000 295.65360
14.55000 281.49610
14.65000 283.01496
14.75000 277.62376
14.85000 269.99221
14.95000 266.72147
15.05000 260.84666
15.15000 261.96558
15.25000 255.37657
15.35000 249.16552
15.45000 245.15056
15.55000 236.18198
15.65000 227.51366
15.75000 230.55673
15.85000 233.08627
15.95000 228.75494
16.05000 225.75858
16.15000 219.06076
16.25000 210.08834
16.35000 202.78430
16.45000 194.39378
16.55000 200.28891
16.65000 198.72992
16.75000 195.47135
16.85000 190.73046
16.95000 188.78144
17.05000 182.56417
17.15000 184.35535
17.25000 176.45684
17.35000 175.54887
17.45000 171.08580
17.55000 166.50076
17.65000 163.72902
17.75000 161.92935
17.85000 154.89817
17.95000 152.58743
18.05000 153.99894
18.15000 149.97712
18.25000 142.58324
18.35000 147.50748
18.45000 144.92497
18.55000 138.09686
18.65000 143.53415
18.75000 138.02141
18.85000 134.62135
18.95000 140.02297
19.05000 131.25989
19.15000 127.92081
19.25000 129.75557
19.35000 123.94333
19.45000 122.62689
19.55000 125.01445
19.65000 119.05398
19.75000 117.11267
19.85000 116.20769
19.95000 109.01393
