0.05000 1787.81680
0.15000 2953.19158
0.25000 4073.36079
0.35000 5009.59725
0.45000 5775.30255
0.55000 6262.43822
0.65000 6819.73153
0.75000 7182.84329
0.85000 7311.08179
0.95000 7447.76327
1.05000 7521.45940
1.15000 7539.44228
1.25000 7403.70063
1.35000 7374.20873
1.45000 7086.55402
1.55000 6981.07683
1.65000 6867.75136
1.75000 6635.99117
1.85000 6397.21975
1.95000 6218.86381
2.05000 5999.84053
2.15000 5864.10270
2.25000 5681.75425
2.35000 5487.38339
2.45000 5296.93361
2.55000 5088.14146
2.65000 4918.23403
2.75000 4709.63070
2.85000 4526.07087
2.95000 4401.40649
3.05000 4301.47703
3.15000 4067.84977
3.25000 3946.24486
3.35000 3829.71706
3.45000 3696.50522
3.55000 3595.79693
3.65000 3502.16925
3.75000 3386.52049
3.85000 3311.95873
3.95000 3189.02184
4.05000 3078.33348
4.15000 2918.87028
4.25000 2831.87173
4.35000 2793.46346
4.45000 2691.39540
4.55000 2581.59786
4.65000 2508.01292
4.75000 2438.78826
4.85000 2359.21656
4.95000 2272.96441
5.05000 2188.06597
5.15000 2105.70904
5.25000 2020.16545
5.35000 1974.26067
5.45000 1889.85394
5.55000 1831.75260
5.65000 1772.68755
5.75000 1702.73813
5.85000 1684.26748
5.95000 1622.27486
6.05000 1583.23626
6.15000 1539.62375
6.25000 1446.47107
6.35000 1476.25905
6.45000 1399.94799
6.55000 1400.90408
6.65000 1316.34363
6.75000 1339.48244
6.85000 1288.05026
6.95000 1257.91915
7.05000 1223.79431
7.15000 1213.34596
7.25000 1173.04246
7.35000 1130.40903
7.45000 1131.82517
7.55000 1096.93114
7.65000 1074.94403
7.75000 1042.62564
7.85000 1043.43817
7.95000 1028.18986
8.05000 986.87321
8.15000 989.93458
8.25000 962.06346
8.35000 942.05752
8.45000 936.32161
8.55000 917.88420
8.65000 912.60498
8.75000 891.04319
8.85000 879.63610
8.95000 858.89625
9.05000 842.00929
9.15000 826.21464
9.25000 815.75410
9.35000 803.87784
9.45000 794.04828
9.55000 783.44699
9.65000 764.54747
9.75000 749.84096
9.85000 747.74929
9.95000 728.19446
10.05000 720.49675
10.15000 709.83763
10.25000 697.49171
10.35000 675.56822
10.45000 662.43641
10.55000 657.54770
10.65000 649.97598
10.75000 640.25177
10.85000 616.88541
10.95000 600.97575
11.05000 590.80515
11.15000 579.18621
11.25000 562.69042
11.35000 571.02146
11.45000 536.32390
11.55000 533.26269
11.65000 529.39922
11.75000 515.28592
11.85000 507.74736
11.95000 497.16534
12.05000 482.22883
12.15000 467.71435
12.25000 460.82129
12.35000 462.71937
12.45000 442.54699
12.55000 433.88144
12.65000 423.75220
12.75000 425.09328
12.85000 415.87001
12.95000 399.42712
13.05000 401.73115
13.15000 385.02627
13.25000 369.39985
13.35000 371.22810
13.45000 371.67702
13.55000 360.19645
13.65000 344.33601
13.75000 353.84772
13.85000 332.29864
13.95000 331.06193
14.05000 322.31276
14.15000 317.27616
14.25000 315.37435
14.35000 309.89606
14.45000 295.12678
14.55000 303.38133
14.65000 296.64471
14.75000 294.65450
14.85000 285.86255
14.95000 283.65154
15.05000 278.46876
15.15000 281.70582
15.25000 264.79550
15.35000 261.75352
15.45000 267.13544
15.55000 262.86225
15.65000 254.39312
15.75000 252.15420
15.85000 247.88822
15.95000 246.62976
16.05000 243.74837
16.15000 239.96976
16.25000 237.84419
16.35000 227.80837
16.45000 227.21016
16.55000 227.35862
16.65000 224.07665
16.75000 212.76080
16.85000 213.19852
16.95000 209.66228
17.05000 204.07891
17.15000 196.71934
17.25000 192.82243
17.35000 197.85161
17.45000 195.09935
17.55000 189.77855
17.65000 193.34301
17.75000 179.15190
17.85000 177.00535
17.95000 171.63451
18.05000 179.32586
18.15000 171.46851
18.25000 166.40522
18.35000 161.48868
18.45000 158.50949
18.55000 157.79742
18.65000 157.84175
18.75000 151.99199
18.85000 151.91052
18.95000 146.82228
19.05000 146.21609
19.15000 144.87958
19.25000 137.95513
19.35000 127.33640
19.45000 139.91176
19.55000 132.20932
19.65000 130.52986
19.75000 126.36346
19.85000 126.20170
19.95000 127.57114
