0.10101 0.07194 0.08092
0.30303 0.06307 0.06382
0.50505 0.05494 0.04716
0.70707 0.04926 0.03684
0.90909 0.04417 0.02851
1.11111 0.03945 0.02259
1.31313 0.03769 0.01853
1.51515 0.03523 0.01530
1.71717 0.03274 0.01295
1.91919 0.03042 0.01080
2.12121 0.02822 0.00909
2.32323 0.02685 0.00783
2.52525 0.02525 0.00682
2.72727 0.02415 0.00604
2.92929 0.02268 0.00527
3.13131 0.02150 0.00464
3.33333 0.02035 0.00417
3.53535 0.01915 0.00368
3.73737 0.01862 0.00336
3.93939 0.01714 0.00298
4.14141 0.01605 0.00265
4.34343 0.01561 0.00242
4.54545 0.01471 0.00218
4.74747 0.01430 0.00204
4.94949 0.01360 0.00185
5.15152 0.01310 0.00173
5.35354 0.01244 0.00157
5.55556 0.01193 0.00145
5.75758 0.01157 0.00136
5.95960 0.01103 0.00125
6.16162 0.01040 0.00114
6.36364 0.00995 0.00106
6.56566 0.00957 0.00098
6.76768 0.00907 0.00090
6.96970 0.00869 0.00084
7.17172 0.00821 0.00077
7.37374 0.00771 0.00070
7.57576 0.00730 0.00065
7.77778 0.00698 0.00060
7.97980 0.00674 0.00057
8.18182 0.00620 0.00051
8.38384 0.00593 0.00048
8.58586 0.00556 0.00044
8.78788 0.00518 0.00040
8.98990 0.00495 0.00037
9.19192 0.00468 0.00034
9.39394 0.00440 0.00031
9.59596 0.00413 0.00029
9.79798 0.00387 0.00026
10.00000 0.00366 0.00025
10.20202 0.00350 0.00023
10.40404 0.00341 0.00022
10.60606 0.00324 0.00020
10.80808 0.00307 0.00019
11.01010 0.00297 0.00018
11.21212 0.00286 0.00017
11.41414 0.00272 0.00016
11.61616 0.00252 0.00015
11.81818 0.00234 0.00013
12.02020 0.00223 0.00012
12.22222 0.00214 0.00012
12.42424 0.00199 0.00011
12.62626 0.00190 0.00010
12.82828 0.00176 0.00009
13.03030 0.00170 0.00009
13.23232 0.00160 0.00008
13.43434 0.00151 0.00008
13.63636 0.00145 0.00007
13.83838 0.00138 0.00007
14.04040 0.00130 0.00006
14.24242 0.00125 0.00006
14.44444 0.00118 0.00006
14.64646 0.00122 0.00006
14.84848 0.00117 0.00005
15.05051 0.00107 0.00005
15.25253 0.00106 0.00005
15.45455 0.00099 0.00004
15.65657 0.00091 0.00004
15.85859 0.00092 0.00004
16.06061 0.00085 0.00004
16.26263 0.00078 0.00003
16.46465 0.00075 0.00003
16.66667 0.00068 0.00003
16.86869 0.00067 0.00003
17.07071 0.00062 0.00002
17.27273 0.00060 0.00002
17.47475 0.00057 0.00002
17.67677 0.00056 0.00002
17.87879 0.00050 0.00002
18.08081 0.00048 0.00002
18.28283 0.00046 0.00002
18.48485 0.00044 0.00002
18.68687 0.00042 0.00001
18.88889 0.00041 0.00001
19.09091 0.00039 0.00001
19.29293 0.00037 0.00001
19.49495 0.00036 0.00001
19.69697 0.00031 0.00001
19.89899 0.00029 0.00001
