0.12500 0.04483
0.37500 0.00751
0.62500 0.00899
0.87500 0.00184
1.12500 0.00230
1.37500 0.02811
1.62500 0.05651
1.87500 0.06277
2.12500 0.07159
2.37500 0.09209
2.62500 0.10976
2.87500 0.11087
3.12500 0.10974
3.37500 0.12072
3.62500 0.11266
3.87500 0.10307
4.12500 0.11588
4.37500 0.09685
4.62500 0.08847
4.87500 0.07039
5.12500 0.07756
5.37500 0.04831
5.62500 0.04517
5.87500 0.03065
6.12500 0.02290
6.37500 0.00402
6.62500 0.02005
6.87500 0.01940
7.12500 0.01864
7.37500 0.03598
7.62500 0.02755
7.87500 0.03757
8.12500 0.01902
8.37500 0.01839
8.62500 0.02265
8.87500 0.00687
9.12500 0.02321
9.37500 0.00380
9.62500 0.01523
9.87500 0.00315
10.12500 0.00226
10.37500 0.01254
10.62500 0.01313
10.87500 0.02482
11.12500 0.02667
11.37500 0.03255
11.62500 0.02184
11.87500 0.00675
12.12500 0.02189
12.37500 0.01903
12.62500 0.00499
12.87500 0.01513
13.12500 0.03398
13.37500 0.02149
13.62500 0.02761
13.87500 0.04389
14.12500 0.02839
14.37500 0.02511
14.62500 0.02930
14.87500 0.03906
