0.120000 0.419820
0.380000 0.128000
0.620000 -0.478030
0.880000 -0.550620
1.120000 -0.626490
1.380000 -0.669920
1.620000 -0.734520
1.880000 -0.802240
2.120000 -0.873260
2.380000 -0.869020
2.620000 -0.950960
2.880000 -1.072790
3.120000 -1.186190
3.380000 -1.082850
3.620000 -1.205490
3.880000 -1.124150
4.120000 -1.208480
4.380000 -1.274390
4.620000 -1.218580
4.880000 -1.580620
5.120000 -1.457330
5.380000 -1.791600
5.620000 -1.690910
5.880000 -2.151580
6.120000 -2.054180
6.380000 -1.838320
6.620000 -1.998100
6.880000 -2.126850
7.120000 -2.101650
7.380000 -2.699900
7.620000 2.990700
7.880000 -0.728300
8.120000 2.984160
8.380000 -2.610840
8.620000 -2.005640
8.880000 -2.094020
9.120000 -1.994750
9.380000 -2.016090
9.620000 -0.803240
9.880000 -2.689410
10.120000 -2.783260
10.380000 -2.267970
10.620000 3.092140
10.880000 2.404390
11.120000 2.498800
11.380000 2.568420
11.620000 2.134230
11.880000 2.038220
12.120000 2.135970
12.380000 1.880120
12.620000 1.571070
12.880000 1.806220
13.120000 1.756440
13.380000 1.551910
13.620000 -2.777530
13.880000 -0.012950
14.120000 2.156270
14.380000 2.824530
14.620000 -1.553930
14.880000 -2.555200
15.120000 2.252660
15.380000 2.935810
15.620000 1.341290
15.880000 1.274470
16.120000 2.152620
16.380000 0.698640
16.620000 0.957480
16.880000 0.762290
17.120000 0.584880
17.380000 0.249890
17.620000 0.099430
17.880000 -0.033320
18.120000 -0.302450
18.380000 -0.060450
18.620000 -1.841630
18.880000 -1.936840
19.120000 -2.838790
19.380000 -2.419260
19.620000 -2.638020
19.880000 -2.659050
