0.05000 1371.04532
0.15000 2738.44095
0.25000 4349.19080
0.35000 5429.46013
0.45000 6552.93266
0.55000 7225.50056
0.65000 7849.18247
0.75000 8201.64510
0.85000 8089.69904
0.95000 8183.40415
1.05000 8267.97474
1.15000 7953.99370
1.25000 7782.62950
1.35000 7682.19176
1.45000 7496.93172
1.55000 7301.95806
1.65000 6987.32659
1.75000 6788.08629
1.85000 6581.68162
1.95000 6424.73715
2.05000 6125.57143
2.15000 6018.76014
2.25000 5767.58106
2.35000 5582.72747
2.45000 5381.78486
2.55000 5154.33988
2.65000 4982.38128
2.75000 4848.73570
2.85000 4739.05258
2.95000 4502.03361
3.05000 4440.67932
3.15000 4276.65664
3.25000 4150.90745
3.35000 3981.64639
3.45000 3916.84800
3.55000 3818.25420
3.65000 3682.31321
3.75000 3544.33527
3.85000 3454.95683
3.95000 3298.78781
4.05000 3220.35387
4.15000 3118.91011
4.25000 3015.46076
4.35000 2931.86251
4.45000 2850.36143
4.55000 2796.76164
4.65000 2689.74440
4.75000 2600.76271
4.85000 2515.72146
4.95000 2429.15721
5.05000 2375.34632
5.15000 2304.96694
5.25000 2216.13027
5.35000 2190.62066
5.45000 2081.55109
5.55000 2046.19343
5.65000 1986.18692
5.75000 1941.92037
5.85000 1867.35183
5.95000 1781.10225
6.05000 1757.64666
6.15000 1637.09505
6.25000 1602.01188
6.35000 1550.32370
6.45000 1503.47138
6.55000 1467.40890
6.65000 1408.91111
6.75000 1367.47900
6.85000 1343.54930
6.95000 1302.17498
7.05000 1288.49785
7.15000 1256.19506
7.25000 1204.70935
7.35000 1196.72754
7.45000 1155.98634
7.55000 1161.40203
7.65000 1123.84740
7.75000 1127.30700
7.85000 1098.15159
7.95000 1059.13250
8.05000 1052.52111
8.15000 1033.80307
8.25000 1002.17708
8.35000 996.34745
8.45000 981.42219
8.55000 950.21515
8.65000 938.55787
8.75000 908.98261
8.85000 894.69728
8.95000 882.23606
9.05000 869.55898
9.15000 845.15736
9.25000 841.62821
9.35000 803.01336
9.45000 784.29909
9.55000 784.91924
9.65000 765.77731
9.75000 760.64728
9.85000 731.31150
9.95000 723.91603
10.05000 695.02235
10.15000 697.79881
10.25000 677.54267
10.35000 662.60535
10.45000 660.22973
10.55000 634.76624
10.65000 616.17501
10.75000 612.30634
10.85000 585.95736
10.95000 588.05568
11.05000 584.37896
11.15000 568.01153
11.25000 545.22464
11.35000 541.63412
11.45000 522.62010
11.55000 509.55974
11.65000 495.11829
11.75000 504.33182
11.85000 483.12905
11.95000 475.81357
12.05000 455.11461
12.15000 444.50202
12.25000 443.41522
12.35000 434.49960
12.45000 430.53309
12.55000 426.12729
12.65000 410.28897
12.75000 402.05936
12.85000 389.77984
12.95000 384.77575
13.05000 384.00334
13.15000 374.56356
13.25000 367.72890
13.35000 366.84744
13.45000 351.26809
13.55000 345.11752
13.65000 345.40926
13.75000 332.09346
13.85000 329.38311
13.95000 325.89413
14.05000 316.41390
14.15000 311.86900
14.25000 296.42808
14.35000 303.08759
14.45000 298.08261
14.55000 291.61734
14.65000 288.26549
14.75000 297.73245
14.85000 280.17142
14.95000 286.82507
15.05000 273.69917
15.15000 273.23068
15.25000 264.21903
15.35000 269.75547
15.45000 260.74878
15.55000 261.52312
15.65000 252.64782
15.75000 251.14351
15.85000 245.85060
15.95000 251.31190
16.05000 235.76796
16.15000 239.67859
16.25000 238.39620
16.35000 233.68210
16.45000 223.75888
16.55000 229.87278
16.65000 229.48322
16.75000 212.04294
16.85000 218.73722
16.95000 210.98387
17.05000 208.24182
17.15000 209.58752
17.25000 210.45019
17.35000 194.96309
17.45000 197.01841
17.55000 189.23464
17.65000 186.49579
17.75000 180.65148
17.85000 181.13826
17.95000 179.03338
18.05000 179.96280
18.15000 171.98780
18.25000 169.57031
18.35000 166.88001
18.45000 164.86700
18.55000 161.67742
18.65000 156.47589
18.75000 151.54454
18.85000 155.69726
18.95000 145.87246
19.05000 143.97967
19.15000 140.59510
19.25000 146.37793
19.35000 138.51317
19.45000 132.73037
19.55000 135.85913
19.65000 135.50830
19.75000 127.37144
19.85000 126.17005
19.95000 129.98350
