0.05000 -1925.44416 372.99026 -276.68271 2375.44279 2870.18252 4724.86852
0.15000 -3318.20906 24.03400 -889.99830 2470.30589 2178.43547 4493.76319
0.25000 -5219.92042 16.48490 -157.61271 3139.24162 3547.14880 6184.73582
0.35000 -6179.18954 -12.42005 49.76085 2961.30576 2276.47479 6804.41989
0.45000 -6845.90902 79.08297 77.88630 2641.63971 2462.62833 7633.69191
0.55000 -7213.08693 8.39810 -103.09357 2504.24261 1740.62548 7590.91687
0.65000 -7366.34758 23.45819 84.45118 2363.02514 1607.56089 7908.13950
0.75000 -7548.81652 8.90536 -204.52832 2511.30146 1624.60982 8015.45552
0.85000 -7707.85843 14.24922 20.70109 2184.29384 1540.23385 7586.13458
0.95000 -7803.11924 1.97117 200.63903 2255.95053 1247.50590 7555.03413
1.05000 -7769.09088 14.04833 116.75642 2074.64300 1139.00179 7401.64079
1.15000 -7839.20245 47.49480 194.53985 1925.97280 1317.99918 7210.28809
1.25000 -7825.19800 12.03444 195.52307 1965.79409 1451.02176 7141.49229
1.35000 -7746.35893 38.85275 58.62919 1785.79899 990.51730 6807.85110
1.45000 -7708.85766 21.22371 32.81625 1664.04093 953.89647 6678.78687
1.55000 -7700.60619 7.51281 49.01137 1663.08941 954.76156 6408.88883
1.65000 -7745.09174 20.23052 50.46010 1518.89944 1128.03896 6180.11776
1.75000 -7728.90363 13.02441 24.80735 1507.59186 888.06287 5975.53328
1.85000 -7714.30592 -5.31993 -11.19054 1433.60308 909.92963 5807.50893
1.95000 -7748.87602 18.78667 -40.20165 1327.04067 1059.24029 5615.87632
2.05000 -7741.86014 2.80787 -46.32339 1278.22697 894.30245 5437.80045
2.15000 -7701.40554 -9.40438 -37.83977 1258.26583 936.87467 5280.55485
2.25000 -7685.66263 1.59678 52.71188 1213.48954 805.48654 5088.96748
2.35000 -7663.60261 -7.03073 -96.22710 1103.97551 853.07402 4962.46940
2.45000 -7633.94884 20.30398 -43.01008 1099.30998 840.13675 4789.41860
2.55000 -7642.59062 0.27311 -15.16071 1067.91886 784.68538 4633.47900
2.65000 -7604.73652 16.50914 35.66524 1036.25624 756.98320 4506.74685
2.75000 -7568.65610 7.78303 13.67041 944.04790 708.51430 4410.70089
2.85000 -7532.12228 4.41142 -58.33231 957.58935 651.88822 4279.29535
2.95000 -7510.91335 18.63085 43.31799 953.11630 667.95381 4130.19003
3.05000 -7479.80779 4.46655 5.32270 888.56964 638.79869 4045.71640
3.15000 -7444.83862 5.28410 -71.42833 857.62433 610.21814 3952.81286
3.25000 -7394.97296 15.49896 13.43994 850.16320 597.91052 3849.21625
3.35000 -7363.08042 15.41874 13.01194 814.84957 655.94805 3736.17772
3.45000 -7322.60944 17.51567 -80.53829 811.01376 626.06177 3616.37447
3.55000 -7289.33765 20.76193 -11.31198 753.07680 607.26650 3520.93169
3.65000 -7257.32235 11.71175 34.36266 856.79195 552.24053 3513.77119
3.75000 -7207.92674 25.94197 -17.01237 864.78684 576.28682 3351.89127
3.85000 -7172.37444 15.04491 -65.46992 699.34281 519.20468 3278.19604
3.95000 -7130.11814 13.84030 -83.19929 666.75525 457.46478 3205.34463
4.05000 -7076.73619 12.99019 -47.87191 681.79460 545.73761 3133.20178
4.15000 -7045.61991 8.08181 -16.85757 628.05244 458.94307 3024.71916
4.25000 -6998.49199 21.04476 -13.37433 619.91687 399.02112 2932.53459
4.35000 -6949.60927 21.14374 -16.62306 651.32093 512.47173 2903.50613
4.45000 -6937.13353 19.99118 -32.45073 597.08731 406.67964 2799.77935
4.55000 -6863.86706 18.75977 45.24905 604.93413 423.20103 2763.80335
4.65000 -6838.62120 21.61464 -51.42594 521.38976 370.33956 2672.36383
4.75000 -6784.15526 10.76754 -64.49546 602.28387 431.73937 2620.89107
4.85000 -6749.12502 12.23885 6.04987 573.29477 516.54842 2552.61945
4.95000 -6717.21989 8.88565 0.27285 529.98766 436.14063 2473.40588
5.05000 -6655.05003 18.04898 -54.42914 664.15238 420.80539 2448.23987
5.15000 -6636.28990 18.37433 -35.68888 507.80139 331.14350 2378.59041
5.25000 -6595.63001 20.65079 8.40832 509.40842 347.73156 2320.22113
5.35000 -6539.66775 16.93801 -18.41000 444.82768 312.90135 2280.53745
5.45000 -6485.71895 19.18837 -12.52520 494.27910 384.09782 2230.09875
5.55000 -6437.27379 8.70933 -18.26635 427.76594 321.46595 2160.04758
5.65000 -6397.78404 12.39604 9.40269 417.21862 346.47136 2084.56325
5.75000 -6351.35281 13.90191 -46.58682 461.61458 336.10321 2058.04717
5.85000 -6288.76377 12.86710 -42.54681 476.68899 359.93563 2036.80229
5.95000 -6249.09326 9.11571 -1.93693 414.56858 363.87793 1982.09372
6.05000 -6209.71793 10.77877 -36.59399 424.44781 351.27953 1950.74992
6.15000 -6162.19352 10.51619 -14.81624 362.11416 345.14693 1897.95584
6.25000 -6126.00199 12.71368 9.67319 446.57680 382.25724 1849.25785
6.35000 -6061.80454 -5.07837 -4.82194 445.24657 798.06437 1913.09635
6.45000 -6022.69992 3.29131 -0.55279 394.78410 337.09396 1792.53545
6.55000 -5979.26170 8.99790 -20.78127 376.59647 350.97161 1734.52347
6.65000 -5930.82132 12.62316 2.63526 357.08919 322.33388 1711.97475
6.75000 -5891.08586 8.81025 -45.92979 315.53756 298.58390 1676.66082
6.85000 -5851.27916 11.45180 -15.43952 377.80577 292.55158 1609.27761
6.95000 -5796.70414 8.13192 8.16914 400.78897 252.19335 1590.34367
7.05000 -5763.63791 3.50125 18.37763 374.69162 312.47784 1547.53994
7.15000 -5728.81133 11.69939 -17.36269 383.67968 415.30632 1532.24682
7.25000 -5684.39208 2.71789 0.95095 403.31667 321.50418 1489.54089
7.35000 -5644.15343 9.27716 -6.57697 330.59425 250.81359 1439.03644
7.45000 -5597.80494 13.01367 15.71003 308.91063 306.31262 1411.67011
7.55000 -5542.00017 7.50592 24.82315 345.07325 246.58526 1411.86780
7.65000 -5491.42649 10.01126 18.04355 394.68633 194.39020 1355.13352
7.75000 -5447.63142 10.45048 32.52918 341.09092 304.27215 1347.40742
7.85000 -5403.53837 11.81954 21.78199 356.55372 277.76944 1315.60827
7.95000 -5366.91125 9.85585 11.72290 317.84535 280.43355 1277.79969
8.05000 -5320.18589 13.95727 7.70343 298.43875 218.53851 1247.60935
8.15000 -5273.28451 9.64724 -39.06447 363.53204 286.59177 1219.54121
8.25000 -5237.06182 9.55968 14.89618 264.74866 212.23529 1203.08639
8.35000 -5197.06545 9.83397 34.38869 225.35876 176.50472 1153.75882
8.45000 -5159.30523 6.81247 -8.97885 254.25168 259.51057 1147.50469
8.55000 -5112.79327 9.45745 23.67564 259.04380 242.74243 1138.15169
8.65000 -5076.59920 2.25097 -6.19572 272.19566 273.03901 1113.24551
8.75000 -5042.08804 4.81944 -18.00639 240.27258 205.17656 1076.50597
8.85000 -4998.89889 7.34411 23.48977 224.69070 187.80142 1051.63463
8.95000 -4956.77147 5.99329 -5.60915 297.19281 176.11626 1032.62858
9.05000 -4922.92387 6.56912 36.41874 283.50712 315.68373 1016.78323
9.15000 -4878.47988 7.31605 25.00856 305.45339 154.60910 1013.32922
9.25000 -4842.31952 6.53356 38.12477 261.38167 174.98774 968.52393
9.35000 -4800.13131 9.96723 45.71417 283.21135 241.69747 976.08199
9.45000 -4761.21265 4.43137 19.23239 243.20762 264.58971 945.07020
9.55000 -4722.37905 6.48722 27.47363 251.56628 178.08822 957.42526
9.65000 -4690.40754 7.16589 7.83531 182.55446 155.29850 908.36561
9.75000 -4651.01196 7.92114 38.44851 238.56795 200.44273 890.48502
9.85000 -4620.04155 7.33756 41.38257 296.69576 260.33104 899.44316
9.95000 -4582.35678 12.48785 35.84627 178.03274 261.07756 872.04589
10.05000 -4558.96958 10.67292 29.02606 205.24663 157.45283 834.67262
10.15000 -4526.80327 7.74132 57.41893 215.33033 191.97496 822.48126
10.25000 -4491.99218 1.08039 56.45342 198.31934 277.97371 821.46613
10.35000 -4457.18994 8.08061 36.82425 167.76325 188.38440 833.61744
10.45000 -4423.88196 12.10031 42.93355 182.49998 143.23631 779.22297
10.55000 -4394.96541 13.37012 43.54787 182.56553 138.68798 749.93215
10.65000 -4364.05771 16.37933 27.92722 188.91523 175.42769 739.87174
10.75000 -4334.80747 10.67366 51.62122 231.70611 139.46503 718.53408
10.85000 -4298.05007 12.29812 31.31225 179.22708 161.73966 717.18797
10.95000 -4261.53600 13.79861 26.26712 286.75902 136.45255 709.18288
11.05000 -4235.32458 12.38770 12.85887 151.56827 114.22913 666.45615
11.15000 -4199.69777 12.73075 20.40615 155.95227 213.94574 695.88946
11.25000 -4166.20034 7.67607 20.93190 196.46196 231.36314 695.38307
11.35000 -4136.18315 8.39147 23.01136 171.67017 203.34017 652.46061
11.45000 -4106.34858 9.97924 5.38543 206.77460 152.54057 631.48902
11.55000 -4083.52579 8.93849 6.23542 147.79008 153.23600 614.33799
11.65000 -4045.05960 11.62920 7.09608 174.71314 113.19217 606.08858
11.75000 -4016.56662 11.64228 -4.97580 146.52520 112.08855 588.61870
11.85000 -3990.98449 14.09226 17.42754 149.69879 124.69582 575.99867
11.95000 -3959.09618 12.35497 -0.11686 163.42047 160.99603 572.40009
12.05000 -3930.91231 9.90981 26.39326 196.10649 242.01860 575.60846
12.15000 -3902.26307 11.52774 10.12340 176.32744 128.09281 551.81935
12.25000 -3880.60412 8.12796 2.53812 348.08414 163.86478 538.25215
12.35000 -3851.15741 8.53245 -19.25584 202.62638 133.51233 522.17094
12.45000 -3812.81483 5.85138 -7.21690 160.07955 228.71855 537.19166
12.55000 -3790.57014 12.24801 -19.15245 171.83198 122.73615 503.43656
12.65000 -3759.89531 8.68581 -29.16225 116.43559 105.22260 508.71527
12.75000 -3735.55332 8.41785 -18.03050 142.31120 167.87419 488.46299
12.85000 -3702.53566 10.19921 -8.98881 279.01740 148.18974 506.58951
12.95000 -3682.04567 8.06211 -6.29492 123.95671 96.75783 460.51113
13.05000 -3662.79709 2.41775 -9.77886 581.25309 255.75008 481.09665
13.15000 -3629.63070 10.28858 -6.84252 103.45252 88.19231 446.88024
13.25000 -3605.98306 5.93180 -0.18564 100.70421 138.35250 442.13182
13.35000 -3583.73132 8.63884 -11.03919 97.63262 81.58064 429.68434
13.45000 -3556.34449 10.88657 5.15720 127.98025 138.34850 521.20986
13.55000 -3531.98237 7.51436 -7.72562 101.68525 79.15873 421.80064
13.65000 -3509.27407 7.06120 7.08154 137.34813 92.68199 420.48480
13.75000 -3482.43597 5.50791 -1.91873 335.74642 135.48466 420.00701
13.85000 -3464.05426 7.12738 -11.69664 88.73317 84.78648 404.97705
13.95000 -3436.71715 4.46932 -10.02720 142.56237 95.84186 383.10774
14.05000 -3416.49458 6.78857 -3.15695 142.23704 132.21535 516.76445
14.15000 -3391.07229 8.01455 -2.93939 119.74405 110.82580 403.91870
14.25000 -3369.72919 5.25189 2.01836 94.74544 84.38547 371.72749
14.35000 -3346.86931 11.39135 -4.16371 125.67043 103.13645 367.97543
14.45000 -3326.25791 9.51493 5.01563 91.94602 71.35071 361.27864
14.55000 -3299.95324 10.67979 -1.84153 82.85402 85.75756 364.70982
14.65000 -3274.91966 10.05464 4.69051 135.04516 126.17322 365.07522
14.75000 -3257.84450 13.47893 3.86859 114.61858 125.11000 346.95287
14.85000 -3242.23181 3.53503 -1.70050 105.05068 86.46535 336.61446
14.95000 -3211.63750 6.01390 -6.20457 109.21279 75.56052 335.22980
15.05000 -3196.66428 9.97633 13.12630 68.60133 83.22159 312.23371
15.15000 -3178.65342 5.75609 21.76010 77.59799 68.72310 314.90083
15.25000 -3154.68113 6.40522 -4.46984 70.50304 61.99933 298.69079
15.35000 -3133.22751 5.25552 -19.30534 75.24775 77.74619 300.73190
15.45000 -3108.58754 9.08564 16.50304 228.16588 381.31752 389.52444
15.55000 -3087.19042 3.46116 4.10349 266.31492 143.36602 372.83940
15.65000 -3069.84662 8.85469 16.48337 68.44866 66.41990 293.78902
15.75000 -3045.99466 0.23222 8.43122 184.92496 180.77766 296.05682
15.85000 -3026.75766 11.58937 3.07658 101.70888 121.05191 269.99418
15.95000 -3012.99144 4.36590 2.33284 74.07065 55.34584 263.01345
16.05000 -2995.37072 6.41266 0.55126 69.72544 79.42195 280.84056
16.15000 -2969.19511 8.14140 -8.21780 91.68912 91.41724 291.14145
16.25000 -2951.13518 5.44063 -6.24300 80.89445 73.29583 265.52282
16.35000 -2929.62975 4.07424 -10.49383 81.43871 111.46616 256.07889
16.45000 -2911.91586 9.33165 -13.60988 91.77591 138.54267 255.30231
16.55000 -2886.38625 5.75223 -9.77228 96.22608 105.72485 246.06986
16.65000 -2870.52715 0.85233 -13.64132 81.99328 81.41165 252.07814
16.75000 -2846.66823 7.76265 5.69844 132.09107 70.92026 250.24058
16.85000 -2827.77111 4.04722 -17.78117 80.04469 67.23517 234.43097
16.95000 -2808.38169 5.95007 -22.76254 66.75299 63.28388 220.12413
17.05000 -2792.52270 7.31409 -6.43618 95.24535 128.06479 240.23005
17.15000 -2772.53734 3.76800 -15.57219 79.41054 79.85373 239.95188
17.25000 -2755.49143 5.54705 -25.27420 75.88507 83.89316 221.36471
17.35000 -2742.98675 5.16651 -19.31305 70.16747 108.50161 211.08507
17.45000 -2717.38045 5.99266 -27.32546 80.04819 41.46824 213.30285
17.55000 -2703.47707 4.94878 -25.43924 51.93845 47.83767 202.78495
17.65000 -2690.94388 4.27703 -20.79443 63.73256 48.11762 209.00893
17.75000 -2672.56380 6.61880 -24.76541 46.06220 50.93284 196.08056
17.85000 -2657.70471 4.29939 -34.68271 127.53052 62.44632 237.32893
17.95000 -2640.03466 3.40258 -21.47637 66.66521 47.08812 193.73796
18.05000 -2623.57706 0.93740 -27.21337 69.84195 83.10587 205.02360
18.15000 -2606.14970 5.60653 -13.38918 55.75996 104.28690 208.38231
18.25000 -2594.26811 3.31292 -17.19408 51.53154 39.89096 183.94414
18.35000 -2569.19972 1.52955 -28.33837 66.46051 83.47660 173.88498
18.45000 -2556.71865 3.98621 -5.53095 120.59526 81.48308 201.14605
18.55000 -2540.47764 2.35512 -34.21357 57.12055 62.50839 179.68456
18.65000 -2526.55508 8.41250 -12.35291 79.97646 153.45175 176.99160
18.75000 -2509.74257 3.43904 -26.29401 173.46578 76.95173 166.31484
18.85000 -2493.56420 2.30762 -20.11543 44.74824 58.37746 164.06038
18.95000 -2479.11040 2.79890 -38.55172 42.55522 59.36215 168.71284
19.05000 -2466.15757 3.10523 -22.88477 47.69031 60.79791 167.18716
19.15000 -2444.56102 3.89739 -21.75457 50.88970 86.94775 178.56924
19.25000 -2434.31748 5.35010 -28.43028 102.31656 66.83359 161.50038
19.35000 -2417.25688 4.80972 -14.00607 45.73512 86.36875 151.37677
19.45000 -2405.50371 6.41435 -26.80125 36.19188 32.61765 155.01632
19.55000 -2391.34519 1.59460 -23.99497 75.43584 52.83936 167.96505
19.65000 -2379.97317 4.95992 -21.15560 31.51935 30.53378 145.16916
19.75000 -2368.20557 4.82052 -9.33239 49.70933 43.09846 146.33700
19.85000 -2354.71728 5.19911 -10.60652 52.26952 50.48859 156.38614
19.95000 -2339.45535 4.56973 -22.79121 102.48615 57.94604 140.63516
