0.05000 -1921.06992 -324.54216 11888.76262 2101.46747 2200.44433 896628.52744
0.15000 -4710.38094 28.62817 5470.90058 2174.88163 2450.62168 1391288.92142
0.25000 -7423.65596 132.91463 41418.28000 2506.32689 2479.71200 1076549.91095
0.35000 -9450.43619 93.08613 10996.57806 2638.15595 2728.93021 1195473.30741
0.45000 -11131.53171 50.45859 37718.10871 2642.83949 3013.88270 1223598.05358
0.55000 -12476.31373 25.07888 7227.78060 2562.83206 3085.40767 1190387.84141
0.65000 -13357.59771 31.34359 266.12908 2598.55080 3212.22665 1097519.15261
0.75000 -14005.61002 34.87709 -722.18955 2620.34673 3228.46827 1020056.16198
0.85000 -14302.37468 43.24303 10831.05612 2563.11714 3298.04746 1022505.72964
0.95000 -14547.21855 -29.61704 -7164.43747 2344.52968 3339.47763 900603.04914
1.05000 -14599.92716 31.34853 8438.01928 2143.96682 3304.05414 927156.80551
1.15000 -14546.42344 51.56048 -1380.05464 1938.12432 3279.06961 892298.86532
1.25000 -14437.75073 91.66112 275.67089 1784.12824 3264.75899 858463.42691
1.35000 -14268.40526 97.31987 2581.11809 1594.55465 3216.19326 775396.24334
1.45000 -14081.26119 72.70660 -17546.57242 1397.95286 3134.17104 736688.56086
1.55000 -13859.70183 46.37013 125.60713 1276.91116 3071.78444 729004.23345
1.65000 -13635.23973 67.31200 2648.15720 1140.65900 3000.91208 676305.00518
1.75000 -13364.19237 -6.26350 14090.59438 1048.87073 2943.91972 668649.66132
1.85000 -13121.86259 21.26595 6647.65393 981.98392 2832.75622 625324.93617
1.95000 -12841.28297 61.03038 -4081.29849 894.22231 2797.41933 599632.96477
2.05000 -12616.57671 52.73264 -6509.64167 789.59882 2720.86133 567249.17710
2.15000 -12393.07703 27.47156 -4822.38965 713.28920 2616.62566 577539.24196
2.25000 -12143.72477 53.21658 -11053.18873 630.22235 2571.31662 510622.39496
2.35000 -11893.74310 -2.59954 1086.57256 597.35268 2496.35897 544290.02595
2.45000 -11669.31438 104.52094 -1216.45104 578.17151 2425.90128 478899.82317
2.55000 -11428.73942 72.60889 -4008.33970 527.93522 2369.79096 464967.09092
2.65000 -11213.94800 47.11949 1878.93359 502.09216 2312.94543 460105.61729
2.75000 -10991.22210 30.60399 3388.47791 487.31998 2222.69658 411233.47016
2.85000 -10765.56521 60.79785 4771.77362 469.07976 2178.05912 411428.33888
2.95000 -10573.17117 32.32256 6715.74242 435.69017 2114.88860 393668.32553
3.05000 -10382.49417 14.37131 -4391.90554 444.56058 2057.52659 408579.74034
3.15000 -10212.04607 33.18642 -7779.17881 419.89013 2003.82544 376104.29797
3.25000 -10026.50867 15.39960 -1156.44055 431.20960 1960.93842 335955.17962
3.35000 -9876.68978 41.01760 110.91506 441.01886 1888.28803 339659.00230
3.45000 -9706.15092 25.55977 -2446.47018 429.73518 1821.70577 325799.30201
3.55000 -9529.72351 64.70339 1036.93206 428.05658 1789.28315 316961.24835
3.65000 -9402.84820 6.06666 -471.70698 443.48041 1719.97441 290740.48609
3.75000 -9252.70555 59.57262 -2099.22771 449.88542 1691.83816 277785.21554
3.85000 -9107.30280 39.15282 -8402.51176 458.36921 1635.05169 298687.42319
3.95000 -8974.34772 17.22925 -2418.87055 485.40798 1573.67216 281550.91012
4.05000 -8869.18896 18.42492 -1421.97292 466.62006 1538.09975 244918.66676
4.15000 -8731.12648 22.39464 256.23958 472.83613 1479.88157 240844.19508
4.25000 -8605.54994 22.11589 -5956.28996 490.35538 1445.14981 242497.31431
4.35000 -8493.27221 24.44108 1219.09797 508.26834 1383.07613 237954.86844
4.45000 -8382.22785 23.46877 -5149.77991 515.97450 1331.58304 225399.76172
4.55000 -8266.51813 -21.02022 1872.69611 521.74947 1303.73264 204256.14696
4.65000 -8175.47843 15.44465 889.17886 505.08850 1256.73990 214194.13403
4.75000 -8068.90311 19.16436 -2488.59935 529.22238 1211.30106 215679.16498
4.85000 -7934.00385 45.99155 -3345.16212 546.03780 1158.26300 203956.29554
4.95000 -7843.30526 -2.99921 1146.01253 556.88030 1127.40943 212180.11174
5.05000 -7767.84837 32.80224 -306.99029 576.88559 1085.24173 187811.75259
5.15000 -7657.18380 19.46586 -5859.01254 576.43038 1040.38131 201585.27431
5.25000 -7534.35904 9.93991 130.48679 598.79417 1010.74452 195389.73092
5.35000 -7480.97904 10.78896 634.81308 610.48750 970.75463 168431.47670
5.45000 -7377.21694 36.83942 -255.49887 621.82837 929.04630 171422.83621
5.55000 -7282.96266 2.33141 1425.84592 638.28080 881.29263 164425.70217
5.65000 -7144.11974 9.11604 -99.17227 642.84649 857.47530 159127.80952
5.75000 -7068.42501 71.26646 3943.39064 647.80097 814.86750 146979.22478
5.85000 -6942.00814 37.10137 3359.69188 654.43707 758.48047 159879.03732
5.95000 -6836.63598 29.16889 -1737.26209 664.55418 731.01906 148824.36796
6.05000 -6740.51757 24.05275 -1256.91997 663.52411 691.21232 134208.91954
6.15000 -6645.46232 30.70958 -1839.61715 673.87439 660.82168 138930.24349
6.25000 -6508.68446 38.50353 -3505.03120 673.38551 630.14522 128324.33082
6.35000 -6383.54033 39.75125 -1893.48460 666.69401 604.82704 129238.49642
6.45000 -6295.66521 47.15655 2243.86479 661.81664 585.51416 137007.74203
6.55000 -6142.66081 35.71530 -381.28456 646.60421 554.90076 119791.81956
6.65000 -6056.46029 40.33803 -2782.72876 628.75571 513.34499 127306.97233
6.75000 -5926.96456 40.11303 -1521.05761 614.94997 493.54218 116304.56107
6.85000 -5831.43790 40.93132 -1237.17478 598.65669 466.25032 104825.29591
6.95000 -5743.47650 32.96921 1720.06492 582.35978 444.21148 106224.62991
7.05000 -5641.86776 45.32927 -4274.15885 563.09988 417.94766 102056.05704
7.15000 -5550.52030 19.73783 -1539.04755 534.42988 406.96416 89475.62197
7.25000 -5470.49314 43.24070 1168.76582 513.81862 381.77939 85539.49473
7.35000 -5396.60504 43.10064 -192.05423 493.90970 370.03706 86768.34652
7.45000 -5315.60424 42.40038 -694.31262 459.85280 358.36652 74343.88622
7.55000 -5263.50303 44.72349 -2663.09820 422.12183 327.53605 76839.97434
7.65000 -5189.37728 38.26550 610.97003 417.56959 344.60674 71149.57551
7.75000 -5143.71851 34.36431 956.22527 406.81817 320.12874 73884.22477
7.85000 -5100.93221 34.24087 321.45184 369.26261 310.78512 72102.51222
7.95000 -5050.69031 20.09953 163.55655 350.40440 287.06449 60366.65847
8.05000 -5002.08589 27.87756 206.22372 349.12647 312.27696 73350.43074
8.15000 -4964.58308 29.36605 343.08924 328.77976 285.36951 61254.70573
8.25000 -4917.11265 16.83699 756.67169 315.03963 285.61733 59212.61871
8.35000 -4895.46743 23.58189 1038.90037 299.94448 280.34588 54220.37514
8.45000 -4858.34454 20.31454 -101.28914 274.79471 271.25908 53964.37346
8.55000 -4830.12877 15.12363 525.21101 269.73501 254.45499 44461.46097
8.65000 -4789.96450 13.88647 630.90398 251.21119 235.10291 51197.10974
8.75000 -4757.50209 12.81385 1462.50378 245.02027 246.87055 35988.81387
8.85000 -4730.93014 7.79100 1600.45895 244.94228 224.21613 43829.07184
8.95000 -4702.33980 9.24823 184.25390 237.01303 218.26748 40094.53769
9.05000 -4670.07043 7.42325 510.09732 218.99175 238.60185 36525.82062
9.15000 -4641.29873 4.53232 498.44489 231.16968 230.98019 36540.50615
9.25000 -4618.63689 3.83913 353.96854 234.48027 222.03753 34009.23006
9.35000 -4593.50663 1.84964 774.24463 233.72230 214.29518 32438.05418
9.45000 -4559.00181 5.23127 175.09852 189.52662 203.21251 29990.17939
9.55000 -4528.55107 -2.81495 1163.71369 200.76536 205.23557 35364.81846
9.65000 -4497.86158 2.93364 -484.84173 234.25998 212.66075 31259.00780
9.75000 -4460.97653 -2.24587 366.58393 194.87893 191.42075 29624.14574
9.85000 -4434.35581 -4.01607 826.40638 189.17875 205.46233 31875.65200
9.95000 -4410.07205 3.88041 546.95092 186.40150 186.29266 25978.75270
10.05000 -4370.24094 -4.25042 24.22766 196.33220 201.95658 24317.11030
10.15000 -4349.18242 -5.70682 69.99637 204.07343 172.44155 25040.60228
10.25000 -4319.34240 -1.33072 -209.98175 178.26332 188.98910 25749.60953
10.35000 -4285.57364 -4.91183 267.96310 168.77485 176.36032 24216.46904
10.45000 -4247.37342 0.66906 597.92785 180.94145 185.19439 20930.16429
10.55000 -4219.81032 2.34900 446.97757 162.36848 196.87206 22457.11342
10.65000 -4185.39099 -1.43722 -800.41892 180.61327 166.95343 46751.63982
10.75000 -4163.26269 -3.19119 206.55447 180.01307 175.50349 21009.34059
10.85000 -4124.26365 -1.20605 775.10231 151.72678 159.75524 20118.91671
10.95000 -4095.51641 -1.98679 -354.32260 154.23870 147.30768 20653.54126
11.05000 -4068.99776 -2.09062 9.72513 143.28088 139.12874 20661.06803
11.15000 -4029.98439 0.83665 -320.71211 149.18580 149.23782 17205.96503
11.25000 -4002.76246 5.04535 40.62584 174.84303 161.87191 22407.33871
11.35000 -3969.48002 0.67416 -280.53378 168.19744 197.79818 22751.16719
11.45000 -3945.98200 1.63331 70.00028 168.30718 154.29819 14982.08079
11.55000 -3912.92515 4.13576 -343.69192 154.34675 149.22162 17201.94172
11.65000 -3875.34171 3.99942 -170.38211 194.03332 162.59697 17356.56773
11.75000 -3847.15011 7.93597 -493.10795 199.79215 147.05584 20894.62638
11.85000 -3820.43347 11.62715 534.97714 151.75504 145.29872 16903.35405
11.95000 -3790.44015 2.79411 227.85371 153.04562 123.63423 14447.62978
12.05000 -3763.58965 5.46838 114.96867 147.76198 133.75651 23696.47954
12.15000 -3727.48014 7.11403 -132.32069 150.10736 133.49527 14694.23635
12.25000 -3702.48196 5.46991 -239.13998 141.93409 139.21642 16975.52232
12.35000 -3676.49234 2.29887 12.30283 155.92011 151.28684 12159.91418
12.45000 -3643.83032 4.07747 -301.34615 151.95949 177.82602 15020.69018
12.55000 -3620.12381 10.81619 41.62103 122.18548 103.79123 13158.10965
12.65000 -3597.34379 5.33534 -1455.80159 156.49473 127.03452 85636.20943
12.75000 -3564.59868 8.80917 -277.85725 149.30767 117.02509 12603.47595
12.85000 -3545.32906 6.84248 144.74438 123.45537 100.54986 15115.02333
12.95000 -3518.04801 12.26250 -28.79512 125.68144 110.68338 11636.43532
13.05000 -3495.80435 10.86457 -34.90671 127.15706 115.73265 9337.46681
13.15000 -3478.38686 6.77985 -170.66017 153.23593 151.44049 13420.74433
13.25000 -3451.77752 12.63321 26.52295 164.87546 156.22417 11028.21670
13.35000 -3432.79667 10.49246 139.57648 126.98591 103.97634 10327.33164
13.45000 -3413.09907 9.51491 102.54999 142.70985 123.68687 11785.36108
13.55000 -3387.44204 10.55364 204.62520 155.21294 118.62682 12354.39080
13.65000 -3370.69566 8.00546 375.71455 111.98528 118.89167 9717.33287
13.75000 -3347.39068 12.29927 322.18184 103.15440 89.82270 8635.63376
13.85000 -3327.42008 10.91014 91.05802 118.44266 110.29451 9137.42868
13.95000 -3308.89713 7.15853 50.67367 130.90543 164.86044 11884.66199
14.05000 -3284.93545 10.13316 -469.99033 169.40063 102.85263 9699.72365
14.15000 -3264.62907 8.35994 354.01872 126.34478 103.23073 8711.14254
14.25000 -3247.67597 7.84165 578.15992 109.94131 96.73149 9773.86045
14.35000 -3228.25732 6.75865 -50.12290 104.51446 88.82437 8168.78452
14.45000 -3208.57865 12.09087 240.71653 113.51002 122.91817 9387.45581
14.55000 -3195.39426 7.92589 57.74841 153.08264 100.95871 9003.48686
14.65000 -3166.56688 10.44865 123.69406 100.52963 121.60542 8191.67752
14.75000 -3153.06794 7.21150 49.72038 99.90573 117.91084 9015.17377
14.85000 -3128.76112 7.84614 315.55961 93.32421 94.94076 8259.29969
14.95000 -3112.36229 8.48984 -173.51593 112.92929 101.27655 8810.84837
15.05000 -3090.82655 7.03913 220.25830 93.65579 83.92547 7281.41371
15.15000 -3066.73513 7.08320 523.53984 101.11484 95.71045 8320.43464
15.25000 -3047.17871 8.97832 641.09810 104.83390 88.83589 24238.42990
15.35000 -3027.84004 5.19361 178.70351 94.29656 78.84097 6842.56460
15.45000 -3010.34878 5.99997 143.12563 117.61918 103.38050 6865.75653
15.55000 -2993.80777 6.03829 285.73039 95.05156 80.73545 8821.84479
15.65000 -2974.43659 8.74798 139.31900 82.29750 77.74740 6332.86975
15.75000 -2953.21618 6.07676 36.80026 80.82012 89.40536 5918.66255
15.85000 -2930.55607 8.75373 189.48537 115.99789 125.08663 8746.62911
15.95000 -2915.15704 7.08426 381.80972 83.01132 76.34184 6002.56209
16.05000 -2893.71571 7.56635 443.67051 78.26739 67.33442 6785.30374
16.15000 -2876.00185 0.40079 243.25975 100.35498 131.93259 5871.95160
16.25000 -2861.09191 4.87034 41.62436 81.76431 67.61814 6322.18440
16.35000 -2838.15868 4.79887 252.79857 94.37338 85.72349 5506.46266
16.45000 -2818.75500 5.29977 48.17545 79.66469 79.56036 5389.46771
16.55000 -2800.19012 5.63742 402.90207 97.75440 66.42182 5424.96670
16.65000 -2787.35254 7.81145 116.03658 96.95170 66.56119 5326.34177
16.75000 -2763.37364 5.35503 31.74532 93.27717 99.68615 5867.68926
16.85000 -2748.03598 9.71657 22.57700 94.56153 109.82643 5915.02995
16.95000 -2736.75088 7.43171 170.01921 112.43515 64.23918 4954.87142
17.05000 -2720.11367 9.27802 178.39203 84.44735 130.79563 3731.87045
17.15000 -2702.78294 8.01137 151.28276 90.43970 80.77004 4815.14181
17.25000 -2684.59142 6.99558 -4.18306 84.97663 66.38192 4923.05432
17.35000 -2669.62707 8.92479 187.78919 89.81642 71.72972 4585.84617
17.45000 -2661.13771 6.87913 293.61441 72.82540 87.06686 4638.38288
17.55000 -2646.06342 6.25029 24.31650 105.35675 166.65113 5242.14446
17.65000 -2623.79390 4.80143 59.61414 69.66624 49.54326 4886.59952
17.75000 -2610.05499 6.62446 145.01625 91.33389 56.50227 4820.70995
17.85000 -2594.37722 7.72952 -74.06159 69.56711 53.60853 6460.66322
17.95000 -2582.94560 4.79096 27.55604 64.50144 59.01566 4429.74581
18.05000 -2571.42097 8.10122 -67.29563 74.80161 49.54025 4740.31006
18.15000 -2556.13727 5.67956 -180.64298 63.41311 49.73500 3769.41046
18.25000 -2541.29310 8.86183 79.25373 101.38974 55.72575 5708.64693
18.35000 -2533.39704 7.49345 187.49921 84.87712 60.43216 4606.88123
18.45000 -2515.56619 7.64511 39.30148 63.53165 46.86175 3828.86076
18.55000 -2508.03395 7.07761 8.27776 74.08008 69.65743 4138.29348
18.65000 -2494.28417 6.68535 200.36705 60.11083 40.28205 4106.71138
18.75000 -2482.17234 5.10014 137.09802 79.25265 55.50517 3903.67839
18.85000 -2466.81239 9.58878 87.79178 70.86451 58.06386 4084.93426
18.95000 -2455.53187 6.91145 169.77031 61.78670 60.89970 4597.49954
19.05000 -2444.88356 4.62713 -24.73830 101.42094 89.90818 4024.75619
19.15000 -2428.07947 6.06268 17.42439 53.14142 46.23404 3076.13645
19.25000 -2417.76829 7.37720 295.89942 92.35233 96.33962 3715.44801
19.35000 -2406.57423 6.12549 20.44700 51.28672 54.64454 3119.75986
19.45000 -2391.28415 3.84153 -14.67023 62.22372 69.67294 4456.42844
19.55000 -2385.00591 8.99490 224.88042 98.46756 47.08994 3462.66253
19.65000 -2367.24546 6.72743 190.96751 54.34538 66.82578 3971.91883
19.75000 -2355.19927 3.86636 -6.57411 63.96551 33.23147 2894.37090
19.85000 -2340.71848 3.86835 104.68231 61.70781 59.02649 2968.57045
19.95000 -2328.85197 1.99841 26.57071 64.25559 104.82055 4137.75867
