0.2 0.36329 19.13693 -0.90676 109.31136 106.87365 84.08699
0.6 0.74692 44.91698 0.23553 108.40173 100.38427 81.23681
1.0 0.99625 65.85453 0.18475 105.78383 92.43941 77.52134
1.4 0.01436 80.07595 0.40084 102.54117 84.33194 73.06713
1.8 0.76932 89.25454 0.67078 97.14321 79.05549 69.35747
2.2 -0.55982 97.52279 0.8724 89.94524 74.65949 64.83852
2.6 0.30099 104.45581 0.06469 84.76503 71.3116 60.61823
3.0 0.4759 111.83487 0.88295 78.13174 66.98393 57.63297
3.4 0.54764 118.30013 0.54798 71.88438 64.37988 54.20239
3.8 0.05591 125.01058 0.38595 65.52398 61.42988 51.23205
4.2 -0.44903 134.27894 -1.19794 59.83345 59.85988 48.74602
4.6 -0.68545 146.81361 -0.92461 55.41729 57.68223 46.47614
5.0 0.927 161.69206 -1.32749 53.43931 53.54613 43.91265
5.4 0.79098 173.8417 -0.66881 50.77714 47.33711 41.43451
5.8 1.26364 181.3695 -0.87265 48.85563 42.53711 38.5925
6.2 0.40235 184.58343 -0.10137 47.18412 38.88463 35.54363
6.6 0.244 185.75208 -0.70146 46.08837 36.1249 33.27374
7.0 -0.13867 186.37297 -0.29265 45.30818 34.94308 30.7685
7.4 0.09479 187.09024 -0.90788 44.72631 33.36858 28.93875
7.8 0.41122 187.76562 -0.55087 44.06953 31.93058 28.00343
8.2 -0.1618 188.20781 -0.00816 43.69289 30.90304 26.55591
8.6 0.1087 189.17489 -0.22799 42.91038 29.51567 25.59875
9.0 0.23573 190.64311 -0.21148 41.56529 28.88887 25.07744
9.4 0.09537 191.03274 -0.42832 40.41089 28.722 24.08345
9.8 -0.62422 192.12655 -0.46183 38.68235 28.67597 23.31288
10.2 -0.06734 193.00774 -0.69538 37.48217 28.85877 22.5747
10.6 0.95413 193.96757 -1.08358 35.52615 29.16953 21.55316
11.0 0.77647 195.4291 -0.55011 34.02126 28.81807 20.90166
11.4 0.73267 196.75268 -0.41425 32.98633 28.75168 20.19527
11.8 0.54056 198.16043 -0.02637 31.90839 27.33334 19.30886
12.2 0.45305 199.55029 0.31946 31.02334 26.12397 18.61663
12.6 0.14786 200.24404 0.58584 30.59877 24.82617 17.92091
13.0 -0.02853 200.55502 0.79098 30.10204 23.12998 17.38617
13.4 -0.23491 201.37193 0.99792 29.11232 20.82201 16.75179
13.8 -0.50836 201.67874 0.8675 28.35201 19.93746 16.08797
14.2 -0.27419 201.18449 0.82514 27.39267 18.88525 15.79214
14.6 -0.50754 201.43396 0.55359 26.07721 18.73897 14.87456
15.0 -0.47479 201.329 0.53117 23.45985 18.46644 14.7482
15.4 -0.26628 201.61091 0.86819 23.17993 18.20909 13.8499
15.8 0.51552 202.1869 0.57682 21.77066 18.02935 13.76904
16.2 0.67898 202.36084 1.09894 20.26895 17.40915 13.06213
16.6 0.47548 202.73891 1.05238 19.08077 17.3366 12.46798
17.0 -0.13343 203.71673 1.0118 18.23702 16.78323 11.663
17.4 0.47746 203.18517 1.44966 17.79152 16.45502 11.83234
17.8 -0.39362 204.82355 0.78991 16.94859 16.05167 11.15604
18.2 -0.76662 204.91181 0.83356 16.29884 15.73372 10.95825
18.6 -1.27753 205.39301 0.53479 15.88882 15.13 11.17318
19.0 0.1349 206.48659 0.83759 14.86683 12.9103 10.66633
19.4 -1.4021 207.36596 0.11177 14.1806 11.89995 10.45867
19.8 -0.93307 206.93887 0.40779 13.19083 10.93368 10.92819
