0.120000 -1.709660
0.380000 -3.044790
0.620000 -2.902790
0.880000 -2.958550
1.120000 -2.934820
1.380000 -2.974360
1.620000 -2.956750
1.880000 -2.953370
2.120000 -2.929020
2.380000 -2.901610
2.620000 -2.869960
2.880000 -2.886160
3.120000 -2.808700
3.380000 -2.711920
3.620000 -2.642050
3.880000 -2.533480
4.120000 -2.422700
4.380000 -2.274600
4.620000 -2.120340
4.880000 -2.020490
5.120000 -1.926010
5.380000 -1.910110
5.620000 -1.910290
5.880000 -1.956250
6.120000 -2.086490
6.380000 -2.239830
6.620000 -2.446990
6.880000 -2.749710
7.120000 -3.064200
7.380000 2.861530
7.620000 2.695310
7.880000 2.367850
8.120000 2.085810
8.380000 1.775610
8.620000 1.443680
8.880000 1.227190
9.120000 1.030470
9.380000 0.945100
9.620000 0.988190
9.880000 0.806770
10.120000 0.849350
10.380000 0.310320
10.620000 0.783440
10.880000 0.246020
11.120000 -0.545780
11.380000 -1.539140
11.620000 -0.109450
11.880000 0.392130
12.120000 0.530610
12.380000 0.879710
12.620000 0.888500
12.880000 0.605570
13.120000 0.580240
13.380000 0.548410
13.620000 0.584310
13.880000 0.244030
14.120000 0.316140
14.380000 0.181120
14.620000 0.158730
14.880000 0.251950
