0.05000 66520.58776
0.15000 117735.17313
0.25000 65252.41558
0.35000 42687.45287
0.45000 32254.46086
0.55000 25886.43567
0.65000 21602.40129
0.75000 18581.90362
0.85000 16175.59006
0.95000 14315.75818
1.05000 12988.22115
1.15000 11821.31160
1.25000 10714.16016
1.35000 9880.56823
1.45000 9148.97754
1.55000 8531.27235
1.65000 7966.27115
1.75000 7461.66980
1.85000 7032.59244
1.95000 6633.69340
2.05000 6207.89050
2.15000 5993.17215
2.25000 5578.67125
2.35000 5323.14774
2.45000 5095.11564
2.55000 4883.91689
2.65000 4635.94863
2.75000 4349.09717
2.85000 4119.60782
2.95000 3929.96910
3.05000 3716.88786
3.15000 3497.56339
3.25000 3334.84782
3.35000 3194.91456
3.45000 3111.77484
3.55000 3034.15845
3.65000 2926.09882
3.75000 2814.82789
3.85000 2742.81356
3.95000 2680.79066
4.05000 2590.22405
4.15000 2540.67509
4.25000 2485.32110
4.35000 2455.83468
4.45000 2424.05988
4.55000 2319.52353
4.65000 2276.55138
4.75000 2167.58944
4.85000 2175.97093
4.95000 2146.98949
5.05000 2033.69715
5.15000 2040.69730
5.25000 1948.37238
5.35000 1911.76189
5.45000 1860.42498
5.55000 1831.52869
5.65000 1769.34006
5.75000 1751.05872
5.85000 1725.47033
5.95000 1680.23589
6.05000 1619.29695
6.15000 1586.36690
6.25000 1542.91148
6.35000 1531.81525
6.45000 1483.90223
6.55000 1451.46244
6.65000 1414.99638
6.75000 1379.77423
6.85000 1349.14776
6.95000 1321.11069
7.05000 1257.62112
7.15000 1257.54563
7.25000 1207.00289
7.35000 1195.37058
7.45000 1168.67828
7.55000 1137.84812
7.65000 1107.49472
7.75000 1079.24450
7.85000 1046.48564
7.95000 1045.52534
8.05000 1016.11471
8.15000 975.25448
8.25000 960.64783
8.35000 939.94194
8.45000 938.67287
8.55000 906.90998
8.65000 912.89154
8.75000 855.80652
8.85000 871.80108
8.95000 820.13616
9.05000 804.43489
9.15000 799.28735
9.25000 778.72130
9.35000 762.72643
9.45000 751.14402
9.55000 742.97619
9.65000 726.19721
9.75000 712.56934
9.85000 696.37084
9.95000 686.04306
10.05000 690.31105
10.15000 661.96722
10.25000 646.90840
10.35000 631.38825
10.45000 616.70511
10.55000 611.36411
10.65000 607.91589
10.75000 577.94293
10.85000 576.66247
10.95000 560.95856
11.05000 552.38635
11.15000 545.42574
11.25000 533.37181
11.35000 523.19076
11.45000 500.57741
11.55000 501.75174
11.65000 483.74590
11.75000 478.31180
11.85000 461.18218
11.95000 446.11405
12.05000 440.33826
12.15000 434.19445
12.25000 416.45797
12.35000 408.04514
12.45000 401.49333
12.55000 402.70788
12.65000 391.92212
12.75000 375.30045
12.85000 372.69183
12.95000 360.87044
13.05000 360.67967
13.15000 356.02776
13.25000 344.07779
13.35000 340.71213
13.45000 337.14149
13.55000 318.38631
13.65000 321.84246
13.75000 314.02632
13.85000 304.75146
13.95000 294.88443
14.05000 296.97925
14.15000 292.75828
14.25000 283.91510
14.35000 286.12257
14.45000 280.45750
14.55000 264.02800
14.65000 262.93926
14.75000 259.89150
14.85000 261.28848
14.95000 254.47788
15.05000 250.26281
15.15000 247.04744
15.25000 243.08136
15.35000 234.17577
15.45000 230.02039
15.55000 228.60529
15.65000 214.30855
15.75000 209.49488
15.85000 206.17118
15.95000 206.69176
16.05000 198.60738
16.15000 200.45709
16.25000 203.56994
16.35000 192.65088
16.45000 188.69542
16.55000 193.42670
16.65000 198.02251
16.75000 183.34737
16.85000 171.14241
16.95000 169.90406
17.05000 176.31329
17.15000 177.68328
17.25000 169.10789
17.35000 166.13936
17.45000 156.06524
17.55000 152.70399
17.65000 155.29192
17.75000 154.04568
17.85000 161.89584
17.95000 153.31090
18.05000 150.02127
18.15000 148.78712
18.25000 137.83161
18.35000 147.77091
18.45000 152.48811
18.55000 141.11351
18.65000 145.29622
18.75000 178.94213
18.85000 137.72380
18.95000 143.51099
19.05000 128.27307
19.15000 131.77196
19.25000 129.63039
19.35000 139.58551
19.45000 129.64514
19.55000 121.04541
19.65000 119.54872
19.75000 122.42455
19.85000 117.92962
19.95000 117.86897
