0.05000 0.00000 0.00000 0.00000 0.00000 0.00000 0.00000
0.15000 -954.42678 -133.15363 4352.36365 1171.72820 1335.31469 204.28862
0.25000 -578.43727 132.57703 4455.17093 1337.81103 1464.07029 339.00831
0.35000 -566.06308 -179.00767 4437.60321 1494.82096 1339.70122 373.43099
0.45000 -917.48195 6.41097 4405.89877 1392.74112 1501.58621 602.88787
0.55000 -1218.99297 43.50864 4367.33001 1446.91950 1428.61353 532.20366
0.65000 -1133.89059 147.33883 4400.85154 1373.07601 1507.57771 636.88084
0.75000 -1337.47921 -67.97461 4253.08236 1627.61858 1813.27033 789.27251
0.85000 -1319.23940 19.59300 4146.74126 1509.21687 1664.43301 707.85842
0.95000 -1687.17156 22.70851 4014.00218 1474.04280 1641.73039 857.53677
1.05000 -1917.71984 -82.49246 3863.13117 1510.87401 1706.76936 884.80016
1.15000 -2070.40752 25.24890 3693.97201 1673.43869 1906.00424 1104.85226
1.25000 -2397.36366 44.34011 3509.54874 1473.70712 1694.87502 1095.32799
1.35000 -2396.14825 3.13335 3351.85179 3061.18110 3183.13805 2258.53696
1.45000 -2535.09692 -63.63128 3067.14734 3147.82066 2056.69788 1737.40994
1.55000 -2663.14471 -8.16116 2731.82039 1717.29005 2009.36005 1432.13742
1.65000 -2848.49301 -85.38309 2516.64989 1847.29231 2020.49508 1633.22473
1.75000 -3015.76619 -105.09419 2222.00961 1774.41743 2006.22281 1943.88470
1.85000 -3219.43754 -50.87287 1999.58045 2102.09609 4123.40462 2417.76767
1.95000 -3332.39921 9.82817 1677.80544 2016.28799 1712.30224 2360.71092
2.05000 -3441.30601 -39.54867 1474.30016 3459.62424 2920.42143 2361.06481
2.15000 -3498.86053 1.42710 1327.04943 1480.42677 1528.19679 2272.18553
2.25000 -3470.68923 -13.39845 1074.38946 1567.39708 1505.27198 2413.88961
2.35000 -3546.08300 -13.88240 912.25086 1435.90006 1389.45559 2507.74285
2.45000 -3564.47479 -20.21242 814.90999 1449.68317 1342.88285 2631.92365
2.55000 -3665.85369 23.84945 761.43151 1326.73190 1284.47668 2589.29951
2.65000 -3663.65244 23.62038 554.18944 1370.22102 1199.02008 2618.65180
2.75000 -3640.36977 42.95746 682.16459 1399.44857 1164.92170 2753.76716
2.85000 -3683.34046 -12.84550 485.37532 1389.22620 1168.88231 2653.97114
2.95000 -3676.01699 5.98857 455.53560 1268.96173 994.15856 2621.55508
3.05000 -3689.21598 10.48640 332.01160 1218.88624 986.92677 2619.37070
3.15000 -3679.60685 -4.15599 376.01810 1263.08089 980.34397 2596.85703
3.25000 -3546.81765 -35.09421 424.73150 1313.13622 917.06759 2688.81278
3.35000 -3638.42796 -35.72212 278.25143 1208.72005 837.36596 2945.21502
3.45000 -3544.21411 -10.35486 335.02540 1277.20796 889.83454 2654.49419
3.55000 -3541.70584 2.33769 220.33432 1361.09517 1455.53778 2618.24114
3.65000 -3488.36654 28.09195 359.86158 1216.73276 754.18997 2578.95280
3.75000 -3525.05365 -16.35639 185.14652 1134.81078 699.08684 2555.84516
3.85000 -3493.74258 13.45509 320.57064 1121.96073 796.43640 2507.07467
3.95000 -3441.70930 31.20030 167.74370 1272.24822 1241.42611 2551.21012
4.05000 -3453.75683 -5.62749 287.30328 1124.10674 647.47799 2486.12411
4.15000 -3419.30215 -9.78296 131.69235 1071.67708 586.92191 2505.60728
4.25000 -3436.67336 29.42658 200.59049 1072.68850 738.99377 2469.53870
4.35000 -3393.06819 -1.50260 152.96590 1086.54093 589.85297 2444.18653
4.45000 -3357.80016 7.17612 120.94539 1035.40147 625.60002 2466.93361
4.55000 -3306.85955 18.10066 64.10075 1150.12616 601.82658 2490.50079
4.65000 -3298.07258 0.83076 149.51130 1030.91739 496.64721 2408.35511
4.75000 -3265.13841 0.17005 132.23172 1027.44298 524.02395 2413.87320
4.85000 -3259.34122 11.23581 80.08825 1011.38594 494.41372 2409.89313
4.95000 -3251.40315 10.80126 177.32410 1008.95485 459.78570 2368.76778
5.05000 -3206.05974 -8.79905 98.61739 1004.47871 465.58201 2396.35943
5.15000 -3188.83744 -3.03803 76.47364 975.12644 429.39128 2388.72898
5.25000 -3145.66572 16.91812 91.09324 1252.90182 434.65651 2385.84977
5.35000 -3185.56608 -0.55282 -13.50744 949.08909 407.68482 2320.52126
5.45000 -3153.65075 -10.82826 102.22214 1007.69105 443.15535 2315.52499
5.55000 -3154.31561 -12.49029 17.03248 939.76287 401.35226 2274.62573
5.65000 -3147.23684 6.58574 -17.91967 938.10166 393.34285 2283.95192
5.75000 -3104.40185 -4.54338 78.91394 984.40549 511.53310 2234.25288
5.85000 -3067.09797 0.16292 32.17225 951.23750 365.47574 2259.93457
5.95000 -3046.07616 2.10912 29.65555 918.63980 360.68536 2246.30228
6.05000 -3005.77822 -14.97524 84.82948 970.77645 346.91936 2249.49835
6.15000 -3000.45200 10.54295 56.87032 895.69746 322.88441 2209.82648
6.25000 -2975.42979 -5.30205 71.26570 941.70997 373.30502 2194.80702
6.35000 -2973.82823 3.62971 28.75770 904.82560 337.62012 2176.89938
6.45000 -2955.69941 -0.25417 -38.44584 876.34832 340.66608 2162.30975
6.55000 -2931.07837 -8.39408 149.94108 882.92657 320.47905 2113.72723
6.65000 -2924.45408 -5.39217 89.77031 865.93860 316.57558 2106.49424
6.75000 -2877.49043 4.22110 31.68806 877.14581 285.18872 2131.73604
6.85000 -2856.78308 7.33055 -49.51995 885.11978 323.11574 2153.35652
6.95000 -2882.33096 2.56788 -8.30432 850.08458 307.79509 2083.79798
7.05000 -2859.74586 -1.37579 -31.62802 858.06654 304.53906 2077.40146
7.15000 -2845.76454 -2.49444 -151.34941 855.28687 441.30694 2078.54922
7.25000 -2840.07720 -4.45063 -112.61869 826.05905 283.73591 2043.24932
7.35000 -2810.45225 2.65770 -41.95472 1072.48617 357.79813 2069.23382
7.45000 -2801.34092 -1.38825 -11.50000 837.51679 302.02245 2024.67080
7.55000 -2722.29048 -5.47818 -8.01702 859.29405 259.83290 2056.94015
7.65000 -2778.63784 2.22183 -42.39107 812.48176 260.19469 1996.48967
7.75000 -2707.73652 -5.67678 -14.19057 843.47450 305.24346 2030.49108
7.85000 -2752.79845 -18.43102 -52.55319 840.42667 358.86453 1974.09045
7.95000 -2711.70469 7.60057 -73.27888 801.45614 452.38982 1983.06323
8.05000 -2696.21330 0.52920 -21.85386 879.74548 255.96568 1962.38928
8.15000 -2691.61768 -1.24240 62.39853 785.69942 234.61730 1928.96088
8.25000 -2640.89968 -8.10310 -38.82439 795.48454 262.45608 1976.50390
8.35000 -2650.03929 -0.00827 -38.32782 780.86809 246.50030 1919.67360
8.45000 -2630.09517 8.00775 -14.11585 1025.45203 613.88240 1974.08396
8.55000 -2619.36788 -2.11839 -78.38052 769.67992 221.15170 1909.32284
8.65000 -2588.99432 4.79161 -32.75711 821.83514 375.05826 1912.89771
8.75000 -2601.01752 12.00378 -61.37721 749.61592 207.67871 1872.70699
8.85000 -2565.94340 -1.19122 -81.09822 771.59796 231.73738 1867.28731
8.95000 -2580.33439 -2.48778 -91.99000 750.75341 202.18755 1841.02610
9.05000 -2523.16818 6.12854 -52.78569 759.11260 201.33914 1867.80601
9.15000 -2538.84783 19.66519 -5.26776 741.24645 835.61824 1839.95958
9.25000 -2499.34572 1.68822 -76.86751 765.38052 194.59363 1845.23713
9.35000 -2509.76079 -4.49204 -53.78097 712.91999 180.37716 1806.87621
9.45000 -2506.43222 -8.08895 -110.76910 735.00792 196.23432 1779.12538
9.55000 -2456.44379 -3.31203 -34.52851 744.98313 225.87942 1822.58079
9.65000 -2445.46780 3.46428 -56.52749 716.54414 186.26215 1797.05661
9.75000 -2432.51570 -0.57816 -74.62908 731.16374 211.82025 1781.76129
9.85000 -2408.05817 0.71699 -40.12413 731.96698 178.82985 1781.94048
9.95000 -2396.11956 2.31607 -86.09793 726.12761 177.91331 1783.58594
10.05000 -2379.83432 -5.52744 -50.47698 715.63390 175.05387 1762.42995
10.15000 -2383.83050 3.26519 -70.66423 700.55313 170.46176 1754.86137
10.25000 -2331.11913 -1.61573 -135.41518 728.77607 171.43555 1771.10870
10.35000 -2317.17387 1.56233 -70.50660 716.99427 203.25247 1768.55129
10.45000 -2339.59313 1.77217 -15.60290 692.92578 188.61759 1724.47580
10.55000 -2324.65943 -0.94787 -50.29926 685.18507 160.96901 1714.54820
10.65000 -2307.70192 -1.38086 -82.52452 689.31246 174.57808 1706.75165
10.75000 -2300.35604 4.25152 -60.80734 659.72807 155.22838 1700.09846
10.85000 -2275.28086 -2.88887 -72.14147 674.49761 168.32723 1690.36305
10.95000 -2278.56338 1.37914 -105.00510 664.93717 213.67412 1680.07148
11.05000 -2255.21167 2.34376 -82.23903 654.83526 142.37117 1672.06813
11.15000 -2256.85645 0.01296 -51.98935 655.90031 143.21198 1641.42355
11.25000 -2232.73434 -4.12919 -54.21329 653.01146 135.21702 1642.65108
11.35000 -2235.39917 -4.24222 -63.80875 1469.98563 942.99025 1691.46014
11.45000 -2215.03714 -1.44372 -90.75546 642.65045 158.22689 1623.02511
11.55000 -2179.93143 -1.90564 -16.94455 643.08315 137.38255 1640.93760
11.65000 -2178.27525 1.48688 -67.16554 642.39020 136.91843 1617.86351
11.75000 -2183.16282 1.84642 -76.10063 632.32995 173.39603 1595.39326
11.85000 -2151.79726 -4.86387 -79.15370 646.60371 140.45514 1611.08745
11.95000 -2158.34153 -1.08660 -91.28950 642.54447 140.68757 1585.16698
12.05000 -2146.84195 2.39385 -88.99753 619.75045 130.95764 1569.91459
12.15000 -2135.43542 -0.04504 -114.16512 624.93837 163.33360 1558.19053
12.25000 -2105.21244 -2.76487 -125.28078 620.09433 125.90304 1573.97349
12.35000 -2122.58206 -0.34556 -62.47378 611.91400 125.10589 1532.57534
12.45000 -2082.40397 1.94199 -85.67079 618.66426 120.73944 1552.25328
12.55000 -2079.38901 0.52104 -72.60626 613.83088 155.42506 1536.29071
12.65000 -2064.07263 1.31973 -61.29845 612.11045 129.14968 1535.56119
12.75000 -2056.72911 -1.54324 -39.50473 604.64028 129.19203 1518.63504
12.85000 -2034.88136 -0.96498 -124.85185 622.60895 138.00018 1532.12259
12.95000 -2032.35206 3.81592 -126.73649 608.73895 117.66211 1511.63477
13.05000 -2023.36109 -1.74976 -82.92824 589.91871 124.90034 1503.52798
13.15000 -2031.48506 2.39052 -87.87005 567.76758 148.47341 1479.88722
13.25000 -2002.12780 0.82809 -79.20291 593.78160 169.22010 1485.11105
13.35000 -1985.26447 2.11401 -62.47163 581.84825 124.93063 1487.48420
13.45000 -1981.69747 0.32692 -74.93755 579.57855 144.00955 1476.34459
13.55000 -1971.18163 -2.75695 -92.86608 578.44661 135.47536 1471.32549
13.65000 -1958.33394 -0.21204 -118.10521 588.49050 114.51249 1461.99793
13.75000 -1959.71304 -0.97260 -67.57109 574.43532 117.32918 1439.63213
13.85000 -1956.06227 0.60198 -124.44381 572.28364 136.18890 1432.42525
13.95000 -1941.51003 -1.60572 -78.32238 571.75362 112.54442 1432.33838
14.05000 -1950.49886 0.98336 -54.38969 543.96493 146.48564 1401.73114
14.15000 -1923.65871 1.20645 -104.54650 553.70372 89.64492 1417.40000
14.25000 -1929.11609 0.52035 -39.20195 559.94704 123.04860 1382.78849
14.35000 -1905.96137 -0.91882 -36.85841 544.18901 95.48207 1392.25625
14.45000 -1889.61023 1.51217 -1.48876 540.94871 95.69497 1387.70255
14.55000 -1875.99312 0.70468 -88.51004 543.17021 107.45555 1398.96524
14.65000 -1865.35337 0.48417 -27.51586 543.18662 107.35588 1382.95935
14.75000 -1861.22465 1.97279 23.46356 532.78427 97.51424 1364.11019
14.85000 -1858.50207 0.59701 -63.31013 547.30922 130.22498 1364.87589
14.95000 -1852.93715 -0.52787 -100.72727 534.90929 93.12624 1357.18914
15.05000 -1827.68424 -2.51385 -21.98731 536.60690 138.82038 1359.34427
15.15000 -1816.73399 -0.29259 -55.52693 531.33333 89.85781 1356.76247
15.25000 -1821.74886 1.66325 -28.44929 526.73232 99.42775 1328.83248
15.35000 -1808.74794 0.16553 -50.40768 528.51100 150.52821 1328.73304
15.45000 -1812.27984 1.01087 -90.49053 515.26182 82.53573 1314.26270
15.55000 -1802.48328 3.27302 -106.53788 518.45968 88.64617 1310.56626
15.65000 -1771.97097 -0.73339 -44.95339 524.89214 86.57934 1317.98463
15.75000 -1783.88831 -0.46105 -50.17174 512.91151 104.16594 1289.84564
15.85000 -1771.31214 0.60006 -46.61927 505.75876 123.10150 1289.41592
15.95000 -1776.19777 0.27687 -27.40716 488.78936 75.59866 1272.64577
16.05000 -1741.69589 0.17883 -95.90458 514.43151 76.99622 1295.21543
16.15000 -1750.56740 2.17467 -42.22488 786.53854 211.21948 1293.96979
16.25000 -1711.60024 2.60287 -62.78769 518.19299 87.29447 1297.90273
16.35000 -1717.38772 -3.96089 -80.18789 564.87192 143.23997 1309.12810
16.45000 -1715.47862 2.64248 -46.52038 494.18985 82.83712 1261.97305
16.55000 -1712.35027 0.16479 -27.60442 485.32790 82.43874 1250.90183
16.65000 -1703.40877 -1.41404 -77.95670 490.71070 81.64378 1245.98785
16.75000 -1689.63290 -0.39505 -86.09394 511.00813 176.84005 1282.80530
16.85000 -1689.86875 -1.50823 -103.80899 493.14901 78.28442 1233.93174
16.95000 -1664.46750 -2.00245 -108.17675 496.99019 176.30359 1253.51905
17.05000 -1677.57429 1.43691 -59.47495 472.56898 75.69252 1222.30617
17.15000 -1663.87342 -0.47532 -70.28635 481.44269 71.32992 1220.06314
17.25000 -1644.29575 -1.10037 -55.78400 482.93871 92.44822 1230.52964
17.35000 -1652.13179 -0.48273 -85.04786 484.36814 100.99132 1201.01439
17.45000 -1635.98456 0.37669 -59.27553 481.27267 91.21453 1205.39787
17.55000 -1622.75689 1.02084 -30.17083 467.68032 120.31704 1207.60950
17.65000 -1629.55323 -0.66723 -89.17407 459.98515 68.97844 1187.61726
17.75000 -1604.29636 1.36107 -49.57468 480.48092 142.11961 1199.62817
17.85000 -1619.92250 2.13770 -63.28552 456.41112 73.02048 1170.39587
17.95000 -1586.39499 0.50476 -59.93897 467.61890 69.93597 1197.86505
18.05000 -1580.79565 -0.37025 -92.42838 462.89546 63.87847 1190.29202
18.15000 -1584.85769 -1.31048 -50.71115 465.17012 70.57794 1164.18913
18.25000 -1592.00474 -0.75764 -77.68191 443.97088 64.00179 1148.79245
18.35000 -1579.71454 -1.96463 -55.80280 443.83652 123.48819 1148.85570
18.45000 -1557.13822 0.11936 -48.62555 455.56072 62.10086 1168.16651
18.55000 -1546.00146 -0.76922 -55.07417 451.91017 87.86988 1159.80258
18.65000 -1547.27108 -0.74592 -26.81302 449.32222 102.89991 1140.92043
18.75000 -1540.49431 0.59833 -81.43136 443.64481 70.25152 1138.01468
18.85000 -1535.10396 -0.62233 -37.59702 441.68794 79.52556 1129.87460
18.95000 -1531.52371 1.16383 -54.00388 433.06455 78.83529 1127.07136
19.05000 -1518.54124 -0.11968 -59.95551 438.52474 83.10401 1126.90645
19.15000 -1521.48518 -0.79083 -40.24526 429.07033 66.04556 1111.19266
19.25000 -1496.47927 0.68452 -92.86241 441.38099 66.12651 1125.22935
19.35000 -1499.96253 -1.00564 -31.78516 426.09223 57.48476 1108.00417
19.45000 -1487.45832 -0.27816 -32.47081 443.63917 68.90991 1109.91969
19.55000 -1483.88897 0.11104 -47.12732 433.23647 95.65756 1101.54011
19.65000 -1490.72671 -0.30196 -36.25617 425.31552 56.11077 1080.64480
19.75000 -1470.39409 -0.08795 -69.60642 428.92060 52.57099 1091.07737
19.85000 -1456.05448 1.92557 -44.34645 435.22940 68.26715 1095.37658
19.95000 -1461.50827 1.92727 -50.30593 424.15428 56.68970 1076.00974
