0.05000 -11157.90118 3493.28525 -5330.69085 23702.20522 21709.51741 16513.05993
0.15000 -28083.72448 -1189.73762 -2008.26891 16196.73630 20037.27633 27301.29552
0.25000 -33175.62790 105.09266 -1591.25257 13563.88297 13700.87622 32882.08834
0.35000 -34371.51678 -128.80263 -565.40866 12089.65232 9868.02012 30099.56033
0.45000 -31622.54788 -269.42618 -576.65712 11004.69808 7306.08772 27387.47034
0.55000 -28831.39769 -240.04868 -798.45028 9642.59984 5755.78371 25163.78656
0.65000 -26155.56729 22.97711 369.23835 8455.66238 4834.28949 22381.38664
0.75000 -24332.12300 -91.78685 36.63719 7529.46024 4523.31024 20481.34047
0.85000 -22989.47857 75.58775 102.03826 6853.83046 3958.09512 18591.33161
0.95000 -21382.61732 3.41714 -100.20620 6375.91093 3602.61967 17296.04161
1.05000 -20115.21677 122.55530 -144.55866 5783.50098 3426.79330 16028.17767
1.15000 -18970.97488 -96.59469 6.04411 5206.27658 3138.03521 14934.81373
1.25000 -18181.93326 -22.51978 69.27003 4811.46386 3175.20535 13763.81456
1.35000 -17268.92925 -30.33457 351.17242 4418.29739 2882.16711 12923.46828
1.45000 -16549.70007 19.31580 81.97536 4264.59570 2906.36700 12134.87638
1.55000 -15829.28232 -80.68712 -123.54090 3937.01454 2601.59492 11534.94870
1.65000 -15348.02386 39.24417 -23.82657 3678.37726 2659.27352 10729.03426
1.75000 -14750.49789 8.03207 124.17970 3360.78744 2455.63293 10133.11701
1.85000 -14242.57291 44.17997 -65.39912 3335.83612 2445.62758 9579.47364
1.95000 -13699.27610 27.54898 -97.73669 3125.60809 2274.74439 9152.28611
2.05000 -13296.48916 -55.92563 109.14863 2869.67875 2211.43282 8651.88622
2.15000 -12818.79326 12.55200 354.07991 2792.81107 2199.64748 8340.08417
2.25000 -12568.96435 57.22696 77.76466 2646.40319 2101.88529 7841.13168
2.35000 -12146.82974 32.47826 -108.73853 2483.04859 2039.64165 7611.83619
2.45000 -11822.56376 -9.80243 -21.64445 2362.09125 2010.20099 7268.88461
2.55000 -11416.17421 -42.38465 107.37626 2325.38643 1828.92901 7164.84579
2.65000 -11218.42235 31.23234 -57.44647 2169.49519 1779.76354 6687.35442
2.75000 -10899.51742 8.01189 85.80910 2075.67432 1762.07207 6549.75296
2.85000 -10615.54248 -51.04212 94.27299 2023.57531 1835.02264 6357.29100
2.95000 -10402.09973 39.72578 129.57790 2028.46310 1768.83276 6076.15103
3.05000 -10257.22321 103.82544 56.58940 1716.22043 1638.40486 5792.39484
3.15000 -9940.27053 1.19876 67.55391 1969.09504 1614.04870 5675.46683
3.25000 -9754.06619 30.86402 266.24643 1635.17807 1486.32067 5512.13254
3.35000 -9532.65630 -12.49571 62.11604 1700.93071 1462.23081 5419.39781
3.45000 -9418.61038 35.70334 41.74629 1515.64547 1401.41512 5116.84637
3.55000 -9194.26690 5.44818 100.49988 1479.16618 1342.65479 5051.82488
3.65000 -9046.53192 42.91640 -114.21899 1534.92999 1357.77240 4850.64256
3.75000 -8775.50857 11.26678 73.61184 1597.47345 1285.41227 4835.58268
3.85000 -8664.28152 40.93126 123.85108 1323.47417 1208.15817 4648.03944
3.95000 -8531.55001 12.01161 184.01270 1217.93764 1340.45489 4510.71598
4.05000 -8356.37675 51.77971 -12.17007 1381.13698 1259.88885 4344.77475
4.15000 -8197.15484 1.23608 11.91271 1115.50195 1141.98863 4193.48045
4.25000 -8017.06070 30.00083 69.91639 1133.09082 1088.94538 4150.16254
4.35000 -7966.23740 -49.41963 -60.83732 1069.41863 1364.59640 3985.99339
4.45000 -7808.53268 38.86088 191.69529 1055.82342 1023.18192 3823.53190
4.55000 -7665.39294 -45.44900 64.66585 979.74078 998.31419 3843.28545
4.65000 -7558.65971 12.30289 -71.89423 968.94014 1022.66447 3719.46648
4.75000 -7484.31387 5.61829 -22.50560 877.54071 925.24030 3538.41693
4.85000 -7290.49326 21.66436 119.13092 958.96652 1046.17267 3621.99200
4.95000 -7253.79304 11.91816 -1.71211 977.87407 1152.75255 3472.03616
5.05000 -7166.22780 -20.43180 -57.76506 838.60723 971.28188 3325.60431
5.15000 -6983.54271 -18.18197 118.16769 803.42335 853.31829 3284.78191
5.25000 -6912.60573 33.28602 202.80790 797.12617 864.01565 3141.40566
5.35000 -6857.23564 12.52371 -29.70500 764.72502 889.49389 2986.08193
5.45000 -6710.28449 -44.12211 103.09498 976.80651 983.58054 3027.26694
5.55000 -6627.46402 26.04998 89.95021 651.02031 744.06688 2860.31858
5.65000 -6569.82928 43.18260 100.35143 721.73566 778.26261 2743.27655
5.75000 -6457.54960 41.71867 -55.82533 645.00201 718.60631 2740.11970
5.85000 -6388.62141 9.23891 -11.43022 561.46550 738.33024 2774.66363
5.95000 -6319.69583 7.39299 80.24299 594.22739 776.87443 2505.61833
6.05000 -6260.82990 31.34490 88.90665 906.86712 1038.13970 2433.39749
6.15000 -6199.51801 9.32614 32.82072 507.61924 674.40177 2348.76038
6.25000 -6126.19300 5.49821 -101.26649 737.46939 759.25569 2341.06515
6.35000 -6043.93070 -5.05083 48.82070 530.11046 722.92487 2251.76534
6.45000 -5999.62070 -17.51502 86.48788 466.64086 652.02677 2153.11128
6.55000 -5926.22961 -2.58190 51.28955 474.69672 660.97150 2051.80488
6.65000 -5863.20199 -17.09013 103.41396 434.35458 578.58168 1957.69583
6.75000 -5801.71199 9.87755 -8.83052 430.68042 621.60871 2154.85498
6.85000 -5756.39423 -18.68183 41.51418 357.07343 582.93670 1880.92464
6.95000 -5695.02767 -16.78500 -28.57682 604.38442 773.68438 1868.33928
7.05000 -5668.94873 -21.27107 45.98842 428.90158 704.83468 1794.73610
7.15000 -5643.71281 17.96479 -122.86897 399.96120 549.72528 1616.08731
7.25000 -5582.37773 -34.79884 -8.89483 371.73274 510.32800 1635.69982
7.35000 -5549.91931 -19.09555 -29.46476 433.04751 582.77479 1584.65082
7.45000 -5489.52822 -13.93877 -16.42383 461.83335 559.53176 1478.15804
7.55000 -5464.75152 -5.92112 -44.16552 381.97005 523.54680 1465.10381
7.65000 -5438.36012 -24.51218 12.88573 445.39799 524.38736 1426.78397
7.75000 -5411.52718 -29.71360 -76.56974 418.69804 575.07968 1369.74598
7.85000 -5384.44771 -29.37656 19.63184 426.78816 491.79153 1314.30564
7.95000 -5364.91563 -41.28851 -17.86935 515.64214 489.80301 1291.76598
8.05000 -5333.00033 -22.27802 44.92933 483.89770 424.18146 1198.77383
8.15000 -5299.44487 1.61036 -99.83257 441.02141 455.31293 1218.41697
8.25000 -5240.70230 -4.87783 -18.03101 798.71630 650.45607 1255.30019
8.35000 -5237.88858 -5.89086 -61.18518 585.86007 449.16994 1169.82050
8.45000 -5219.11395 -18.46908 -11.67352 718.15197 486.42145 1151.00721
8.55000 -5147.66384 -5.43724 -39.65448 520.19036 589.78347 1082.96815
8.65000 -5085.31280 -2.43810 73.40147 432.05109 361.41872 1061.74114
8.75000 -5043.88455 7.18712 -1.41707 466.98322 331.46351 1063.70728
8.85000 -5016.66813 8.18730 -36.22787 420.04973 324.55295 1008.44934
8.95000 -4972.04785 -5.51119 -4.04045 445.55287 339.04432 996.30801
9.05000 -4946.27662 -4.94899 -2.81002 451.64768 307.74958 948.13072
9.15000 -4867.56220 -1.53547 -25.21488 387.31461 325.62766 925.52728
9.25000 -4827.54564 -6.96767 10.25705 429.97249 296.02656 935.72123
9.35000 -4783.35271 9.58332 16.30216 672.04466 433.90475 1042.22390
9.45000 -4716.04044 8.98493 7.77945 526.50222 323.86380 860.58860
9.55000 -4691.07605 10.87395 -16.70688 361.60550 269.71531 880.17872
9.65000 -4649.33123 19.67348 6.82870 614.96784 1026.67859 1052.57516
9.75000 -4645.71723 -15.15811 4.69620 360.80987 290.85413 781.64121
9.85000 -4599.15846 8.62121 -25.78809 392.61137 340.41774 830.30523
9.95000 -4553.05794 8.26338 15.06813 364.31276 259.95505 837.18817
10.05000 -4465.80252 23.23886 -13.19117 540.03230 460.30459 999.25867
10.15000 -4460.03184 1.02219 8.01339 287.42966 263.05112 740.61118
10.25000 -4406.76864 7.79293 -8.97957 317.51999 212.29570 709.48299
10.35000 -4365.45717 2.01129 -16.27331 295.45490 182.56090 701.96987
10.45000 -4326.05196 15.10932 16.22525 277.99527 206.15652 734.79225
10.55000 -4269.00180 7.93287 13.30456 331.79024 204.42121 678.06862
10.65000 -4250.55782 4.80771 -35.41061 283.11302 277.04794 687.39078
10.75000 -4214.74891 9.01059 50.21434 274.36441 243.86338 683.38071
10.85000 -4189.55027 2.73695 -13.60430 276.63950 204.90517 647.73492
10.95000 -4147.75374 -1.66583 -3.04289 206.77522 170.89137 647.20337
11.05000 -4085.12881 -6.63124 23.97340 637.02728 296.87064 839.01659
11.15000 -4074.99612 -7.39028 -25.66116 204.62527 143.72487 604.84855
11.25000 -4055.48711 1.94752 14.74158 204.24820 186.83447 612.56518
11.35000 -4005.00522 28.51417 5.55200 450.05574 598.41810 618.53199
11.45000 -3995.70425 9.13433 14.89156 228.98327 200.44712 580.31564
11.55000 -3956.47017 6.61193 6.78079 196.51353 174.59971 571.51622
11.65000 -3959.17907 -0.42435 35.53930 332.17258 142.30908 563.87534
11.75000 -3910.83729 -0.87295 10.83171 176.33311 150.47730 530.75342
11.85000 -3869.14210 -5.11631 3.16717 212.41034 186.64663 576.68532
11.95000 -3850.31112 0.06075 -2.53158 236.22391 143.59821 598.84464
12.05000 -3795.21227 3.40211 52.98323 376.34072 229.46180 511.08827
12.15000 -3789.31419 -0.16258 22.29369 168.12788 128.74587 524.49032
12.25000 -3765.04167 7.19525 22.79521 174.53712 168.72039 486.31014
12.35000 -3726.69672 -5.22272 47.72577 260.27574 291.46511 518.41353
12.45000 -3683.30797 2.04592 38.00139 174.10370 126.06617 522.19884
12.55000 -3673.09450 3.58138 44.46531 168.64369 137.80818 476.26112
12.65000 -3651.70149 -0.90017 15.10308 224.90407 181.17033 486.54539
12.75000 -3609.30721 4.97640 30.70768 212.52654 138.68885 498.27539
12.85000 -3581.60585 -2.75288 20.56705 249.74424 247.26443 472.18913
12.95000 -3558.58534 4.85684 21.42297 232.54416 126.39727 456.58892
13.05000 -3541.04044 -0.25034 26.76624 172.93166 167.10418 444.42468
13.15000 -3506.42714 -5.16806 15.37675 211.69836 198.74568 450.88212
13.25000 -3474.40838 -3.58283 4.68457 368.33827 171.03532 445.69223
13.35000 -3463.41248 11.91971 36.77229 168.84586 152.09086 435.57131
13.45000 -3448.27425 -8.26974 21.65993 155.62924 191.60146 501.66256
13.55000 -3415.00181 -1.17480 56.38400 137.10041 116.07088 405.43029
13.65000 -3399.32497 -0.74419 47.49022 152.30341 136.11183 394.45683
13.75000 -3368.92177 -10.56123 63.36514 186.63354 182.11035 409.63072
13.85000 -3357.73729 -16.74734 36.96155 224.49982 218.12574 445.11278
13.95000 -3314.54148 13.16719 25.43794 181.77004 144.80720 400.90778
14.05000 -3296.77073 1.02464 40.40408 131.76638 97.16196 390.42962
14.15000 -3290.56718 3.07995 23.44163 154.75026 105.14341 522.39620
14.25000 -3265.54095 -1.38880 16.00001 149.77154 110.86741 356.89729
14.35000 -3197.15446 -14.83600 40.39277 697.32832 414.57891 377.54279
14.45000 -3216.93655 3.43207 24.45913 110.43812 81.93390 338.92530
14.55000 -3177.54163 1.41144 16.37117 183.05004 86.08391 369.58636
14.65000 -3190.94476 -7.40597 39.40994 732.92856 287.26904 329.14426
14.75000 -3138.12509 1.57235 17.06106 135.81349 79.63910 328.85329
14.85000 -3119.91605 -9.35654 19.16566 194.86146 162.43936 367.42377
14.95000 -3098.35561 14.21965 -16.97221 130.91167 149.16840 343.38920
15.05000 -3074.09013 12.20674 10.23254 188.87472 150.21769 338.75065
15.15000 -3053.34096 5.77246 38.40161 111.49781 80.14562 312.26883
15.25000 -3029.42435 1.71611 -14.57535 98.83070 83.76761 314.53225
15.35000 -3003.86686 -1.64815 9.26321 118.01803 101.94672 297.39398
15.45000 -3003.94181 2.25776 17.92843 97.52570 71.68035 277.41919
15.55000 -2973.38178 7.49005 8.32017 104.93321 99.35366 298.04479
15.65000 -2969.82774 6.75860 25.76570 172.69462 122.46562 290.49284
15.75000 -2932.88994 0.56690 21.21076 107.67405 88.43575 277.19242
15.85000 -2918.07675 -2.59985 -7.92132 131.67856 137.31854 271.63078
15.95000 -2895.28200 3.45527 28.60955 94.69628 84.68226 278.91193
16.05000 -2882.28249 3.78661 25.18618 119.25889 100.29001 291.24297
16.15000 -2862.96232 0.99067 -7.15339 114.61182 74.38749 261.22269
16.25000 -2842.24865 5.18511 22.09928 87.33317 154.92352 273.21744
16.35000 -2880.46615 -33.21235 14.03144 1171.44611 563.83982 276.02533
16.45000 -2808.32952 -3.32302 -6.82881 90.26615 97.96956 265.37964
16.55000 -2790.64637 1.46269 10.18162 104.13772 77.47132 263.67170
16.65000 -2774.69073 -6.15615 -6.05591 137.63303 92.53691 285.77363
16.75000 -2752.74052 4.90836 -2.40550 154.04014 151.14500 320.49220
16.85000 -2743.68780 0.35702 7.79282 75.90728 65.64763 252.65677
16.95000 -2720.84057 4.15413 16.01158 219.63050 114.72678 257.99891
17.05000 -2710.14078 4.92404 8.33837 73.85811 69.61104 235.62760
17.15000 -2692.27587 -3.71624 36.96143 80.50540 155.85181 231.58402
17.25000 -2680.67251 1.19305 37.22019 73.90785 70.24871 235.81957
17.35000 -2665.10255 0.64664 35.12976 77.23493 65.52506 243.64046
17.45000 -2656.70162 7.94756 3.53479 75.66458 71.52286 213.82069
17.55000 -2635.43946 -2.23206 28.87554 191.10680 67.42484 365.97920
17.65000 -2615.36671 8.97539 34.19843 69.21395 61.14053 223.04603
17.75000 -2602.14656 5.67783 10.90971 77.88391 74.59909 223.74552
17.85000 -2584.91647 4.56350 31.45328 91.83039 60.90941 210.32080
17.95000 -2580.05259 6.33448 1.27465 75.74536 62.26937 229.22708
18.05000 -2564.63138 13.82413 48.13176 69.84945 77.04421 215.38158
18.15000 -2531.70016 9.47034 22.29470 170.45584 118.32120 208.53052
18.25000 -2534.68657 10.84122 8.81264 59.09427 69.99473 273.94910
18.35000 -2509.34902 3.82170 8.34289 117.18160 98.50435 216.06251
18.45000 -2490.50130 6.25144 20.44666 74.89305 58.71774 210.93699
18.55000 -2476.84252 -0.58125 21.48160 79.81835 99.78677 220.67593
18.65000 -2468.66095 8.18506 -3.30169 65.82991 58.81564 199.78478
18.75000 -2449.57462 4.13656 0.93085 93.93742 112.83230 316.25525
18.85000 -2466.50102 -6.01333 -7.70066 257.93080 139.65872 317.49973
18.95000 -2424.53504 2.03360 -0.17213 66.45943 63.54841 210.74636
19.05000 -2409.92653 9.75390 -13.44677 95.83926 82.76301 218.45085
19.15000 -2401.13930 -4.64660 5.46678 111.64546 121.74262 203.27420
19.25000 -2411.05580 -7.37012 21.24905 263.46915 108.75380 210.02031
19.35000 -2369.13831 0.26731 -0.82518 81.12545 59.77764 198.65026
19.45000 -2358.84579 4.62399 5.01019 67.67486 64.19935 207.58846
19.55000 -2342.66266 5.91183 18.67242 65.96537 54.85785 193.83107
19.65000 -2327.63552 9.74085 8.83339 50.04499 47.32048 178.92387
19.75000 -2321.40847 -1.96721 26.30506 62.14605 95.86883 198.44425
19.85000 -2330.32665 -9.05330 3.02563 261.38169 190.82103 206.90950
19.95000 -2286.07187 6.79879 4.49186 88.58398 55.97469 184.85328
