0.125 0.001 -0.001 0.006
0.375 0.006 0.002 0.061
0.625 0.004 -0.034 0.318
0.875 -0.059 -0.031 0.963
1.125 -0.054 -0.110 1.711
1.375 -0.134 -0.013 2.608
1.625 -0.182 -0.131 3.487
1.875 -0.115 -0.101 4.238
2.125 -0.187 -0.150 5.100
2.375 -0.249 -0.023 5.692
2.625 -0.166 -0.162 6.241
2.875 -0.292 -0.223 6.878
3.125 -0.287 -0.298 7.335
3.375 -0.180 -0.171 7.591
3.625 -0.313 -0.283 7.856
3.875 -0.290 -0.269 8.402
4.125 -0.334 -0.424 8.331
4.375 -0.439 -0.338 9.441
4.625 -0.425 -0.383 9.810
4.875 -0.426 -0.419 10.985
5.125 -0.340 -0.351 11.784
5.375 -0.570 -0.511 13.038
5.625 -0.542 -0.615 15.040
5.875 -0.510 -0.566 16.886
6.125 -0.528 -0.767 19.601
6.375 -0.563 -0.745 21.169
6.625 -0.500 -0.710 22.363
6.875 -0.732 -0.887 24.750
7.125 -0.652 -0.893 25.347
7.375 -0.678 -0.836 24.963
7.625 -0.628 -0.804 24.369
7.875 -0.649 -0.840 23.870
8.125 -0.602 -0.795 23.279
8.375 -0.579 -0.861 23.853
8.625 -0.569 -0.774 23.039
8.875 -0.478 -0.768 21.950
9.125 -0.527 -0.681 22.705
9.375 -0.423 -0.688 22.255
9.625 -0.446 -0.598 22.226
9.875 -0.469 -0.625 22.422
10.125 -0.397 -0.476 22.046
10.375 -0.476 -0.540 22.055
10.625 -0.479 -0.493 21.468
10.875 -0.459 -0.520 20.929
11.125 -0.452 -0.455 21.664
11.375 -0.491 -0.414 19.687
11.625 -0.433 -0.618 19.929
11.875 -0.471 -0.550 19.371
12.125 -0.441 -0.519 19.886
12.375 -0.447 -0.455 19.813
12.625 -0.435 -0.642 19.053
12.875 -0.421 -0.457 18.482
13.125 -0.461 -0.548 19.014
13.375 -0.402 -0.550 17.616
13.625 -0.354 -0.426 17.965
13.875 -0.315 -0.482 18.131
14.125 -0.346 -0.510 18.344
14.375 -0.315 -0.493 17.656
14.625 -0.312 -0.437 17.061
14.875 -0.240 -0.437 16.788
15.125 -0.285 -0.476 17.012
15.375 -0.304 -0.372 15.596
15.625 -0.221 -0.375 15.112
15.875 -0.190 -0.382 15.530
16.125 -0.226 -0.377 14.612
16.375 -0.211 -0.276 13.741
16.625 -0.217 -0.290 13.035
16.875 -0.205 -0.248 12.710
17.125 -0.230 -0.213 11.382
17.375 -0.288 -0.203 11.187
17.625 -0.247 -0.185 10.567
17.875 -0.206 -0.194 9.688
18.125 -0.201 -0.175 8.193
18.375 -0.207 -0.173 8.553
18.625 -0.224 -0.140 7.849
18.875 -0.192 -0.183 6.737
19.125 -0.170 -0.182 6.754
19.375 -0.154 -0.165 6.030
19.625 -0.169 -0.157 6.222
19.875 -0.140 -0.187 5.808
