0.450000 1.235920
1.350000 1.270400
2.250000 1.343200
3.150000 1.272210
4.050000 1.179910
4.950000 1.178120
5.850000 1.095660
6.750000 0.164850
7.650000 -0.089900
8.550000 2.469250
9.450000 2.074880
10.350000 -0.292180
11.250000 -1.176830
12.150000 -1.573060
13.050000 -1.813750
13.950000 -2.163320
14.850000 3.120910
15.750000 1.374330
16.650000 -2.501340
17.550000 -0.739350
