0.12500 0.01822
0.37500 0.02506
0.62500 0.02268
0.87500 0.01551
1.12500 0.02999
1.37500 0.05956
1.62500 0.07147
1.87500 0.07855
2.12500 0.06185
2.37500 0.04450
2.62500 0.04085
2.87500 0.03233
3.12500 0.04778
3.37500 0.02772
3.62500 0.02862
3.87500 0.02143
4.12500 0.01699
4.37500 0.01639
4.62500 0.01924
4.87500 0.00613
5.12500 0.00549
5.37500 0.01263
5.62500 0.01277
5.87500 0.03586
6.12500 0.01600
6.37500 0.03177
6.62500 0.01870
6.87500 0.00171
7.12500 0.03589
7.37500 0.02980
7.62500 0.02097
7.87500 0.03383
8.12500 0.01365
8.37500 0.03308
8.62500 0.01216
8.87500 0.02824
9.12500 0.02357
9.37500 0.01587
9.62500 0.00237
9.87500 0.03072
10.12500 0.00782
10.37500 0.01384
10.62500 0.04827
10.87500 0.00026
11.12500 0.01918
11.37500 0.01936
11.62500 0.02725
11.87500 0.02170
12.12500 0.04111
12.37500 0.02736
12.62500 0.04140
12.87500 0.04781
13.12500 0.04678
13.37500 0.05032
13.62500 0.03422
13.87500 0.04716
14.12500 0.02504
14.37500 0.02918
14.62500 0.04247
14.87500 0.02089
15.12500 0.02668
15.37500 0.04488
15.62500 0.03630
15.87500 0.02503
16.12500 0.10212
16.37500 0.03709
16.62500 0.05911
16.87500 0.03256
17.12500 0.07366
17.37500 0.03530
17.62500 0.07010
17.87500 0.11113
18.12500 0.01587
18.37500 0.08214
18.62500 0.02832
18.87500 0.04052
19.12500 0.04171
19.37500 0.13932
19.62500 0.04122
19.87500 0.03428
