0.05000 -23.54454 407.90612 -2388.49815 2284.43142 2982.86346 459.66722
0.15000 427.65528 -627.08276 -1935.37042 2989.24450 2175.67602 455.28090
0.25000 -339.46927 -401.63033 -1981.64819 2617.34359 2767.00050 681.54956
0.35000 -444.04472 214.38802 -2028.02505 2724.17233 2596.27439 1055.35630
0.45000 -725.56954 -289.23589 -1855.69686 2520.01469 2683.61579 1404.32930
0.55000 -670.63281 -126.19691 -1703.43610 2431.04115 2768.97691 1484.83903
0.65000 -954.00682 78.07475 -1578.33503 2271.51319 2512.65709 1788.54656
0.75000 -1091.92793 63.34993 -1361.94776 2043.36451 2612.69653 1854.49644
0.85000 -1601.53464 149.51201 -966.08649 1971.65592 2454.02016 2125.45360
0.95000 -1895.90494 -249.65421 -840.13959 1699.82351 2346.22523 2208.26278
1.05000 -2252.59174 -25.39058 -574.42339 1654.00169 2261.75593 2419.89632
1.15000 -2417.04661 -61.58931 -525.06378 1472.89223 2031.37161 2473.81266
1.25000 -2612.29171 77.44042 -507.95608 1399.37565 1858.60524 2545.49169
1.35000 -2840.88414 -52.41461 -516.66355 1355.10977 1753.74551 2462.79491
1.45000 -2825.82625 -60.24218 -312.47819 1464.48158 1693.63614 2539.97847
1.55000 -2982.08397 61.87723 -367.33422 1291.57976 1604.07531 2510.79673
1.65000 -3031.19766 -116.03434 -365.11926 1281.67927 1469.08774 2507.79037
1.75000 -3014.61747 63.06490 -471.34998 1285.35746 1382.11272 2530.00936
1.85000 -3086.76609 36.85780 -277.04383 1217.01760 1309.80223 2540.67935
1.95000 -3111.63425 59.11886 -238.02264 1221.49531 1255.93111 2532.42777
2.05000 -3147.20191 -10.80432 -250.83877 1139.61839 1205.80818 2537.99589
2.15000 -3131.98054 34.05582 -242.81214 1180.62693 1129.18489 2532.90953
2.25000 -3249.21030 -34.79888 -233.21683 1077.44053 1117.12245 2456.77339
2.35000 -3162.23611 -20.77189 -113.59695 1129.39126 1067.21819 2547.88752
2.45000 -3201.36894 -32.51871 -231.57692 1122.98450 1005.50799 2495.01975
2.55000 -3225.84074 10.33655 -224.10558 1099.25070 939.33772 2436.91924
2.65000 -3206.65042 -7.62932 -223.89825 1078.23984 916.98125 2442.83629
2.75000 -3223.98067 23.82313 -265.12982 1059.19456 883.14406 2439.42581
2.85000 -3247.05750 22.65289 -54.83168 1042.19400 889.87758 2345.58060
2.95000 -3149.36086 27.11416 -168.40051 1081.86912 801.47173 2444.33092
3.05000 -3144.47299 -7.25572 -167.84494 1065.79553 867.48968 2435.89992
3.15000 -3134.69942 -7.95584 -184.38378 1081.86058 759.76389 2391.95512
3.25000 -3141.46385 14.31366 -88.26296 1019.40485 728.85474 2376.79802
3.35000 -3137.57014 11.27718 -141.22736 1029.87158 719.20241 2364.86065
3.45000 -3100.67494 8.87059 -163.58220 1034.75932 711.81839 2420.81278
3.55000 -3100.97494 2.00702 -24.99002 1053.62083 679.44239 2407.17307
3.65000 -3159.82894 5.94649 -56.81568 994.29748 681.42189 2316.31855
3.75000 -3088.34005 8.23048 -31.78319 992.15869 649.48700 2357.93324
3.85000 -3135.80751 -11.18735 -126.10276 987.34658 659.27819 2297.66792
3.95000 -3110.37473 5.23838 -13.11495 959.05787 591.24005 2287.10129
4.05000 -3099.80658 15.17372 -106.98998 987.64043 584.22273 2272.96644
4.15000 -3057.98775 -15.94753 42.05087 971.24769 582.81093 2301.16501
4.25000 -3013.69786 4.45264 -58.51496 1004.03404 541.02883 2274.59660
4.35000 -2973.13640 13.90140 -177.60251 978.73892 537.13585 2307.74341
4.45000 -2968.43327 6.42876 -7.87532 958.98492 540.73994 2294.15360
4.55000 -3012.43388 3.03387 -17.05087 904.87099 515.59923 2236.30545
4.65000 -2989.61228 11.01624 1.25895 929.57291 496.90470 2236.54760
4.75000 -2985.76565 8.14519 -58.75709 918.59653 464.62396 2231.22955
4.85000 -2933.74076 12.50373 -100.00311 906.30641 469.20232 2260.55568
4.95000 -2967.70102 -7.11041 -6.78839 884.04721 476.03447 2199.10146
5.05000 -2978.58797 5.79131 47.20827 880.19445 446.19884 2172.76684
5.15000 -2927.11654 -1.59505 -79.14874 919.74046 439.09561 2191.36958
5.25000 -2921.24869 -5.37857 -20.30696 904.73666 441.08457 2190.68674
5.35000 -2870.71274 -6.29732 17.46113 886.69861 418.26114 2222.63404
5.45000 -2904.69027 -10.79458 -81.26672 886.70560 410.61176 2141.77664
5.55000 -2889.81701 -10.90788 6.36920 839.30206 403.43663 2147.23556
5.65000 -2867.40889 -9.35956 1.02884 841.55934 391.01994 2138.72929
5.75000 -2807.84460 -3.46409 -36.80887 865.25424 376.46977 2186.16817
5.85000 -2850.16190 -4.81331 -33.94069 862.17754 380.52696 2095.35165
5.95000 -2830.98205 -6.42033 -0.11337 844.32286 386.23531 2104.70584
6.05000 -2861.52177 6.96745 -85.45179 823.13137 343.72098 2032.52130
6.15000 -2796.49046 -6.22096 19.63287 845.37985 343.12079 2078.66972
6.25000 -2786.24670 -11.42458 -80.55625 820.83212 350.99265 2068.37473
6.35000 -2780.19228 2.21858 70.10532 826.49297 349.84258 2060.51948
6.45000 -2744.93707 -2.60327 70.35923 836.54348 347.01539 2071.07407
6.55000 -2768.09920 -18.55615 35.30222 799.17700 328.15385 2030.21722
6.65000 -2726.20314 -3.77229 -14.15721 824.87049 313.48792 2037.82092
6.75000 -2724.65236 -0.95712 37.66573 822.56484 316.35807 2030.17810
6.85000 -2717.43998 2.95719 75.14135 790.44702 297.66834 1989.28768
6.95000 -2697.44414 2.83802 22.97170 805.18787 298.34491 1995.68705
7.05000 -2666.63847 1.12808 16.03065 787.35561 288.78826 2001.05233
7.15000 -2660.13933 1.46277 18.23956 815.80057 327.30776 1991.98658
7.25000 -2626.68897 -1.61828 15.29467 807.39275 301.86250 1994.10284
7.35000 -2628.99446 -1.47238 62.08464 792.46855 269.18092 1958.13548
7.45000 -2629.34319 10.68116 26.69838 770.58390 270.69583 1936.58271
7.55000 -2625.76873 -2.51978 127.55778 764.50387 275.05967 1928.58025
7.65000 -2575.62846 -1.23989 1.02406 770.47831 272.05716 1958.46823
7.75000 -2573.63638 6.51534 25.17375 764.79148 265.86704 1930.12388
7.85000 -2571.67310 0.22901 -26.96343 748.12058 274.76323 1901.43630
7.95000 -2566.96209 -3.35174 -20.15721 751.08204 310.75203 1892.03556
8.05000 -2552.44403 -8.11442 5.81890 730.68984 245.68373 1888.57267
8.15000 -2517.09868 -6.41017 -40.79988 739.44597 255.05284 1896.12392
8.25000 -2524.30630 0.76215 -41.85958 762.47328 232.74587 1852.54359
8.35000 -2514.66737 -4.52596 53.93070 728.17208 234.02451 1856.39125
8.45000 -2511.66314 1.50006 9.81690 735.85208 233.02681 1831.11552
8.55000 -2478.25164 10.02530 26.82197 741.82136 219.46807 1846.57099
8.65000 -2481.32542 -0.08428 19.64558 704.41858 224.25186 1818.21998
8.75000 -2460.37067 1.93543 44.40721 725.15614 222.72154 1814.92357
8.85000 -2443.25969 3.66956 -17.79529 727.03365 213.35311 1807.24213
8.95000 -2424.36649 -0.66571 32.18584 712.47128 219.88294 1810.94885
9.05000 -2433.34692 0.13058 33.78521 685.23100 212.33701 1782.60818
9.15000 -2392.31020 2.32250 67.20335 717.82556 225.28248 1791.36477
9.25000 -2362.18275 6.11636 34.78687 713.97104 213.09802 1807.64078
9.35000 -2394.06100 -3.34657 46.07443 681.05749 199.94635 1747.27373
9.45000 -2348.15171 5.62378 17.45379 713.19555 196.28268 1760.78750
9.55000 -2356.26371 5.63953 -14.37471 684.35127 181.63763 1748.97648
9.65000 -2365.05918 -1.05853 3.87516 661.23431 205.98028 1715.02473
9.75000 -2331.31056 2.00859 43.00839 683.92254 187.63931 1724.62585
9.85000 -2315.14290 -0.02979 49.15502 673.89956 187.72603 1717.87252
9.95000 -2280.46263 -1.97090 52.42924 682.92193 191.33538 1739.04498
10.05000 -2298.78949 -7.20924 62.11914 663.33551 189.59870 1695.86104
10.15000 -2257.76952 2.51919 22.29693 672.45871 180.12986 1718.44913
10.25000 -2237.79179 1.62455 59.16461 693.45173 182.66565 1708.52495
10.35000 -2271.18091 0.22901 13.86719 642.09133 174.65063 1661.94473
10.45000 -2248.48939 3.57742 -16.73246 649.49039 165.60894 1659.47673
10.55000 -2214.29403 -0.82506 9.16246 652.37238 165.61683 1680.87467
10.65000 -2208.33631 -4.85064 18.62262 656.99343 181.87500 1657.66484
10.75000 -2190.00555 5.02182 -16.81362 647.16671 164.05308 1655.78476
10.85000 -2180.48878 -4.29764 32.85683 639.26057 165.67568 1650.69336
10.95000 -2203.13671 2.49030 -2.47890 613.43639 155.06734 1603.70357
11.05000 -2193.54122 5.05650 86.17167 612.60994 158.86335 1595.42048
11.15000 -2177.53096 3.76988 33.59650 618.10970 162.66785 1587.06691
11.25000 -2165.99950 -2.55555 2.78626 624.51611 160.65213 1585.82144
11.35000 -2154.55111 -3.98807 33.30515 628.01530 164.62546 1570.94240
11.45000 -2150.10378 0.64752 34.55244 628.77298 152.66031 1556.89304
11.55000 -2114.12780 -0.88460 60.94909 614.46924 157.67263 1585.86352
11.65000 -2099.62626 -2.05515 45.21180 619.58956 169.27594 1578.63433
11.75000 -2102.38733 1.25136 -11.72552 608.11363 151.96275 1554.58181
11.85000 -2098.81864 1.94536 -22.35463 609.07685 152.37579 1534.87492
11.95000 -2100.85041 1.47473 18.67309 596.67117 152.50524 1519.55386
12.05000 -2100.62162 -5.54736 -31.44578 582.86629 133.89878 1497.43334
12.15000 -2059.87216 -1.35400 19.33012 593.03420 130.85351 1526.90637
12.25000 -2081.44845 -1.65494 -64.44688 576.84918 128.66163 1479.88334
12.35000 -2056.86269 5.41619 39.10771 602.08386 155.34732 1486.08720
12.45000 -2028.12123 -1.66142 41.00378 596.10798 148.96753 1497.66579
12.55000 -2023.07740 2.35460 -4.87574 584.84159 131.89606 1491.32351
12.65000 -2014.03648 0.59404 -14.42291 579.28617 146.06885 1479.83561
12.75000 -2004.97626 -3.17140 29.26631 579.43410 134.21148 1471.13481
12.85000 -2012.51606 -1.94057 -14.73407 579.92799 180.97549 1442.89627
12.95000 -1961.87877 -4.98066 9.83842 604.54748 155.69709 1476.66372
13.05000 -1971.16709 3.25745 72.56284 570.68365 128.05312 1455.97361
13.15000 -1969.85786 -0.68501 28.69143 558.26918 125.97009 1441.77604
13.25000 -1961.81893 1.65750 -13.30552 565.89699 123.45878 1418.57769
13.35000 -1953.77337 1.52459 -5.38726 552.88394 126.56801 1425.24136
13.45000 -1943.02971 -2.89201 23.98401 554.95080 120.85519 1415.86284
13.55000 -1922.87977 2.12513 1.88948 561.49387 118.60014 1422.41876
13.65000 -1925.55808 2.37258 28.41830 559.28033 119.49586 1393.32298
13.75000 -1930.53394 -3.15055 11.10930 529.77271 112.04595 1377.32700
13.85000 -1872.97862 -1.98458 30.32422 557.36026 132.19842 1421.41795
13.95000 -1894.98558 0.09843 -0.08059 538.20911 111.52421 1383.84076
14.05000 -1891.92236 0.35304 37.41257 537.81152 99.95799 1364.62483
14.15000 -1876.94909 -0.33028 3.53793 535.63453 112.57548 1364.51690
14.25000 -1855.15625 1.02184 -3.17609 542.93996 108.11536 1372.86825
14.35000 -1858.16939 1.14896 -13.30325 541.78749 110.75934 1346.66152
14.45000 -1840.30454 0.00955 0.25483 537.39546 106.53104 1358.17501
14.55000 -1828.65446 -0.38427 75.66332 522.00534 104.84840 1359.67416
14.65000 -1822.60214 0.47413 24.84648 529.16628 114.08418 1345.12123
14.75000 -1802.89947 -0.39070 -7.74644 537.61607 107.40293 1345.97230
14.85000 -1793.01099 -0.02400 13.10137 533.64923 111.63390 1347.01545
14.95000 -1808.86967 1.90298 16.74410 511.74510 118.34341 1314.99795
15.05000 -1807.45555 1.27719 -19.48413 496.25735 96.22196 1299.90212
15.15000 -1775.47790 -0.10474 50.02706 513.20098 94.39492 1320.51862
15.25000 -1766.11022 -4.69882 36.56668 514.61226 94.93007 1313.00935
15.35000 -1755.91597 -1.02700 33.36000 511.76166 96.10827 1309.57643
15.45000 -1755.48217 2.98393 31.10156 514.45123 112.97128 1291.62406
15.55000 -1743.58003 3.23910 53.58080 502.37534 98.26469 1294.04359
15.65000 -1755.63510 -0.83363 59.37602 507.06862 93.64289 1262.88275
15.75000 -1751.27375 -1.79722 9.92814 487.46416 88.26225 1261.60362
15.85000 -1718.71119 2.97094 5.47063 496.53037 105.97015 1279.37288
15.95000 -1713.59681 -1.13860 14.08261 498.58449 113.06380 1266.96932
16.05000 -1704.79980 0.15686 -1.48122 518.51767 114.57142 1255.09847
16.15000 -1705.89986 -0.56496 6.12096 495.83647 89.15459 1244.86353
16.25000 -1695.17003 0.13767 22.76460 483.82410 91.27105 1250.80389
16.35000 -1668.18349 -0.52969 55.10977 501.57583 90.78981 1257.78355
16.45000 -1674.98578 1.04380 13.57297 492.65986 86.67589 1240.19509
16.55000 -1654.78787 -0.26487 -8.25485 494.66980 85.77747 1247.58098
16.65000 -1656.99912 1.55052 7.47716 497.80040 112.96039 1225.82482
16.75000 -1653.95712 -0.55404 21.42871 482.12172 78.20280 1220.46364
16.85000 -1646.35164 1.39050 -5.42640 475.19911 85.96753 1215.52163
16.95000 -1644.74206 0.46134 -29.85906 474.29960 75.94041 1195.82519
17.05000 -1640.87235 1.02557 8.98795 455.50556 104.67718 1193.51966
17.15000 -1616.73650 1.77949 -7.40457 472.86915 85.24754 1204.84736
17.25000 -1623.72180 2.00757 -1.09799 480.74799 87.57526 1185.62132
17.35000 -1597.74088 -2.89757 -10.44856 463.71373 87.11537 1200.20358
17.45000 -1594.46611 -2.07532 -20.67314 468.26682 84.14917 1187.16879
17.55000 -1602.15570 -1.05657 69.99698 454.39614 80.83611 1170.91110
17.65000 -1584.38071 -0.35929 10.26571 456.44138 79.81340 1177.65825
17.75000 -1584.24119 -0.57955 10.20903 456.64478 85.02752 1160.53761
17.85000 -1583.22505 1.94313 1.01737 459.32673 81.62860 1150.60847
17.95000 -1559.48664 -0.45908 -8.60115 459.26553 75.18527 1165.21745
18.05000 -1563.66022 0.60574 -5.81995 449.14887 77.22608 1147.80391
18.15000 -1544.32372 1.70533 8.49613 462.16229 79.32753 1151.71137
18.25000 -1543.65180 0.88959 14.69701 446.78213 74.33733 1147.36982
18.35000 -1531.56147 0.04343 21.91122 454.54784 80.95114 1143.56939
18.45000 -1533.47894 0.57794 33.44769 442.14756 72.48531 1131.64623
18.55000 -1534.11882 1.71291 25.91503 452.37070 94.01351 1115.44684
18.65000 -1501.96789 -0.06779 7.63765 448.88145 74.75915 1142.00195
18.75000 -1512.07643 0.92958 -1.55282 442.76747 71.88369 1115.41552
18.85000 -1492.58657 1.46673 14.79261 442.59676 102.36089 1126.93158
18.95000 -1485.91937 -0.54112 45.50700 452.06840 80.88198 1125.03510
19.05000 -1485.22017 0.75675 49.46795 452.06382 74.19528 1115.52326
19.15000 -1497.81871 -0.44979 16.50671 425.63745 77.59150 1086.34361
19.25000 -1490.49548 0.85372 -23.83518 423.04596 74.57773 1084.01373
19.35000 -1486.36802 1.59467 4.11831 419.51713 70.22352 1074.49711
19.45000 -1472.61474 0.29782 -13.12366 416.66777 81.12503 1077.24019
19.55000 -1458.87918 -1.28185 50.81852 419.27201 76.43574 1081.82164
19.65000 -1459.72754 1.64656 43.49488 412.13952 65.31894 1070.79886
19.75000 -1450.75473 0.86384 -26.12968 421.83698 60.76044 1062.69600
19.85000 -1437.80782 -1.41556 2.33599 424.29195 67.83074 1071.32745
19.95000 -1448.54923 1.86927 -10.04405 420.03302 83.02620 1043.79512
