0.12500 0.03440
0.37500 0.04411
0.62500 0.06572
0.87500 0.08360
1.12500 0.11447
1.37500 0.13893
1.62500 0.16620
1.87500 0.18014
2.12500 0.19951
2.37500 0.20274
2.62500 0.19766
2.87500 0.19891
3.12500 0.21113
3.37500 0.21200
3.62500 0.21967
3.87500 0.23323
4.12500 0.20468
4.37500 0.20572
4.62500 0.17811
4.87500 0.16907
5.12500 0.15051
5.37500 0.16408
5.62500 0.13418
5.87500 0.13953
6.12500 0.13563
6.37500 0.10884
6.62500 0.09644
6.87500 0.08879
7.12500 0.04460
7.37500 0.04203
7.62500 0.05170
7.87500 0.00448
8.12500 0.02532
8.37500 0.03826
8.62500 0.06523
8.87500 0.06704
9.12500 0.08790
9.37500 0.07475
9.62500 0.06588
9.87500 0.02791
10.12500 0.04781
10.37500 0.03212
10.62500 0.03548
10.87500 0.04566
11.12500 0.06511
11.37500 0.03710
11.62500 0.06037
11.87500 0.08584
12.12500 0.05916
12.37500 0.06220
12.62500 0.06533
12.87500 0.04725
13.12500 0.05744
13.37500 0.04954
13.62500 0.05626
13.87500 0.04781
14.12500 0.02275
14.37500 0.00688
14.62500 0.02167
14.87500 0.01480
15.12500 0.04098
15.37500 0.00513
15.62500 0.04119
15.87500 0.03889
16.12500 0.06669
16.37500 0.06724
16.62500 0.06427
16.87500 0.05016
17.12500 0.02107
17.37500 0.01967
17.62500 0.05998
17.87500 0.04794
18.12500 0.02994
18.37500 0.08381
18.62500 0.04894
18.87500 0.04938
19.12500 0.06421
19.37500 0.03328
19.62500 0.03904
19.87500 0.05639
