0.125 0.001 0.003 0.024
0.375 -0.020 -0.015 0.245
0.625 0.003 -0.044 0.741
0.875 -0.028 -0.045 1.344
1.125 -0.027 -0.018 2.280
1.375 -0.050 -0.074 3.185
1.625 -0.083 -0.058 4.380
1.875 -0.070 -0.090 5.950
2.125 -0.129 -0.166 7.256
2.375 -0.073 -0.267 8.553
2.625 -0.126 -0.343 9.954
2.875 -0.154 -0.402 11.419
3.125 -0.201 -0.494 12.728
3.375 -0.158 -0.539 14.705
3.625 -0.235 -0.624 16.001
3.875 -0.302 -0.594 17.626
4.125 -0.264 -0.743 18.279
4.375 -0.275 -0.878 19.906
4.625 -0.299 -0.797 20.303
4.875 -0.356 -0.808 20.618
5.125 -0.379 -0.793 21.394
5.375 -0.391 -0.901 21.221
5.625 -0.322 -0.893 21.095
5.875 -0.334 -0.851 21.257
6.125 -0.395 -1.013 21.536
6.375 -0.434 -1.056 21.983
6.625 -0.364 -0.994 22.156
6.875 -0.310 -1.024 23.019
7.125 -0.304 -0.995 23.227
7.375 -0.284 -1.067 24.411
7.625 -0.248 -1.072 24.423
7.875 -0.201 -1.077 25.262
8.125 -0.200 -1.111 24.993
8.375 -0.197 -0.966 24.948
8.625 -0.237 -0.988 23.448
8.875 -0.167 -0.878 21.930
9.125 -0.193 -0.973 22.064
9.375 -0.210 -0.823 21.158
9.625 -0.102 -0.870 20.906
9.875 -0.112 -0.863 20.391
10.125 -0.123 -0.752 18.546
10.375 -0.095 -0.625 18.171
10.625 -0.152 -0.793 18.357
10.875 -0.174 -0.714 18.312
11.125 -0.160 -0.630 16.247
11.375 -0.172 -0.576 15.799
11.625 -0.117 -0.635 15.486
11.875 -0.148 -0.620 14.782
12.125 -0.124 -0.541 13.612
12.375 -0.138 -0.501 13.537
12.625 -0.160 -0.480 12.517
12.875 -0.140 -0.468 11.655
13.125 -0.107 -0.435 11.199
13.375 -0.106 -0.422 11.316
13.625 -0.068 -0.337 9.942
13.875 -0.050 -0.334 8.880
14.125 -0.062 -0.244 8.475
14.375 -0.106 -0.221 7.817
14.625 -0.078 -0.190 7.927
14.875 -0.095 -0.150 6.671
15.125 -0.064 -0.160 6.760
15.375 -0.168 -0.193 7.191
15.625 -0.164 -0.186 6.262
15.875 -0.175 -0.225 6.242
16.125 -0.163 -0.176 5.433
16.375 -0.185 -0.255 5.871
16.625 -0.141 -0.196 4.911
16.875 -0.164 -0.207 4.882
17.125 -0.120 -0.225 4.843
17.375 -0.102 -0.208 4.316
17.625 -0.068 -0.224 4.313
17.875 -0.060 -0.204 3.973
18.125 -0.057 -0.206 4.276
18.375 -0.043 -0.200 3.817
18.625 -0.040 -0.174 3.448
18.875 -0.013 -0.151 2.810
19.125 -0.008 -0.133 2.883
19.375 -0.006 -0.113 2.483
19.625 0.005 -0.115 2.629
19.875 0.007 -0.082 2.005
