0.120000 -0.963050
0.380000 0.406880
0.620000 1.923690
0.880000 0.052860
1.120000 -0.385610
1.380000 0.760650
1.620000 0.529440
1.880000 -2.071880
2.120000 -0.093440
2.380000 -1.823650
2.620000 -1.635430
2.880000 -1.461330
3.120000 -1.011730
3.380000 -2.114880
3.620000 -1.775200
3.880000 -2.033360
4.120000 -2.195610
4.380000 -2.144810
4.620000 3.091310
4.880000 -2.119780
5.120000 -3.112400
5.380000 2.046240
5.620000 2.532780
5.880000 2.908090
6.120000 2.204150
6.380000 2.290420
6.620000 2.831900
6.880000 2.237910
7.120000 2.153770
7.380000 2.888090
7.620000 2.287740
7.880000 2.150590
8.120000 2.593130
8.380000 -3.103420
8.620000 -2.814870
8.880000 2.831110
9.120000 2.627430
9.380000 -1.575120
9.620000 -3.059610
9.880000 -1.902250
10.120000 -1.491600
10.380000 2.709850
10.620000 -2.011060
10.880000 -1.757320
11.120000 -1.613110
11.380000 -1.097900
11.620000 0.449300
11.880000 -3.062900
12.120000 -1.523420
12.380000 3.111740
12.620000 -0.966390
12.880000 2.289620
13.120000 1.008210
13.380000 -0.570790
13.620000 1.234890
13.880000 1.179200
14.120000 -1.075150
14.380000 -1.533740
14.620000 -1.787220
14.880000 1.306000
