0.12500 0.04964
0.37500 0.02013
0.62500 0.03268
0.87500 0.03270
1.12500 0.06650
1.37500 0.09809
1.62500 0.14141
1.87500 0.15294
2.12500 0.17204
2.37500 0.19070
2.62500 0.19481
2.87500 0.20099
3.12500 0.22992
3.37500 0.18656
3.62500 0.18792
3.87500 0.16827
4.12500 0.13026
4.37500 0.15078
4.62500 0.11824
4.87500 0.12180
5.12500 0.10592
5.37500 0.08646
5.62500 0.10009
5.87500 0.07305
6.12500 0.06151
6.37500 0.05983
6.62500 0.02989
6.87500 0.04510
7.12500 0.03901
7.37500 0.04853
7.62500 0.03081
7.87500 0.02363
8.12500 0.03279
8.37500 0.01212
8.62500 0.02464
8.87500 0.02320
9.12500 0.03435
9.37500 0.02593
9.62500 0.04408
9.87500 0.01911
10.12500 0.01393
10.37500 0.01994
10.62500 0.01509
10.87500 0.03609
11.12500 0.03830
11.37500 0.01246
11.62500 0.02902
11.87500 0.02068
12.12500 0.01070
12.37500 0.02255
12.62500 0.02475
12.87500 0.00887
13.12500 0.03574
13.37500 0.02673
13.62500 0.01765
13.87500 0.01784
14.12500 0.02664
14.37500 0.03601
14.62500 0.00492
14.87500 0.04782
