0.05000 -327.53777 -140.22284 -9.58842 393.19411 366.14636 877.14282
0.15000 -509.97483 38.79400 -54.27904 354.99657 363.05186 1473.59369
0.25000 -731.46071 31.22019 -165.63458 388.10981 358.65411 2181.18149
0.35000 -1053.67572 20.47741 -74.59159 432.73634 329.85085 2806.64437
0.45000 -1396.62168 20.61092 -75.34818 545.28535 377.58999 3346.48614
0.55000 -1807.14248 45.71584 97.43889 651.78873 400.74669 3834.72081
0.65000 -2134.99771 43.95878 200.63774 683.79771 405.92752 4252.63573
0.75000 -2427.40242 34.69776 168.11893 701.97477 414.70367 4535.96572
0.85000 -2720.08423 37.60866 20.39339 767.34921 414.01865 4763.79566
0.95000 -3019.34891 30.48548 81.69953 799.51142 440.02726 4928.71433
1.05000 -3318.95591 46.04819 107.17776 838.41555 435.67227 5049.64287
1.15000 -3616.76085 47.55341 84.69846 875.42174 443.98491 5060.54689
1.25000 -3791.44134 54.28426 86.29092 932.13401 450.97920 5239.83565
1.35000 -4031.00637 55.13746 32.84699 923.69805 459.05326 5167.37426
1.45000 -4236.08297 46.28530 111.02991 931.94722 471.48389 5154.87476
1.55000 -4455.31028 64.74463 -63.64336 910.47297 479.54234 5046.01575
1.65000 -4601.04273 52.60906 38.82107 901.93924 487.17987 5043.38395
1.75000 -4823.43344 65.09660 48.90114 893.86971 507.53000 4914.07256
1.85000 -4971.39928 63.28620 28.93001 917.18036 506.80099 4920.80322
1.95000 -5178.78132 71.40511 -30.67484 874.85978 513.22034 4796.41147
2.05000 -5351.32105 67.45082 -44.50651 863.45648 502.95852 4734.91353
2.15000 -5515.14611 63.23087 -10.13346 864.64817 504.34267 4650.61920
2.25000 -5656.68859 78.78052 91.33688 851.76891 503.84410 4578.95153
2.35000 -5793.63490 75.79128 51.97839 824.42007 488.96001 4465.78202
2.45000 -5913.51025 79.87037 -43.52347 782.79275 476.73228 4359.82067
2.55000 -5986.27330 72.47340 39.98173 794.15279 471.30719 4306.94801
2.65000 -6069.16010 75.52557 -37.84695 729.51445 465.44930 4244.87836
2.75000 -6145.87348 77.94837 55.25209 715.86793 452.53790 4136.62230
2.85000 -6241.03300 76.33161 -69.79857 700.52239 443.85482 4030.98298
2.95000 -6290.81878 85.78925 22.93228 680.92784 430.36372 3943.58094
3.05000 -6360.68807 81.28440 -2.77091 648.64023 420.40386 3872.18630
3.15000 -6419.04835 83.18564 -1.88531 641.61628 399.54519 3794.11117
3.25000 -6476.54957 84.45038 -79.26616 611.87107 385.12664 3690.04975
3.35000 -6505.19946 82.70527 -66.67149 606.72184 377.08368 3634.09123
3.45000 -6544.35578 85.18273 -10.23511 583.28712 358.14414 3534.60973
3.55000 -6590.01234 83.94289 -73.63314 559.72331 355.03029 3465.02192
3.65000 -6630.41577 92.37845 5.46207 538.94828 341.98972 3379.63181
3.75000 -6663.75002 81.17651 2.59465 524.00013 330.99883 3308.36689
3.85000 -6693.46736 81.98584 64.83954 531.27846 322.87470 3225.49238
3.95000 -6709.73548 94.22466 68.85876 509.72886 308.55641 3164.12072
4.05000 -6726.97669 88.29611 -9.09167 484.81282 300.77115 3097.18245
4.15000 -6735.25153 91.84422 -53.15701 474.65728 286.90091 3011.90687
4.25000 -6743.86226 91.33822 -17.01051 474.62157 278.26602 2975.78385
4.35000 -6742.86619 87.94651 -25.41916 460.02653 268.03140 2898.77294
4.45000 -6750.03155 88.41553 -63.62170 457.95643 268.35971 2841.09817
4.55000 -6761.16347 80.75207 24.83721 439.10711 251.75461 2766.12115
4.65000 -6760.51395 92.89387 76.42230 435.26991 245.59102 2698.33765
4.75000 -6746.18734 83.43511 -8.31086 430.00121 236.94149 2655.63354
4.85000 -6741.46707 80.76333 -81.47779 410.65554 232.65067 2568.67557
4.95000 -6720.28715 84.83515 35.03193 391.61316 223.87798 2527.78471
5.05000 -6720.36914 89.89880 -31.43304 380.22736 219.04677 2447.22367
5.15000 -6708.59862 86.17623 36.03225 381.70724 210.29174 2421.92421
5.25000 -6695.70855 83.57444 -0.79510 369.11859 201.69011 2355.57529
5.35000 -6684.54724 79.82312 -8.35116 358.77626 198.91668 2297.41089
5.45000 -6668.51694 84.37337 13.80137 367.39508 191.38946 2267.46876
5.55000 -6647.87787 82.73987 31.06534 342.38380 188.25644 2167.45615
5.65000 -6618.93007 79.19630 44.83100 331.97168 185.10917 2154.07940
5.75000 -6583.00065 80.40754 26.13570 347.41960 177.25968 2125.43063
5.85000 -6560.78148 78.78668 30.31211 327.70111 177.97256 2060.09498
5.95000 -6536.13055 76.37085 -29.90408 321.52994 165.85753 2005.45286
6.05000 -6491.60669 76.04855 -4.60215 327.86448 166.68931 1984.77427
6.15000 -6465.54755 74.22728 7.08008 295.42287 162.75716 1921.51625
6.25000 -6429.85473 73.87289 1.51313 277.56167 160.11707 1864.13232
6.35000 -6396.55413 74.31982 15.44012 279.20958 151.84493 1820.38531
6.45000 -6364.66138 73.64700 27.37063 263.31908 153.70982 1772.27673
6.55000 -6323.27291 73.46651 8.01403 259.46675 148.81011 1763.67817
6.65000 -6283.01440 72.20651 -22.71087 254.51472 144.01533 1720.81645
6.75000 -6241.52011 69.57377 -2.90523 255.03760 141.90864 1672.86380
6.85000 -6201.22343 71.64063 -10.95429 249.43340 137.67683 1644.22422
6.95000 -6156.26400 68.57981 44.75977 249.23495 139.45248 1605.27091
7.05000 -6122.82341 67.49318 18.47607 233.04908 131.21262 1565.90570
7.15000 -6076.52683 69.85334 -4.48524 238.56510 133.01013 1546.33986
7.25000 -6048.85673 65.24761 -11.95881 225.30058 129.14378 1499.40967
7.35000 -6008.84312 67.26850 -22.18896 206.27265 125.72013 1480.20418
7.45000 -5971.75234 66.53508 12.15324 217.65147 120.43106 1444.02147
7.55000 -5934.37174 64.77637 -19.43663 203.63010 116.94193 1413.30471
7.65000 -5893.16639 63.95296 -13.57373 206.42045 118.44369 1395.41476
7.75000 -5850.14723 65.38998 -17.90651 200.87096 120.73219 1380.61178
7.85000 -5826.00525 63.30035 -45.85296 202.30656 114.66072 1325.22143
7.95000 -5786.79287 64.67204 -27.17119 183.15112 113.71274 1288.53461
8.05000 -5752.11992 63.78546 -9.67349 181.22529 111.72521 1266.73795
8.15000 -5721.84435 59.65023 -15.01826 181.28763 108.20650 1247.76735
8.25000 -5686.10591 59.24014 -55.40154 186.53686 110.82583 1219.89110
8.35000 -5654.38269 60.57699 -9.90933 181.93784 106.33281 1188.94536
8.45000 -5606.62740 59.78570 -10.88107 187.39918 101.01370 1179.11460
8.55000 -5567.76049 56.92253 -7.73827 192.69222 99.64597 1150.47586
8.65000 -5527.44498 58.57271 2.12783 185.99693 100.06131 1133.69066
8.75000 -5489.30229 56.16431 -11.59274 180.97432 101.00689 1094.08822
8.85000 -5453.70168 56.29423 6.17788 162.74911 99.49379 1070.95025
8.95000 -5412.45899 52.47386 -15.56773 159.57040 97.48334 1043.44773
9.05000 -5364.71480 54.00595 -2.54336 178.40333 91.31261 1047.54150
9.15000 -5326.36689 53.72324 -12.92346 159.55946 88.12765 999.34508
9.25000 -5288.64893 55.21724 -24.82459 143.15061 95.92822 965.43919
9.35000 -5245.19040 52.36450 -25.86125 162.21692 91.13832 970.93963
9.45000 -5205.16661 53.20804 7.33759 164.09071 86.86004 962.80364
9.55000 -5163.41548 50.50416 -12.18266 153.78401 88.48049 943.93786
9.65000 -5127.74055 50.41756 5.16471 155.25523 85.59523 906.36287
9.75000 -5086.69893 51.20985 15.61299 137.23809 88.11938 882.33953
9.85000 -5053.68788 48.18565 8.88096 126.60888 85.42362 868.26413
9.95000 -5018.47129 49.27950 -8.93891 125.17352 84.83679 857.37595
10.05000 -4976.70908 50.48903 7.09220 126.43043 83.48425 838.07019
10.15000 -4940.44391 48.82454 12.30920 141.73678 80.38072 808.51902
10.25000 -4899.39773 48.55106 13.69349 121.99424 80.49214 800.37865
10.35000 -4858.68229 45.90464 17.55595 114.78997 77.27186 781.65927
10.45000 -4821.07275 48.20004 7.69930 113.93362 81.23306 756.86927
10.55000 -4786.51156 47.75944 -13.23650 132.68618 81.09487 752.83172
10.65000 -4747.19102 46.10759 -6.63768 135.07615 77.87248 734.69341
10.75000 -4707.39619 47.05981 15.73170 112.49098 77.62762 722.23371
10.85000 -4673.29373 46.77323 -6.94683 104.42368 77.57316 702.69719
10.95000 -4637.70052 45.35388 -15.56410 107.64905 73.87988 698.48333
11.05000 -4598.95962 43.73604 -0.05187 105.30578 73.33894 680.85032
11.15000 -4564.65535 43.32852 -17.37092 100.38532 73.02898 667.22606
11.25000 -4523.76895 43.72679 -20.09669 124.14568 70.59446 668.78428
11.35000 -4491.86773 42.38078 -8.46924 97.68097 72.84168 635.01377
11.45000 -4457.91423 40.10421 17.99229 97.04425 73.08524 624.61937
11.55000 -4421.95689 42.65073 -28.32884 94.94081 68.76299 612.29444
11.65000 -4392.42017 42.50154 5.21351 95.00859 71.09768 599.28572
11.75000 -4358.98646 40.78698 -21.38118 96.25284 70.30142 586.77773
11.85000 -4321.42628 38.17944 -5.90307 109.31762 70.56176 592.91042
11.95000 -4289.77920 40.02456 -17.60516 95.70953 67.01938 570.75937
12.05000 -4253.80083 39.43155 8.63577 87.72287 61.54863 563.80544
12.15000 -4223.68890 39.82220 -5.17704 92.24653 65.05087 553.54415
12.25000 -4187.91197 38.46263 -3.22727 90.54737 68.15495 531.56267
12.35000 -4157.14301 39.21006 -4.56586 89.31773 63.83898 519.53804
12.45000 -4127.86438 36.76297 -9.83721 91.02179 73.06587 520.24460
12.55000 -4092.91403 39.27470 9.53777 86.92606 59.23568 511.53894
12.65000 -4062.86453 37.19465 -7.17225 90.24221 61.17883 502.91260
12.75000 -4034.78805 38.02663 -10.76648 80.58939 58.35730 484.67536
12.85000 -4006.04253 36.82400 -8.14874 85.70422 60.50628 466.50486
12.95000 -3972.27316 36.73802 -4.94934 82.25516 59.52088 467.25939
13.05000 -3945.19009 35.93734 1.84564 81.52464 53.84019 472.35733
13.15000 -3911.89832 35.88126 3.39458 82.12910 56.95717 454.92597
13.25000 -3886.99383 36.43619 -10.57660 80.51503 58.69565 434.14612
13.35000 -3857.77446 34.44345 -12.01912 81.21294 58.16801 431.37538
13.45000 -3830.19801 36.35047 -17.75056 77.42275 55.77398 433.76168
13.55000 -3801.54533 35.05416 13.56641 73.58020 57.56233 424.86252
13.65000 -3775.42343 34.56005 -39.81275 72.63343 57.62418 407.57730
13.75000 -3746.00339 32.89389 -8.05618 78.22345 57.30548 403.93575
13.85000 -3719.78404 32.97759 -6.41530 70.88406 57.10469 393.93937
13.95000 -3691.75787 33.67706 -2.20396 71.82811 54.54943 394.03422
14.05000 -3664.97675 32.05065 -0.12650 65.55074 51.20458 382.95391
14.15000 -3639.54175 33.97241 -10.32213 66.48355 53.51277 362.70091
14.25000 -3614.79700 33.61593 -3.83508 64.69893 54.95834 362.55040
14.35000 -3586.66646 29.53310 5.56339 71.29565 51.82089 364.15536
14.45000 -3559.34739 32.80985 -17.23656 65.46417 54.14802 353.24731
14.55000 -3535.09957 33.11800 -13.91505 62.31451 56.57077 346.49337
14.65000 -3507.19830 31.62352 -15.42990 65.23632 53.63322 336.52827
14.75000 -3484.54860 30.73882 -6.28881 60.88036 50.21617 332.81927
14.85000 -3456.59371 30.70634 -8.23879 62.10426 53.05481 326.88493
14.95000 -3432.71469 31.05467 -10.54531 58.33228 53.64273 325.66512
15.05000 -3409.00480 29.87010 -8.05594 57.19055 51.32273 310.49697
15.15000 -3384.19613 28.00583 -20.88141 60.35045 47.67651 314.49629
15.25000 -3357.87109 26.71202 -6.23987 57.45663 46.15785 307.31396
15.35000 -3334.84179 29.09692 -19.97898 61.51176 50.39314 300.87582
15.45000 -3311.97498 28.48609 -23.53062 58.90827 48.19187 285.28043
15.55000 -3286.37876 28.78830 -10.89226 55.98198 46.19736 293.37012
15.65000 -3267.40691 27.48468 -5.51995 50.99768 49.19959 280.57080
15.75000 -3243.38101 29.05011 -19.54317 54.29000 46.22266 286.17454
15.85000 -3221.55007 27.83094 -2.23889 54.34750 43.40001 279.08369
15.95000 -3198.70022 28.09644 -30.78912 52.62004 45.69711 270.87652
16.05000 -3177.68871 29.25560 -9.40120 54.94583 46.69640 265.32167
16.15000 -3154.16452 28.42008 -10.73985 49.06005 42.25888 244.68619
16.25000 -3127.94036 28.36854 -13.76640 51.71778 41.65343 255.26155
16.35000 -3105.71939 28.82864 -4.23193 53.54941 46.94471 252.92894
16.45000 -3084.26012 28.94976 8.99739 48.95593 43.76146 245.57381
16.55000 -3060.84570 26.04360 3.58424 47.58163 45.62215 243.05749
16.65000 -3042.55984 27.26935 -3.91811 46.17283 41.04187 229.32726
16.75000 -3016.80464 27.81618 4.91462 52.26389 52.65738 230.73354
16.85000 -2994.38673 26.09670 -21.41150 45.61825 40.27552 226.37775
16.95000 -2974.17677 24.12105 -19.89235 49.20547 52.28747 230.02198
17.05000 -2958.96184 25.94031 -16.31422 42.81890 45.00718 211.35285
17.15000 -2931.75017 23.98776 -3.97943 40.18305 39.56224 216.90112
17.25000 -2909.71514 24.47697 -9.89675 44.66395 37.19225 210.87615
17.35000 -2886.86309 26.67545 -10.24842 50.66958 45.45391 210.50889
17.45000 -2868.77857 24.74629 2.32343 43.93279 40.08643 201.78223
17.55000 -2848.09970 27.59632 -9.43439 48.09345 43.19987 196.22453
17.65000 -2824.14963 23.70870 -23.03224 44.87107 36.83951 191.72270
17.75000 -2808.41576 23.53804 -22.68703 46.76126 37.60755 198.98432
17.85000 -2786.32430 25.43246 -22.15305 41.60362 38.63993 192.58337
17.95000 -2769.70997 26.57311 -20.25146 43.57767 40.08489 191.07758
18.05000 -2748.45397 24.79140 -15.80243 38.93913 36.74658 190.02654
18.15000 -2731.60135 23.87773 -9.04277 43.95254 31.15610 185.59320
18.25000 -2712.63526 22.03499 -21.08155 46.38686 37.20906 181.63959
18.35000 -2693.76925 22.23286 -22.08204 37.95890 39.36181 171.67050
18.45000 -2675.48995 22.13816 -9.13184 43.40864 37.14937 181.76082
18.55000 -2659.48148 25.21915 -18.88608 35.71345 34.73598 167.84669
18.65000 -2638.65897 23.24500 -8.64949 38.08839 39.43988 167.53808
18.75000 -2625.15410 22.06280 -24.67250 39.16326 35.10645 163.40443
18.85000 -2606.23019 21.91688 -10.45557 41.02626 30.14273 172.30276
18.95000 -2586.38141 22.11289 -18.06329 37.61232 35.98127 161.11693
19.05000 -2572.36084 21.76149 -24.27990 37.77566 33.77137 156.94539
19.15000 -2556.24715 23.44712 -13.07290 35.07285 35.78650 149.24373
19.25000 -2540.09687 20.44174 -22.30737 34.50447 33.48986 154.96207
19.35000 -2522.18721 22.17865 -22.63638 32.30740 26.63582 157.59325
19.45000 -2507.27032 20.82312 -11.68688 31.29295 33.81335 153.53460
19.55000 -2490.75383 20.61250 -15.70094 34.04745 27.67475 145.88568
19.65000 -2476.39148 19.00840 -23.47495 44.80426 35.20838 146.20269
19.75000 -2458.04562 19.56968 -14.84438 38.24139 41.01653 143.47693
19.85000 -2444.92556 20.12561 -21.64110 30.84426 30.80200 137.97793
19.95000 -2434.82063 21.94076 -26.59561 48.29886 38.39914 141.39199
