0.05000 -1360.88714 -468.72853 -508.53580 1126.37023 1958.00345 3011.81168
0.15000 -2974.30901 150.06534 -475.37001 2386.57094 1998.47860 3938.38913
0.25000 -3579.42164 -116.03751 -281.56035 2382.70402 2167.91760 5202.64342
0.35000 -4614.94183 26.68278 -231.96491 2108.75048 1585.84412 6171.99250
0.45000 -5548.87507 -4.51383 -284.57528 2022.87696 1626.61558 6594.87977
0.55000 -5817.18782 58.86508 -138.39809 1978.96773 1403.58028 6884.76113
0.65000 -6061.70215 33.59204 -254.36016 1883.69867 1324.46617 6963.71622
0.75000 -6194.97153 28.07316 17.80682 1910.80353 1209.62242 6951.09855
0.85000 -6324.80041 21.86823 138.34363 2041.37675 1209.34367 6979.81058
0.95000 -6471.98601 57.71647 -189.39211 1944.24948 1231.54705 6940.85742
1.05000 -6578.01829 13.78049 101.96929 1824.72232 1224.60944 6743.30158
1.15000 -6653.06566 20.96416 -75.72274 1777.24386 1174.21656 6666.58177
1.25000 -6760.01485 60.69172 -153.65172 1632.26854 1082.26080 6431.28565
1.35000 -6815.55473 15.68091 -7.76571 1645.40960 1048.91602 6337.81996
1.45000 -6878.89129 20.26117 -54.20583 1591.25945 1030.45089 6222.03672
1.55000 -6906.03262 14.72328 81.85149 1535.26386 1046.46664 6045.01861
1.65000 -6991.26327 57.31510 86.73129 1525.91526 1107.26380 5892.15603
1.75000 -7002.91052 34.09650 5.04551 1407.23179 1009.68707 5741.10089
1.85000 -7011.66849 44.43783 -67.69599 1319.20730 1009.23727 5536.15903
1.95000 -7025.70532 36.87765 118.26672 1324.29929 1049.41487 5426.02294
2.05000 -7000.95273 0.50146 -25.55552 1228.91972 939.91440 5271.90854
2.15000 -7005.79581 12.76822 61.67552 1200.28979 980.23197 5151.44514
2.25000 -7018.75556 19.41735 -1.64006 1105.46648 948.10280 4965.08447
2.35000 -7010.99643 11.48845 8.78277 1072.86799 890.04824 4829.76094
2.45000 -6965.84704 23.11298 0.96890 1039.04664 886.64029 4710.41957
2.55000 -6985.40243 27.28512 75.72019 975.23659 941.25837 4552.74351
2.65000 -6958.88869 4.51229 -0.34413 924.47630 903.41398 4420.86628
2.75000 -6949.90266 -0.69391 92.61920 902.93665 902.69845 4347.98882
2.85000 -6931.56866 21.47804 33.15188 885.16330 926.69545 4289.97210
2.95000 -6933.10848 15.79343 -45.20178 832.09542 911.35320 4124.48403
3.05000 -6926.54035 11.26574 -44.11668 805.59727 869.40243 4026.82344
3.15000 -6927.29239 -3.59526 -23.83102 722.82107 893.92170 3939.05809
3.25000 -6937.72126 18.50785 12.04962 794.80731 875.33142 3817.33087
3.35000 -6952.53250 26.87681 42.14126 779.38073 847.67837 3759.49885
3.45000 -6940.97092 32.01167 -46.35926 686.41020 827.86334 3695.94997
3.55000 -6949.92956 15.27089 -45.52231 686.73858 804.30178 3572.41270
3.65000 -6936.26086 5.81918 -52.62766 682.77392 767.95170 3532.03024
3.75000 -6940.49797 1.24695 -71.49846 656.09464 774.46521 3449.83057
3.85000 -6941.04467 12.87367 -23.48660 662.32443 779.35812 3332.00176
3.95000 -6929.02617 14.75417 8.84057 602.22954 765.15483 3246.73509
4.05000 -6908.10208 13.09013 5.66073 648.60024 712.42396 3202.51902
4.15000 -6897.29580 17.33582 73.00263 601.10504 657.61175 3120.97398
4.25000 -6886.44052 6.96284 48.50786 576.07550 638.17955 2982.11588
4.35000 -6865.20737 21.49606 2.37562 611.38548 684.57968 2928.57561
4.45000 -6824.50603 7.20010 41.06066 588.69226 629.27454 2893.80324
4.55000 -6792.43114 2.07397 31.61750 549.45393 632.08842 2798.59147
4.65000 -6778.68998 7.65446 -62.90842 536.45560 569.63053 2745.25945
4.75000 -6752.81664 7.51497 10.80428 594.41909 587.25363 2648.48751
4.85000 -6734.32848 18.85391 -20.88868 575.53286 522.45836 2615.72284
4.95000 -6712.27209 6.70287 71.79054 522.94165 577.03035 2546.39270
5.05000 -6690.52512 12.82549 -45.42845 504.44856 512.54834 2474.32051
5.15000 -6654.50350 17.37593 -9.07707 525.94764 534.97099 2441.60009
5.25000 -6625.34260 -0.86887 47.06597 485.07851 521.34830 2366.89304
5.35000 -6599.78073 5.10691 -8.40088 539.57160 495.27954 2329.94388
5.45000 -6586.91505 11.30478 -22.75308 553.57874 477.11113 2252.43657
5.55000 -6540.01751 14.40030 27.98506 590.27194 447.16361 2222.28854
5.65000 -6497.10664 9.06684 6.12499 481.71456 439.52671 2152.00472
5.75000 -6463.21162 5.51280 -9.24752 480.76307 443.14611 2125.31642
5.85000 -6437.75746 10.28441 5.72558 514.84363 480.81849 2054.26047
5.95000 -6388.49964 7.68795 -11.76190 570.59191 413.71408 2009.94839
6.05000 -6345.03564 5.75909 3.09142 438.71461 412.96242 1945.85265
6.15000 -6294.77065 5.51322 -6.08530 418.85296 423.32255 1883.35734
6.25000 -6236.91818 7.61682 24.68412 445.33982 368.85100 1884.89834
6.35000 -6206.62051 12.95544 0.54274 418.19900 390.09705 1795.69829
6.45000 -6161.37936 17.30049 15.96441 424.86545 410.10838 1776.34359
6.55000 -6109.51482 16.22536 19.80102 396.19807 356.23178 1704.05816
6.65000 -6068.82002 12.83698 -20.19361 424.57068 430.64942 1659.74847
6.75000 -6026.93054 14.68277 -8.51739 428.85922 314.98680 1640.29881
6.85000 -5981.91680 10.84730 11.97934 394.01392 337.78191 1580.79815
6.95000 -5926.56262 11.28787 0.02995 367.70896 342.82102 1568.68614
7.05000 -5874.39400 10.93757 21.89669 405.09656 267.00991 1523.55077
7.15000 -5827.76058 7.46295 -10.96318 340.54442 272.15605 1485.23035
7.25000 -5769.02442 16.36840 9.81264 359.65969 345.89425 1485.66626
7.35000 -5720.46634 13.98877 1.86562 401.89014 319.07762 1422.79590
7.45000 -5678.20919 16.95290 1.94850 459.53378 286.91935 1397.96776
7.55000 -5627.94788 12.62635 9.97426 333.53613 336.44416 1356.17153
7.65000 -5581.83179 8.68449 -8.11333 386.26046 314.65463 1325.12560
7.75000 -5528.23018 19.24803 44.29184 318.99485 355.71650 1292.18893
7.85000 -5481.98426 10.97698 20.12709 323.39654 273.67218 1252.60014
7.95000 -5438.98018 9.38701 -12.86340 404.95598 250.96610 1221.81959
8.05000 -5389.51888 4.84126 12.65567 359.82421 269.70603 1209.41978
8.15000 -5338.35581 23.48245 -14.92011 335.40884 377.34264 1200.18609
8.25000 -5295.41042 15.82099 -17.71660 319.09124 220.32355 1134.88548
8.35000 -5254.54499 4.46608 11.47090 334.05449 355.32378 1179.47186
8.45000 -5196.62109 13.24106 1.22541 336.54873 196.87355 1104.98980
8.55000 -5150.74746 11.68036 -1.40538 277.60007 210.19133 1065.64534
8.65000 -5106.99907 10.34218 -9.24416 275.29313 236.66249 1089.63870
8.75000 -5058.54815 11.32683 -17.73798 277.51073 213.93914 1016.64306
8.85000 -5023.22466 3.16685 3.50260 278.17163 274.64749 976.44766
8.95000 -4974.15274 12.97754 -9.14869 375.54173 237.70804 1002.91604
9.05000 -4921.41830 18.27653 6.55343 252.87842 266.22293 956.61780
9.15000 -4883.45647 20.15280 -8.44967 378.62524 394.62292 929.89569
9.25000 -4841.66991 4.32446 -1.01321 395.02709 196.24636 931.15486
9.35000 -4800.75367 6.87873 -24.64777 229.87152 179.64733 882.59704
9.45000 -4766.27410 12.97114 -5.91463 211.06790 158.79901 866.12790
9.55000 -4722.36701 6.99516 -18.15079 248.87578 182.97167 854.81792
9.65000 -4691.57591 12.34016 -8.70687 227.07053 173.77683 842.15239
9.75000 -4644.92683 5.70798 -37.53418 279.89894 218.29591 826.03927
9.85000 -4612.65612 14.40813 -28.04136 273.97355 366.20399 809.66335
9.95000 -4573.20062 8.80529 -12.01396 255.07980 198.35571 787.81004
10.05000 -4542.03449 10.13772 -19.67822 240.94726 245.39795 774.19874
10.15000 -4506.16449 5.17784 -29.94045 167.47019 161.70844 748.57615
10.25000 -4472.41353 3.37113 -45.17386 258.83163 181.09461 808.34774
10.35000 -4435.63828 7.14645 -28.99138 222.47555 148.97745 716.82065
10.45000 -4402.55066 10.53564 -12.06480 239.32890 168.61066 710.24596
10.55000 -4368.19209 -3.73821 -6.74208 199.82487 372.53622 703.38315
10.65000 -4332.73775 6.21608 -25.02465 169.94424 169.96504 666.87771
10.75000 -4302.45876 -0.80856 -4.61047 278.57813 410.03118 682.30709
10.85000 -4264.86678 6.95218 -11.65756 328.43017 165.07580 664.43657
10.95000 -4231.22786 7.90367 16.90283 175.86981 156.01720 660.72206
11.05000 -4192.88247 7.38372 5.99254 153.41911 144.48702 631.23822
11.15000 -4158.40076 -0.47012 -2.69233 279.78130 264.48248 616.11235
11.25000 -4132.32582 1.93267 -11.94653 189.98951 118.24854 595.44074
11.35000 -4097.77972 8.09118 4.83583 174.72121 133.39102 631.80947
11.45000 -4071.48237 7.32067 6.58603 135.34301 123.43846 580.04742
11.55000 -4038.93586 5.58623 4.64509 201.74183 193.93548 584.31189
11.65000 -4011.00644 4.61188 15.45660 158.93379 182.07294 568.03694
11.75000 -3980.56129 9.00923 20.16285 142.85396 108.57267 543.83600
11.85000 -3953.00205 -2.51382 13.48845 187.55307 266.74370 535.92333
11.95000 -3921.34296 5.43070 25.24840 132.93600 129.49565 539.42520
12.05000 -3889.89037 6.45672 8.90029 139.41677 118.61640 520.29915
12.15000 -3864.03394 9.87224 27.66532 134.77212 147.37300 501.20146
12.25000 -3837.79390 9.09365 12.81418 142.47274 142.60736 501.17382
12.35000 -3802.45452 13.22367 30.67842 226.13346 170.53471 493.43652
12.45000 -3781.15677 4.95984 8.19834 189.73818 170.18050 491.85658
12.55000 -3745.32149 5.27220 28.81862 110.77240 109.58130 471.19860
12.65000 -3721.79939 9.82102 20.83356 136.24679 215.17428 468.19474
12.75000 -3693.60158 4.78449 13.45215 141.19602 158.08119 449.86574
12.85000 -3676.62194 9.58466 22.77012 132.91958 209.01281 450.25727
12.95000 -3637.99043 11.68533 -3.87328 288.96944 209.33579 459.97478
13.05000 -3615.14944 5.16327 20.23860 115.64014 88.21384 430.07703
13.15000 -3592.71021 5.16548 24.27573 179.41702 137.78472 429.45604
13.25000 -3560.65803 7.58021 9.82984 128.82983 89.97286 438.49278
13.35000 -3547.14729 -3.23392 36.91133 295.67159 303.05264 522.85567
13.45000 -3512.39363 1.42641 -4.43517 123.72440 154.88038 518.46781
13.55000 -3483.10079 7.06376 25.59279 192.98492 101.20946 410.71806
13.65000 -3461.01362 3.21705 0.51926 213.02331 112.79551 398.70929
13.75000 -3439.33814 6.43065 8.17807 183.93763 98.05955 390.89983
13.85000 -3408.94890 -0.81867 22.77692 201.88931 122.20606 381.91187
13.95000 -3399.08276 -7.20892 5.16898 510.39546 406.08442 396.10312
14.05000 -3361.99242 5.85821 13.87643 195.63415 151.18131 358.97549
14.15000 -3334.98186 7.83767 10.70128 160.93558 85.55182 393.26098
14.25000 -3312.81079 4.83892 27.97476 179.74457 125.43772 577.61919
14.35000 -3286.30697 6.44962 15.58740 90.21981 93.73237 343.63342
14.45000 -3262.16648 5.77666 20.42382 113.00994 78.85922 327.56617
14.55000 -3234.07625 3.19866 4.84380 95.06821 109.05818 329.44260
14.65000 -3212.52618 7.86726 4.22431 177.55384 168.85852 331.99336
14.75000 -3193.23009 9.37538 17.28323 175.00989 135.32484 327.37091
14.85000 -3167.52160 7.24189 9.68918 79.56902 89.71889 311.75624
14.95000 -3148.42652 8.14988 -0.12835 125.06615 112.13874 311.01807
15.05000 -3114.29329 2.62396 11.21733 173.95628 92.78656 295.80687
15.15000 -3097.67564 5.06405 7.21044 80.80808 73.89816 293.45343
15.25000 -3080.46141 3.65181 18.43695 96.91375 62.03091 283.44718
15.35000 -3056.44249 2.50451 15.46223 63.16872 60.59728 280.89117
15.45000 -3039.93028 9.22670 5.28616 83.68454 168.50605 302.40682
15.55000 -3011.17755 -3.56173 3.89704 346.44314 155.26877 324.77736
15.65000 -3001.58896 4.89032 9.37976 64.41691 85.06147 265.73126
15.75000 -2981.33665 1.97010 -2.22676 65.55022 52.47807 272.81328
15.85000 -2963.93660 2.38566 4.28933 96.74405 129.07860 258.23658
15.95000 -2941.68332 4.42687 11.44601 73.15659 133.56856 259.18828
16.05000 -2924.62639 2.60394 8.29319 60.11879 58.74428 247.04253
16.15000 -2905.40310 -0.76799 -5.07841 109.80501 170.28059 251.02898
16.25000 -2888.42544 7.93473 5.26540 93.98195 117.44725 263.07316
16.35000 -2869.90842 4.05668 -1.57557 74.29885 69.78155 228.24492
16.45000 -2848.92221 2.44044 7.31652 78.22500 71.52152 228.14249
16.55000 -2830.93672 4.99126 6.43503 120.90326 69.88406 243.33593
16.65000 -2813.70667 1.99572 -8.57332 69.01133 72.55448 253.70649
16.75000 -2793.87005 0.74470 17.98301 92.07648 75.82607 222.27291
16.85000 -2779.22542 -1.90892 -0.36704 73.60541 87.52185 214.21490
16.95000 -2763.04968 1.34240 4.74489 67.16058 63.72616 208.84278
17.05000 -2744.47606 2.92546 1.61304 56.06571 50.74662 206.61812
17.15000 -2718.47373 5.48114 9.69014 134.61607 141.18824 208.11348
17.25000 -2710.19024 0.21831 7.44975 56.83205 54.97459 208.04977
17.35000 -2688.24697 7.62641 2.28443 112.53657 187.24279 204.37618
17.45000 -2674.27987 5.07954 6.94562 63.08859 71.69239 208.00458
17.55000 -2660.57099 1.78260 13.91754 117.72155 88.47561 235.06922
17.65000 -2644.27218 2.90810 1.62742 73.36627 50.90479 195.00999
17.75000 -2632.08044 5.03390 2.38196 75.03649 54.29192 197.50177
17.85000 -2616.94492 4.35907 -2.39000 146.72399 95.86848 194.78988
17.95000 -2594.38955 2.75827 8.03629 61.59872 64.67325 170.47597
18.05000 -2579.97347 2.68700 -4.19729 71.25692 71.55747 174.63900
18.15000 -2562.22408 1.05133 -10.30843 83.38061 92.75802 237.94845
18.25000 -2563.83866 -11.54908 1.19853 395.47723 415.77189 256.79959
18.35000 -2523.91874 4.44492 -6.07491 139.58477 65.76412 176.64407
18.45000 -2517.21449 4.45536 -0.88618 51.84064 52.22362 203.45135
18.55000 -2502.06894 3.22640 -1.15932 46.07581 43.59889 157.42274
18.65000 -2485.08341 5.02840 8.42642 96.31033 86.11234 212.01605
18.75000 -2470.86941 3.58808 -4.90218 82.88628 43.71890 155.55225
18.85000 -2454.28344 1.38092 0.58771 43.23369 43.31237 155.74452
18.95000 -2439.21794 6.14271 -4.41065 54.67773 55.71122 156.92650
19.05000 -2428.42865 3.26364 0.42148 42.23500 35.06997 156.31928
19.15000 -2409.65367 3.53831 -6.16249 65.65979 103.40268 139.44998
19.25000 -2395.46042 2.45842 4.55797 37.04854 36.88132 149.09276
19.35000 -2384.45820 4.63873 3.67384 45.22332 38.99248 149.64416
19.45000 -2369.48606 13.35229 1.52180 86.56679 243.34028 165.20252
19.55000 -2356.01579 2.44940 -0.58189 49.42234 44.54625 137.85319
19.65000 -2338.97740 -2.26909 4.79074 94.67071 74.31685 143.76526
19.75000 -2331.91392 2.93122 8.95084 67.49621 55.07723 139.20266
19.85000 -2316.09123 2.77419 8.80890 40.22397 40.61042 132.89726
19.95000 -2303.36408 1.80501 4.65621 50.38326 42.13031 132.21599
