0.120000 2.075390
0.380000 0.136750
0.620000 0.131640
0.880000 0.663600
1.120000 1.482810
1.380000 0.721880
1.620000 1.117880
1.880000 1.238120
2.120000 0.992420
2.380000 1.061690
2.620000 1.366490
2.880000 0.871620
3.120000 1.343470
3.380000 2.770670
3.620000 3.140790
3.880000 3.121030
4.120000 -2.824170
4.380000 3.117980
4.620000 3.062730
4.880000 2.673030
5.120000 2.712990
5.380000 2.490350
5.620000 2.590700
5.880000 2.547060
6.120000 2.506760
6.380000 1.800050
6.620000 1.647870
6.880000 1.428120
7.120000 1.550950
7.380000 0.182470
7.620000 2.107830
7.880000 -0.255340
8.120000 -2.870670
8.380000 -2.672450
8.620000 -2.276900
8.880000 -0.875970
9.120000 -1.295620
9.380000 0.642490
9.620000 1.335440
9.880000 1.522120
10.120000 1.719930
10.380000 1.346070
10.620000 -0.609730
10.880000 1.702160
11.120000 -0.224480
11.380000 -3.068990
11.620000 1.164850
11.880000 0.732540
12.120000 2.645960
12.380000 -1.694500
12.620000 -2.755150
12.880000 0.914380
13.120000 -1.156300
13.380000 -0.721760
13.620000 -1.750320
13.880000 -0.177360
14.120000 2.166240
14.380000 2.452310
14.620000 2.386720
14.880000 1.671970
