0.05000 -1973.52623 52.29674 -12.91102 1830.44906 1903.06543 3045.07558
0.15000 -4209.23987 100.10010 -468.20374 2387.65340 1907.03800 5331.91198
0.25000 -6633.22270 -34.71051 -584.44405 3059.59544 2340.14038 7914.70025
0.35000 -8390.60101 90.76757 -26.28177 3490.89673 2859.75533 9753.29014
0.45000 -9424.04164 78.09386 -156.42952 3822.42384 3182.27170 11026.58489
0.55000 -10321.05450 83.59092 27.46161 3744.23861 3489.03998 11698.57051
0.65000 -10916.46041 95.37472 -113.38766 3815.40546 3585.16647 12009.22711
0.75000 -11298.21385 36.87701 -4.30282 3792.20701 3662.90200 12153.35993
0.85000 -11415.34519 137.63694 -170.18946 3680.86096 3761.84657 12075.33733
0.95000 -11570.92498 79.19920 -154.45368 3541.44087 3788.60724 11738.93886
1.05000 -11691.38089 119.71973 -82.78020 3509.45295 3768.47946 11455.96873
1.15000 -11793.02766 83.20585 51.35838 3308.38834 3721.03705 11063.27442
1.25000 -11818.25364 45.37606 -39.73087 3157.23353 3673.60011 10681.30581
1.35000 -11780.61771 23.51398 -128.43380 2934.45490 3608.38358 10215.52557
1.45000 -11816.15307 35.31469 153.45126 2802.57379 3556.62483 9637.90829
1.55000 -11659.62357 143.47476 -69.18429 2654.56195 3481.04574 9362.00487
1.65000 -11574.91316 10.57703 81.38536 2484.57265 3360.32985 8948.14000
1.75000 -11485.13004 84.52072 -58.48392 2330.23541 3302.43152 8500.12148
1.85000 -11360.69119 9.91921 -65.22431 2193.90930 3189.95067 8191.23606
1.95000 -11218.45148 46.71423 -88.63052 2095.44557 3074.89126 7884.79506
2.05000 -11096.57139 79.96874 11.83231 1988.50114 2993.88892 7515.15649
2.15000 -10950.49449 84.11247 70.20245 1868.29819 2924.88701 7224.19711
2.25000 -10815.18998 57.83296 98.19189 1748.37632 2811.46257 6892.70184
2.35000 -10634.99822 49.31582 57.11585 1675.49928 2718.61822 6693.44169
2.45000 -10469.82988 4.99496 -21.60837 1633.53837 2610.87493 6426.97268
2.55000 -10350.81812 9.97810 22.95254 1498.27623 2534.54948 6154.31474
2.65000 -10174.10775 6.68310 103.32186 1447.97923 2455.88349 5946.56925
2.75000 -10007.19467 4.78100 6.01149 1406.86214 2360.33038 5678.91093
2.85000 -9881.65316 4.12075 147.26092 1289.69492 2269.70106 5461.97036
2.95000 -9730.99674 -3.76491 60.72551 1265.65283 2197.78841 5293.43317
3.05000 -9600.44724 -0.24028 53.84418 1228.32302 2124.63718 5101.43746
3.15000 -9456.61948 -57.45772 76.93552 1183.74363 2040.79993 4922.86873
3.25000 -9298.14375 -8.99077 104.31853 1167.26799 1964.10183 4791.78651
3.35000 -9145.34956 -3.78263 -28.52833 1121.21317 1881.23948 4615.51378
3.45000 -9017.04124 3.56691 -88.06295 1096.95265 1828.78586 4471.08457
3.55000 -8900.46578 -0.82443 6.01838 1049.17111 1764.90693 4346.49689
3.65000 -8783.28936 -1.76857 -91.67541 1000.46679 1685.81471 4175.82567
3.75000 -8640.75174 -30.73089 84.29523 978.84387 1627.18987 3996.69970
3.85000 -8502.22029 -9.96941 76.55825 987.26983 1556.04714 3912.58569
3.95000 -8411.86479 -24.05050 -79.08832 956.05649 1506.33392 3762.22145
4.05000 -8301.48881 -7.30616 9.58562 950.74284 1442.81426 3635.62485
4.15000 -8180.86597 -23.23910 -9.42490 944.14484 1377.37374 3528.67659
4.25000 -8057.10155 -31.38141 43.74729 951.94435 1315.13131 3409.56185
4.35000 -7949.87776 -28.23934 -42.44940 936.64072 1263.89101 3279.65079
4.45000 -7853.57855 -43.80859 8.83254 928.78512 1193.90535 3186.91172
4.55000 -7704.94204 -21.99287 -44.02685 890.68510 1133.33482 3116.99678
4.65000 -7608.58416 -31.61480 73.04868 887.98472 1093.11929 2955.56768
4.75000 -7470.48943 -26.54151 29.97662 884.30666 1034.34786 2869.76422
4.85000 -7356.74720 -15.15829 111.26054 860.62579 992.14614 2767.56139
4.95000 -7225.52222 -11.70521 4.02276 854.19706 921.19238 2713.62397
5.05000 -7089.67230 -16.13875 -24.12884 841.75227 865.31961 2590.44368
5.15000 -6975.59381 -33.36710 62.97471 821.87368 827.75988 2516.09671
5.25000 -6848.64719 -6.98352 -6.73082 787.92471 777.77461 2425.40488
5.35000 -6706.73965 -21.81555 -2.79832 786.23427 734.00804 2338.69753
5.45000 -6599.15337 -3.73019 67.62209 758.48062 697.32533 2220.76743
5.55000 -6503.85439 -19.08350 -10.44373 738.28782 666.92348 2164.61504
5.65000 -6356.19183 -0.07318 -37.50344 707.04284 625.09553 2060.32447
5.75000 -6272.31541 -20.18030 21.59301 687.78610 588.37202 1981.66554
5.85000 -6156.53759 -13.71608 13.98354 654.24855 563.63099 1920.39210
5.95000 -6057.27937 -7.59519 -5.51536 618.23826 534.85748 1856.64546
6.05000 -5971.80230 -8.45506 -16.43599 597.52912 510.94623 1767.82874
6.15000 -5894.33240 -10.08131 24.40126 575.76260 483.34983 1733.90602
6.25000 -5804.01571 -0.85313 -62.98147 550.06788 455.45075 1673.63579
6.35000 -5727.86029 1.63985 -17.24806 535.54675 433.84893 1644.19300
6.45000 -5652.71298 4.72995 26.20015 519.69123 410.77931 1557.08840
6.55000 -5583.68155 11.41737 51.26516 478.63679 393.91414 1496.15320
6.65000 -5536.36491 2.83906 19.37145 462.60683 383.13285 1457.08595
6.75000 -5478.96972 9.77948 -9.53838 443.21319 362.61786 1428.03920
6.85000 -5421.62492 13.57360 44.64713 409.34888 344.64503 1381.60100
6.95000 -5375.58626 20.91908 28.15623 392.72200 329.77943 1306.08652
7.05000 -5334.92386 17.58208 37.60658 390.11384 317.80424 1296.51159
7.15000 -5279.40694 26.99939 36.43871 369.36159 303.01983 1250.64944
7.25000 -5237.50078 16.10065 26.77063 361.10491 290.92376 1228.22632
7.35000 -5199.29769 19.25220 8.05380 347.68685 280.63304 1201.02110
7.45000 -5164.81357 21.53138 22.36352 331.30134 267.33189 1168.46980
7.55000 -5114.17856 26.19370 7.70459 326.58708 254.83950 1142.54404
7.65000 -5080.11823 20.92327 -9.53241 314.78447 246.54972 1110.64447
7.75000 -5049.76908 25.89737 19.54379 302.45750 235.51942 1077.65636
7.85000 -5000.25450 22.06528 -2.08675 287.96990 229.36953 1071.13799
7.95000 -4963.47080 20.79821 21.11083 278.35768 221.79026 1056.24482
8.05000 -4940.36675 17.17985 -24.72775 266.63086 213.52144 999.67454
8.15000 -4901.58379 23.13469 14.11776 266.59853 207.07328 980.91853
8.25000 -4862.41318 24.31667 7.06851 252.18296 195.91241 943.43815
8.35000 -4813.82616 22.16144 -0.51857 241.54215 189.79666 951.26653
8.45000 -4780.17444 23.04470 -4.69987 234.96528 182.97171 924.75303
8.55000 -4738.05298 23.73047 3.63410 232.36141 179.00311 908.61139
8.65000 -4696.52701 20.74029 17.01005 233.46389 174.95069 895.74955
8.75000 -4661.55243 20.81833 -29.32839 222.71435 167.50185 857.27310
8.85000 -4620.92593 20.76106 -26.54055 209.01425 159.54029 850.76228
8.95000 -4573.55030 14.51618 -8.73780 203.39830 156.42997 842.73734
9.05000 -4543.74083 13.01108 -19.41854 197.30310 154.51723 810.48003
9.15000 -4491.35399 15.08088 5.70752 192.76132 149.58653 798.51370
9.25000 -4458.83713 13.58353 4.15640 179.04573 144.19982 776.13164
9.35000 -4417.44584 17.53745 -9.18085 167.78496 144.00675 772.87990
9.45000 -4381.90661 12.67873 -19.10987 166.96052 138.93485 757.26684
9.55000 -4347.91491 12.67022 -15.52646 160.95747 134.54475 740.78938
9.65000 -4315.45165 14.58361 -6.65848 156.27692 131.96381 727.64582
9.75000 -4277.87735 11.58490 -13.57079 150.66453 127.97065 721.87663
9.85000 -4247.87059 12.18451 -11.33694 140.10085 125.88516 697.58374
9.95000 -4214.48605 14.68609 -26.35030 134.18593 122.97999 690.22369
10.05000 -4180.17053 11.44077 -14.91496 132.97878 119.42342 677.86870
10.15000 -4151.73427 11.60562 -35.59119 126.07391 119.73789 664.39157
10.25000 -4121.49857 10.83866 -2.70797 127.37281 113.01070 652.58506
10.35000 -4089.77543 8.38160 6.20565 126.37592 114.27698 637.46777
10.45000 -4061.98330 9.64965 -5.36853 128.30118 110.44227 638.58262
10.55000 -4035.93999 9.16786 -36.79052 124.97677 106.81473 609.26684
10.65000 -4008.73539 10.36486 -9.86861 123.95715 106.01459 610.85732
10.75000 -3979.12989 8.23211 -5.20508 125.49452 104.63759 595.78574
10.85000 -3955.54997 11.06111 1.70468 123.60596 102.40141 599.31754
10.95000 -3932.34571 9.98218 5.90747 118.12145 99.56235 576.16697
11.05000 -3905.35936 8.38244 -2.17241 113.69760 97.71170 572.15002
11.15000 -3882.27156 6.89340 -15.12007 109.20273 95.29565 560.69661
11.25000 -3852.08638 9.56478 8.30983 116.22786 93.20018 564.97012
11.35000 -3832.09712 5.79631 -4.81408 103.97295 92.79832 545.93163
11.45000 -3806.46229 8.29833 -8.27186 106.75856 88.48362 528.43589
11.55000 -3781.86047 8.31046 -4.70410 103.71545 90.13309 519.28779
11.65000 -3757.31884 7.75585 -18.88220 102.62187 86.19356 519.10777
11.75000 -3736.21266 8.56308 7.93569 100.67609 85.90625 508.93926
11.85000 -3711.87788 10.10770 20.50684 96.48788 83.01629 491.52851
11.95000 -3690.28700 9.76591 15.14961 95.94152 81.53417 486.12442
12.05000 -3667.11549 9.80328 -6.20321 106.17309 78.86580 473.04028
12.15000 -3641.40466 9.93953 19.76903 99.71535 77.32582 457.09043
12.25000 -3618.70846 9.96820 13.16454 96.45521 76.18796 460.22266
12.35000 -3599.16852 7.89682 24.10312 94.63017 74.18146 447.22377
12.45000 -3573.39173 7.27260 23.16834 96.59146 74.21092 446.08741
12.55000 -3549.53157 7.87073 13.33605 92.90121 71.75028 431.76791
12.65000 -3524.30131 7.32577 22.93765 94.56953 71.26868 432.46990
12.75000 -3501.23012 9.34074 26.49861 93.45630 69.04164 424.00719
12.85000 -3481.47083 6.02173 17.61133 92.37113 66.96171 410.04501
12.95000 -3463.35681 8.95408 24.67102 92.10220 66.31967 397.37804
13.05000 -3438.28442 6.94570 31.55586 96.69464 65.08112 401.04943
13.15000 -3412.36049 9.33048 17.06776 94.86300 65.19721 385.02082
13.25000 -3390.16989 9.32988 42.25334 91.68580 62.76981 376.35691
13.35000 -3367.82697 9.16925 6.30505 89.32347 62.99250 383.30033
13.45000 -3346.76815 9.05533 14.27487 87.20515 58.82733 367.74372
13.55000 -3323.61600 7.40333 18.37391 86.57355 61.06587 365.41453
13.65000 -3303.28015 9.23978 22.60054 84.16250 60.71698 354.75665
13.75000 -3283.62661 7.85355 25.20969 81.28947 57.22936 341.86611
13.85000 -3259.12428 6.40774 17.36272 79.95252 57.69441 344.44503
13.95000 -3236.77417 9.87584 10.02107 80.83098 54.06049 333.85375
14.05000 -3215.86232 8.82512 27.56152 77.12889 53.17831 330.75178
14.15000 -3190.05751 8.97795 13.76468 79.11229 51.18792 331.79967
14.25000 -3170.55301 7.46321 12.21533 75.06316 54.64303 327.63471
14.35000 -3145.77648 7.09772 -1.74964 73.39536 54.48492 320.04630
14.45000 -3127.07279 8.40295 8.97736 74.74528 51.92917 306.86532
14.55000 -3105.71203 9.55728 9.09331 73.26785 52.79525 302.85357
14.65000 -3083.15451 3.25463 17.63525 71.71739 53.86299 298.21696
14.75000 -3063.86676 7.33408 14.11484 69.01685 49.67333 300.54032
14.85000 -3045.68271 5.97742 12.69916 65.56780 48.99643 285.50928
14.95000 -3020.50717 6.78826 5.26953 64.09163 49.91392 285.60991
15.05000 -3002.59200 7.21675 7.68044 61.82091 48.39702 271.87889
15.15000 -2979.16561 6.80300 13.85524 64.26017 52.90139 274.42036
15.25000 -2963.22315 7.36866 11.35570 62.88529 47.54501 266.74107
15.35000 -2945.56056 6.61850 17.97688 61.25969 48.54890 262.47835
15.45000 -2922.54307 7.95657 -2.18199 60.59874 47.32089 260.62189
15.55000 -2903.81499 6.68803 -2.01411 61.69420 46.18625 258.56038
15.65000 -2884.96296 5.06285 -3.68356 58.68093 44.93828 252.08553
15.75000 -2868.64079 1.94553 6.51787 56.64707 43.60776 250.48778
15.85000 -2847.32458 5.35496 -7.05534 55.39754 45.87083 246.48645
15.95000 -2832.36875 5.22620 -6.49648 57.60973 46.15374 237.83825
16.05000 -2814.29780 4.00977 -5.22462 56.06775 43.69957 239.01562
16.15000 -2800.45773 5.41592 0.66408 55.53217 43.31514 229.69529
16.25000 -2778.84582 5.23730 -1.84317 55.55846 42.04825 227.59803
16.35000 -2762.94005 5.00571 -12.64733 53.21369 41.97697 227.94217
16.45000 -2747.20808 5.95379 -11.03161 51.81393 43.53820 217.43851
16.55000 -2729.81356 5.56223 -0.30448 51.02840 42.10417 210.52270
16.65000 -2712.51905 5.68873 0.81134 50.93675 39.69220 205.16779
16.75000 -2694.71218 3.64098 -1.04708 46.66363 39.75555 208.10206
16.85000 -2682.22908 2.72572 -10.93499 46.42689 40.66226 205.77165
16.95000 -2664.35480 3.93146 -6.00888 46.55147 38.95442 204.87856
17.05000 -2648.30444 3.21746 -12.36669 44.56464 40.42623 198.75789
17.15000 -2629.89093 4.38291 -0.69468 41.02705 37.80281 192.70114
17.25000 -2616.50817 4.93496 -2.47378 44.65617 36.31356 191.81847
17.35000 -2598.54538 4.23632 -0.19705 43.18287 38.54698 181.14241
17.45000 -2582.87271 5.07240 -12.85789 41.58740 37.63930 180.51037
17.55000 -2568.23086 3.78533 -5.60255 43.84175 37.82211 182.93284
17.65000 -2555.61779 3.14923 -5.98798 44.87455 39.89440 187.12816
17.75000 -2538.33647 4.41582 -1.27488 41.42586 36.04536 173.76556
17.85000 -2526.43012 5.46189 4.37795 43.12389 36.76163 177.85756
17.95000 -2509.25010 5.08622 -6.19372 43.63783 37.96975 165.57797
18.05000 -2497.61731 2.73960 11.25948 46.83280 36.15891 162.31112
18.15000 -2481.79248 2.94189 11.15042 43.13104 38.51848 155.20492
18.25000 -2466.47955 2.61064 -1.23926 38.48965 30.60449 156.92405
18.35000 -2453.54745 2.42169 10.33317 42.14136 34.59419 153.90957
18.45000 -2437.06342 1.72760 -0.21032 38.24503 34.58995 148.07348
18.55000 -2421.89077 4.42149 -5.49515 37.65216 29.29278 156.75431
18.65000 -2405.48292 2.19445 -9.01197 39.20293 35.63220 152.18574
18.75000 -2390.69915 3.97563 5.46410 39.20830 32.74944 142.10177
18.85000 -2378.06696 4.04644 4.15877 35.79820 29.44776 135.67547
18.95000 -2360.92392 5.72462 -18.33566 36.28820 34.43965 135.07980
19.05000 -2348.12782 3.83720 7.15924 35.47783 33.71242 132.50151
19.15000 -2336.99399 3.06521 5.80258 38.73052 30.09750 131.47831
19.25000 -2321.41254 -0.22827 -2.46863 42.57856 30.83267 137.66379
19.35000 -2308.41274 3.53254 2.15544 34.32957 28.70646 137.71678
19.45000 -2293.45999 1.61461 12.52421 37.53949 31.76697 133.82502
19.55000 -2284.45240 5.58106 3.22379 36.96826 28.90979 126.56427
19.65000 -2268.64751 2.11149 -3.98203 30.13743 30.30988 125.03002
19.75000 -2254.80268 2.05461 4.04064 32.54867 31.29373 122.76256
19.85000 -2237.95055 1.76685 -11.65724 35.48876 32.36926 123.77794
19.95000 -2233.06105 3.57735 -0.59144 25.91110 32.87135 114.93609
