0.05000 -4865.27613 -474.11175 -599.65178 6275.66177 5953.33666 6060.66897
0.15000 -8119.14955 145.81074 757.91183 5594.34007 5605.67923 8917.19569
0.25000 -10213.97254 -96.26521 -346.08091 5191.76322 5244.93990 11403.89922
0.35000 -11671.76599 -160.05845 170.33930 4899.95076 4878.63059 12812.77386
0.45000 -12434.40089 19.20763 27.75053 4925.41836 4488.57480 13534.01923
0.55000 -12960.77157 109.33531 58.57169 4927.52641 4326.36561 13625.33600
0.65000 -13127.49714 51.29815 39.09895 4782.80417 4219.88868 13606.91567
0.75000 -13108.43852 19.82692 -2.07817 4563.35067 4144.43678 13353.36381
0.85000 -12962.22416 67.52426 -300.21071 4288.88597 4088.65576 12928.43797
0.95000 -12756.45538 -53.30873 -43.35041 4136.74587 3968.67944 12548.66258
1.05000 -12506.45788 -65.97269 -276.00414 3910.82099 3974.24808 12107.17575
1.15000 -12452.86316 91.56047 42.81411 3722.76107 3830.69678 11555.14136
1.25000 -12213.19921 12.91920 25.50362 3595.69997 3785.53557 11231.75187
1.35000 -12063.47088 33.56154 97.62796 3305.27356 3705.89344 10659.50689
1.45000 -11890.86174 19.98739 163.08603 3128.54074 3658.34622 10184.02520
1.55000 -11737.65692 42.18666 49.67877 3003.77686 3548.79411 9769.31409
1.65000 -11631.99757 18.88606 61.27198 2830.43226 3471.51191 9290.41332
1.75000 -11493.32911 21.36177 143.46869 2697.05728 3403.36992 8929.47474
1.85000 -11349.90365 -54.26601 24.90689 2517.64415 3318.91604 8526.94869
1.95000 -11161.29769 21.01837 -19.45280 2431.13725 3185.44051 8242.19765
2.05000 -11020.33764 5.43765 13.62699 2344.07275 3159.93262 7879.87132
2.15000 -10846.87066 -45.88971 48.30678 2236.79721 3044.00923 7591.90628
2.25000 -10694.70134 -0.79490 15.24191 2099.66070 2947.13918 7318.28992
2.35000 -10560.83117 -15.72091 123.65805 1992.89401 2881.92754 7081.00409
2.45000 -10435.30262 10.60433 35.44881 1898.43548 2811.13984 6779.32390
2.55000 -10288.39610 0.67040 145.30880 1836.34769 2726.16235 6590.83198
2.65000 -10108.72738 36.12516 75.31679 1818.03047 2664.30525 6369.08201
2.75000 -9914.28978 -15.18412 -9.85232 1712.35330 2545.87098 6233.60154
2.85000 -9867.31530 -24.82682 -42.64875 1589.94002 2539.28802 5856.72873
2.95000 -9657.14187 -4.53534 -39.41525 1604.65995 2398.55882 5772.08021
3.05000 -9563.78763 3.75347 101.64442 1466.04327 2328.54624 5512.02398
3.15000 -9365.44203 -14.11153 40.71342 1504.81534 2255.71724 5437.49783
3.25000 -9269.49720 -17.11320 58.24263 1466.86254 2212.46056 5219.20865
3.35000 -9150.15971 17.10436 -23.00378 1363.45792 2151.19624 5021.74909
3.45000 -9037.78186 -30.18081 -23.79809 1345.05182 2075.15393 4860.52699
3.55000 -8896.90228 -57.50037 -28.61708 1256.26470 1997.35370 4740.99113
3.65000 -8783.69370 -32.76548 -36.65126 1209.05542 1946.21423 4585.54394
3.75000 -8650.30048 -11.52344 -24.42553 1224.62677 1911.95200 4455.82669
3.85000 -8550.21030 2.65003 192.20005 1125.23975 1814.58896 4296.94365
3.95000 -8401.46519 -0.32271 17.48656 1157.38031 1781.11095 4242.93392
4.05000 -8294.87473 6.06862 -68.50960 1149.69107 1723.69225 4076.09974
4.15000 -8144.55044 12.82765 47.94750 1042.67958 1647.84629 4021.59167
4.25000 -8026.35990 -10.08821 -17.76883 1042.35573 1597.72873 3870.86188
4.35000 -7891.97202 24.20481 -11.91430 992.56904 1547.75490 3788.09488
4.45000 -7822.29687 5.39805 -19.92493 1011.11718 1545.31306 3652.62160
4.55000 -7718.26866 27.53175 -55.28453 948.88845 1488.31647 3537.83079
4.65000 -7611.42882 29.48952 -80.35023 918.82763 1434.18491 3474.78459
4.75000 -7505.30896 -6.88382 -77.64587 907.49339 1382.17645 3397.24229
4.85000 -7409.03732 25.41231 9.01117 822.83945 1348.52352 3281.37648
4.95000 -7313.77409 -41.06119 -38.79450 860.66012 1298.86268 3255.96493
5.05000 -7246.32806 18.83127 -25.90218 771.78892 1269.45866 3077.43096
5.15000 -7140.91802 -20.13741 -58.49236 776.26598 1261.13704 3053.57849
5.25000 -7029.25939 24.50114 49.56844 766.40452 1179.27570 2964.02202
5.35000 -6954.04417 -8.08954 -84.45681 747.16789 1142.94275 2894.64497
5.45000 -6869.48512 27.02541 -99.81059 704.77323 1105.31769 2818.06092
5.55000 -6788.82055 -0.67502 -78.67674 733.69452 1089.17829 2722.49617
5.65000 -6708.35468 11.77935 -19.20234 709.93513 1062.19869 2656.07834
5.75000 -6631.64644 7.41231 -46.82468 752.86003 1055.06694 2544.96067
5.85000 -6504.45245 13.38616 21.25835 604.82997 963.02747 2512.49754
5.95000 -6433.58331 3.32244 -90.22887 630.07702 963.76240 2423.77015
6.05000 -6331.14741 14.46394 -99.17308 606.66110 923.13070 2379.22362
6.15000 -6236.84965 6.32759 7.63146 574.85696 896.65728 2282.53371
6.25000 -6163.46927 -14.53931 -3.14902 571.47323 931.99329 2218.52456
6.35000 -6082.11899 36.84217 -34.82045 543.98783 870.52804 2174.10272
6.45000 -5992.33302 -15.53330 -34.63002 533.97713 811.92838 2116.94897
6.55000 -5911.37858 -6.23559 -111.97776 528.12129 798.34571 2042.94435
6.65000 -5825.92474 6.82445 13.39821 505.00742 758.09935 1998.26551
6.75000 -5750.18859 -20.26707 -6.86027 474.19463 749.27522 1925.50511
6.85000 -5673.97276 -13.62001 -15.84780 452.96206 724.94795 1901.92949
6.95000 -5597.20689 7.10982 -16.10822 454.62643 811.21128 1840.60985
7.05000 -5523.42851 -9.65884 -41.98290 427.32773 720.13881 1807.09630
7.15000 -5463.85214 -20.82857 -4.66021 427.72046 677.95175 1799.87823
7.25000 -5382.70694 -10.44873 -18.05413 374.91190 648.55863 1735.05971
7.35000 -5317.03087 -12.43677 -8.05231 376.49679 642.09472 1652.52445
7.45000 -5256.95565 2.27358 8.24500 381.27215 621.19572 1625.54089
7.55000 -5197.89844 -26.35060 4.97303 332.40878 620.10924 1589.32548
7.65000 -5144.04959 -2.35558 -12.05691 341.79730 605.09100 1560.77121
7.75000 -5101.25963 -15.86514 -33.52412 316.93358 593.39439 1510.66550
7.85000 -5056.43847 -16.13402 30.52005 324.08059 579.51835 1488.24107
7.95000 -5006.95922 -13.55972 -19.99211 325.47485 599.40451 1435.64084
8.05000 -4960.23364 -7.42408 -18.30573 336.46216 611.66973 1411.41621
8.15000 -4924.80952 -14.92671 17.13008 336.69769 571.81402 1377.42643
8.25000 -4904.79999 -0.03268 -0.64880 293.47544 567.31714 1347.10413
8.35000 -4869.95713 -6.32068 36.96675 297.72540 549.84545 1295.51894
8.45000 -4838.95521 -17.28252 14.05222 310.45476 551.09603 1270.91438
8.55000 -4819.02181 -16.68166 16.62456 316.72967 532.63627 1256.47805
8.65000 -4793.70313 -5.83454 31.08738 320.17881 538.37109 1226.11672
8.75000 -4784.25098 -17.58684 24.87967 413.50235 544.82469 1183.33425
8.85000 -4752.23981 2.40128 -6.90012 340.99501 515.86989 1164.06810
8.95000 -4741.29651 -14.12489 19.80341 364.06964 508.63991 1119.85427
9.05000 -4721.65147 -15.80972 0.84552 357.93933 485.27336 1118.88704
9.15000 -4710.11997 -11.56270 -5.72037 374.57091 476.65082 1044.19498
9.25000 -4699.64979 -22.91391 -10.21776 389.26503 469.70630 1029.53259
9.35000 -4683.88988 -16.33271 -4.89129 441.27910 484.25618 1043.29753
9.45000 -4670.50762 -18.07660 2.92225 434.63777 440.74737 981.99854
9.55000 -4644.27147 -10.93361 -5.65959 437.67671 425.52763 951.12810
9.65000 -4628.35723 -13.32815 -31.14746 458.47218 412.82012 922.53527
9.75000 -4595.04205 -9.42802 -18.53358 474.94788 407.41202 886.14945
9.85000 -4572.13152 -15.77727 -34.25086 495.15920 378.24088 856.80123
9.95000 -4546.98063 -16.78828 -39.33626 492.64380 362.30884 827.64813
10.05000 -4495.44202 -1.34482 -28.25958 494.87216 363.05212 802.96431
10.15000 -4409.14142 -5.08549 -28.06417 469.47226 337.24585 760.77273
10.25000 -4377.87159 -3.53760 -14.55668 489.72547 318.10943 738.81238
10.35000 -4323.40340 -4.96902 -16.33930 456.70364 297.85681 710.47839
10.45000 -4261.36634 3.30781 -7.54385 424.60644 273.61268 703.32669
10.55000 -4227.46057 0.56257 -0.97763 413.93351 273.77235 672.54548
10.65000 -4192.29225 1.74829 1.13574 385.87549 266.64578 665.65464
10.75000 -4131.13899 -1.92222 -7.26854 417.31863 258.64324 745.57059
10.85000 -4096.85990 -2.93263 -25.09592 364.83802 239.09829 628.01411
10.95000 -4062.00794 4.68930 -29.17252 343.14520 224.78690 603.06022
11.05000 -4028.64549 6.69920 -20.46520 342.64543 235.10305 600.19216
11.15000 -3993.13966 12.78010 -13.26803 328.50522 212.14536 577.22800
11.25000 -3966.03883 4.20517 -0.85294 307.34333 209.14773 550.83365
11.35000 -3920.24165 2.14455 5.45405 299.49803 230.15603 573.97902
11.45000 -3880.28611 7.87298 -22.14850 308.82615 218.91600 542.25075
11.55000 -3865.25660 3.18050 8.60026 278.75881 194.17655 525.21657
11.65000 -3817.32546 10.13283 16.50417 281.46160 180.94770 524.75370
11.75000 -3798.39911 11.07457 -20.89526 261.05113 199.56283 510.75543
11.85000 -3754.09752 9.99229 -4.85631 282.42626 174.87552 497.38311
11.95000 -3738.97912 5.80461 4.15022 272.84271 214.90146 492.61423
12.05000 -3710.20423 9.32643 -7.30509 242.77191 173.79551 483.85771
12.15000 -3682.77003 5.65921 -12.98148 244.04144 165.02608 452.44804
12.25000 -3660.53778 8.24647 -20.19291 229.81382 165.13392 455.45658
12.35000 -3619.50126 10.25561 4.18946 231.13441 153.40839 451.03051
12.45000 -3602.56558 10.12976 -27.11775 216.18678 159.58283 439.77411
12.55000 -3574.53939 9.13109 -11.23209 206.16663 146.25499 429.19065
12.65000 -3548.53115 5.31104 2.58022 218.72126 133.47657 430.75182
12.75000 -3512.14824 13.30145 -7.70785 190.71631 147.85720 407.03622
12.85000 -3489.06651 6.36429 13.98900 191.25783 161.30188 437.52890
12.95000 -3472.15714 5.04226 -18.47035 179.25240 161.36921 401.56054
13.05000 -3441.76738 8.46839 -17.18760 172.09360 149.27897 390.30734
13.15000 -3414.08274 6.23738 -11.03478 165.51004 116.51319 372.73839
13.25000 -3393.16088 7.57849 -21.08839 163.11285 118.05001 367.55881
13.35000 -3367.42253 9.21238 -19.92917 162.54905 154.41459 362.88133
13.45000 -3339.51382 10.31948 -15.35550 166.66356 115.93884 368.25389
13.55000 -3316.29415 7.02472 -22.70744 140.78452 95.92197 340.87274
13.65000 -3287.08319 10.83710 -34.63689 135.37191 111.49902 343.30335
13.75000 -3258.90675 8.18918 -29.99147 157.21882 107.30286 328.90017
13.85000 -3243.52335 11.31427 -24.72586 157.33204 170.96847 358.09361
13.95000 -3224.83423 5.89201 -29.49425 195.53331 135.67942 340.16925
14.05000 -3198.09019 6.24827 -31.81800 129.97616 113.91444 323.55617
14.15000 -3174.62405 4.56536 -21.91218 156.55445 125.49491 334.15146
14.25000 -3152.57100 5.74410 -35.93104 116.15796 108.67478 304.30180
14.35000 -3127.66395 7.09726 -19.85738 120.45671 94.92677 303.03711
14.45000 -3109.73333 1.13006 -32.48562 109.05165 110.28395 304.49935
14.55000 -3090.59927 0.42446 -21.63734 160.20566 116.81613 300.91837
14.65000 -3071.47882 9.69409 -14.96826 109.94536 89.19642 286.43341
14.75000 -3041.04564 8.78937 -29.30580 125.58456 109.23522 329.40126
14.85000 -3025.34528 6.45077 -19.94223 109.86881 83.89184 304.82640
14.95000 -3005.72111 3.89986 -27.23558 102.44848 102.89485 271.17610
15.05000 -2992.89373 2.09776 -22.25699 102.68687 85.31167 260.65052
15.15000 -2968.96599 6.85163 -24.24838 103.30170 75.09890 297.77394
15.25000 -2953.37500 7.57396 -12.01480 92.69516 75.06252 268.10877
15.35000 -2933.20038 6.06721 -23.55987 93.76132 81.82088 258.79411
15.45000 -2914.78841 1.74114 -6.00386 95.96522 84.93728 255.36015
15.55000 -2894.85759 7.71743 -23.33120 91.10329 76.05250 246.61923
15.65000 -2870.55983 1.27605 -13.63292 98.84881 166.28529 261.69473
15.75000 -2860.10499 7.10085 -13.41276 127.51306 117.79795 257.43416
15.85000 -2837.30340 4.92160 -25.56862 109.11485 90.72591 248.51606
15.95000 -2823.12552 4.53793 -2.00144 94.26407 95.94607 238.12777
16.05000 -2801.31033 10.28084 -24.44475 139.02567 144.96200 279.42318
16.15000 -2783.12661 6.63338 -22.56062 151.57672 105.07886 247.81122
16.25000 -2768.45319 6.71032 -1.80376 83.34215 63.26868 226.31126
16.35000 -2744.20446 6.40695 -2.18081 93.47330 76.59176 217.79404
16.45000 -2730.81225 13.87677 -3.03540 95.48917 167.71528 224.06964
16.55000 -2720.00337 9.84652 -13.12145 103.22086 100.85607 220.27598
16.65000 -2698.23030 7.00880 6.34807 72.31718 73.37514 206.04018
16.75000 -2684.48981 2.99573 -2.16962 141.08013 99.85315 200.15513
16.85000 -2668.98354 5.48813 -2.63338 127.48284 96.73685 205.23846
16.95000 -2643.51054 8.84537 -2.38049 77.32265 55.56904 200.40610
17.05000 -2636.40148 1.62375 3.04520 71.86423 63.70641 200.88681
17.15000 -2617.28152 6.33720 -8.68811 95.54228 69.24591 197.94597
17.25000 -2606.13244 10.12580 -2.45600 135.80806 79.00611 205.44979
17.35000 -2585.02597 5.80662 -0.22904 105.91604 101.18516 176.38363
17.45000 -2570.78587 2.36983 -9.16110 66.08891 73.60689 185.86121
17.55000 -2551.87819 5.38985 -20.01146 109.83104 58.26432 199.59621
17.65000 -2540.18880 3.82765 -4.75796 61.21513 49.42739 180.53630
17.75000 -2524.98120 3.01672 -4.82656 74.13780 74.75118 193.81952
17.85000 -2509.94283 7.84262 -18.81286 66.55537 60.01709 177.14368
17.95000 -2492.10429 10.84951 7.37667 70.30013 68.31619 193.01174
18.05000 -2482.19285 8.75564 -11.17318 69.34059 60.85227 169.02962
18.15000 -2459.64128 4.77876 -7.72168 75.22022 56.37370 175.19096
18.25000 -2451.06843 10.37601 -11.51121 149.90932 136.15216 193.68582
18.35000 -2448.80271 14.63327 -1.65974 258.33655 253.53374 360.18359
18.45000 -2416.18267 3.35908 5.44690 168.87179 54.84504 192.86846
18.55000 -2403.32455 0.68722 -8.34551 54.34486 76.70578 163.74501
18.65000 -2394.80565 10.31624 1.82663 67.30363 79.21734 157.44585
18.75000 -2378.92829 3.82824 5.00653 73.09133 71.49928 164.56051
18.85000 -2370.71329 1.76440 -13.04992 183.98044 124.80669 191.24350
18.95000 -2350.16774 3.10406 -3.28792 68.88036 51.98536 155.13379
19.05000 -2336.06014 8.09475 -6.25227 61.76508 44.94189 155.93562
19.15000 -2316.11979 -0.11919 -17.02996 69.76238 70.69156 157.54962
19.25000 -2308.37282 7.58482 4.02694 57.61931 49.96896 151.91513
19.35000 -2289.47628 14.17877 0.24161 111.82303 199.31945 155.71286
19.45000 -2285.90167 6.62061 10.64584 67.36198 64.93074 147.44602
19.55000 -2271.53991 1.61368 2.85787 57.57964 55.37236 141.70693
19.65000 -2254.88417 4.77277 2.27734 59.04687 50.88270 140.80562
19.75000 -2237.60363 5.73276 4.41480 49.53977 37.63216 141.29064
19.85000 -2225.05706 7.63465 -8.52308 65.91391 50.81694 137.73265
19.95000 -2215.73396 7.78451 6.49261 53.29139 42.25238 138.56232
