0.1875 -3.83855 15.06321 0.76596 115.11327 115.71473 93.71995
0.5625 -0.47324 33.23645 0.22566 116.39436 111.42925 92.25157
0.9375 -1.71275 50.19172 0.05484 116.20764 103.51439 85.64862
1.3125 -0.99404 60.98013 0.08971 113.92125 96.86399 82.24488
1.6875 -0.33041 70.44258 -1.58724 113.84425 92.44521 78.59953
2.0625 -0.09794 75.85435 -1.29729 110.89155 86.70772 73.99197
2.4375 0.53722 83.32414 -1.72135 109.61656 81.62514 70.88317
2.8125 -0.94159 87.70791 0.13877 106.06375 78.77406 67.83309
3.1875 0.19335 90.76272 -1.11779 101.16995 74.82634 65.50148
3.5625 -0.49812 93.53838 -0.28023 97.80663 71.2873 62.67848
3.9375 -1.13027 97.29464 1.41858 94.11242 69.57826 59.02641
4.3125 -1.74249 102.53338 0.88303 88.33307 65.51766 58.44329
4.6875 -3.51286 106.22484 0.95452 81.98286 64.24501 57.67755
5.0625 -0.13108 113.69774 3.12433 76.25258 62.96332 54.30648
5.4375 0.55299 121.54509 0.5223 69.64033 61.72476 53.06043
5.8125 -0.66978 129.16631 0.33297 63.29014 62.01946 50.49857
6.1875 -0.05393 140.3737 1.66124 57.36174 60.66484 47.79365
6.5625 -1.75452 151.01271 1.26773 52.19464 57.68064 44.78313
6.9375 -0.48456 162.78178 0.88954 46.78218 53.26353 40.63348
7.3125 -1.33034 170.38017 0.49979 41.8284 47.30506 36.37536
7.6875 -0.69833 178.17463 -0.66556 38.24802 40.89807 32.57255
8.0625 -0.61575 183.09731 -2.15877 35.77257 33.35164 30.26906
8.4375 -0.14926 184.81822 -1.57957 33.41135 30.10338 28.91806
8.8125 0.50962 186.88367 -0.34628 31.46346 28.35779 27.85037
9.1875 0.06976 188.85116 0.03146 30.69811 26.84681 26.93197
9.5625 0.60522 191.94918 -0.06781 29.87942 25.09231 26.14391
9.9375 1.10159 193.46268 -0.22901 30.02887 24.95289 25.47309
10.3125 0.76136 196.20932 -0.04434 28.06787 23.38885 24.29614
10.6875 2.41977 197.43372 -0.38715 27.1111 22.20368 23.30709
11.0625 0.99781 198.87863 -0.6146 26.66981 20.13632 22.75958
11.4375 0.22216 198.88806 -0.214 25.31089 18.83122 22.18254
11.8125 1.77341 198.79128 -0.63932 25.23946 18.38793 21.50691
12.1875 1.91616 197.92608 -0.70488 23.87801 17.85575 20.85231
12.5625 0.71074 198.05205 -0.28374 23.57861 17.20989 20.78647
12.9375 1.6316 198.50752 -0.00836 22.28909 17.30357 19.86025
13.3125 1.32549 199.16334 0.54496 21.62651 16.53553 19.07209
13.6875 2.57919 200.82382 0.64408 21.57978 16.15063 17.8616
14.0625 1.04427 201.46346 -0.63381 20.65445 16.11282 17.89553
14.4375 2.73354 201.73771 0.23749 20.48433 16.06235 17.25011
14.8125 0.66183 202.73859 -0.24266 19.32751 16.11174 16.91117
15.1875 2.31428 203.22606 0.9989 19.09393 15.17457 17.34916
15.5625 2.20509 202.63558 1.36183 18.54542 16.06752 17.11119
15.9375 0.49716 204.13623 2.11717 17.81434 15.59956 17.28967
16.3125 -0.049 205.55703 2.14508 18.24111 14.68181 17.21395
16.6875 0.1577 205.93916 2.52135 17.55396 14.10727 17.51104
17.0625 -0.23017 206.95319 3.26459 17.01814 13.13576 17.97704
17.4375 -1.58299 206.1731 3.6261 16.79181 11.73714 17.95459
17.8125 -1.3168 206.42864 1.8425 17.81199 11.3879 18.98377
18.1875 -1.98535 204.49887 2.86988 16.71524 9.49281 19.86451
18.5625 -1.7795 203.88024 2.26137 16.39685 9.02385 19.98624
18.9375 -2.89137 201.37797 0.41395 16.77507 8.66134 20.00383
19.3125 -0.6884 200.23015 0.78474 16.23437 8.66646 21.27761
19.6875 0.6419 199.56204 2.98548 15.6394 9.84093 19.69488
20.0625 -1.84209 198.39994 0.1703 16.00298 10.78578 18.68742
20.4375 -1.2415 196.93249 0.56798 14.87677 11.26328 19.50855
20.8125 -0.78572 196.07587 1.27144 14.09191 11.42373 18.23591
21.1875 0.25728 197.50659 1.35172 13.58195 12.7708 17.92607
21.5625 -0.20339 196.88016 2.12837 14.77726 12.17957 16.86925
21.9375 -1.78261 198.45328 1.25591 13.15174 12.69094 16.09713
22.3125 2.57073 198.65493 -0.16238 12.21441 12.21274 16.97088
22.6875 1.68723 200.55212 -1.43475 13.16132 10.19513 13.25249
23.0625 0.67146 199.79872 0.78067 11.92424 10.5642 14.80998
23.4375 0.62492 199.33627 -0.1155 9.21098 8.88148 12.95668
23.8125 3.44596 200.27818 0.13401 11.48983 7.55351 14.45386
24.1875 0.11916 200.58735 -1.33666 10.7754 8.84043 13.13509
24.5625 1.93338 201.79658 1.37516 9.73247 7.18994 12.54778
24.9375 -1.32882 199.88224 1.84332 11.03544 7.33354 12.8816
25.3125 0.45591 199.20914 3.7021 9.63174 6.88175 12.5963
25.6875 -1.96589 201.79142 -1.48037 10.97391 7.90532 10.79506
26.0625 1.99571 199.58993 3.96643 11.65307 7.49202 12.0975
26.4375 1.70455 199.94489 1.87433 10.91044 6.64058 9.70106
26.8125 0.2492 203.01173 -0.17665 8.50811 7.13733 9.54302
27.1875 3.46388 201.07945 -3.6479 8.27368 7.1732 8.61528
27.5625 1.09239 200.32146 3.02532 9.87836 6.86801 9.05961
27.9375 1.65859 198.95415 -0.68276 9.44964 5.55831 8.25814
28.3125 5.83011 201.07449 -1.32138 5.54401 4.98467 10.33346
28.6875 0.66808 200.66374 6.18963 8.01076 7.6268 7.11397
29.0625 2.82678 201.99871 0.91398 6.0972 6.7707 9.62593
29.4375 -1.80168 201.206 -1.79064 6.77335 5.68671 9.30764
29.8125 5.82483 200.75077 -1.00754 7.54174 7.13227 7.25767
