0.05000 -3302.30272 -92.73135 -3552.65712 3399.45818 5510.65581 4459.95810
0.15000 -3847.16254 283.05583 -2120.66157 5506.86578 4401.45160 8456.18468
0.25000 -7179.47953 -398.31912 429.86054 4673.32255 4890.55831 9114.41385
0.35000 -8036.22588 3.28281 149.94054 4276.93209 3031.20308 10076.26765
0.45000 -8593.25787 191.79234 -836.99255 4024.87907 2798.66634 9556.34600
0.55000 -8778.87259 127.66883 -392.91746 3371.35081 2791.70480 9680.55622
0.65000 -9033.14626 -33.60345 221.95805 3462.01327 2427.05313 9475.42846
0.75000 -8957.29822 107.62121 -598.56214 2909.57287 2102.79068 8992.56782
0.85000 -8655.41405 -105.08977 98.94925 3156.15136 2462.05302 9048.28094
0.95000 -8685.46119 25.14553 -196.26899 2512.21041 1801.88830 8529.80612
1.05000 -8614.91361 15.55736 -339.49457 2560.17294 1622.40374 8215.85570
1.15000 -8660.05101 16.25356 -33.37651 2496.39834 1560.15978 7923.80033
1.25000 -8486.72762 19.12523 124.46767 2336.32309 1579.41007 7765.70240
1.35000 -8445.40542 43.76432 171.55228 1960.95428 1255.51683 7492.39395
1.45000 -8371.18096 68.18883 200.20138 1884.50499 1615.98820 7140.46569
1.55000 -8287.84060 50.89435 71.16184 1943.69982 1451.38629 6839.63373
1.65000 -8245.19281 88.48549 125.59912 1859.55631 1357.22611 6663.10341
1.75000 -8161.72695 17.93306 133.32982 1736.43560 1569.83650 6453.86588
1.85000 -8222.06766 52.93757 146.13740 1521.01455 1429.44607 6185.16489
1.95000 -8142.66964 38.13025 32.26617 1522.40856 1220.17339 5988.15950
2.05000 -8162.50913 30.80183 57.16709 1498.68140 1177.70007 5787.77944
2.15000 -8141.78604 19.02166 228.04097 1388.32170 1204.64099 5582.21993
2.25000 -8228.64145 64.32725 219.08526 1358.59700 1316.62639 5381.93051
2.35000 -8219.32487 15.74905 324.73138 1638.37889 1138.37936 5210.73619
2.45000 -8203.05712 42.77843 51.67680 1321.16057 1276.38864 5124.12027
2.55000 -8220.40027 31.90815 160.84290 1268.92884 1175.13625 4876.70899
2.65000 -8175.73144 -11.07843 237.75870 1070.90925 1293.23787 4797.38704
2.75000 -8151.84477 29.20266 61.51986 1181.18316 1002.37371 4616.75207
2.85000 -8097.13082 13.29609 127.56989 1128.48038 1013.19701 4495.56197
2.95000 -8076.50290 30.11319 161.56835 1069.98053 785.69842 4418.20254
3.05000 -8072.19382 15.16931 34.26657 954.76056 752.06441 4177.12030
3.15000 -8033.56965 21.55466 -44.91582 960.11098 844.19354 4072.18370
3.25000 -8039.42098 5.80838 -38.77084 1003.25129 859.04382 3925.85894
3.35000 -7972.30780 31.43838 69.96047 1146.09801 899.66682 3829.80034
3.45000 -7928.89895 15.61873 -26.34443 967.04340 682.04925 3803.87695
3.55000 -7862.19898 16.74296 70.20407 1134.62549 986.79811 3680.74388
3.65000 -7827.00840 12.50819 -33.01440 906.64064 901.81923 3515.94378
3.75000 -7799.34843 10.39124 -15.46162 878.38994 674.30876 3482.68150
3.85000 -7768.19065 17.03493 -8.21104 968.07677 871.02911 3496.66447
3.95000 -7696.90825 -4.32662 -75.17708 834.33294 777.20253 3200.73012
4.05000 -7669.34095 -3.61219 -21.32596 849.40101 646.33354 3077.07002
4.15000 -7599.42518 5.14011 45.53864 752.22491 587.49725 3052.51331
4.25000 -7505.81859 -3.73380 45.71085 687.91902 505.70753 2943.77097
4.35000 -7411.49517 -12.40089 34.50379 732.51475 632.48370 2860.84037
4.45000 -7386.30363 -9.64298 34.76189 982.25895 1042.38969 3008.42444
4.55000 -7323.22593 -4.91601 -24.56857 625.54606 449.82506 2713.90677
4.65000 -7281.05395 -14.73386 -12.68561 735.46326 793.01351 2671.60502
4.75000 -7208.58782 -7.85691 -82.56131 616.92392 591.77360 2592.00881
4.85000 -7167.08777 5.88452 0.16770 611.69929 473.58426 2649.88868
4.95000 -7083.68274 -3.32123 69.43258 632.74439 565.41146 2474.19478
5.05000 -7033.67706 -23.27433 2.32425 690.56566 620.91543 2342.66612
5.15000 -6940.47392 -7.84254 38.86333 588.95059 676.69221 2340.57103
5.25000 -6895.33614 -0.08225 -27.55632 576.97757 452.47845 2277.68402
5.35000 -6830.53907 6.29969 44.37650 526.83616 386.68517 2177.68017
5.45000 -6778.28832 8.69347 75.19545 566.70730 620.03578 2201.11396
5.55000 -6710.11120 -7.95624 -70.07760 637.31565 725.58691 2085.97344
5.65000 -6650.32451 23.05068 -4.90396 501.24409 469.14676 2000.45991
5.75000 -6605.81830 17.78611 -22.81998 473.98049 372.15266 1979.54621
5.85000 -6545.95434 -2.84967 31.40400 597.04490 415.51465 1938.03516
5.95000 -6488.55565 14.66154 -16.17704 524.05819 543.57266 1961.10893
6.05000 -6426.61698 -1.77849 -6.01569 717.38129 662.45195 1870.37941
6.15000 -6381.56013 11.74596 -74.90218 496.34638 639.38991 1833.14444
6.25000 -6324.45156 17.67680 -14.34915 420.00476 399.09109 1780.12373
6.35000 -6269.02758 10.79818 -68.99371 507.24714 387.67189 1750.88554
6.45000 -6231.94542 26.67709 -1.18194 393.42764 355.54532 1659.96660
6.55000 -6154.59398 7.38228 -73.23902 479.84330 480.51856 1754.06316
6.65000 -6119.01451 8.73874 -75.16313 529.78387 432.22800 1623.13758
6.75000 -6071.46456 1.96918 -88.14658 446.53071 472.31667 1610.82109
6.85000 -6049.62075 11.03522 -107.95946 580.55910 732.83131 1550.15788
6.95000 -5984.39397 2.54086 -97.25111 428.02375 487.71840 1537.71954
7.05000 -5946.81156 -5.06333 -96.64068 587.97629 475.20963 1511.03793
7.15000 -5895.87661 5.53104 -133.90761 368.75620 322.31718 1407.50999
7.25000 -5826.03653 9.68336 -83.88714 492.86611 416.53532 1482.34125
7.35000 -5788.97207 -3.86072 -72.68489 417.06285 284.98528 1352.70080
7.45000 -5732.09698 17.73452 -65.76638 406.79925 382.40564 1377.82592
7.55000 -5692.84363 1.53494 -62.11306 321.57801 268.41545 1298.20200
7.65000 -5648.16267 23.10673 -116.14396 471.39358 789.14342 1401.34924
7.75000 -5578.92025 6.58376 -133.70239 477.48186 636.83486 1294.73741
7.85000 -5535.82691 29.28644 -67.26651 355.58463 669.51036 1256.64143
7.95000 -5487.30713 -0.95526 -69.19131 332.99110 403.77224 1175.21434
8.05000 -5429.71746 9.12844 -124.18855 320.17043 192.65462 1162.56009
8.15000 -5387.86750 4.73193 -64.21319 276.02886 255.17787 1128.91905
8.25000 -5346.60696 11.53675 -151.57746 687.74710 313.57057 1232.13042
8.35000 -5268.29268 16.36113 -119.58909 457.61752 658.93737 1157.69665
8.45000 -5252.09781 15.92612 -105.46754 337.63902 278.75301 1047.51906
8.55000 -5212.85562 12.07888 -60.17917 610.03510 445.23546 1090.93423
8.65000 -5157.70812 7.44335 -103.47395 371.91281 269.95317 1022.85077
8.75000 -5108.26396 2.63189 -59.62638 262.71234 228.41817 987.64169
8.85000 -5056.90027 15.32806 -61.91483 219.38582 187.67107 943.58562
8.95000 -4994.15803 0.19988 -28.89436 308.56559 393.85407 955.48732
9.05000 -4965.67344 5.42610 -61.91504 285.48514 252.24128 923.08271
9.15000 -4909.35956 14.10278 -34.47332 395.33988 487.23412 948.28787
9.25000 -4872.45902 6.17143 -35.76344 248.93810 216.76853 868.86125
9.35000 -4820.33115 -2.08403 21.92426 300.78750 304.46053 865.22959
9.45000 -4794.37053 17.75509 -19.92072 486.35392 409.39451 855.64592
9.55000 -4745.43558 3.14112 -28.44972 202.66804 209.15135 827.51049
9.65000 -4707.32950 5.28326 3.37346 234.23810 234.75874 820.94955
9.75000 -4670.97344 -4.66409 -21.69999 344.70693 254.79883 786.22145
9.85000 -4641.01085 -14.16498 -13.06499 522.27667 521.53845 830.78249
9.95000 -4581.29957 7.68382 -5.68353 282.81729 196.92116 757.15538
10.05000 -4555.62889 3.20858 13.37205 290.21283 229.88050 697.86595
10.15000 -4524.77595 -0.25487 11.29262 243.75631 247.83444 730.20196
10.25000 -4470.80647 -12.89880 21.50783 293.34667 479.71032 721.57762
10.35000 -4444.40779 8.51673 54.96577 246.19423 212.15954 698.36592
10.45000 -4408.11011 12.39840 20.68079 224.84894 189.58527 722.59179
10.55000 -4372.47014 -0.49408 -4.54060 168.68383 167.41635 688.14456
10.65000 -4350.29230 -4.81082 42.14766 315.12570 195.72430 637.20054
10.75000 -4297.90344 3.96826 3.92980 191.49986 170.47836 647.23817
10.85000 -4257.33547 13.99094 40.15479 257.80157 277.59214 740.82099
10.95000 -4238.82702 -2.59483 45.80704 154.75286 176.36933 614.62249
11.05000 -4210.19000 3.02959 46.43348 208.23993 177.89474 609.88006
11.15000 -4170.12856 1.54154 21.59671 162.00305 148.90275 610.22906
11.25000 -4141.85680 2.35294 27.83945 194.21839 223.21269 588.14999
11.35000 -4108.70253 -8.50482 35.15646 329.36807 252.29748 673.44710
11.45000 -4069.76313 6.28203 45.31781 212.87306 160.14288 553.99418
11.55000 -4025.41270 2.41414 93.31772 241.61957 149.02899 579.03921
11.65000 -4021.24524 1.61240 51.36043 254.66912 201.63579 538.89225
11.75000 -3978.86909 4.20396 30.20093 323.69389 173.99216 598.15540
11.85000 -3947.52594 3.05174 73.65294 142.97957 119.16726 505.13569
11.95000 -3917.26241 -1.89945 33.74763 144.53197 131.99018 515.00405
12.05000 -3886.02333 -4.17131 51.04764 175.48699 175.27590 515.78018
12.15000 -3849.12864 -3.14026 42.29234 270.17138 321.58795 572.31863
12.25000 -3800.62239 17.19729 31.75476 347.61748 303.29700 497.47579
12.35000 -3787.01190 -5.16622 12.36766 241.14577 188.27373 725.95746
12.45000 -3762.02065 3.87523 42.81223 151.94439 90.79394 450.56564
12.55000 -3738.06865 0.10093 19.96123 136.26219 224.40463 460.03918
12.65000 -3699.06662 8.11050 3.44089 178.37419 200.25873 452.11360
12.75000 -3661.22961 -19.85064 -42.07764 196.71486 611.95072 843.31490
12.85000 -3653.51459 -3.49562 -29.06723 149.96642 120.05046 416.31969
12.95000 -3604.60381 -3.75334 12.57988 406.88883 202.66510 442.73682
13.05000 -3596.52981 -5.64079 2.52892 144.05289 151.72831 435.36257
13.15000 -3606.00016 -19.16576 10.77567 930.39623 459.79999 531.41675
13.25000 -3541.08420 4.35279 -0.40803 161.90680 301.01054 430.22722
13.35000 -3508.86130 2.06466 -12.45871 114.28269 97.89040 384.10680
13.45000 -3480.01207 9.82497 -9.52543 121.17270 153.50245 381.52965
13.55000 -3465.42418 -3.98001 8.43072 164.19944 154.36945 467.70482
13.65000 -3449.98666 5.98359 -24.97839 133.02485 141.09909 358.46968
13.75000 -3425.57722 3.79404 -3.34923 159.45178 138.55710 364.70819
13.85000 -3397.82178 -0.94734 -4.99004 94.21440 128.31106 349.39691
13.95000 -3366.98800 6.86537 -33.14352 194.60508 136.01901 350.51099
14.05000 -3347.46413 -2.90488 -31.06254 135.77912 103.42889 338.06600
14.15000 -3324.26242 6.30363 -16.34488 123.03889 115.11655 342.70761
14.25000 -3302.23680 -0.57780 5.97746 137.92765 93.86734 352.28449
14.35000 -3285.17160 15.96770 -26.63535 193.06848 289.18844 319.17337
14.45000 -3244.44941 6.84134 2.07642 110.75487 81.45671 319.44582
14.55000 -3232.14125 6.56242 2.32730 90.59723 164.45057 310.36231
14.65000 -3207.37966 8.35853 -1.62389 194.22129 221.27252 369.59184
14.75000 -3177.94048 -7.41184 -12.17735 237.65011 145.41553 304.51332
14.85000 -3173.87663 -1.89270 -5.28412 136.08365 73.80100 292.67264
14.95000 -3138.38736 7.74681 5.08914 163.19336 147.15738 327.18737
15.05000 -3123.91778 8.54314 14.73251 81.13788 78.33760 295.40473
15.15000 -3092.09087 4.81125 3.24805 142.51227 122.54410 284.71571
15.25000 -3080.36213 9.61779 13.33631 146.08157 175.27678 279.73421
15.35000 -3054.95691 5.80063 1.34139 75.50248 100.91970 276.40236
15.45000 -3066.94630 -11.84036 7.25240 528.21679 178.96089 282.85295
15.55000 -3008.57733 3.01011 -15.48137 231.59439 152.16714 269.01437
15.65000 -2999.69551 -1.69920 14.68539 174.36941 95.80772 262.53028
15.75000 -2973.95829 -1.48042 -2.54346 88.56335 95.87876 266.45197
15.85000 -2937.64427 1.98459 9.13272 82.73198 137.41304 276.42767
15.95000 -2942.13361 0.80582 15.68156 81.19200 93.07980 253.37817
16.05000 -2912.22067 -1.25935 -19.98259 88.62632 67.11148 244.11119
16.15000 -2891.49255 -4.16925 26.06756 76.24183 65.64519 227.18845
16.25000 -2873.26229 -4.41868 -2.76531 67.19565 77.29477 239.47920
16.35000 -2853.76149 -0.21568 -2.18467 155.66263 89.08251 235.58429
16.45000 -2831.61881 -6.94728 -45.56121 70.27034 89.04540 247.97639
16.55000 -2818.63538 20.47472 16.42607 123.91952 317.52592 225.15181
16.65000 -2795.32230 0.27244 -1.15659 109.32666 72.52759 245.31128
16.75000 -2777.07774 0.52313 -13.83442 105.53917 85.53235 277.48970
16.85000 -2768.08582 3.86867 -19.33528 54.56405 45.11751 212.71412
16.95000 -2750.98304 5.74261 -33.75714 112.24844 95.31472 251.54793
17.05000 -2728.00236 -4.78729 -15.04023 72.91271 66.58777 201.96991
17.15000 -2717.86206 0.06132 -18.14280 115.29784 72.87342 214.71096
17.25000 -2700.26277 5.26074 -2.39391 70.30081 54.07722 206.15316
17.35000 -2676.02827 1.08791 -7.40363 72.72776 46.30559 211.48473
17.45000 -2659.20533 4.93190 -32.61516 59.24245 58.21790 204.44878
17.55000 -2637.73026 0.34056 -23.84445 112.73110 72.75286 195.58152
17.65000 -2633.87878 4.00525 -31.48130 68.26951 50.64710 188.36241
17.75000 -2613.23045 -2.28147 -51.02859 58.93278 54.20153 191.05530
17.85000 -2600.26317 8.09897 -39.92356 70.91546 58.09815 187.48409
17.95000 -2570.52760 -8.61933 -46.41843 107.34648 136.11265 209.41697
18.05000 -2570.33390 -5.32265 -31.70455 80.87529 101.64741 180.85676
18.15000 -2544.74320 -0.07132 -41.24170 78.46368 71.33604 168.69354
18.25000 -2518.42818 1.66377 -50.71051 127.78946 56.17993 195.54407
18.35000 -2527.02087 0.02570 -48.01404 81.62585 74.09164 160.51412
18.45000 -2505.41625 -1.26506 -19.90990 52.93898 53.65155 164.98497
18.55000 -2485.24471 0.36215 -51.32054 42.14866 42.98024 175.74726
18.65000 -2469.12283 0.12426 -36.35076 138.84009 58.23179 249.64053
18.75000 -2461.45747 2.28188 -35.54129 51.33235 42.59321 165.57108
18.85000 -2441.10824 0.31870 -46.30133 57.43905 76.41523 170.80617
18.95000 -2435.13924 2.86050 -59.65340 102.38548 63.08256 165.08709
19.05000 -2406.46605 9.98449 -33.10387 48.17161 74.38722 156.84564
19.15000 -2400.35298 -8.82974 -50.67065 71.40201 77.03927 159.92836
19.25000 -2377.10483 4.43858 -50.23904 64.12559 56.08011 137.16791
19.35000 -2360.96486 0.18060 -23.98558 48.40443 34.27251 153.23149
19.45000 -2344.36909 1.50498 -34.91093 43.78345 41.51998 140.46514
19.55000 -2357.04643 54.68019 9.56748 265.85069 497.11279 581.66505
19.65000 -2337.04730 1.18229 -48.45267 148.81874 46.03642 134.91156
19.75000 -2299.84529 -0.63429 -24.45811 91.76005 40.57632 156.45773
19.85000 -2293.38447 9.80382 -27.08139 42.21551 38.73366 123.60439
19.95000 -2283.35676 3.41193 -19.68106 72.74519 59.85341 130.74728
