0.12500 0.05996
0.37500 0.10942
0.62500 0.14861
0.87500 0.22941
1.12500 0.24484
1.37500 0.28799
1.62500 0.28183
1.87500 0.27438
2.12500 0.27478
2.37500 0.27890
2.62500 0.26096
2.87500 0.24289
3.12500 0.22516
3.37500 0.19343
3.62500 0.17970
3.87500 0.15008
4.12500 0.12176
4.37500 0.09482
4.62500 0.07132
4.87500 0.06262
5.12500 0.05130
5.37500 0.04439
5.62500 0.05306
5.87500 0.02461
6.12500 0.02194
6.37500 0.00921
6.62500 0.01119
6.87500 0.01325
7.12500 0.00337
7.37500 0.03991
7.62500 0.04773
7.87500 0.05584
8.12500 0.06559
8.37500 0.07314
8.62500 0.04715
8.87500 0.05861
9.12500 0.02682
9.37500 0.03817
9.62500 0.02863
9.87500 0.01599
10.12500 0.01057
10.37500 0.05507
10.62500 0.01954
10.87500 0.03426
11.12500 0.05392
11.37500 0.07897
11.62500 0.06806
11.87500 0.07375
12.12500 0.11582
12.37500 0.10162
12.62500 0.12547
12.87500 0.10066
13.12500 0.07429
13.37500 0.07950
13.62500 0.06498
13.87500 0.07924
14.12500 0.03281
14.37500 0.04762
14.62500 0.06790
14.87500 0.04564
15.12500 0.07203
15.37500 0.02540
15.62500 0.07062
15.87500 0.01592
16.12500 0.07215
16.37500 0.06807
16.62500 0.11050
16.87500 0.05634
17.12500 0.06226
17.37500 0.03598
17.62500 0.07264
17.87500 0.06734
18.12500 0.10606
18.37500 0.05087
18.62500 0.08055
18.87500 0.07486
19.12500 0.04379
19.37500 0.01586
19.62500 0.01765
19.87500 0.15961
