0.1875 1.51963 17.1382 -0.13412 122.59868 121.43 116.83699
0.5625 0.0923 40.8945 -1.09242 109.61033 102.5094 98.46534
0.9375 1.80197 59.94618 0.01855 99.40189 90.32259 84.33291
1.3125 -0.14813 81.1013 0.89565 89.69891 83.36101 75.18748
1.6875 -0.10005 98.4592 1.236 79.53269 78.19589 70.18326
2.0625 1.26482 116.37612 1.16568 71.881 72.29325 64.14763
2.4375 0.68526 131.47716 -0.00633 65.33027 65.3009 59.05705
2.8125 1.15533 143.40678 0.77575 61.4386 59.34764 54.46577
3.1875 0.70079 152.07619 0.9691 57.84808 53.54025 49.72219
3.5625 1.85586 160.17944 0.36939 53.95403 48.69038 47.47252
3.9375 1.64341 165.81056 -0.54173 52.11572 44.99576 44.18109
4.3125 2.14024 170.3404 -0.51301 49.64592 42.1318 41.08243
4.6875 1.55569 174.76991 -0.35551 47.34383 40.2521 39.2157
5.0625 0.81831 179.58214 0.21133 45.63341 38.57378 37.14772
5.4375 1.80318 182.04005 1.02336 43.65936 36.78586 36.43697
5.8125 1.31592 185.68895 0.07639 42.33613 34.37064 33.86075
6.1875 1.12109 188.00499 1.12472 40.65873 33.41814 32.32069
6.5625 0.87416 190.36298 0.64698 39.41452 32.21665 31.61848
6.9375 -0.05245 192.70142 0.82243 38.07045 31.35164 30.10287
7.3125 -0.22704 195.61898 0.39065 36.95243 29.96987 28.99597
7.6875 0.29283 198.34027 0.12314 35.22821 28.71285 27.81775
8.0625 0.29554 199.40912 0.67206 34.70979 27.0575 27.23657
8.4375 0.04221 200.73104 0.50299 33.35305 25.81413 26.14178
8.8125 0.51584 201.37748 -0.14968 32.95521 24.29598 25.1491
9.1875 1.01157 201.55992 -0.21939 31.43843 23.56839 24.74183
9.5625 1.22402 201.75204 -0.32606 31.07914 23.1055 24.04195
9.9375 -0.00451 202.17378 -1.52567 29.81995 22.8494 23.23577
10.3125 -0.412 202.69825 -1.53635 29.45936 22.06742 22.26877
10.6875 -0.63597 203.7407 -1.11602 27.74011 21.4624 21.67161
11.0625 -2.32621 203.99422 -1.81851 27.29832 21.20753 20.22499
11.4375 -0.78271 205.22907 -1.86265 25.95764 20.02276 19.68121
11.8125 -0.39467 204.87591 -1.5677 25.53419 19.82142 18.83048
12.1875 -0.80849 205.13929 -1.00256 24.21448 19.30536 18.88292
12.5625 -0.6791 205.84486 -0.83123 24.89792 18.1836 17.92675
12.9375 -0.43624 206.66652 -0.77051 22.40814 17.26052 17.71137
13.3125 -0.87453 207.35512 -1.90085 22.3475 16.41115 17.80516
13.6875 -0.94318 207.15271 -2.29602 21.42657 15.62872 18.00095
14.0625 0.03193 206.18945 -2.19471 21.41384 15.25876 16.51945
14.4375 -0.72947 206.42185 -2.36813 20.1936 16.00526 16.34983
14.8125 -0.42753 206.18499 -2.92423 20.01153 14.86174 15.75524
15.1875 -0.76443 206.59544 -2.88521 19.88067 14.67248 15.62834
15.5625 -1.32057 208.21357 -3.82795 18.90577 13.70047 14.63602
15.9375 0.35475 206.39889 -3.32263 18.85572 13.88781 13.18656
16.3125 1.12938 206.27614 -3.47279 18.0757 12.5035 14.41712
16.6875 -0.97439 206.32944 -3.50061 16.54556 12.10182 14.09196
17.0625 -0.08254 206.29073 -4.22477 16.44893 12.59107 14.23031
17.4375 0.17667 205.38599 -2.46036 15.64393 12.56861 13.33289
17.8125 0.65233 205.89261 -0.79969 16.86745 11.23241 13.72005
18.1875 -0.34218 205.16409 -0.90435 15.41875 11.75018 13.21695
18.5625 -0.12427 205.63378 -0.68542 14.63231 11.16259 12.45857
18.9375 -1.06254 206.09992 -0.28629 14.50483 10.64035 11.80518
19.3125 -2.23754 206.35266 -1.09349 13.30253 10.58453 11.66868
19.6875 -0.93348 206.49642 0.38346 13.60598 10.94702 13.10785
20.0625 0.85333 204.99948 -0.21895 14.17116 10.35549 11.22467
20.4375 0.50042 206.30509 -0.63258 12.80445 9.41896 11.70623
20.8125 -2.32605 206.6878 -1.334 12.57423 9.11039 12.45462
21.1875 -2.73885 206.04802 1.87667 13.53493 8.90761 11.6631
21.5625 -1.35041 204.98941 -0.9986 13.07195 8.52059 11.16364
21.9375 -3.9121 206.47216 2.40046 13.06585 7.50303 10.80198
22.3125 -0.12938 205.32278 -0.32061 11.83911 8.14954 13.16622
22.6875 1.33969 204.01308 -0.74731 12.63427 7.91046 12.66195
23.0625 1.4727 205.60036 0.38875 11.2373 7.45894 11.35161
23.4375 0.38107 203.08405 -2.51155 10.33567 8.21994 9.5364
23.8125 -0.6553 203.93798 -0.33346 11.13122 7.67163 10.29461
24.1875 0.77461 200.65064 -0.11621 11.16386 8.13287 10.75557
24.5625 -0.54732 201.6039 -2.14574 10.13909 6.80847 9.55392
24.9375 0.39516 202.33862 -1.34008 9.76755 8.50736 10.13093
25.3125 0.22521 204.2167 -3.60038 10.58559 8.64565 11.50524
25.6875 -0.20105 201.92465 -0.37484 10.45783 6.24997 10.13877
26.0625 0.03517 204.79326 -3.44308 8.29363 6.98348 10.05989
26.4375 1.87087 200.037 -0.93341 10.00768 6.5477 7.78443
26.8125 2.88864 203.93889 -5.24394 9.60108 5.94153 11.04246
27.1875 1.34753 203.5875 -3.20081 7.92196 8.16486 8.66175
27.5625 0.5859 200.75014 -4.89104 9.66703 7.11085 8.69799
27.9375 2.04652 200.14112 -1.60221 10.63855 6.39929 8.57719
28.3125 0.04787 204.71055 -0.73126 9.02765 5.12856 10.689
28.6875 2.22373 199.90479 -1.90933 11.69609 3.25782 9.14153
29.0625 -1.80625 204.04633 -0.92817 6.76913 7.18916 8.24038
29.4375 1.94498 201.64155 -3.91449 6.81413 3.09587 7.06704
29.8125 3.42124 201.26691 -0.77945 6.81166 12.31054 5.85118
