0.120000 1.831380
0.380000 1.823160
0.620000 1.882720
0.880000 1.908020
1.120000 1.593920
1.380000 -2.988430
1.620000 -2.389460
1.880000 3.097730
2.120000 -2.178860
2.380000 -1.984670
2.620000 -2.249130
2.880000 -2.538070
3.120000 -2.448050
3.380000 -2.664960
3.620000 -2.639270
3.880000 -2.931890
4.120000 -3.132970
4.380000 2.625580
4.620000 2.405150
4.880000 0.186010
5.120000 -2.011860
5.380000 -0.405690
5.620000 -1.611200
5.880000 -1.667340
6.120000 -2.109830
6.380000 -2.350360
6.620000 -1.348110
6.880000 -1.422260
7.120000 -2.020990
7.380000 -2.342510
7.620000 -2.510290
7.880000 2.908490
8.120000 2.849840
8.380000 2.772050
8.620000 2.551540
8.880000 2.390200
9.120000 -3.083390
9.380000 2.264890
9.620000 -0.171630
9.880000 -1.065540
10.120000 0.182380
10.380000 -0.797610
10.620000 -0.390730
10.880000 0.703580
11.120000 0.131170
11.380000 0.473820
11.620000 0.214870
11.880000 0.499140
12.120000 -0.507230
12.380000 -0.738940
12.620000 -0.176290
12.880000 -1.364520
13.120000 -1.710260
13.380000 -1.148770
13.620000 -1.956430
13.880000 -2.297550
14.120000 -1.838580
14.380000 2.765540
14.620000 2.152000
14.880000 -2.754750
