0.05000 3132.35507
0.15000 4911.84665
0.25000 6847.69965
0.35000 8813.35340
0.45000 10089.76999
0.55000 10396.94202
0.65000 10656.21786
0.75000 10606.61030
0.85000 10559.66011
0.95000 10109.64854
1.05000 9852.04345
1.15000 9388.36903
1.25000 8972.24757
1.35000 8639.44988
1.45000 8157.74480
1.55000 7838.96833
1.65000 7421.59172
1.75000 7188.71450
1.85000 6862.94404
1.95000 6511.82207
2.05000 6284.52518
2.15000 6056.24856
2.25000 5794.93942
2.35000 5485.94478
2.45000 5352.56687
2.55000 5093.51379
2.65000 4939.63886
2.75000 4711.48948
2.85000 4509.65762
2.95000 4324.57954
3.05000 4182.01018
3.15000 4026.02544
3.25000 3843.99969
3.35000 3715.64480
3.45000 3541.42357
3.55000 3429.87768
3.65000 3314.12689
3.75000 3129.94884
3.85000 3080.51392
3.95000 2937.42160
4.05000 2865.94792
4.15000 2709.79197
4.25000 2605.09802
4.35000 2538.86657
4.45000 2416.31376
4.55000 2328.27483
4.65000 2247.48693
4.75000 2126.25560
4.85000 2066.59028
4.95000 1965.15339
5.05000 1925.73420
5.15000 1890.08568
5.25000 1811.95116
5.35000 1740.70810
5.45000 1649.10300
5.55000 1600.29206
5.65000 1564.57552
5.75000 1503.88309
5.85000 1458.35472
5.95000 1419.01633
6.05000 1369.53884
6.15000 1328.33268
6.25000 1298.76182
6.35000 1245.47971
6.45000 1244.94420
6.55000 1187.59884
6.65000 1170.25101
6.75000 1123.59097
6.85000 1117.55098
6.95000 1067.36459
7.05000 1044.23471
7.15000 1033.36026
7.25000 1019.18978
7.35000 992.51523
7.45000 972.20055
7.55000 949.60010
7.65000 920.95410
7.75000 913.05661
7.85000 905.01639
7.95000 869.59132
8.05000 860.45511
8.15000 842.48090
8.25000 829.38200
8.35000 802.88427
8.45000 781.53486
8.55000 765.56978
8.65000 755.98787
8.75000 744.59362
8.85000 736.49932
8.95000 722.27657
9.05000 706.95771
9.15000 695.81567
9.25000 687.65128
9.35000 669.51748
9.45000 659.79355
9.55000 646.32631
9.65000 641.32120
9.75000 630.76903
9.85000 615.07337
9.95000 604.37852
10.05000 600.04308
10.15000 577.65814
10.25000 565.76298
10.35000 566.38843
10.45000 552.18909
10.55000 550.91865
10.65000 525.43296
10.75000 516.10104
10.85000 508.95358
10.95000 511.73318
11.05000 490.05336
11.15000 485.67604
11.25000 475.86561
11.35000 461.05124
11.45000 468.13319
11.55000 442.34612
11.65000 447.30652
11.75000 429.43341
11.85000 426.61671
11.95000 428.34979
12.05000 413.90706
12.15000 390.90475
12.25000 400.61757
12.35000 389.43000
12.45000 374.04391
12.55000 375.63207
12.65000 372.23549
12.75000 362.92468
12.85000 359.26175
12.95000 345.88132
13.05000 341.17000
13.15000 351.59539
13.25000 333.63729
13.35000 323.14026
13.45000 313.14440
13.55000 316.26601
13.65000 313.92965
13.75000 299.94193
13.85000 297.35058
13.95000 285.22310
14.05000 275.88039
14.15000 278.78001
14.25000 272.45324
14.35000 265.09396
14.45000 259.44903
14.55000 261.75252
14.65000 254.18219
14.75000 240.80764
14.85000 250.77865
14.95000 238.57094
15.05000 247.25807
15.15000 236.49201
15.25000 221.09388
15.35000 222.95028
15.45000 216.80321
15.55000 215.93709
15.65000 214.12207
15.75000 202.55591
15.85000 200.49464
15.95000 202.92552
16.05000 195.52129
16.15000 191.07220
16.25000 196.90387
16.35000 197.14931
16.45000 188.62753
16.55000 177.17346
16.65000 169.98058
16.75000 166.05732
16.85000 171.36136
16.95000 165.62670
17.05000 166.26212
17.15000 152.97197
17.25000 154.83590
17.35000 151.88874
17.45000 145.70687
17.55000 150.36361
17.65000 145.88498
17.75000 145.77758
17.85000 139.01206
17.95000 132.04472
18.05000 131.08139
18.15000 129.56579
18.25000 129.27762
18.35000 130.94993
18.45000 120.50616
18.55000 119.68491
18.65000 132.79815
18.75000 127.31033
18.85000 117.60682
18.95000 121.17759
19.05000 111.20009
19.15000 116.47341
19.25000 112.89339
19.35000 114.37859
19.45000 110.41148
19.55000 107.53439
19.65000 113.03432
19.75000 112.96363
19.85000 118.00777
19.95000 105.98459
