0.12500 0.00372
0.37500 0.00735
0.62500 0.00325
0.87500 0.01100
1.12500 0.01649
1.37500 0.02009
1.62500 0.03806
1.87500 0.01299
2.12500 0.02180
2.37500 0.01989
2.62500 0.03024
2.87500 0.02228
3.12500 0.03542
3.37500 0.02164
3.62500 0.01944
3.87500 0.02761
4.12500 0.02302
4.37500 0.01884
4.62500 0.01526
4.87500 0.02004
5.12500 0.01051
5.37500 0.00395
5.62500 0.00587
5.87500 0.01044
6.12500 0.01596
6.37500 0.00763
6.62500 0.00971
6.87500 0.01815
7.12500 0.00541
7.37500 0.01061
7.62500 0.02303
7.87500 0.01853
8.12500 0.01006
8.37500 0.01442
8.62500 0.01007
8.87500 0.00702
9.12500 0.00541
9.37500 0.01319
9.62500 0.00519
9.87500 0.00580
10.12500 0.01769
10.37500 0.01968
10.62500 0.00776
10.87500 0.01196
11.12500 0.01414
11.37500 0.01972
11.62500 0.01029
11.87500 0.01239
12.12500 0.00541
12.37500 0.00481
12.62500 0.01251
12.87500 0.01144
13.12500 0.01794
13.37500 0.01253
13.62500 0.00337
13.87500 0.01657
14.12500 0.02263
14.37500 0.00203
14.62500 0.00612
14.87500 0.01537
15.12500 0.01892
15.37500 0.04289
15.62500 0.03510
15.87500 0.03133
16.12500 0.02373
16.37500 0.01889
16.62500 0.00302
16.87500 0.02691
17.12500 0.03470
17.37500 0.00988
17.62500 0.01182
17.87500 0.01541
18.12500 0.03880
18.37500 0.00743
18.62500 0.02134
18.87500 0.03768
19.12500 0.01742
19.37500 0.03104
19.62500 0.03627
19.87500 0.03389
