0.125 -0.000 -0.000 -0.000
0.375 0.000 0.000 -0.000
0.625 -0.001 0.000 0.000
0.875 0.001 0.001 0.000
1.125 -0.001 0.002 -0.000
1.375 -0.001 0.001 -0.000
1.625 0.000 0.003 0.001
1.875 -0.003 -0.005 0.003
2.125 -0.001 0.000 -0.002
2.375 -0.004 0.005 0.002
2.625 -0.005 0.008 0.001
2.875 -0.002 0.011 0.014
3.125 -0.011 -0.003 0.002
3.375 0.005 -0.003 0.027
3.625 -0.003 0.023 0.032
3.875 -0.025 -0.004 0.037
4.125 0.011 0.011 0.039
4.375 -0.006 -0.028 0.018
4.625 0.011 0.011 0.031
4.875 -0.006 -0.003 0.054
5.125 -0.026 -0.023 0.044
5.375 0.003 -0.005 0.065
5.625 0.013 0.018 0.074
5.875 0.014 0.047 0.058
6.125 -0.032 0.041 0.064
6.375 0.005 0.005 0.082
6.625 0.015 -0.016 0.055
6.875 0.034 -0.029 0.075
7.125 0.008 -0.044 0.057
7.375 -0.021 0.011 0.056
7.625 0.061 0.048 0.041
7.875 0.049 -0.004 0.058
8.125 0.020 -0.040 0.021
8.375 0.032 -0.061 0.070
8.625 -0.055 -0.021 0.078
8.875 0.002 -0.025 0.049
9.125 -0.012 0.002 0.075
9.375 -0.021 0.028 0.069
9.625 -0.009 0.016 0.032
9.875 0.045 0.043 0.136
10.125 0.003 0.025 0.033
10.375 -0.005 0.053 0.078
10.625 0.010 -0.106 0.117
10.875 -0.051 -0.045 0.021
11.125 -0.048 -0.003 0.102
11.375 -0.015 -0.054 0.112
11.625 0.020 0.087 0.044
11.875 -0.084 0.031 0.021
12.125 0.028 -0.050 0.005
12.375 0.014 -0.003 0.011
12.625 -0.058 0.010 0.103
12.875 -0.012 0.114 -0.001
13.125 0.057 -0.023 -0.012
13.375 -0.015 -0.062 0.073
13.625 -0.014 0.053 0.063
13.875 -0.024 -0.009 0.061
14.125 0.009 0.023 0.105
14.375 0.035 0.156 0.004
14.625 0.010 0.025 0.023
14.875 -0.035 0.039 0.075
