0.12500 0.03698
0.37500 0.00857
0.62500 0.04398
0.87500 0.05725
1.12500 0.07513
1.37500 0.11135
1.62500 0.15046
1.87500 0.16023
2.12500 0.18308
2.37500 0.20216
2.62500 0.19435
2.87500 0.18687
3.12500 0.15675
3.37500 0.16689
3.62500 0.14925
3.87500 0.11891
4.12500 0.12044
4.37500 0.10326
4.62500 0.09841
4.87500 0.07941
5.12500 0.05420
5.37500 0.04195
5.62500 0.03361
5.87500 0.03267
6.12500 0.04020
6.37500 0.02573
6.62500 0.03112
6.87500 0.02890
7.12500 0.04648
7.37500 0.03181
7.62500 0.03109
7.87500 0.04078
8.12500 0.02633
8.37500 0.03511
8.62500 0.04795
8.87500 0.06610
9.12500 0.04131
9.37500 0.04153
9.62500 0.05722
9.87500 0.03276
10.12500 0.02087
10.37500 0.01322
10.62500 0.03360
10.87500 0.03616
11.12500 0.03458
11.37500 0.03914
11.62500 0.01244
11.87500 0.05387
12.12500 0.04207
12.37500 0.03758
12.62500 0.03114
12.87500 0.06604
13.12500 0.04290
13.37500 0.07027
13.62500 0.02498
13.87500 0.03588
14.12500 0.04852
14.37500 0.02180
14.62500 0.06769
14.87500 0.04548
