0.2 -1.07562 15.02085 0.25251 121.68438 119.48102 88.3837
0.6 0.84446 36.32752 -0.47313 120.71233 112.23287 84.74334
1.0 0.79867 56.06598 -0.0974 119.98424 102.78735 80.35901
1.4 0.55434 69.96597 -0.14169 117.34893 95.16779 74.96391
1.8 0.9445 74.61955 0.12053 113.84606 88.65371 70.8267
2.2 0.60787 79.564 0.04473 109.5892 83.71174 67.06311
2.6 0.4611 83.87552 0.18784 105.99647 79.47903 62.91473
3.0 0.81034 87.67403 -0.03184 101.13601 75.28941 59.45688
3.4 0.96612 90.74537 -0.42809 95.66278 72.49976 55.81931
3.8 0.27457 94.85446 -0.4061 90.48333 70.76139 53.11401
4.2 -0.34846 102.73443 -0.21604 84.9004 70.15689 49.94228
4.6 -0.63739 113.23364 -1.02925 80.38268 69.81118 47.46312
5.0 -0.95137 126.45893 -0.27666 75.68334 69.36335 45.33806
5.4 -1.88615 141.62599 0.20844 70.1402 66.0696 42.83223
5.8 -0.74411 153.75699 -0.13543 64.27967 61.70096 40.31708
6.2 -1.16791 162.60261 0.12372 59.57167 56.94611 38.00412
6.6 -0.70787 168.40756 0.24941 54.21494 52.52168 35.69292
7.0 -0.69651 172.69303 0.25088 49.68597 47.84248 32.94404
7.4 -0.39833 175.53306 0.83194 46.29353 42.88995 30.07097
7.8 0.22953 178.72035 0.84078 43.62439 38.49775 27.83783
8.2 1.18149 181.8729 0.7966 42.05774 34.80234 26.05635
8.6 0.54513 185.25274 0.92413 40.48998 31.89536 24.7351
9.0 0.90592 189.08448 0.5712 38.80486 29.99019 23.67996
9.4 0.86073 190.90031 0.33712 37.24386 28.58155 22.58865
9.8 2.02123 191.93464 0.16896 36.02733 27.78677 21.72072
10.2 0.91596 193.36065 -0.51648 33.74218 27.4582 20.71231
10.6 1.0433 193.92624 -0.24657 32.33753 26.89482 19.83613
11.0 -0.1195 194.9974 -0.26605 31.24193 26.69204 19.00105
11.4 -0.54176 196.28592 -0.08341 30.39145 26.44383 18.40089
11.8 -0.76764 197.24751 -0.09888 29.53486 25.4179 18.03737
12.2 -0.596 198.71384 0.49626 28.91739 23.64594 17.14163
12.6 -0.8019 200.13351 0.39874 27.99527 21.49417 16.66166
13.0 0.7555 201.15802 0.26142 26.89631 19.85008 16.24695
13.4 1.01169 201.08955 0.27941 26.30532 18.72822 15.6971
13.8 0.76196 201.34508 0.04665 24.71422 17.53553 15.20474
14.2 0.88703 201.08237 -0.42846 23.26798 17.38717 14.276
14.6 0.88691 200.65143 -0.11196 22.51105 17.87764 13.7892
15.0 0.56819 201.14879 -0.49271 21.53328 18.40318 13.20798
15.4 0.83502 202.16499 -0.51495 21.10741 18.2995 12.77983
15.8 0.40773 203.99395 -0.55047 20.99137 18.04197 12.51371
16.2 0.66709 205.11151 -0.47007 19.80679 16.95373 12.25007
16.6 1.26824 205.63222 -0.36798 19.5315 15.81729 11.86523
17.0 1.01627 205.98223 -0.13832 19.52171 14.6957 11.83082
17.4 0.83991 205.28834 -0.44587 18.81079 12.97374 11.31158
17.8 1.16314 204.53844 -0.37353 17.98748 11.5808 11.19905
18.2 1.24972 203.74053 -0.25501 17.39468 11.38815 10.7667
18.6 0.25895 202.69236 -0.2005 17.46351 11.75451 10.39911
19.0 -0.13536 202.15455 -0.52452 16.3555 12.28542 9.93476
19.4 0.38557 201.93865 -0.50991 15.07254 12.38274 9.6825
19.8 -0.33685 201.80753 -0.51742 15.13784 12.40133 9.9208
