0.12500 0.01442
0.37500 0.01992
0.62500 0.03389
0.87500 0.00787
1.12500 0.01537
1.37500 0.04380
1.62500 0.02985
1.87500 0.03838
2.12500 0.02749
2.37500 0.03590
2.62500 0.07086
2.87500 0.09558
3.12500 0.09390
3.37500 0.09183
3.62500 0.10386
3.87500 0.10159
4.12500 0.09556
4.37500 0.11174
4.62500 0.09986
4.87500 0.05847
5.12500 0.06672
5.37500 0.04452
5.62500 0.03194
5.87500 0.01870
6.12500 0.02287
6.37500 0.00845
6.62500 0.01710
6.87500 0.00224
7.12500 0.00784
7.37500 0.02224
7.62500 0.01205
7.87500 0.03715
8.12500 0.03994
8.37500 0.02943
8.62500 0.03452
8.87500 0.02989
9.12500 0.00498
9.37500 0.00874
9.62500 0.00978
9.87500 0.01667
10.12500 0.01624
10.37500 0.02211
10.62500 0.04411
10.87500 0.02315
11.12500 0.04447
11.37500 0.01953
11.62500 0.01939
11.87500 0.06963
12.12500 0.02038
12.37500 0.04456
12.62500 0.02756
12.87500 0.04345
13.12500 0.07101
13.37500 0.04920
13.62500 0.03762
13.87500 0.04818
14.12500 0.06513
14.37500 0.06197
14.62500 0.04304
14.87500 0.06262
15.12500 0.08491
15.37500 0.02663
15.62500 0.07568
15.87500 0.03180
16.12500 0.03043
16.37500 0.03799
16.62500 0.05415
16.87500 0.07285
17.12500 0.03279
17.37500 0.06639
17.62500 0.13254
17.87500 0.10470
18.12500 0.08183
18.37500 0.07979
18.62500 0.02140
18.87500 0.03587
19.12500 0.08887
19.37500 0.05323
19.62500 0.04053
19.87500 0.05888
