0.05000 101895.33643
0.15000 60995.16003
0.25000 41456.93802
0.35000 31149.67185
0.45000 25589.02059
0.55000 21726.30711
0.65000 19064.26708
0.75000 17128.18440
0.85000 15040.77667
0.95000 13840.87003
1.05000 12599.15072
1.15000 11517.18103
1.25000 10649.85273
1.35000 10018.99504
1.45000 9306.44078
1.55000 8809.96808
1.65000 8346.07714
1.75000 7794.84991
1.85000 7403.29057
1.95000 6972.63935
2.05000 6893.87892
2.15000 6489.75249
2.25000 6086.19578
2.35000 5766.85934
2.45000 5615.63092
2.55000 5298.54094
2.65000 5178.80802
2.75000 4991.63987
2.85000 4677.88342
2.95000 4434.62391
3.05000 4220.31010
3.15000 3994.98704
3.25000 3772.05146
3.35000 3640.06067
3.45000 3529.69771
3.55000 3335.21623
3.65000 3210.57598
3.75000 3077.87145
3.85000 2969.35987
3.95000 2868.13569
4.05000 2800.34662
4.15000 2740.35931
4.25000 2632.79602
4.35000 2607.74207
4.45000 2497.44018
4.55000 2434.96472
4.65000 2358.28361
4.75000 2317.06196
4.85000 2250.51467
4.95000 2179.00954
5.05000 2106.07189
5.15000 2049.59637
5.25000 2017.24804
5.35000 1955.67431
5.45000 1905.40199
5.55000 1863.17602
5.65000 1824.12473
5.75000 1776.78321
5.85000 1751.09872
5.95000 1677.11094
6.05000 1651.86921
6.15000 1604.85531
6.25000 1554.46693
6.35000 1543.43160
6.45000 1475.23851
6.55000 1444.68806
6.65000 1432.69365
6.75000 1370.16273
6.85000 1331.49011
6.95000 1338.36655
7.05000 1279.76014
7.15000 1265.56812
7.25000 1228.74321
7.35000 1202.96466
7.45000 1161.98813
7.55000 1114.97085
7.65000 1125.06408
7.75000 1086.96603
7.85000 1093.01480
7.95000 1036.50946
8.05000 1025.99298
8.15000 997.82611
8.25000 980.51397
8.35000 971.24390
8.45000 940.42144
8.55000 931.21838
8.65000 910.83388
8.75000 876.34491
8.85000 877.33891
8.95000 852.45321
9.05000 841.93548
9.15000 818.36411
9.25000 800.74528
9.35000 791.13578
9.45000 793.21394
9.55000 738.80165
9.65000 760.67733
9.75000 748.29702
9.85000 724.22452
9.95000 701.38308
10.05000 710.17653
10.15000 698.58496
10.25000 674.80653
10.35000 668.76644
10.45000 651.06195
10.55000 659.68661
10.65000 653.29085
10.75000 614.42507
10.85000 612.03288
10.95000 595.28281
11.05000 563.87727
11.15000 570.05781
11.25000 558.89918
11.35000 547.54955
11.45000 540.35844
11.55000 534.69868
11.65000 520.86345
11.75000 503.80284
11.85000 490.11049
11.95000 493.92680
12.05000 481.16471
12.15000 473.42128
12.25000 470.97226
12.35000 451.62926
12.45000 462.02140
12.55000 433.71258
12.65000 431.35189
12.75000 412.57139
12.85000 424.69056
12.95000 413.51790
13.05000 393.07044
13.15000 393.53819
13.25000 387.93172
13.35000 386.58890
13.45000 361.68999
13.55000 358.12176
13.65000 352.21645
13.75000 353.42917
13.85000 350.32247
13.95000 344.58388
14.05000 329.07069
14.15000 318.23836
14.25000 307.88705
14.35000 313.56880
14.45000 303.56109
14.55000 303.17855
14.65000 293.62821
14.75000 283.86237
14.85000 275.80674
14.95000 281.80639
15.05000 281.44030
15.15000 265.26079
15.25000 271.54350
15.35000 253.91865
15.45000 273.00254
15.55000 249.01852
15.65000 252.49947
15.75000 249.93840
15.85000 250.89833
15.95000 244.51235
16.05000 231.90966
16.15000 230.11557
16.25000 225.20698
16.35000 230.57770
16.45000 216.80123
16.55000 214.29470
16.65000 213.11701
16.75000 202.90348
16.85000 199.86110
16.95000 208.97915
17.05000 193.93535
17.15000 199.41870
17.25000 190.26287
17.35000 191.01954
17.45000 187.37035
17.55000 180.52598
17.65000 179.51624
17.75000 178.45297
17.85000 171.79750
17.95000 171.57283
18.05000 167.10474
18.15000 164.02256
18.25000 164.00948
18.35000 171.86044
18.45000 152.47167
18.55000 145.69105
18.65000 152.31819
18.75000 153.28921
18.85000 145.98537
18.95000 149.41996
19.05000 143.27482
19.15000 138.70356
19.25000 135.59560
19.35000 132.78072
19.45000 140.77115
19.55000 136.63687
19.65000 126.84477
19.75000 129.87653
19.85000 129.77025
19.95000 128.28483
