0.12500 0.02872
0.37500 0.02400
0.62500 0.05173
0.87500 0.10370
1.12500 0.15450
1.37500 0.18879
1.62500 0.23786
1.87500 0.27058
2.12500 0.29947
2.37500 0.31936
2.62500 0.34487
2.87500 0.36974
3.12500 0.39819
3.37500 0.41952
3.62500 0.43288
3.87500 0.44974
4.12500 0.45419
4.37500 0.46645
4.62500 0.46690
4.87500 0.45886
5.12500 0.43825
5.37500 0.39491
5.62500 0.36659
5.87500 0.28883
6.12500 0.23512
6.37500 0.18054
6.62500 0.16211
6.87500 0.14372
7.12500 0.11384
7.37500 0.10660
7.62500 0.08331
7.87500 0.07382
8.12500 0.07161
8.37500 0.08042
8.62500 0.08196
8.87500 0.07439
9.12500 0.06690
9.37500 0.07934
9.62500 0.07869
9.87500 0.08733
10.12500 0.07769
10.37500 0.06693
10.62500 0.05162
10.87500 0.04494
11.12500 0.03975
11.37500 0.04838
11.62500 0.04292
11.87500 0.03194
12.12500 0.03645
12.37500 0.04266
12.62500 0.03725
12.87500 0.03765
13.12500 0.06830
13.37500 0.05714
13.62500 0.08719
13.87500 0.08270
14.12500 0.08026
14.37500 0.06737
14.62500 0.07070
14.87500 0.07367
