0.05000 2236.01343
0.15000 5170.98796
0.25000 8462.50644
0.35000 10325.31843
0.45000 11600.91465
0.55000 12401.38878
0.65000 12693.76709
0.75000 12651.54041
0.85000 12381.24986
0.95000 11998.67035
1.05000 11583.18675
1.15000 11009.03959
1.25000 10410.22720
1.35000 9891.07247
1.45000 9497.84367
1.55000 8871.17942
1.65000 8498.63566
1.75000 8008.40366
1.85000 7625.91970
1.95000 7288.67503
2.05000 6897.63011
2.15000 6588.63288
2.25000 6268.52215
2.35000 6062.51895
2.45000 5783.31673
2.55000 5445.40693
2.65000 5315.12263
2.75000 5076.68984
2.85000 4919.69692
2.95000 4681.89146
3.05000 4519.97256
3.15000 4375.56805
3.25000 4186.56667
3.35000 4125.43604
3.45000 3904.50746
3.55000 3796.59646
3.65000 3671.42846
3.75000 3575.88416
3.85000 3401.36759
3.95000 3336.51693
4.05000 3179.11102
4.15000 3087.54245
4.25000 2950.39434
4.35000 2882.51649
4.45000 2815.18427
4.55000 2661.20548
4.65000 2585.10044
4.75000 2489.75829
4.85000 2370.04318
4.95000 2279.36261
5.05000 2200.45735
5.15000 2109.47899
5.25000 2043.60922
5.35000 1942.51051
5.45000 1906.13109
5.55000 1848.24205
5.65000 1800.98954
5.75000 1733.24773
5.85000 1671.13854
5.95000 1616.71501
6.05000 1566.57794
6.15000 1536.32222
6.25000 1489.25928
6.35000 1482.43186
6.45000 1423.06299
6.55000 1405.25207
6.65000 1366.04664
6.75000 1334.38383
6.85000 1290.36630
6.95000 1275.05004
7.05000 1249.40824
7.15000 1202.41847
7.25000 1186.51810
7.35000 1153.82687
7.45000 1113.03183
7.55000 1080.29503
7.65000 1042.89967
7.75000 999.15466
7.85000 983.17452
7.95000 950.09518
8.05000 931.60559
8.15000 899.29671
8.25000 857.25453
8.35000 848.52507
8.45000 803.87908
8.55000 785.62904
8.65000 768.67964
8.75000 729.74332
8.85000 714.39235
8.95000 698.97868
9.05000 670.24032
9.15000 636.88022
9.25000 636.11508
9.35000 616.60102
9.45000 596.23239
9.55000 575.43618
9.65000 564.22685
9.75000 560.74589
9.85000 536.19852
9.95000 535.74316
10.05000 532.13882
10.15000 504.51333
10.25000 489.73656
10.35000 482.02261
10.45000 460.56224
10.55000 471.99367
10.65000 441.06300
10.75000 441.82775
10.85000 432.93260
10.95000 425.31395
11.05000 414.52388
11.15000 406.69858
11.25000 397.69485
11.35000 395.10433
11.45000 385.00253
11.55000 372.34180
11.65000 372.59164
11.75000 360.21547
11.85000 344.51754
11.95000 340.92795
12.05000 337.94530
12.15000 330.18470
12.25000 328.58706
12.35000 313.48112
12.45000 302.19226
12.55000 299.06869
12.65000 296.41625
12.75000 294.96772
12.85000 281.84948
12.95000 272.80753
13.05000 266.08762
13.15000 271.25950
13.25000 264.96953
13.35000 254.27658
13.45000 240.40525
13.55000 246.22616
13.65000 242.79533
13.75000 233.09229
13.85000 225.42561
13.95000 227.06922
14.05000 219.52816
14.15000 210.31333
14.25000 213.61039
14.35000 207.90761
14.45000 195.70864
14.55000 203.42860
14.65000 193.75502
14.75000 195.91577
14.85000 188.16609
14.95000 189.13421
15.05000 187.10439
15.15000 187.40025
15.25000 184.13882
15.35000 184.18498
15.45000 173.69763
15.55000 172.91363
15.65000 166.28306
15.75000 177.01192
15.85000 166.73180
15.95000 165.08009
16.05000 151.20133
16.15000 148.63070
16.25000 161.08531
16.35000 167.78149
16.45000 141.29897
16.55000 151.98870
16.65000 144.13057
16.75000 132.69909
16.85000 145.16634
16.95000 150.42481
17.05000 136.24504
17.15000 136.01862
17.25000 135.96195
17.35000 146.09805
17.45000 133.92321
17.55000 130.11997
17.65000 123.42508
17.75000 126.00649
17.85000 129.73485
17.95000 118.70510
18.05000 121.10686
18.15000 124.46310
18.25000 116.87766
18.35000 120.79472
18.45000 120.44215
18.55000 117.03623
18.65000 128.22650
18.75000 118.67262
18.85000 123.99007
18.95000 119.08978
19.05000 112.93600
19.15000 102.44546
19.25000 117.44534
19.35000 110.96886
19.45000 110.69598
19.55000 108.13451
19.65000 107.56949
19.75000 108.07233
19.85000 107.22287
19.95000 112.07205
