0.12500 0.02904
0.37500 0.03477
0.62500 0.10444
0.87500 0.14668
1.12500 0.20594
1.37500 0.24369
1.62500 0.27391
1.87500 0.29369
2.12500 0.30807
2.37500 0.31554
2.62500 0.30447
2.87500 0.33048
3.12500 0.32992
3.37500 0.33619
3.62500 0.34459
3.87500 0.33360
4.12500 0.32195
4.37500 0.29392
4.62500 0.27860
4.87500 0.23487
5.12500 0.18060
5.37500 0.13848
5.62500 0.08904
5.87500 0.09150
6.12500 0.07213
6.37500 0.09295
6.62500 0.08876
6.87500 0.09567
7.12500 0.10210
7.37500 0.11070
7.62500 0.10155
7.87500 0.12362
8.12500 0.12375
8.37500 0.11919
8.62500 0.14116
8.87500 0.13769
9.12500 0.11501
9.37500 0.12020
9.62500 0.10748
9.87500 0.08970
10.12500 0.08147
10.37500 0.05630
10.62500 0.04866
10.87500 0.03996
11.12500 0.02253
11.37500 0.01080
11.62500 0.01614
11.87500 0.02228
12.12500 0.01483
12.37500 0.01791
12.62500 0.01177
12.87500 0.02535
13.12500 0.01546
13.37500 0.04124
13.62500 0.02472
13.87500 0.04122
14.12500 0.04467
14.37500 0.05279
14.62500 0.03659
14.87500 0.08893
