0.2 -3.763 11.56599 0.79727 128.35968 125.6086 100.11406
0.6 1.73964 28.26069 -0.43519 128.19277 121.6007 96.78127
1.0 0.0771 46.00743 -1.11852 126.95784 115.72483 93.54213
1.4 -0.55669 60.0789 0.73551 129.85391 109.05651 88.71294
1.8 -1.02186 66.77222 -0.08999 129.25854 100.94189 85.68685
2.2 1.48622 70.02616 1.17729 128.31717 97.18546 81.87778
2.6 1.55081 76.2814 -0.11465 127.6542 92.11065 78.91669
3.0 -0.40301 77.62995 -0.54386 126.84412 87.58048 75.54068
3.4 0.27634 80.94823 0.59471 126.31277 83.69504 73.30269
3.8 0.92864 84.27252 0.48063 122.0868 80.41509 70.69109
4.2 -1.3443 84.98367 -1.53382 117.00365 77.18414 67.4031
4.6 2.79969 87.2515 -0.08106 114.1853 74.69573 64.95705
5.0 1.33353 87.26561 -1.57201 109.98675 71.34658 62.24724
5.4 0.39455 90.20789 2.50985 105.0948 71.79602 60.34084
5.8 1.75443 92.49907 0.02171 99.57219 68.00878 59.35217
6.2 0.6475 96.47423 1.21881 94.30156 68.83847 57.78908
6.6 0.27833 101.00484 -0.72023 88.46165 70.3059 55.04231
7.0 3.80438 105.73543 0.49258 82.75677 70.11675 53.5364
7.4 0.45049 113.42021 0.73555 79.39014 69.67916 52.95807
7.8 0.85886 124.51802 0.62869 73.45928 70.51452 50.87853
8.2 2.89452 134.47044 1.03602 70.11133 68.6714 48.51003
8.6 -0.49117 144.49914 -0.34381 64.55131 66.86783 45.21218
9.0 0.76829 153.68057 0.57258 59.2481 66.81996 42.63928
9.4 -0.30461 162.71483 1.24294 53.0235 62.34388 39.96327
9.8 0.89966 170.84343 0.12058 48.35586 58.09418 38.05733
10.2 1.66619 177.15204 0.13933 44.60144 52.91933 33.10338
10.6 0.70252 182.65479 0.49252 40.63408 47.60341 31.61267
11.0 0.00691 185.45377 -0.31337 37.64581 44.04506 28.15785
11.4 -0.27191 187.88276 0.35232 35.13806 40.54493 26.73347
11.8 1.39033 191.61484 -1.10712 33.15744 35.66599 25.03127
12.2 0.44295 195.58451 0.2055 31.95793 31.98817 24.71488
12.6 0.53123 199.48998 0.33643 31.80357 26.51239 23.25235
13.0 -0.80607 201.70907 -0.05082 31.16133 24.52738 22.62404
13.4 0.5846 203.50418 -0.44043 29.76195 21.33569 22.17146
13.8 -0.45794 203.68964 0.37321 29.03385 20.0392 21.00532
14.2 -0.58317 203.40921 0.16721 28.35325 19.43367 20.7547
14.6 -1.54934 202.89383 0.00769 27.10068 18.74008 19.39279
15.0 0.0466 203.2985 -0.08102 25.93715 18.4834 18.86504
15.4 -1.1185 201.75114 -0.67512 23.78843 18.90313 18.55428
15.8 -0.11889 200.21741 -0.59987 23.81136 19.41371 18.21122
16.2 0.0698 200.82323 0.06838 23.04614 19.43371 17.35384
16.6 -0.68534 202.84665 -0.4257 21.57733 19.09838 16.76596
17.0 -0.71869 203.01542 -0.73063 22.07044 18.62342 16.72931
17.4 0.77477 204.42617 0.81462 21.00665 17.98141 16.0919
17.8 -0.01773 204.87044 -0.21945 20.1399 16.70256 15.57544
18.2 -0.0346 206.21399 -0.67791 19.67694 16.01872 14.86599
18.6 0.22908 206.66907 -0.05336 20.27665 15.62101 14.82064
19.0 -0.3317 206.47827 -0.21382 19.20869 14.90454 15.07124
19.4 0.40219 207.2824 -1.0342 19.45904 14.52879 13.75775
19.8 1.14414 206.53969 -1.85155 19.07045 13.75482 13.68286
