0.05000 1106.84734
0.15000 2085.55941
0.25000 3127.23092
0.35000 3800.57160
0.45000 4288.88907
0.55000 4702.05252
0.65000 4930.94307
0.75000 5106.48252
0.85000 5182.58903
0.95000 5183.98719
1.05000 5197.94567
1.15000 5170.99885
1.25000 5034.21585
1.35000 4994.42043
1.45000 4884.77728
1.55000 4839.04536
1.65000 4650.26729
1.75000 4618.29022
1.85000 4452.52841
1.95000 4414.15970
2.05000 4219.45602
2.15000 4187.37563
2.25000 4090.95479
2.35000 3908.05401
2.45000 3898.71700
2.55000 3742.88565
2.65000 3713.27437
2.75000 3581.17389
2.85000 3470.47953
2.95000 3393.24080
3.05000 3340.04147
3.15000 3229.93054
3.25000 3202.32967
3.35000 3080.15600
3.45000 3025.59059
3.55000 2922.26573
3.65000 2829.56369
3.75000 2776.78449
3.85000 2718.21413
3.95000 2660.39701
4.05000 2580.26481
4.15000 2526.88325
4.25000 2482.55868
4.35000 2402.28915
4.45000 2368.53041
4.55000 2298.29359
4.65000 2215.55971
4.75000 2191.11878
4.85000 2149.12461
4.95000 2099.83264
5.05000 2061.32983
5.15000 2009.46660
5.25000 1942.04219
5.35000 1931.69461
5.45000 1880.21357
5.55000 1820.52730
5.65000 1803.66424
5.75000 1754.42529
5.85000 1708.08777
5.95000 1672.80592
6.05000 1608.64127
6.15000 1548.87093
6.25000 1576.38452
6.35000 1545.91093
6.45000 1478.63554
6.55000 1443.26374
6.65000 1419.31208
6.75000 1390.40377
6.85000 1344.33323
6.95000 1316.01307
7.05000 1314.67407
7.15000 1283.51733
7.25000 1247.97315
7.35000 1206.23047
7.45000 1187.88438
7.55000 1156.55503
7.65000 1135.19024
7.75000 1102.49409
7.85000 1084.95085
7.95000 1076.13076
8.05000 1033.47919
8.15000 1013.41810
8.25000 996.36930
8.35000 975.43455
8.45000 968.88925
8.55000 936.81063
8.65000 940.09055
8.75000 902.65512
8.85000 892.87053
8.95000 868.43497
9.05000 853.85339
9.15000 837.85585
9.25000 815.47759
9.35000 797.28557
9.45000 785.46197
9.55000 773.54863
9.65000 750.39466
9.75000 720.86667
9.85000 704.51301
9.95000 703.79594
10.05000 698.23886
10.15000 667.02798
10.25000 642.02931
10.35000 647.22105
10.45000 629.53694
10.55000 618.99165
10.65000 607.74959
10.75000 599.77843
10.85000 583.29864
10.95000 575.05420
11.05000 555.54731
11.15000 542.72153
11.25000 528.56951
11.35000 524.02157
11.45000 514.01049
11.55000 499.66928
11.65000 496.96359
11.75000 479.40294
11.85000 472.86804
11.95000 473.79433
12.05000 468.85113
12.15000 454.85868
12.25000 432.67797
12.35000 432.79346
12.45000 420.82002
12.55000 413.25569
12.65000 403.05603
12.75000 400.26017
12.85000 385.31858
12.95000 375.98274
13.05000 384.14865
13.15000 373.14463
13.25000 348.94450
13.35000 356.40282
13.45000 343.33343
13.55000 344.36833
13.65000 339.56522
13.75000 326.34970
13.85000 316.98202
13.95000 320.83799
14.05000 308.01174
14.15000 302.97050
14.25000 305.94927
14.35000 289.43133
14.45000 291.38438
14.55000 279.33778
14.65000 277.58124
14.75000 278.25836
14.85000 272.78518
14.95000 273.15097
15.05000 260.48927
15.15000 259.59778
15.25000 242.34727
15.35000 242.94244
15.45000 242.20506
15.55000 245.13266
15.65000 223.41721
15.75000 223.72320
15.85000 218.33531
15.95000 212.93403
16.05000 206.24662
16.15000 208.99675
16.25000 208.37653
16.35000 196.86672
16.45000 195.24554
16.55000 191.97531
16.65000 181.68311
16.75000 182.25878
16.85000 181.85289
16.95000 172.55770
17.05000 169.18524
17.15000 169.07788
17.25000 165.72131
17.35000 163.54794
17.45000 158.86314
17.55000 160.55000
17.65000 156.32470
17.75000 149.69064
17.85000 150.16098
17.95000 150.90938
18.05000 146.68324
18.15000 144.25708
18.25000 137.48196
18.35000 139.39419
18.45000 136.24319
18.55000 134.50559
18.65000 126.75641
18.75000 123.32796
18.85000 127.25958
18.95000 121.76060
19.05000 121.54984
19.15000 126.80198
19.25000 121.36713
19.35000 117.31698
19.45000 117.77593
19.55000 119.62498
19.65000 114.20305
19.75000 116.48585
19.85000 120.43581
19.95000 112.50583
