0.12500 0.03795
0.37500 0.01232
0.62500 0.01000
0.87500 0.00536
1.12500 0.03435
1.37500 0.05537
1.62500 0.08839
1.87500 0.11905
2.12500 0.12781
2.37500 0.14527
2.62500 0.17251
2.87500 0.19045
3.12500 0.18037
3.37500 0.18326
3.62500 0.16276
3.87500 0.15564
4.12500 0.13264
4.37500 0.11617
4.62500 0.09285
4.87500 0.07661
5.12500 0.04670
5.37500 0.03992
5.62500 0.03585
5.87500 0.03666
6.12500 0.04411
6.37500 0.02590
6.62500 0.05189
6.87500 0.04117
7.12500 0.05797
7.37500 0.05927
7.62500 0.04897
7.87500 0.05671
8.12500 0.03738
8.37500 0.04278
8.62500 0.01161
8.87500 0.02141
9.12500 0.01010
9.37500 0.02064
9.62500 0.01800
9.87500 0.03476
10.12500 0.03097
10.37500 0.04572
10.62500 0.05271
10.87500 0.05405
11.12500 0.03437
11.37500 0.04011
11.62500 0.01189
11.87500 0.01949
12.12500 0.01796
12.37500 0.01205
12.62500 0.03320
12.87500 0.04157
13.12500 0.04755
13.37500 0.02716
13.62500 0.04060
13.87500 0.02614
14.12500 0.03863
14.37500 0.03322
14.62500 0.03827
14.87500 0.03151
