0.05000 -1604.93137 -146.42767 1091.69053 2088.20632 2119.88140 1632.47378
0.15000 -3425.96758 80.72019 503.48266 2138.32524 2076.97423 3482.09076
0.25000 -4185.01697 -49.82403 252.51562 2622.20688 2440.29017 5277.30886
0.35000 -5774.55010 12.07077 170.38918 2966.37203 2758.00771 6641.28098
0.45000 -6906.63951 115.14046 -283.47741 3182.63586 2870.03050 7876.71922
0.55000 -7777.98056 165.31443 -102.44831 3338.33363 3022.88126 8799.14034
0.65000 -8418.69237 55.26834 -199.75306 3448.23821 3112.39948 9651.42480
0.75000 -8924.46289 122.14950 62.58969 3512.19821 3283.52026 9930.46364
0.85000 -9291.43670 135.89626 137.79923 3456.98684 3405.64311 10155.77035
0.95000 -9532.56177 130.08156 95.20987 3456.03728 3441.73519 10241.00953
1.05000 -9640.75267 116.38308 22.59617 3392.51365 3484.73584 10262.18147
1.15000 -9791.94379 56.24023 95.38877 3217.07846 3515.18062 10086.01481
1.25000 -9860.59757 91.06817 106.67130 3108.06704 3482.69346 9894.87942
1.35000 -9940.98266 65.94300 234.72015 2922.57302 3476.40401 9608.78207
1.45000 -9962.23157 84.03770 -25.23486 2801.51938 3453.00805 9414.79090
1.55000 -9954.52893 12.82412 133.42154 2708.85793 3367.06365 9163.37241
1.65000 -9983.31266 52.49962 -92.38076 2625.06084 3313.68462 8865.46407
1.75000 -9965.21308 54.40215 83.46675 2490.69635 3228.62761 8537.37901
1.85000 -9908.36667 68.86572 -157.61972 2381.35975 3170.26499 8313.27529
1.95000 -9864.39591 -18.31698 118.77059 2251.83842 3076.08786 7963.47785
2.05000 -9798.55529 33.57154 -168.95007 2151.97229 2997.10101 7729.94414
2.15000 -9754.71466 32.52960 -49.12480 2042.62252 2945.91333 7494.28779
2.25000 -9699.37334 33.83067 -60.13739 1947.08973 2843.18363 7153.44786
2.35000 -9602.52474 67.12881 -107.76904 1891.85092 2785.03398 6969.95300
2.45000 -9577.18535 86.12308 2.94322 1781.27209 2738.04481 6665.65869
2.55000 -9451.54015 68.63393 -59.63622 1742.55395 2625.06361 6507.46506
2.65000 -9377.61708 53.22409 -159.23215 1656.29313 2583.04461 6234.40828
2.75000 -9298.29157 30.00207 -45.68284 1599.58298 2509.27816 5990.09288
2.85000 -9194.46197 52.23949 -39.72421 1507.39675 2433.73423 5832.21849
2.95000 -9097.85268 59.36826 85.89632 1451.02789 2380.23401 5642.01420
3.05000 -8995.83942 34.12433 147.15791 1403.81834 2309.25422 5507.35582
3.15000 -8896.68643 21.64258 -35.92742 1370.65237 2235.93009 5360.83770
3.25000 -8803.00028 29.16974 141.60180 1346.71983 2149.56048 5158.82765
3.35000 -8719.36287 -0.00181 84.67600 1284.10545 2104.74595 5032.70914
3.45000 -8619.17974 41.29064 91.69612 1228.97434 2046.35222 4861.40711
3.55000 -8538.83779 44.47926 63.61752 1187.18167 1996.66761 4671.28435
3.65000 -8411.25040 28.49602 43.99435 1179.60541 1901.69953 4618.25597
3.75000 -8333.41963 -10.46419 18.28870 1144.53393 1853.99029 4435.34598
3.85000 -8215.51644 35.95919 -29.39486 1108.29977 1791.69605 4389.94935
3.95000 -8151.51514 39.65000 0.83343 1046.78529 1743.37591 4179.82580
4.05000 -8054.79415 31.99040 -46.10613 1009.15886 1679.68985 4097.36429
4.15000 -7953.39474 -3.01706 20.55336 1003.55501 1631.54821 4002.08870
4.25000 -7875.36689 -9.12618 48.15548 1000.03283 1573.89675 3862.18312
4.35000 -7774.33893 24.92154 -0.39196 975.35866 1541.69189 3814.77580
4.45000 -7700.25160 -6.27648 -31.98281 952.42949 1454.44954 3684.84860
4.55000 -7620.71418 6.67602 40.49262 972.19930 1417.64828 3602.62794
4.65000 -7545.69086 16.76538 6.08623 942.36922 1353.98589 3471.05819
4.75000 -7470.21751 -15.05618 -43.47860 954.80827 1298.40407 3412.80723
4.85000 -7380.05693 -11.67851 29.97047 942.62987 1263.63329 3326.15269
4.95000 -7317.54965 -24.58244 80.18038 947.06276 1217.46479 3233.49426
5.05000 -7241.27154 -4.73249 24.68522 913.99024 1152.93866 3126.45799
5.15000 -7167.97553 -1.51284 48.69776 922.37635 1113.25823 3071.00367
5.25000 -7086.29297 -5.51874 -39.23558 902.20135 1069.31803 2956.64170
5.35000 -7005.42466 1.59785 -9.42478 891.25629 1016.99201 2883.46049
5.45000 -6945.24428 -20.43124 -42.13575 880.89228 981.32387 2798.99870
5.55000 -6852.26498 -9.05378 -33.88431 865.25841 921.23416 2690.10391
5.65000 -6751.01785 10.64609 -11.08532 870.57531 896.96938 2600.05546
5.75000 -6641.85696 -6.38438 -32.06095 859.02174 841.45769 2568.03169
5.85000 -6606.51460 14.13822 -80.87374 862.77196 812.96894 2423.83509
5.95000 -6475.54396 5.91128 -39.37718 843.00598 765.68829 2399.39182
6.05000 -6364.90076 0.77946 -14.75510 824.03097 731.28524 2315.54546
6.15000 -6303.60245 13.17051 21.74314 816.20603 698.97051 2190.09320
6.25000 -6193.81983 19.60455 -7.70129 814.41029 652.11281 2151.64728
6.35000 -6056.90860 13.38619 -56.89477 770.07369 616.36409 2119.22658
6.45000 -5963.66246 33.93717 -14.50186 728.43943 597.52239 2000.19673
6.55000 -5884.83700 7.46089 -35.90315 697.46047 555.72480 1915.57739
6.65000 -5772.05561 17.46151 -45.53454 675.18456 530.70474 1893.03285
6.75000 -5687.59279 42.06281 -22.08833 643.95304 505.64961 1824.86338
6.85000 -5603.81933 26.27642 -1.92706 620.38350 480.83974 1771.52708
6.95000 -5522.63959 28.54933 15.16052 594.62908 458.86778 1708.85851
7.05000 -5448.16137 26.71107 37.87004 562.78603 433.43309 1650.47044
7.15000 -5394.52117 42.37290 8.05010 520.37738 414.60492 1609.24612
7.25000 -5303.33611 44.42432 -11.49898 496.57173 402.43485 1588.62400
7.35000 -5260.77157 27.29036 26.30793 463.21649 382.83551 1525.63766
7.45000 -5206.65121 29.35660 -14.08014 444.88741 373.63942 1476.10484
7.55000 -5145.00798 38.33566 30.51220 420.57525 358.90785 1438.55929
7.65000 -5104.64952 41.80909 6.13758 387.83538 347.20058 1399.67971
7.75000 -5063.28892 36.73629 16.05413 374.61987 335.17200 1385.61043
7.85000 -5025.84442 34.96507 -3.05159 358.26654 322.14058 1325.08987
7.95000 -4993.44654 38.25441 -24.95799 345.73060 314.06964 1288.87647
8.05000 -4943.55037 35.46067 8.79618 321.58089 300.28270 1277.52285
8.15000 -4912.63541 38.86541 -9.39971 304.01875 295.94963 1219.81808
8.25000 -4883.78111 35.89815 -16.82483 297.22747 288.70115 1201.30489
8.35000 -4840.43695 29.73741 29.08610 284.02830 281.01789 1194.93761
8.45000 -4818.77227 35.07736 19.10569 267.40435 270.53528 1142.20980
8.55000 -4786.08698 23.96306 0.23249 269.18360 266.43413 1148.63320
8.65000 -4763.85243 32.82787 -18.99213 249.76239 260.22573 1106.93416
8.75000 -4736.59779 30.10239 11.05336 241.25207 253.25225 1092.32968
8.85000 -4708.65882 26.91445 7.18190 239.40680 249.09141 1060.06059
8.95000 -4686.77564 30.28816 18.62422 238.90255 240.36108 1046.48676
9.05000 -4658.17581 24.93747 6.50996 231.17306 244.75024 1020.37124
9.15000 -4631.46213 16.22373 13.28649 231.15967 234.81325 990.89707
9.25000 -4601.62034 24.30717 -22.82510 215.12020 227.24837 963.98044
9.35000 -4572.88787 22.88680 -10.44103 214.33734 218.16794 958.35311
9.45000 -4530.31898 24.68110 11.59450 219.58857 212.15569 949.31559
9.55000 -4510.11515 16.37603 12.28771 209.67190 212.66698 909.42456
9.65000 -4477.85984 19.18589 8.31710 202.99433 205.16418 910.37097
9.75000 -4442.71803 26.05161 3.34622 207.14182 199.80348 880.05635
9.85000 -4416.90846 19.61161 -8.85595 201.36478 193.39724 852.71909
9.95000 -4384.58273 13.48844 -2.48364 196.88014 192.01568 836.82511
10.05000 -4346.62119 17.19170 -0.92040 201.63910 188.30006 830.38942
10.15000 -4328.98628 10.01750 7.29863 194.25100 184.03982 809.16883
10.25000 -4298.40803 14.76522 -16.62308 196.17244 179.82574 779.69571
10.35000 -4265.02761 14.91149 -2.81373 196.49209 172.39056 774.41760
10.45000 -4235.10633 16.04100 -3.72593 197.51131 168.66860 778.69406
10.55000 -4203.94868 14.81996 -15.07898 202.23549 161.67351 753.33778
10.65000 -4176.76147 7.53900 -20.30217 198.87121 158.86207 724.73267
10.75000 -4150.11655 16.97159 -21.04920 200.70431 156.78525 709.74481
10.85000 -4110.31304 11.13487 7.72384 198.53482 151.11261 701.33532
10.95000 -4084.48174 13.35492 -9.63505 201.51615 148.36384 707.61191
11.05000 -4052.85420 11.25204 -3.73824 199.66861 148.60066 696.50216
11.15000 -4013.72902 13.29368 -36.21913 197.42676 145.25282 677.08710
11.25000 -3990.10074 11.71076 4.35721 198.50193 141.89882 651.15919
11.35000 -3960.97711 12.26230 -3.73806 194.40492 134.13420 645.84289
11.45000 -3922.90350 9.25548 -45.61379 190.97333 131.46691 640.90143
11.55000 -3903.68797 7.52715 -5.63768 193.48258 131.26651 632.31636
11.65000 -3867.30194 8.89427 -8.07130 187.67834 128.66721 613.26331
11.75000 -3838.19242 6.14402 -13.92307 185.00801 123.01256 611.14444
11.85000 -3809.64282 15.61008 4.94372 182.21173 114.20198 591.07656
11.95000 -3780.45881 7.36764 9.32477 175.45906 112.52496 582.97921
12.05000 -3754.30033 9.55565 -5.61962 174.02264 109.00398 570.02005
12.15000 -3724.44270 11.47902 -11.73146 171.29312 113.09291 554.59407
12.25000 -3698.06684 11.16832 13.22875 171.67216 107.30786 541.97056
12.35000 -3668.37142 13.65082 -2.11699 173.64271 101.20111 550.16946
12.45000 -3642.80193 12.62872 0.48725 170.29653 106.78517 533.37807
12.55000 -3612.56912 8.26912 4.29657 165.25235 95.14137 536.13242
12.65000 -3588.95100 10.03460 -3.67338 165.64236 99.89285 511.05702
12.75000 -3549.83526 12.28672 9.75358 154.10822 98.60054 524.21989
12.85000 -3537.48980 10.75631 -9.44987 154.51737 95.77140 494.08940
12.95000 -3514.08195 11.24391 4.31026 149.29553 87.00351 480.69728
13.05000 -3485.95720 12.62363 11.32853 148.72970 85.86765 480.67135
13.15000 -3460.95335 10.37951 -11.24479 145.59332 88.52203 489.04464
13.25000 -3438.13517 11.44631 -12.41700 146.93617 81.76756 475.02594
13.35000 -3416.64908 13.30441 14.64294 136.68988 87.54734 460.53179
13.45000 -3398.74504 10.46673 8.48210 133.32012 79.01495 456.70740
13.55000 -3370.51147 15.09935 -1.82232 129.79124 79.25991 446.69191
13.65000 -3354.21885 10.72166 -12.36649 123.94869 78.23442 439.76309
13.75000 -3328.59141 10.24455 -18.84878 118.23700 78.72386 430.64009
13.85000 -3311.82833 8.05289 -18.29376 118.27754 79.40140 422.67827
13.95000 -3292.02073 6.79094 8.56938 118.95536 78.47289 417.20075
14.05000 -3272.76459 4.97042 -14.89068 114.21286 73.37248 405.57370
14.15000 -3253.06155 7.94761 -9.57933 114.46427 78.36250 409.31655
14.25000 -3234.21228 9.83268 -18.39378 113.76030 84.21084 395.65985
14.35000 -3211.13034 6.88011 -15.77145 107.00413 73.42643 400.33575
14.45000 -3198.31605 8.41911 -5.75973 106.69542 78.51294 392.66475
14.55000 -3176.75208 8.61528 -12.55956 109.18742 75.91163 393.13099
14.65000 -3161.66082 5.23640 2.49237 103.01908 71.06342 371.51169
14.75000 -3139.26119 7.51995 -7.12766 106.84889 69.68680 368.70343
14.85000 -3120.19228 8.29446 -6.13405 103.42432 69.74682 362.76031
14.95000 -3104.70255 7.27565 -12.63588 101.80760 74.88586 361.75754
15.05000 -3088.96943 4.23453 -26.82158 99.66813 70.15642 352.37600
15.15000 -3071.60127 8.28235 -21.19383 97.05746 63.69790 346.24051
15.25000 -3049.35992 5.13585 -20.35505 95.39244 72.75764 338.21504
15.35000 -3031.82432 7.82051 -20.93031 92.95128 62.09683 339.89987
15.45000 -3016.21067 7.68498 -24.38480 95.90049 63.85819 329.56413
15.55000 -2997.50883 9.28912 -35.47379 95.48241 69.37155 330.81843
15.65000 -2985.60509 8.01111 -32.23073 89.48013 62.47194 323.09286
15.75000 -2966.27947 7.25328 -25.11966 87.88429 67.58148 320.57613
15.85000 -2944.51624 9.29262 -42.28096 86.04200 61.07750 316.75370
15.95000 -2926.48095 7.71983 -41.28704 81.89138 56.07091 311.60343
16.05000 -2907.20061 8.12665 -28.43169 86.99928 62.52924 308.83705
16.15000 -2893.15510 8.49171 -40.17116 79.39051 59.97284 296.28129
16.25000 -2876.50056 10.05992 -35.22557 79.93181 60.76362 293.58787
16.35000 -2860.59853 8.72076 -38.07514 79.42769 60.30510 294.48743
16.45000 -2841.75031 8.71890 -35.32425 79.74497 58.39504 295.81764
16.55000 -2828.31121 8.25511 -23.22687 77.16134 60.27428 283.86680
16.65000 -2810.33318 9.38817 -28.37153 80.14328 57.44068 280.07491
16.75000 -2797.31445 13.09042 -15.82412 82.95503 55.15472 274.95088
16.85000 -2778.40822 8.25998 -29.14298 74.44565 53.76204 280.49021
16.95000 -2765.09214 8.79984 -40.06761 77.00949 66.18136 275.40090
17.05000 -2747.13310 8.76034 -30.23155 82.04139 56.48448 271.03747
17.15000 -2730.44242 9.42334 -28.90135 72.25263 49.85457 271.28422
17.25000 -2714.22977 8.24185 -36.11643 69.01303 55.52961 259.33387
17.35000 -2696.84843 8.91200 -24.51052 62.63127 46.46778 253.74423
17.45000 -2684.02483 8.02959 -39.68847 68.01812 53.63913 254.47270
17.55000 -2673.69298 8.29613 -23.49147 71.11256 55.49782 241.81783
17.65000 -2652.15414 8.86099 -27.15096 65.96275 56.17117 253.96612
17.75000 -2640.45423 6.74123 -30.98137 61.39171 48.99440 244.50736
17.85000 -2626.22336 6.75716 -17.79094 65.93461 48.69948 242.21773
17.95000 -2611.14316 6.10567 -24.96550 63.77572 49.66626 234.20092
18.05000 -2591.33409 5.26531 -19.20407 56.84859 52.38283 231.72255
18.15000 -2580.08747 5.51528 -24.30906 58.48696 45.86928 220.26788
18.25000 -2566.36592 5.70155 -22.24124 56.18490 42.47274 226.20838
18.35000 -2551.51653 6.46098 -20.73825 51.95965 46.59364 215.49907
18.45000 -2539.70909 6.19534 -31.94650 57.53059 51.97589 217.27411
18.55000 -2520.62016 9.81579 -21.57690 58.37096 54.12918 209.38814
18.65000 -2510.21401 6.20969 -0.64104 54.87765 58.56721 206.47704
18.75000 -2495.56052 6.74797 -3.59517 54.82517 41.46175 197.90847
18.85000 -2483.17771 5.13470 -4.11132 54.40672 42.15796 202.54848
18.95000 -2470.23995 6.83043 -11.86882 50.72661 37.78927 197.81885
19.05000 -2455.89025 6.48398 -15.52493 52.68813 41.63080 194.01230
19.15000 -2442.15623 4.63766 -8.79000 51.48457 46.99367 190.86368
19.25000 -2428.81543 3.99115 -5.17005 61.73710 44.31751 189.16402
19.35000 -2412.28883 4.41340 -5.48470 46.58435 44.34254 186.57603
19.45000 -2401.27815 3.94229 -4.62037 48.54144 42.17047 178.72536
19.55000 -2388.12149 4.31086 -4.57403 47.63020 42.11039 173.46789
19.65000 -2377.07177 2.72783 -2.93345 51.61511 52.10441 177.75012
19.75000 -2366.20786 4.29907 -7.58173 50.32344 41.44811 167.32326
19.85000 -2351.80386 4.93785 -13.79665 51.80818 44.80700 176.66828
19.95000 -2335.99086 5.67021 -8.03076 53.23515 44.58663 166.13941
