0.05000 1459.19293
0.15000 2435.70867
0.25000 3473.36586
0.35000 4329.78898
0.45000 5013.39088
0.55000 5288.14906
0.65000 5547.67417
0.75000 5766.32812
0.85000 5820.71513
0.95000 5797.76633
1.05000 5814.45315
1.15000 5731.73585
1.25000 5600.98052
1.35000 5398.51771
1.45000 5397.26825
1.55000 5152.05359
1.65000 5073.17835
1.75000 4965.46461
1.85000 4728.08714
1.95000 4624.33608
2.05000 4499.89000
2.15000 4410.19817
2.25000 4264.83708
2.35000 4111.73845
2.45000 4064.47505
2.55000 3934.93362
2.65000 3765.39162
2.75000 3743.86493
2.85000 3572.62833
2.95000 3481.43540
3.05000 3403.53769
3.15000 3303.60126
3.25000 3195.61063
3.35000 3101.10045
3.45000 3046.93830
3.55000 2928.81088
3.65000 2893.92874
3.75000 2813.79796
3.85000 2698.02823
3.95000 2620.24385
4.05000 2609.91659
4.15000 2472.72578
4.25000 2447.85316
4.35000 2361.35346
4.45000 2305.64194
4.55000 2248.24254
4.65000 2165.05626
4.75000 2127.33435
4.85000 2026.81224
4.95000 2028.40769
5.05000 1969.28046
5.15000 1915.98937
5.25000 1860.84397
5.35000 1826.20754
5.45000 1770.38091
5.55000 1735.18483
5.65000 1711.47947
5.75000 1641.57066
5.85000 1623.54820
5.95000 1558.30277
6.05000 1531.48861
6.15000 1487.86172
6.25000 1465.55989
6.35000 1411.80238
6.45000 1387.20791
6.55000 1342.40662
6.65000 1321.90027
6.75000 1270.91394
6.85000 1255.77760
6.95000 1220.14568
7.05000 1201.40595
7.15000 1160.96160
7.25000 1147.29514
7.35000 1115.89970
7.45000 1091.48205
7.55000 1052.51049
7.65000 1038.58495
7.75000 1002.46350
7.85000 969.30126
7.95000 957.27832
8.05000 937.21976
8.15000 907.75272
8.25000 889.15197
8.35000 869.03693
8.45000 851.34760
8.55000 839.34224
8.65000 811.97867
8.75000 791.14925
8.85000 781.53422
8.95000 756.18111
9.05000 742.60308
9.15000 737.52189
9.25000 713.12156
9.35000 695.15973
9.45000 663.79339
9.55000 658.50637
9.65000 653.08668
9.75000 625.70889
9.85000 620.77169
9.95000 605.49253
10.05000 590.94814
10.15000 585.73778
10.25000 563.96474
10.35000 562.67720
10.45000 546.84188
10.55000 534.15270
10.65000 528.75146
10.75000 506.42905
10.85000 505.03432
10.95000 482.53617
11.05000 474.57184
11.15000 458.50788
11.25000 458.97478
11.35000 451.31593
11.45000 450.84204
11.55000 421.04570
11.65000 421.17565
11.75000 411.70855
11.85000 403.59827
11.95000 393.32749
12.05000 391.31730
12.15000 379.91834
12.25000 376.27729
12.35000 369.64989
12.45000 347.12917
12.55000 342.14395
12.65000 340.83528
12.75000 340.56586
12.85000 318.84809
12.95000 323.83780
13.05000 316.15521
13.15000 307.41273
13.25000 304.32254
13.35000 291.98368
13.45000 284.65311
13.55000 290.86084
13.65000 278.48206
13.75000 278.72061
13.85000 260.34961
13.95000 264.55368
14.05000 256.35202
14.15000 255.99259
14.25000 245.68599
14.35000 245.68392
14.45000 239.95532
14.55000 234.21657
14.65000 231.00057
14.75000 224.15399
14.85000 221.52626
14.95000 209.84011
15.05000 209.03105
15.15000 204.54801
15.25000 197.58011
15.35000 196.42726
15.45000 194.89698
15.55000 195.30146
15.65000 184.42244
15.75000 188.37007
15.85000 183.27627
15.95000 169.55534
16.05000 174.28626
16.15000 170.79277
16.25000 169.35508
16.35000 171.71313
16.45000 161.78653
16.55000 157.91095
16.65000 156.34772
16.75000 159.82778
16.85000 150.29671
16.95000 152.98078
17.05000 147.17951
17.15000 141.13360
17.25000 143.69711
17.35000 138.72696
17.45000 135.08125
17.55000 136.63831
17.65000 131.96356
17.75000 131.56675
17.85000 132.65837
17.95000 133.65990
18.05000 124.94437
18.15000 123.19641
18.25000 120.37579
18.35000 116.34889
18.45000 116.31835
18.55000 116.65220
18.65000 111.02946
18.75000 114.63767
18.85000 110.03242
18.95000 108.50789
19.05000 100.51777
19.15000 104.71358
19.25000 103.95789
19.35000 101.31196
19.45000 104.64873
19.55000 98.29572
19.65000 98.52037
19.75000 92.10745
19.85000 92.17419
19.95000 94.62111
