0.1875 -4.05455 16.16182 0.96145 125.03701 122.22161 103.41841
0.5625 1.1708 40.21224 -1.41015 124.66048 114.4638 98.25212
0.9375 0.2259 60.73927 0.80091 121.06084 105.7602 92.01722
1.3125 1.45538 72.44562 -0.38162 117.30608 96.95296 85.82929
1.6875 -0.17723 79.02869 -1.43516 112.65045 89.4665 81.93303
2.0625 -0.69744 85.50023 -0.05196 107.36296 84.77646 78.19632
2.4375 0.7206 89.97492 -0.03301 103.0898 80.4146 75.84701
2.8125 2.4806 94.15644 -0.38601 99.63955 76.07961 72.77601
3.1875 2.83656 99.44291 -0.84989 93.92229 73.6354 70.05081
3.5625 2.7822 103.49866 -0.84153 88.55134 69.82091 68.29475
3.9375 2.21481 110.42373 0.07477 84.33298 68.25304 65.3236
4.3125 2.63717 119.88393 -1.63191 78.57943 66.6126 63.17964
4.6875 2.36089 129.71425 -0.58283 74.9502 65.49931 60.36797
5.0625 -0.50987 141.94931 -0.2369 67.91928 63.43091 55.22237
5.4375 -0.56055 154.08644 0.33155 63.44178 60.26195 48.84351
5.8125 0.87676 162.9724 1.40523 57.1926 55.88951 44.49271
6.1875 -0.31456 171.87104 0.90295 52.60042 50.85438 39.57891
6.5625 0.20698 177.42464 0.33714 47.67212 45.72195 37.17054
6.9375 -0.52006 182.02011 -0.66057 43.94289 41.57298 34.76755
7.3125 -0.26119 187.26729 0.11977 41.29741 35.80309 32.61586
7.6875 0.66221 190.27202 0.17254 39.28726 33.89876 30.69352
8.0625 0.1815 193.55577 1.00955 37.3982 31.0502 29.34427
8.4375 1.17422 195.43014 -0.26683 36.05977 29.74608 27.64224
8.8125 1.32079 197.22162 -0.23879 34.36262 28.82491 27.26999
9.1875 1.09385 198.99728 -0.15989 33.78396 27.55556 25.48341
9.5625 0.51219 201.7563 -0.74088 32.42486 25.88419 24.68197
9.9375 1.17405 202.33479 -0.84186 32.07577 25.24765 23.88386
10.3125 1.12175 202.56519 -0.59973 30.45393 24.58239 23.61438
10.6875 1.04398 203.93012 0.2318 29.70385 23.43119 22.07314
11.0625 2.13269 205.02718 0.51382 28.21994 23.13127 21.8177
11.4375 1.75445 206.27517 0.35513 28.27597 21.88485 21.34082
11.8125 2.6114 206.76889 1.89055 27.45186 21.57863 21.2618
12.1875 2.18984 207.76862 1.27865 26.80548 21.47848 19.41776
12.5625 2.50995 208.17263 1.55618 26.81637 19.82747 19.3771
12.9375 1.53763 209.54394 1.9583 24.82882 19.61857 19.23237
13.3125 2.23952 209.40004 1.45468 25.44053 19.36658 17.99894
13.6875 1.5964 209.44121 0.74689 24.73109 19.76912 18.95333
14.0625 0.7621 210.56837 1.15585 24.01492 18.17946 17.61334
14.4375 0.96253 211.62348 1.31874 23.80516 17.87855 17.17118
14.8125 0.95175 211.70585 1.265 22.57762 17.06138 17.0376
15.1875 -0.50632 211.86563 1.31169 23.12506 16.26061 16.97091
15.5625 0.9847 210.63607 1.08905 22.38499 15.03747 16.3996
15.9375 0.12779 210.14123 1.9395 21.68874 14.15452 16.20011
16.3125 1.13779 210.09445 0.77684 21.35565 13.47351 15.05178
16.6875 0.3647 208.36785 0.8992 21.06505 13.26915 15.8535
17.0625 1.01166 208.10316 1.23722 20.3213 13.54107 14.59858
17.4375 0.35294 208.10567 1.08677 20.35453 13.81192 14.27665
17.8125 1.61028 206.97632 0.01414 19.75289 14.00501 14.04931
18.1875 1.61118 207.52455 0.29703 18.82616 14.26484 13.70435
18.5625 0.98696 208.01396 -1.53478 18.35592 14.06875 13.54405
18.9375 1.38837 208.19562 -1.6053 17.14138 13.82789 12.65834
19.3125 2.03636 208.43745 -0.87749 17.38583 13.79955 13.01925
19.6875 2.06891 208.6861 -0.59047 15.44678 13.76229 13.01968
20.0625 1.6001 208.3032 -1.24118 16.44841 13.16558 12.03844
20.4375 1.67315 207.69644 -0.16025 15.21541 12.86158 12.86282
20.8125 2.84065 209.55611 0.20658 15.34674 12.03662 11.80913
21.1875 0.84529 208.89312 -0.93679 13.88427 11.92635 12.11583
21.5625 1.92656 210.8669 1.14971 15.00714 10.3481 11.32732
21.9375 0.80723 209.98201 0.22116 14.21491 10.74769 11.08781
22.3125 1.3302 208.78526 0.45486 14.53687 9.75326 11.3677
22.6875 -0.57559 207.88867 -1.05008 13.97535 9.97423 10.83165
23.0625 -0.50246 208.22309 -1.35422 13.86203 9.85788 10.99151
23.4375 -2.02097 208.7388 0.90322 12.98022 9.41198 11.29858
23.8125 -3.26294 207.58985 0.79466 12.6449 9.45538 9.6142
24.1875 -0.31013 207.66675 1.67013 12.32513 8.30899 9.98475
24.5625 -2.73375 209.77222 0.55537 13.08101 8.38146 11.17987
24.9375 -0.75256 207.30401 1.01347 13.1878 9.03909 9.9244
25.3125 0.88543 206.61641 0.54038 11.79084 7.17906 8.49758
25.6875 0.88321 206.68613 0.49155 11.9888 7.5914 8.318
26.0625 -2.47314 206.4705 -0.27194 10.10913 8.12079 8.53535
26.4375 -0.65475 206.90217 1.13117 12.05144 6.57036 9.10052
26.8125 -1.09676 204.64724 1.05517 10.14428 7.03476 7.41836
27.1875 -1.22704 207.00086 -0.31673 10.09083 8.31922 7.64601
27.5625 1.13186 205.54646 1.40606 9.19621 6.21615 7.22528
27.9375 -2.34866 205.99917 0.65892 10.45425 6.30805 7.87644
28.3125 -0.05178 205.90042 -1.76838 9.9257 6.81775 6.65818
28.6875 -0.26395 202.82269 -0.01519 9.60644 5.98309 7.55815
29.0625 -3.08834 204.22775 1.87254 9.35357 5.45733 7.19522
29.4375 -2.15641 204.13681 0.61353 11.8921 6.50667 6.43035
29.8125 1.78188 205.10593 0.76527 10.34602 6.26054 7.71327
