0.05000 -4361.98384 712.32128 -2433.62702 6643.13270 7147.97877 7783.33043
0.15000 -3588.67593 -434.43651 -534.94664 5559.13271 8395.93513 8179.17942
0.25000 -6308.72208 21.40990 191.29868 5280.04364 4907.87049 8918.65692
0.35000 -7548.40780 -79.22744 2.87458 3942.90259 4671.05582 10453.29194
0.45000 -8480.01882 217.31433 90.43650 5029.63842 6654.24649 12250.88665
0.55000 -9089.55150 22.01598 28.68897 3379.09180 2773.41331 10930.20877
0.65000 -9574.12109 -23.57036 30.45038 4690.90765 3624.11224 11205.26063
0.75000 -9791.80106 14.94636 -245.07590 3402.17415 2726.85882 10360.55918
0.85000 -9746.32748 -1.55910 -245.88480 3312.57885 2270.77904 10266.47557
0.95000 -10023.92447 13.55763 320.95148 2792.92111 2413.46002 9530.96805
1.05000 -10117.74485 68.60756 -140.05392 2974.89516 5905.23093 9218.85851
1.15000 -10239.99028 -10.10762 -254.99529 2617.12151 2079.80372 8813.66583
1.25000 -10175.99423 -14.25824 67.83710 3451.38300 2782.97094 8333.43457
1.35000 -10172.18600 -2.68952 63.74473 2207.44404 1956.54365 7997.67992
1.45000 -10130.73849 -38.69361 103.72027 2391.45070 1775.66042 7627.00833
1.55000 -10084.21457 -13.53901 -144.92990 2467.90804 2049.69162 7250.73696
1.65000 -10023.19920 -74.29128 31.42743 3142.62178 5655.61683 8161.78360
1.75000 -10090.36947 -8.63413 44.28558 2004.48710 1638.45837 6634.53466
1.85000 -10059.21067 -26.74835 5.20485 1816.22574 2105.65909 6388.55699
1.95000 -10001.85727 -7.47206 -108.65343 2057.00261 1513.31676 6092.75595
2.05000 -9934.33432 2.48497 -107.71593 1864.66238 1557.89725 5790.57343
2.15000 -9801.64648 -21.26586 227.26505 1776.17027 2033.34215 5701.04094
2.25000 -9770.16362 10.57055 142.36584 1640.61871 1373.42014 5341.71118
2.35000 -9666.99920 -101.54864 53.26341 2720.44816 5984.21892 6803.08463
2.45000 -9433.44548 -16.22489 -14.55966 2861.64337 2367.36948 5715.64118
2.55000 -9361.33048 -2.32666 42.88333 1184.44530 1137.21402 4763.13164
2.65000 -9270.54821 -5.30679 183.56513 1342.29414 1630.84369 4953.64052
2.75000 -9107.75510 0.39762 -198.69808 1523.80354 1325.51504 4446.51276
2.85000 -8971.09762 0.38169 48.37192 1443.47797 1509.95943 4337.69225
2.95000 -8854.97320 21.17193 -98.75051 1483.72533 1104.08852 4135.33113
3.05000 -8717.16524 30.80933 13.36273 1133.61729 923.68435 3964.02773
3.15000 -8658.41472 9.60263 -31.01095 1186.94860 1439.05795 3911.36493
3.25000 -8547.98066 28.29323 -85.03716 923.13565 894.16796 3669.90505
3.35000 -8404.46470 12.16939 -105.87696 1600.25229 1342.84980 3653.30837
3.45000 -8300.06307 35.11189 -77.34070 1178.48184 1033.88494 3442.47672
3.55000 -8224.35693 49.45127 25.75271 904.16333 952.13090 3522.81876
3.65000 -8143.94804 10.59678 8.31836 1185.32962 1147.76631 3439.70999
3.75000 -8082.47692 41.41817 -20.33831 890.85180 751.14179 3083.01997
3.85000 -7977.17226 24.55012 -11.01157 804.75595 1527.46978 3209.49738
3.95000 -7914.89540 15.94498 137.61851 1110.73810 1694.49052 3408.12482
4.05000 -7827.58136 -6.40308 -57.03944 810.64964 1021.11592 2870.32248
4.15000 -7779.80254 15.68053 -72.08297 729.89979 763.91927 2718.13823
4.25000 -7740.56842 3.16650 -52.77450 1042.43900 846.22985 2690.62208
4.35000 -7731.68807 31.48004 -12.52264 1099.68907 870.53994 2637.78612
4.45000 -7640.16540 11.47275 -5.88540 977.12678 904.86781 2558.48226
4.55000 -7596.93831 21.45057 67.27534 732.18942 714.95183 2430.79331
4.65000 -7546.20241 -17.13132 -47.77422 779.63380 685.83696 2495.12211
4.75000 -7483.75385 1.76345 -82.64009 895.31355 1079.08917 3791.45351
4.85000 -7406.54985 5.11887 4.59608 1042.92120 845.48528 2532.42403
4.95000 -7340.79017 5.50057 20.21087 572.79945 487.60491 2188.59384
5.05000 -7250.37160 14.13670 -31.27154 641.52928 469.17870 2132.58833
5.15000 -7173.39036 1.77881 -29.06868 580.34376 575.78986 2029.02857
5.25000 -7121.19797 10.29228 -72.42941 616.27173 635.22398 1974.38955
5.35000 -7032.04477 12.39537 10.91507 607.28968 539.01830 2173.91904
5.45000 -6914.11342 0.27628 -43.16616 1023.42337 1034.16566 1831.62709
5.55000 -6827.01080 6.57632 16.10070 562.71272 583.66004 1917.03209
5.65000 -6752.98833 9.50501 30.77867 978.44599 828.12508 2016.53580
5.75000 -6665.29212 10.26388 -36.33849 450.63001 1177.75667 1763.32628
5.85000 -6565.05014 17.41854 17.09376 476.44113 389.33106 1616.88953
5.95000 -6483.97853 -11.14127 14.85573 677.33427 777.29368 1791.76839
6.05000 -6416.46104 25.38307 10.34568 484.34305 868.90193 1591.35949
6.15000 -6383.97572 9.82524 -22.15066 587.32642 475.73068 1485.81300
6.25000 -6292.74767 -5.76253 -2.90324 462.04279 684.68411 1448.29401
6.35000 -6217.12581 1.11660 -7.44005 392.38010 542.99144 1403.28485
6.45000 -6126.70850 16.75094 25.38303 646.82266 363.27016 1448.54940
6.55000 -6071.62571 -4.18655 62.24095 440.99782 325.64124 1651.74941
6.65000 -6013.35198 8.87685 52.19226 647.42046 499.00411 1355.33629
6.75000 -5944.41128 0.99895 29.02004 399.67151 432.94116 1276.15386
6.85000 -5883.03239 0.49266 0.98088 373.93075 317.43472 1350.72239
6.95000 -5824.52704 8.57538 31.08694 494.48683 367.32965 1197.03802
7.05000 -5778.76233 28.18639 21.22329 611.31584 983.43823 1213.03860
7.15000 -5744.32476 2.49972 -18.89611 699.45120 763.50593 1686.50145
7.25000 -5696.13974 -5.40882 -6.46523 336.93823 370.75575 1154.95294
7.35000 -5655.59649 13.22322 9.11312 432.73418 387.73181 1104.93257
7.45000 -5591.15730 10.75268 -29.70836 452.00666 359.68772 1065.80848
7.55000 -5521.97273 -0.26887 17.90590 301.97125 278.39341 1042.45275
7.65000 -5481.93644 7.93063 45.96879 287.12039 313.44715 1008.64753
7.75000 -5406.84720 12.42739 4.76128 633.72591 479.41435 1012.92070
7.85000 -5359.21461 11.53737 47.65174 395.84928 551.00985 985.62242
7.95000 -5310.38574 -13.21357 40.09557 536.94409 785.68750 989.04107
8.05000 -5265.45340 0.77657 11.38762 616.49401 307.05722 936.24962
8.15000 -5205.86133 26.58590 41.67786 314.89716 514.05642 941.37307
8.25000 -5152.36493 9.40674 73.27007 331.98366 230.69023 845.87537
8.35000 -5091.98255 12.38891 71.81770 240.57823 252.21297 814.37676
8.45000 -5027.19584 4.24025 40.09578 590.53337 271.71832 872.50324
8.55000 -4991.70927 12.43514 31.88645 286.99865 230.68848 830.22625
8.65000 -4936.57156 -0.76022 47.97224 221.82508 286.37847 740.17252
8.75000 -4898.17557 -5.51437 37.83980 203.28178 173.35436 737.55782
8.85000 -4861.55495 -20.81097 46.49561 500.20303 474.83439 884.67618
8.95000 -4793.50769 -13.17647 27.71869 499.35097 351.26778 809.01353
9.05000 -4786.43633 9.28212 32.02945 315.60158 308.73950 700.89317
9.15000 -4752.89559 3.29792 68.26945 316.85789 237.59864 723.50771
9.25000 -4693.49725 -0.96262 58.37279 307.92458 204.00070 688.74973
9.35000 -4649.95185 0.24548 24.26766 231.35538 243.07244 675.54195
9.45000 -4604.75451 -12.89247 37.85547 301.71259 472.74954 680.59009
9.55000 -4580.28873 20.48561 29.32927 460.07239 484.72258 652.83764
9.65000 -4541.92038 4.22300 55.20593 215.32084 261.06718 627.83656
9.75000 -4494.95610 5.00755 15.22228 232.92000 279.32461 655.89140
9.85000 -4462.30254 10.56579 21.43436 293.15342 197.26756 584.80618
9.95000 -4430.20720 -5.41208 -25.58652 212.43584 221.38650 577.11225
10.05000 -4385.49916 3.89739 -15.68960 225.07642 173.00464 540.07934
10.15000 -4348.18767 4.24831 -1.99210 192.06409 323.51037 537.11629
10.25000 -4310.70648 -1.94226 0.43149 197.63104 190.60370 707.23953
10.35000 -4272.47053 8.22290 -37.09967 201.29716 154.84269 517.91213
10.45000 -4230.91463 0.58617 -7.19452 184.36010 131.58245 506.90070
10.55000 -4196.62229 6.96028 -13.62703 839.13896 2019.62443 522.05813
10.65000 -4177.53036 -0.87922 -40.42103 153.95968 173.14859 497.39880
10.75000 -4147.48059 -4.70782 -48.68236 207.01252 265.76904 529.29857
10.85000 -4098.60868 10.11322 8.35400 151.65062 150.74222 469.52429
10.95000 -4102.70341 -13.85906 -13.71753 577.46978 422.68276 458.35362
11.05000 -4028.27727 -2.27500 14.52155 206.17292 240.16489 474.44512
11.15000 -4020.59105 13.46189 -14.23469 225.10785 132.48907 461.66674
11.25000 -3959.30199 11.33179 -12.78114 181.98297 139.66035 449.06264
11.35000 -3938.40316 14.87870 -6.92945 152.64795 188.14591 414.69581
11.45000 -3898.91309 -1.57339 -11.63666 115.82214 121.00286 391.20633
11.55000 -3864.18188 8.37989 16.00146 163.23035 120.60771 768.72579
11.65000 -3875.78406 34.82980 -17.88904 806.17756 734.13635 774.24102
11.75000 -3820.28569 0.31477 1.44469 95.62461 100.91338 364.64970
11.85000 -3784.91610 0.91925 -38.64230 170.53391 118.11575 1052.44842
11.95000 -3746.46728 5.41484 3.89146 127.81245 130.60805 355.46934
12.05000 -3717.02862 6.54635 -1.33047 156.26769 156.63932 341.42024
12.15000 -3689.23218 12.99692 43.05718 180.42573 197.33690 362.82533
12.25000 -3646.33527 -5.64917 -1.30496 141.13658 108.50574 317.54056
12.35000 -3613.01767 -3.24808 28.99761 155.69833 155.44990 311.93100
12.45000 -3618.06635 -15.94851 29.98142 406.01488 445.02266 491.44039
12.55000 -3574.85746 2.39659 -0.91810 102.72434 117.52577 314.08405
12.65000 -3540.01429 20.48133 30.59815 195.84502 330.63122 307.54508
12.75000 -3520.77678 -1.13484 4.08039 99.88012 78.38553 268.86289
12.85000 -3488.13759 3.18704 26.48276 104.43255 95.92074 296.87500
12.95000 -3458.24185 3.04947 36.73323 119.64814 130.03841 254.04388
13.05000 -3430.41004 15.37364 23.40533 119.02283 132.05553 310.72922
13.15000 -3422.50773 2.74720 46.37885 516.61293 127.92187 421.05933
13.25000 -3386.55051 3.11860 50.07963 117.40182 73.90002 244.21256
13.35000 -3353.25983 -3.32675 36.05875 83.83534 85.25928 244.35147
13.45000 -3330.50960 5.63568 36.44202 314.58008 258.19863 950.01894
13.55000 -3309.07985 7.73618 31.10361 75.01855 65.37306 232.00431
13.65000 -3283.00856 9.07826 20.55798 224.34192 194.86706 263.73209
13.75000 -3258.67159 -5.19003 32.56676 138.17079 114.20315 250.69341
13.85000 -3226.51365 8.49110 44.45236 130.11328 103.96778 229.60819
13.95000 -3206.08108 6.50315 26.52376 81.01105 67.39736 221.47704
14.05000 -3179.95795 -2.81833 47.77817 65.29262 61.27410 202.56821
14.15000 -3141.59747 -1.87921 49.93847 118.12216 98.63279 233.01660
14.25000 -3132.22988 -5.16276 45.59089 127.31593 126.08787 257.17986
14.35000 -3114.96380 8.61629 20.47322 365.29254 259.98380 273.59795
14.45000 -3087.83587 -4.86206 43.71840 96.62533 103.79630 240.88324
14.55000 -3063.92317 -4.74462 57.80263 79.82218 78.12079 200.29779
14.65000 -3053.40970 -0.26298 38.92803 160.34911 136.20052 209.48608
14.75000 -3015.35684 4.95879 56.73636 70.31008 88.21969 196.99727
14.85000 -2997.41674 -8.82264 26.66329 108.69776 110.14466 191.17251
14.95000 -2968.60256 -3.34218 -8.82783 83.95009 79.52878 186.37561
15.05000 -2939.48184 -5.31196 65.60853 225.83598 67.96190 349.42047
15.15000 -2936.79425 9.30668 27.69781 94.68183 87.30789 175.81393
15.25000 -2915.97128 -2.23141 32.98651 108.33743 92.64573 174.89554
15.35000 -2902.02498 18.01555 27.27216 122.27774 173.56269 178.05668
15.45000 -2857.29449 -9.41777 14.73073 179.13883 164.31396 194.65471
15.55000 -2856.41777 1.03250 17.87154 80.02842 77.29655 186.30961
15.65000 -2842.56758 1.56315 1.98879 91.55360 88.84772 156.67502
15.75000 -2821.81264 0.09795 5.65731 148.36170 100.22630 160.64303
15.85000 -2803.92821 -2.15244 2.90401 64.27266 53.31351 157.18182
15.95000 -2784.55550 -1.13675 1.61857 78.62576 122.02565 169.93941
16.05000 -2756.92493 -17.81985 -21.13685 122.60938 258.37416 184.85512
16.15000 -2740.53262 6.29198 0.36552 81.59675 54.73171 234.00588
16.25000 -2715.00133 0.85265 -25.74359 93.47966 90.82057 153.52057
16.35000 -2707.04149 5.90662 -34.30568 60.73950 55.25379 144.89224
16.45000 -2696.88052 4.19962 -23.71573 50.34397 50.63689 139.81368
16.55000 -2668.81255 -3.27135 -10.98037 59.52733 62.45482 148.23862
16.65000 -2660.64121 12.06455 -34.92729 86.79023 75.79635 127.02944
16.75000 -2629.05062 5.68136 -25.95158 62.15352 72.01959 116.96914
16.85000 -2616.48572 3.87525 -13.34583 57.76038 61.79875 134.37123
16.95000 -2608.66253 5.87886 -49.94884 84.71059 65.34453 153.28148
17.05000 -2588.88836 -0.01098 -20.97612 75.72801 67.51499 162.18680
17.15000 -2572.40814 -8.00479 -37.25795 58.23603 86.84904 136.74487
17.25000 -2554.28529 -0.40017 -40.87280 96.92482 45.84097 177.03768
17.35000 -2533.58282 2.12877 4.61030 71.94137 99.95333 137.45475
17.45000 -2526.61311 -1.36162 -7.71252 49.14819 51.16608 121.34514
17.55000 -2501.83439 -1.52392 -9.65782 97.57656 61.73989 123.95107
17.65000 -2491.68515 -12.60264 7.04461 249.82551 108.71872 197.11185
17.75000 -2488.27066 -6.68984 -46.20838 92.96102 129.43165 117.39880
17.85000 -2457.59855 -6.33194 2.05939 94.58236 116.13513 112.28354
17.95000 -2452.59665 -1.02464 -15.95053 54.20924 40.92445 111.05635
18.05000 -2430.17524 25.39900 4.48242 73.14295 266.28025 132.68917
18.15000 -2417.24341 9.95112 -0.16514 43.67143 41.28077 110.78232
18.25000 -2406.44736 0.98177 13.01925 50.17968 141.38391 548.11322
18.35000 -2396.57644 0.34393 10.25521 35.98392 36.21444 114.07490
18.45000 -2375.19766 -1.77078 3.35410 98.60412 54.57725 118.58579
18.55000 -2374.97035 7.01563 8.10367 71.11795 56.41422 111.32740
18.65000 -2359.26098 1.63953 14.09423 43.99327 39.12867 87.62379
18.75000 -2342.02832 1.86643 22.47167 39.09642 41.74398 103.16413
18.85000 -2315.67915 -18.63679 31.20109 50.50932 198.76702 108.30699
18.95000 -2315.87601 1.78686 40.47067 60.86948 44.81841 94.99694
19.05000 -2298.27936 2.60750 10.28384 52.64929 44.50535 102.99020
19.15000 -2292.57319 6.86156 36.05992 57.84300 39.94370 90.99421
19.25000 -2234.06414 17.35489 26.12867 352.06492 162.81234 82.87173
19.35000 -2257.72024 -8.06609 35.74762 36.96513 68.38800 103.07438
19.45000 -2243.41097 -2.18037 41.65719 37.64512 40.90741 96.55064
19.55000 -2242.77453 7.19369 25.93287 36.10666 37.12882 73.41172
19.65000 -2215.79807 -4.30065 9.27716 44.05343 46.94121 124.38135
19.75000 -2206.82969 -17.28965 32.23561 74.19026 71.58734 103.31657
19.85000 -2195.63641 4.56020 43.33382 42.87076 37.48306 89.35133
19.95000 -2188.88069 0.00231 31.38629 50.00934 47.27844 83.73598
