0.12500 0.04421
0.37500 0.02531
0.62500 0.01794
0.87500 0.01103
1.12500 0.01197
1.37500 0.01625
1.62500 0.01267
1.87500 0.03225
2.12500 0.01694
2.37500 0.00843
2.62500 0.01675
2.87500 0.02896
3.12500 0.03266
3.37500 0.01021
3.62500 0.01171
3.87500 0.01365
4.12500 0.00384
4.37500 0.00870
4.62500 0.00499
4.87500 0.01154
5.12500 0.01452
5.37500 0.01982
5.62500 0.01394
5.87500 0.00932
6.12500 0.02572
6.37500 0.03107
6.62500 0.01607
6.87500 0.01587
7.12500 0.00716
7.37500 0.00615
7.62500 0.00899
7.87500 0.02511
8.12500 0.01763
8.37500 0.01389
8.62500 0.02432
8.87500 0.02257
9.12500 0.03846
9.37500 0.01104
9.62500 0.01021
9.87500 0.03222
10.12500 0.02687
10.37500 0.02122
10.62500 0.01920
10.87500 0.04875
11.12500 0.02469
11.37500 0.03086
11.62500 0.01090
11.87500 0.03061
12.12500 0.01080
12.37500 0.04095
12.62500 0.01760
12.87500 0.02665
13.12500 0.01803
13.37500 0.02046
13.62500 0.02830
13.87500 0.03194
14.12500 0.02078
14.37500 0.02431
14.62500 0.03509
14.87500 0.00804
15.12500 0.01293
15.37500 0.02416
15.62500 0.02871
15.87500 0.03880
16.12500 0.04069
16.37500 0.01893
16.62500 0.03505
16.87500 0.02336
17.12500 0.02750
17.37500 0.04621
17.62500 0.01400
17.87500 0.05459
18.12500 0.01594
18.37500 0.02611
18.62500 0.00391
18.87500 0.03908
19.12500 0.03021
19.37500 0.00963
19.62500 0.05771
19.87500 0.01978
