0.125 -0.002 0.001 0.004
0.375 0.008 0.023 0.095
0.625 -0.044 -0.013 0.454
0.875 -0.046 -0.000 1.035
1.125 -0.044 -0.043 1.889
1.375 0.010 -0.041 2.606
1.625 0.053 -0.109 3.703
1.875 -0.059 0.038 4.183
2.125 -0.026 -0.080 4.951
2.375 0.039 -0.218 5.435
2.625 -0.111 -0.081 6.117
2.875 -0.009 -0.092 6.688
3.125 -0.068 -0.091 7.115
3.375 -0.027 -0.098 7.356
3.625 -0.038 -0.120 8.339
3.875 -0.084 -0.136 8.821
4.125 -0.082 -0.157 9.469
4.375 -0.092 -0.102 9.864
4.625 -0.152 -0.119 11.121
4.875 -0.152 -0.060 11.078
5.125 -0.254 -0.176 12.334
5.375 -0.199 -0.226 13.153
5.625 -0.264 -0.298 14.437
5.875 -0.236 -0.294 16.479
6.125 -0.386 -0.190 18.087
6.375 -0.372 -0.298 19.388
6.625 -0.493 -0.355 21.235
6.875 -0.363 -0.356 22.543
7.125 -0.565 -0.290 23.936
7.375 -0.515 -0.433 24.196
7.625 -0.531 -0.365 23.826
7.875 -0.485 -0.308 24.039
8.125 -0.421 -0.378 23.386
8.375 -0.432 -0.337 22.652
8.625 -0.429 -0.399 22.664
8.875 -0.358 -0.408 21.551
9.125 -0.342 -0.345 21.203
9.375 -0.319 -0.493 20.036
9.625 -0.334 -0.368 19.184
9.875 -0.255 -0.399 19.980
10.125 -0.311 -0.403 18.120
10.375 -0.195 -0.349 18.294
10.625 -0.230 -0.368 17.559
10.875 -0.231 -0.342 17.720
11.125 -0.247 -0.358 17.939
11.375 -0.178 -0.278 16.545
11.625 -0.168 -0.349 17.192
11.875 -0.175 -0.380 16.239
12.125 -0.189 -0.359 16.572
12.375 -0.214 -0.324 15.838
12.625 -0.230 -0.382 16.671
12.875 -0.228 -0.298 17.253
13.125 -0.168 -0.349 16.540
13.375 -0.199 -0.296 16.466
13.625 -0.264 -0.188 16.345
13.875 -0.187 -0.315 16.228
14.125 -0.205 -0.276 16.644
14.375 -0.229 -0.369 16.764
14.625 -0.172 -0.278 16.498
14.875 -0.220 -0.303 16.591
15.125 -0.207 -0.241 16.001
15.375 -0.232 -0.365 15.936
15.625 -0.178 -0.327 16.414
15.875 -0.182 -0.307 15.940
16.125 -0.151 -0.245 15.464
16.375 -0.188 -0.225 14.913
16.625 -0.204 -0.239 14.101
16.875 -0.199 -0.287 13.528
17.125 -0.170 -0.206 12.714
17.375 -0.086 -0.176 11.697
17.625 -0.091 -0.206 10.803
17.875 -0.050 -0.143 9.880
18.125 -0.055 -0.147 9.889
18.375 -0.066 -0.088 9.116
18.625 -0.044 -0.081 8.585
18.875 -0.034 -0.098 7.700
19.125 -0.064 -0.073 7.867
19.375 -0.093 -0.030 6.544
19.625 -0.041 -0.037 6.766
19.875 -0.062 -0.058 5.941
