0.125 0.000 -0.001 0.002
0.375 -0.001 -0.006 0.070
0.625 -0.002 0.001 0.333
0.875 -0.015 -0.007 0.871
1.125 -0.003 -0.007 1.648
1.375 -0.014 -0.040 2.482
1.625 -0.023 -0.010 3.437
1.875 -0.020 -0.068 4.198
2.125 -0.012 -0.072 5.084
2.375 0.010 -0.127 5.999
2.625 0.031 -0.146 6.650
2.875 0.023 -0.183 7.271
3.125 0.001 -0.176 7.823
3.375 -0.012 -0.176 8.259
3.625 0.000 -0.170 8.880
3.875 0.012 -0.106 9.383
4.125 0.023 -0.092 9.985
4.375 0.022 -0.060 10.568
4.625 -0.029 -0.046 11.245
4.875 0.002 -0.040 11.715
5.125 0.054 -0.039 12.530
5.375 0.051 -0.062 12.970
5.625 0.065 -0.021 13.914
5.875 0.077 0.017 14.910
6.125 0.057 0.043 16.208
6.375 0.077 0.015 17.433
6.625 0.072 0.068 18.572
6.875 0.029 0.077 20.267
7.125 0.049 0.058 21.379
7.375 -0.009 0.107 23.068
7.625 0.008 0.013 23.707
7.875 -0.001 0.064 24.825
8.125 -0.108 0.103 24.935
8.375 -0.031 0.132 24.430
8.625 -0.064 0.134 23.827
8.875 -0.047 0.131 22.826
9.125 -0.052 0.134 22.210
9.375 -0.083 0.153 21.206
9.625 -0.048 0.129 20.319
9.875 -0.032 0.097 19.980
10.125 -0.034 0.117 19.674
10.375 -0.072 0.158 20.307
10.625 -0.142 0.075 20.652
10.875 -0.149 0.050 20.981
11.125 -0.121 0.122 20.774
11.375 -0.153 0.056 20.565
11.625 -0.118 0.028 20.286
11.875 -0.134 0.041 19.909
12.125 -0.160 -0.028 19.085
12.375 -0.138 -0.066 18.811
12.625 -0.104 -0.076 18.493
12.875 -0.093 -0.092 17.767
13.125 -0.103 -0.095 16.573
13.375 -0.078 -0.086 15.750
13.625 -0.083 -0.085 14.639
13.875 -0.072 -0.072 14.764
14.125 -0.058 -0.070 14.470
14.375 -0.031 -0.091 13.901
14.625 -0.051 -0.110 13.634
14.875 -0.053 -0.098 13.699
