0.05000 33952.94709
0.15000 41244.23226
0.25000 33046.03194
0.35000 25667.08489
0.45000 21627.74140
0.55000 18723.97117
0.65000 16136.45328
0.75000 14682.96266
0.85000 13291.64478
0.95000 11983.05009
1.05000 11177.56205
1.15000 10304.99698
1.25000 9675.05732
1.35000 8991.87155
1.45000 8358.18752
1.55000 7907.72722
1.65000 7473.85905
1.75000 7100.28108
1.85000 6886.20021
1.95000 6421.63933
2.05000 6137.99781
2.15000 5830.34027
2.25000 5567.95694
2.35000 5367.52939
2.45000 5123.47708
2.55000 4946.69437
2.65000 4741.97767
2.75000 4512.64636
2.85000 4323.76569
2.95000 4220.29378
3.05000 3940.99123
3.15000 3759.73325
3.25000 3649.14482
3.35000 3571.86120
3.45000 3262.44731
3.55000 3196.29092
3.65000 3095.41396
3.75000 2998.68191
3.85000 2907.30542
3.95000 2805.24161
4.05000 2716.67888
4.15000 2605.49119
4.25000 2519.83223
4.35000 2459.36020
4.45000 2408.91531
4.55000 2339.09445
4.65000 2295.20201
4.75000 2252.46117
4.85000 2155.86282
4.95000 2149.76164
5.05000 2074.66116
5.15000 2022.56782
5.25000 1986.96815
5.35000 1938.78168
5.45000 1908.20491
5.55000 1853.97652
5.65000 1815.51683
5.75000 1746.02245
5.85000 1702.38839
5.95000 1680.83639
6.05000 1653.80433
6.15000 1581.73121
6.25000 1610.09362
6.35000 1527.18759
6.45000 1512.61890
6.55000 1463.36521
6.65000 1431.27824
6.75000 1398.63018
6.85000 1394.91882
6.95000 1362.12772
7.05000 1314.70704
7.15000 1288.70808
7.25000 1266.01053
7.35000 1224.83140
7.45000 1215.52285
7.55000 1208.79571
7.65000 1162.77281
7.75000 1132.06426
7.85000 1118.58627
7.95000 1091.99332
8.05000 1071.11589
8.15000 1059.66281
8.25000 1012.99140
8.35000 1018.18352
8.45000 992.38530
8.55000 967.60015
8.65000 938.09874
8.75000 940.72661
8.85000 902.01885
8.95000 907.12195
9.05000 887.08206
9.15000 859.49790
9.25000 839.09307
9.35000 836.88570
9.45000 805.96117
9.55000 790.15145
9.65000 790.65843
9.75000 776.08488
9.85000 744.95079
9.95000 751.80638
10.05000 727.09347
10.15000 719.23155
10.25000 691.17398
10.35000 691.80146
10.45000 688.26154
10.55000 670.93733
10.65000 647.84762
10.75000 650.40225
10.85000 621.98843
10.95000 617.06465
11.05000 613.41645
11.15000 599.31847
11.25000 593.08302
11.35000 585.89861
11.45000 551.90887
11.55000 562.57426
11.65000 535.98675
11.75000 530.91347
11.85000 521.45030
11.95000 515.63655
12.05000 494.44454
12.15000 496.20094
12.25000 479.22014
12.35000 481.50744
12.45000 452.48211
12.55000 462.65520
12.65000 438.77839
12.75000 436.73274
12.85000 415.34534
12.95000 416.88124
13.05000 418.89359
13.15000 394.69613
13.25000 381.57826
13.35000 390.01053
13.45000 375.99422
13.55000 368.86413
13.65000 366.69196
13.75000 359.72406
13.85000 350.36268
13.95000 353.86717
14.05000 334.87721
14.15000 334.33244
14.25000 321.30017
14.35000 314.37156
14.45000 314.26999
14.55000 311.38889
14.65000 305.96143
14.75000 294.16060
14.85000 283.21759
14.95000 287.66665
15.05000 278.61760
15.15000 268.90885
15.25000 271.86416
15.35000 272.21836
15.45000 268.25428
15.55000 254.11049
15.65000 255.46281
15.75000 257.53112
15.85000 250.66271
15.95000 238.05481
16.05000 236.39114
16.15000 236.37458
16.25000 224.54694
16.35000 226.60131
16.45000 215.20552
16.55000 218.49671
16.65000 209.16672
16.75000 198.59423
16.85000 205.87310
16.95000 204.01203
17.05000 201.19760
17.15000 195.83469
17.25000 195.89234
17.35000 198.58623
17.45000 180.73530
17.55000 188.67010
17.65000 174.60633
17.75000 173.77941
17.85000 170.20276
17.95000 180.72726
18.05000 172.68206
18.15000 163.49347
18.25000 162.94168
18.35000 162.04939
18.45000 165.74204
18.55000 157.17733
18.65000 146.99407
18.75000 155.70047
18.85000 146.72850
18.95000 152.01947
19.05000 140.38973
19.15000 142.20640
19.25000 141.18484
19.35000 137.20873
19.45000 138.22163
19.55000 131.82684
19.65000 131.37739
19.75000 129.17151
19.85000 129.58039
19.95000 129.52071
