0.05000 0.00000 0.00000 0.00000 0.00000 0.00000 0.00000
0.15000 436.68249 336.76371 4112.50026 977.52363 1148.05952 190.53507
0.25000 -918.95127 226.43495 3960.01186 1390.53828 1242.24446 393.13439
0.35000 -1117.09644 103.48684 3997.23504 1375.67902 1313.53458 444.71512
0.45000 -1077.38008 -116.14653 3930.18991 1401.48459 1355.06127 584.17378
0.55000 -1125.00432 75.29938 3893.00088 1382.29694 1479.46348 617.93701
0.65000 -1681.94886 -121.36964 3660.15694 1278.75480 1448.51745 709.85382
0.75000 -1835.87618 -8.93818 3586.79372 1261.33276 1492.88611 769.48909
0.85000 -1930.48706 154.88114 3429.64190 1401.97300 1586.88783 884.59381
0.95000 -2097.45218 -40.16589 3245.30671 1383.86181 1636.57821 998.19274
1.05000 -2208.44288 -24.82782 2926.43504 1577.14836 1676.41944 1145.78179
1.15000 -2495.99180 -39.03145 2720.85158 1371.35078 1772.19734 1251.39719
1.25000 -2578.10861 78.37357 2365.51003 1496.27964 1728.52226 1470.51081
1.35000 -2830.94393 48.95327 2014.73564 1435.81934 1663.84206 1681.11862
1.45000 -2880.72966 -122.66464 1627.85178 1441.23522 1590.75661 2007.50513
1.55000 -2997.72633 50.70839 1404.70190 1376.76487 1487.56450 2215.26991
1.65000 -3249.62140 -8.02525 1303.91849 1119.38452 1387.29782 2181.39378
1.75000 -3178.19306 -4.20069 1217.24605 1211.70326 1282.48129 2286.39984
1.85000 -3303.28783 -19.78858 999.70528 1166.25680 1197.36577 2271.73481
1.95000 -3362.05148 -78.08979 1036.43759 1150.28818 1111.71057 2230.19341
2.05000 -3274.10616 -0.57710 962.30643 1231.47941 999.82280 2389.97868
2.15000 -3399.08257 -56.42164 784.99598 1098.54051 971.78259 2383.05551
2.25000 -3384.15053 -69.68686 662.69364 1115.13798 919.71223 2447.26894
2.35000 -3440.64545 -6.65055 678.52183 1123.99297 845.79643 2375.96186
2.45000 -3384.50464 29.01032 593.04112 1104.91177 785.98692 2451.74830
2.55000 -3413.19767 17.18962 676.81402 1072.70429 753.82285 2397.79915
2.65000 -3355.98853 11.11614 625.02908 1092.52894 723.58863 2461.43473
2.75000 -3428.21288 3.04378 425.16690 1040.25298 693.96471 2438.44475
2.85000 -3458.09486 24.01033 349.60281 1059.20448 649.42018 2386.70543
2.95000 -3418.91741 4.11927 395.82297 1048.79385 645.05391 2401.14839
3.05000 -3372.68327 -33.16887 274.78697 1032.79789 611.15540 2474.40745
3.15000 -3372.75818 26.71299 439.92921 1059.80490 573.01379 2403.87221
3.25000 -3389.46856 12.03862 363.30438 1014.75124 558.13499 2394.95327
3.35000 -3346.33398 0.46242 199.47986 1040.70070 556.39000 2440.31484
3.45000 -3347.43610 -5.60566 295.12732 1008.86468 513.70952 2396.78629
3.55000 -3294.31928 -5.19447 325.82948 994.47845 490.95419 2420.77428
3.65000 -3277.80006 -7.79004 341.25332 1017.93592 463.74195 2378.57958
3.75000 -3282.25792 3.70124 319.44296 981.90604 457.77362 2360.13942
3.85000 -3239.96920 25.32438 198.80957 987.02262 448.39392 2381.11278
3.95000 -3268.15721 13.10246 98.52775 987.21087 436.85242 2323.95588
4.05000 -3190.94151 -16.89699 260.19086 980.78207 431.67958 2367.65271
4.15000 -3215.78506 -0.58292 120.44207 976.03376 416.51153 2320.38757
4.25000 -3171.40122 -0.99315 139.03812 970.66908 393.68817 2337.01524
4.35000 -3171.40095 11.88145 179.70764 940.92857 380.01950 2296.18755
4.45000 -3116.23015 1.01105 89.98899 961.29438 376.86552 2339.58367
4.55000 -3134.75558 -9.16923 134.45693 927.18608 358.59329 2293.94442
4.65000 -3151.19964 -1.77147 134.66748 895.19308 341.84758 2235.41866
4.75000 -3113.58783 12.73587 185.47927 904.42769 341.73064 2215.77875
4.85000 -3064.73761 -3.33163 162.77103 909.61963 327.28425 2242.98869
4.95000 -3070.97363 6.83891 125.43613 902.20755 321.29282 2215.66672
5.05000 -3012.85958 4.75670 53.17846 911.52225 313.79492 2254.84534
5.15000 -3011.88352 7.07662 92.49675 899.64846 303.70089 2220.87025
5.25000 -3002.44741 2.62998 101.86370 892.67636 296.69680 2196.37240
5.35000 -2978.63411 1.35929 64.53072 888.02426 285.27379 2192.91305
5.45000 -2943.59906 10.39325 98.07126 877.42492 286.14262 2220.22298
5.55000 -2958.84392 -13.44924 82.21628 864.24040 280.20932 2160.79508
5.65000 -2944.02340 1.90204 19.32686 850.94324 269.91056 2157.43421
5.75000 -2932.35173 -1.15246 77.91251 840.05668 266.29394 2128.75481
5.85000 -2908.46917 -0.31619 85.25989 866.51122 258.41070 2121.24848
5.95000 -2906.27181 6.21066 79.69433 831.89223 252.44755 2096.30887
6.05000 -2875.09197 -7.28770 -26.12635 841.39775 244.50170 2111.72086
6.15000 -2854.35745 5.63360 136.30614 857.83201 239.36516 2080.82295
6.25000 -2833.26875 -1.75777 54.24642 835.16383 235.78111 2085.78525
6.35000 -2826.63860 1.01391 36.26199 824.59682 230.88752 2071.43155
6.45000 -2836.84991 2.21520 13.78330 804.89623 232.81749 2038.25414
6.55000 -2800.50005 -3.68944 57.07967 831.78925 224.56520 2038.57811
6.65000 -2779.08178 -3.55266 12.41647 814.98512 220.47178 2045.52567
6.75000 -2755.13491 -8.17035 -26.72662 811.20188 214.57494 2060.66294
6.85000 -2760.23059 3.23898 -1.13673 798.99029 212.77927 2016.38549
6.95000 -2734.22151 0.39574 78.22987 802.85892 205.34443 2008.09620
7.05000 -2722.77330 -3.97986 -22.05221 798.58178 202.46200 2005.74122
7.15000 -2696.20046 0.56837 72.72242 786.86004 199.13947 1996.23365
7.25000 -2699.62584 -0.01617 -9.17925 782.39865 196.09896 1971.12504
7.35000 -2695.78781 -4.81342 4.07772 764.50686 188.93462 1944.57541
7.45000 -2658.52840 2.39792 -8.29849 790.24397 188.79208 1969.33658
7.55000 -2638.46117 -0.04493 -33.95302 774.39490 182.25778 1966.46019
7.65000 -2639.19365 0.87549 -24.69679 774.19758 183.74204 1932.19443
7.75000 -2634.94233 -2.21878 -24.32034 750.25741 178.98617 1920.70056
7.85000 -2625.27809 0.59131 37.44333 732.04094 174.29836 1901.01021
7.95000 -2609.07607 -2.84804 21.21164 739.83371 168.16164 1891.73018
8.05000 -2557.24425 2.41808 -41.99385 765.28044 167.28423 1930.60630
8.15000 -2570.95041 2.50438 -23.15922 748.96538 166.87616 1884.66424
8.25000 -2543.30793 -1.86605 11.97457 733.81812 165.64810 1889.73879
8.35000 -2540.01773 -2.83728 -32.46460 742.92705 161.76115 1871.16378
8.45000 -2523.95090 0.80091 -53.73627 725.75208 159.47930 1882.07260
8.55000 -2518.52875 -1.06698 -57.59066 729.56108 155.70099 1852.46288
8.65000 -2489.64482 0.36509 5.99119 722.66821 149.67200 1861.68533
8.75000 -2501.41427 -2.42077 -40.78897 719.52457 152.34230 1824.11607
8.85000 -2487.48828 -0.59927 5.64670 716.06199 147.29286 1812.90262
8.95000 -2474.34279 -0.11743 -57.35813 716.60240 144.09841 1803.43973
9.05000 -2442.17684 -0.42284 9.80441 723.33049 141.20852 1808.96980
9.15000 -2472.22279 1.77782 -32.16563 670.76004 141.07134 1763.06777
9.25000 -2411.98317 0.34738 -15.68013 706.47958 137.83092 1804.65972
9.35000 -2417.18327 -3.22573 -56.63763 704.30420 136.98775 1767.54501
9.45000 -2401.77916 2.99227 -26.87947 683.82273 135.62423 1769.30618
9.55000 -2401.86180 0.85659 -66.64807 687.60824 133.61443 1742.07164
9.65000 -2377.39193 1.47265 -110.46038 700.67121 131.71930 1748.73807
9.75000 -2356.01941 -4.74439 -47.34934 699.63450 129.01910 1743.81838
9.85000 -2332.48119 1.72699 -87.16527 686.42067 126.99523 1759.91668
9.95000 -2316.04229 1.57083 -4.35677 691.84502 125.22042 1742.92919
10.05000 -2318.31877 0.29228 -126.35744 665.80882 121.80235 1733.09245
10.15000 -2302.65855 -0.58197 -8.82375 676.76670 122.04309 1715.60955
10.25000 -2297.83707 3.63530 -52.55955 654.92376 117.69233 1706.62350
10.35000 -2280.98727 -3.33366 -83.88466 669.91264 116.55320 1702.46372
10.45000 -2301.68481 -1.19757 4.31221 628.67770 117.48569 1650.46000
10.55000 -2290.62843 -1.46844 -46.07594 642.17201 110.95862 1641.87981
10.65000 -2250.22924 2.01069 -56.84208 649.61646 112.79154 1665.58370
10.75000 -2252.24177 0.65879 -55.80101 642.25627 111.33264 1637.42499
10.85000 -2230.35506 0.31164 -27.23931 650.46878 109.53952 1633.03142
10.95000 -2215.94141 -2.22618 -60.36271 634.49684 109.72970 1633.83964
11.05000 -2174.93671 -1.64875 -41.27810 639.34486 106.69564 1655.94542
11.15000 -2208.18587 0.52440 -52.87462 626.00452 106.49359 1597.85881
11.25000 -2170.67637 2.28663 -38.94857 624.39865 105.60867 1618.69235
11.35000 -2161.16313 -0.59022 -94.73359 628.11273 101.25358 1611.52150
11.45000 -2158.70829 -3.26831 -64.09966 613.21420 101.52604 1594.51774
11.55000 -2158.11425 0.21346 13.42336 608.03154 101.91107 1567.74218
11.65000 -2135.00008 0.46922 -29.13838 612.16368 98.36414 1576.29543
11.75000 -2118.78409 2.22000 -55.31816 633.96785 97.96434 1572.04480
11.85000 -2124.52180 -0.54170 -62.78605 604.23952 100.01026 1549.31119
11.95000 -2100.71402 0.09046 -36.06311 607.10823 96.70277 1554.95792
12.05000 -2074.37797 -0.64984 -38.96919 605.97333 93.79204 1565.20381
12.15000 -2067.96314 -1.64226 -7.02405 608.05289 93.98961 1553.22786
12.25000 -2080.73697 2.25124 -19.32423 590.92319 91.37401 1515.80770
12.35000 -2059.91054 2.51496 -30.14188 578.10735 91.77603 1524.14540
12.45000 -2057.25979 -0.59067 -49.73269 593.49189 87.80039 1504.42182
12.55000 -2059.03234 2.47689 -67.27301 583.35154 89.92273 1484.43519
12.65000 -2039.24646 2.71669 -94.39355 574.44691 87.55552 1494.38843
12.75000 -2043.16406 -1.90115 -15.12846 553.38510 85.70022 1468.03849
12.85000 -2002.13293 -0.23479 -39.68343 587.18752 87.69424 1489.01623
12.95000 -2007.98713 -1.06182 -25.35985 567.87878 84.38955 1464.61087
13.05000 -2019.13825 1.78791 -38.23262 557.45604 83.27583 1430.55388
13.15000 -1974.73074 0.98359 -80.37155 565.03029 83.62184 1470.99709
13.25000 -1999.27590 1.45804 -11.10206 556.54186 80.22476 1414.53131
13.35000 -1957.78679 -1.78433 -37.89253 578.39659 81.43354 1444.94874
13.45000 -1942.09537 -1.20052 -89.97682 567.02186 79.99215 1449.60927
13.55000 -1955.48422 1.56963 -53.62864 553.37768 78.29113 1419.08105
13.65000 -1941.06945 1.24561 -75.58622 550.70943 80.37967 1416.00144
13.75000 -1919.15527 -2.14915 -58.48476 561.01830 78.92493 1418.94840
13.85000 -1926.30657 1.48506 -86.48483 542.06846 77.66214 1397.60831
13.95000 -1920.97396 0.17296 -83.48646 542.55418 76.45911 1384.61997
14.05000 -1894.09010 -1.88139 -15.82613 556.75060 74.94042 1388.06142
14.15000 -1900.63539 -0.20040 -49.76625 539.80530 73.29858 1372.64812
14.25000 -1879.13249 0.78431 -10.18500 537.96290 73.59422 1378.67168
14.35000 -1847.16376 2.06559 -72.78052 551.18286 72.40741 1397.06404
14.45000 -1843.95476 -1.81037 -47.16910 554.40384 70.85990 1379.78816
14.55000 -1860.22236 0.39435 -124.72836 527.48868 73.01671 1352.85515
14.65000 -1839.88838 2.58396 -84.25268 531.09622 71.55980 1361.49702
14.75000 -1829.44173 0.29779 -14.72413 538.83025 68.47143 1347.79985
14.85000 -1835.90572 0.19781 -48.13981 510.29474 69.29414 1329.38679
14.95000 -1826.24603 0.63093 -38.18829 519.43534 67.14394 1318.71219
15.05000 -1795.77009 -1.43059 21.71651 529.71219 67.20008 1332.82930
15.15000 -1792.05574 0.47009 -37.76648 515.09852 66.95000 1325.94270
15.25000 -1780.93347 1.20520 -39.17269 523.12646 66.50942 1321.89261
15.35000 -1800.32498 -2.06305 -77.59187 496.74373 66.97210 1289.58016
15.45000 -1780.39176 -2.34821 -21.73346 501.04290 63.18380 1295.76098
15.55000 -1763.97815 1.41763 -41.38920 503.32398 63.46922 1301.79767
15.65000 -1778.26316 -0.06394 -38.15256 495.85998 64.59939 1264.12453
15.75000 -1748.45292 -0.06744 -48.24805 488.50932 63.20306 1286.19311
15.85000 -1742.86128 -1.68604 -61.64271 498.81049 62.93793 1277.36795
15.95000 -1744.26294 -0.38302 -36.56034 494.65061 61.02156 1256.99911
16.05000 -1713.39815 -1.51916 -28.33878 491.64152 61.49479 1280.97245
16.15000 -1725.42615 0.04643 -17.91716 482.77224 62.38965 1250.19377
16.25000 -1724.64654 0.31770 -27.45807 487.79945 59.59064 1234.24865
16.35000 -1705.27695 -1.59320 -60.01872 478.29243 60.56852 1247.20824
16.45000 -1685.76812 0.27673 2.16227 490.24059 59.87144 1248.42713
16.55000 -1692.85287 2.00136 -71.32296 486.35071 59.60111 1225.17296
16.65000 -1680.50513 -0.57807 -34.98688 478.50786 56.57067 1229.69022
16.75000 -1653.85571 -0.57702 -94.02297 491.64969 58.19516 1245.06220
16.85000 -1679.38518 0.14345 -27.27399 472.07787 57.53905 1197.80854
16.95000 -1645.76747 -0.06330 -56.05708 479.18367 57.26433 1226.24534
17.05000 -1634.41219 0.82921 -38.26291 489.79628 56.14214 1223.03054
17.15000 -1641.49057 -0.04754 -35.93671 456.98057 53.99228 1206.26564
17.25000 -1619.88923 -0.97173 -70.16105 476.26503 53.67275 1214.12853
17.35000 -1629.66760 -1.00219 -53.99340 458.16181 55.78602 1188.46940
17.45000 -1601.80504 1.26198 -23.16923 465.24035 54.50802 1206.73635
17.55000 -1610.73847 -0.46447 -28.89816 460.49040 53.73610 1182.95141
17.65000 -1611.38180 -0.29547 -50.79014 453.72777 52.98608 1168.31361
17.75000 -1589.90056 -0.02384 -32.38547 464.38151 50.11876 1175.21866
17.85000 -1585.00858 0.20077 -28.37549 460.44896 53.83027 1170.89047
17.95000 -1556.98984 0.37428 -58.06012 466.45542 50.50643 1187.76760
18.05000 -1569.34311 -0.12430 -65.86604 452.76837 50.81193 1162.05176
18.15000 -1576.77443 0.77031 -45.38086 447.98409 49.94425 1140.72209
18.25000 -1556.00386 0.89412 -36.75559 446.35745 50.33587 1150.80937
18.35000 -1540.85685 0.98006 -49.66808 452.95899 51.07389 1154.04104
18.45000 -1562.20757 0.76616 -91.04088 424.90658 49.08102 1120.54691
18.55000 -1541.45785 -0.18154 -47.35975 439.67740 50.78981 1130.24611
18.65000 -1522.30420 0.24554 -60.71211 443.78906 49.17824 1138.39302
18.75000 -1546.84627 1.03030 -66.18340 418.61996 47.47618 1099.83632
18.85000 -1500.59067 -1.07681 -46.22281 444.41191 49.03228 1137.38278
18.95000 -1520.25563 2.03257 -43.20835 425.55991 46.72785 1101.86815
19.05000 -1495.54288 0.26834 -44.60303 434.36280 46.77157 1118.96070
19.15000 -1500.64946 -0.89298 -74.52096 417.97397 48.06166 1106.37281
19.25000 -1471.94694 1.05673 -29.87294 439.98887 45.27119 1119.55089
19.35000 -1489.85685 0.56612 -63.69295 426.28583 46.04602 1086.81852
19.45000 -1488.60321 -0.57984 8.86450 415.53661 45.88767 1074.02024
19.55000 -1470.15123 -1.03211 -41.00356 430.68433 46.47965 1082.71787
19.65000 -1462.47731 0.10497 -48.04436 423.48221 44.69465 1083.02723
19.75000 -1464.33897 0.19996 -37.45080 414.42605 43.90010 1070.94257
19.85000 -1461.57425 0.74432 -55.35994 404.53223 45.13444 1064.60709
19.95000 -1460.97052 0.04759 -69.15952 409.41135 42.54164 1048.99821
