0.05000 -3001.85136 -433.31406 -44810.71404 1794.37823 2702.69925 214035.56501
0.15000 -5509.94911 420.67634 6165.52520 4791.45428 5586.50039 448438.39954
0.25000 -6639.47882 -273.98288 4233.56913 4482.02596 3895.62387 356854.54689
0.35000 -8216.99968 -46.20073 -10981.69650 2532.47371 2305.72391 359219.23822
0.45000 -9309.04000 -6.90687 -4718.62252 3017.75547 3195.85335 441147.51775
0.55000 -9777.76613 -29.87958 6837.44080 4935.66938 2812.46124 367732.51510
0.65000 -9933.95075 -78.19732 2263.00277 3509.04837 1933.43095 353064.57970
0.75000 -10301.85890 21.54031 -2309.93493 2351.83288 2187.83468 405562.14820
0.85000 -10302.61483 26.80955 1804.04581 2046.20688 1548.95850 318044.80091
0.95000 -10152.62680 8.28651 -2332.84519 1941.24373 1460.11091 313193.73468
1.05000 -10187.01085 26.48279 5354.32789 1688.07882 1614.92528 306500.75255
1.15000 -10114.33983 -5.95081 3489.83133 1728.07025 1334.42498 293263.10278
1.25000 -9973.68781 -36.46111 3737.35498 1605.73430 1665.89024 306536.66551
1.35000 -9821.65560 -22.20672 3675.65676 1375.75388 1338.92424 270415.78516
1.45000 -9713.56182 -19.16595 -4817.97823 1451.26114 1558.76399 235938.39552
1.55000 -9647.78161 -19.77227 -1722.46573 1637.28620 1816.72949 278935.65928
1.65000 -9536.88675 10.91050 -567.61077 1149.68086 1148.09296 240679.75530
1.75000 -9439.48323 -19.27509 -1388.34332 1036.32831 1174.84999 226616.64393
1.85000 -9335.65539 -6.39292 -836.26548 1178.61316 1269.30192 212130.49996
1.95000 -9219.26263 6.49357 -1313.74012 1045.81459 1285.00244 205834.80476
2.05000 -9127.96253 -4.77441 2634.08676 982.06726 1364.22266 201012.87368
2.15000 -9014.65320 12.78195 -531.74490 918.63987 990.11776 190647.18338
2.25000 -8928.43778 20.88154 -2351.71043 810.63979 1052.51118 194406.85273
2.35000 -8847.38896 -8.06987 -3651.97729 922.58140 1724.10771 168713.18920
2.45000 -8731.43376 -1.51283 -2756.95299 1304.29143 982.35999 179459.16498
2.55000 -8647.99811 26.65047 3134.13140 834.36159 1001.20344 173786.39284
2.65000 -8590.98865 6.01504 1570.39132 731.08108 940.76833 175249.69025
2.75000 -8508.19301 2.95201 2122.72009 871.22520 984.95365 160078.02119
2.85000 -8459.20746 5.18941 -3058.35006 709.20691 888.80013 145284.60478
2.95000 -8392.13889 18.52901 -1241.06418 694.17784 802.88014 142175.03405
3.05000 -8329.41042 2.38355 5631.92739 574.60331 752.95548 140506.38364
3.15000 -8262.90285 23.55780 827.43499 1108.52095 1934.83367 142667.24136
3.25000 -8194.19858 -4.24585 -140.44763 782.53582 940.99495 137242.04447
3.35000 -8134.46857 19.42715 2351.90939 923.27504 2075.26094 140842.20958
3.45000 -8050.63580 -0.80797 -1054.89952 602.61489 773.18707 128951.27073
3.55000 -7996.95774 7.56542 -653.63265 1198.78070 713.31560 141383.34976
3.65000 -7913.27418 1.38603 -364.75904 979.44290 856.95658 142749.06328
3.75000 -7836.73807 0.36467 -265.28909 561.81589 748.33972 106502.86847
3.85000 -7777.74564 -3.16198 -3656.03850 849.61649 1472.13839 119633.24710
3.95000 -7705.30079 1.01538 658.15756 667.81148 611.36589 113501.62904
4.05000 -7668.20729 2.06967 -1774.50670 758.45365 649.88688 113810.28614
4.15000 -7607.50836 -2.81897 1460.86478 549.24365 561.34207 101378.63257
4.25000 -7534.37745 17.01268 -2104.23489 729.11018 553.60635 100601.60714
4.35000 -7467.53207 5.68681 -777.79312 526.95389 674.48122 100232.42037
4.45000 -7427.44940 7.75782 1226.57626 722.07328 1114.89319 92955.11311
4.55000 -7364.33309 11.10092 -110.12578 600.79784 599.87445 91568.51335
4.65000 -7316.86893 7.50418 -2036.84183 537.42820 677.98500 136798.63310
4.75000 -7264.60552 8.44824 371.47244 510.78538 625.25816 79137.50004
4.85000 -7196.94195 6.34687 -958.52751 350.16908 527.30048 80981.97646
4.95000 -7143.44039 14.90937 -1423.53945 508.70612 454.28255 80340.62168
5.05000 -7101.44599 4.34413 -799.02157 398.53548 648.71934 81709.91816
5.15000 -7025.86719 8.47899 -994.91567 1558.21797 618.14983 71679.84965
5.25000 -6976.16939 15.51898 -119.73899 411.40798 545.78495 66853.77549
5.35000 -6910.61573 1.44094 -1520.49181 697.46290 610.18928 75294.31890
5.45000 -6858.29176 3.76482 -75.16091 589.79528 480.71830 64353.44777
5.55000 -6815.86117 10.48707 -13.92821 431.29968 355.97327 63323.51130
5.65000 -6751.64984 15.76316 -409.22065 731.13690 896.81564 60828.47876
5.75000 -6694.95527 0.58047 -576.83995 379.02184 525.51365 60335.61197
5.85000 -6636.09692 9.76349 -96.17914 494.47282 498.22530 61857.70959
5.95000 -6572.48634 16.34695 -667.51710 491.55642 479.81474 53852.34170
6.05000 -6521.52203 9.21833 -85.87574 351.57479 333.60287 52348.38720
6.15000 -6447.63586 9.14337 1041.92722 381.31945 504.44951 59460.03127
6.25000 -6394.98655 5.59272 -623.99722 433.04845 372.86992 58755.42945
6.35000 -6347.04219 10.42035 -440.25352 321.56863 321.69250 74061.09154
6.45000 -6284.54016 8.88544 1385.73301 647.37200 460.50215 49673.49268
6.55000 -6224.01980 5.62502 -64.83540 505.31652 1158.42117 45144.71276
6.65000 -6164.58408 6.44654 -431.10363 638.07165 566.55756 54202.24553
6.75000 -6119.42591 6.67740 -67.81937 400.92205 363.82928 42221.58804
6.85000 -6074.18285 6.04414 -783.77177 409.47181 380.52692 56266.15617
6.95000 -6017.43436 8.37569 510.72627 301.60417 239.03103 42863.47660
7.05000 -5969.46119 9.58013 -76.86864 298.19795 298.83370 56351.07611
7.15000 -5921.78185 6.49072 311.57829 304.48785 375.02431 62729.48634
7.25000 -5879.87881 5.00300 438.43834 313.61797 288.09721 50457.38174
7.35000 -5830.89949 4.92051 -713.82182 289.42334 338.22390 41674.13276
7.45000 -5777.56356 2.48522 473.87853 285.90115 394.37090 35996.48328
7.55000 -5726.65209 9.49417 -343.55062 312.85972 354.01716 39577.05478
7.65000 -5673.82773 15.09717 -63.38681 540.03269 354.81871 38210.68971
7.75000 -5633.74280 0.94087 275.27516 235.73143 238.15622 38777.04046
7.85000 -5584.77433 7.65103 447.43504 255.76760 249.89647 32319.54069
7.95000 -5532.65281 8.45959 -279.86069 311.14680 217.20244 28500.93484
8.05000 -5477.85958 13.71112 -29.78844 309.44685 297.63458 31233.52910
8.15000 -5428.51366 6.10087 596.57388 230.04799 266.93713 52891.36787
8.25000 -5381.65394 12.65978 970.85790 263.90169 244.27772 35886.41992
8.35000 -5337.32103 4.32010 634.03031 287.25755 286.65709 29507.44300
8.45000 -5288.76154 3.54372 239.87257 322.06175 362.32727 29304.93123
8.55000 -5239.36437 9.87782 -605.90035 218.81178 313.63026 24708.56745
8.65000 -5186.92769 3.58895 174.54020 415.40350 391.22104 26586.36891
8.75000 -5144.32808 6.39917 -477.48544 228.00924 181.23486 26065.88376
8.85000 -5099.38246 1.76944 403.51669 279.31052 209.83795 23917.63933
8.95000 -5057.96501 7.86225 -79.02964 893.40782 626.92734 24983.45737
9.05000 -5018.84149 5.85356 -157.20883 484.17512 214.21326 32893.37696
9.15000 -4970.21269 2.04841 336.98502 187.88835 191.95664 23943.33845
9.25000 -4928.08309 3.49565 -263.30408 216.15589 243.39122 22443.36982
9.35000 -4887.62759 5.95724 -89.46871 220.72893 426.91476 22700.35233
9.45000 -4849.97568 4.57729 52.50351 273.03567 907.14696 22589.41338
9.55000 -4812.32093 0.56416 -456.99838 214.67613 212.57635 17572.79978
9.65000 -4765.54003 1.93291 -138.08567 183.27545 271.19905 23669.92715
9.75000 -4729.99388 3.88307 191.72957 197.72529 253.57470 18701.13448
9.85000 -4700.41727 6.57493 344.86900 721.06078 155.77103 17640.08203
9.95000 -4664.25602 5.31479 291.63711 299.59649 241.64439 18116.00819
10.05000 -4626.24417 3.84088 200.77881 278.65945 2037.18060 19119.22860
10.15000 -4595.74746 8.25628 -26.94948 207.77795 204.93640 17316.17265
10.25000 -4559.41855 -4.78210 -366.72329 167.22778 529.89460 16478.93260
10.35000 -4524.72712 1.91006 290.12123 170.87466 369.70388 15434.97800
10.45000 -4490.62508 1.06063 -315.56081 135.99081 155.01023 28221.82803
10.55000 -4457.08659 4.83696 -308.28303 222.44532 247.82903 17121.49376
10.65000 -4420.27484 -0.63665 -27.20259 307.30566 198.14993 15207.43199
10.75000 -4391.90096 9.02618 -1248.13738 120.07049 239.12906 57797.92343
10.85000 -4356.40858 2.01213 137.97182 165.83185 134.08875 13023.19206
10.95000 -4320.20600 -0.72282 512.10020 347.25529 260.04302 13556.56233
11.05000 -4293.05748 3.41423 -89.90923 145.83764 128.99204 12699.83436
11.15000 -4255.18610 2.91566 4.74075 141.64431 182.81884 13703.65121
11.25000 -4229.27629 5.14444 44.67048 268.92339 397.89275 15606.82544
11.35000 -4197.94769 5.87140 -154.63593 217.67911 115.68846 12854.17436
11.45000 -4167.45342 7.01336 -357.31077 170.42778 196.85264 13774.23666
11.55000 -4138.95389 4.75188 -136.83351 163.21060 121.18723 11076.54273
11.65000 -4102.22846 3.81873 9.59184 138.23980 113.93401 13000.69812
11.75000 -4066.94618 0.06328 -558.47369 185.72132 137.74375 10480.59299
11.85000 -4040.89566 1.85167 -385.58153 301.17130 142.31205 10769.23386
11.95000 -4013.66035 6.07305 -150.10611 386.31134 157.63291 10161.67681
12.05000 -3980.19253 0.46568 -79.33952 115.31818 157.38839 11706.99640
12.15000 -3957.71493 0.17790 9.51459 159.16207 121.33241 9380.09180
12.25000 -3920.88525 5.15827 -138.58448 159.97914 147.06003 10380.62638
12.35000 -3897.32187 6.16754 -375.35661 143.46343 118.34786 8523.29988
12.45000 -3874.16128 5.89905 -86.69108 369.85551 241.84577 8383.20853
12.55000 -3831.24900 3.86689 -233.32700 125.52542 183.37579 9722.48239
12.65000 -3803.59237 3.12711 -117.61954 140.46026 132.21281 10156.26005
12.75000 -3777.62564 2.70473 -176.72254 2020.33316 1226.52611 8252.29733
12.85000 -3750.33463 3.95592 98.51469 284.82890 131.40229 7577.65329
12.95000 -3718.01851 -1.29765 119.24957 144.84343 134.49450 8251.47781
13.05000 -3696.24511 4.29761 202.62231 267.75260 105.74595 8754.29163
13.15000 -3664.45119 2.76789 -90.47030 99.00957 116.83680 8613.82002
13.25000 -3632.65859 1.79849 -115.51464 105.67050 144.64255 7698.92767
13.35000 -3607.43832 0.18626 -483.16995 149.79723 110.49100 7380.45990
13.45000 -3581.45681 1.48237 -315.86455 274.43825 125.77332 12235.31332
13.55000 -3554.81014 3.81238 48.85904 125.14255 117.61402 7886.56557
13.65000 -3526.88924 0.88812 -201.30641 82.36993 81.76078 6628.00224
13.75000 -3498.11045 4.33187 266.60557 151.13376 130.91606 9950.83692
13.85000 -3478.26528 0.19131 216.48854 95.35329 86.54936 7453.77739
13.95000 -3455.09970 2.04474 -90.50187 88.96352 118.14852 5919.31015
14.05000 -3429.13641 1.74116 -82.42343 154.07591 318.45158 6226.26976
14.15000 -3401.54950 -0.06677 85.74358 122.15102 94.63935 5466.72237
14.25000 -3378.60992 -0.70424 -110.03344 166.38218 96.78142 6372.68054
14.35000 -3355.04710 4.70370 148.43373 81.92923 85.65254 5624.05843
14.45000 -3325.90913 4.15068 -78.50412 158.61926 191.32630 5673.86418
14.55000 -3310.76521 -1.99687 -23.36495 126.67443 166.14159 5884.60658
14.65000 -3297.08732 -0.29618 80.93520 1706.39352 238.61580 5752.47782
14.75000 -3271.49328 6.02795 -103.73634 112.57768 204.12237 6386.72183
14.85000 -3238.14217 3.74330 202.64164 194.27165 134.44763 6030.07684
14.95000 -3219.96368 2.91565 194.91943 103.68934 99.61495 5199.35956
15.05000 -3199.80756 2.74446 -112.36066 78.66627 77.11217 4450.14284
15.15000 -3185.90849 1.91613 134.43147 295.26524 95.03218 4878.15397
15.25000 -3153.05428 -4.77281 444.90314 82.41244 303.16508 6125.27158
15.35000 -3130.83827 6.38338 195.82170 93.38881 102.76778 5075.35042
15.45000 -3108.39423 0.70140 85.08688 57.51845 82.20763 5919.13473
15.55000 -3084.21755 4.30295 78.13610 190.82613 110.35146 5744.05720
15.65000 -3068.96444 0.77873 75.81774 66.99465 79.50040 5026.85613
15.75000 -3046.08405 1.37973 33.46098 132.34862 61.04598 4437.65495
15.85000 -3028.60921 4.37433 68.45570 92.98940 103.93544 4577.84295
15.95000 -3001.76902 5.93098 33.82814 84.32711 84.17001 4636.62855
16.05000 -2994.36936 1.13998 43.24839 163.38897 174.87973 3688.46849
16.15000 -2968.62508 5.36838 83.26626 65.60163 62.05108 3445.27704
16.25000 -2939.64558 8.80423 -98.11753 240.57979 244.80902 4491.04610
16.35000 -2928.37297 2.85250 -4.47715 75.86065 60.39348 3198.18590
16.45000 -2912.39017 3.18855 256.21717 91.80458 72.25290 4007.17133
16.55000 -2890.25171 4.86478 19.09996 81.75327 77.95704 3885.91080
16.65000 -2866.07508 1.71911 -214.48883 70.83598 67.74551 4092.95297
16.75000 -2849.96291 0.60041 -84.93852 92.83790 157.00526 4288.33560
16.85000 -2827.98678 0.45223 161.25644 75.10969 64.39659 4518.15844
16.95000 -2816.31428 1.89111 90.87603 66.40104 73.88162 3419.69131
17.05000 -2794.91299 4.06690 -95.43453 99.77063 57.17748 3003.50934
17.15000 -2776.92127 2.21069 94.06141 63.09291 63.80506 3036.86768
17.25000 -2758.84443 -1.18137 167.20977 67.17422 75.66028 3802.94322
17.35000 -2745.61793 -0.37174 1.89544 78.26194 54.25435 3149.73767
17.45000 -2726.57290 -0.00532 209.40248 92.36169 60.61924 3074.93976
17.55000 -2710.49602 0.15393 0.58428 3497.70249 389.19113 3583.81060
17.65000 -2694.58381 1.06961 66.57583 59.06591 54.25358 2873.97614
17.75000 -2675.39025 1.63493 135.95829 47.80357 53.01260 2773.89920
17.85000 -2662.40770 1.79491 160.19579 60.19365 49.38111 2641.23655
17.95000 -2644.94667 3.29754 -62.57682 106.81993 127.80707 2980.07229
18.05000 -2626.88607 -2.13904 28.58437 73.24208 52.21230 2804.29254
18.15000 -2610.78409 1.64974 17.21266 69.79228 58.04103 2275.31916
18.25000 -2596.19272 3.00018 -7.83882 44.51725 38.90781 2465.35800
18.35000 -2577.50058 5.08593 175.55743 61.07082 109.13925 2527.04877
18.45000 -2564.45352 -0.07911 99.82097 51.26656 45.41491 2840.27977
18.55000 -2549.95989 -0.48084 200.76138 256.49594 90.94668 2268.61171
18.65000 -2532.29203 5.45029 -127.53547 41.82975 123.38597 1948.64608
18.75000 -2516.25324 1.35938 -68.75405 74.25461 61.46859 2356.69724
18.85000 -2500.75203 1.22318 -8.43011 43.51288 48.66142 2268.87871
18.95000 -2486.40034 0.22279 -91.87208 37.90439 34.61656 2308.58374
19.05000 -2469.87337 0.79626 -97.39828 144.14557 66.40597 2463.15513
19.15000 -2455.38256 3.55619 -1.65399 40.18226 61.02943 2262.76400
19.25000 -2435.70407 0.73196 59.86213 88.07331 39.32127 2223.69498
19.35000 -2427.66153 0.03665 42.62208 38.05423 48.50892 2988.94179
19.45000 -2413.18165 0.48307 17.69628 33.76809 33.18666 1572.82080
19.55000 -2399.47552 -2.03696 12.69992 71.69266 56.88600 1979.94406
19.65000 -2385.66133 -0.79212 -34.94077 35.07641 49.84994 1923.31991
19.75000 -2376.23138 0.42576 65.64371 58.30017 50.83003 2263.60699
19.85000 -2356.79430 0.06083 -6.05783 104.87397 65.10145 2104.59480
19.95000 -2344.78476 1.66211 22.35900 54.39153 63.90408 1729.99449
