0.125 0.000 0.001 0.002
0.375 0.000 -0.001 0.055
0.625 -0.003 0.018 0.272
0.875 -0.030 -0.009 0.614
1.125 -0.034 -0.010 1.181
1.375 -0.062 0.023 1.969
1.625 -0.123 0.034 2.881
1.875 -0.150 0.029 3.862
2.125 -0.152 0.023 5.343
2.375 -0.187 0.025 6.676
2.625 -0.140 0.021 8.161
2.875 -0.248 0.021 9.931
3.125 -0.247 0.101 11.595
3.375 -0.243 0.023 13.221
3.625 -0.296 0.067 15.351
3.875 -0.366 0.089 16.624
4.125 -0.378 0.141 17.468
4.375 -0.291 0.175 18.921
4.625 -0.394 0.094 19.347
4.875 -0.485 0.121 20.578
5.125 -0.489 0.056 21.225
5.375 -0.469 0.017 21.880
5.625 -0.464 0.141 22.391
5.875 -0.588 0.035 23.515
6.125 -0.481 0.016 24.428
6.375 -0.386 -0.089 24.675
6.625 -0.455 -0.015 24.643
6.875 -0.410 -0.048 25.038
7.125 -0.467 -0.019 24.696
7.375 -0.495 0.081 24.542
7.625 -0.487 0.159 24.818
7.875 -0.552 0.074 23.527
8.125 -0.385 0.101 23.944
8.375 -0.547 0.084 23.515
8.625 -0.529 0.095 24.074
8.875 -0.533 0.176 24.206
9.125 -0.447 0.056 23.098
9.375 -0.507 0.031 24.114
9.625 -0.535 -0.019 23.044
9.875 -0.567 0.034 23.211
10.125 -0.621 0.046 24.327
10.375 -0.528 0.036 21.896
10.625 -0.509 0.064 23.503
10.875 -0.557 0.047 22.204
11.125 -0.482 -0.022 21.379
11.375 -0.494 -0.071 21.904
11.625 -0.512 -0.001 21.705
11.875 -0.532 0.010 20.552
12.125 -0.474 0.000 20.553
12.375 -0.346 0.032 18.980
12.625 -0.430 0.068 18.630
12.875 -0.357 0.053 18.581
13.125 -0.377 0.060 18.601
13.375 -0.378 0.062 17.877
13.625 -0.354 0.110 17.032
13.875 -0.346 0.150 16.417
14.125 -0.324 0.157 15.724
14.375 -0.355 0.141 15.320
14.625 -0.338 0.146 14.472
14.875 -0.302 0.145 12.921
15.125 -0.278 0.185 13.294
15.375 -0.277 0.110 11.827
15.625 -0.279 0.167 11.446
15.875 -0.286 0.200 11.191
16.125 -0.313 0.184 10.948
16.375 -0.324 0.146 10.604
16.625 -0.299 0.202 9.919
16.875 -0.400 0.145 9.579
17.125 -0.407 0.148 10.003
17.375 -0.444 0.123 9.467
17.625 -0.448 0.123 9.365
17.875 -0.383 0.069 8.169
18.125 -0.352 0.089 7.931
18.375 -0.392 0.022 7.891
18.625 -0.401 -0.026 7.591
18.875 -0.336 -0.025 7.075
19.125 -0.272 -0.046 5.772
19.375 -0.277 -0.070 6.127
19.625 -0.254 -0.066 6.026
19.875 -0.228 -0.088 5.863
