0.12500 0.05920
0.37500 0.03490
0.62500 0.08053
0.87500 0.12108
1.12500 0.17472
1.37500 0.21769
1.62500 0.20995
1.87500 0.26952
2.12500 0.25305
2.37500 0.26653
2.62500 0.29023
2.87500 0.27095
3.12500 0.29740
3.37500 0.30043
3.62500 0.27010
3.87500 0.27281
4.12500 0.24008
4.37500 0.22857
4.62500 0.20778
4.87500 0.16925
5.12500 0.14174
5.37500 0.11105
5.62500 0.09476
5.87500 0.04353
6.12500 0.04765
6.37500 0.02277
6.62500 0.02670
6.87500 0.02868
7.12500 0.01976
7.37500 0.01338
7.62500 0.03595
7.87500 0.03282
8.12500 0.03078
8.37500 0.05078
8.62500 0.05158
8.87500 0.03833
9.12500 0.06474
9.37500 0.05128
9.62500 0.04168
9.87500 0.06673
10.12500 0.07231
10.37500 0.06474
10.62500 0.08572
10.87500 0.08642
11.12500 0.06130
11.37500 0.10244
11.62500 0.10117
11.87500 0.12518
12.12500 0.11022
12.37500 0.09220
12.62500 0.09857
12.87500 0.07422
13.12500 0.03536
13.37500 0.04355
13.62500 0.04077
13.87500 0.02591
14.12500 0.04449
14.37500 0.04285
14.62500 0.01141
14.87500 0.03189
15.12500 0.02160
15.37500 0.03352
15.62500 0.00413
15.87500 0.03440
16.12500 0.01144
16.37500 0.07510
16.62500 0.08422
16.87500 0.02422
17.12500 0.08065
17.37500 0.11756
17.62500 0.08998
17.87500 0.05673
18.12500 0.03262
18.37500 0.02336
18.62500 0.05531
18.87500 0.07739
19.12500 0.05601
19.37500 0.03130
19.62500 0.02741
19.87500 0.05073
