0.05000 0.00000 0.00000 0.00000 0.00000 0.00000 0.00000
0.15000 -367.05056 -25.52203 -58553.58188 1631.50792 1073.66852 700552.59907
0.25000 -519.44057 -132.57658 -54144.91876 1993.34392 1034.81142 548957.52345
0.35000 -299.81561 -143.54771 -8127.62728 2933.24320 1019.54464 654329.82989
0.45000 -137.23369 1.18433 -90917.58558 2567.49249 1030.63075 1432223.42232
0.55000 -726.50796 -79.59231 -101656.49532 2590.25833 1119.61097 1985137.75751
0.65000 -790.55276 -92.38473 -90693.18663 2422.24554 1095.29180 1008863.12317
0.75000 -727.49874 -96.06461 99951.57146 2438.14047 1172.62830 1705568.03076
0.85000 -915.15138 6.13607 -14321.95769 2328.72160 1182.00608 1452702.56847
0.95000 -1273.19482 -65.26465 98661.19604 2262.78637 1145.23884 1369089.07049
1.05000 -1260.95153 77.54079 -25797.74269 2097.52966 1218.30246 1693863.05383
1.15000 -1283.00194 114.55096 11059.16500 2104.63847 1284.41007 1032773.19855
1.25000 -1555.55983 35.08924 -55689.60046 1906.13963 1362.10184 1716751.63873
1.35000 -1833.27037 -30.22951 -9142.88055 1622.00005 1376.55517 987671.76264
1.45000 -2118.32422 49.07821 -24037.35561 1354.79704 1363.43645 1976738.14462
1.55000 -2510.31087 10.05454 -99470.17425 995.30957 1332.47536 1364297.92708
1.65000 -2818.66014 3.39280 -45443.36800 760.64972 1253.90829 1513482.19361
1.75000 -3111.01710 30.35934 -93988.27846 609.40400 1139.27093 2043562.06060
1.85000 -3294.52178 -5.96535 153430.89835 494.46817 1043.26417 1943829.31453
1.95000 -3388.39769 2.29398 -39633.91139 418.83058 998.22885 1450142.92092
2.05000 -3513.85008 -25.97531 12258.47787 350.95818 954.05017 1610932.64592
2.15000 -3608.03329 22.00017 79072.53908 307.05619 883.87569 1574998.17312
2.25000 -3675.57328 -23.25629 46575.09397 286.22476 823.10938 1758567.35146
2.35000 -3759.46851 -15.05173 -48154.15238 266.45303 785.30459 1942130.79391
2.45000 -3789.91370 5.26770 -19461.20713 251.66119 732.89766 1745306.29782
2.55000 -3854.35476 6.55742 -22011.30801 231.56299 685.51308 2226511.20643
2.65000 -3882.58249 21.71253 -22093.76113 208.93614 662.29082 2160887.86240
2.75000 -3901.20432 6.01565 64220.18615 191.64689 646.13852 1976650.71070
2.85000 -3937.17710 13.99381 -38233.74393 195.19083 630.12091 2108555.51455
2.95000 -3954.81175 0.93873 -82749.87592 193.86044 576.31262 1988786.95403
3.05000 -3963.63013 -5.02297 30146.14370 192.92894 581.32742 1699794.97279
3.15000 -3981.34407 8.14207 7257.89480 204.73443 547.51361 1987298.03773
3.25000 -3990.92677 -6.01428 26423.73883 202.25221 521.91158 2588190.64739
3.35000 -4003.10803 11.48214 86828.74866 208.10788 499.19504 2715120.82157
3.45000 -3985.90030 -1.09983 -82031.43342 209.63216 479.00855 2776293.61510
3.55000 -3993.39831 0.86208 14180.43071 216.82272 467.04704 2025817.54638
3.65000 -3974.02882 -14.69859 36740.75952 217.97553 449.90822 2696464.61253
3.75000 -3980.43635 -3.00786 -65615.86802 221.20501 434.88400 2386387.58594
3.85000 -3958.53979 -11.82304 33201.22557 212.88678 407.24268 1868098.41900
3.95000 -3965.62169 -18.70331 69427.21859 227.53554 400.55005 2027857.54525
4.05000 -3947.33899 -0.68230 8277.49335 225.97173 389.47131 2383495.37745
4.15000 -3924.85204 -0.01407 44585.50550 211.95096 375.05997 1773477.80342
4.25000 -3917.67101 -6.59060 -62395.07583 219.25088 362.78497 2250268.30033
4.35000 -3902.52646 -2.86435 6553.65258 211.41004 352.51685 2147972.82935
4.45000 -3891.26941 -3.37899 42682.08273 209.29691 340.10951 2228901.19367
4.55000 -3881.55978 -0.31458 68778.95440 208.60817 333.46338 2378849.33786
4.65000 -3873.70612 -0.06608 22838.77327 206.63616 318.24939 2389240.65050
4.75000 -3845.60990 6.35982 -54594.99709 204.30790 307.58553 2342514.17449
4.85000 -3838.18843 -0.42263 16270.76301 201.65103 309.96273 2049380.45067
4.95000 -3814.58777 -1.49320 19231.61005 192.61661 291.46438 2496524.52953
5.05000 -3804.64671 9.18041 56093.29765 195.87288 282.35188 2661148.32998
5.15000 -3786.82036 -15.28742 7183.97487 195.35906 280.05481 2346160.97989
5.25000 -3764.90599 6.04643 -150079.03754 191.74100 275.82245 2061751.96618
5.35000 -3753.06698 -3.25584 -40190.84350 192.94314 267.95585 2430831.16300
5.45000 -3730.93003 5.34874 -63034.36297 191.30235 260.13760 2579529.48645
5.55000 -3706.28891 -2.53859 -20177.37906 186.60215 250.07435 2524705.89960
5.65000 -3690.96903 5.39489 24717.98364 182.79454 246.49768 2315412.32493
5.75000 -3681.64628 4.02756 45760.63227 187.04727 238.59696 2541225.78390
5.85000 -3657.24642 4.44436 -12932.27713 185.83595 234.96772 2331239.12418
5.95000 -3634.92864 -4.55336 27755.23170 178.19908 222.86839 2271226.33966
6.05000 -3620.26771 -5.72920 2280.83785 180.86325 224.10075 2529502.94944
6.15000 -3611.38125 -9.86214 -17619.86178 174.92762 214.89181 2217646.44632
6.25000 -3587.43900 6.49507 8926.71791 178.94888 211.22057 2161449.12583
6.35000 -3566.91959 -2.87668 -83819.36064 176.77207 208.93315 2533215.89800
6.45000 -3547.57293 3.08051 9194.51075 173.43886 205.85172 2469761.26850
6.55000 -3527.92722 -2.31926 -33764.96131 169.30973 197.84613 2260221.89189
6.65000 -3515.03938 0.72668 17445.97844 173.45042 191.31398 2497284.24799
6.75000 -3491.57211 2.47812 37647.89702 166.98475 192.30096 2143992.05746
6.85000 -3477.13521 -7.30318 21314.10830 164.06190 184.60300 2344481.15134
6.95000 -3459.49154 -2.12364 46939.03864 165.60703 182.20439 2401449.23820
7.05000 -3442.51513 0.09270 -30074.84003 164.88421 179.16448 2439800.34652
7.15000 -3420.07119 7.92699 -17121.08762 161.28472 175.86714 2381669.66654
7.25000 -3403.91682 4.62109 11857.87882 160.13201 169.21799 2456819.59372
7.35000 -3384.71434 -1.76737 -5290.25842 157.89696 168.82270 2262056.26492
7.45000 -3365.22959 -2.58121 -93098.56540 152.05842 160.99604 2596251.60925
7.55000 -3344.70134 0.20362 27974.13423 149.40970 164.36822 2024227.74295
7.65000 -3337.56254 -0.38599 -34071.58792 149.31384 157.94996 2597930.68111
7.75000 -3318.81188 -4.92754 103761.21917 146.78890 158.52047 2448232.49367
7.85000 -3302.20025 -0.10250 -18017.79820 143.29102 154.06207 2140936.05637
7.95000 -3285.59588 -1.31769 61775.80090 143.86147 149.89817 2352849.56718
8.05000 -3265.97961 6.04304 43911.04542 140.34382 147.21314 2294856.86986
8.15000 -3257.81305 -0.08030 30209.44073 140.56873 147.61438 2308037.75042
8.25000 -3232.73211 -2.86447 10623.61947 142.47381 141.33375 2121614.76434
8.35000 -3222.29298 2.85519 11756.04402 139.79623 139.64142 2055880.58555
8.45000 -3203.87200 0.71115 -45407.51166 140.17122 137.86431 2392949.36591
8.55000 -3191.51595 2.89154 -15995.44538 139.05275 136.18880 2366772.09858
8.65000 -3172.53542 0.31621 -22301.01611 143.26224 134.20060 2047934.27411
8.75000 -3158.72987 2.92760 -16969.81172 140.39838 132.18016 2395119.64320
8.85000 -3136.01441 0.28336 -107915.75110 140.63841 130.38835 2276555.88618
8.95000 -3131.46393 -1.89033 60141.42715 141.84550 129.90567 2408142.41950
9.05000 -3105.01355 3.58433 15964.05624 138.42118 126.70773 2010738.95023
9.15000 -3092.04165 3.42917 -5572.11692 137.83582 123.37880 2059983.21907
9.25000 -3079.75828 0.24366 5007.06973 139.88159 123.12380 2295011.82285
9.35000 -3063.45477 0.15869 12682.01390 142.09329 121.62085 2382206.79650
9.45000 -3048.84527 3.31383 -33164.77916 139.71299 117.51958 2791333.61375
9.55000 -3034.39105 1.47089 46185.25964 139.08642 115.70092 2409548.38874
9.65000 -3016.62370 0.88337 -41688.96488 140.16851 114.42419 2308513.21497
9.75000 -3005.65895 -0.07948 -51023.47717 140.87898 113.23471 2229772.14970
9.85000 -2983.88396 0.72487 -105698.94137 139.53478 109.06250 2161195.04312
9.95000 -2973.75458 -2.06125 -87233.13630 138.80526 109.51430 2311602.62533
10.05000 -2952.09310 0.41663 33833.22217 135.85956 108.04506 2185646.32457
10.15000 -2938.92462 0.45640 40456.56382 133.98278 106.29641 2310087.01293
10.25000 -2916.45469 2.55288 -13677.71614 135.03359 103.27956 2252958.49414
10.35000 -2906.39782 -3.39656 -21908.25608 133.23240 101.60812 2186078.65904
10.45000 -2886.93738 -2.18869 13864.63820 134.43106 101.17131 2243889.87124
10.55000 -2875.27922 -0.47793 -8349.83785 132.75688 101.45233 2244385.65446
10.65000 -2858.57704 3.52058 -7495.19246 132.54394 98.38272 2013463.83351
10.75000 -2839.84468 -0.85574 -52830.38240 130.80528 97.63236 2248957.59480
10.85000 -2828.05763 0.83483 -86268.24096 130.31741 97.09261 2158442.78330
10.95000 -2813.60400 1.63673 -1946.24729 129.45668 94.58573 2297642.68729
11.05000 -2797.29167 3.53579 -51038.69523 126.79612 93.24740 2229567.29037
11.15000 -2784.44249 -1.39771 30226.10484 125.98340 91.59435 1995893.32028
11.25000 -2768.09807 -0.39945 15597.14665 124.67331 90.13747 2300297.68710
11.35000 -2755.25773 -1.63029 41398.45531 124.41785 89.77774 2211407.22903
11.45000 -2740.56478 1.54482 -8715.47552 125.53603 87.54367 2067588.53618
11.55000 -2721.30989 1.06778 -21213.08134 119.36572 86.91309 2179188.95121
11.65000 -2712.52801 -0.16481 46377.26908 121.12053 88.49056 2108463.19418
11.75000 -2701.75474 -2.45044 45617.17929 120.56579 87.54868 2092913.32038
11.85000 -2685.20803 -1.53796 -21955.36896 119.96317 85.13784 2097103.94838
11.95000 -2673.21731 2.19334 2584.73797 118.19397 84.50713 2190466.21242
12.05000 -2657.61256 0.39042 59963.34807 117.75747 81.58674 2152094.55772
12.15000 -2644.28296 0.25812 9544.00106 117.81962 82.56866 2178387.90908
12.25000 -2629.33123 0.07717 40586.75555 115.79678 81.11646 2113881.75039
12.35000 -2615.76211 1.17920 -3239.24400 114.96098 79.13573 2163783.99377
12.45000 -2606.81939 -1.59748 -42524.50500 114.40112 80.40215 2162302.20395
12.55000 -2597.65069 0.10484 -2744.63365 112.74607 77.05467 2102996.85757
12.65000 -2581.33288 3.89369 52605.06289 111.63748 77.30799 2035688.42977
12.75000 -2565.08058 -0.77795 -11137.38200 110.49605 75.70504 2125282.85704
12.85000 -2554.83633 -0.46749 -33950.84822 109.49271 75.56253 1829612.81902
12.95000 -2541.51468 0.57210 49856.86588 108.78766 73.89211 2135118.02138
13.05000 -2531.92273 -0.82881 26505.01604 109.29726 73.27638 2074812.49234
13.15000 -2515.22886 -0.50093 -58657.72813 109.06870 73.07396 2080444.91904
13.25000 -2504.01547 0.46855 -16384.67894 107.99252 70.34345 2215633.59405
13.35000 -2492.87422 -2.74470 -2777.40824 107.04411 71.07298 2110820.56567
13.45000 -2479.49700 -1.04682 61224.59892 106.60302 71.12384 1899206.90465
13.55000 -2469.81898 1.16612 36773.98911 110.04463 69.40738 2013349.32317
13.65000 -2454.31986 -0.64270 -2467.10031 111.16139 69.07475 2299495.00214
13.75000 -2443.91755 1.88793 75250.21003 107.24168 68.90528 1911370.46740
13.85000 -2428.83215 2.28086 37455.81719 105.77474 66.17033 2048974.34620
13.95000 -2416.10376 3.50066 -7181.33941 105.85784 66.76513 2037969.07394
14.05000 -2407.75690 0.86830 34322.59913 105.88530 65.38926 1828514.42067
14.15000 -2394.74992 -1.58798 2787.05464 104.09748 66.06336 2104365.67056
14.25000 -2385.72732 -0.00824 -32744.19446 103.89429 66.13822 2152746.09572
14.35000 -2367.00536 0.09124 -79624.03514 101.01728 64.87124 2123554.20988
14.45000 -2358.87988 0.71482 -23220.15192 101.76908 63.63572 2051136.24719
14.55000 -2349.20034 -1.39737 -3022.88727 101.36105 63.93542 2048006.41999
14.65000 -2335.72966 1.62446 3256.36445 100.19196 62.21814 2051224.64485
14.75000 -2324.03596 1.87597 24857.85181 98.55383 62.84193 2026024.08526
14.85000 -2313.29848 1.85564 -67600.57780 97.77890 61.36125 2010067.02414
14.95000 -2301.42546 1.51399 26598.51884 95.81879 61.23895 1786362.45274
15.05000 -2292.87316 -0.53858 336.54351 95.68360 63.20749 1939077.70151
15.15000 -2278.24236 0.81642 32320.56021 94.99851 60.69250 2077616.74532
15.25000 -2271.17461 -1.79903 54517.96496 92.94025 59.85848 2097116.23236
15.35000 -2259.24006 -1.10012 -1861.36233 90.76621 59.48424 2122810.35738
15.45000 -2248.97570 0.17714 1218.05710 92.87786 59.58778 1827173.83247
15.55000 -2238.90057 0.19628 -15849.30292 91.60888 58.99175 1805548.77513
15.65000 -2226.11748 -2.41866 25333.33341 89.04660 58.73499 2070758.15691
15.75000 -2220.74852 -1.86852 -74241.45944 89.65430 56.85118 2123280.53631
15.85000 -2210.40896 0.14254 46244.10103 90.04152 57.03630 2044254.24655
15.95000 -2199.99455 2.15432 3140.88153 87.42537 56.84143 2079015.14202
16.05000 -2189.81738 -0.37296 -39810.02909 86.89289 56.65550 1914200.13973
16.15000 -2177.32339 0.31286 -37618.59140 87.70513 55.66842 1772132.21465
16.25000 -2167.96377 1.54742 -13999.80160 89.10408 56.87811 1952921.87345
16.35000 -2157.92109 -1.12093 41870.90973 87.36146 54.43561 1858307.73245
16.45000 -2148.68346 0.47101 -26601.27202 88.10545 53.27032 1922411.20021
16.55000 -2140.46181 1.56361 32001.78059 85.09234 53.95204 2010105.57505
16.65000 -2126.86565 -0.27700 -20150.86642 84.39027 52.24568 1969456.93466
16.75000 -2118.78817 -0.49157 -4847.24393 85.18349 52.50102 2132515.52261
16.85000 -2108.44837 1.24641 8433.30706 84.27421 51.73478 2019732.71932
16.95000 -2096.54865 -0.13915 -19494.77500 83.33067 53.01807 1905143.51922
17.05000 -2089.66962 0.75886 15563.82771 82.11931 52.53961 1847219.34812
17.15000 -2084.82217 0.61733 28554.53041 83.60423 50.47288 1834617.94741
17.25000 -2069.76761 0.08410 -114078.79280 81.56151 51.15011 1885459.45522
17.35000 -2061.00845 0.38362 30545.95689 80.14329 50.79041 1916946.86476
17.45000 -2052.51047 1.07118 7571.98501 82.23753 49.56697 2043725.44485
17.55000 -2043.12899 0.80347 35511.67545 81.38593 48.63286 1859843.90301
17.65000 -2032.65070 0.47964 33712.26511 80.40442 48.67978 2057602.75827
17.75000 -2022.33519 0.40181 62812.86677 77.79190 47.91030 1845603.21352
17.85000 -2016.69781 -1.04839 -2920.27557 77.85654 47.44066 2012773.07541
17.95000 -2008.62079 -1.11300 -15666.89586 77.05467 47.79989 1960118.13326
18.05000 -2003.88815 -1.26729 18526.32677 75.97612 47.35507 2000585.78278
18.15000 -1990.53535 1.31655 41270.73124 75.81597 46.26209 1866669.79290
18.25000 -1983.24893 -0.38576 69592.44001 75.56724 46.41284 1864569.61158
18.35000 -1975.23391 0.29775 37123.28575 74.45979 45.44045 1811108.57193
18.45000 -1966.05977 1.49368 -30766.33750 75.78677 45.10342 1855591.83490
18.55000 -1957.81382 0.26006 4975.42158 74.39889 45.52495 1992291.83853
18.65000 -1947.56343 -0.75084 1387.70672 75.19151 44.86788 1863541.31424
18.75000 -1938.92532 1.59514 -62437.75522 74.38114 44.63060 2029558.69157
18.85000 -1931.62319 -0.11709 -41014.60451 73.59395 43.74449 1735064.19360
18.95000 -1918.67380 1.07402 -25877.86957 73.66876 44.01157 1733763.78548
19.05000 -1914.42621 0.96792 69035.61877 70.88783 42.82419 1726973.32276
19.15000 -1908.26893 0.49843 -21284.72439 71.58047 42.81366 1777597.99967
19.25000 -1894.93651 -0.07987 19314.13676 71.52945 41.71738 1797788.22216
19.35000 -1888.68833 -0.39406 14682.92278 71.13653 41.37806 1753361.84164
19.45000 -1880.11703 0.22768 -9904.85153 71.00705 43.24622 2052296.41379
19.55000 -1872.06838 1.04143 53879.08572 68.93297 41.00949 1813972.14899
19.65000 -1861.90532 -0.35670 45399.81881 70.04619 40.59172 1832348.90327
19.75000 -1854.44825 -0.48471 42034.24290 69.06927 40.33000 1809688.45017
19.85000 -1848.54566 0.64213 20972.18665 68.15527 40.80086 1942405.03585
19.95000 -1840.53777 0.69716 -5384.85262 68.50419 39.97186 1808710.08135
