0.12500 0.05429
0.37500 0.04495
0.62500 0.06650
0.87500 0.11858
1.12500 0.15095
1.37500 0.17246
1.62500 0.20109
1.87500 0.22248
2.12500 0.21839
2.37500 0.23760
2.62500 0.22130
2.87500 0.22610
3.12500 0.20749
3.37500 0.20147
3.62500 0.19435
3.87500 0.19507
4.12500 0.20464
4.37500 0.19042
4.62500 0.16448
4.87500 0.14012
5.12500 0.12608
5.37500 0.09060
5.62500 0.07446
5.87500 0.08431
6.12500 0.09903
6.37500 0.05852
6.62500 0.07796
6.87500 0.07315
7.12500 0.08217
7.37500 0.08287
7.62500 0.08943
7.87500 0.05061
8.12500 0.07033
8.37500 0.05671
8.62500 0.04901
8.87500 0.05667
9.12500 0.06032
9.37500 0.04425
9.62500 0.07427
9.87500 0.04907
10.12500 0.02793
10.37500 0.05225
10.62500 0.02666
10.87500 0.03548
11.12500 0.04864
11.37500 0.02655
11.62500 0.02688
11.87500 0.03159
12.12500 0.02940
12.37500 0.02173
12.62500 0.01410
12.87500 0.04572
13.12500 0.02641
13.37500 0.01819
13.62500 0.04023
13.87500 0.05025
14.12500 0.09242
14.37500 0.05986
14.62500 0.07828
14.87500 0.10597
