0.05000 -7295.77920 -857.21403 -485.83298 6364.71234 6996.74289 3621.80819
0.15000 -7388.46372 431.07842 187.17957 6355.32073 7439.81729 8154.96594
0.25000 -10954.99654 124.31138 1006.62912 5751.96605 5606.20509 12050.80036
0.35000 -11966.93802 28.63927 119.26726 5086.68354 4905.42905 13423.22395
0.45000 -13102.06221 255.89080 -252.87822 5326.83477 4247.47034 13951.13182
0.55000 -14000.90599 -13.10318 367.12435 5470.88708 4206.24117 14247.22043
0.65000 -14224.93142 90.89081 -366.92827 5385.49683 3916.82845 14419.89234
0.75000 -14608.72921 105.96205 260.20122 5269.16251 3904.85346 14063.43348
0.85000 -14337.23950 -83.04515 104.57652 5276.76563 3941.81465 14056.78532
0.95000 -14431.55074 37.42309 -43.41680 4969.60255 3715.89513 13491.11852
1.05000 -14224.12970 117.46583 -195.69224 4645.44004 3528.00650 13038.56798
1.15000 -13891.01208 -58.30329 -69.01169 4525.03277 3479.62495 12690.07516
1.25000 -13604.18407 -88.31461 -89.91001 4293.70803 3366.67740 12196.99700
1.35000 -13303.55036 26.31062 -58.69483 4155.91298 3304.89713 11865.89934
1.45000 -13004.14627 -3.71919 191.17582 3842.06770 3207.94271 11355.04032
1.55000 -12831.36118 51.42991 312.73805 3730.53466 3233.33294 10929.99661
1.65000 -12715.25320 -105.86723 -159.14293 3545.14956 3154.81918 10286.41636
1.75000 -12498.92179 -65.79262 15.06032 3450.30074 3100.69362 9986.60078
1.85000 -12258.52597 -41.47847 -224.16463 3300.19360 3109.87425 9638.81538
1.95000 -12168.19010 11.60603 20.38501 2957.67516 2999.84396 9074.12742
2.05000 -11856.65406 -51.30490 223.37114 2954.41295 2923.93584 8829.32034
2.15000 -11625.24552 -29.94083 -51.35912 2817.36905 2787.79932 8539.83624
2.25000 -11505.55082 -37.13459 -77.65289 2766.55780 2772.32968 8213.14279
2.35000 -11276.66381 3.79294 79.23043 2580.42258 2721.86134 8002.57519
2.45000 -11162.80256 30.02878 44.00596 2520.95566 2685.11669 7683.51388
2.55000 -10953.48519 -43.75711 -137.48662 2332.40336 2624.53642 7467.30085
2.65000 -10806.08973 25.66220 -80.36372 2302.55536 2534.78692 7058.22119
2.75000 -10694.33751 23.65334 75.15424 2168.93601 2462.13271 6812.11606
2.85000 -10494.14314 -12.64247 -20.62915 2117.36564 2440.28055 6699.92366
2.95000 -10364.32454 -19.26531 145.98033 1971.07619 2378.85933 6451.93795
3.05000 -10183.25629 -24.18263 -10.25618 2063.70885 2267.77790 6217.21716
3.15000 -9936.77153 -30.65410 -168.49328 1865.54720 2143.77940 6130.25160
3.25000 -9909.55451 37.42011 -57.63620 1697.65949 2214.24139 5775.20858
3.35000 -9706.38382 -35.43649 141.08062 1745.61012 2115.82326 5622.17218
3.45000 -9639.40078 82.06286 -161.39790 1576.78198 2084.67092 5376.83310
3.55000 -9449.12935 -26.31264 -43.67308 1593.58758 1986.74420 5260.36471
3.65000 -9268.63119 28.21664 -49.89018 1586.28971 1962.17165 5156.99125
3.75000 -9175.14650 51.33257 -133.36858 1587.90494 1939.61020 4969.67170
3.85000 -8983.22102 -39.80808 -86.30153 1493.73867 1849.44374 4917.82924
3.95000 -8846.82590 -23.99671 -43.81854 1436.51972 1828.16115 4821.55653
4.05000 -8773.74223 -46.98156 -25.18015 1357.01437 1766.32005 4712.88847
4.15000 -8715.54355 -30.32253 -16.08104 1408.80234 1714.91856 4426.22541
4.25000 -8554.41357 21.86217 -164.98591 1350.96319 1660.82053 4448.11484
4.35000 -8474.37772 -59.77108 -0.59561 1221.55014 1644.48313 4296.92354
4.45000 -8257.83143 7.41098 -27.02763 1198.51427 1550.02599 4245.14597
4.55000 -8216.77571 -34.44264 14.54767 1164.22476 1530.82616 4022.50076
4.65000 -8088.47145 -34.77295 8.96987 1082.55050 1516.25700 3994.09969
4.75000 -7916.64047 46.06496 146.92460 1177.03374 1493.36383 3917.83296
4.85000 -7809.11867 36.48654 -89.01991 1086.71133 1391.78214 3824.75816
4.95000 -7688.49834 32.24218 30.88564 1145.68833 1369.88601 3757.28296
5.05000 -7643.55338 25.05503 44.44340 1038.99685 1326.63037 3608.06507
5.15000 -7540.78361 -21.73706 23.56392 1041.94929 1417.63240 3520.80184
5.25000 -7439.48728 27.31170 221.06024 1081.59994 1402.77359 3487.86973
5.35000 -7333.54492 -8.47410 166.08495 953.01964 1314.00052 3319.54026
5.45000 -7294.50453 16.88295 -113.84168 1104.38177 1309.15652 3237.39270
5.55000 -7144.37513 2.38499 -31.38962 825.31328 1223.08492 3199.70587
5.65000 -7033.49268 34.01202 106.05816 1044.88860 1164.62073 3143.13491
5.75000 -6967.15650 8.07991 -9.32400 836.61903 1135.05419 3040.88473
5.85000 -6829.58394 37.53332 -52.24065 845.38982 1077.56580 3062.28482
5.95000 -6751.00095 8.72082 144.52768 805.82440 1038.04788 3010.28948
6.05000 -6702.85528 41.99714 4.81042 775.68053 1058.15292 2890.66650
6.15000 -6602.89561 -4.95891 -125.46118 716.45529 999.21459 2794.09561
6.25000 -6545.70537 36.10210 -54.52404 723.47322 987.23834 2675.18062
6.35000 -6456.20472 -40.28067 4.39127 731.54803 991.38791 2676.65888
6.45000 -6403.76009 41.32058 -63.72122 714.49006 971.40023 2712.31781
6.55000 -6310.98989 -17.59556 -72.05681 801.88972 987.06159 2606.43005
6.65000 -6226.09662 -18.67813 -23.13667 671.97997 930.57390 2549.90919
6.75000 -6141.92925 45.21767 -52.26628 739.65392 920.43870 2486.04409
6.85000 -6077.84438 -30.84187 -124.75747 598.54279 865.39223 2387.85542
6.95000 -6037.27020 -19.21100 99.93349 592.29007 932.35724 2399.71533
7.05000 -5957.86086 -0.04638 28.89610 557.73261 767.36962 2319.03471
7.15000 -5878.26729 -1.76148 57.90681 576.38562 899.70192 2285.12619
7.25000 -5794.97817 -5.75522 -49.39295 551.21432 742.87219 2212.42256
7.35000 -5738.98606 31.35042 -47.90912 630.42871 735.74248 2194.24691
7.45000 -5677.84492 1.64503 133.85062 552.36401 710.71399 2087.82279
7.55000 -5633.19274 -17.16945 -69.11745 533.66187 696.02134 2014.59538
7.65000 -5563.50672 12.67298 -77.79255 483.09373 666.61286 2022.81403
7.75000 -5487.06541 -12.48143 -107.13001 635.65396 764.93577 2084.86184
7.85000 -5404.65705 -3.53104 41.50841 557.54527 652.73749 1949.18477
7.95000 -5360.65988 9.04932 -0.22862 533.27222 670.31235 1875.90321
8.05000 -5320.05013 -33.48840 20.76595 457.00115 595.09077 1763.47809
8.15000 -5254.01301 -9.87773 81.76855 470.08832 580.82866 1776.82136
8.25000 -5204.50745 -11.18719 13.82106 484.87061 583.99883 1775.12574
8.35000 -5135.99327 0.42477 18.77899 685.98460 803.59989 1683.44672
8.45000 -5098.80046 -21.35206 13.29236 516.34607 666.86632 1636.84225
8.55000 -5063.26997 -12.89023 -89.15687 398.59337 538.34889 1564.72588
8.65000 -5004.09848 28.97064 -8.49892 492.31394 570.31085 1692.14181
8.75000 -4902.24531 4.42222 15.34590 525.48067 605.30428 1518.26580
8.85000 -4867.53653 -11.43598 -29.87915 462.54173 511.90876 1537.25040
8.95000 -4815.30625 -21.54959 23.64309 385.08160 471.63784 1482.72413
9.05000 -4759.92904 11.20530 -55.34351 464.06756 577.89406 1469.41508
9.15000 -4748.26029 -4.92644 -80.53196 394.15955 476.72528 1347.90252
9.25000 -4685.36840 -14.39481 -54.85000 428.40625 469.36357 1337.63786
9.35000 -4666.24016 -44.86051 31.50827 347.09395 483.71406 1300.01819
9.45000 -4589.09944 0.30751 -16.65089 366.01839 435.17021 1272.86662
9.55000 -4554.53391 -32.47090 30.97453 402.04459 452.17902 1208.61790
9.65000 -4513.18579 6.52393 72.24876 364.11200 503.80082 1213.62474
9.75000 -4485.90321 -14.57906 39.09544 425.32672 438.57266 1186.56941
9.85000 -4445.53806 -32.10704 3.59170 419.31286 487.69909 1177.58068
9.95000 -4401.39106 -13.96708 -39.00449 383.86376 685.17304 1217.53431
10.05000 -4372.18336 -21.20959 -16.24646 380.39966 430.97651 1109.53925
10.15000 -4339.94952 -31.05723 -6.22685 378.78235 468.32790 1105.37135
10.25000 -4306.17975 -29.70296 44.36921 306.57844 388.56010 1023.99116
10.35000 -4291.75660 -33.76212 11.80976 309.77143 357.65735 1032.25313
10.45000 -4247.63219 -30.07783 6.66436 312.24139 341.24184 1002.38225
10.55000 -4222.48360 -45.84205 1.10307 310.73419 333.16097 953.54751
10.65000 -4201.76938 -20.15205 -30.10974 314.77339 399.37128 968.93888
10.75000 -4189.87216 -36.18278 13.41688 417.77293 410.24016 930.97886
10.85000 -4135.21363 -28.08312 33.91352 302.23108 347.02069 904.38396
10.95000 -4105.70440 -14.32224 2.90106 357.11261 345.23976 868.67321
11.05000 -4069.86827 -6.49063 -0.62939 496.71522 578.31616 958.51169
11.15000 -4080.34174 -32.82047 -19.46330 353.88513 340.01475 800.63855
11.25000 -4025.22907 -32.97514 -1.64555 318.20309 310.96429 798.60221
11.35000 -4013.99386 -18.25004 38.95967 327.87156 294.38677 796.17792
11.45000 -3989.41083 -31.53263 15.87985 297.12267 296.14688 792.44168
11.55000 -3969.65826 -14.46747 -1.76503 466.73127 300.80717 755.52102
11.65000 -3926.17250 -23.99891 4.15640 352.64877 334.83431 929.89205
11.75000 -3926.04428 -22.49583 -16.25882 318.30026 250.90601 693.04242
11.85000 -3878.39296 -23.09742 12.80904 409.90889 344.72093 684.02643
11.95000 -3853.63030 -12.90597 22.70124 290.82826 250.36097 643.35826
12.05000 -3818.87395 -18.84093 -15.69987 809.87703 481.81523 643.72702
12.15000 -3790.73462 -13.61819 -10.02495 285.53812 216.40199 619.21535
12.25000 -3763.17752 -16.17522 24.54203 311.87496 216.72166 634.36524
12.35000 -3740.46140 -1.12116 25.01118 275.25040 277.50990 583.28343
12.45000 -3706.09746 -4.68175 17.09347 454.89857 287.39126 598.83716
12.55000 -3676.97482 -2.28512 21.21960 245.78182 192.10503 542.13378
12.65000 -3651.32249 -7.74130 -4.33663 254.17338 199.77380 533.35335
12.75000 -3605.42411 -16.20367 20.53209 477.34640 296.49601 539.71485
12.85000 -3621.56629 -0.21445 4.85311 282.85548 209.83138 533.24214
12.95000 -3569.49974 -22.89020 41.69840 410.55492 558.91409 603.48975
13.05000 -3551.15468 -11.00901 26.40777 238.53428 177.05864 519.07272
13.15000 -3531.96236 -14.17753 20.62729 225.58120 162.25243 529.67407
13.25000 -3501.80492 -0.22707 44.30996 237.75360 164.05174 496.93447
13.35000 -3482.28097 0.82099 27.24034 242.88667 222.68191 457.23043
13.45000 -3446.36822 -9.80551 6.89000 262.24397 330.51134 447.99184
13.55000 -3431.14924 -4.51376 33.66178 206.91706 179.80638 462.89393
13.65000 -3385.75705 10.59222 46.94453 231.60192 146.62297 477.88562
13.75000 -3364.29397 7.30078 -3.95644 190.09061 160.50913 467.47909
13.85000 -3346.13910 2.58785 -3.07936 186.48188 248.67003 434.66184
13.95000 -3336.22719 0.36660 32.26791 189.12895 148.58237 442.56657
14.05000 -3310.26175 3.70754 12.09582 235.01872 172.61821 430.85803
14.15000 -3283.07199 -4.15183 -24.15960 171.37146 154.29802 414.50014
14.25000 -3238.70880 -6.10295 -18.89749 179.72159 191.41383 400.06400
14.35000 -3236.92244 -1.54509 9.14451 165.22939 145.65302 403.97486
14.45000 -3210.15023 2.99211 25.34496 192.64665 123.81293 424.47050
14.55000 -3205.21095 7.37342 -4.01673 175.53317 146.53327 390.44712
14.65000 -3169.52320 5.18059 1.56499 163.02812 116.74534 403.65564
14.75000 -3146.37483 9.99808 -7.56704 187.59991 130.03864 345.89978
14.85000 -3120.30031 0.48223 7.86828 194.42819 122.03069 368.44300
14.95000 -3112.20269 -2.97773 12.16014 151.22095 153.67040 366.89048
15.05000 -3088.01474 -12.36772 7.29368 137.18802 122.48928 390.32661
15.15000 -3055.56178 -15.55664 1.06440 339.31898 313.22458 352.93969
15.25000 -3046.93804 6.01523 -7.52917 164.03960 136.96581 355.98308
15.35000 -3034.21258 -5.97073 -20.74796 145.96758 112.92348 364.60510
15.45000 -2996.59716 5.57045 37.42412 126.07927 106.27852 326.15673
15.55000 -2980.41662 -4.10845 24.07675 194.08715 140.87135 400.45501
15.65000 -2960.13545 -0.72160 7.15733 123.17846 116.12108 321.76070
15.75000 -2943.23416 2.08676 16.61246 158.23886 108.68920 311.14509
15.85000 -2919.32001 3.38384 52.66845 113.96878 126.58123 316.27605
15.95000 -2928.44072 -2.11417 32.70955 241.41828 118.60040 311.44771
16.05000 -2892.05564 -2.91074 13.52235 163.15702 124.77659 323.49726
16.15000 -2867.35026 5.16805 3.71643 131.02097 93.34297 354.00526
16.25000 -2856.46360 -2.78391 37.22398 130.99624 106.74569 343.59257
16.35000 -2840.34685 -5.06093 2.22979 99.46117 94.90012 291.27796
16.45000 -2817.10982 7.11295 31.27541 115.61345 104.88122 302.17627
16.55000 -2807.93545 24.35898 -5.53537 321.43635 562.72773 398.88436
16.65000 -2775.20612 2.05869 14.98368 124.19362 94.23639 304.85999
16.75000 -2751.49812 5.95649 20.17094 96.91124 88.90871 300.25509
16.85000 -2745.42805 -1.84317 19.76065 100.71432 91.54268 268.41487
16.95000 -2731.77466 5.13565 39.89881 113.33411 99.29910 287.42318
17.05000 -2713.62844 1.91811 31.27969 91.04570 118.14585 283.29918
17.15000 -2695.39784 -0.57868 25.26096 95.12772 73.76030 254.96322
17.25000 -2682.45753 -1.43856 17.37460 99.00737 82.41926 275.11696
17.35000 -2666.66198 -2.14292 45.27484 103.71415 86.05431 267.59418
17.45000 -2639.98970 -7.87714 62.98786 169.48310 93.40257 269.58458
17.55000 -2627.87848 6.06587 35.53258 140.48603 89.74585 252.22921
17.65000 -2620.41825 21.60829 36.78902 140.17899 165.34913 403.31660
17.75000 -2592.59344 -4.58845 40.95588 99.48232 200.03527 310.84592
17.85000 -2569.11720 -1.22322 36.45992 86.54651 89.04543 252.48503
17.95000 -2564.82189 8.02625 39.45192 116.85779 103.53535 262.42191
18.05000 -2559.01589 -0.18675 19.12508 126.51206 63.42324 225.13959
18.15000 -2548.57020 -5.39586 46.55971 100.28708 62.42704 242.60848
18.25000 -2512.01612 4.99361 24.43929 94.62068 103.97796 258.79078
18.35000 -2513.49892 -7.76493 34.95800 80.90224 76.77362 232.75843
18.45000 -2486.58233 -0.35396 42.86877 85.67213 68.24705 241.41322
18.55000 -2481.51789 -6.73333 49.11714 75.27049 64.47726 214.12404
18.65000 -2435.94875 -23.92613 74.94262 406.41797 413.79061 428.04804
18.75000 -2453.17062 0.46236 19.42761 72.84281 57.44290 225.96358
18.85000 -2451.66998 1.34325 36.46365 122.17068 66.56339 221.94494
18.95000 -2427.15144 -2.42267 32.13293 65.71672 55.36327 207.18271
19.05000 -2421.58667 -0.72853 48.67432 95.52181 71.19832 200.01065
19.15000 -2397.66911 -1.74897 48.25446 77.51700 90.89724 238.85463
19.25000 -2370.88810 -0.36910 23.30657 73.76528 60.22498 204.68806
19.35000 -2370.18743 -0.47837 8.16762 132.14518 93.77346 204.02256
19.45000 -2360.62429 2.69957 -7.36478 102.98648 97.10991 185.79560
19.55000 -2333.30529 -10.74189 45.72828 277.38940 144.75588 236.76152
19.65000 -2328.10721 -3.30494 52.93846 99.56996 80.28307 187.53232
19.75000 -2322.64366 2.91917 28.04030 57.28738 56.99543 167.70245
19.85000 -2306.32088 22.90807 19.60162 133.36235 417.58703 319.40787
19.95000 -2300.90544 -0.90779 16.38361 73.21266 67.96703 168.38505
