0.12500 0.00453
0.37500 0.01496
0.62500 0.05408
0.87500 0.10382
1.12500 0.15706
1.37500 0.17443
1.62500 0.21133
1.87500 0.22816
2.12500 0.24748
2.37500 0.27820
2.62500 0.29944
2.87500 0.34387
3.12500 0.38281
3.37500 0.39002
3.62500 0.40362
3.87500 0.43467
4.12500 0.45773
4.37500 0.42748
4.62500 0.43764
4.87500 0.42258
5.12500 0.40669
5.37500 0.38266
5.62500 0.35633
5.87500 0.35632
6.12500 0.32648
6.37500 0.33568
6.62500 0.32949
6.87500 0.33099
7.12500 0.29814
7.37500 0.29108
7.62500 0.25482
7.87500 0.20379
8.12500 0.18520
8.37500 0.13178
8.62500 0.13185
8.87500 0.10820
9.12500 0.08412
9.37500 0.09736
9.62500 0.06473
9.87500 0.06439
10.12500 0.06934
10.37500 0.06792
10.62500 0.06223
10.87500 0.05046
11.12500 0.05220
11.37500 0.04862
11.62500 0.08283
11.87500 0.06118
12.12500 0.04077
12.37500 0.03173
12.62500 0.04446
12.87500 0.02741
13.12500 0.06147
13.37500 0.05097
13.62500 0.06905
13.87500 0.07990
14.12500 0.07057
14.37500 0.11365
14.62500 0.09258
14.87500 0.09382
15.12500 0.11155
15.37500 0.12995
15.62500 0.15267
15.87500 0.11833
16.12500 0.14500
16.37500 0.13415
16.62500 0.12102
16.87500 0.13758
17.12500 0.10603
17.37500 0.14366
17.62500 0.11580
17.87500 0.15432
18.12500 0.12190
18.37500 0.10726
18.62500 0.17183
18.87500 0.13050
19.12500 0.07830
19.37500 0.08651
19.62500 0.06288
19.87500 0.02257
