0.05000 17584.89324
0.15000 24554.00728
0.25000 26071.57457
0.35000 24241.48460
0.45000 21536.39519
0.55000 20175.48736
0.65000 18347.63724
0.75000 16606.01099
0.85000 15400.27272
0.95000 14383.93936
1.05000 13178.97802
1.15000 12185.30092
1.25000 11286.11432
1.35000 10657.94186
1.45000 10034.10222
1.55000 9328.97860
1.65000 8881.83273
1.75000 8451.69081
1.85000 7690.98516
1.95000 7557.05318
2.05000 7057.89034
2.15000 6679.77355
2.25000 6372.68908
2.35000 6127.52849
2.45000 6024.02450
2.55000 5525.62617
2.65000 5500.16409
2.75000 5217.44766
2.85000 4990.36097
2.95000 4704.53987
3.05000 4751.39227
3.15000 4526.66255
3.25000 4328.56283
3.35000 4184.72889
3.45000 4020.40722
3.55000 3906.18410
3.65000 3722.31817
3.75000 3748.83805
3.85000 3607.02520
3.95000 3347.25288
4.05000 3350.78818
4.15000 3108.12989
4.25000 3071.26675
4.35000 3080.36824
4.45000 2886.94012
4.55000 2837.76100
4.65000 2710.42536
4.75000 2723.21667
4.85000 2614.75499
4.95000 2480.18274
5.05000 2476.52989
5.15000 2342.19902
5.25000 2258.85670
5.35000 2212.08046
5.45000 2230.07815
5.55000 2103.14519
5.65000 2056.74329
5.75000 2004.88958
5.85000 1951.58561
5.95000 1949.32799
6.05000 1864.72041
6.15000 1860.27206
6.25000 1812.60459
6.35000 1729.79240
6.45000 1689.11913
6.55000 1649.09493
6.65000 1646.46192
6.75000 1586.59848
6.85000 1500.50885
6.95000 1464.79556
7.05000 1424.54252
7.15000 1392.96867
7.25000 1380.90772
7.35000 1355.33193
7.45000 1294.32713
7.55000 1253.35705
7.65000 1262.57261
7.75000 1167.55117
7.85000 1167.68714
7.95000 1160.48234
8.05000 1127.24314
8.15000 1094.52992
8.25000 1085.56321
8.35000 1052.03591
8.45000 1042.05489
8.55000 1005.15155
8.65000 956.85263
8.75000 964.34218
8.85000 900.56376
8.95000 916.69871
9.05000 903.93076
9.15000 862.70025
9.25000 840.96512
9.35000 828.42523
9.45000 807.04096
9.55000 800.33442
9.65000 761.48074
9.75000 767.43147
9.85000 735.82209
9.95000 711.17024
10.05000 718.91519
10.15000 718.84684
10.25000 711.62367
10.35000 668.53170
10.45000 657.25298
10.55000 639.23599
10.65000 628.22766
10.75000 633.08956
10.85000 619.57083
10.95000 620.53747
11.05000 610.76832
11.15000 552.48719
11.25000 550.65378
11.35000 536.10523
11.45000 558.92269
11.55000 524.06594
11.65000 528.85895
11.75000 494.40123
11.85000 514.57178
11.95000 489.56396
12.05000 522.35309
12.15000 483.05303
12.25000 482.08217
12.35000 464.29274
12.45000 475.39095
12.55000 451.52232
12.65000 457.77011
12.75000 457.54212
12.85000 422.69320
12.95000 442.00368
13.05000 426.27363
13.15000 433.56231
13.25000 416.28865
13.35000 406.11289
13.45000 402.52391
13.55000 374.72439
13.65000 394.03672
13.75000 373.98679
13.85000 360.29943
13.95000 362.93404
14.05000 354.83881
14.15000 375.55840
14.25000 342.87195
14.35000 341.99531
14.45000 332.84467
14.55000 346.65575
14.65000 341.68810
14.75000 330.18501
14.85000 319.90191
14.95000 321.75155
15.05000 308.36696
15.15000 312.93402
15.25000 288.60849
15.35000 315.53933
15.45000 279.49003
15.55000 302.47816
15.65000 296.34063
15.75000 306.01565
15.85000 276.49011
15.95000 272.86062
16.05000 285.90462
16.15000 289.00621
16.25000 260.77048
16.35000 261.37181
16.45000 243.31603
16.55000 249.48759
16.65000 240.65761
16.75000 250.58033
16.85000 236.43546
16.95000 237.55743
17.05000 248.17552
17.15000 211.01175
17.25000 228.62538
17.35000 230.21397
17.45000 230.75632
17.55000 235.95109
17.65000 215.65520
17.75000 227.18180
17.85000 202.48776
17.95000 210.82661
18.05000 191.41422
18.15000 188.69208
18.25000 196.12017
18.35000 185.19600
18.45000 182.48768
18.55000 188.66710
18.65000 184.66766
18.75000 173.88624
18.85000 183.69881
18.95000 172.85708
19.05000 181.10426
19.15000 169.41383
19.25000 180.91244
19.35000 170.76506
19.45000 178.44451
19.55000 166.94071
19.65000 159.47179
19.75000 168.64067
19.85000 168.33639
19.95000 153.92481
