0.12500 0.04469
0.37500 0.02050
0.62500 0.00827
0.87500 0.00590
1.12500 0.01693
1.37500 0.01128
1.62500 0.00885
1.87500 0.01618
2.12500 0.00640
2.37500 0.01609
2.62500 0.02346
2.87500 0.02782
3.12500 0.02340
3.37500 0.02117
3.62500 0.00471
3.87500 0.01360
4.12500 0.00505
4.37500 0.00412
4.62500 0.01336
4.87500 0.01233
5.12500 0.02200
5.37500 0.01158
5.62500 0.02091
5.87500 0.00642
6.12500 0.00366
6.37500 0.00511
6.62500 0.00581
6.87500 0.01216
7.12500 0.00555
7.37500 0.00471
7.62500 0.00536
7.87500 0.01735
8.12500 0.00465
8.37500 0.00758
8.62500 0.01621
8.87500 0.00606
9.12500 0.00496
9.37500 0.00633
9.62500 0.01944
9.87500 0.00805
10.12500 0.00566
10.37500 0.00602
10.62500 0.01151
10.87500 0.00704
11.12500 0.00723
11.37500 0.01341
11.62500 0.01211
11.87500 0.01757
12.12500 0.01293
12.37500 0.01634
12.62500 0.01653
12.87500 0.01995
13.12500 0.02970
13.37500 0.02576
13.62500 0.01959
13.87500 0.01712
14.12500 0.01058
14.37500 0.01831
14.62500 0.01780
14.87500 0.03696
