0.05000 -743.66336 189.07711 140.74274 995.90619 1241.52447 1736.96510
0.15000 -1998.01120 60.35232 325.36326 1178.70884 1168.86912 2571.04094
0.25000 -2983.59680 84.34418 19.66691 1056.93668 956.14292 3554.11011
0.35000 -3703.01436 179.11363 -200.42471 1063.32601 762.14479 4233.19406
0.45000 -4024.08927 143.85848 -111.49042 1237.53951 645.78276 5092.81090
0.55000 -4486.04213 175.94638 -53.38519 1217.00384 548.45447 5387.59623
0.65000 -4811.51877 185.28575 -63.47855 1251.87275 482.17353 5678.13821
0.75000 -5085.36533 183.42910 -183.27372 1258.80347 417.54067 5875.52525
0.85000 -5224.77215 183.56361 -41.59807 1330.46254 380.54487 6108.93356
0.95000 -5445.95153 181.79472 135.89443 1275.74384 354.52435 6030.92750
1.05000 -5615.73449 182.04372 193.60678 1264.60602 331.88455 5990.52797
1.15000 -5747.61401 177.29056 71.69514 1199.51943 309.53367 5933.63086
1.25000 -5850.92408 180.92784 102.50270 1188.14938 295.02225 5893.23793
1.35000 -5942.73212 177.71291 94.13139 1152.17577 296.56401 5866.05493
1.45000 -6025.83946 175.99884 92.18212 1131.58266 280.55984 5829.39397
1.55000 -6162.92427 188.29837 123.96906 1090.65952 275.77278 5618.88322
1.65000 -6279.68387 179.59874 92.58900 1068.35084 268.65201 5463.05139
1.75000 -6393.07319 182.71174 -40.40842 1023.34380 259.15177 5400.61333
1.85000 -6529.12001 188.66333 86.98535 979.57274 253.52561 5254.78089
1.95000 -6617.22018 189.82434 -18.08399 976.93548 248.47524 5136.86730
2.05000 -6681.79297 188.97068 56.55159 932.39288 233.83368 5071.75661
2.15000 -6765.83378 190.55719 1.77694 918.01696 235.66167 4877.32381
2.25000 -6829.40630 185.33601 -66.07334 846.57419 226.63995 4781.12335
2.35000 -6862.61448 190.08643 25.35193 864.39036 216.46149 4692.75688
2.45000 -6917.83741 186.30141 27.30362 817.09922 209.32140 4539.25331
2.55000 -6962.51223 188.78387 -52.45234 769.79534 201.25921 4419.43772
2.65000 -6959.28056 193.68982 -15.42413 798.94917 190.25760 4367.94183
2.75000 -6998.19683 185.80207 -20.68107 700.11263 180.55668 4233.55664
2.85000 -7001.00606 189.79338 83.54921 687.94676 175.22828 4122.42455
2.95000 -7002.60861 180.93256 48.64081 666.88696 171.05943 4018.31263
3.05000 -6994.03065 180.27763 9.61774 647.72279 168.96963 3948.06440
3.15000 -6998.12457 178.36546 107.12128 623.92796 167.79617 3811.45913
3.25000 -6980.53876 171.55380 21.85548 594.69080 160.88289 3749.55524
3.35000 -6985.66220 173.69947 -48.75441 565.93959 156.40286 3572.32653
3.45000 -6947.50223 169.79622 12.36929 551.92280 150.89524 3534.07075
3.55000 -6915.19276 165.35925 18.60508 528.95144 144.48324 3443.46414
3.65000 -6881.54115 163.50462 -28.69470 506.91629 141.49594 3346.32402
3.75000 -6849.64599 159.37960 -35.75972 494.22433 140.36351 3267.47450
3.85000 -6826.17490 158.79324 -52.18698 461.64906 135.54095 3175.02239
3.95000 -6791.16626 153.42898 17.27669 442.10622 130.64876 3128.28806
4.05000 -6769.73573 149.81718 -36.71904 416.74854 124.93003 3025.68273
4.15000 -6726.60023 147.61599 -25.09093 412.71685 121.44874 2985.80893
4.25000 -6684.50963 143.55840 32.45950 407.33982 118.57371 2926.05859
4.35000 -6646.11748 142.25852 -38.83063 387.01391 118.46117 2844.23270
4.45000 -6623.08685 140.82847 -9.62472 361.58337 119.09932 2746.35774
4.55000 -6585.39302 139.97123 -67.32427 393.26171 115.13799 2711.75500
4.65000 -6567.67498 135.39821 -1.00725 369.74739 114.40977 2628.32806
4.75000 -6531.15389 134.25783 -30.91443 370.49907 109.80194 2615.91776
4.85000 -6512.44931 132.62151 -56.24728 341.10373 106.61841 2528.26502
4.95000 -6476.70679 130.06493 -18.06120 345.48487 107.24575 2473.78034
5.05000 -6451.09174 128.10186 -3.27451 320.66218 106.09868 2408.72638
5.15000 -6417.50654 128.99410 -20.31979 310.00953 106.29892 2342.27179
5.25000 -6371.95063 122.88573 -25.28426 305.54896 104.95262 2319.34572
5.35000 -6331.49696 122.46989 -20.13062 302.95985 102.45816 2261.14137
5.45000 -6288.18751 123.23955 -14.67194 293.37889 100.72934 2204.17589
5.55000 -6251.19770 118.90381 -2.23404 271.81850 100.30120 2160.78892
5.65000 -6213.45052 116.74371 -34.66258 262.99555 98.95923 2096.62398
5.75000 -6177.66000 111.44562 -26.37867 260.78942 100.75688 2037.29980
5.85000 -6142.69587 112.09316 -18.11487 253.17247 100.77983 2007.68450
5.95000 -6104.76138 109.79644 -23.04158 264.17112 99.25517 1985.01577
6.05000 -6070.90011 111.01582 13.27636 229.86864 97.87501 1925.67313
6.15000 -6038.58619 105.68267 23.80557 229.87331 94.12230 1878.51849
6.25000 -6000.11516 104.62281 -3.92685 240.38054 92.36938 1829.55191
6.35000 -5962.06152 102.77035 -20.60773 230.47633 91.08901 1810.08742
6.45000 -5921.97552 100.80837 -3.22639 230.50882 90.33237 1780.57336
6.55000 -5890.64462 98.26632 -37.04711 216.04379 87.79245 1724.41740
6.65000 -5857.05515 98.09680 -3.10984 228.15588 87.59895 1683.85540
6.75000 -5825.18716 95.52236 -22.17755 207.86151 87.28457 1648.57359
6.85000 -5793.27705 95.35128 9.33135 211.43434 86.15631 1618.14542
6.95000 -5759.36367 91.61675 -3.38361 208.43205 84.77765 1580.91259
7.05000 -5723.83461 92.33306 -22.31263 208.76927 82.26836 1549.96299
7.15000 -5692.56994 89.60049 -37.51164 203.01188 80.11799 1503.88431
7.25000 -5654.89999 88.94645 -25.38039 209.22458 79.66727 1486.62835
7.35000 -5624.69028 87.75614 6.26945 192.66107 77.02953 1436.77357
7.45000 -5578.58399 85.71322 -40.29563 192.86546 77.48577 1427.41179
7.55000 -5546.41172 84.24742 18.91921 190.33920 76.89399 1377.60886
7.65000 -5504.52069 82.08785 -11.16473 184.17467 76.86001 1345.58746
7.75000 -5456.82640 79.07196 -45.55900 197.22518 74.01758 1336.80241
7.85000 -5413.98283 80.29242 -13.17258 190.04854 70.70640 1301.78621
7.95000 -5369.67746 77.51883 -36.01057 172.92350 69.84607 1267.83742
8.05000 -5317.77461 78.73965 -41.89028 166.99739 67.51045 1243.60232
8.15000 -5278.57764 75.78398 -12.90822 154.44048 67.67782 1193.11114
8.25000 -5233.20859 74.72661 -3.86246 146.52734 64.86200 1175.33933
8.35000 -5185.01889 73.03768 -13.77088 152.75251 63.73481 1156.11697
8.45000 -5134.33676 72.05500 -26.13966 170.06444 62.57387 1147.78494
8.55000 -5095.51390 70.19064 -14.35538 136.64768 61.98510 1101.09985
8.65000 -5050.84960 68.48139 -1.39543 137.93755 61.60438 1086.43611
8.75000 -5009.84687 68.23135 -17.78494 137.88597 60.46933 1058.33228
8.85000 -4979.35646 66.76214 -22.95027 127.65004 61.23608 1022.53272
8.95000 -4944.10713 65.90083 -3.53330 120.68788 59.51330 991.27879
9.05000 -4904.56124 64.92073 -19.47205 125.11884 58.37016 986.48498
9.15000 -4870.30757 63.88354 -29.04209 126.68672 58.06903 965.75963
9.25000 -4837.17435 63.62693 -29.68862 120.11154 57.65004 934.57195
9.35000 -4797.32603 62.82263 -2.09898 121.16254 55.06321 932.77845
9.45000 -4768.27879 60.47011 -2.26035 119.42704 54.58584 902.50692
9.55000 -4728.42350 60.14766 -16.70075 129.19459 53.72274 898.93268
9.65000 -4693.58998 58.21541 30.44131 117.81248 51.35751 878.58042
9.75000 -4653.42687 58.37364 8.96076 140.71302 50.82708 871.94195
9.85000 -4614.19793 57.60438 12.55968 117.07488 50.72287 859.61751
9.95000 -4579.52584 54.90356 24.62064 111.13655 49.93116 831.34079
10.05000 -4540.39755 54.01706 36.36094 105.26174 48.35448 809.57564
10.15000 -4499.07895 52.91929 30.57102 101.94416 48.40187 800.78936
10.25000 -4459.93287 52.14117 15.06987 95.00054 49.45610 769.76579
10.35000 -4422.38755 51.15795 -2.97319 93.94030 48.13593 765.62470
10.45000 -4383.99516 51.70950 14.40422 87.82333 45.34374 750.24665
10.55000 -4344.95373 48.23340 7.94750 126.55738 46.24054 736.37630
10.65000 -4312.96468 49.49303 27.36152 80.10961 45.28216 718.78888
10.75000 -4276.75766 48.62528 -12.28816 76.37074 43.79504 697.76320
10.85000 -4245.59344 48.16541 3.26665 77.54248 44.84173 680.02879
10.95000 -4208.28171 45.44226 -20.39016 78.47418 45.94655 669.21233
11.05000 -4176.62845 46.90441 -2.31925 93.60009 45.30807 655.50133
11.15000 -4145.52145 45.69942 -5.37578 69.89671 46.06401 642.49745
11.25000 -4117.14824 46.01962 6.48030 71.27532 44.68943 626.15171
11.35000 -4089.02343 46.51924 -4.92704 75.00976 43.28346 626.49005
11.45000 -4061.42156 45.01811 -9.96452 77.06203 44.32257 606.92745
11.55000 -4035.39302 43.75482 -6.08266 72.73230 43.01007 593.71399
11.65000 -4011.27378 43.50581 -9.29413 71.48001 42.03593 582.83028
11.75000 -3987.72382 42.46744 -14.70995 71.42858 43.07813 580.18270
11.85000 -3968.82914 43.54571 -25.73030 68.63813 43.26825 560.08219
11.95000 -3945.39652 41.83786 -8.77992 70.42840 40.44284 556.20058
12.05000 -3921.62139 41.03450 16.15271 87.40083 40.15616 550.12707
12.15000 -3899.01989 40.38799 10.11293 72.92698 38.88143 537.46257
12.25000 -3876.79566 39.98183 -7.53484 73.60693 38.62665 522.97204
12.35000 -3852.50777 39.42898 -5.97751 71.42352 37.80955 519.27965
12.45000 -3827.90666 38.49699 -10.24240 70.57796 38.78219 513.77554
12.55000 -3804.46422 37.96963 2.58265 69.56678 38.20239 498.65785
12.65000 -3782.48025 36.97576 14.33368 68.98648 36.53057 479.87271
12.75000 -3760.54910 37.02495 5.62203 67.33485 37.57603 468.04536
12.85000 -3735.41668 35.15806 -1.70877 67.01058 37.02230 459.18278
12.95000 -3708.52475 36.01454 10.17232 69.73960 36.89614 462.02541
13.05000 -3682.65655 36.89281 13.19541 66.79943 36.21428 454.95684
13.15000 -3652.67013 34.32444 22.90582 69.12025 34.47247 450.33734
13.25000 -3626.35975 34.90694 15.16062 63.67527 33.57154 432.89757
13.35000 -3597.29202 33.98586 7.67146 62.36960 34.41514 425.61236
13.45000 -3570.63180 34.74117 15.52533 58.05555 34.66968 410.44586
13.55000 -3541.02730 33.00538 4.14774 61.77394 35.13317 415.92689
13.65000 -3514.21126 34.08035 -8.65168 57.10878 33.87217 395.23781
13.75000 -3485.49561 32.38273 -1.56485 55.34284 33.80184 395.56741
13.85000 -3458.35128 31.11087 7.71955 53.26189 32.95229 385.90279
13.95000 -3432.22420 29.95697 17.66103 52.12328 31.83609 377.92627
14.05000 -3403.63856 30.53761 6.12789 49.99285 32.10757 372.54171
14.15000 -3375.45834 28.68279 -10.80042 48.46063 30.42294 369.40707
14.25000 -3352.23900 29.58562 -0.32193 43.72538 33.59142 344.77942
14.35000 -3323.52732 30.70420 1.40408 48.83472 32.24995 355.09376
14.45000 -3299.21707 27.66193 1.42859 43.35134 32.13190 341.34537
14.55000 -3274.19112 27.81680 -6.09463 41.02329 31.04179 329.44896
14.65000 -3249.84799 27.20322 -10.34837 40.76770 29.69635 313.62592
14.75000 -3221.32827 27.04131 -2.75129 39.25334 28.66928 317.43759
14.85000 -3196.43630 26.34173 -8.73959 36.89456 30.05022 308.71412
14.95000 -3170.15437 25.47231 -10.74832 37.84148 29.90241 308.14203
15.05000 -3148.02809 25.81318 -15.65411 36.69494 28.92795 296.79980
15.15000 -3124.43158 25.32578 -8.07299 34.53533 29.01521 290.67544
15.25000 -3101.16281 25.23654 14.01337 34.56264 30.41156 280.48225
15.35000 -3081.54802 24.47668 4.52684 35.13205 29.72553 281.64194
15.45000 -3058.80699 24.01555 9.85775 35.13401 30.22012 279.90297
15.55000 -3037.86888 24.05932 20.14413 34.79832 28.62817 269.86083
15.65000 -3017.93812 22.53757 15.36732 33.89025 28.96599 265.38858
15.75000 -2999.62242 24.22635 1.65862 32.88783 28.40590 263.50858
15.85000 -2983.30011 23.07060 14.65447 34.60202 30.15103 251.02963
15.95000 -2965.70576 21.92528 15.15395 34.24005 28.97168 252.85801
16.05000 -2949.06817 22.07252 19.67927 34.55156 29.49816 254.51063
16.15000 -2932.74129 22.49437 32.25817 36.38661 28.56882 252.00884
16.25000 -2916.33973 20.89733 16.42095 33.40968 29.46351 235.49572
16.35000 -2900.76926 21.32904 22.53386 33.04793 28.24810 234.64363
16.45000 -2881.47175 21.39426 28.39881 32.74660 27.65461 227.13885
16.55000 -2862.18502 21.56988 35.50600 33.85822 27.96822 233.04182
16.65000 -2846.61507 20.66815 38.97359 35.27877 26.25039 223.72908
16.75000 -2828.41716 21.19206 34.63313 32.53799 27.45317 220.23745
16.85000 -2811.58703 21.22506 16.99691 29.78671 25.76548 208.81286
16.95000 -2793.28756 19.36927 30.94020 31.33571 26.04157 219.29571
17.05000 -2775.56604 20.79458 33.98991 31.30943 24.94753 212.55122
17.15000 -2755.46538 20.71520 33.82880 33.25807 25.21800 218.47437
17.25000 -2739.77530 19.60129 34.31450 32.86267 24.93090 208.85043
17.35000 -2721.98285 17.87153 29.81900 33.29823 25.95968 205.86810
17.45000 -2704.83637 19.59026 28.86287 32.16677 24.26384 201.23573
17.55000 -2688.11296 20.19817 33.39932 31.83757 26.22702 196.76132
17.65000 -2671.73264 18.51266 34.05521 30.65026 24.72321 193.31485
17.75000 -2653.74781 18.27574 22.67680 31.13635 23.87946 197.92899
17.85000 -2638.65718 17.82370 24.26168 29.67803 24.38982 187.14764
17.95000 -2623.01447 17.86033 40.16208 28.76983 25.84033 182.53527
18.05000 -2608.71709 16.89709 21.49794 29.66046 24.10684 182.03552
18.15000 -2594.24250 17.68149 8.87028 29.33732 24.76325 184.20847
18.25000 -2578.35567 18.04733 23.39172 30.57490 24.44446 172.58731
18.35000 -2565.09741 16.64249 15.48462 29.95706 22.90722 177.99344
18.45000 -2551.65798 17.51651 11.96231 29.22002 23.32322 172.10754
18.55000 -2535.57581 17.26198 1.66931 29.67144 23.55588 171.27750
18.65000 -2521.74156 17.82945 5.17031 30.90995 23.19685 172.95737
18.75000 -2507.70090 16.16307 11.12183 28.98741 24.34536 169.51586
18.85000 -2495.76841 16.27053 -2.08896 27.89352 24.73071 167.35205
18.95000 -2483.27216 15.46827 2.24774 28.66716 22.31917 162.44761
19.05000 -2469.27396 17.65329 3.95796 28.40751 22.37496 164.71018
19.15000 -2455.99190 14.77391 -0.37782 28.13696 22.60818 159.10209
19.25000 -2442.42606 14.91665 1.06113 27.39985 21.43922 155.05749
19.35000 -2427.01341 14.17278 -14.43696 26.97670 22.56980 155.29730
19.45000 -2416.43780 15.45852 6.89380 27.95699 20.89496 154.31480
19.55000 -2400.62500 15.41409 1.50363 27.44906 22.43068 145.16890
19.65000 -2386.54310 15.47638 1.90156 28.25174 21.29228 152.63799
19.75000 -2373.43003 14.84126 6.02654 26.54004 22.57083 144.67497
19.85000 -2361.03390 14.19032 -0.00354 27.27956 22.40305 142.88372
19.95000 -2345.63624 14.25151 -4.68685 26.43875 21.62502 138.37517
