0.05000 -1018.22006 105.14422 -397.48880 1079.54855 1119.32112 1089.25549
0.15000 -1787.17056 140.38630 -329.53412 951.66590 998.69143 2477.46616
0.25000 -2593.44901 92.76660 -184.79953 1149.60773 1012.43511 3972.35356
0.35000 -3508.41349 67.90185 92.45941 1507.20828 1061.97768 4988.01228
0.45000 -4303.11220 61.03244 -511.04920 1727.41463 1181.06487 5936.34571
0.55000 -5088.91366 43.62697 -143.74393 1710.84699 1290.34402 6505.22391
0.65000 -5640.48502 47.51815 -113.97562 1834.35217 1348.88882 6765.36558
0.75000 -6023.76974 -6.95236 -141.27633 1947.29622 1391.17037 7023.22130
0.85000 -6384.12252 45.45599 86.51291 1947.45792 1442.27033 7141.66895
0.95000 -6544.99718 22.73741 6.33344 1958.48811 1507.99185 7166.72965
1.05000 -6728.01254 31.08495 -113.41142 1902.53803 1518.25671 7039.84133
1.15000 -6817.36946 8.56350 -158.82584 1912.39105 1548.04248 6979.26655
1.25000 -6909.02895 44.26750 -185.99181 1875.16308 1578.56799 6901.37538
1.35000 -6915.25887 -9.83499 109.33471 1845.82715 1620.94340 6746.70342
1.45000 -7033.94833 14.07371 167.24913 1739.82741 1641.13783 6515.44875
1.55000 -7075.52864 2.23120 -13.72958 1687.22573 1655.88216 6385.78065
1.65000 -7075.00321 29.26315 -69.08110 1653.96947 1657.79590 6306.07687
1.75000 -7225.12795 30.77778 100.61500 1532.07608 1701.82969 6001.11361
1.85000 -7269.60802 25.62992 45.89658 1484.98472 1688.88424 5842.46752
1.95000 -7324.23594 30.56546 74.10727 1420.34042 1716.24325 5661.29011
2.05000 -7301.99757 62.65291 63.95217 1370.07087 1679.42287 5561.31593
2.15000 -7307.92637 14.98968 18.48200 1313.59665 1672.51777 5407.99085
2.25000 -7238.12567 -16.11327 51.03021 1246.94381 1655.38640 5343.87210
2.35000 -7248.58632 -30.03760 84.10814 1134.28617 1632.00675 5131.27695
2.45000 -7213.24193 -3.36660 63.55533 1101.34072 1622.54338 5016.42399
2.55000 -7179.08428 -11.17948 94.07369 1046.72099 1603.66344 4887.34092
2.65000 -7174.50650 13.93290 -106.48613 970.06071 1584.03680 4710.03014
2.75000 -7180.28636 -19.05261 11.92434 888.78063 1549.82261 4551.46567
2.85000 -7124.52088 -6.28206 24.42035 860.87149 1520.84388 4505.84580
2.95000 -7076.82195 39.17751 73.24654 819.35648 1491.09704 4373.06847
3.05000 -7070.16033 -10.82657 -74.67834 774.82635 1464.78370 4193.90950
3.15000 -7035.35580 0.13570 4.58551 714.54172 1426.99898 4194.71448
3.25000 -6987.37566 13.58674 -41.86207 712.19453 1404.49900 4038.73991
3.35000 -6956.19957 39.10374 3.47212 642.23038 1365.50782 3961.68475
3.45000 -6920.51996 2.90123 -106.78902 629.44401 1353.45536 3844.58479
3.55000 -6884.41185 -8.09105 -21.21177 596.00231 1304.91584 3797.98940
3.65000 -6868.69963 2.23384 -21.13724 569.02717 1293.43185 3666.40288
3.75000 -6812.86728 18.94805 -27.69328 578.81835 1238.24717 3599.57137
3.85000 -6803.92885 6.68046 42.39827 543.94587 1211.78922 3537.64442
3.95000 -6785.64941 -11.40407 8.73968 545.86671 1182.30686 3444.28532
4.05000 -6747.89305 1.89644 51.27684 529.47597 1145.97230 3346.30379
4.15000 -6725.13170 -32.16399 -7.87974 530.83811 1124.77423 3289.57579
4.25000 -6704.82883 -6.85170 -16.46242 546.59502 1084.22130 3225.91655
4.35000 -6683.31269 -24.11715 25.18394 546.23460 1047.61575 3105.07733
4.45000 -6665.11559 6.40271 28.38211 524.60846 1020.31445 3030.43494
4.55000 -6631.50358 12.13795 -26.29060 562.38584 982.58899 3013.40895
4.65000 -6612.66269 17.41046 60.70073 564.72673 948.02906 2886.88613
4.75000 -6591.45959 9.68762 19.02831 594.86283 904.93363 2813.16975
4.85000 -6553.46224 27.27261 31.64482 590.48965 865.67300 2765.68777
4.95000 -6531.27288 12.48658 4.65988 584.39089 833.94708 2694.14281
5.05000 -6504.43983 12.69045 7.71569 578.99198 798.05645 2620.39208
5.15000 -6475.18520 14.46696 61.72890 583.54968 768.39488 2551.44017
5.25000 -6455.71804 24.75241 5.55025 599.10583 741.07406 2490.74988
5.35000 -6412.05737 5.91854 50.78617 609.77139 704.36305 2458.94782
5.45000 -6375.38825 14.48130 -6.85903 617.91158 666.58368 2392.50796
5.55000 -6348.26945 10.87355 8.70680 620.76221 639.37545 2306.11035
5.65000 -6302.21784 20.70676 -26.38202 615.26745 606.95591 2251.11527
5.75000 -6268.46051 15.80792 -22.02734 611.97455 574.55024 2189.81159
5.85000 -6214.58519 18.27722 -2.42199 589.70096 549.77450 2123.16447
5.95000 -6192.11053 22.44198 11.07216 600.27001 524.27062 2075.43548
6.05000 -6140.63061 20.91494 18.59836 591.60473 503.16982 2021.97399
6.15000 -6102.64693 20.31244 19.77341 562.99922 475.81440 1960.21963
6.25000 -6060.07605 31.40224 13.37181 551.41172 454.66809 1915.16849
6.35000 -6007.87504 23.00366 -15.64635 530.00357 435.58933 1886.76362
6.45000 -5952.70584 17.79958 20.44510 513.77812 411.53928 1846.04780
6.55000 -5913.33620 23.80816 58.75033 498.37653 389.13706 1775.17837
6.65000 -5871.72681 24.22169 27.13673 474.38044 373.88784 1751.91242
6.75000 -5846.60575 18.59935 53.38028 475.58851 357.36906 1699.40622
6.85000 -5804.17019 17.43774 28.23554 461.06526 341.73795 1679.43168
6.95000 -5751.87959 18.96059 48.00453 434.45636 323.01609 1623.97449
7.05000 -5718.29889 27.37678 17.87338 415.03032 311.57730 1591.90414
7.15000 -5681.05666 16.79373 35.62619 401.34044 298.71568 1545.25860
7.25000 -5657.05294 17.69512 28.18996 387.35931 284.14798 1512.26631
7.35000 -5607.44414 17.22803 -13.59245 369.59532 275.79690 1463.45296
7.45000 -5562.53583 20.43873 -9.13383 364.15878 264.06115 1446.30153
7.55000 -5509.28786 17.93323 -3.08179 345.62046 253.68498 1424.95857
7.65000 -5488.75620 19.05953 16.19132 331.95943 245.30232 1383.95649
7.75000 -5444.93087 16.25983 3.06830 315.34125 236.92998 1352.38671
7.85000 -5402.08205 17.49023 38.40068 314.93619 230.53041 1300.74009
7.95000 -5358.02617 19.64431 6.76967 292.13225 221.23857 1304.35448
8.05000 -5308.88785 19.56335 7.73170 286.25282 215.98876 1278.94315
8.15000 -5269.05956 18.04263 -20.53945 268.23753 200.24549 1247.22785
8.25000 -5225.19622 16.08666 9.92571 257.07129 204.69798 1223.41501
8.35000 -5190.33834 13.89823 -25.39254 246.74265 199.06696 1187.61281
8.45000 -5162.70354 11.84870 -21.44467 242.66886 193.32396 1158.86063
8.55000 -5121.51915 12.14503 -24.36412 241.09210 185.40677 1145.15166
8.65000 -5076.57144 13.89540 -22.77507 229.89229 174.98175 1117.71179
8.75000 -5029.18714 7.20404 -37.64110 232.62049 173.64272 1087.93351
8.85000 -4990.35112 12.50129 -26.50164 222.82882 169.77626 1050.58959
8.95000 -4954.98511 7.27442 -9.74912 214.14186 163.35221 1041.63329
9.05000 -4922.21819 11.15579 -18.83720 213.73086 158.75422 1017.07320
9.15000 -4872.74218 9.08771 -48.75112 207.68248 157.09971 996.94504
9.25000 -4842.16768 7.97787 -48.61546 193.17468 155.43019 969.70739
9.35000 -4793.92441 6.82285 -26.95253 186.94333 151.98495 968.85735
9.45000 -4756.63965 8.34423 -0.56420 181.01617 149.42753 944.62843
9.55000 -4718.93103 9.43221 -22.12339 182.76948 145.19193 939.58694
9.65000 -4689.01292 7.61223 -37.49638 183.91842 144.68894 895.48845
9.75000 -4652.30763 9.01439 -10.40730 177.33014 139.75878 882.41957
9.85000 -4608.02516 10.20205 -25.38499 172.18871 135.91713 869.39105
9.95000 -4580.43044 5.63071 -31.63303 169.09483 134.04751 839.88937
10.05000 -4538.28253 6.08769 -62.45230 165.55959 130.99493 828.30217
10.15000 -4499.04976 6.12759 -64.44996 163.98424 129.40994 817.38772
10.25000 -4469.90439 11.08943 -17.83146 159.61870 125.90591 804.79265
10.35000 -4435.73536 9.80197 -38.50553 155.91465 124.15964 786.16654
10.45000 -4397.67666 9.24936 -14.89121 153.75946 120.48455 774.39951
10.55000 -4365.67154 11.29040 -28.47612 164.05998 121.67424 751.29673
10.65000 -4333.39834 11.44307 -19.31507 154.09864 119.25465 753.08746
10.75000 -4302.69772 7.81503 -30.55579 156.16567 119.35709 721.14366
10.85000 -4270.60097 10.34599 -25.19930 154.83414 115.48292 715.64426
10.95000 -4244.17797 9.44205 -26.39170 150.88156 112.50622 700.10263
11.05000 -4217.52386 5.91591 -19.61252 152.36209 108.30085 683.55997
11.15000 -4180.56104 8.86840 -16.24562 146.56300 114.46568 675.11175
11.25000 -4151.59055 7.55034 -8.97332 146.62344 106.04455 660.91128
11.35000 -4126.96236 10.72847 -21.23734 148.05125 109.83326 652.86719
11.45000 -4086.02343 7.72101 4.30937 136.27304 95.23523 635.28438
11.55000 -4061.42358 9.19831 -11.85176 136.49882 97.90054 627.85864
11.65000 -4028.72730 9.69242 7.08726 138.80930 95.99108 616.77249
11.75000 -4004.69419 8.01878 -17.03617 132.23359 101.43785 595.89599
11.85000 -3973.77768 7.48433 -8.87601 132.89504 94.17121 576.52114
11.95000 -3943.11769 7.49561 -14.04465 127.68032 94.64214 571.65287
12.05000 -3915.13156 9.78512 -14.30847 119.44231 96.06339 559.60797
12.15000 -3884.03713 7.95303 8.96505 124.65363 86.43608 552.57083
12.25000 -3853.27514 8.59248 -5.99152 121.39397 95.84967 539.41721
12.35000 -3826.33755 9.54383 -9.64307 127.34199 90.09423 530.80891
12.45000 -3797.86346 7.17894 -12.45199 119.49726 88.39999 517.90902
12.55000 -3769.73969 8.85768 -1.20653 113.37904 80.60263 504.40466
12.65000 -3735.99000 10.80066 2.76045 114.95655 85.01994 503.16171
12.75000 -3711.42701 7.29867 2.18499 110.30128 84.78876 496.66050
12.85000 -3679.26501 8.58448 0.76703 117.74114 77.99307 482.20436
12.95000 -3655.95520 4.60462 13.97056 103.90292 73.56096 469.28903
13.05000 -3631.20711 7.97261 -1.77346 108.43201 78.31897 469.32153
13.15000 -3604.69956 7.98471 5.44265 106.29953 80.02056 449.76342
13.25000 -3580.09473 6.68423 -1.11398 111.03212 74.90735 444.99861
13.35000 -3556.49230 5.95572 1.21994 109.99114 75.21329 438.18292
13.45000 -3526.25771 5.06354 -2.31223 111.46047 76.76261 432.98460
13.55000 -3507.30059 7.58480 -10.69523 106.80472 75.59981 419.03341
13.65000 -3476.98284 5.29506 -9.40890 105.33052 69.32189 422.78466
13.75000 -3453.26356 7.03844 -7.07435 101.58695 75.73195 407.70771
13.85000 -3425.99516 6.18270 -20.10485 106.63505 65.47035 414.67372
13.95000 -3404.97390 6.86840 -3.57878 97.43040 69.56641 398.53636
14.05000 -3381.04798 6.45337 -5.61286 95.33240 71.86423 399.34562
14.15000 -3362.38603 4.18972 -8.45839 99.11781 67.08629 379.92400
14.25000 -3334.78518 4.30621 -17.33949 101.11211 70.73771 378.34451
14.35000 -3308.06809 4.58651 -6.74445 86.95082 62.02036 367.71164
14.45000 -3289.33635 6.93484 -23.58003 89.67945 66.98033 362.50584
14.55000 -3271.60708 7.69336 -10.23337 88.06504 64.97959 355.93555
14.65000 -3248.76078 6.86864 -33.70499 87.22929 61.57892 359.34198
14.75000 -3227.12193 4.11937 -23.46398 84.02569 62.47279 336.30899
14.85000 -3202.40233 4.15217 -16.67950 84.33238 67.31142 343.96295
14.95000 -3177.60898 6.76571 -5.36616 79.36202 52.88875 338.56612
15.05000 -3161.28391 6.83330 -6.14596 74.33577 62.64710 328.77764
15.15000 -3140.93590 3.90834 -11.07723 80.59527 62.63027 311.16794
15.25000 -3113.59231 5.43566 -17.59835 74.17357 57.41109 317.57270
15.35000 -3093.26603 4.67030 -18.79809 70.94525 57.13723 321.19873
15.45000 -3073.50548 3.84811 -3.95427 72.88230 57.99671 303.45013
15.55000 -3055.84480 5.69499 -22.01804 76.69345 63.12610 308.45485
15.65000 -3035.88553 4.57065 -19.20332 67.02383 58.37022 295.49269
15.75000 -3016.88979 3.29885 -21.49980 65.17268 54.63187 290.54062
15.85000 -2992.95139 5.80568 -24.03297 61.61865 53.16679 289.56997
15.95000 -2976.44367 3.12129 -37.53153 62.32513 55.69601 281.52627
16.05000 -2955.41899 5.23034 -24.99564 60.29145 57.25862 280.68662
16.15000 -2937.81909 2.71813 -12.17079 73.48185 57.42623 266.69233
16.25000 -2916.11728 4.44436 -7.45290 59.42742 51.03517 262.35039
16.35000 -2896.20648 3.27847 -12.49158 60.66910 58.97617 268.94279
16.45000 -2878.01165 3.05716 3.78349 65.27925 50.31274 260.52326
16.55000 -2860.46896 -0.42897 -14.84157 58.84421 48.11337 250.89398
16.65000 -2843.00238 4.84800 -13.77766 62.99050 55.58582 255.48306
16.75000 -2826.82181 1.33174 11.19223 62.24335 51.67606 242.31219
16.85000 -2806.84714 4.55817 -12.34639 57.79745 48.59979 239.55969
16.95000 -2792.31311 1.26174 -5.32654 55.89851 49.05292 235.88034
17.05000 -2773.43305 1.14357 2.32443 59.32294 55.31311 232.75271
17.15000 -2752.75091 1.87451 -2.05688 49.96264 49.56423 229.79626
17.25000 -2738.85186 4.41695 4.14803 48.39210 46.28096 226.52810
17.35000 -2719.48175 5.01700 6.68507 47.82505 49.01166 213.99740
17.45000 -2700.70232 2.33396 4.89314 53.97863 47.98326 211.35252
17.55000 -2685.02194 4.48441 15.50043 56.80544 55.98005 213.74887
17.65000 -2671.40917 2.94875 6.17521 52.43438 38.80794 211.09428
17.75000 -2653.88472 3.51250 13.71091 48.99667 38.82296 207.20118
17.85000 -2637.92939 2.46118 20.36717 47.22181 38.84923 211.24062
17.95000 -2621.48607 2.72566 23.43454 49.51765 45.63131 204.40072
18.05000 -2607.74636 4.09585 26.63745 40.41359 44.27854 197.26025
18.15000 -2588.11722 4.13263 28.78267 43.77406 33.97413 191.34253
18.25000 -2572.84966 2.13363 27.55770 52.25888 43.62411 186.03406
18.35000 -2555.94825 3.09350 28.79708 56.81204 36.57294 190.49094
18.45000 -2543.08580 2.42769 17.16079 50.88827 43.82420 188.54260
18.55000 -2526.68982 -0.12300 28.00633 51.84493 40.89191 190.22241
18.65000 -2508.53460 2.23036 35.27726 54.56867 41.38145 186.77304
18.75000 -2495.41062 2.29259 34.49088 39.02444 41.84478 175.71546
18.85000 -2482.08885 3.18335 38.96726 45.69183 44.64996 175.27352
18.95000 -2467.15944 0.55013 33.50199 40.16007 29.63134 178.06173
19.05000 -2454.27863 2.49320 27.80088 49.92082 50.62003 166.38314
19.15000 -2437.74374 1.94435 34.61542 48.40656 48.89253 168.01655
19.25000 -2424.00725 1.32852 23.01949 34.70520 37.79837 166.44221
19.35000 -2409.61035 1.99402 25.53024 47.17176 45.02232 173.48491
19.45000 -2398.69338 1.56894 28.12153 42.79084 40.49446 159.37127
19.55000 -2383.36802 2.80975 32.71678 35.98830 37.25968 166.23986
19.65000 -2367.61227 2.98033 30.25421 47.68733 44.60635 160.18384
19.75000 -2356.25467 1.24227 21.07467 36.18177 39.53231 155.82872
19.85000 -2346.78244 5.56236 14.49116 53.02834 49.16510 149.92060
19.95000 -2329.14183 3.05349 17.91087 36.50482 38.75750 147.47976
