0.125 0.001 0.000 0.000
0.375 0.002 -0.004 0.038
0.625 -0.006 0.003 0.220
0.875 0.002 0.025 0.664
1.125 -0.030 0.028 1.323
1.375 -0.022 0.074 2.104
1.625 -0.026 0.056 2.917
1.875 -0.074 0.065 3.682
2.125 -0.019 0.043 4.438
2.375 -0.082 0.059 5.122
2.625 -0.094 0.074 5.773
2.875 -0.110 0.115 6.373
3.125 -0.143 0.081 6.949
3.375 -0.153 0.119 7.489
3.625 -0.115 0.144 8.101
3.875 -0.099 0.109 8.641
4.125 -0.099 0.103 9.230
4.375 -0.180 0.159 9.791
4.625 -0.171 0.089 10.359
4.875 -0.162 0.189 10.674
5.125 -0.151 0.217 11.018
5.375 -0.260 0.098 11.468
5.625 -0.190 0.157 11.817
5.875 -0.210 0.179 12.227
6.125 -0.235 0.236 12.945
6.375 -0.243 0.234 13.983
6.625 -0.269 0.210 14.927
6.875 -0.284 0.281 15.876
7.125 -0.285 0.287 17.386
7.375 -0.358 0.353 18.930
7.625 -0.393 0.364 20.697
7.875 -0.484 0.386 22.270
8.125 -0.429 0.434 23.470
8.375 -0.567 0.438 24.362
8.625 -0.580 0.455 25.020
8.875 -0.538 0.449 25.162
9.125 -0.574 0.487 25.508
9.375 -0.575 0.459 25.581
9.625 -0.585 0.462 24.669
9.875 -0.508 0.437 24.475
10.125 -0.517 0.444 23.478
10.375 -0.513 0.373 22.846
10.625 -0.478 0.401 22.022
10.875 -0.467 0.436 22.314
11.125 -0.456 0.435 22.631
11.375 -0.533 0.397 23.219
11.625 -0.518 0.405 23.056
11.875 -0.518 0.392 22.808
12.125 -0.521 0.436 22.863
12.375 -0.564 0.376 23.213
12.625 -0.504 0.413 23.065
12.875 -0.529 0.363 22.416
13.125 -0.511 0.354 22.168
13.375 -0.517 0.327 21.457
13.625 -0.483 0.321 20.785
13.875 -0.457 0.355 19.981
14.125 -0.493 0.330 19.757
14.375 -0.448 0.264 19.445
14.625 -0.509 0.241 19.603
14.875 -0.537 0.275 19.912
