0.05000 -19964.02578 526.29677 3580.14879 18648.73716 12153.04947 23728.64739
0.15000 -29846.38136 164.15244 967.92374 13523.12454 9233.56533 27850.40961
0.25000 -26752.74184 231.58976 749.71374 9521.55061 5660.35957 23585.20627
0.35000 -23244.72693 10.82449 103.41397 7921.77744 5132.72032 20454.66545
0.45000 -20466.18679 14.16330 -114.97128 6912.91649 3707.53263 18196.73744
0.55000 -18512.36269 98.33137 195.39832 5570.13363 3649.02693 16226.62539
0.65000 -17125.33388 7.86910 -316.97714 5402.12563 3283.05471 14935.87880
0.75000 -15802.33067 -2.17072 -303.71890 4607.16816 2893.69714 13704.20433
0.85000 -15056.34710 37.54828 156.19696 4209.79107 3210.17000 12628.10303
0.95000 -14212.39818 47.41779 19.24666 3694.93118 2747.59712 11704.57638
1.05000 -13587.03038 27.93172 -58.15211 3486.52413 2661.20567 10971.35613
1.15000 -12916.50612 -24.06126 -225.04174 3177.90461 2509.72586 10399.49558
1.25000 -12490.90205 10.93504 -162.42519 2910.46631 2740.60953 9769.14230
1.35000 -12048.71012 6.78456 -172.46611 2810.64031 2530.68678 9287.50511
1.45000 -11646.46097 -12.00631 190.94201 2400.96620 2671.69235 8828.92334
1.55000 -11288.30155 7.71739 108.96574 2325.20992 2393.91668 8368.43702
1.65000 -10963.71152 -27.54058 27.33603 2563.65088 2380.55175 8019.27693
1.75000 -10680.82437 -45.26496 -130.68048 2038.21479 2158.84368 7585.44937
1.85000 -10467.08914 4.59283 -149.91005 2025.17064 2104.14712 7205.75295
1.95000 -10178.38382 -13.58789 -72.38298 1945.29574 2135.98690 6997.53677
2.05000 -9944.03452 -45.96235 -23.21018 1659.36201 1981.84172 6649.35134
2.15000 -9744.37448 -7.59413 132.28202 1569.04233 1997.17439 6400.90984
2.25000 -9585.37926 -11.97630 -23.39710 1520.19541 1946.33969 6114.13252
2.35000 -9437.25951 -67.89921 153.96533 1433.37327 1964.57002 5883.24059
2.45000 -9281.66587 -5.92017 -103.23420 1331.10033 1935.90989 5702.96636
2.55000 -9141.07068 -2.46342 -64.56845 1118.66456 1813.83232 5403.17727
2.65000 -8980.85448 8.47593 58.41033 1467.79524 1912.92673 5396.19084
2.75000 -8873.21292 -12.37179 11.10053 1129.19936 1733.76672 5006.24878
2.85000 -8763.70637 -42.37528 -18.41700 1059.40010 1740.27863 5018.03762
2.95000 -8697.77715 -56.63285 -61.44939 1147.93596 1816.87456 4737.67480
3.05000 -8594.35378 11.63627 -122.51682 1057.23361 2046.17629 4624.94954
3.15000 -8508.90622 -24.78190 -35.06702 923.02941 1480.57638 4389.91812
3.25000 -8488.88346 -25.41021 -22.16500 947.81605 1442.73556 4254.48088
3.35000 -8392.33217 31.70001 109.46069 1387.48411 1512.22605 4183.56637
3.45000 -8343.06580 -8.34761 7.93171 1340.39619 1444.18913 3994.64692
3.55000 -8310.61326 -16.02759 -35.56232 1239.43696 1314.35443 4064.56587
3.65000 -8258.96743 -9.24530 -70.87089 903.26472 1244.13960 3797.78154
3.75000 -8219.11891 23.30676 -50.66027 973.73698 1187.48750 3644.77043
3.85000 -8183.15784 6.42017 -13.96686 1415.88322 1233.31379 3745.74186
3.95000 -8084.48259 6.19095 85.95867 979.56677 1048.25610 3415.22189
4.05000 -8019.42040 10.99070 -83.75927 894.53646 956.06876 3342.22752
4.15000 -7945.69075 17.12689 -3.50639 908.02685 930.75639 3261.53030
4.25000 -7892.08246 19.25053 44.90537 884.00676 851.63600 3123.13349
4.35000 -7823.19327 2.80019 -4.98968 908.43234 813.77593 3039.61126
4.45000 -7721.54588 3.01027 4.16722 882.41197 966.90705 2927.19889
4.55000 -7613.52627 23.51135 83.88985 915.86391 706.13902 2872.55645
4.65000 -7520.92339 15.59923 19.42037 799.64337 678.03247 2788.12311
4.75000 -7443.40751 18.91412 22.55511 779.03688 767.70599 2689.27310
4.85000 -7346.46395 20.12205 -49.99314 890.33330 767.76663 2631.06633
4.95000 -7282.97641 25.26977 -0.25616 712.96717 612.50474 2555.31976
5.05000 -7211.04514 13.47014 -25.34626 742.19436 606.85599 2487.16066
5.15000 -7125.97491 -0.80203 10.18374 967.80292 940.04607 2497.66747
5.25000 -7065.48922 20.62214 -10.55514 655.17476 489.82599 2348.97264
5.35000 -6998.79624 18.40922 40.71955 659.86342 516.35975 2296.13739
5.45000 -6909.01720 18.62827 27.60392 804.09067 590.13684 2605.52279
5.55000 -6834.09015 15.64864 48.51719 596.66890 495.42165 2227.62911
5.65000 -6779.21999 8.32046 4.61478 585.14891 410.63776 2129.53005
5.75000 -6720.84532 10.86325 -8.17014 552.33386 514.41967 2085.92876
5.85000 -6632.65382 17.75280 10.21156 581.19850 466.71845 2081.79154
5.95000 -6585.76041 12.38190 25.14042 550.04930 414.20493 1972.31496
6.05000 -6535.77755 8.46270 19.01565 561.25917 414.62535 1938.65807
6.15000 -6487.38308 8.33454 8.99692 465.25864 373.18708 1882.16137
6.25000 -6424.99611 12.76756 19.13140 498.29244 377.66997 1856.83830
6.35000 -6378.37542 15.57168 37.20137 523.14209 428.82379 1845.00925
6.45000 -6326.04691 7.83586 21.82832 429.60813 455.47908 1767.89947
6.55000 -6272.35219 9.55885 64.65481 545.05675 403.66815 1734.11734
6.65000 -6218.80936 13.24472 34.47615 464.85100 339.76155 1690.10462
6.75000 -6160.30272 8.14625 4.91016 482.23002 441.99925 1651.35431
6.85000 -6110.55564 5.27786 43.14822 402.77965 342.25143 1613.23900
6.95000 -6057.30006 8.72139 -6.19429 402.21858 257.41111 1550.77765
7.05000 -6004.69440 4.80722 45.75349 578.94286 363.55296 1538.00341
7.15000 -5961.63408 -1.73656 -8.27853 624.88293 551.36384 1528.46842
7.25000 -5899.77614 5.47173 31.50655 361.85452 311.17450 1512.04775
7.35000 -5849.63454 11.47289 -32.35288 531.89147 301.77256 1435.64571
7.45000 -5787.76772 3.97340 14.68104 343.43657 315.07659 1407.69555
7.55000 -5740.01452 2.85413 0.58672 372.60990 315.40314 1366.09198
7.65000 -5686.43451 6.59049 11.99161 326.93425 328.41237 1358.59936
7.75000 -5630.95213 5.03980 -26.52218 324.26533 529.87977 1332.48288
7.85000 -5586.29372 4.72709 12.71405 371.21079 244.52161 1299.90565
7.95000 -5527.10719 0.35946 27.73365 345.20746 461.91858 1299.50422
8.05000 -5479.38597 13.08710 -32.13489 396.96609 282.46424 1265.74450
8.15000 -5447.61318 10.42254 -10.21649 481.32261 515.99973 1270.45051
8.25000 -5378.02340 2.34653 -21.08944 311.49492 264.94719 1206.27112
8.35000 -5333.32434 10.64248 8.53615 383.91420 262.90698 1222.35058
8.45000 -5287.21760 6.52311 -16.91799 300.33162 293.74737 1125.59968
8.55000 -5250.21519 8.53904 -37.72545 318.29363 240.74755 1112.01049
8.65000 -5194.64133 7.61457 10.88559 341.98043 259.35350 1087.37573
8.75000 -5150.63202 8.22936 25.01110 263.46797 233.69109 1069.41252
8.85000 -5108.07555 5.21426 -17.40867 267.02081 201.92783 1034.06168
8.95000 -5057.66738 6.57215 -5.02663 326.96125 436.45526 1063.05300
9.05000 -5020.20751 4.72029 8.63202 250.49330 245.06231 993.18954
9.15000 -4980.67891 8.17200 4.53300 276.33553 189.15415 990.57260
9.25000 -4935.22241 3.82843 -17.74888 329.88339 437.29047 986.61400
9.35000 -4889.64349 5.64236 -3.62568 232.91289 175.12136 954.66293
9.45000 -4856.81091 7.11623 14.63482 392.22232 223.14918 934.58506
9.55000 -4807.23034 4.84180 32.90059 194.71606 124.48779 913.50853
9.65000 -4771.37428 1.99994 -1.92001 190.97278 139.80236 886.59080
9.75000 -4734.68390 5.92354 1.54334 191.35506 153.62714 895.39574
9.85000 -4693.71028 4.51099 4.68898 216.95698 156.27033 868.58946
9.95000 -4657.07595 2.95650 20.25936 251.07969 135.33972 851.39296
10.05000 -4614.28283 3.39744 11.22546 270.39279 182.64184 835.10372
10.15000 -4582.66602 4.22899 11.89436 263.35457 176.09049 822.90359
10.25000 -4545.63032 5.81775 38.09390 259.76945 198.05470 797.70382
10.35000 -4518.78171 7.14784 12.57544 206.27750 168.48173 782.67375
10.45000 -4483.66526 5.99831 -1.39308 187.36009 248.38817 783.21295
10.55000 -4454.19532 2.16294 20.10505 225.82793 221.90806 762.14553
10.65000 -4429.36534 2.36367 4.70041 187.64527 179.81455 750.15116
10.75000 -4393.63811 8.36657 15.17033 282.33178 233.46351 750.37609
10.85000 -4356.59098 0.94135 17.94663 261.17491 241.98950 731.73379
10.95000 -4335.63089 8.31904 21.65099 213.14635 249.83461 746.81778
11.05000 -4294.95869 4.42578 13.40425 200.55538 183.17626 698.05207
11.15000 -4258.35016 9.60157 -9.49879 237.70087 242.02387 672.96428
11.25000 -4234.53817 3.63765 -17.90269 181.54025 138.17944 644.97919
11.35000 -4204.78123 2.80326 3.47188 138.52024 144.26360 641.43293
11.45000 -4168.08636 7.40882 -4.10597 153.13474 193.02942 635.15563
11.55000 -4143.48197 0.07807 8.37662 286.48961 303.73747 635.03856
11.65000 -4112.26508 4.51748 -7.17906 163.01341 161.97563 598.75762
11.75000 -4077.92421 4.19202 -5.77374 117.68364 85.19210 581.60394
11.85000 -4046.30681 5.91366 2.87563 156.06589 159.53067 574.90754
11.95000 -4016.26622 4.03494 -17.37312 187.35236 314.01408 771.13097
12.05000 -3986.74719 11.59198 2.66842 154.44241 202.62222 564.16201
12.15000 -3955.09257 5.74621 7.41540 200.09232 150.20222 540.11856
12.25000 -3930.59087 3.69349 -9.12403 110.20460 127.26614 541.13937
12.35000 -3904.35447 0.90174 11.10006 151.61948 150.14334 521.81856
12.45000 -3872.50602 4.18828 18.90307 151.52987 108.44431 524.18594
12.55000 -3844.35028 4.36641 -1.15728 146.52798 98.34596 497.02124
12.65000 -3812.28841 4.39813 7.25911 204.88951 105.32580 525.96403
12.75000 -3784.30625 2.69919 1.19621 146.87322 95.30549 494.34183
12.85000 -3757.40759 2.34442 -3.46738 112.91523 107.84518 482.46105
12.95000 -3724.39938 2.64270 -3.12947 364.04614 160.06734 504.24113
13.05000 -3699.49318 -1.49736 -15.96376 271.51313 169.25915 482.38399
13.15000 -3672.75799 1.40609 -12.80508 129.75644 146.08066 497.31484
13.25000 -3648.20905 1.58796 -18.88122 166.90351 178.85411 456.48939
13.35000 -3615.55183 3.45634 -11.77976 162.31160 98.73578 448.26792
13.45000 -3587.63451 7.28204 1.31915 154.69078 145.60452 430.66662
13.55000 -3564.76309 5.68662 -3.86251 128.16593 96.31986 429.13354
13.65000 -3539.71576 4.75853 -15.15620 166.08145 96.83492 420.14015
13.75000 -3516.11131 5.92142 -8.66870 171.45373 154.24893 429.92702
13.85000 -3488.85328 9.04334 -18.48616 94.75421 118.00366 392.11520
13.95000 -3468.04206 3.25141 -8.22905 178.91541 104.83073 415.47177
14.05000 -3444.72694 3.64949 -17.59632 98.85312 96.40215 370.97384
14.15000 -3415.94373 5.76581 -11.07818 86.79480 76.24395 373.80299
14.25000 -3391.85692 3.57322 -11.95349 152.93706 76.73507 376.24240
14.35000 -3369.89314 7.77226 -7.57779 99.86225 110.82760 366.15280
14.45000 -3343.73830 1.92824 -24.29216 80.55676 75.22558 361.21779
14.55000 -3319.62590 4.18706 -21.38609 102.36004 93.96887 355.19508
14.65000 -3303.82337 10.07791 -22.73497 171.02370 229.34904 376.45140
14.75000 -3275.87894 1.64537 -20.01605 78.04525 116.40871 344.01082
14.85000 -3252.16851 1.78641 -23.75373 94.83719 74.87417 329.67862
14.95000 -3225.38703 4.13669 -6.88217 116.07392 89.21465 331.59214
15.05000 -3204.26813 1.69297 -9.61772 87.52336 73.39992 318.13290
15.15000 -3181.50846 3.45170 -3.11690 80.61739 107.30702 313.23630
15.25000 -3158.42506 6.93818 -10.00005 96.67164 97.82095 318.41642
15.35000 -3139.12439 2.03995 -10.14839 84.44774 83.86453 324.04786
15.45000 -3114.01607 -0.06685 -18.86234 153.02116 114.09587 310.75077
15.55000 -3095.06034 1.84305 -2.33760 718.91455 95.29007 347.38920
15.65000 -3076.14882 4.08146 -12.57603 84.42220 73.36417 301.45285
15.75000 -3059.41246 3.66521 -26.06379 64.67183 56.36830 282.57821
15.85000 -3034.86534 -1.81459 -14.66767 113.05484 159.74690 288.56496
15.95000 -3019.54100 2.33915 -25.99951 64.92163 66.29467 277.30333
16.05000 -2996.77529 7.72979 -10.99333 103.80067 173.63762 288.53878
16.15000 -2975.41249 3.33151 -8.53610 72.58314 64.91599 270.90892
16.25000 -2954.26498 5.97394 -24.47381 88.98272 216.90287 290.67064
16.35000 -2937.33565 7.51479 -16.53015 73.63490 70.07575 264.68271
16.45000 -2920.54642 5.57463 -5.57305 56.15179 54.88795 251.54762
16.55000 -2900.78344 4.97592 -23.23716 74.97058 93.60085 257.15100
16.65000 -2885.39674 5.63074 -19.43030 57.37214 48.37381 245.67883
16.75000 -2866.06091 5.46218 -12.77045 63.49098 41.99836 242.83970
16.85000 -2850.62144 6.67311 -18.60361 68.66135 72.98983 258.25490
16.95000 -2835.60648 4.24256 -12.01454 60.38945 50.14591 236.88034
17.05000 -2816.96886 5.40404 -25.25396 62.11214 55.79696 225.19191
17.15000 -2798.80116 3.94218 -24.45119 56.88194 61.73293 229.18757
17.25000 -2776.96883 5.80290 -18.72512 53.47178 51.65714 233.49600
17.35000 -2766.08777 6.15083 -21.63126 52.34556 52.24683 215.73576
17.45000 -2743.86726 0.90043 -1.49389 82.74369 98.10846 208.33813
17.55000 -2727.83071 6.26525 -11.48299 57.85545 54.20916 217.61675
17.65000 -2708.39244 4.79832 -18.46401 171.54907 68.91494 218.46772
17.75000 -2696.26243 4.11046 -14.87786 43.96469 38.91939 203.69372
17.85000 -2679.64648 2.79050 -21.48537 49.56136 69.06882 215.34576
17.95000 -2664.90257 3.89548 -28.68227 79.26253 76.50050 213.92449
18.05000 -2648.57774 0.68352 -18.53152 59.76081 57.65843 196.86444
18.15000 -2631.10874 4.15642 -23.65594 104.81180 57.22870 193.08729
18.25000 -2614.32633 1.18725 -14.75706 68.82035 116.64996 194.45490
18.35000 -2598.79163 2.43067 -18.03014 65.03527 45.37328 183.73275
18.45000 -2581.56643 4.58242 -2.63545 91.09451 58.52211 189.97781
18.55000 -2563.92926 6.73466 -22.37477 120.72416 69.97352 175.34900
18.65000 -2548.99195 7.15261 -2.36049 44.53857 54.04224 175.15325
18.75000 -2534.69506 3.89021 -13.64020 45.41604 43.43843 169.67606
18.85000 -2517.21503 4.66678 -17.44890 39.05593 43.57401 171.40655
18.95000 -2499.17334 4.44088 -23.44916 78.32095 49.53899 171.22632
19.05000 -2487.98271 3.92718 -7.74167 46.44122 33.52496 162.90520
19.15000 -2467.73811 2.77456 -19.68624 53.80558 33.16848 160.89850
19.25000 -2456.82000 6.04986 -17.16284 58.88407 57.18514 165.96291
19.35000 -2441.65099 4.99915 -21.41866 67.00864 42.76167 158.31523
19.45000 -2427.81571 3.28880 -9.25086 65.49047 72.20069 153.15934
19.55000 -2410.71906 4.68763 -1.66248 60.87640 53.05829 157.22871
19.65000 -2396.79874 0.53229 -6.97950 46.58130 58.67597 153.35619
19.75000 -2385.15305 2.86151 -14.89467 48.04586 45.88507 150.98526
19.85000 -2367.77307 3.09044 -7.63971 49.55801 52.72828 147.79468
19.95000 -2357.49765 1.82731 -3.27362 86.93519 128.07100 178.97819
