0.2 2.15952 231.46987 0.05454
0.41 1.81077 182.08165 0.0494
0.61 1.32319 132.04177 0.04838
0.82 1.31476 125.10109 0.04489
1.02 1.28358 117.49958 0.04203
1.22 1.58532 135.81897 0.03922
1.43 1.31628 115.63896 0.0381
1.63 1.41452 114.76836 0.03455
1.84 1.48431 115.4945 0.03273
2.04 1.46528 110.02046 0.03082
2.24 1.45878 107.07673 0.02878
2.45 1.46627 100.27326 0.0267
2.65 1.50412 98.53397 0.025
2.86 1.61185 103.71213 0.02375
3.06 1.25942 77.93792 0.02268
3.26 1.66198 100.08909 0.0213
3.47 1.53458 85.42608 0.01972
3.67 1.54453 85.45877 0.01889
3.88 1.51015 79.1377 0.01769
4.08 1.56143 79.90967 0.01705
4.28 1.67876 80.21626 0.0157
4.49 1.56312 75.28695 0.01536
4.69 1.45808 69.34251 0.01477
4.9 1.58358 72.04542 0.01362
5.1 1.74918 72.96239 0.01243
5.3 1.5723 64.63587 0.01171
5.51 1.79507 71.35415 0.01125
5.71 1.58834 61.65247 0.01058
5.92 1.56724 60.68926 0.01024
6.12 1.73446 65.59413 0.00984
6.32 1.51362 53.45707 0.00915
6.53 1.87488 61.9598 0.00845
6.73 1.8118 59.13655 0.00812
6.94 1.82796 56.54548 0.00755
7.14 1.79098 52.82983 0.00711
7.34 2.00552 55.4531 0.00662
7.55 2.06643 55.68692 0.0062
7.75 1.84302 46.49007 0.00564
7.96 2.22365 55.80727 0.00559
8.16 2.02105 48.0245 0.00527
8.36 2.1738 48.91002 0.00478
8.57 1.92065 44.14769 0.00479
8.77 2.63033 50.21307 0.00404
8.98 2.39435 47.00074 0.00403
9.18 2.1843 41.79339 0.00379
9.38 2.68283 48.59535 0.00359
9.59 2.28305 41.3249 0.00346
9.79 2.43278 41.79138 0.00326
10.0 2.70118 43.94164 0.00297
