0.125 0.000 -0.000 0.002
0.375 -0.003 0.004 0.042
0.625 -0.005 0.003 0.227
0.875 -0.006 0.002 0.663
1.125 -0.005 0.003 1.356
1.375 -0.008 -0.026 2.313
1.625 -0.027 -0.044 3.501
1.875 -0.008 -0.002 4.722
2.125 -0.005 -0.009 6.135
2.375 0.003 -0.037 7.574
2.625 -0.009 -0.021 9.098
2.875 0.041 -0.017 10.669
3.125 -0.017 -0.005 12.591
3.375 0.022 0.043 14.230
3.625 0.029 0.043 15.788
3.875 0.023 -0.054 17.316
4.125 0.036 -0.013 18.580
4.375 0.003 0.018 19.476
4.625 -0.049 0.018 19.674
4.875 0.018 -0.033 20.166
5.125 -0.065 -0.018 19.617
5.375 -0.039 -0.016 19.512
5.625 -0.057 -0.057 20.036
5.875 -0.071 0.019 21.123
6.125 -0.110 -0.009 22.648
6.375 -0.078 -0.027 25.591
6.625 -0.015 -0.013 28.352
6.875 -0.049 -0.064 30.468
7.125 -0.058 -0.049 30.657
7.375 0.002 -0.050 30.072
7.625 0.000 -0.045 28.674
7.875 0.007 -0.040 26.964
8.125 0.019 0.009 25.997
8.375 0.079 -0.004 24.977
8.625 0.048 -0.042 24.160
8.875 0.023 -0.023 23.163
9.125 0.034 0.013 21.493
9.375 -0.013 -0.026 20.993
9.625 0.005 -0.017 20.636
9.875 0.026 0.019 19.681
10.125 0.053 0.017 19.962
10.375 0.018 0.030 19.758
10.625 0.025 0.023 21.135
10.875 -0.003 0.066 21.830
11.125 0.012 0.022 22.501
11.375 0.024 0.059 22.613
11.625 0.033 0.046 21.321
11.875 0.022 0.040 19.777
12.125 0.018 0.022 18.614
12.375 0.009 0.072 17.487
12.625 0.014 0.012 16.334
12.875 0.010 0.027 15.438
13.125 0.009 0.032 14.910
13.375 0.039 0.025 14.535
13.625 0.006 0.025 14.588
13.875 -0.015 0.024 14.293
14.125 0.017 0.024 14.296
14.375 -0.003 0.045 14.040
14.625 0.010 0.035 13.909
14.875 -0.011 0.025 13.879
