0.120000 0.617730
0.380000 1.335590
0.620000 1.165460
0.880000 1.216410
1.120000 1.140440
1.380000 1.164550
1.620000 1.169450
1.880000 1.116180
2.120000 1.142400
2.380000 1.142900
2.620000 1.175060
2.880000 1.210640
3.120000 1.244530
3.380000 1.242730
3.620000 1.295140
3.880000 1.299780
4.120000 1.337250
4.380000 1.320820
4.620000 1.281410
4.880000 1.233600
5.120000 1.203550
5.380000 1.138590
5.620000 1.042980
5.880000 1.009300
6.120000 0.895460
6.380000 0.768120
6.620000 0.677050
6.880000 0.622680
7.120000 0.536470
7.380000 0.548230
7.620000 0.785690
7.880000 0.696490
8.120000 0.846010
8.380000 0.819550
8.620000 0.847750
8.880000 0.965390
9.120000 0.912340
9.380000 0.425030
9.620000 0.782860
9.880000 0.669530
10.120000 0.330180
10.380000 0.241230
10.620000 0.115540
10.880000 -0.582110
11.120000 -1.035230
11.380000 -1.236570
11.620000 -1.464560
11.880000 -1.483310
12.120000 -1.578840
12.380000 -1.732950
12.620000 -1.760900
12.880000 -1.832140
13.120000 -1.910640
13.380000 -1.984540
13.620000 -2.195970
13.880000 -1.981700
14.120000 -2.046520
14.380000 -2.257920
14.620000 -2.484540
14.880000 -3.044840
