0.120000 -0.774590
0.380000 -0.080920
0.620000 0.556610
0.880000 -0.008720
1.120000 0.041660
1.380000 0.007460
1.620000 0.084270
1.880000 -0.095240
2.120000 -0.032600
2.380000 -0.007290
2.620000 -0.020210
2.880000 0.020610
3.120000 0.049880
3.380000 0.167700
3.620000 0.195140
3.880000 0.310100
4.120000 0.399710
4.380000 0.648050
4.620000 0.603940
4.880000 0.314830
5.120000 0.507200
5.380000 0.489070
5.620000 0.514430
5.880000 0.032040
6.120000 0.410710
6.380000 0.007540
6.620000 0.094720
6.880000 -0.563900
7.120000 -0.394710
7.380000 -1.494130
7.620000 -0.911500
7.880000 -0.295700
8.120000 -0.849840
8.380000 -0.513280
8.620000 -0.475820
8.880000 -0.544710
9.120000 -0.726720
9.380000 -0.760900
9.620000 0.259490
9.880000 -0.567960
10.120000 0.013030
10.380000 -0.129870
10.620000 -0.759930
10.880000 0.894600
11.120000 -0.927170
11.380000 -2.238110
11.620000 -1.637170
11.880000 -2.508080
12.120000 -2.341490
12.380000 -2.038840
12.620000 -1.946280
12.880000 -2.137990
13.120000 -1.749750
13.380000 -2.783580
13.620000 -2.218460
13.880000 -2.542950
14.120000 2.957840
14.380000 -2.248930
14.620000 1.515100
14.880000 1.675800
