0.120000 1.578920
0.380000 -1.693160
0.620000 -1.792090
0.880000 -1.950970
1.120000 -2.183150
1.380000 -1.969420
1.620000 -2.150890
1.880000 -1.930380
2.120000 -2.023960
2.380000 -2.013510
2.620000 -2.079760
2.880000 -1.942880
3.120000 -2.041290
3.380000 -2.069300
3.620000 -2.047520
3.880000 -2.101670
4.120000 -2.144590
4.380000 -2.090360
4.620000 -2.482480
4.880000 -2.297840
5.120000 -2.169940
5.380000 -2.528440
5.620000 -1.256790
5.880000 -1.063720
6.120000 -2.468470
6.380000 -1.013290
6.620000 -0.119740
6.880000 -0.173540
7.120000 -0.392370
7.380000 -0.549830
7.620000 -0.694230
7.880000 -1.057250
8.120000 -0.516540
8.380000 -2.245190
8.620000 -1.783980
8.880000 -2.676440
9.120000 -1.928680
9.380000 1.862180
9.620000 2.816660
9.880000 -1.915580
10.120000 -2.925170
10.380000 2.363190
10.620000 -2.853870
10.880000 1.489630
11.120000 1.222060
11.380000 1.212080
11.620000 1.142370
11.880000 0.738930
12.120000 0.734760
12.380000 0.531910
12.620000 0.518630
12.880000 0.005270
13.120000 0.208110
13.380000 -0.460470
13.620000 -0.592480
13.880000 -0.317120
14.120000 -0.016060
14.380000 -0.664960
14.620000 0.267830
14.880000 -0.422230
