0.12500 0.03258
0.37500 0.01574
0.62500 0.02561
0.87500 0.05125
1.12500 0.08705
1.37500 0.09854
1.62500 0.10551
1.87500 0.09967
2.12500 0.09315
2.37500 0.07251
2.62500 0.06122
2.87500 0.05514
3.12500 0.04995
3.37500 0.04935
3.62500 0.04897
3.87500 0.05524
4.12500 0.04603
4.37500 0.06223
4.62500 0.04828
4.87500 0.04223
5.12500 0.04408
5.37500 0.02435
5.62500 0.03609
5.87500 0.01562
6.12500 0.01556
6.37500 0.01717
6.62500 0.00813
6.87500 0.00430
7.12500 0.00115
7.37500 0.00924
7.62500 0.00715
7.87500 0.01405
8.12500 0.01660
8.37500 0.01317
8.62500 0.00678
8.87500 0.01293
9.12500 0.00553
9.37500 0.01884
9.62500 0.01234
9.87500 0.01695
10.12500 0.02554
10.37500 0.02819
10.62500 0.01331
10.87500 0.02710
11.12500 0.02379
11.37500 0.03450
11.62500 0.01745
11.87500 0.00776
12.12500 0.02084
12.37500 0.00652
12.62500 0.02239
12.87500 0.01229
13.12500 0.01046
13.37500 0.00622
13.62500 0.01820
13.87500 0.02191
14.12500 0.00653
14.37500 0.02952
14.62500 0.02520
14.87500 0.00931
15.12500 0.01996
15.37500 0.01545
15.62500 0.02155
15.87500 0.01486
16.12500 0.03185
16.37500 0.02501
16.62500 0.02263
16.87500 0.02832
17.12500 0.02586
17.37500 0.03046
17.62500 0.01824
17.87500 0.02718
18.12500 0.04770
18.37500 0.01680
18.62500 0.03415
18.87500 0.01662
19.12500 0.04691
19.37500 0.02154
19.62500 0.04418
19.87500 0.04036
