0.05000 -2807.89050 -26.26209 -87058.33610 4562.23373 5172.96203 1503133.62822
0.15000 -7111.51974 389.24250 39011.32834 4049.45897 5341.23065 1061652.19263
0.25000 -10998.87914 125.53495 32520.17737 3588.91421 4846.19052 1058975.25738
0.35000 -13801.91408 199.25650 7582.47166 3470.73290 4793.51487 867312.21998
0.45000 -15916.90118 95.10739 -11002.95998 3447.12877 4616.20160 943620.52268
0.55000 -17422.40708 73.15321 10962.69533 3245.54325 4617.76991 835998.90919
0.65000 -18206.93627 15.98311 6682.20572 3070.42649 4623.16782 771540.32291
0.75000 -18530.42787 74.52320 8739.68774 2936.12879 4583.49638 676913.92320
0.85000 -18542.65810 135.55406 -3312.54732 2763.73817 4552.21016 615663.40830
0.95000 -18401.68960 35.24731 4949.90715 2541.82988 4496.42824 629119.55038
1.05000 -18102.87595 142.87815 -1927.92088 2260.57282 4447.66805 522722.06289
1.15000 -17744.61806 142.45653 -1117.48354 1972.86823 4399.39290 501850.74706
1.25000 -17303.59409 153.05938 -751.67741 1721.62553 4296.46185 461654.02012
1.35000 -16804.70879 171.29242 -2970.75122 1535.72383 4193.62184 466162.97308
1.45000 -16307.39009 225.00790 528.51024 1355.06786 4064.76675 402652.64093
1.55000 -15859.78318 155.07930 -2899.25958 1187.55668 3991.79908 383406.93480
1.65000 -15389.58200 159.61009 -2939.36990 1047.13261 3821.25731 350126.73825
1.75000 -14992.29907 215.41494 -1791.09185 933.90260 3726.62816 340711.03480
1.85000 -14557.31810 147.81224 -1026.55691 827.60362 3611.80833 308712.22785
1.95000 -14143.62129 156.21555 1859.84070 698.32027 3491.16395 290574.24559
2.05000 -13742.58342 167.48494 -2648.51142 608.07255 3390.98681 252592.09091
2.15000 -13362.79985 186.18330 5117.55624 563.53074 3300.22039 253176.32862
2.25000 -13034.62226 156.53942 -570.88019 531.42346 3188.94051 228244.08147
2.35000 -12711.59419 143.72399 -2585.74100 502.74020 3067.64536 202189.02843
2.45000 -12393.45031 128.68731 1489.34685 468.60218 2957.37465 212395.36205
2.55000 -12104.50503 91.01912 -3379.51319 461.07274 2894.88595 186666.86674
2.65000 -11806.60940 166.07312 1740.75392 440.45502 2783.17692 179243.58679
2.75000 -11551.22872 125.74776 -1280.19041 438.91632 2696.42566 167922.88662
2.85000 -11319.05055 184.31687 -3034.89898 447.64010 2575.55149 177069.10879
2.95000 -11078.71727 122.71618 1107.69850 465.94607 2487.40257 164667.20639
3.05000 -10851.76418 157.70957 -3102.21379 464.77377 2400.89919 148840.46168
3.15000 -10652.65187 162.90104 -3455.16015 467.91220 2319.55472 133929.17124
3.25000 -10439.73016 139.66896 -3126.64146 480.07965 2244.20962 128303.46998
3.35000 -10229.86944 138.55021 -1069.51942 496.29971 2152.99574 126280.77228
3.45000 -10050.77432 115.11664 -2233.42760 521.64178 2079.00314 109679.60339
3.55000 -9871.68546 152.64153 -1712.78858 522.15550 2001.58712 117936.46209
3.65000 -9697.16701 128.38189 1489.81241 531.17984 1933.57534 112479.02383
3.75000 -9514.75954 99.71399 924.94095 530.49859 1862.91968 123035.96038
3.85000 -9350.96261 101.80248 -2722.52395 543.82643 1770.25158 136347.40867
3.95000 -9196.06664 92.65812 -1719.30798 552.52549 1703.40005 97281.16898
4.05000 -9024.05513 130.01345 -1113.39651 576.42714 1630.68165 94222.02878
4.15000 -8894.56850 79.52910 -2608.27859 565.84089 1586.96453 88891.55530
4.25000 -8747.20087 48.19365 -2656.79156 593.55611 1505.69156 87976.16892
4.35000 -8593.61365 117.06844 -943.85233 601.77668 1443.46557 86525.73699
4.45000 -8449.26871 73.37633 -3190.56370 615.12508 1394.86718 83238.40505
4.55000 -8296.91707 89.77219 20.99361 641.88596 1301.22729 81215.85829
4.65000 -8188.04871 84.24127 243.78998 652.44280 1253.34976 82287.94434
4.75000 -8026.74890 89.60680 -1327.55178 679.57978 1196.50193 106278.10855
4.85000 -7872.88460 69.91374 -1407.14458 684.23717 1137.83554 75787.25507
4.95000 -7709.57899 77.18545 -658.55431 679.27582 1078.95311 88832.87758
5.05000 -7554.73832 73.72968 -260.64597 683.00339 1017.30840 87166.19520
5.15000 -7373.11824 81.57103 -1409.53967 689.48851 961.47287 79502.36232
5.25000 -7234.97317 69.46203 -2442.67809 676.96890 917.81256 82991.35322
5.35000 -7078.32171 69.47990 -1664.76026 667.89438 874.86204 78136.56328
5.45000 -6915.73896 60.91818 -2302.15213 669.44877 817.34769 89270.82632
5.55000 -6773.01889 44.62759 -578.66258 656.33650 787.41286 89745.41465
5.65000 -6605.96255 36.71159 -1615.57586 636.94022 740.22971 69087.38727
5.75000 -6513.26416 42.70627 -1430.52205 605.49148 718.82864 60137.19135
5.85000 -6356.26353 68.68263 -854.91749 579.91142 672.20445 76914.09755
5.95000 -6245.50138 55.60057 -2781.15730 556.45481 658.64571 59197.10029
6.05000 -6139.05629 27.59736 -2445.34774 538.83966 630.25973 76190.04408
6.15000 -6043.35747 52.33643 -541.20920 519.82000 600.53541 59777.86521
6.25000 -5952.91736 24.12891 -2446.83706 485.56900 589.01038 63580.91645
6.35000 -5856.74072 25.96609 -3240.79911 457.90359 559.45889 55124.93144
6.45000 -5807.45418 19.87587 -3102.60323 437.78184 546.10991 54217.09332
6.55000 -5737.88782 1.31999 -277.75147 426.45572 528.72234 55520.94420
6.65000 -5681.69025 6.79603 -2562.30562 406.48085 517.63044 56626.94209
6.75000 -5619.13844 7.55141 -2530.46051 391.52944 498.19383 48038.26076
6.85000 -5569.68846 11.69436 -1759.21528 374.38171 485.94333 41894.54418
6.95000 -5523.67114 -8.83835 -865.25876 362.06752 467.09209 42209.62233
7.05000 -5476.44300 -1.60112 -1165.31435 353.56702 452.69357 40519.90707
7.15000 -5439.97432 -2.72702 -1662.49097 346.70811 445.51962 38877.56821
7.25000 -5401.68742 4.76617 -1972.36466 344.36601 425.29175 37434.82973
7.35000 -5363.10514 -13.53788 -1060.56335 338.98843 416.06300 36541.57819
7.45000 -5337.28554 -18.66044 -1275.05141 340.63762 403.98722 32351.82115
7.55000 -5300.30394 -7.84369 -541.67878 342.46473 391.17189 28200.22584
7.65000 -5262.96313 -4.70551 -1414.38344 346.09353 376.27806 26683.08622
7.75000 -5233.91562 -11.09440 -1386.21100 350.83811 360.58022 32205.65275
7.85000 -5194.40578 -12.48798 -732.64380 355.22191 349.04940 26345.23327
7.95000 -5152.92338 -4.49112 -427.74825 357.77811 338.17423 24065.33767
8.05000 -5125.04647 -3.95367 -426.50863 359.10801 323.37239 23510.37070
8.15000 -5072.17020 -2.14587 -204.04051 365.73993 311.51768 22469.82185
8.25000 -5023.23640 -6.73314 -768.80936 363.93287 300.41990 25394.73399
8.35000 -4964.96209 2.69764 -1104.93520 360.68989 285.06402 30902.32815
8.45000 -4920.47473 6.99826 -917.20727 351.61939 276.81824 45845.33309
8.55000 -4869.49093 -3.16973 -516.35630 344.69554 260.80933 21585.27452
8.65000 -4815.97990 6.11637 -579.85310 333.76592 253.49772 32432.05841
8.75000 -4755.54933 6.68767 -737.33923 321.35960 241.87622 17653.64941
8.85000 -4718.26781 5.50229 -587.52564 310.90126 230.68264 17308.39059
8.95000 -4659.13649 16.42495 -276.96348 299.46305 219.47950 17919.99144
9.05000 -4606.55897 15.25318 -784.26982 287.04350 210.05002 17630.40825
9.15000 -4566.03793 15.23743 -452.45040 272.38665 203.66720 18055.92249
9.25000 -4515.90477 13.35447 -1082.34952 264.37547 196.58753 15221.54258
9.35000 -4473.54162 21.14894 -486.19407 254.54574 187.58331 16928.40374
9.45000 -4428.55430 18.22356 472.55636 245.00679 180.78531 33592.61263
9.55000 -4400.26339 15.12226 0.52563 234.01335 177.00092 12923.57567
9.65000 -4373.33753 16.31203 16.95349 226.30259 171.02493 14656.34382
9.75000 -4322.72238 18.69886 289.37808 223.03963 161.29229 39939.90551
9.85000 -4293.11098 20.34924 250.73224 211.71249 156.06563 15052.94543
9.95000 -4258.46919 20.95228 -183.94654 202.48689 151.89322 13263.86564
10.05000 -4229.67514 19.97594 -263.46832 199.29645 144.60407 11019.12951
10.15000 -4182.51379 26.58405 -454.06592 192.16918 139.98974 12096.05215
10.25000 -4149.77924 24.54342 -289.22420 186.18060 134.50743 11206.83547
10.35000 -4124.33956 20.23462 -472.26306 175.82071 132.40495 10787.01651
10.45000 -4092.01000 23.59685 211.26475 174.37619 131.15610 10768.08234
10.55000 -4056.78699 24.19427 -87.95014 165.95795 125.74684 10962.62565
10.65000 -4033.88093 23.70857 25.88780 161.82776 120.74251 10331.53829
10.75000 -4002.21294 24.68551 -97.65118 155.87953 120.16890 10801.89080
10.85000 -3965.30642 24.18050 196.94895 148.41608 117.03602 9061.72829
10.95000 -3933.38993 28.57089 180.40652 144.38182 115.03914 8735.69285
11.05000 -3914.56053 22.37580 -49.47709 143.10786 113.79636 7875.11148
11.15000 -3880.58363 21.68686 -25.78414 137.46568 108.20735 8068.86115
11.25000 -3851.92772 26.97290 52.15442 137.14766 104.40397 9441.04066
11.35000 -3818.05007 21.13993 -68.56409 122.19315 105.52741 7499.56917
11.45000 -3793.37961 25.68499 -288.02253 118.39163 101.05804 8323.58574
11.55000 -3761.85123 25.39618 -201.26247 113.37069 98.99823 7916.49486
11.65000 -3739.07601 19.85368 92.72594 114.63559 97.59378 7767.71824
11.75000 -3711.32792 19.95225 305.96360 111.70727 97.22360 8960.27674
11.85000 -3681.09210 22.34753 296.74402 106.22739 91.85506 6956.13768
11.95000 -3656.43563 20.36079 -69.55326 102.61539 91.96985 6486.02599
12.05000 -3625.80441 21.43679 203.48529 101.74352 94.10609 6961.99209
12.15000 -3604.46028 19.85199 472.72910 99.55999 90.58610 6190.27819
12.25000 -3579.71632 16.54564 398.34816 100.76794 88.86830 7987.47936
12.35000 -3548.27098 17.80197 333.65681 97.15966 88.00087 6745.58353
12.45000 -3523.24948 17.26056 319.59612 92.98495 86.17221 6628.57088
12.55000 -3499.62484 16.62254 61.76302 91.22196 85.91176 6985.15240
12.65000 -3476.65980 17.81250 137.34497 88.70013 82.43026 5976.23432
12.75000 -3455.44866 17.10779 215.71830 89.22478 81.45280 5729.30876
12.85000 -3430.28165 15.19572 306.66549 82.15548 81.99980 5246.58018
12.95000 -3407.94722 15.84355 59.81958 80.91851 79.24858 6169.73923
13.05000 -3383.77088 15.62881 259.79315 79.97360 77.91314 5603.33897
13.15000 -3359.63180 17.44152 439.81235 81.43378 72.98549 6221.17551
13.25000 -3334.03656 15.37416 325.50410 76.81192 71.69667 6566.64054
13.35000 -3311.02237 17.01036 110.59175 75.52340 71.99936 5792.83206
13.45000 -3288.16922 15.03820 161.33079 72.83658 71.67225 4256.34888
13.55000 -3267.28265 12.79765 107.56202 74.26470 70.81783 5498.21367
13.65000 -3244.99115 15.31116 407.89624 74.31901 66.63622 4688.57824
13.75000 -3219.46885 13.65178 294.67386 74.07999 70.41435 4765.44322
13.85000 -3199.72022 14.11725 150.77115 72.89869 68.40438 5740.80981
13.95000 -3176.73472 12.90627 357.10054 73.77458 66.52947 5565.64766
14.05000 -3156.19653 15.46943 294.38602 71.49596 67.23257 5836.17579
14.15000 -3138.09346 15.27569 0.61642 72.02442 63.47180 3839.83199
14.25000 -3112.96704 13.46031 16.09706 68.40357 63.51051 4320.30489
14.35000 -3099.80378 9.46750 244.15629 68.86232 63.81346 4640.49492
14.45000 -3074.99413 11.57757 60.45562 66.34212 60.74292 4595.78698
14.55000 -3058.34823 13.54800 -35.28854 67.04771 59.95404 4340.07886
14.65000 -3039.08520 14.59968 94.15338 70.49645 60.95624 4069.57237
14.75000 -3018.35435 12.99544 41.76767 69.37688 60.67061 4337.31523
14.85000 -3002.02716 12.40290 -54.19845 70.68794 59.78675 5136.75297
14.95000 -2982.72584 13.86811 83.00681 70.53727 55.44934 5114.28524
15.05000 -2958.48729 15.72856 182.66846 70.67819 57.86467 4796.81060
15.15000 -2946.53760 12.54512 86.00013 69.39051 59.42610 3670.20829
15.25000 -2926.90891 15.37195 255.31028 70.51713 54.95409 3830.68509
15.35000 -2905.14648 15.75431 155.90787 68.22013 52.53225 3898.50689
15.45000 -2889.28373 15.49710 82.80057 67.98839 55.48635 5336.35322
15.55000 -2864.75007 16.28837 256.41482 70.07291 51.10454 4428.33861
15.65000 -2844.04014 17.61892 325.65461 67.66124 53.05823 5439.37394
15.75000 -2828.91620 16.56613 320.22276 67.95736 49.43978 3609.87164
15.85000 -2808.31918 17.11019 191.61180 65.86610 53.14419 2999.78867
15.95000 -2792.76729 15.75429 1.22221 63.90075 49.20007 3371.16662
16.05000 -2774.18471 12.76235 210.62611 67.35431 52.49950 3572.92432
16.15000 -2755.68625 14.93377 336.27353 66.42683 53.67292 3507.39663
16.25000 -2740.48534 15.90922 67.75484 63.10642 46.21036 4458.39976
16.35000 -2721.82413 16.16414 -21.65708 63.00984 50.56181 3532.68222
16.45000 -2705.61587 16.80519 286.10666 65.09418 51.09543 3514.80164
16.55000 -2690.18128 18.77067 347.70142 64.23283 49.24709 5483.81198
16.65000 -2669.70773 17.64735 113.65159 62.27782 46.80343 3166.74296
16.75000 -2656.56051 15.87399 192.43562 62.70187 45.82951 2788.36986
16.85000 -2635.24822 17.26455 386.94806 63.98851 50.01381 4453.52875
16.95000 -2619.51524 15.05223 223.46173 64.46164 48.15223 3518.28397
17.05000 -2606.26424 18.15405 -10.86378 60.25382 45.06803 6907.05261
17.15000 -2586.45559 16.62242 215.55864 56.98819 43.02531 3072.95754
17.25000 -2566.89367 15.10122 227.69885 56.37298 49.37584 3405.92888
17.35000 -2550.83545 16.53267 -24.33844 56.98246 45.81959 4127.05322
17.45000 -2539.89275 17.42403 92.77170 59.90600 47.49585 2592.62637
17.55000 -2521.62065 14.60117 38.36254 55.47766 41.56590 2782.98306
17.65000 -2504.01870 15.14264 -178.75016 58.74940 42.03122 2971.01968
17.75000 -2490.76961 17.08511 6.23937 54.13846 43.70290 2618.53101
17.85000 -2478.11137 15.39943 209.41354 57.40413 45.16928 2466.12071
17.95000 -2464.42527 16.04438 234.70583 52.16225 43.63021 2488.24245
18.05000 -2452.40100 14.73914 129.09733 53.71424 43.11232 1866.86740
18.15000 -2434.69394 14.51424 221.38027 50.14113 39.09652 1947.95234
18.25000 -2421.08658 11.53496 119.47539 49.04738 41.52158 2093.17767
18.35000 -2407.75167 14.02361 276.72117 49.07928 42.71421 2484.94615
18.45000 -2390.85227 11.78804 213.35621 50.30062 40.49644 1567.98549
18.55000 -2375.96585 13.04171 54.56987 49.39296 38.23534 1682.95159
18.65000 -2359.98046 14.39728 19.87800 48.81649 40.28961 1543.49299
18.75000 -2347.63137 13.53791 72.69134 48.78573 40.69515 1413.74201
18.85000 -2334.13999 15.52209 -93.06821 50.55512 42.32432 1444.47719
18.95000 -2323.92296 13.14456 152.12265 46.61363 38.94847 1980.71989
19.05000 -2310.59481 9.74959 -22.00403 49.37920 42.41404 2146.32822
19.15000 -2294.71568 11.06477 143.16222 46.15979 38.64819 1373.80358
19.25000 -2287.27963 14.17832 115.50396 46.89585 38.54277 1900.37460
19.35000 -2274.96206 9.19716 47.32854 44.40322 40.47731 1362.87390
19.45000 -2258.66627 9.78145 -11.46013 47.63184 40.68912 1644.75874
19.55000 -2243.47072 16.68515 -35.76651 43.38769 41.62089 1155.41605
19.65000 -2234.06064 11.21492 -82.92398 41.92802 39.01909 1157.76342
19.75000 -2222.25119 13.59766 36.08005 40.97541 36.43744 1089.99477
19.85000 -2209.05929 8.56332 45.93281 48.83237 38.95485 999.50166
19.95000 -2194.65511 9.82484 39.33356 43.09138 36.16441 1197.85852
