0.12500 0.01882
0.37500 0.00661
0.62500 0.02076
0.87500 0.02033
1.12500 0.04000
1.37500 0.04682
1.62500 0.07184
1.87500 0.07392
2.12500 0.06544
2.37500 0.07964
2.62500 0.07690
2.87500 0.08014
3.12500 0.08462
3.37500 0.08626
3.62500 0.08741
3.87500 0.07777
4.12500 0.08152
4.37500 0.07168
4.62500 0.06905
4.87500 0.06524
5.12500 0.05024
5.37500 0.04279
5.62500 0.04927
5.87500 0.04544
6.12500 0.02817
6.37500 0.03769
6.62500 0.03078
6.87500 0.02613
7.12500 0.02493
7.37500 0.02485
7.62500 0.03181
7.87500 0.02669
8.12500 0.02729
8.37500 0.01825
8.62500 0.01273
8.87500 0.02290
9.12500 0.02046
9.37500 0.01124
9.62500 0.01908
9.87500 0.03351
10.12500 0.01572
10.37500 0.01338
10.62500 0.02777
10.87500 0.00221
11.12500 0.01919
11.37500 0.01136
11.62500 0.00380
11.87500 0.01375
12.12500 0.03324
12.37500 0.02895
12.62500 0.03256
12.87500 0.03007
13.12500 0.04177
13.37500 0.03111
13.62500 0.02910
13.87500 0.02701
14.12500 0.03317
14.37500 0.03483
14.62500 0.02994
14.87500 0.02258
15.12500 0.02919
15.37500 0.02451
15.62500 0.03164
15.87500 0.04028
16.12500 0.03308
16.37500 0.04151
16.62500 0.05270
16.87500 0.02447
17.12500 0.01748
17.37500 0.01284
17.62500 0.01129
17.87500 0.03929
18.12500 0.04746
18.37500 0.03136
18.62500 0.04932
18.87500 0.04258
19.12500 0.02456
19.37500 0.02599
19.62500 0.03012
19.87500 0.02808
