0.12500 0.02986
0.37500 0.01448
0.62500 0.01093
0.87500 0.02519
1.12500 0.01918
1.37500 0.03823
1.62500 0.03814
1.87500 0.05040
2.12500 0.04347
2.37500 0.03942
2.62500 0.03129
2.87500 0.02083
3.12500 0.01044
3.37500 0.01108
3.62500 0.00837
3.87500 0.00529
4.12500 0.00022
4.37500 0.00956
4.62500 0.00694
4.87500 0.00727
5.12500 0.00297
5.37500 0.00740
5.62500 0.01178
5.87500 0.01483
6.12500 0.00921
6.37500 0.00458
6.62500 0.00889
6.87500 0.02034
7.12500 0.01584
7.37500 0.01479
7.62500 0.00377
7.87500 0.01829
8.12500 0.01472
8.37500 0.00376
8.62500 0.00989
8.87500 0.01959
9.12500 0.00853
9.37500 0.01042
9.62500 0.00639
9.87500 0.00792
10.12500 0.01989
10.37500 0.00727
10.62500 0.01191
10.87500 0.01055
11.12500 0.01386
11.37500 0.02189
11.62500 0.01225
11.87500 0.01670
12.12500 0.02083
12.37500 0.02804
12.62500 0.00699
12.87500 0.01301
13.12500 0.01134
13.37500 0.00373
13.62500 0.00758
13.87500 0.01860
14.12500 0.00400
14.37500 0.02794
14.62500 0.02237
14.87500 0.00693
