0.12500 0.01863
0.37500 0.04062
0.62500 0.06681
0.87500 0.09692
1.12500 0.12423
1.37500 0.16171
1.62500 0.17622
1.87500 0.19830
2.12500 0.22219
2.37500 0.23934
2.62500 0.23454
2.87500 0.22868
3.12500 0.22555
3.37500 0.21883
3.62500 0.21636
3.87500 0.20193
4.12500 0.19661
4.37500 0.18296
4.62500 0.16035
4.87500 0.13808
5.12500 0.10320
5.37500 0.08731
5.62500 0.07728
5.87500 0.05957
6.12500 0.03826
6.37500 0.03554
6.62500 0.02063
6.87500 0.02504
7.12500 0.01371
7.37500 0.01206
7.62500 0.01376
7.87500 0.01428
8.12500 0.00651
8.37500 0.00760
8.62500 0.01549
8.87500 0.02108
9.12500 0.01595
9.37500 0.03009
9.62500 0.03278
9.87500 0.02135
10.12500 0.03401
10.37500 0.04599
10.62500 0.03873
10.87500 0.04249
11.12500 0.02859
11.37500 0.02175
11.62500 0.01911
11.87500 0.02035
12.12500 0.01535
12.37500 0.01923
12.62500 0.02247
12.87500 0.02980
13.12500 0.02453
13.37500 0.02282
13.62500 0.02254
13.87500 0.03889
14.12500 0.00216
14.37500 0.02576
14.62500 0.03900
14.87500 0.02986
15.12500 0.02852
15.37500 0.04900
15.62500 0.03976
15.87500 0.02936
16.12500 0.03437
16.37500 0.03361
16.62500 0.03741
16.87500 0.02132
17.12500 0.02421
17.37500 0.00928
17.62500 0.00779
17.87500 0.02043
18.12500 0.02264
18.37500 0.03405
18.62500 0.02832
18.87500 0.00614
19.12500 0.02315
19.37500 0.02244
19.62500 0.03948
19.87500 0.06011
