0.12500 0.02380
0.37500 0.01707
0.62500 0.01130
0.87500 0.00463
1.12500 0.00794
1.37500 0.00881
1.62500 0.00865
1.87500 0.00556
2.12500 0.00529
2.37500 0.00590
2.62500 0.00794
2.87500 0.01595
3.12500 0.02843
3.37500 0.02698
3.62500 0.02241
3.87500 0.01296
4.12500 0.02007
4.37500 0.03056
4.62500 0.02789
4.87500 0.01668
5.12500 0.01596
5.37500 0.02491
5.62500 0.02325
5.87500 0.01965
6.12500 0.01520
6.37500 0.02666
6.62500 0.04996
6.87500 0.01368
7.12500 0.01359
7.37500 0.01578
7.62500 0.00240
7.87500 0.01197
8.12500 0.01128
8.37500 0.01010
8.62500 0.00687
8.87500 0.02695
9.12500 0.07137
9.37500 0.02151
9.62500 0.02806
9.87500 0.00513
10.12500 0.03866
10.37500 0.03808
10.62500 0.03496
10.87500 0.06378
11.12500 0.03067
11.37500 0.03926
11.62500 0.03841
11.87500 0.05341
12.12500 0.05018
12.37500 0.03140
12.62500 0.02702
12.87500 0.03963
13.12500 0.03633
13.37500 0.03252
13.62500 0.02817
13.87500 0.03714
14.12500 0.02438
14.37500 0.02443
14.62500 0.07398
14.87500 0.06038
15.12500 0.04065
15.37500 0.02735
15.62500 0.09828
15.87500 0.02983
16.12500 0.06113
16.37500 0.04155
16.62500 0.03953
16.87500 0.09780
17.12500 0.13324
17.37500 0.11124
17.62500 0.07422
17.87500 0.03811
18.12500 0.07925
18.37500 0.05516
18.62500 0.04610
18.87500 0.03351
19.12500 0.03812
19.37500 0.09786
19.62500 0.05030
19.87500 0.10377
