0.12500 0.04459
0.37500 0.05980
0.62500 0.06528
0.87500 0.11738
1.12500 0.14568
1.37500 0.16127
1.62500 0.16495
1.87500 0.19119
2.12500 0.23212
2.37500 0.22875
2.62500 0.21848
2.87500 0.23346
3.12500 0.22716
3.37500 0.22462
3.62500 0.22366
3.87500 0.22949
4.12500 0.25319
4.37500 0.21707
4.62500 0.21072
4.87500 0.17891
5.12500 0.14985
5.37500 0.15740
5.62500 0.11814
5.87500 0.10975
6.12500 0.08834
6.37500 0.09692
6.62500 0.08793
6.87500 0.08266
7.12500 0.06957
7.37500 0.04227
7.62500 0.04161
7.87500 0.04608
8.12500 0.06070
8.37500 0.05360
8.62500 0.03942
8.87500 0.04082
9.12500 0.05701
9.37500 0.05857
9.62500 0.08590
9.87500 0.05783
10.12500 0.06618
10.37500 0.05137
10.62500 0.04578
10.87500 0.05122
11.12500 0.05725
11.37500 0.05883
11.62500 0.07056
11.87500 0.04186
12.12500 0.06335
12.37500 0.05757
12.62500 0.05144
12.87500 0.06283
13.12500 0.07272
13.37500 0.05081
13.62500 0.07909
13.87500 0.01923
14.12500 0.01680
14.37500 0.03506
14.62500 0.02539
14.87500 0.02147
15.12500 0.02374
15.37500 0.02444
15.62500 0.01577
15.87500 0.01461
16.12500 0.04420
16.37500 0.07674
16.62500 0.01953
16.87500 0.04230
17.12500 0.03711
17.37500 0.04543
17.62500 0.01937
17.87500 0.01011
18.12500 0.05609
18.37500 0.07340
18.62500 0.04865
18.87500 0.11196
19.12500 0.07033
19.37500 0.08426
19.62500 0.09142
19.87500 0.07514
