0.05000 8748.64068
0.15000 8964.22819
0.25000 11478.67370
0.35000 11978.52952
0.45000 12470.40355
0.55000 12184.53723
0.65000 12160.56746
0.75000 11472.69048
0.85000 11020.42128
0.95000 10498.37054
1.05000 9626.28854
1.15000 9180.46445
1.25000 8850.08403
1.35000 8333.83616
1.45000 8066.50167
1.55000 7666.49377
1.65000 7305.02977
1.75000 6880.38014
1.85000 6577.11416
1.95000 6415.28120
2.05000 6110.68396
2.15000 5805.51606
2.25000 5604.72606
2.35000 5377.08424
2.45000 5223.96152
2.55000 5002.22066
2.65000 5070.36677
2.75000 4735.58593
2.85000 4620.98193
2.95000 4438.64917
3.05000 4303.00443
3.15000 4209.10231
3.25000 3984.05563
3.35000 3964.42067
3.45000 3772.07277
3.55000 3694.43534
3.65000 3526.71487
3.75000 3478.31639
3.85000 3273.35455
3.95000 3229.17146
4.05000 3098.70443
4.15000 3061.62771
4.25000 2929.85450
4.35000 2926.98604
4.45000 2732.77459
4.55000 2707.84035
4.65000 2698.02097
4.75000 2578.09481
4.85000 2472.94474
4.95000 2375.20266
5.05000 2312.35496
5.15000 2218.24712
5.25000 2141.28092
5.35000 2069.52618
5.45000 2056.90464
5.55000 1921.16094
5.65000 1875.18610
5.75000 1850.27098
5.85000 1724.30352
5.95000 1711.15100
6.05000 1624.70312
6.15000 1592.35377
6.25000 1557.52819
6.35000 1491.60354
6.45000 1481.43667
6.55000 1393.02728
6.65000 1411.83670
6.75000 1340.45477
6.85000 1272.97969
6.95000 1265.95540
7.05000 1234.46352
7.15000 1177.13651
7.25000 1200.66056
7.35000 1124.38705
7.45000 1116.32858
7.55000 1096.58604
7.65000 1047.89940
7.75000 1050.99880
7.85000 983.41778
7.95000 999.58462
8.05000 979.19196
8.15000 923.90482
8.25000 890.99429
8.35000 914.78210
8.45000 866.65075
8.55000 824.05405
8.65000 842.06306
8.75000 794.02584
8.85000 793.25369
8.95000 767.10421
9.05000 735.34271
9.15000 746.38519
9.25000 741.89929
9.35000 711.63611
9.45000 690.88138
9.55000 669.07055
9.65000 652.03013
9.75000 657.45336
9.85000 648.75869
9.95000 643.78742
10.05000 623.46389
10.15000 579.91291
10.25000 596.01718
10.35000 560.77429
10.45000 577.05061
10.55000 532.59152
10.65000 553.18728
10.75000 537.83436
10.85000 536.12616
10.95000 513.74466
11.05000 496.67818
11.15000 514.91801
11.25000 482.53947
11.35000 468.61832
11.45000 457.78436
11.55000 468.73110
11.65000 452.17105
11.75000 451.17480
11.85000 454.12659
11.95000 447.65604
12.05000 437.62480
12.15000 411.17151
12.25000 417.35811
12.35000 400.56057
12.45000 393.08980
12.55000 386.71231
12.65000 389.65850
12.75000 372.57662
12.85000 373.21865
12.95000 360.20066
13.05000 357.07127
13.15000 371.98694
13.25000 348.98758
13.35000 351.59786
13.45000 321.90605
13.55000 333.81239
13.65000 317.74176
13.75000 327.70789
13.85000 301.02363
13.95000 296.96362
14.05000 287.62650
14.15000 279.89048
14.25000 292.38023
14.35000 283.93756
14.45000 269.05926
14.55000 247.21418
14.65000 265.76334
14.75000 241.64371
14.85000 264.32729
14.95000 252.71039
15.05000 256.91737
15.15000 253.31222
15.25000 249.98433
15.35000 234.39560
15.45000 226.96741
15.55000 217.23852
15.65000 222.64723
15.75000 212.46593
15.85000 191.37023
15.95000 214.06919
16.05000 209.62751
16.15000 189.98680
16.25000 202.37167
16.35000 178.46555
16.45000 202.18235
16.55000 182.77433
16.65000 197.04386
16.75000 179.14089
16.85000 175.47881
16.95000 180.77587
17.05000 182.04044
17.15000 168.24028
17.25000 161.97046
17.35000 163.56678
17.45000 150.81710
17.55000 162.09151
17.65000 152.07684
17.75000 164.84325
17.85000 156.32963
17.95000 150.98367
18.05000 160.95924
18.15000 147.15555
18.25000 155.69282
18.35000 153.84226
18.45000 147.44353
18.55000 140.61839
18.65000 139.70370
18.75000 145.60522
18.85000 139.25480
18.95000 142.43643
19.05000 140.55722
19.15000 144.11609
19.25000 132.60613
19.35000 143.00780
19.45000 155.00981
19.55000 145.06919
19.65000 146.99691
19.75000 147.66379
19.85000 130.32968
19.95000 134.20178
