0.05000 0.00000 0.00000 0.00000 0.00000 0.00000 0.00000
0.15000 315.61762 -260.80634 -288079.72134 2931.25838 1071.97591 769651.64008
0.25000 -405.97282 568.29031 -93742.26294 3179.54014 1331.76277 630175.06651
0.35000 -366.07166 58.65439 122118.03698 2933.41596 2213.87641 713658.89786
0.45000 -141.02954 107.62223 169378.95500 3028.63687 1416.22493 3302998.64668
0.55000 -151.11133 31.86584 -32884.33312 2726.68769 1535.74238 633296.33111
0.65000 -931.37299 112.25026 187547.12283 2522.78780 1652.12232 1181671.01721
0.75000 -1066.31056 -107.85214 19887.47970 2651.26026 1643.34093 1270046.78800
0.85000 -746.72940 11.45903 69595.26551 2761.46555 1874.50636 1216592.85189
0.95000 -916.48255 79.27066 57082.74032 2502.76585 2033.81922 862445.79060
1.05000 -1414.09352 -21.68924 -31388.11758 2275.82447 2016.19132 1626214.59819
1.15000 -1650.64694 56.68419 -93753.83657 2692.80662 2298.71073 1443428.15261
1.25000 -2022.88541 -102.50820 -39226.12229 1809.39734 2298.22859 1087511.38344
1.35000 -2429.22247 20.91396 -14873.76149 2029.95271 2283.53515 1243273.96957
1.45000 -2680.61335 -57.11844 67908.50567 1123.72726 1883.85412 1515147.35500
1.55000 -3006.93960 20.86278 -52835.25299 935.91836 1879.34588 1270297.82533
1.65000 -3314.84302 -35.15195 66923.07562 1035.59008 1709.66971 1895663.78683
1.75000 -3482.61883 -11.84905 -68072.38346 930.09168 1575.70518 1888625.17137
1.85000 -3623.71068 -6.99680 116426.59766 632.90764 1382.50723 2167964.14235
1.95000 -3741.18767 3.48502 30252.51908 545.51554 1367.67321 1641000.46183
2.05000 -3812.58947 16.65163 -18801.07096 927.13970 1492.17605 1873439.56730
2.15000 -3895.07864 -41.12232 -1029.10017 909.79198 1265.73586 1853462.16441
2.25000 -3917.69267 12.75292 -89426.23155 1100.83817 1358.90293 2154350.26630
2.35000 -3958.07415 26.25399 -48310.81386 428.72283 1041.47464 1653754.70435
2.45000 -4029.93818 17.47790 19675.76652 891.35604 1094.78920 2012569.34262
2.55000 -4059.19534 -0.02813 -14709.19695 488.32649 888.05407 1799286.60836
2.65000 -4082.86898 -0.04840 -11360.73645 834.14081 1031.14841 1741095.98041
2.75000 -4112.10132 23.65181 -43240.31294 448.51385 856.85960 2199119.86725
2.85000 -4116.90994 -11.55437 21711.52372 517.58934 831.16871 1991876.17298
2.95000 -4121.38318 9.52523 24855.81344 335.76768 756.94352 1933323.50292
3.05000 -4118.32340 -32.02176 -811.65796 596.36812 776.58240 1867128.82313
3.15000 -4107.77036 -33.45168 -45212.81305 362.01536 951.13965 1991478.91868
3.25000 -4109.31556 5.18870 10196.99626 383.81670 861.32194 2041279.48096
3.35000 -4096.22131 -2.13887 -5413.47987 364.66860 645.96052 2075599.42761
3.45000 -4080.09563 10.55172 -18074.40718 349.49043 612.83971 2306879.49961
3.55000 -4065.36017 5.84935 63915.45638 419.86449 629.51277 1916708.61074
3.65000 -4062.62430 28.88885 -30485.57827 393.13009 828.92375 2095432.33640
3.75000 -4035.78339 -22.47809 -31563.22451 376.30957 566.72572 1872562.31006
3.85000 -4036.61113 5.09126 -12286.43464 329.08880 519.83505 1989553.76572
3.95000 -4008.78125 1.90912 -8483.03019 434.28329 781.25855 1815873.79557
4.05000 -3994.21719 -21.12033 -57762.33829 446.09949 743.03001 2550246.15159
4.15000 -3988.00145 0.44189 -16679.74678 437.05486 648.53636 2592086.20187
4.25000 -3955.40932 1.17998 -59210.76630 365.02259 456.83962 2228228.80253
4.35000 -3937.85975 -6.00459 65191.15290 558.17745 467.67433 2502752.06354
4.45000 -3921.36850 0.32932 -12266.67674 324.14285 512.73293 2021809.53962
4.55000 -3915.78773 7.78796 30547.33399 444.28697 524.01978 2367876.75124
4.65000 -3895.59964 10.62879 54572.85966 383.53682 490.39913 2583248.66563
4.75000 -3869.29156 12.70729 -121606.58334 314.27166 416.38526 2208370.77122
4.85000 -3846.42150 -13.95527 33492.91560 476.15846 480.25698 1969234.93173
4.95000 -3845.37680 2.82373 -104895.47486 393.74820 450.71188 2874790.28476
5.05000 -3816.15438 -3.21522 44615.98946 292.11842 442.54917 2278845.76604
5.15000 -3793.26606 5.05298 -93687.65345 339.56830 357.89276 2036336.39539
5.25000 -3777.86294 -3.46561 26794.43215 269.55225 346.91846 2175518.78779
5.35000 -3752.37302 -0.59068 -36531.72321 271.43361 404.85712 2417871.40072
5.45000 -3733.68878 5.88785 -9069.01687 483.58839 535.46544 2227490.69258
5.55000 -3707.24468 -1.50249 -14452.47558 250.25381 325.66292 2502960.69058
5.65000 -3698.19710 -0.62973 31499.84318 317.94081 384.98675 2132114.85527
5.75000 -3675.38083 -13.91886 35643.44828 292.05193 385.04770 2324218.89458
5.85000 -3655.00962 6.80134 42878.94598 359.47926 312.57202 1889862.08989
5.95000 -3634.30886 1.79464 -16957.81543 303.58757 674.07027 2730431.75880
6.05000 -3622.53378 9.66763 10702.13711 333.84621 446.12820 2193661.93387
6.15000 -3586.61727 3.31780 18747.99960 251.14401 298.71325 2341487.91796
6.25000 -3582.26470 -4.11786 -62875.11323 389.68907 347.42630 2565855.34600
6.35000 -3559.33261 0.70369 2633.99725 379.38816 471.25180 2215561.27196
6.45000 -3534.20818 0.56781 -14010.28282 231.45311 279.30146 2598373.97115
6.55000 -3524.52623 -3.56372 98134.73142 313.94901 303.62154 2495773.87268
6.65000 -3502.99625 0.15907 -5610.91183 354.23300 286.86262 2504194.34278
6.75000 -3482.99602 -9.12127 -33780.88445 227.17400 280.22744 2076934.12912
6.85000 -3464.27338 -2.60491 32627.89232 237.13490 250.82830 2225385.66816
6.95000 -3450.15551 7.37273 8383.84923 267.58499 275.49241 2526302.36867
7.05000 -3424.93940 3.75329 9219.05969 412.20317 484.19393 2033691.67471
7.15000 -3415.31245 1.59078 -22263.43847 338.24182 378.48336 2453926.62849
7.25000 -3405.82059 -5.69934 -10212.66523 234.98106 287.25549 2325991.30055
7.35000 -3385.80575 0.66663 -13524.82984 287.51176 766.43579 2272499.72846
7.45000 -3366.56045 -1.33073 -91389.02264 273.26988 252.85676 2385235.39061
7.55000 -3346.33493 -0.89492 -27150.88739 193.86344 211.87854 2050451.28262
7.65000 -3330.72122 2.56452 24707.37454 211.28248 393.95263 2361941.83459
7.75000 -3311.86756 -5.38214 -10507.12076 246.73268 244.04794 2245234.60422
7.85000 -3297.92882 4.96799 -45427.00608 351.81572 402.79768 2307270.77251
7.95000 -3280.98113 1.59395 -84157.52913 414.67192 435.70322 2252279.33620
8.05000 -3266.95211 2.66322 -13681.54527 429.49433 300.60903 1978633.55133
8.15000 -3248.41189 3.42682 -35662.04017 190.67430 206.31260 2134728.03347
8.25000 -3228.11923 1.08251 -30082.64537 191.01388 210.32137 2258785.24701
8.35000 -3214.99000 0.92956 -78471.69772 280.67881 336.87386 2345965.59121
8.45000 -3202.97718 -0.93364 30876.67224 206.31139 215.74418 2154979.89882
8.55000 -3180.60340 0.36335 42194.03913 285.94787 232.10334 2023716.41057
8.65000 -3167.59358 4.44831 14599.02104 169.36973 189.55869 2323317.56350
8.75000 -3146.50418 1.35799 -5087.08886 187.96665 182.79670 2357141.96725
8.85000 -3136.89726 -2.95202 -1879.40118 611.44901 275.30389 2443165.86722
8.95000 -3117.48994 2.00382 -45277.50187 262.60704 217.31503 2220385.73013
9.05000 -3100.35211 -0.14254 40538.86030 292.55886 249.72378 2217564.39245
9.15000 -3083.41667 -3.86400 -96111.22182 249.91829 236.71323 2309889.68615
9.25000 -3073.07930 -0.94347 -9654.52153 222.09231 196.24555 2125210.78488
9.35000 -3054.78352 -4.70962 32378.41500 237.90008 199.06656 2270851.68964
9.45000 -3034.46243 2.81566 -82601.94790 283.04073 390.30359 2314360.27337
9.55000 -3019.38622 -2.61754 7190.19536 174.63795 162.33380 2101180.39995
9.65000 -3004.30443 -0.39977 -63963.16898 267.78302 564.86563 2075068.46138
9.75000 -2986.35606 2.99169 -69404.55528 211.40075 199.27320 2069957.10459
9.85000 -2968.78939 -2.00912 -25086.09450 226.60567 211.17439 1936708.47697
9.95000 -2963.30603 1.41261 -107372.08598 276.25507 176.54313 2342516.27676
10.05000 -2941.24782 -1.45719 -26964.61493 174.43533 186.32105 2142147.39732
10.15000 -2924.06773 1.63047 -5605.33702 181.39458 139.71632 2052728.82547
10.25000 -2908.00370 1.40678 -66705.48828 156.17523 146.64957 2213207.68828
10.35000 -2896.77340 3.62171 -88080.46444 231.71549 370.28750 2066978.12450
10.45000 -2868.33120 5.76379 7158.07544 418.10720 312.77207 2252683.50033
10.55000 -2862.76236 -8.97275 -37664.48033 417.79816 292.27405 2279885.09183
10.65000 -2849.06539 3.78710 -23730.86496 178.00602 209.87773 2268528.79802
10.75000 -2830.67665 1.77404 -62826.26786 195.73072 157.80792 2184265.79694
10.85000 -2821.03568 0.13909 -6355.39182 232.39127 172.44913 2237816.16572
10.95000 -2803.37021 1.89573 74254.88905 164.12779 131.68045 2008692.78283
11.05000 -2786.82222 0.04141 96330.20239 179.96226 522.33185 2253849.43876
11.15000 -2777.07501 -2.97357 53688.89408 139.29278 124.15786 2145072.74164
11.25000 -2764.04896 -1.81100 64108.16135 160.54665 190.38599 2261873.94379
11.35000 -2751.71745 0.67496 25705.31382 169.00967 133.34505 2112617.43025
11.45000 -2729.27814 -0.24105 -77419.84310 183.77474 294.06857 2204009.21696
11.55000 -2720.86113 1.27457 -4707.62080 255.66033 247.16137 2104946.14937
11.65000 -2700.74845 0.81844 -78060.03135 226.29642 138.70492 1984777.53270
11.75000 -2694.59918 -0.34475 9351.82515 160.32866 147.06030 2157635.56910
11.85000 -2681.00713 2.62922 -75464.54408 235.82366 208.15201 2227706.29517
11.95000 -2663.50606 -1.67415 20754.97975 209.19350 204.39301 2316262.84183
12.05000 -2652.83732 2.16469 -22764.98315 174.93770 139.44452 2045027.58388
12.15000 -2636.91914 0.33566 61849.33964 147.71621 127.74242 2285737.70552
12.25000 -2627.02898 -1.84604 -23756.87963 153.32432 132.29701 2138185.42968
12.35000 -2610.78734 1.22317 -9015.33088 145.27730 132.30627 1987080.44595
12.45000 -2600.26077 -2.39675 -9955.75695 130.68012 134.43256 2176868.20692
12.55000 -2580.85426 2.56413 3061.05926 147.78359 121.93815 2416567.91053
12.65000 -2572.08176 1.81651 18930.21824 182.60129 137.58746 2110184.87019
12.75000 -2557.11283 -0.61531 27006.03395 161.16871 166.13788 2096060.73819
12.85000 -2551.46215 1.89473 19240.85392 183.72585 123.93483 1922866.63145
12.95000 -2537.91793 0.83127 12630.98903 141.21859 227.80612 2096898.18273
13.05000 -2519.80986 -1.21043 7082.35369 178.54229 127.21504 2249364.40897
13.15000 -2509.91927 0.64619 -8784.73813 132.83599 110.97321 2055873.42581
13.25000 -2494.68518 -0.74703 40812.88072 152.73627 120.04654 2015789.67001
13.35000 -2487.92491 -0.23365 65704.39348 140.94073 101.48375 2022832.92580
13.45000 -2475.29773 -0.65375 -22965.41745 277.31213 346.55650 2090838.39119
13.55000 -2461.90932 1.30995 40414.71279 318.95976 139.47941 2147066.81680
13.65000 -2451.91673 -1.39993 -57188.92507 120.14068 92.35637 2030819.95646
13.75000 -2434.08590 0.92825 38065.57073 131.38176 113.24383 2009373.59204
13.85000 -2422.24555 0.68555 59445.23648 131.03918 129.24493 2167633.50903
13.95000 -2415.31839 -2.86833 14021.03355 119.15830 111.49486 1985588.93153
14.05000 -2404.35617 1.16409 63333.02391 210.12119 179.28583 2040581.07972
14.15000 -2390.14541 -1.32544 -10809.73924 118.31009 87.11790 2033488.06587
14.25000 -2376.30466 -2.48753 -8320.61161 122.87689 110.88538 2189604.72144
14.35000 -2368.76322 -2.27358 52764.43738 167.12654 102.71747 2076672.52939
14.45000 -2358.75978 2.34886 -37564.79684 119.17920 98.25960 1767702.50840
14.55000 -2343.04295 1.16171 -18778.77095 128.01516 100.73600 2173610.54732
14.65000 -2331.30257 1.03749 24329.81136 111.40800 98.00042 1923791.91286
14.75000 -2324.82663 -2.97399 -32780.59038 115.71303 108.01766 2003157.56462
14.85000 -2312.44743 -1.03991 -11293.30943 132.18488 107.60898 1870816.43017
14.95000 -2302.35840 1.19860 45644.01171 146.59700 90.98201 1933482.98041
15.05000 -2288.10899 -0.03570 69312.39764 118.39645 117.26797 1983471.11864
15.15000 -2278.04270 0.57792 10562.71446 127.95188 88.68718 1918874.43460
15.25000 -2266.76308 1.87946 9462.38825 118.52727 110.72593 2006791.95919
15.35000 -2257.47634 1.52355 68130.97504 131.40474 146.03088 2064475.17346
15.45000 -2246.91375 -5.63372 24056.61721 265.60901 202.86030 1968764.50892
15.55000 -2239.90439 -1.57025 17410.39314 114.75501 78.33825 2120201.71034
15.65000 -2225.34159 -0.76903 12914.47810 115.07111 104.34058 1827124.59333
15.75000 -2215.65788 -0.63799 48809.04931 139.07293 95.60530 1981391.52473
15.85000 -2211.01903 2.43271 -44311.13175 147.24935 122.53182 2061661.89135
15.95000 -2191.65757 -1.10123 -70922.54115 100.16346 84.42746 1797574.00309
16.05000 -2185.31982 -2.55412 33508.88330 109.53230 82.59919 1855152.82005
16.15000 -2177.38704 0.82834 -28822.54859 122.15800 87.55623 1903924.25963
16.25000 -2166.83736 -0.69393 -23878.35949 98.72949 74.11062 1966667.89822
16.35000 -2157.66406 -0.56744 -61519.14609 96.32005 73.14459 2182664.31542
16.45000 -2146.23652 -1.06366 43886.01328 109.17848 98.17753 1933309.62080
16.55000 -2138.72339 -1.31903 -57130.58814 103.84651 101.19649 2154114.38114
16.65000 -2128.58254 0.38753 22457.36525 109.66168 88.77997 1985322.37581
16.75000 -2117.23249 0.65130 74926.68409 100.14204 67.11392 2013275.71050
16.85000 -2102.16404 1.25407 18643.12242 107.69629 352.38148 1905974.02354
16.95000 -2095.67705 1.07222 -55837.20155 106.19558 87.51722 1856293.68187
17.05000 -2088.97677 1.44836 -63594.60006 107.71442 77.38335 1858435.41357
17.15000 -2079.24850 0.39022 -31564.97408 91.50718 72.14761 2078481.93563
17.25000 -2065.74234 -0.13430 -17146.31215 104.35769 103.17383 1920632.86306
17.35000 -2060.41730 -0.96484 3157.29562 113.94067 101.07500 1914921.59451
17.45000 -2051.67675 -0.72839 21443.73427 111.15440 96.53061 1830618.48115
17.55000 -2038.25760 -0.09998 47636.61938 106.30472 74.70018 1775418.13968
17.65000 -2029.64820 1.82020 -45706.18716 116.66556 105.23606 1838427.94192
17.75000 -2022.31987 -1.29847 7323.11402 100.17866 76.14051 1932407.87226
17.85000 -2012.24742 0.69290 -14504.77411 103.86768 61.22061 1694788.46664
17.95000 -2004.55864 1.27493 4605.88476 92.52176 61.34804 2095406.73716
18.05000 -1997.88053 0.47200 -2527.70796 95.21901 86.46005 1968806.49115
18.15000 -1985.35688 -1.46061 470.53925 157.02838 83.13254 1786514.75570
18.25000 -1976.61931 0.01867 10312.01000 99.51804 69.97958 1799079.04666
18.35000 -1968.41832 -0.17736 3745.33002 92.86726 78.76526 1778095.42720
18.45000 -1964.36439 -0.21214 -3521.33634 85.08694 108.20937 1645509.94313
18.55000 -1949.36547 2.27972 -23242.23945 127.68767 138.09765 1812456.83495
18.65000 -1940.20796 0.28523 -808.64097 85.62560 58.37238 1968647.21512
18.75000 -1933.83065 -0.86584 18315.28289 85.08880 57.86990 1801556.14357
18.85000 -1927.61422 -2.42894 6629.23847 98.64638 89.99112 1928449.37075
18.95000 -1912.72441 1.88493 -45684.93276 89.65061 75.97227 1904407.30383
19.05000 -1906.83004 0.44904 8483.96380 88.28596 60.36891 1809614.42014
19.15000 -1896.07209 -0.25250 50606.48728 93.00329 63.84371 1785084.48329
19.25000 -1890.15437 -1.24263 -42040.42840 90.85360 64.92568 1802989.23659
19.35000 -1883.93473 1.70607 47785.91741 80.93133 63.39967 1910508.35700
19.45000 -1872.22749 1.28062 28492.18168 84.55720 81.16808 1879274.55275
19.55000 -1864.47289 -0.79647 -22229.30399 81.48208 70.66609 1814414.86901
19.65000 -1856.35046 -0.01843 -17839.38334 102.93148 70.55883 1761323.42395
19.75000 -1846.68095 3.92196 2341.65023 90.57360 140.45160 1863196.87226
19.85000 -1838.59647 -0.08946 75606.37924 84.13994 72.15968 1576539.10993
19.95000 -1832.67858 0.89121 32125.52379 87.35682 120.61308 1781049.62109
