0.120000 2.383970
0.380000 1.447760
0.620000 0.901530
0.880000 0.730190
1.120000 0.713610
1.380000 0.744930
1.620000 0.764710
1.880000 0.770020
2.120000 0.760740
2.380000 0.750790
2.620000 0.758420
2.880000 0.789610
3.120000 0.780190
3.380000 0.805060
3.620000 0.800490
3.880000 0.791490
4.120000 0.797540
4.380000 0.820420
4.620000 0.811290
4.880000 0.827300
5.120000 0.852460
5.380000 0.834010
5.620000 0.837710
5.880000 0.867480
6.120000 0.864600
6.380000 0.803040
6.620000 0.825660
6.880000 0.832530
7.120000 0.824710
7.380000 0.853050
7.620000 0.920270
7.880000 0.921630
8.120000 0.911930
8.380000 0.865140
8.620000 0.688560
8.880000 0.482830
9.120000 0.303300
9.380000 0.171100
9.620000 -0.323610
9.880000 -0.435120
10.120000 -0.348560
10.380000 0.333230
10.620000 0.082270
10.880000 0.504010
11.120000 0.483820
11.380000 0.383490
11.620000 0.432760
11.880000 0.284610
12.120000 0.531840
12.380000 0.415510
12.620000 0.520870
12.880000 0.215860
13.120000 -0.336930
13.380000 -0.959540
13.620000 -1.527860
13.880000 -1.800460
14.120000 -2.011300
14.380000 -2.084250
14.620000 -2.082860
14.880000 -2.007770
