0.05000 -1683.41689 -103.74564 -46094.29516 999.64056 806.93673 223645.25381
0.15000 -3707.32136 68.14895 -8307.11142 1128.70727 670.74047 483202.04054
0.25000 -5366.46843 21.03985 18768.47496 957.13871 519.03322 382043.60275
0.35000 -6274.84532 48.31419 12600.88123 1021.13638 419.75523 356283.76237
0.45000 -6844.28675 53.95983 -97.00476 1156.45682 367.53168 366840.76846
0.55000 -7274.56056 37.94529 4262.59199 1366.76460 341.66028 377323.97579
0.65000 -7640.06418 59.79274 4162.56378 1427.84514 310.69821 321615.18556
0.75000 -7917.09912 45.87930 1705.42812 1429.95656 301.85732 317318.22774
0.85000 -8142.75134 65.89372 -4428.43856 1363.65238 285.16468 349880.98874
0.95000 -8317.39333 54.77885 -5928.92477 1333.42711 279.70325 280384.16509
1.05000 -8446.43086 59.61623 -3258.88563 1264.77562 281.21407 300784.08171
1.15000 -8517.62564 60.95044 1842.72407 1201.05950 279.14731 268216.32538
1.25000 -8549.28698 63.57852 -691.33395 1123.87193 268.50442 251243.83497
1.35000 -8574.68945 56.16898 -2856.96012 1070.69430 261.02705 257126.35416
1.45000 -8559.21688 55.25979 -1598.31319 1020.59102 255.28933 254638.92263
1.55000 -8542.56388 51.27993 -1292.13235 989.85509 252.03850 216776.88934
1.65000 -8512.68080 53.89926 -689.27470 926.53207 258.79753 223114.54936
1.75000 -8487.66890 48.08211 873.97994 877.59444 265.99625 218498.16366
1.85000 -8443.55969 52.98824 103.05905 789.52163 271.54199 197097.82422
1.95000 -8453.06498 50.91665 1441.78349 737.58208 267.78887 191668.26738
2.05000 -8398.21123 56.41548 3020.20626 656.97211 265.40201 186635.88213
2.15000 -8339.65241 58.49256 934.99679 593.35819 266.99115 194362.06687
2.25000 -8326.95591 57.13106 -2257.62275 541.03659 266.85426 196515.16352
2.35000 -8312.63680 57.38049 -3613.33372 490.30427 263.12181 176644.93935
2.45000 -8278.49234 51.02286 232.57431 459.69869 257.63445 174191.19124
2.55000 -8215.91261 54.94219 -567.45559 416.82020 257.79278 159680.77569
2.65000 -8182.26366 47.06613 -208.70414 375.63471 252.31830 160329.66706
2.75000 -8144.81836 47.65081 370.18223 344.73160 249.30266 154042.69815
2.85000 -8096.37449 43.15807 -1750.25992 321.46294 248.58856 143982.38189
2.95000 -8045.43678 44.32974 1592.53196 294.08158 245.12667 134156.53852
3.05000 -7997.37684 42.30507 920.94468 265.95684 244.75503 130354.98193
3.15000 -7948.63500 37.18496 1467.42719 253.55840 237.11496 145688.24249
3.25000 -7886.05880 41.16360 -980.18276 245.78840 234.08595 125305.34565
3.35000 -7817.85364 37.88825 220.87737 239.31161 233.73642 121238.61727
3.45000 -7755.33202 39.69237 240.27526 235.65829 230.34153 120458.73620
3.55000 -7696.43393 39.97298 2095.12066 223.62455 226.77739 117627.90964
3.65000 -7636.39906 39.46409 -489.85976 211.95913 218.98934 105978.62220
3.75000 -7576.67051 37.56254 327.87750 203.06502 217.41102 95891.39505
3.85000 -7525.88751 33.38320 -1223.01266 196.90477 208.48713 97970.49223
3.95000 -7472.27655 31.19189 1044.16403 194.28194 202.29066 99469.15531
4.05000 -7417.75825 31.05434 -683.71765 194.44949 193.45206 97808.44533
4.15000 -7357.03117 32.70927 -620.72149 201.71028 188.58610 94964.84716
4.25000 -7296.46055 35.78601 1085.41230 200.88166 185.11486 89225.96761
4.35000 -7247.53271 34.12031 -338.44783 195.22897 177.26793 82201.58600
4.45000 -7200.62850 32.34566 1255.57519 197.31945 174.10642 91476.76424
4.55000 -7139.30152 38.25929 -109.39179 193.60853 169.14279 94426.41219
4.65000 -7082.94367 33.35389 301.98228 185.55420 162.67523 76847.28781
4.75000 -7024.90547 35.84150 -981.32289 176.03669 159.40497 77354.93919
4.85000 -6968.65169 38.57981 819.06244 171.32672 151.73942 75949.63289
4.95000 -6920.76878 32.36667 -910.23530 178.06327 149.33901 76267.23584
5.05000 -6866.31616 36.00394 1302.08949 180.37403 140.88513 64694.90914
5.15000 -6816.62945 35.25255 -545.45356 183.37104 143.72693 68322.17268
5.25000 -6768.58288 35.37769 -1183.67079 180.80454 137.57176 60079.37669
5.35000 -6726.89892 33.90469 -1411.76143 176.33928 129.10627 96476.64676
5.45000 -6679.04360 33.71061 344.06886 170.03231 124.36484 67125.20127
5.55000 -6626.76426 32.37852 -248.19632 160.10403 119.76077 54856.67893
5.65000 -6578.82912 31.99452 -153.86325 149.45732 113.26604 56799.81278
5.75000 -6523.07037 33.56264 -536.75844 141.88516 109.81940 57359.86193
5.85000 -6468.44329 32.15503 -97.26341 137.84181 107.27912 51740.18779
5.95000 -6425.77092 28.99081 66.03166 130.18603 104.56629 45782.78107
6.05000 -6373.52867 29.29606 -121.17458 123.02938 100.45585 42361.86949
6.15000 -6321.83863 26.75561 662.57691 116.71213 98.17617 57977.44746
6.25000 -6276.17785 29.45581 236.66946 106.66790 96.28001 46294.21697
6.35000 -6238.80255 26.92961 630.79082 106.53675 93.80093 43850.91075
6.45000 -6199.43639 28.02583 -251.57088 103.63647 91.00588 59739.75673
6.55000 -6152.39409 26.48561 730.28746 102.04172 89.56333 78951.88129
6.65000 -6111.04133 27.28797 508.57558 98.23565 88.35549 44027.20680
6.75000 -6067.32250 25.24188 1323.19377 99.59023 86.44869 71366.00857
6.85000 -6024.33701 22.74244 -698.19465 90.63340 84.39819 57491.34895
6.95000 -5975.80966 24.43659 1131.78007 90.30069 82.47344 49313.81568
7.05000 -5922.02411 24.39593 380.52835 84.96020 82.31012 34786.90788
7.15000 -5869.95824 21.83226 1296.27876 82.57551 80.56885 62706.57809
7.25000 -5821.88281 24.11697 625.25107 82.05680 79.95816 36908.89747
7.35000 -5778.81077 21.83860 -74.74798 81.40794 79.74794 28744.00442
7.45000 -5732.28866 20.68912 1802.84175 82.76784 77.88208 67745.34198
7.55000 -5685.48422 21.12333 28.26325 82.89318 76.52316 31548.35732
7.65000 -5639.98429 19.59465 24.40642 87.45236 75.17298 29562.61972
7.75000 -5592.76621 20.04102 223.89048 87.79350 75.29012 29630.48214
7.85000 -5542.30362 18.24142 219.94312 87.70897 72.60927 28248.41842
7.95000 -5491.31519 17.52344 106.00276 90.81418 71.40905 30561.12843
8.05000 -5445.52429 19.54831 -362.18935 87.20462 71.28810 26584.92824
8.15000 -5395.06227 19.80633 -484.46328 87.21313 71.25757 27232.45286
8.25000 -5345.96084 18.61033 339.89571 86.85024 70.42990 25269.96847
8.35000 -5301.12139 19.47309 -968.53949 90.83490 68.89043 40340.95535
8.45000 -5256.44165 18.37055 -219.75333 91.48934 70.60339 25025.92311
8.55000 -5215.82024 18.81509 830.58340 90.26432 69.17939 30963.79455
8.65000 -5168.98698 17.85582 23.92706 88.67055 67.91470 22885.34401
8.75000 -5126.71048 16.24545 77.07797 85.95280 65.48348 20943.45190
8.85000 -5082.61029 16.57230 216.84723 84.55775 64.16521 17997.44175
8.95000 -5040.60047 17.01645 -333.81662 81.00980 64.04375 21081.41900
9.05000 -4997.69649 16.83325 129.90467 80.81826 64.87368 19499.24758
9.15000 -4953.70259 17.32419 167.45383 82.11772 62.89806 19983.26171
9.25000 -4909.82563 16.99025 -79.14234 82.40657 61.30247 17400.45429
9.35000 -4867.66419 16.50755 -273.81901 82.14526 59.64315 21593.97533
9.45000 -4820.69612 15.42913 90.49504 81.45690 58.12228 23874.34596
9.55000 -4776.57488 15.01233 664.74135 77.55133 57.92192 32030.82840
9.65000 -4734.60576 16.03005 -482.48024 73.75075 56.44341 15341.05963
9.75000 -4692.04484 16.59458 -209.51000 76.23094 56.24034 21065.67360
9.85000 -4650.39695 15.46272 64.77358 77.66822 55.97140 16567.68223
9.95000 -4608.43050 15.38027 -462.23617 77.12794 55.20844 14487.25541
10.05000 -4563.14148 15.32927 -66.98457 74.74563 52.12283 15645.62894
10.15000 -4521.90167 15.24981 348.78044 74.85679 51.96774 45169.37381
10.25000 -4478.60263 14.00745 -85.78871 72.73854 50.53141 11326.05693
10.35000 -4438.28592 12.81037 -520.53309 73.82493 49.81200 12983.30177
10.45000 -4399.61069 14.70483 -427.32519 72.31620 49.41415 13317.45068
10.55000 -4363.72522 14.44990 -677.96236 71.72051 49.18639 14654.59772
10.65000 -4325.41789 13.51797 -416.16987 72.44196 47.08747 11160.42734
10.75000 -4288.97307 11.12371 -298.18969 68.36920 46.81309 12711.18164
10.85000 -4256.38093 11.37776 -190.88394 66.09983 45.30391 11302.84709
10.95000 -4221.48216 11.56608 -348.60946 64.80267 43.52892 11699.97210
11.05000 -4189.26006 12.03810 -394.38148 65.45950 44.93003 11449.25802
11.15000 -4160.43953 12.84462 -327.87795 64.82034 43.81626 10451.76777
11.25000 -4126.55996 12.18579 49.03605 65.08860 41.34955 9395.03596
11.35000 -4095.24012 11.12805 -158.58608 61.10290 43.37024 10908.55099
11.45000 -4064.44936 8.83926 -51.05260 59.42419 42.02792 11172.77556
11.55000 -4032.44505 10.76488 -150.82651 57.14688 42.39809 9144.76399
11.65000 -4002.26944 9.62822 -205.24529 53.16334 41.39466 9734.99282
11.75000 -3973.24875 9.94586 -90.82407 51.69427 40.88407 8945.81508
11.85000 -3943.73723 11.20870 144.63528 48.48292 41.45204 10118.28286
11.95000 -3915.49668 8.33961 -96.24310 46.76386 41.16474 8009.59711
12.05000 -3886.29087 10.28806 216.27826 49.13090 39.16648 8400.28589
12.15000 -3860.19950 9.47422 -332.29546 48.76443 38.96356 7571.82088
12.25000 -3828.05883 9.18252 -58.28264 46.84168 38.41948 8895.66553
12.35000 -3800.85627 8.10481 58.00330 45.10635 38.62055 9061.16125
12.45000 -3772.26990 9.31721 -363.19014 44.45159 39.44729 6846.62115
12.55000 -3747.58862 9.67996 3.59411 43.56361 38.68218 8847.71840
12.65000 -3720.69338 9.34101 -127.78775 45.37753 38.73539 9789.97545
12.75000 -3695.98100 8.59114 -280.07549 46.81537 39.88251 8536.58197
12.85000 -3670.37286 7.60869 -123.33760 48.69685 38.82391 7803.75847
12.95000 -3644.94517 8.58808 -95.82760 48.34403 38.15353 6661.05775
13.05000 -3617.14895 7.77037 84.16263 48.55414 37.87419 7938.07278
13.15000 -3587.58326 9.90488 -134.69711 47.40755 37.62228 7611.50507
13.25000 -3563.44461 9.37759 -147.43660 46.31120 36.86774 6358.28144
13.35000 -3535.31184 9.13429 17.69546 45.38097 35.93010 5783.86961
13.45000 -3509.66493 8.39331 -100.66538 46.44682 36.11138 5642.87973
13.55000 -3488.22051 7.73460 -131.25511 47.22335 37.37950 5469.40202
13.65000 -3461.59475 8.80792 -27.86443 45.99664 35.97591 6123.45951
13.75000 -3438.38115 7.63032 21.48574 46.22877 34.53648 5350.36796
13.85000 -3415.26949 8.19266 -229.97762 45.62438 33.71541 5025.15772
13.95000 -3387.87639 8.54615 127.98583 44.92909 35.92339 4970.87622
14.05000 -3362.90154 8.59733 -352.16216 43.74691 34.98974 5927.31703
14.15000 -3337.61112 9.91263 29.98666 42.74884 33.84731 4876.84666
14.25000 -3316.26479 7.26989 -160.78927 41.44369 34.48775 6148.38259
14.35000 -3295.53402 6.54725 -119.67719 41.16108 33.95928 4021.29298
14.45000 -3271.15611 7.88457 -170.63194 40.68357 32.87340 5536.89997
14.55000 -3248.58922 5.71165 -0.96830 40.16321 30.98519 5155.38695
14.65000 -3224.19020 8.69209 -192.00297 37.43622 29.71175 4405.83474
14.75000 -3200.30990 8.25312 -282.45609 36.16885 30.06315 5032.52118
14.85000 -3177.99672 8.24850 -93.00398 35.87547 29.26954 3911.34636
14.95000 -3154.71144 7.45971 -168.70615 36.73254 30.34751 4257.66169
15.05000 -3136.79501 7.15793 -210.29420 38.21834 29.29160 3684.16127
15.15000 -3113.73356 6.37120 -29.89679 37.23374 30.90197 4140.76251
15.25000 -3096.28239 6.43758 40.41376 37.15148 30.25912 3216.90355
15.35000 -3076.12783 7.02715 -71.39557 37.52466 30.40551 3877.18699
15.45000 -3055.66843 6.56535 -31.86286 35.18925 28.96352 3609.45088
15.55000 -3033.82117 5.97128 -263.52934 34.30729 29.00856 4967.39864
15.65000 -3011.88471 5.99225 -45.30504 35.32542 28.16003 4190.48823
15.75000 -2991.68633 6.65840 -25.36578 33.83426 27.12201 3978.49958
15.85000 -2972.19188 5.41671 -88.15674 33.18904 29.16588 2822.17033
15.95000 -2950.43260 6.54833 -202.44558 35.73392 27.89822 3050.03701
16.05000 -2929.31385 5.87564 -162.04323 35.34566 25.68539 3408.88489
16.15000 -2907.70529 5.00753 2.41837 36.48325 28.11995 3384.61562
16.25000 -2886.69243 5.78328 -128.91581 33.46656 27.43745 3575.23046
16.35000 -2866.74783 5.48665 -240.53869 35.48370 28.30934 3238.40013
16.45000 -2848.45012 7.13205 -340.52704 35.05837 27.11319 3099.07066
16.55000 -2828.79289 7.55030 -61.09382 34.89846 27.35975 3531.91128
16.65000 -2809.04091 3.94485 54.16618 34.59104 27.81564 3064.94065
16.75000 -2791.40238 5.89720 -111.54579 36.37074 26.94506 2441.41786
16.85000 -2772.12669 5.63726 -112.58497 32.68209 25.90758 2481.15966
16.95000 -2753.83210 5.09610 -37.48541 33.16065 26.19211 2956.35804
17.05000 -2733.21045 6.62862 -276.21436 33.01212 27.74072 3134.26706
17.15000 -2719.73097 4.73285 -112.02103 32.57734 25.31233 2561.46154
17.25000 -2701.88327 6.06545 -43.42809 31.27744 27.48832 2552.74771
17.35000 -2686.91811 6.47109 -103.50532 30.60567 28.42959 2679.27220
17.45000 -2670.89946 5.20708 -87.27506 31.23069 27.68238 2219.33618
17.55000 -2656.63421 5.57937 -139.08329 31.95940 26.86149 2333.40477
17.65000 -2641.15395 5.15581 -7.82830 31.66109 27.07827 2271.17812
17.75000 -2626.55665 3.96393 -104.24047 30.97331 27.33006 2113.71672
17.85000 -2612.09821 3.28260 -101.09354 32.66971 27.54771 1919.84787
17.95000 -2598.32824 3.56631 -105.14254 30.32438 27.82324 1595.06155
18.05000 -2580.25312 5.83444 80.26553 30.22182 27.65847 2156.28311
18.15000 -2566.22261 3.59620 45.97518 29.42650 26.56748 2235.67463
18.25000 -2552.64679 3.99550 -66.12037 29.53191 25.39082 1674.66480
18.35000 -2537.66921 3.44215 -17.10547 29.65637 27.26191 2190.63496
18.45000 -2520.47588 4.44685 -140.01558 30.39819 24.59798 2260.27228
18.55000 -2506.09440 4.26282 107.48677 29.37756 24.92058 2073.90857
18.65000 -2491.97743 5.32729 -75.76497 29.76229 24.93209 1624.63578
18.75000 -2473.98788 2.35425 -101.10601 30.48565 23.23477 2249.30556
18.85000 -2459.37980 3.95430 2.57028 30.82926 26.59686 1921.54191
18.95000 -2441.89122 5.32910 -55.46256 29.28567 25.35762 2111.71123
19.05000 -2429.54056 4.49632 -155.65802 29.61254 25.65968 1565.71114
19.15000 -2413.13311 4.45730 -187.45883 31.11021 23.35049 1726.90184
19.25000 -2397.69420 1.96524 -169.55277 29.15801 24.41465 1772.59057
19.35000 -2384.09534 5.27459 -182.60781 29.67045 24.61939 1807.88784
19.45000 -2367.03408 4.92435 1.45486 29.41681 25.69952 1790.94336
19.55000 -2349.82792 8.12618 -112.19087 30.27210 25.80864 2569.38446
19.65000 -2336.69175 9.69870 -87.58056 28.90578 25.61643 1689.67273
19.75000 -2323.35405 12.20357 67.14142 29.72709 25.29751 1443.91090
19.85000 -2309.12121 20.38771 40.99560 29.56223 25.36726 1768.98068
19.95000 -2298.51499 19.78732 -73.33958 27.65569 23.80926 1089.99532
