0.120000 1.241120
0.380000 1.664180
0.620000 1.795980
0.880000 1.705410
1.120000 1.753530
1.380000 1.816140
1.620000 1.777620
1.880000 1.829400
2.120000 1.870780
2.380000 1.911530
2.620000 1.963780
2.880000 1.990070
3.120000 2.007980
3.380000 1.968080
3.620000 1.930050
3.880000 1.889520
4.120000 1.827150
4.380000 1.764330
4.620000 1.725400
4.880000 1.676580
5.120000 1.629820
5.380000 1.574440
5.620000 1.536630
5.880000 1.478710
6.120000 1.398020
6.380000 1.326720
6.620000 1.287420
6.880000 1.194860
7.120000 1.119580
7.380000 0.989300
7.620000 0.941310
7.880000 0.745100
8.120000 0.583100
8.380000 0.485690
8.620000 0.385190
8.880000 0.180740
9.120000 0.339460
9.380000 -0.012670
9.620000 -1.624440
9.880000 -0.632010
10.120000 3.003010
10.380000 2.014920
10.620000 1.389010
10.880000 1.009860
11.120000 1.498200
11.380000 1.408460
11.620000 1.002650
11.880000 0.712110
12.120000 0.640550
12.380000 0.576630
12.620000 0.127890
12.880000 -0.054760
13.120000 0.011120
13.380000 -0.231020
13.620000 -0.145880
13.880000 -0.348700
14.120000 -0.371500
14.380000 -0.572060
14.620000 -0.646290
14.880000 -0.602420
