0.05000 -3879.49724 -127.99105 -589.12316 3236.78015 3289.75361 4875.92787
0.15000 -6465.07105 -19.96642 200.38043 3851.38080 3396.29717 6143.07141
0.25000 -8726.11633 -77.03091 -704.02797 4073.81924 3516.18719 8757.89465
0.35000 -9836.17750 104.34715 -756.35643 4123.72188 3105.67847 9881.82479
0.45000 -10634.79025 -2.72612 -422.02253 4176.17660 3272.17705 10365.61070
0.55000 -10879.14869 67.11958 83.96922 4105.37209 3304.73216 10996.37312
0.65000 -11196.20886 56.72099 231.19386 3972.10046 3389.74986 11091.42282
0.75000 -11248.85373 37.47526 -171.59529 3929.73890 3268.95252 11244.15195
0.85000 -11242.90743 43.60556 -144.13249 3846.26127 3257.79714 11077.16626
0.95000 -11206.99962 54.57319 -33.77220 3735.13025 3262.77704 10961.46743
1.05000 -11159.50199 45.78611 141.08938 3549.46621 3190.37035 10765.43118
1.15000 -11144.78609 40.38509 210.47547 3439.05782 3182.15309 10395.13360
1.25000 -10943.42813 92.03377 45.10809 3304.87067 3091.09393 10220.05219
1.35000 -10802.77208 10.26447 -62.57438 3193.46706 3079.46557 9919.03940
1.45000 -10673.69092 48.29595 116.09888 3044.10289 3000.72473 9641.47820
1.55000 -10588.38236 30.17049 -106.34576 2949.82000 2999.59682 9289.03736
1.65000 -10448.69355 66.06231 -35.96297 2816.74193 2911.88679 9016.52904
1.75000 -10395.23868 36.96064 16.49958 2668.18887 2862.97699 8599.58346
1.85000 -10275.82107 31.52184 -35.42951 2571.45208 2791.78479 8320.56720
1.95000 -10139.64563 36.01877 -5.32578 2504.38431 2727.18454 8123.07392
2.05000 -10076.96377 23.42040 -83.92134 2359.35629 2657.53544 7818.64038
2.15000 -9958.95558 43.65890 -127.99326 2306.77048 2592.22623 7565.77285
2.25000 -9831.08909 44.94426 -69.85116 2237.17661 2506.31523 7348.83634
2.35000 -9729.61152 15.48270 6.42990 2152.96835 2446.74862 7104.94074
2.45000 -9680.94865 26.24031 -13.95642 2004.99969 2439.11767 6788.41116
2.55000 -9507.85169 16.60178 18.24293 1982.12607 2334.90153 6684.78546
2.65000 -9424.75933 43.20433 41.50362 1862.50658 2269.54074 6412.27536
2.75000 -9309.00385 35.79454 164.18060 1806.63777 2204.94353 6209.28539
2.85000 -9219.72702 33.53612 -14.35228 1734.22066 2157.44455 5990.56411
2.95000 -9075.32500 41.28037 -24.03264 1672.55232 2105.40168 5849.98057
3.05000 -8949.41553 43.02929 -41.90707 1609.20288 2042.03727 5698.06041
3.15000 -8854.64329 61.17556 -21.17360 1516.77937 1989.44018 5440.00241
3.25000 -8706.68205 47.60197 32.31220 1544.82483 1947.74966 5332.42818
3.35000 -8615.55492 21.55713 16.00974 1472.21456 1896.48591 5154.75711
3.45000 -8478.42036 9.18338 -73.35911 1417.11769 1806.42674 5034.25358
3.55000 -8405.16662 47.16348 14.19965 1334.18082 1780.41887 4825.83550
3.65000 -8300.55662 67.37359 102.64591 1328.06623 1751.95666 4645.71951
3.75000 -8192.15880 26.34752 83.41071 1290.70517 1717.80521 4526.81549
3.85000 -8084.16649 48.14420 141.33500 1196.98544 1679.56146 4440.67148
3.95000 -8012.88520 2.86469 -10.47576 1152.72765 1622.21367 4315.11797
4.05000 -7923.36538 24.76602 109.39789 1135.56770 1581.69525 4189.08303
4.15000 -7834.09099 32.89349 -66.86952 1135.47295 1563.43959 4085.95101
4.25000 -7761.99228 24.66323 42.84348 1065.76244 1520.06130 3965.17960
4.35000 -7692.51533 8.58226 18.20206 1072.88314 1486.62714 3832.28247
4.45000 -7577.22906 25.83931 23.90346 1049.76824 1415.45739 3794.60691
4.55000 -7504.42328 37.93463 123.68250 1000.62201 1381.85236 3679.77700
4.65000 -7438.73635 -17.44758 -14.17514 922.73978 1333.55843 3558.97339
4.75000 -7335.76633 34.27650 74.79590 926.32420 1291.90074 3509.48673
4.85000 -7262.17931 9.10073 77.52108 876.16078 1258.96098 3388.02593
4.95000 -7185.69147 -7.65660 53.01240 856.36362 1212.03526 3339.44911
5.05000 -7134.84995 11.54397 4.69058 873.95512 1194.55796 3229.54924
5.15000 -7030.76190 18.10465 94.90617 814.73701 1136.93854 3164.84547
5.25000 -6980.24123 23.89701 10.94080 830.64249 1162.21083 3077.58158
5.35000 -6890.62246 10.30631 93.85953 804.43711 1102.42856 3029.40548
5.45000 -6812.31463 27.33434 9.53666 791.45511 1050.91536 2937.64045
5.55000 -6748.36454 -3.20804 73.83546 775.27501 1015.18495 2875.54832
5.65000 -6668.61809 1.09398 98.43272 737.47544 999.98877 2757.85428
5.75000 -6608.72329 6.33976 60.86769 744.51594 991.84869 2691.27208
5.85000 -6550.84146 -33.65311 20.60307 761.10937 928.34573 2584.73059
5.95000 -6477.41546 -15.47873 51.88345 722.02145 885.74257 2537.15592
6.05000 -6424.81401 -34.56558 8.32370 686.20894 857.79785 2423.13960
6.15000 -6336.41825 -52.10535 65.90864 732.31712 818.57018 2362.15335
6.25000 -6242.44175 -40.30947 62.16036 677.77554 793.91017 2271.86091
6.35000 -6197.50393 -50.49965 12.40041 649.16554 737.43965 2207.88103
6.45000 -6091.76964 -69.92832 -6.50421 653.54583 723.29065 2111.36148
6.55000 -6004.64937 -61.68066 4.35819 641.46637 681.76433 2060.86825
6.65000 -5939.34573 -69.16208 28.01028 630.62019 643.77131 1938.04698
6.75000 -5863.20466 -41.95210 -12.73197 648.49047 637.55606 1866.59581
6.85000 -5761.36599 -47.20998 14.37755 642.12481 596.94750 1836.98306
6.95000 -5659.82780 -40.07324 -15.12450 603.37500 557.24150 1754.50387
7.05000 -5579.88662 -48.58739 -89.75231 605.51161 552.80204 1695.38334
7.15000 -5496.94442 -30.49204 -18.46485 581.76075 525.81606 1660.69402
7.25000 -5426.87353 -26.53295 -6.02664 533.26123 508.53471 1596.37254
7.35000 -5376.73374 -19.44022 -7.18236 514.12715 491.54649 1543.76324
7.45000 -5328.10421 -31.32032 -43.25982 506.52618 565.70110 1473.57812
7.55000 -5267.45396 -44.96593 -43.80376 484.79138 448.05481 1439.93535
7.65000 -5212.43991 -36.75424 -21.37960 540.74186 443.30985 1408.95044
7.75000 -5164.27501 -19.65801 -12.98145 447.28412 448.72085 1355.02915
7.85000 -5130.94092 -30.41897 -23.54653 467.08592 443.74349 1327.90010
7.95000 -5082.40497 -20.56627 -26.01414 429.38036 408.74206 1280.93733
8.05000 -5021.56316 -18.95760 -36.40978 399.97608 393.64550 1247.04133
8.15000 -4992.49518 -19.14213 -30.18703 386.28349 380.34779 1230.17461
8.25000 -4954.08002 -0.41757 -21.02025 364.68447 363.87469 1204.94853
8.35000 -4908.95956 3.34929 -29.22330 402.14274 369.16305 1190.72896
8.45000 -4887.34995 6.23901 -35.08867 351.61903 357.91396 1170.68280
8.55000 -4850.21963 -2.76765 2.34440 384.70839 351.26775 1127.16582
8.65000 -4825.49419 10.79733 -21.66475 335.21685 344.57870 1108.81603
8.75000 -4796.15813 6.79499 -16.70050 351.26964 333.70610 1074.24885
8.85000 -4767.60114 8.32114 -19.72427 314.51905 326.27877 1054.90148
8.95000 -4736.47747 17.02233 13.72584 326.47340 325.24683 1029.44919
9.05000 -4717.60688 19.45296 -22.76726 323.88839 310.08530 1013.24267
9.15000 -4694.75367 23.39674 -43.98688 318.33524 306.85342 980.12979
9.25000 -4662.95243 29.98875 -22.99751 307.59404 288.95822 970.01797
9.35000 -4636.68025 26.53500 4.13301 300.78899 295.26157 956.35878
9.45000 -4616.66949 15.42934 -56.34055 288.50413 277.48370 902.31899
9.55000 -4590.82831 30.05644 -20.28143 345.65258 295.87987 909.03850
9.65000 -4572.82795 28.55172 -8.78354 337.55516 312.70478 887.98964
9.75000 -4544.19448 25.86313 -23.18887 315.40863 285.36942 881.70560
9.85000 -4513.30042 30.01574 -25.77224 351.93528 298.51153 859.58452
9.95000 -4488.47477 30.56941 -1.31367 315.31988 258.03970 822.48499
10.05000 -4450.24601 32.79345 -22.54882 288.49560 226.93468 788.87648
10.15000 -4420.66285 36.69492 -37.53694 303.49546 250.97368 791.08526
10.25000 -4378.16386 38.19082 0.35819 276.54876 234.00316 769.71407
10.35000 -4339.33080 30.17686 2.51308 266.38102 210.30636 724.49511
10.45000 -4303.66543 27.85308 -23.56940 294.58246 219.11442 716.25949
10.55000 -4260.67964 27.11854 -4.64532 257.66867 212.53266 710.47626
10.65000 -4224.13311 29.76608 -15.28172 256.48527 190.15085 708.20761
10.75000 -4192.24799 27.66898 19.60230 249.78147 205.19361 671.38713
10.85000 -4146.56465 20.52282 0.81533 231.95027 184.45532 653.80701
10.95000 -4116.35570 20.12641 -10.57231 231.26982 188.20470 631.97713
11.05000 -4082.57360 23.65014 -0.76062 249.71596 180.26685 631.58375
11.15000 -4047.95897 20.36999 -5.85410 217.46750 187.47309 611.68183
11.25000 -4013.26008 19.67289 11.89966 220.09903 183.99563 597.67741
11.35000 -3973.89209 16.52893 -4.26327 247.73540 155.29015 603.03610
11.45000 -3933.25088 19.23291 -25.50778 202.37414 187.08869 588.64775
11.55000 -3895.19748 17.54188 -24.75994 214.62389 176.88187 584.04538
11.65000 -3879.04571 14.61576 -7.14767 213.30492 187.75420 570.39825
11.75000 -3836.84903 13.24524 -1.46843 196.01785 171.69030 548.83065
11.85000 -3810.84699 16.90105 -21.68718 195.68027 150.56166 541.18508
11.95000 -3786.66778 12.91170 -7.03727 198.06215 153.69135 531.98285
12.05000 -3748.51429 15.50907 -9.92352 189.75097 132.41783 521.52174
12.15000 -3720.30850 14.62973 1.75914 194.62326 168.74824 511.88302
12.25000 -3698.03659 9.02364 -18.18091 176.24828 155.29110 514.22203
12.35000 -3672.46463 3.65414 -25.44269 185.71664 151.72437 511.87343
12.45000 -3644.70183 8.06924 -4.79703 175.06375 118.89910 483.52710
12.55000 -3622.67277 8.85969 -11.36372 145.86965 120.86419 486.22183
12.65000 -3601.57200 14.39688 -12.29682 196.99067 137.76090 474.84291
12.75000 -3573.92004 6.42461 -20.62711 224.15305 172.61529 465.86274
12.85000 -3546.77748 10.39848 -1.08349 141.73547 119.45285 456.55351
12.95000 -3520.63802 10.11699 -24.37138 181.57071 143.20113 453.02405
13.05000 -3501.33498 9.59395 -19.38873 150.35385 134.55677 436.85110
13.15000 -3475.65264 0.40741 -18.10080 137.03579 132.82538 432.28763
13.25000 -3454.35988 8.25414 -12.17050 141.82609 112.88324 419.07922
13.35000 -3430.77995 9.51202 -0.38357 142.13384 137.95966 422.93912
13.45000 -3413.43798 2.10641 -9.39716 139.06186 124.12176 409.46975
13.55000 -3385.20680 7.45167 -16.07097 145.12109 159.45517 422.88366
13.65000 -3354.52946 5.45556 -0.28291 148.31869 116.04483 406.58723
13.75000 -3340.24073 1.61576 -9.20017 125.75497 122.66558 381.72714
13.85000 -3317.64706 3.59948 -18.26494 150.77109 125.78020 387.84988
13.95000 -3299.21882 3.00281 -3.87698 200.24972 105.46084 373.44892
14.05000 -3276.73519 4.65754 9.63924 121.13805 125.51775 382.47190
14.15000 -3254.96923 3.29415 -36.93839 144.46909 157.17503 365.08812
14.25000 -3236.34754 0.40485 -11.58495 150.70195 117.95659 370.35956
14.35000 -3216.90281 5.75004 -13.64303 131.58375 111.84834 348.17537
14.45000 -3201.57224 6.72277 -11.69864 140.75483 107.05565 362.71028
14.55000 -3173.99125 10.50580 -6.91734 113.15695 108.99913 343.45274
14.65000 -3151.58673 3.00052 -9.90665 122.33157 83.83679 331.46207
14.75000 -3130.57710 5.20827 3.44303 118.63019 103.93533 335.86654
14.85000 -3107.85771 7.39318 -4.02833 119.10061 92.71074 330.65929
14.95000 -3088.99407 8.59185 -4.16078 103.51202 87.02916 330.40766
15.05000 -3068.21479 7.24986 -6.74017 95.13803 94.55824 316.26597
15.15000 -3046.19366 5.78541 -1.54127 85.99420 69.85981 305.28698
15.25000 -3028.73243 4.44914 -4.60516 122.35649 81.00727 306.94681
15.35000 -3015.99485 1.99322 -14.78274 95.08438 96.55606 297.18821
15.45000 -2994.31322 3.19696 16.63031 101.51050 76.37163 297.52411
15.55000 -2971.44086 2.46023 5.64360 95.51353 85.45938 296.43444
15.65000 -2946.94063 2.44132 3.20090 145.42364 107.05620 295.87581
15.75000 -2933.02729 6.69811 -1.12662 88.02756 102.96763 276.53268
15.85000 -2914.68003 2.17181 20.33088 104.68500 114.29563 287.07542
15.95000 -2895.29295 8.03595 17.67862 112.33020 91.13322 273.12510
16.05000 -2883.10120 7.79053 -3.39015 97.12477 146.77061 281.96577
16.15000 -2856.67623 3.87217 13.67895 151.11737 118.20480 279.26215
16.25000 -2846.02742 5.69703 -5.41858 90.87178 80.70539 274.49806
16.35000 -2825.97736 3.11860 4.42089 93.76324 64.49560 262.97961
16.45000 -2807.99453 6.58486 11.91518 86.96023 65.63885 248.95692
16.55000 -2790.75735 4.88259 4.16913 89.27364 98.88281 257.85317
16.65000 -2767.61642 6.95256 2.56632 88.90247 81.69454 250.02960
16.75000 -2751.41027 7.54455 2.22515 100.55564 94.95322 254.84361
16.85000 -2732.79559 6.75846 8.44328 80.36306 70.05581 249.85306
16.95000 -2717.96649 4.24040 11.62043 140.23093 174.44568 241.65743
17.05000 -2698.94837 4.90436 26.88104 122.44680 83.44717 237.15305
17.15000 -2680.85104 4.19271 19.56072 97.51976 77.30243 232.71878
17.25000 -2662.29553 14.84266 6.05211 92.19932 177.48479 249.85396
17.35000 -2649.95470 9.16884 26.96157 98.48576 78.18120 239.94986
17.45000 -2636.01767 6.16180 11.12641 88.36191 86.57007 227.92806
17.55000 -2617.48018 7.15695 20.34396 87.66085 97.30774 224.29592
17.65000 -2597.62401 6.00140 16.49596 100.56732 68.43821 209.55037
17.75000 -2584.27267 5.57744 15.28345 117.66637 122.04910 222.53765
17.85000 -2576.39451 8.16361 7.79267 73.97454 72.60132 213.74812
17.95000 -2555.21257 5.09969 12.95458 71.60865 64.62470 205.48712
18.05000 -2547.54002 6.51525 6.54054 69.56285 69.84685 201.62309
18.15000 -2531.54238 7.23129 12.32968 88.02517 72.97972 210.44667
18.25000 -2520.03267 5.27669 13.83533 80.28263 60.32753 202.30109
18.35000 -2500.70307 5.93148 6.31340 66.18005 55.46832 229.65828
18.45000 -2487.12109 4.74201 10.88998 91.37901 53.48612 197.46804
18.55000 -2468.52752 11.27638 19.40039 82.44393 56.70709 204.83499
18.65000 -2460.74004 6.46133 10.15128 82.47766 74.18772 206.10044
18.75000 -2448.83638 6.96236 -7.23738 106.41570 142.16384 208.11527
18.85000 -2427.61519 4.18000 4.10062 80.68274 109.07299 202.43605
18.95000 -2417.60433 6.86277 13.51988 85.30268 49.93572 192.84327
19.05000 -2406.56322 3.68304 18.61734 88.33728 98.11428 185.58589
19.15000 -2392.11623 9.18316 17.16843 103.96911 66.62213 201.35144
19.25000 -2379.33647 9.45262 15.05580 66.60394 60.60654 177.00706
19.35000 -2370.88532 6.28894 6.71981 69.75493 60.82539 178.58332
19.45000 -2354.79691 9.99177 3.90332 79.49255 67.50146 169.86310
19.55000 -2343.27736 8.86795 7.70465 79.71847 55.06789 185.14197
19.65000 -2332.15581 3.79566 12.36541 86.48369 79.20208 169.93368
19.75000 -2309.72495 11.45017 12.80809 203.40217 83.38279 167.49540
19.85000 -2296.25399 12.68276 13.54791 98.87982 58.73828 175.95648
19.95000 -2298.14252 7.42185 14.10437 80.37897 44.65880 166.03152
