0.1875 -0.10127 11.95632 2.14641 130.45194 127.72405 103.23628
0.5625 -0.10405 31.12125 0.45301 128.92807 121.75109 96.89739
0.9375 -1.26833 48.94894 1.05134 126.29937 113.80455 91.44775
1.3125 0.57622 62.10903 -0.19487 124.29564 104.65137 85.58242
1.6875 0.31485 69.60091 -0.0821 123.08835 96.7399 79.67832
2.0625 0.2458 74.36605 0.48366 118.16125 91.00324 75.89318
2.4375 -0.60633 78.13784 0.67697 114.9552 85.57889 71.37015
2.8125 -0.76884 80.41824 -0.36295 112.35966 82.70895 67.05312
3.1875 -2.58084 82.35089 -0.82087 110.24222 78.63067 64.1373
3.5625 -1.38779 84.55143 -1.03922 105.37976 74.60314 61.48486
3.9375 0.3728 89.01 -0.88612 104.69773 73.41927 58.44013
4.3125 -2.79295 93.65975 0.9999 101.21495 70.21038 56.50579
4.6875 0.13977 98.88915 0.07842 98.56129 69.33339 54.17815
5.0625 -0.01816 101.88088 -0.71355 93.42047 68.00618 51.16171
5.4375 -2.0307 107.332 0.62626 87.98324 66.87607 50.14035
5.8125 -0.85347 116.45365 -0.42743 81.30788 66.59338 47.94644
6.1875 -1.46501 122.85665 -0.47838 74.73119 66.07198 45.59862
6.5625 -0.59023 130.99444 -0.06983 68.46285 65.45986 44.03195
6.9375 0.73662 140.11636 0.93988 61.46624 64.46481 41.70933
7.3125 0.08772 149.28884 -0.11743 56.99701 61.689 39.27201
7.6875 -0.50972 155.88845 0.00144 51.07605 58.83541 36.34883
8.0625 -0.29158 166.64264 0.20277 45.98392 54.17288 33.72367
8.4375 -0.37485 173.6842 0.40201 40.55863 48.48221 31.43174
8.8125 0.11441 179.2649 0.28608 38.10108 43.35245 28.99542
9.1875 0.65436 183.9142 0.40263 35.59985 39.0132 27.22462
9.5625 1.02048 189.47008 -0.16275 33.1384 32.79754 25.98569
9.9375 0.81961 192.93204 -0.55088 31.96229 29.52274 25.18795
10.3125 1.36704 194.48703 -0.76272 31.41516 26.23147 24.55034
10.6875 0.12829 196.96152 -0.99809 30.53496 24.44539 23.70558
11.0625 0.65191 198.77857 -0.49334 30.40194 23.28675 22.6727
11.4375 0.6794 198.52968 -1.50774 29.12108 22.20117 21.9044
11.8125 1.21627 199.41682 -1.19213 28.29451 20.99478 20.76336
12.1875 0.74519 198.19373 -1.17027 27.57905 20.1545 20.21317
12.5625 0.87432 198.68934 -1.10677 26.11437 19.0447 19.70851
12.9375 0.9061 199.18228 -1.54257 26.61567 19.43005 18.91014
13.3125 -0.39059 198.7402 -0.10966 25.27307 18.54791 18.29412
13.6875 -0.99237 200.17034 -0.61795 24.59161 18.35135 17.56476
14.0625 0.91771 198.60516 0.61382 23.66673 18.32428 16.60299
14.4375 0.05065 199.88761 0.03498 22.94876 18.84453 16.06153
14.8125 0.4069 200.34485 0.17827 21.82721 18.61291 15.13534
15.1875 2.45804 201.56348 -0.85866 21.50242 18.38561 14.86523
15.5625 -0.1418 201.4269 0.51387 20.53449 17.7376 15.01309
15.9375 -0.26517 203.44031 0.58002 20.3007 16.66509 14.12873
16.3125 1.55993 202.80114 1.50986 20.04683 16.69795 13.69317
16.6875 1.41924 203.3907 1.62344 19.53665 15.72713 13.27887
17.0625 1.09464 203.56312 2.21056 19.03481 14.35306 13.94577
17.4375 2.00951 204.55346 1.38563 18.6537 13.94983 14.23789
17.8125 -0.16014 203.82842 0.766 19.16632 13.84641 14.18155
18.1875 1.85732 204.30121 1.79437 18.07502 14.31468 14.53348
18.5625 0.90731 204.65602 0.86267 17.38133 13.25388 15.56694
18.9375 1.6655 206.18473 0.45294 17.22091 13.84776 14.56958
19.3125 1.97887 206.31188 -0.02497 19.04425 12.70174 15.10584
19.6875 2.52405 206.32806 -0.76834 16.39125 11.10008 14.54442
20.0625 4.30808 206.17632 -1.32694 17.01142 10.47081 13.62045
20.4375 2.54724 205.47353 0.32415 16.09453 9.35912 13.21441
20.8125 3.49828 202.91735 -1.30082 16.559 9.02643 13.48112
21.1875 3.42646 201.19246 -1.12734 16.39308 9.68874 12.68805
21.5625 3.51225 200.86799 -2.63921 15.7546 8.62459 13.1541
21.9375 6.10196 199.47247 -2.60761 16.14134 8.44041 12.04324
22.3125 4.92163 198.95263 -0.13712 15.12269 9.33479 11.52437
22.6875 0.99565 197.25578 -0.83758 15.18775 9.24885 10.98586
23.0625 2.24639 196.7826 -1.74737 13.33846 10.82042 11.43248
23.4375 0.94894 198.15763 -1.1112 13.29639 11.96405 11.65878
23.8125 -0.40688 198.84751 -0.58192 11.92909 11.12123 12.62147
24.1875 0.39424 199.85936 -3.3873 13.05963 11.24009 10.98772
24.5625 -0.24298 201.85559 0.23429 13.0439 10.90272 10.13882
24.9375 2.36575 200.97505 0.51298 12.25488 10.83498 11.27287
25.3125 -1.09665 201.01919 0.09507 12.05088 10.61333 8.40508
25.6875 -1.10711 201.56449 2.25624 10.33608 9.34312 9.14214
26.0625 0.00032 201.62911 0.19457 12.59823 10.88211 8.01867
26.4375 2.14947 203.76272 -0.06661 11.23912 8.12798 7.40291
26.8125 2.21291 200.59193 -1.58434 9.42059 7.30852 10.37322
27.1875 1.46245 201.38408 -2.92782 10.605 9.89589 8.38481
27.5625 2.44018 203.74689 -2.06102 10.94113 6.83882 8.26514
27.9375 5.77368 200.03956 -0.22726 15.23768 7.57585 11.93688
28.3125 1.91381 197.56481 -1.70214 12.28746 6.52883 8.47585
28.6875 -2.99452 200.14002 -4.50336 10.00282 10.35884 6.03179
29.0625 0.3918 198.72746 -2.24236 7.40266 8.23263 8.02227
29.4375 0.12937 200.01201 -3.32835 11.38241 7.87217 9.46816
29.8125 1.53384 203.25758 -3.83238 12.57071 4.4455 8.82668
