0.05000 -3283.09495 566.47332 -282.95534 7748.13119 7708.83691 6509.27080
0.15000 -6937.94464 -51.95143 -726.46903 6133.77828 6645.28083 9264.86336
0.25000 -9692.28099 182.16368 -200.72998 5671.72547 5815.44549 11369.85650
0.35000 -11669.11545 11.18664 273.80614 5232.37825 5252.81036 13166.85601
0.45000 -12711.91149 55.61681 -160.39214 4963.84263 4978.50707 13665.51891
0.55000 -13227.16705 182.78117 -93.57882 5081.67922 4606.93517 13927.77849
0.65000 -13441.23606 82.33372 -172.41927 4839.78969 4332.83493 13921.75586
0.75000 -13274.73303 61.49623 -424.58449 4590.65817 4173.05422 13726.89103
0.85000 -13236.30648 139.13146 -194.18824 4444.77782 4059.21814 13178.06337
0.95000 -13060.68173 44.58886 -27.97626 4220.09859 3963.98725 12690.21427
1.05000 -12805.53490 87.73810 85.11540 3937.46869 3916.32741 12201.21201
1.15000 -12577.44983 35.52205 -12.01423 3772.80111 3864.88000 11659.70983
1.25000 -12430.77087 68.62097 -66.93036 3642.18605 3807.75908 11137.29544
1.35000 -12322.66123 58.56425 -115.86243 3396.56119 3759.50181 10654.58973
1.45000 -12081.39622 74.44245 23.98177 3231.58032 3657.86002 10286.99486
1.55000 -11921.03669 27.60047 8.51630 3037.32572 3589.34098 9808.48028
1.65000 -11812.16501 31.52100 -169.75141 2864.43640 3541.53781 9360.52650
1.75000 -11680.56222 68.05516 -141.67163 2748.30120 3465.05154 8993.27904
1.85000 -11415.94147 -13.77931 -95.75139 2628.47500 3324.81274 8767.45965
1.95000 -11330.24698 39.84184 -86.59213 2413.77273 3254.07220 8257.76902
2.05000 -11147.31136 4.59590 -139.25363 2335.72382 3184.84163 7937.61680
2.15000 -11017.32698 7.09770 -90.32811 2191.18948 3114.22407 7603.79744
2.25000 -10833.22840 27.13835 113.80436 2143.69869 2990.78547 7387.96362
2.35000 -10725.25392 57.53654 8.71797 1980.77171 2937.20004 7063.30453
2.45000 -10538.62807 15.52972 34.79505 1925.67077 2835.58692 6866.08142
2.55000 -10409.82551 -7.13565 114.39246 1826.56723 2750.67654 6598.92042
2.65000 -10276.39667 65.01379 84.11521 1792.54340 2666.70776 6348.40979
2.75000 -10108.63111 -18.95880 3.10736 1730.90015 2611.05713 6168.92251
2.85000 -9958.99246 2.18569 -2.22929 1659.78262 2516.93582 5949.13658
2.95000 -9833.62502 -30.50270 73.41854 1608.97425 2444.57427 5748.73198
3.05000 -9664.90248 -31.32828 51.79552 1519.73013 2368.24951 5623.37703
3.15000 -9533.21767 18.55977 -48.45349 1486.98743 2319.65261 5395.87275
3.25000 -9390.69256 7.56899 -6.41044 1409.44924 2230.10542 5253.87061
3.35000 -9251.18097 22.22662 28.54616 1408.19745 2126.20350 5073.91538
3.45000 -9104.24176 -2.87087 -4.73881 1340.16787 2109.35753 4933.23055
3.55000 -8975.92694 -3.29688 -44.52350 1287.40544 2005.73886 4788.31376
3.65000 -8881.17990 -3.00177 11.30085 1257.54812 1971.91872 4583.30253
3.75000 -8767.01049 -6.95492 95.92495 1239.46123 1927.31982 4489.74130
3.85000 -8590.95899 16.25815 19.78765 1168.94841 1838.08271 4365.74261
3.95000 -8480.79001 -33.25565 62.03991 1112.18528 1799.80476 4230.09864
4.05000 -8337.92002 32.77847 4.82576 1080.16159 1742.20868 4136.66468
4.15000 -8180.23602 15.33904 -43.37544 1126.19000 1671.99752 4057.37286
4.25000 -8108.94362 11.47906 50.69572 1053.82485 1640.94129 3924.69675
4.35000 -8008.68821 34.67605 35.48696 1021.94880 1578.74225 3776.87712
4.45000 -7907.26263 26.20877 93.31767 950.92314 1541.26811 3672.66687
4.55000 -7831.73294 24.64312 117.49689 928.40431 1483.64707 3531.88851
4.65000 -7683.15023 29.88976 -9.90777 935.54818 1423.62989 3510.99604
4.75000 -7605.76414 20.70036 20.38841 867.67042 1414.33829 3361.59399
4.85000 -7502.49350 21.82846 0.50118 847.69478 1342.48459 3275.88776
4.95000 -7365.61823 14.07980 45.80548 841.11108 1318.03048 3210.23309
5.05000 -7275.92351 18.53519 11.25974 831.71167 1264.01238 3116.89260
5.15000 -7173.67273 -4.29622 62.81317 811.55992 1255.03385 3079.28870
5.25000 -7085.13903 23.87436 -65.73662 782.28670 1224.04928 2941.66214
5.35000 -7005.60210 32.16020 3.71331 734.18318 1165.75096 2871.51293
5.45000 -6910.36388 16.48103 -43.35132 695.26822 1105.44029 2796.35759
5.55000 -6826.50227 20.16239 -15.02886 655.33397 1105.11919 2735.29799
5.65000 -6747.14697 -30.65961 18.40924 692.69054 1070.85660 2641.63183
5.75000 -6639.76680 17.20621 -38.91515 687.50902 1026.02381 2606.78573
5.85000 -6559.04368 43.67574 44.32516 605.37016 996.36510 2494.70389
5.95000 -6442.03222 6.59004 50.32322 608.50316 988.12506 2461.60563
6.05000 -6372.49004 -0.84614 29.85838 591.30160 926.98173 2413.40354
6.15000 -6286.96687 29.52927 -19.67152 558.51802 901.17062 2330.59750
6.25000 -6218.39225 7.17413 20.43743 551.55629 892.21436 2256.85669
6.35000 -6113.29551 -13.77381 -1.36124 555.41860 865.39437 2185.14981
6.45000 -6029.41116 -0.13459 -9.12444 500.34010 818.73221 2119.88463
6.55000 -5947.25844 37.60126 42.23442 507.55902 800.04457 2076.39923
6.65000 -5870.79071 7.11689 11.36000 609.06406 769.38385 2072.64576
6.75000 -5779.97985 22.28904 -3.82893 494.91775 774.71531 1983.06856
6.85000 -5706.24771 6.78916 -0.27795 449.71933 738.29020 1936.12374
6.95000 -5651.08225 -18.89320 35.27748 426.62450 728.96696 1852.46400
7.05000 -5573.69099 -9.36481 58.75156 431.31800 703.02483 1825.64812
7.15000 -5505.98868 7.59219 50.28329 426.97123 685.62067 1816.48892
7.25000 -5440.49778 -1.13541 39.45216 418.88667 671.36834 1708.29413
7.35000 -5373.16749 -7.17762 68.44396 375.70073 674.04915 1733.67480
7.45000 -5313.29106 -15.75191 25.77294 370.86168 644.16966 1655.12844
7.55000 -5255.89757 -12.11963 73.92896 448.38917 648.67490 1611.50291
7.65000 -5209.26801 -18.77391 12.33167 339.36836 602.61425 1556.03154
7.75000 -5147.21118 -15.81726 46.74751 335.09856 597.22978 1568.72296
7.85000 -5106.69631 -10.35948 82.76847 319.92708 602.83219 1513.34602
7.95000 -5053.62929 -10.98546 92.83479 309.29336 577.53452 1461.67702
8.05000 -5004.36484 -15.41433 11.13777 320.35411 569.02506 1427.15352
8.15000 -4960.64368 -20.21918 55.83924 315.74230 581.24151 1383.24464
8.25000 -4925.70179 -8.52995 34.86954 295.31999 559.14469 1357.29359
8.35000 -4887.77449 -12.51893 33.42241 308.04862 547.73347 1326.65184
8.45000 -4867.06434 -9.53695 63.99329 306.10794 548.90404 1278.68128
8.55000 -4826.57089 -8.31753 63.58092 303.23235 534.07602 1243.12914
8.65000 -4792.21559 -3.69077 68.11957 306.72395 525.29407 1223.16301
8.75000 -4768.13064 -4.87278 56.63433 352.26457 520.03387 1218.56762
8.85000 -4742.66823 -4.78150 39.53205 321.84109 506.66740 1161.20977
8.95000 -4722.30685 -16.01201 70.51949 326.14288 515.09812 1128.37169
9.05000 -4708.09280 -1.70064 18.72515 360.64517 489.40851 1108.76094
9.15000 -4692.22785 6.92727 42.84006 352.59690 498.20879 1071.73350
9.25000 -4661.64800 6.18669 58.86919 373.47023 477.56332 1034.83514
9.35000 -4663.37183 4.33044 31.31762 421.39692 478.74204 1011.58332
9.45000 -4632.85595 6.59733 9.25318 411.84520 491.71062 988.19445
9.55000 -4625.94142 -3.51675 19.97776 405.08184 446.17791 979.21285
9.65000 -4589.67640 -2.87126 26.09832 417.34312 439.50131 928.90111
9.75000 -4584.15725 13.21975 9.29087 438.39062 418.93352 900.15519
9.85000 -4537.09443 10.25129 22.85488 463.68760 402.64228 855.83200
9.95000 -4494.43495 11.80386 28.37206 452.03157 377.33714 830.35582
10.05000 -4469.75913 7.17950 8.03599 467.29699 371.41426 815.30275
10.15000 -4445.25141 10.49783 -0.08633 482.86523 349.76403 803.64513
10.25000 -4390.61638 6.99102 10.54720 458.47755 352.22358 766.96660
10.35000 -4356.18101 13.37047 13.59638 473.95377 327.01113 743.45617
10.45000 -4305.51468 7.68428 16.45320 444.28599 306.04259 709.05719
10.55000 -4274.03791 10.85266 41.74581 423.29852 306.06722 718.53600
10.65000 -4220.98177 22.05461 7.66066 408.09060 284.10762 663.07713
10.75000 -4177.80887 21.93421 -0.38196 398.82800 268.91566 656.91106
10.85000 -4138.31369 14.65717 34.77546 377.95369 257.68684 641.14713
10.95000 -4090.73910 11.84525 27.22415 355.91573 248.73117 609.20319
11.05000 -4062.99342 15.93517 -4.39581 350.70545 289.70460 620.84794
11.15000 -4015.07987 10.08564 2.66502 317.50232 219.41627 597.61150
11.25000 -3985.41520 16.29475 14.98968 329.70237 216.56925 584.44885
11.35000 -3955.51261 15.02620 32.84278 303.21793 225.35416 551.88844
11.45000 -3918.10711 17.61963 13.38439 295.29931 216.87029 551.69210
11.55000 -3887.30230 13.43404 21.22389 284.34473 200.23646 521.85279
11.65000 -3860.15207 17.01501 13.83145 267.69039 201.61885 534.53948
11.75000 -3819.82106 15.80286 26.29484 273.63922 188.16527 510.47983
11.85000 -3803.06078 16.70802 34.75810 262.25913 196.79314 491.51229
11.95000 -3762.95657 14.83804 21.55863 251.40114 170.88494 493.85634
12.05000 -3745.85057 17.22016 25.03260 257.66612 180.26231 476.22124
12.15000 -3705.64905 20.00964 10.04405 238.19087 168.37420 462.36271
12.25000 -3673.70420 12.87178 18.71006 223.16620 190.29013 460.73593
12.35000 -3645.83549 18.30569 29.84966 225.49779 167.41520 452.78904
12.45000 -3622.86385 9.72674 28.96011 217.13297 167.85581 445.67871
12.55000 -3587.50747 13.97770 19.32372 227.05456 159.68865 438.64480
12.65000 -3563.90118 14.48503 17.94619 182.48273 146.95529 417.87232
12.75000 -3531.68640 13.99204 23.98984 198.97690 149.24952 427.28288
12.85000 -3507.01897 17.62879 19.57785 195.07594 166.55653 424.85300
12.95000 -3484.59852 7.78123 31.92663 256.44029 167.63290 390.64225
13.05000 -3450.05802 16.98198 35.42731 167.05388 143.58110 386.90249
13.15000 -3428.49627 8.39423 21.00496 166.98853 129.71907 385.95998
13.25000 -3397.67051 17.77458 35.09938 185.02274 138.48389 378.98659
13.35000 -3386.50803 11.81965 39.48579 192.04402 192.28152 373.94292
13.45000 -3357.50342 17.46815 25.71288 170.98392 131.21933 375.74113
13.55000 -3322.64232 3.99544 48.90032 182.48267 166.33908 379.63897
13.65000 -3309.88735 10.31517 33.95387 141.24480 109.11673 344.62117
13.75000 -3277.81207 14.64279 40.32873 159.41568 128.06801 379.75071
13.85000 -3253.86003 9.34911 41.91660 132.39817 103.02361 338.18948
13.95000 -3232.89951 12.00169 40.21755 134.98972 140.47479 340.22190
14.05000 -3210.78160 13.53530 41.81924 171.98785 114.54907 325.50689
14.15000 -3189.44741 14.53252 40.69322 143.20147 99.50790 327.87595
14.25000 -3172.85651 8.29942 36.96145 116.22888 94.75019 312.07810
14.35000 -3152.36942 10.04516 52.30277 117.42087 113.72725 314.10333
14.45000 -3129.97091 12.17246 34.49609 108.47021 109.02988 302.02666
14.55000 -3109.15242 13.40871 51.65940 130.79169 92.14767 296.29742
14.65000 -3084.71343 10.34707 32.49769 172.64056 123.87874 299.19376
14.75000 -3069.34010 9.01631 30.22750 130.32639 101.16881 291.97198
14.85000 -3045.76785 10.70197 46.23976 113.74557 101.68916 282.56688
14.95000 -3032.20217 8.70762 42.72828 114.54838 101.42864 276.66698
15.05000 -3008.11361 4.96832 42.08837 110.58064 98.06508 278.61645
15.15000 -2985.37690 13.99910 36.05716 114.19459 103.51160 281.06347
15.25000 -2975.46945 4.10120 44.23756 247.36256 226.78030 283.19680
15.35000 -2954.80383 8.38042 43.26411 128.88232 97.04674 267.54922
15.45000 -2939.68942 8.65409 35.02824 91.05460 76.52358 258.83161
15.55000 -2914.35085 7.67003 40.41577 94.83590 149.13894 262.31670
15.65000 -2897.69640 7.66345 35.68357 104.26439 94.10523 248.35165
15.75000 -2873.58667 9.15744 30.91827 144.70274 80.27679 246.75108
15.85000 -2857.22487 12.59141 31.35672 81.18868 103.73921 235.79875
15.95000 -2840.32705 6.65005 48.05455 84.01453 74.01032 246.05528
16.05000 -2822.94765 8.98589 37.72204 79.57146 74.55348 228.42217
16.15000 -2805.11044 5.16851 36.88263 77.69542 77.67999 237.39494
16.25000 -2786.50721 5.33428 18.17306 77.73558 73.49762 227.18373
16.35000 -2774.35783 4.68013 36.50499 86.74462 81.36321 224.51924
16.45000 -2751.85616 6.24246 30.86586 76.60067 68.07448 217.85190
16.55000 -2731.01448 2.67075 27.34407 79.65962 82.30157 241.03531
16.65000 -2718.21504 4.52956 19.05634 117.47167 105.45328 226.42940
16.75000 -2705.23320 3.83950 11.57453 81.92923 72.83815 201.19162
16.85000 -2685.64581 4.66014 26.03833 74.07343 63.81419 196.31346
16.95000 -2672.32740 4.82931 21.98065 72.59595 63.16250 219.90183
17.05000 -2654.54657 4.84324 12.25438 61.86417 55.85819 204.35539
17.15000 -2637.71395 5.62813 21.29954 66.51299 52.79899 191.01017
17.25000 -2628.55267 4.11818 23.67217 186.18324 90.16374 193.60013
17.35000 -2607.89278 12.11385 17.74034 70.91946 115.82956 194.02078
17.45000 -2588.81207 2.49199 16.65611 64.30940 60.33934 178.96230
17.55000 -2564.69866 2.49613 -5.27370 67.84671 53.42787 191.05501
17.65000 -2551.93507 2.71935 16.32875 116.42953 63.28933 183.95557
17.75000 -2533.61557 1.65633 16.29102 58.26975 44.71926 178.07738
17.85000 -2521.99713 -2.62298 -3.80114 71.68257 60.68778 175.82891
17.95000 -2505.57808 9.66273 15.10304 91.05353 232.22408 253.74578
18.05000 -2492.84206 -1.15298 16.47086 79.60462 59.37126 167.58093
18.15000 -2480.80792 -1.56630 8.17288 54.60437 49.64441 163.71709
18.25000 -2459.98219 1.72254 -5.25608 51.64148 45.06219 162.55639
18.35000 -2449.51152 1.89880 9.57124 64.67844 127.72453 177.53773
18.45000 -2434.71046 1.62700 16.38320 59.81020 53.61524 168.55850
18.55000 -2416.05119 8.42562 9.77287 133.28983 86.15489 237.53580
18.65000 -2398.47001 3.57669 14.30207 63.64107 50.70375 172.33667
18.75000 -2390.78870 2.44324 2.97437 53.96529 43.53274 154.59646
18.85000 -2361.85479 -0.28727 15.90953 97.72676 126.40991 212.25895
18.95000 -2357.48979 3.25347 12.37370 68.03415 40.88456 155.98269
19.05000 -2345.49121 3.42775 9.76336 59.00128 61.27151 159.25341
19.15000 -2334.30100 2.21563 3.20442 55.83016 42.80180 149.47624
19.25000 -2319.71760 5.65102 15.72784 61.31720 62.29019 153.00131
19.35000 -2306.56568 3.13721 11.86071 55.97302 36.57373 138.86759
19.45000 -2290.72203 5.39982 23.81344 76.87171 47.15169 147.02083
19.55000 -2277.23934 4.57368 17.78887 76.09982 58.37508 149.85195
19.65000 -2256.75998 11.80807 20.73085 145.46387 104.01890 139.47637
19.75000 -2242.64541 7.72690 22.78388 52.86918 49.69559 136.28000
19.85000 -2233.99175 8.58358 13.72480 79.22995 49.97043 138.89851
19.95000 -2218.58326 13.82044 10.05777 56.76721 75.73198 163.78334
