0.05000 2781.32420
0.15000 5114.00559
0.25000 7625.65564
0.35000 9471.76808
0.45000 10869.93264
0.55000 11633.82791
0.65000 12162.32188
0.75000 11931.36048
0.85000 11913.40654
0.95000 11581.63240
1.05000 11284.27706
1.15000 10792.81086
1.25000 10291.90739
1.35000 9765.59575
1.45000 9339.75364
1.55000 8933.44903
1.65000 8416.88462
1.75000 8021.55969
1.85000 7630.40309
1.95000 7309.69407
2.05000 6902.71428
2.15000 6648.40584
2.25000 6241.89303
2.35000 6158.55750
2.45000 5818.58167
2.55000 5590.41151
2.65000 5374.48682
2.75000 5113.59698
2.85000 5033.83483
2.95000 4842.40835
3.05000 4669.85930
3.15000 4504.20666
3.25000 4304.53672
3.35000 4210.52337
3.45000 4070.42724
3.55000 3958.44362
3.65000 3787.10483
3.75000 3705.86501
3.85000 3635.75648
3.95000 3458.69512
4.05000 3294.31351
4.15000 3234.45931
4.25000 3129.07542
4.35000 3114.49231
4.45000 2991.04055
4.55000 2855.22220
4.65000 2731.79539
4.75000 2638.66660
4.85000 2590.59606
4.95000 2462.71150
5.05000 2394.75794
5.15000 2290.44504
5.25000 2223.97759
5.35000 2108.87300
5.45000 2101.91967
5.55000 1981.70603
5.65000 1917.29404
5.75000 1880.30679
5.85000 1833.83396
5.95000 1750.34154
6.05000 1738.28839
6.15000 1621.40210
6.25000 1568.59317
6.35000 1542.51683
6.45000 1495.60465
6.55000 1425.17167
6.65000 1376.09393
6.75000 1359.47585
6.85000 1338.33441
6.95000 1299.06971
7.05000 1260.99974
7.15000 1221.97984
7.25000 1160.04378
7.35000 1152.15921
7.45000 1096.92903
7.55000 1099.93389
7.65000 1073.37144
7.75000 1049.81711
7.85000 1011.08764
7.95000 1015.09655
8.05000 977.49259
8.15000 960.27616
8.25000 927.19098
8.35000 896.10528
8.45000 887.02760
8.55000 872.23507
8.65000 840.60791
8.75000 817.81568
8.85000 816.46488
8.95000 775.88428
9.05000 764.93484
9.15000 734.65259
9.25000 727.76363
9.35000 685.57861
9.45000 658.88105
9.55000 646.73329
9.65000 638.00085
9.75000 594.81726
9.85000 587.54353
9.95000 568.95328
10.05000 558.18174
10.15000 534.94534
10.25000 525.56016
10.35000 506.04027
10.45000 497.40793
10.55000 482.08943
10.65000 472.64929
10.75000 454.72012
10.85000 440.56309
10.95000 437.30696
11.05000 436.36242
11.15000 425.60462
11.25000 418.78891
11.35000 401.52482
11.45000 400.17983
11.55000 387.43336
11.65000 384.23909
11.75000 370.27320
11.85000 357.33801
11.95000 354.43855
12.05000 353.75516
12.15000 348.77172
12.25000 349.45758
12.35000 316.22975
12.45000 325.24801
12.55000 313.73960
12.65000 309.10547
12.75000 303.42352
12.85000 300.49548
12.95000 291.78166
13.05000 284.69842
13.15000 282.30053
13.25000 276.03039
13.35000 272.44062
13.45000 260.13889
13.55000 261.52528
13.65000 257.64954
13.75000 258.52133
13.85000 239.19073
13.95000 245.62142
14.05000 236.93324
14.15000 230.66326
14.25000 228.80195
14.35000 223.71497
14.45000 223.93581
14.55000 214.28274
14.65000 208.72921
14.75000 207.20135
14.85000 209.08698
14.95000 197.69182
15.05000 203.59524
15.15000 194.08123
15.25000 181.23089
15.35000 181.98228
15.45000 185.61325
15.55000 179.58625
15.65000 176.07310
15.75000 171.50507
15.85000 166.63519
15.95000 168.34685
16.05000 166.45644
16.15000 167.50059
16.25000 165.51633
16.35000 153.00104
16.45000 161.75603
16.55000 147.71411
16.65000 164.05138
16.75000 146.65691
16.85000 145.71975
16.95000 143.95582
17.05000 139.35298
17.15000 140.14941
17.25000 132.42468
17.35000 132.78261
17.45000 131.10581
17.55000 123.08697
17.65000 122.23007
17.75000 122.66217
17.85000 119.48546
17.95000 113.10107
18.05000 115.37889
18.15000 118.45968
18.25000 119.63346
18.35000 113.18908
18.45000 110.00594
18.55000 109.36078
18.65000 108.75260
18.75000 113.83594
18.85000 109.18654
18.95000 98.21002
19.05000 106.04497
19.15000 102.30251
19.25000 104.51764
19.35000 101.29632
19.45000 101.02265
19.55000 97.58262
19.65000 93.21590
19.75000 99.05963
19.85000 99.17400
19.95000 102.24341
