0.2 -0.07337 20.8606 -1.50247 144.20665 140.31375 138.1199
0.6 0.62928 49.32402 -1.30745 129.95908 111.9737 109.77622
1.0 0.1189 62.39965 0.33152 119.6463 92.43901 91.38098
1.4 1.11695 68.65273 -0.53193 107.19457 83.25327 78.90069
1.8 -0.56421 73.81593 -0.88647 96.37969 79.15253 71.77258
2.2 0.54516 85.20407 -0.86552 86.02733 78.19394 66.27132
2.6 0.77509 101.14832 -0.64688 77.59487 77.74567 62.64297
3.0 -0.32081 122.2212 0.58853 68.18197 73.5657 58.22361
3.4 -0.30511 142.14038 -0.15912 59.31171 65.28345 53.15667
3.8 0.0826 158.12236 -0.224 51.95214 54.561 48.29257
4.2 -0.65223 169.28798 -0.97086 46.98571 44.56789 42.90224
4.6 -0.83378 176.28729 -0.20098 43.61618 38.1158 38.87943
5.0 -0.32213 180.79983 0.03877 41.74751 34.08817 35.99075
5.4 0.03216 183.59289 0.36293 39.61801 31.95291 33.94203
5.8 0.42586 186.74025 0.53335 38.4272 30.76737 32.4588
6.2 0.25909 189.28189 0.75281 36.93214 30.09673 30.27537
6.6 0.36912 192.72041 0.86828 35.78094 29.05915 28.9037
7.0 -0.02663 195.10118 0.87017 35.04404 28.04499 27.95215
7.4 0.21766 197.54665 0.99131 33.56323 26.89946 26.32675
7.8 0.37242 199.13041 1.04944 32.65994 25.82917 25.77384
8.2 0.2417 200.63107 0.84848 31.4921 24.52214 24.54832
8.6 0.07709 201.50474 1.62936 30.01878 23.85203 23.2592
9.0 0.49635 202.73043 1.17116 29.11875 22.71637 22.82491
9.4 -0.12049 203.40055 1.56652 27.85885 22.48447 21.76101
9.8 0.15436 205.61717 1.20625 27.20191 21.43151 21.05183
10.2 0.54014 206.23975 0.87616 26.57124 21.01683 20.15645
10.6 0.61896 207.61451 0.62814 26.20503 20.19662 19.65302
11.0 0.46069 208.29663 0.71718 25.40168 18.57324 19.47179
11.4 0.19025 208.45623 0.41393 24.65918 17.85289 18.66396
11.8 0.6845 207.86333 0.30114 24.37611 16.82083 18.2558
12.2 0.88002 207.48322 -0.47887 23.48667 16.3814 17.77252
12.6 0.76406 207.15701 -0.31184 22.68018 16.30662 16.60604
13.0 0.8048 206.70609 -0.98213 22.39209 16.80727 15.95952
13.4 0.52563 207.28345 -0.78376 21.19197 16.70438 15.42539
13.8 -0.0113 208.3946 -1.01143 21.03472 16.47392 14.575
14.2 -0.38062 208.05619 -0.26242 19.981 15.79704 13.80534
14.6 0.35291 209.51846 -0.1187 19.77609 14.16993 13.29114
15.0 -0.14283 209.2619 -0.40473 18.54778 13.5466 12.25173
15.4 -0.25833 209.11895 0.09919 18.51913 13.28932 12.35459
15.8 0.10287 209.43052 0.12407 18.20447 12.78457 12.40471
16.2 -0.5569 209.38046 0.91756 17.36587 12.25272 11.70909
16.6 0.05544 209.13574 0.94555 16.39656 12.172 11.43985
17.0 0.04894 208.62394 0.99927 16.42247 11.40668 11.5026
17.4 0.48026 208.4053 1.19598 15.98465 11.3062 10.91684
17.8 -0.50204 208.13933 1.34531 15.7934 11.30343 10.55788
18.2 -0.32515 208.04934 0.92093 14.99543 11.05064 10.44782
18.6 -0.85761 208.28704 0.78611 14.41249 10.51734 10.47658
19.0 -0.67536 207.31285 1.16242 14.6269 10.68054 10.10938
19.4 -0.37707 207.73098 1.02545 14.07335 10.09711 9.84519
19.8 -0.14912 207.75788 0.72715 13.11123 9.64435 9.65289
