0.12500 0.06335
0.37500 0.01429
0.62500 0.02942
0.87500 0.01523
1.12500 0.05502
1.37500 0.07657
1.62500 0.10056
1.87500 0.12495
2.12500 0.15876
2.37500 0.17810
2.62500 0.20738
2.87500 0.21195
3.12500 0.22112
3.37500 0.20304
3.62500 0.20620
3.87500 0.19748
4.12500 0.19508
4.37500 0.18232
4.62500 0.17568
4.87500 0.15281
5.12500 0.13318
5.37500 0.10817
5.62500 0.07997
5.87500 0.07987
6.12500 0.05786
6.37500 0.08258
6.62500 0.06167
6.87500 0.07900
7.12500 0.07805
7.37500 0.06846
7.62500 0.08435
7.87500 0.06852
8.12500 0.06082
8.37500 0.04944
8.62500 0.03697
8.87500 0.03385
9.12500 0.02498
9.37500 0.03012
9.62500 0.03850
9.87500 0.02743
10.12500 0.02979
10.37500 0.01890
10.62500 0.01991
10.87500 0.00928
11.12500 0.01549
11.37500 0.01907
11.62500 0.02248
11.87500 0.01459
12.12500 0.02257
12.37500 0.03045
12.62500 0.01971
12.87500 0.03395
13.12500 0.04877
13.37500 0.04562
13.62500 0.05078
13.87500 0.05599
14.12500 0.05535
14.37500 0.05238
14.62500 0.05085
14.87500 0.04621
