0.12500 0.05590
0.37500 0.01728
0.62500 0.03596
0.87500 0.05739
1.12500 0.09499
1.37500 0.10344
1.62500 0.13487
1.87500 0.17532
2.12500 0.19686
2.37500 0.20306
2.62500 0.18634
2.87500 0.16387
3.12500 0.15048
3.37500 0.11995
3.62500 0.09969
3.87500 0.06911
4.12500 0.07311
4.37500 0.06395
4.62500 0.06557
4.87500 0.05962
5.12500 0.06357
5.37500 0.06492
5.62500 0.06755
5.87500 0.07630
6.12500 0.06287
6.37500 0.06416
6.62500 0.06610
6.87500 0.06774
7.12500 0.06198
7.37500 0.06635
7.62500 0.07168
7.87500 0.06810
8.12500 0.06216
8.37500 0.05186
8.62500 0.01624
8.87500 0.03501
9.12500 0.02717
9.37500 0.01743
9.62500 0.01210
9.87500 0.01256
10.12500 0.00710
10.37500 0.01000
10.62500 0.01118
10.87500 0.01061
11.12500 0.01758
11.37500 0.01204
11.62500 0.00757
11.87500 0.01234
12.12500 0.02984
12.37500 0.04951
12.62500 0.03512
12.87500 0.05381
13.12500 0.04039
13.37500 0.06109
13.62500 0.03963
13.87500 0.04824
14.12500 0.04205
14.37500 0.04281
14.62500 0.04857
14.87500 0.06170
