0.05000 -1272.18862 437.88532 778.84275 1395.46250 2489.75605 2922.39825
0.15000 -2023.48693 -60.63109 -64.30306 18023.10161 4935.24963 5692.31486
0.25000 -3689.79402 -27.57989 215.18649 1939.89415 1492.03952 4769.83994
0.35000 -4683.65589 -98.87197 336.78311 3366.44775 2541.24926 5742.12931
0.45000 -5078.94993 -54.32769 129.83028 2740.16122 2749.62237 6282.46482
0.55000 -5388.20753 64.81747 91.68281 3470.19382 1991.17556 6611.18639
0.65000 -5418.27095 -9.12341 227.67930 8992.57298 1447.88759 6707.27566
0.75000 -5812.42241 8.85028 51.57426 2019.48720 1621.95566 6872.79119
0.85000 -6018.27808 1.61460 152.42552 3203.87343 1671.59909 6799.53086
0.95000 -6337.34948 5.70598 -96.74679 2343.07699 2221.68454 6803.54444
1.05000 -6364.57451 -46.09874 -111.08986 1827.16938 1222.84749 6904.11927
1.15000 -6581.64905 17.35545 -165.13700 1816.27989 1237.12293 6772.08794
1.25000 -6672.94673 -19.76625 -153.86971 3513.25530 2756.30151 7630.67939
1.35000 -6817.71161 -3.48163 -29.38655 1799.83030 1060.85135 6421.99394
1.45000 -6917.62594 37.07819 -176.40217 1631.47149 1109.97053 6159.86618
1.55000 -7052.18274 -5.07237 -167.09615 2042.24894 1215.45075 6167.55080
1.65000 -7120.90727 4.48377 -99.60284 1583.71632 930.79701 5859.37585
1.75000 -7165.48320 -2.47098 -73.87422 1411.23698 1254.88231 5781.37090
1.85000 -7233.05490 17.72914 -135.07500 1367.04048 893.14493 5545.21424
1.95000 -7255.33937 19.81982 -77.79690 1225.07316 797.23110 5470.66434
2.05000 -7312.21475 0.83906 -36.31808 1257.86960 846.41305 5267.43398
2.15000 -7336.73009 20.58806 97.79104 1291.57103 1322.65503 5244.96848
2.25000 -7369.42414 15.49529 17.52048 1278.96257 850.32628 4991.28566
2.35000 -7381.12488 10.69618 23.33071 1078.70102 775.08429 4865.84899
2.45000 -7394.15901 -24.38113 94.49046 1226.06347 3405.33741 5351.71174
2.55000 -7417.74453 9.60594 -60.62781 1040.26207 733.78621 4598.61199
2.65000 -7426.07202 -5.01964 50.29517 928.83716 769.74815 4488.32658
2.75000 -7438.26456 3.79804 54.24166 1037.86794 783.79436 4362.81567
2.85000 -7433.09153 11.91301 -1.96235 1040.57561 699.14576 4270.19377
2.95000 -7417.45409 9.62303 -5.75285 926.77064 847.08210 4331.74735
3.05000 -7405.50553 16.16756 -15.70885 1061.80122 762.30672 4198.60343
3.15000 -7387.71091 12.37506 -36.13402 892.20538 539.43265 3947.85150
3.25000 -7360.22128 9.03950 -13.77010 852.25745 776.62989 3840.10087
3.35000 -7321.50149 14.43494 -89.79228 788.73189 626.06228 3681.98588
3.45000 -7273.75397 43.70624 -29.94619 1400.95496 2977.26957 3605.09225
3.55000 -7265.59442 21.68676 53.68382 983.59520 775.72919 3531.98543
3.65000 -7238.34043 -0.09122 -14.16439 774.21591 896.77358 3354.08305
3.75000 -7203.08128 15.46120 5.95955 918.23402 616.09502 4248.43471
3.85000 -7170.20980 20.17476 49.57640 687.78576 647.54777 3255.81635
3.95000 -7117.71807 14.54467 -44.52926 644.13313 491.62144 3189.03571
4.05000 -7090.43260 16.95412 39.86098 567.62632 447.93252 3019.16587
4.15000 -7049.65481 9.83320 17.15447 651.64170 574.53664 3004.06634
4.25000 -7047.62340 6.62174 33.48992 2199.90348 870.45340 2910.82443
4.35000 -6983.12634 0.31642 7.31822 624.53301 521.59469 2856.87687
4.45000 -6951.07389 4.29104 41.34062 721.65514 993.52559 3268.58048
4.55000 -6893.43881 1.39756 10.27063 859.86145 926.81212 2768.81892
4.65000 -6831.47149 4.25889 -13.40261 521.92377 389.57227 2632.89477
4.75000 -6804.15317 4.40247 9.86147 828.26676 521.56980 2600.86340
4.85000 -6767.34095 9.37540 -27.20937 491.37413 415.27973 2481.19273
4.95000 -6702.08901 9.93863 -13.22956 543.14449 379.32500 2444.41548
5.05000 -6659.09781 11.40516 -3.60442 456.54734 369.99114 2391.76996
5.15000 -6599.96898 5.84047 24.08281 517.52561 340.09674 2330.30345
5.25000 -6553.85206 12.20676 23.82513 633.29653 420.71489 2279.74998
5.35000 -6491.10107 6.29809 46.10300 543.11231 416.47520 2239.82269
5.45000 -6439.10331 7.29567 -52.51567 470.39615 501.61520 2183.77334
5.55000 -6383.13475 3.40683 -20.65514 543.02663 386.77541 2126.61886
5.65000 -6345.23555 6.38128 18.75732 411.67548 360.33504 2068.62036
5.75000 -6293.87413 0.03180 8.39345 489.56996 358.75226 2025.64044
5.85000 -6251.76367 3.86572 -46.69345 521.24584 525.89037 2020.70518
5.95000 -6206.87387 -1.39530 20.73672 560.38721 626.08227 1956.47240
6.05000 -6155.08672 5.08268 12.77971 557.98740 293.65001 1903.20372
6.15000 -6129.00392 6.87784 17.84777 361.02980 336.58498 1833.15844
6.25000 -6077.68572 6.58132 13.52106 405.79637 550.48604 1800.13294
6.35000 -6035.13606 2.64072 29.84533 1101.86736 834.67303 1951.57553
6.45000 -6002.71195 10.53620 27.87605 350.38401 322.10026 1725.29068
6.55000 -5963.80904 7.42654 59.26481 346.94272 253.97030 1685.87864
6.65000 -5927.42797 1.70029 -12.26608 339.45217 323.60804 1646.58671
6.75000 -5897.93879 4.30021 44.71931 365.71684 373.74788 1625.32613
6.85000 -5856.85025 0.66047 38.21518 295.74094 269.05406 1567.08771
6.95000 -5824.48124 12.29094 28.60156 319.40732 283.91206 1538.66500
7.05000 -5796.39953 6.40465 31.35999 377.06103 324.53999 1497.21162
7.15000 -5761.05153 10.08316 40.67750 344.12638 274.07381 1482.93744
7.25000 -5719.82969 2.08475 39.78795 476.82866 719.18106 1482.28242
7.35000 -5694.39109 3.80393 15.68811 364.11079 294.05368 1394.74828
7.45000 -5653.90488 3.66956 -30.10247 403.54056 374.59677 1406.93402
7.55000 -5616.50531 6.72772 22.29776 407.95516 682.52443 1372.38645
7.65000 -5582.82281 6.33708 -3.40635 1082.10025 1444.47514 1353.04861
7.75000 -5537.21782 -0.23489 6.73792 354.83734 294.92285 1291.39576
7.85000 -5501.47821 8.27059 20.46670 335.72772 206.78281 1258.60144
7.95000 -5448.24505 3.67699 34.41121 288.52708 253.67216 1228.27362
8.05000 -5410.96816 6.63806 -12.87959 575.33623 364.93103 1230.61214
8.15000 -5357.37129 7.88954 0.62007 275.57682 278.49821 1168.43161
8.25000 -5310.90962 5.88289 8.10219 287.62387 231.60242 1132.17131
8.35000 -5253.31556 8.52688 -10.02051 398.48747 314.45226 1132.01651
8.45000 -5210.86109 0.91263 -11.75150 311.58535 206.88032 1088.80307
8.55000 -5162.87518 4.45758 1.59889 263.73374 247.02681 1079.03495
8.65000 -5126.73660 7.27084 -12.94125 334.97153 231.01806 1041.56815
8.75000 -5074.59981 0.57063 -16.41076 199.25283 182.21389 1048.69438
8.85000 -5024.98958 3.43638 0.16548 196.58726 139.55420 998.34665
8.95000 -4981.99941 2.93600 14.61310 229.89346 298.34205 969.15612
9.05000 -4938.07722 5.29994 -44.02628 193.65757 213.78995 952.45859
9.15000 -4907.05412 -0.16192 -36.05708 202.55518 180.42923 931.38669
9.25000 -4863.98511 4.95581 -14.39698 198.25028 179.63482 898.71359
9.35000 -4820.98832 4.58024 -24.21542 215.19575 206.68974 884.98707
9.45000 -4788.30569 3.58659 -13.34076 203.19909 210.29472 843.66715
9.55000 -4747.99949 4.32899 -11.99031 460.84374 236.98074 848.78722
9.65000 -4698.55121 -1.07562 -23.38516 283.76957 261.37956 865.37311
9.75000 -4672.64807 -2.10896 -8.17274 348.65728 249.35080 804.51746
9.85000 -4625.92236 7.08907 -15.85195 237.79185 335.44764 847.73558
9.95000 -4588.19729 6.73949 0.14908 347.56130 300.87063 842.52418
10.05000 -4536.78184 0.89007 -22.34283 744.07086 271.93410 762.36103
10.15000 -4512.55140 6.27995 -20.03741 2056.53494 732.36109 822.91593
10.25000 -4460.01822 2.88037 -6.00329 321.47189 250.83440 722.54337
10.35000 -4429.83356 6.34996 -5.13462 262.86127 290.97563 733.70937
10.45000 -4393.95789 2.37803 -0.56379 211.34444 215.48476 731.89696
10.55000 -4348.70509 1.43096 -16.37301 206.59658 202.05840 687.45814
10.65000 -4320.21654 3.02298 -2.18555 164.92278 142.31587 685.94386
10.75000 -4276.08184 5.37233 12.07052 153.60411 169.42863 675.75515
10.85000 -4247.31366 6.27710 30.11025 210.44226 163.57874 664.06348
10.95000 -4207.16856 1.59737 -11.42263 158.04185 134.33167 628.84705
11.05000 -4170.57536 0.32490 3.30395 198.28715 116.30999 616.13097
11.15000 -4139.22086 6.67833 9.64737 154.54878 140.14882 614.83076
11.25000 -4113.49111 1.01695 -26.44594 176.14581 154.22566 673.11298
11.35000 -4074.58517 6.85217 11.67900 150.89074 131.93637 584.36549
11.45000 -4046.95576 2.08380 9.71447 149.78229 151.70893 583.95628
11.55000 -4031.12168 0.48920 21.84782 696.42047 173.56390 667.65358
11.65000 -3998.37375 2.70397 15.34180 129.84578 140.62798 550.89570
11.75000 -3974.30789 2.52813 12.68019 183.39688 152.74953 548.37018
11.85000 -3945.28109 7.65890 16.71776 209.56318 166.60923 531.37925
11.95000 -3920.76506 4.61849 27.30943 698.63697 129.07873 586.70712
12.05000 -3899.77170 4.72098 28.30981 140.50745 101.59477 502.34632
12.15000 -3873.43989 2.96908 10.77703 300.92202 145.37376 516.25823
12.25000 -3848.91279 5.70532 30.16389 110.03570 102.64418 495.37058
12.35000 -3826.22648 -2.43976 10.78327 152.66116 211.93870 486.62825
12.45000 -3793.75613 8.78709 24.24873 273.68393 279.14163 522.65244
12.55000 -3767.96398 -0.04896 29.80718 124.94333 98.53620 472.61788
12.65000 -3740.76109 2.80552 41.32929 176.09487 101.78373 463.71623
12.75000 -3711.25535 6.10473 27.53819 168.31212 258.34401 529.76906
12.85000 -3681.05808 2.76913 16.35077 151.93482 123.05021 455.95120
12.95000 -3653.48107 1.00173 28.71677 117.76487 94.37561 427.10919
13.05000 -3630.60400 -0.11996 22.97730 106.08251 110.83390 418.53126
13.15000 -3602.36512 2.22933 8.14619 97.85434 102.77753 407.56497
13.25000 -3572.36207 4.62739 26.80859 121.12564 92.20012 411.16408
13.35000 -3540.59167 3.07297 13.36224 184.67725 275.33339 654.92268
13.45000 -3519.01061 5.34126 40.56136 130.10841 162.82660 428.22700
13.55000 -3488.29058 1.97383 -15.78279 171.88978 101.71462 389.19112
13.65000 -3464.16639 3.69198 9.35186 81.21787 93.05850 381.27317
13.75000 -3437.06737 1.79391 7.45713 176.36174 87.92877 376.41503
13.85000 -3413.58182 4.10891 6.16006 88.39403 76.53625 354.20480
13.95000 -3383.79466 2.39006 4.15360 203.13518 99.13231 352.64628
14.05000 -3360.69089 2.32280 -4.40480 120.01858 86.71089 335.22701
14.15000 -3338.90211 16.67052 -10.72229 129.16713 548.24354 339.38580
14.25000 -3311.70587 2.48881 -10.30247 66.65438 67.20421 323.80341
14.35000 -3284.77393 4.09727 -13.09456 137.35161 171.30487 340.98996
14.45000 -3265.11802 -1.11459 -0.71246 116.43595 227.45318 323.33403
14.55000 -3235.98941 2.76114 -9.36008 61.03624 70.56956 328.75782
14.65000 -3212.31127 -2.14739 -8.10663 100.18102 130.81580 315.96755
14.75000 -3188.83567 -3.93688 1.82729 122.00277 135.59937 338.58498
14.85000 -3167.58022 2.81771 0.24628 75.60063 79.61308 289.95358
14.95000 -3149.14351 1.29619 0.02570 99.41823 111.46385 290.64007
15.05000 -3117.04020 5.52927 -5.86209 57.95949 144.13767 279.37710
15.15000 -3094.69439 0.08651 -8.74672 79.28660 76.00409 281.06133
15.25000 -3080.12703 6.88654 5.76066 106.88624 106.69227 263.84455
15.35000 -3053.98885 2.54518 10.15040 98.69129 83.75654 261.02371
15.45000 -3028.83270 1.16599 2.31595 169.30902 165.60136 269.85259
15.55000 -3017.49225 2.98590 2.10157 59.91157 79.34497 251.27448
15.65000 -2999.27101 2.46640 18.48320 62.80708 67.45483 249.83908
15.75000 -2974.40477 1.06831 17.09884 156.00303 121.89617 262.58655
15.85000 -2959.75792 1.02356 20.87038 94.90189 144.37553 266.76270
15.95000 -2940.32953 1.63231 19.56462 63.64940 90.13045 239.37709
16.05000 -2920.56552 7.32757 22.49787 78.74965 107.89890 246.82107
16.15000 -2909.51415 -3.16835 25.42301 132.65931 157.28011 253.61581
16.25000 -2883.58544 0.04905 10.42670 196.97195 150.37724 265.03028
16.35000 -2881.19256 4.31543 18.13224 362.98098 201.50474 243.59616
16.45000 -2851.35652 -1.66548 28.22912 116.55602 60.75898 218.49294
16.55000 -2837.92582 5.83877 27.52377 60.25695 95.91704 217.41634
16.65000 -2817.34113 2.14713 39.17332 63.74826 121.62628 222.30585
16.75000 -2801.48091 -1.70501 24.93192 88.14495 86.91722 224.77796
16.85000 -2782.57870 5.93103 32.29735 62.47012 65.05818 199.61532
16.95000 -2764.88261 -2.13983 30.81746 63.01703 53.31844 204.51857
17.05000 -2747.01708 -7.11306 29.64647 50.20445 227.69947 194.44518
17.15000 -2731.93394 4.44962 15.66539 73.59276 60.58806 298.55134
17.25000 -2711.11046 0.28403 26.91355 50.77180 44.44388 193.19048
17.35000 -2692.62709 1.83574 11.83468 126.15773 84.12109 379.98450
17.45000 -2677.66560 0.18625 27.79190 67.13256 75.33287 203.91377
17.55000 -2658.76178 3.03133 18.48311 94.45537 144.26579 180.57467
17.65000 -2639.22615 2.40706 24.51798 163.88963 63.03857 286.79293
17.75000 -2625.62884 1.03148 14.08589 68.06680 436.79577 243.56510
17.85000 -2610.04485 3.69252 24.07623 73.39228 73.74000 183.82084
17.95000 -2596.29892 1.64380 4.25918 57.76993 50.44370 171.43581
18.05000 -2579.03438 2.44663 5.10519 49.63022 55.08136 173.69532
18.15000 -2566.91079 -1.22850 16.28042 47.18139 83.41606 166.60522
18.25000 -2549.71274 0.45085 8.22951 63.44320 60.31983 170.34880
18.35000 -2536.46003 -0.99940 -1.38208 44.17898 62.91288 168.33414
18.45000 -2520.69480 -0.31879 2.82601 45.79238 35.66613 161.80880
18.55000 -2504.26021 1.97043 5.70267 81.72622 54.53453 158.00697
18.65000 -2493.99913 -1.37383 -0.72248 43.50719 56.43050 157.22263
18.75000 -2478.86748 1.10189 -1.91061 99.13976 40.78652 163.17336
18.85000 -2468.43608 0.30230 -4.86857 62.63683 46.72289 162.01056
18.95000 -2452.74865 0.24751 -3.14379 37.75986 45.12963 152.05730
19.05000 -2438.43521 0.84186 -10.61384 45.26879 45.44402 159.33378
19.15000 -2426.21187 1.27716 -5.71673 43.21655 35.84574 145.89054
19.25000 -2410.34357 0.82019 -6.75716 42.08686 36.25203 136.40399
19.35000 -2397.05851 1.33134 -0.67285 35.15439 29.72806 141.43178
19.45000 -2383.50644 4.72549 -5.74695 33.79717 53.74942 134.59228
19.55000 -2367.01985 0.88187 -5.99623 54.14327 54.91100 138.91392
19.65000 -2356.88698 0.83004 1.75335 45.27928 51.39627 132.19925
19.75000 -2340.88942 -3.56334 -5.53900 61.37425 51.02639 132.84131
19.85000 -2333.98439 0.88111 -2.19225 76.93152 38.32042 155.09165
19.95000 -2319.28686 -0.94731 -7.55398 53.14355 58.62626 144.01927
