0.12500 0.02665
0.37500 0.01779
0.62500 0.03327
0.87500 0.04509
1.12500 0.07925
1.37500 0.07677
1.62500 0.11315
1.87500 0.11436
2.12500 0.12411
2.37500 0.12548
2.62500 0.14206
2.87500 0.14050
3.12500 0.13945
3.37500 0.15456
3.62500 0.13579
3.87500 0.13875
4.12500 0.14572
4.37500 0.14893
4.62500 0.13777
4.87500 0.12486
5.12500 0.12057
5.37500 0.09983
5.62500 0.09521
5.87500 0.08971
6.12500 0.07545
6.37500 0.07811
6.62500 0.09363
6.87500 0.06368
7.12500 0.06198
7.37500 0.07001
7.62500 0.08692
7.87500 0.05770
8.12500 0.04617
8.37500 0.06495
8.62500 0.04540
8.87500 0.02902
9.12500 0.00883
9.37500 0.03631
9.62500 0.00811
9.87500 0.01485
10.12500 0.00351
10.37500 0.01644
10.62500 0.01559
10.87500 0.02456
11.12500 0.01077
11.37500 0.00567
11.62500 0.02190
11.87500 0.02232
12.12500 0.04639
12.37500 0.04342
12.62500 0.06855
12.87500 0.04197
13.12500 0.02871
13.37500 0.04912
13.62500 0.05126
13.87500 0.00725
14.12500 0.05354
14.37500 0.08090
14.62500 0.03490
14.87500 0.05831
