0.12500 0.03094
0.37500 0.01718
0.62500 0.07195
0.87500 0.13252
1.12500 0.17817
1.37500 0.23163
1.62500 0.27485
1.87500 0.31174
2.12500 0.34526
2.37500 0.37771
2.62500 0.41729
2.87500 0.44019
3.12500 0.45395
3.37500 0.48421
3.62500 0.50753
3.87500 0.51495
4.12500 0.54375
4.37500 0.55343
4.62500 0.55796
4.87500 0.59669
5.12500 0.57885
5.37500 0.60011
5.62500 0.58708
5.87500 0.61570
6.12500 0.62640
6.37500 0.57748
6.62500 0.56466
6.87500 0.55426
7.12500 0.50258
7.37500 0.46673
7.62500 0.40360
7.87500 0.40250
8.12500 0.36957
8.37500 0.36397
8.62500 0.35461
8.87500 0.38579
9.12500 0.33871
9.37500 0.34799
9.62500 0.34941
9.87500 0.30311
10.12500 0.27212
10.37500 0.24534
10.62500 0.16825
10.87500 0.13472
11.12500 0.09095
11.37500 0.07150
11.62500 0.06640
11.87500 0.05781
12.12500 0.08315
12.37500 0.04874
12.62500 0.04612
12.87500 0.05443
13.12500 0.00749
13.37500 0.07667
13.62500 0.02443
13.87500 0.02863
14.12500 0.06478
14.37500 0.06913
14.62500 0.05144
14.87500 0.08379
15.12500 0.07472
15.37500 0.10051
15.62500 0.08809
15.87500 0.07207
16.12500 0.11505
16.37500 0.08789
16.62500 0.10319
16.87500 0.11109
17.12500 0.09617
17.37500 0.08074
17.62500 0.09231
17.87500 0.06867
18.12500 0.14361
18.37500 0.09130
18.62500 0.12159
18.87500 0.12095
19.12500 0.10193
19.37500 0.12131
19.62500 0.18305
19.87500 0.18021
