0.12500 0.01911
0.37500 0.01545
0.62500 0.01080
0.87500 0.01586
1.12500 0.00760
1.37500 0.02013
1.62500 0.01227
1.87500 0.01886
2.12500 0.03962
2.37500 0.03836
2.62500 0.04030
2.87500 0.04647
3.12500 0.04931
3.37500 0.04743
3.62500 0.04221
3.87500 0.04490
4.12500 0.04846
4.37500 0.05444
4.62500 0.04868
4.87500 0.04304
5.12500 0.06120
5.37500 0.05491
5.62500 0.04622
5.87500 0.04983
6.12500 0.04471
6.37500 0.03340
6.62500 0.02221
6.87500 0.01932
7.12500 0.00376
7.37500 0.01384
7.62500 0.02166
7.87500 0.02121
8.12500 0.02405
8.37500 0.02974
8.62500 0.03363
8.87500 0.02792
9.12500 0.03025
9.37500 0.01486
9.62500 0.02058
9.87500 0.03227
10.12500 0.02816
10.37500 0.03455
10.62500 0.02333
10.87500 0.02864
11.12500 0.03162
11.37500 0.01656
11.62500 0.02058
11.87500 0.00709
12.12500 0.01330
12.37500 0.00956
12.62500 0.03600
12.87500 0.02444
13.12500 0.02478
13.37500 0.01357
13.62500 0.03133
13.87500 0.01916
14.12500 0.03950
14.37500 0.03776
14.62500 0.00504
14.87500 0.02072
