0.12500 0.01004
0.37500 0.00891
0.62500 0.00400
0.87500 0.01032
1.12500 0.01251
1.37500 0.00157
1.62500 0.01650
1.87500 0.01211
2.12500 0.01426
2.37500 0.00557
2.62500 0.00250
2.87500 0.01072
3.12500 0.00938
3.37500 0.01000
3.62500 0.00205
3.87500 0.00689
4.12500 0.02311
4.37500 0.01525
4.62500 0.01373
4.87500 0.00489
5.12500 0.01773
5.37500 0.02372
5.62500 0.02107
5.87500 0.02467
6.12500 0.02122
6.37500 0.01800
6.62500 0.01225
6.87500 0.01804
7.12500 0.01204
7.37500 0.00876
7.62500 0.01111
7.87500 0.00705
8.12500 0.01791
8.37500 0.01741
8.62500 0.00725
8.87500 0.01965
9.12500 0.02548
9.37500 0.03835
9.62500 0.01577
9.87500 0.01801
10.12500 0.01746
10.37500 0.01402
10.62500 0.00888
10.87500 0.01684
11.12500 0.01886
11.37500 0.00404
11.62500 0.01554
11.87500 0.00981
12.12500 0.00827
12.37500 0.00769
12.62500 0.00907
12.87500 0.00562
13.12500 0.00603
13.37500 0.01333
13.62500 0.02181
13.87500 0.01015
14.12500 0.01481
14.37500 0.00131
14.62500 0.01491
14.87500 0.04461
