0.125 -0.000 0.002 0.009
0.375 0.002 -0.006 0.113
0.625 -0.002 -0.001 0.398
0.875 -0.007 0.005 0.811
1.125 0.009 -0.023 1.371
1.375 -0.005 0.022 1.881
1.625 -0.037 -0.013 2.434
1.875 0.001 -0.010 3.072
2.125 -0.043 0.030 3.796
2.375 -0.024 -0.004 4.683
2.625 -0.053 -0.062 5.637
2.875 -0.037 0.006 6.784
3.125 -0.034 -0.009 8.055
3.375 -0.051 -0.032 9.411
3.625 -0.124 0.041 10.664
3.875 -0.063 -0.064 12.206
4.125 -0.044 0.016 13.462
4.375 -0.095 0.011 14.865
4.625 -0.143 0.010 16.508
4.875 -0.066 0.006 17.483
5.125 -0.091 0.003 18.147
5.375 -0.096 0.021 18.960
5.625 -0.105 0.015 19.600
5.875 -0.057 0.041 20.143
6.125 -0.036 0.057 20.949
6.375 -0.044 0.066 22.099
6.625 -0.095 0.040 22.553
6.875 -0.103 0.064 23.246
7.125 -0.114 0.065 23.369
7.375 -0.134 0.094 23.591
7.625 -0.127 0.082 24.585
7.875 -0.114 0.121 24.959
8.125 -0.153 0.032 25.067
8.375 -0.146 0.056 25.383
8.625 -0.221 0.075 26.754
8.875 -0.155 0.065 26.946
9.125 -0.099 0.048 26.505
9.375 -0.157 0.053 26.585
9.625 -0.153 0.042 27.467
9.875 -0.118 0.046 27.387
10.125 -0.109 -0.018 28.045
10.375 -0.180 -0.052 28.090
10.625 -0.099 -0.040 28.107
10.875 -0.102 0.046 27.663
11.125 -0.118 0.023 27.431
11.375 -0.119 0.018 26.302
11.625 -0.043 0.025 25.295
11.875 -0.045 0.029 25.166
12.125 -0.066 0.007 24.831
12.375 -0.026 0.073 23.530
12.625 -0.037 0.073 22.490
12.875 -0.027 0.097 21.964
13.125 -0.036 0.122 21.067
13.375 -0.057 0.121 20.286
13.625 -0.071 0.123 19.486
13.875 -0.077 0.103 18.647
14.125 -0.069 0.123 17.989
14.375 -0.089 0.150 17.566
14.625 -0.102 0.099 16.537
14.875 -0.140 0.082 16.023
15.125 -0.135 0.084 16.007
15.375 -0.126 0.056 15.407
15.625 -0.120 0.039 15.173
15.875 -0.114 0.016 14.254
16.125 -0.147 0.027 14.054
16.375 -0.141 -0.002 14.140
16.625 -0.151 0.011 12.983
16.875 -0.103 -0.012 12.430
17.125 -0.105 -0.011 11.936
17.375 -0.093 -0.042 11.616
17.625 -0.087 -0.042 11.136
17.875 -0.041 -0.028 10.754
18.125 -0.035 -0.009 11.042
18.375 -0.015 -0.045 10.340
18.625 -0.004 -0.007 10.036
18.875 -0.009 -0.018 9.727
19.125 0.010 -0.023 9.682
19.375 0.003 -0.003 9.439
19.625 0.013 -0.004 8.583
19.875 0.024 0.004 8.314
