0.05000 2864.76704
0.15000 5915.27185
0.25000 8643.49579
0.35000 10533.32750
0.45000 11742.11550
0.55000 12413.28765
0.65000 12566.78762
0.75000 12431.74118
0.85000 12338.64316
0.95000 11757.18803
1.05000 11373.65058
1.15000 10810.95844
1.25000 10291.07392
1.35000 9746.94051
1.45000 9301.68966
1.55000 8828.83167
1.65000 8385.19191
1.75000 7905.71793
1.85000 7487.10224
1.95000 7215.59178
2.05000 6833.47365
2.15000 6573.70022
2.25000 6256.67608
2.35000 6012.19230
2.45000 5777.24817
2.55000 5528.96106
2.65000 5241.76227
2.75000 5066.11229
2.85000 4913.52827
2.95000 4673.76501
3.05000 4530.94481
3.15000 4380.13903
3.25000 4177.47258
3.35000 4085.50387
3.45000 3909.68551
3.55000 3806.24159
3.65000 3696.90828
3.75000 3524.46275
3.85000 3467.44389
3.95000 3287.96031
4.05000 3240.19671
4.15000 3134.74158
4.25000 3010.91504
4.35000 2916.46762
4.45000 2835.68126
4.55000 2744.10437
4.65000 2689.33119
4.75000 2555.09598
4.85000 2539.10305
4.95000 2472.35760
5.05000 2364.08872
5.15000 2300.13251
5.25000 2221.56108
5.35000 2162.71789
5.45000 2114.75277
5.55000 1985.59930
5.65000 1933.68862
5.75000 1884.96115
5.85000 1786.04887
5.95000 1791.61693
6.05000 1749.16576
6.15000 1646.77770
6.25000 1580.98969
6.35000 1555.82694
6.45000 1508.07310
6.55000 1465.50042
6.65000 1418.66085
6.75000 1384.11224
6.85000 1296.77591
6.95000 1305.94654
7.05000 1257.95575
7.15000 1230.24894
7.25000 1199.74369
7.35000 1173.40823
7.45000 1117.35852
7.55000 1110.18604
7.65000 1055.68447
7.75000 1026.22749
7.85000 1013.95530
7.95000 981.52116
8.05000 952.95274
8.15000 903.63427
8.25000 872.98586
8.35000 836.03869
8.45000 788.74088
8.55000 787.99272
8.65000 734.83623
8.75000 707.60073
8.85000 682.87467
8.95000 672.61975
9.05000 627.05294
9.15000 625.14900
9.25000 607.93743
9.35000 587.35842
9.45000 565.97674
9.55000 560.16999
9.65000 541.39887
9.75000 526.16027
9.85000 503.04850
9.95000 498.57509
10.05000 487.77108
10.15000 473.54057
10.25000 474.74757
10.35000 462.04667
10.45000 448.77599
10.55000 442.50088
10.65000 428.30599
10.75000 421.82248
10.85000 412.86828
10.95000 408.19975
11.05000 402.80100
11.15000 388.27474
11.25000 383.32282
11.35000 370.00551
11.45000 363.73385
11.55000 359.89027
11.65000 346.86862
11.75000 338.67615
11.85000 329.39305
11.95000 333.78553
12.05000 329.95210
12.15000 316.78770
12.25000 307.49022
12.35000 293.05621
12.45000 288.43590
12.55000 277.96129
12.65000 283.90176
12.75000 273.00151
12.85000 273.38385
12.95000 261.66589
13.05000 262.33510
13.15000 259.22577
13.25000 244.88050
13.35000 241.23035
13.45000 235.36659
13.55000 244.76777
13.65000 226.27547
13.75000 223.93293
13.85000 220.20004
13.95000 208.77751
14.05000 203.08909
14.15000 194.32927
14.25000 202.78633
14.35000 201.43362
14.45000 196.44851
14.55000 192.63213
14.65000 182.54463
14.75000 182.59032
14.85000 181.52546
14.95000 184.99305
15.05000 177.34328
15.15000 160.13083
15.25000 173.03602
15.35000 167.74219
15.45000 156.95877
15.55000 153.37463
15.65000 157.67491
15.75000 162.40403
15.85000 149.85484
15.95000 138.60277
16.05000 140.75683
16.15000 146.62521
16.25000 144.93314
16.35000 138.43092
16.45000 134.48872
16.55000 134.71270
16.65000 136.43034
16.75000 144.30857
16.85000 138.70719
16.95000 137.66662
17.05000 132.35604
17.15000 127.47363
17.25000 125.07536
17.35000 125.41853
17.45000 133.15355
17.55000 110.35912
17.65000 122.03508
17.75000 122.11044
17.85000 129.91641
17.95000 122.82749
18.05000 123.92296
18.15000 124.72839
18.25000 117.44450
18.35000 115.29719
18.45000 105.66999
18.55000 113.18843
18.65000 114.08719
18.75000 102.81648
18.85000 105.89150
18.95000 100.95435
19.05000 108.18971
19.15000 89.79813
19.25000 103.54155
19.35000 106.99402
19.45000 101.13902
19.55000 89.64919
19.65000 101.02067
19.75000 96.05365
19.85000 93.48099
19.95000 94.14425
