0.05000 2504.38366
0.15000 4114.44920
0.25000 5678.65427
0.35000 7101.59817
0.45000 7933.76414
0.55000 8594.09000
0.65000 8660.94768
0.75000 8821.23854
0.85000 8699.95492
0.95000 8544.12709
1.05000 8366.13184
1.15000 8068.32039
1.25000 7798.87022
1.35000 7487.35694
1.45000 7165.10374
1.55000 6876.15730
1.65000 6580.00502
1.75000 6441.46870
1.85000 6179.18058
1.95000 5872.18601
2.05000 5678.26304
2.15000 5479.92308
2.25000 5273.73378
2.35000 5103.24443
2.45000 4924.14803
2.55000 4782.66702
2.65000 4603.62619
2.75000 4468.78892
2.85000 4253.88574
2.95000 4174.89845
3.05000 3979.04281
3.15000 3817.66698
3.25000 3736.25543
3.35000 3647.56415
3.45000 3433.75274
3.55000 3338.41400
3.65000 3212.93687
3.75000 3031.14488
3.85000 2973.32796
3.95000 2826.16885
4.05000 2714.53666
4.15000 2595.68725
4.25000 2521.58557
4.35000 2402.26335
4.45000 2380.64875
4.55000 2265.71589
4.65000 2163.29974
4.75000 2148.41138
4.85000 2086.83948
4.95000 2009.33060
5.05000 1955.13368
5.15000 1896.78115
5.25000 1824.03099
5.35000 1806.15009
5.45000 1794.63858
5.55000 1704.56072
5.65000 1627.10664
5.75000 1638.79262
5.85000 1565.51818
5.95000 1568.10032
6.05000 1495.09459
6.15000 1490.09648
6.25000 1406.36537
6.35000 1384.20446
6.45000 1344.52853
6.55000 1337.10140
6.65000 1267.56383
6.75000 1264.79657
6.85000 1239.78452
6.95000 1196.21963
7.05000 1156.10034
7.15000 1120.02256
7.25000 1104.77971
7.35000 1068.97288
7.45000 1050.85763
7.55000 1018.57127
7.65000 994.67098
7.75000 962.75052
7.85000 938.56851
7.95000 910.91340
8.05000 873.80675
8.15000 861.48541
8.25000 846.31253
8.35000 847.31533
8.45000 814.79172
8.55000 788.05374
8.65000 764.64911
8.75000 734.60880
8.85000 728.98794
8.95000 713.75328
9.05000 684.71374
9.15000 680.74072
9.25000 662.53328
9.35000 643.08941
9.45000 622.41826
9.55000 617.13408
9.65000 598.30219
9.75000 581.57511
9.85000 567.12990
9.95000 566.09627
10.05000 548.02869
10.15000 522.05265
10.25000 535.93027
10.35000 513.45451
10.45000 497.24529
10.55000 486.47733
10.65000 476.56608
10.75000 476.59443
10.85000 460.06038
10.95000 465.89744
11.05000 446.87853
11.15000 429.72653
11.25000 424.05301
11.35000 426.77203
11.45000 405.72713
11.55000 404.13952
11.65000 386.28907
11.75000 398.74545
11.85000 384.34973
11.95000 374.52995
12.05000 374.83957
12.15000 354.24235
12.25000 361.93545
12.35000 366.63905
12.45000 347.46082
12.55000 342.55834
12.65000 340.80210
12.75000 328.43615
12.85000 326.98445
12.95000 324.49213
13.05000 309.94917
13.15000 317.04877
13.25000 303.21018
13.35000 294.32514
13.45000 288.44985
13.55000 283.54922
13.65000 279.25892
13.75000 270.76978
13.85000 269.46565
13.95000 263.75345
14.05000 253.35632
14.15000 246.79248
14.25000 253.70754
14.35000 243.91649
14.45000 235.96326
14.55000 230.49742
14.65000 223.68137
14.75000 233.82401
14.85000 220.02589
14.95000 210.00703
15.05000 202.80398
15.15000 203.38070
15.25000 193.03118
15.35000 191.16763
15.45000 190.74992
15.55000 182.08041
15.65000 180.10225
15.75000 181.28351
15.85000 175.30546
15.95000 173.00142
16.05000 172.22095
16.15000 167.71325
16.25000 156.75400
16.35000 157.88340
16.45000 155.53439
16.55000 150.31202
16.65000 150.61552
16.75000 151.08212
16.85000 147.55277
16.95000 139.53920
17.05000 140.65648
17.15000 133.11503
17.25000 139.99522
17.35000 132.28442
17.45000 125.19663
17.55000 130.82782
17.65000 129.10258
17.75000 130.09864
17.85000 119.44844
17.95000 117.21084
18.05000 119.20976
18.15000 112.83563
18.25000 106.33169
18.35000 112.47416
18.45000 114.70294
18.55000 101.50719
18.65000 100.34196
18.75000 105.33918
18.85000 96.30030
18.95000 95.29768
19.05000 94.54757
19.15000 95.29423
19.25000 89.73041
19.35000 90.98758
19.45000 91.98823
19.55000 93.68537
19.65000 92.91550
19.75000 87.27719
19.85000 81.92556
19.95000 95.02067
