0.05000 100411.65876
0.15000 74597.26240
0.25000 49111.11646
0.35000 36623.25739
0.45000 29987.45615
0.55000 25157.79981
0.65000 22091.82887
0.75000 19788.23261
0.85000 17216.32929
0.95000 15793.94861
1.05000 14264.12083
1.15000 12831.41135
1.25000 12028.34910
1.35000 11022.69091
1.45000 10359.05055
1.55000 9769.14879
1.65000 9137.04289
1.75000 8538.54778
1.85000 8195.06824
1.95000 7749.55013
2.05000 7353.86920
2.15000 7023.65429
2.25000 6716.02971
2.35000 6396.88337
2.45000 6065.27657
2.55000 5789.80688
2.65000 5558.67894
2.75000 5350.22486
2.85000 5049.48407
2.95000 4976.72533
3.05000 4718.31542
3.15000 4503.64610
3.25000 4327.06792
3.35000 4208.14898
3.45000 3923.79462
3.55000 3854.72853
3.65000 3696.52639
3.75000 3513.72185
3.85000 3302.23107
3.95000 3121.21737
4.05000 2981.12861
4.15000 2876.31989
4.25000 2696.63159
4.35000 2666.52761
4.45000 2542.69061
4.55000 2466.80905
4.65000 2384.37097
4.75000 2329.88952
4.85000 2265.34184
4.95000 2238.66736
5.05000 2149.71618
5.15000 2091.50487
5.25000 2065.81020
5.35000 2033.47584
5.45000 1940.33205
5.55000 1890.75854
5.65000 1842.82740
5.75000 1813.95032
5.85000 1738.82920
5.95000 1720.93104
6.05000 1664.35921
6.15000 1614.24100
6.25000 1558.77560
6.35000 1510.03454
6.45000 1477.88706
6.55000 1451.12696
6.65000 1405.81710
6.75000 1350.97426
6.85000 1347.20260
6.95000 1321.35513
7.05000 1264.31261
7.15000 1244.37935
7.25000 1197.79164
7.35000 1162.25431
7.45000 1152.16778
7.55000 1139.29473
7.65000 1111.18236
7.75000 1059.71525
7.85000 1044.29877
7.95000 1031.78639
8.05000 1007.05168
8.15000 992.51689
8.25000 976.87546
8.35000 972.49853
8.45000 950.54431
8.55000 897.89974
8.65000 897.03801
8.75000 880.52608
8.85000 863.22246
8.95000 827.89528
9.05000 817.57937
9.15000 805.12912
9.25000 818.31423
9.35000 775.61761
9.45000 767.54178
9.55000 751.34676
9.65000 729.78576
9.75000 738.85291
9.85000 696.21547
9.95000 694.91503
10.05000 690.79465
10.15000 678.71464
10.25000 654.33898
10.35000 647.16051
10.45000 645.67315
10.55000 641.74688
10.65000 612.16422
10.75000 611.03181
10.85000 608.86650
10.95000 601.73903
11.05000 567.78998
11.15000 570.91601
11.25000 556.77526
11.35000 557.33546
11.45000 540.64659
11.55000 533.31052
11.65000 521.61315
11.75000 510.03872
11.85000 504.69264
11.95000 502.84915
12.05000 493.53304
12.15000 486.51746
12.25000 474.48077
12.35000 460.91624
12.45000 460.02102
12.55000 462.45670
12.65000 441.27383
12.75000 427.47340
12.85000 422.15696
12.95000 414.57288
13.05000 411.59030
13.15000 406.69610
13.25000 392.34361
13.35000 374.65776
13.45000 378.10630
13.55000 376.94381
13.65000 370.97943
13.75000 361.41378
13.85000 344.52231
13.95000 334.74856
14.05000 341.45711
14.15000 332.44157
14.25000 325.85528
14.35000 314.94991
14.45000 319.81099
14.55000 307.23313
14.65000 294.81401
14.75000 291.96319
14.85000 292.08042
14.95000 285.32801
15.05000 292.18367
15.15000 311.01802
15.25000 266.90788
15.35000 277.59233
15.45000 270.63589
15.55000 259.83713
15.65000 254.76130
15.75000 259.04273
15.85000 261.01829
15.95000 240.37794
16.05000 234.26799
16.15000 234.39871
16.25000 234.44761
16.35000 232.35471
16.45000 227.04030
16.55000 223.68643
16.65000 222.12491
16.75000 216.16145
16.85000 215.59397
16.95000 211.52755
17.05000 201.92708
17.15000 202.40224
17.25000 202.04668
17.35000 193.72209
17.45000 195.69750
17.55000 181.09892
17.65000 178.32495
17.75000 182.03177
17.85000 184.97568
17.95000 174.91841
18.05000 187.26039
18.15000 164.19580
18.25000 169.25964
18.35000 157.16286
18.45000 163.00246
18.55000 170.54609
18.65000 151.57110
18.75000 140.64961
18.85000 161.19357
18.95000 152.54963
19.05000 160.49924
19.15000 139.79742
19.25000 143.21834
19.35000 148.67949
19.45000 144.47172
19.55000 136.72704
19.65000 129.52254
19.75000 127.60985
19.85000 131.87319
19.95000 121.57055
