0.1875 0.42617 21.24674 -0.6246 70.93353 72.41835 64.41187
0.5625 -1.43726 40.94545 0.4227 69.08563 68.81752 63.06689
0.9375 -1.1533 63.35842 1.64153 66.25493 65.06133 60.84258
1.3125 0.03246 81.47871 0.30033 62.90541 61.37182 57.41645
1.6875 -0.81395 97.97334 -0.32283 59.57377 57.18248 54.03564
2.0625 -0.09981 110.25823 0.45017 56.08918 54.17747 51.38146
2.4375 0.19299 124.10379 1.26756 52.65235 49.24673 47.92556
2.8125 0.60481 135.09707 0.77089 48.93761 47.60082 45.28278
3.1875 1.85566 144.34617 0.97029 46.51683 42.83217 43.19479
3.5625 -0.08921 152.10782 0.91564 44.58052 41.27564 40.66948
3.9375 -0.34811 159.81273 0.96378 42.51758 38.59146 38.03753
4.3125 0.6143 167.36762 0.78222 40.18053 35.31162 36.23141
4.6875 -0.18161 171.76911 0.70768 38.52774 33.27755 33.97908
5.0625 -0.29116 175.61925 0.27521 37.06302 31.01977 32.48802
5.4375 -0.28377 178.74645 -0.56328 35.40577 29.65177 31.04481
5.8125 -1.19077 182.47986 -0.05331 34.35221 28.34679 29.0259
6.1875 -2.39124 185.83614 -0.89137 32.54872 27.01346 27.8772
6.5625 -2.15637 188.55341 -0.9969 31.11428 25.81729 26.28026
6.9375 -1.83916 190.70455 -0.887 29.95778 24.40105 25.13846
7.3125 -1.20725 192.63006 -0.71795 29.00124 23.41551 23.52121
7.6875 -0.68449 194.14001 -0.13165 28.02393 22.27836 22.75665
8.0625 0.30966 196.55787 -0.27693 26.42784 22.14845 21.82185
8.4375 0.86555 197.17727 -0.37447 25.54072 20.8647 20.925
8.8125 0.32612 198.22561 -0.31725 25.12378 19.708 19.59905
9.1875 -0.29963 199.28925 -0.71241 24.60811 19.24026 18.7423
9.5625 0.07312 200.62712 -1.00796 22.60763 18.61331 18.40674
9.9375 -1.60527 201.78842 -2.07725 21.86325 17.22766 17.11933
10.3125 -1.49974 202.72829 -1.97266 20.88235 15.75297 16.48305
10.6875 -1.66122 202.6331 -2.98766 20.40039 14.66108 15.83691
11.0625 -1.00285 202.60199 -2.91594 19.32079 14.64741 15.37018
11.4375 -0.35745 204.47243 -3.19942 18.94789 14.64025 14.80684
11.8125 0.86541 205.8215 -3.27051 17.91747 14.25417 13.81212
12.1875 1.3213 205.70466 -1.44494 17.51493 13.60663 13.25438
12.5625 1.56104 205.11044 -0.38518 17.51172 12.81183 13.27904
12.9375 0.4037 205.1975 0.66953 16.43914 12.09379 12.61044
13.3125 -0.39531 204.69246 2.17448 16.65936 11.88195 12.33002
13.6875 -1.86445 205.89612 0.82503 15.51374 11.42472 11.54255
14.0625 -1.08501 206.70389 0.05738 14.55235 10.68694 11.7147
14.4375 0.24679 206.89408 0.03876 12.96758 10.38724 10.89729
14.8125 1.05689 206.9894 -0.51012 12.93374 10.10294 10.70168
15.1875 1.23733 207.37281 0.42802 13.20307 9.72251 9.99222
15.5625 2.1106 207.3797 -0.45799 12.51166 9.31537 9.9632
15.9375 1.48665 206.45335 -0.4339 13.13213 9.87509 9.99954
16.3125 0.8903 207.22589 -1.22142 12.37412 8.54014 9.47475
16.6875 -0.2812 206.02626 -2.40652 11.86223 9.00453 9.17933
17.0625 -1.09108 206.76143 -2.95758 10.92778 8.36205 8.64411
17.4375 -1.18622 206.68454 -3.19497 11.24613 7.4528 8.05957
17.8125 -0.97136 206.92903 -2.83549 10.25775 7.25507 7.44667
18.1875 -1.1826 205.89085 -1.52422 10.09949 5.90774 7.27463
18.5625 0.06841 206.51033 -1.40859 8.69578 5.80752 7.73443
18.9375 -0.59377 205.55298 0.37729 8.99182 7.5009 7.40312
19.3125 -0.01755 205.41839 2.10017 9.06112 6.46317 7.33126
19.6875 2.85537 206.655 2.72351 8.27046 6.57393 6.90048
20.0625 2.8019 205.9565 3.02819 8.32758 6.66516 6.38668
20.4375 3.80356 205.72014 2.52826 8.95944 7.21962 6.48129
20.8125 4.15117 205.80816 3.53189 8.95042 7.43341 6.75094
21.1875 2.15124 207.21537 2.21071 9.32026 6.4647 6.583
21.5625 1.93884 206.80898 1.71907 6.91929 6.21946 5.96571
21.9375 1.10588 206.64841 0.62766 7.56634 6.61607 6.80488
22.3125 -0.05217 207.41493 -0.39256 7.74079 5.60235 5.5184
22.6875 0.25487 207.41663 -0.61678 7.54488 4.52826 4.92021
23.0625 -0.41198 207.38113 -1.80304 7.36434 4.14706 5.88784
23.4375 -0.41815 207.31155 -1.59713 7.0633 3.71475 5.48818
23.8125 -1.72021 207.23626 -2.1597 6.55977 3.80572 5.31883
24.1875 -2.48745 205.83307 -2.34478 5.9875 4.30838 4.31423
24.5625 -2.01575 205.28169 -2.98776 4.98421 3.59614 4.97411
24.9375 -3.48397 203.89992 -1.99189 5.8699 3.56148 4.9704
25.3125 -2.84164 204.24786 -1.33897 6.33193 3.95286 3.91402
25.6875 -1.46926 204.71405 -2.08348 5.86346 3.85619 4.50675
26.0625 -3.35562 204.81263 -3.14233 4.86189 3.58084 5.70889
26.4375 -2.86505 202.6224 -2.46181 5.8089 4.12601 4.52761
26.8125 -1.38583 201.19308 -2.5835 5.30495 4.72297 6.08553
27.1875 -2.10813 199.86595 -2.05504 2.72541 4.84843 4.96842
27.5625 2.72282 201.33327 -2.08533 4.20101 3.47062 4.61059
27.9375 3.58192 200.889 0.08696 5.50226 6.83663 6.6069
28.3125 3.09486 201.04468 -0.19612 6.35271 4.47539 4.27046
28.6875 2.8924 203.08445 -0.38473 6.18414 2.70518 3.88352
29.0625 2.57613 200.80627 -2.15231 5.85537 3.3512 3.44496
29.4375 4.93546 201.63818 -1.73215 5.34178 3.88316 2.29747
29.8125 1.95787 202.54184 1.73825 3.93586 3.71907 3.91673
