0.12500 0.01144
0.37500 0.06795
0.62500 0.14293
0.87500 0.23335
1.12500 0.30780
1.37500 0.37069
1.62500 0.41336
1.87500 0.45638
2.12500 0.48553
2.37500 0.52758
2.62500 0.55180
2.87500 0.57352
3.12500 0.59228
3.37500 0.61414
3.62500 0.61661
3.87500 0.62359
4.12500 0.63159
4.37500 0.60949
4.62500 0.60651
4.87500 0.59680
5.12500 0.56412
5.37500 0.53888
5.62500 0.50359
5.87500 0.48997
6.12500 0.47912
6.37500 0.46604
6.62500 0.43771
6.87500 0.42099
7.12500 0.41865
7.37500 0.40688
7.62500 0.40105
7.87500 0.36516
8.12500 0.36383
8.37500 0.32693
8.62500 0.28595
8.87500 0.22646
9.12500 0.17052
9.37500 0.11224
9.62500 0.09316
9.87500 0.05245
10.12500 0.05114
10.37500 0.06909
10.62500 0.03927
10.87500 0.04625
11.12500 0.04354
11.37500 0.04669
11.62500 0.05265
11.87500 0.05575
12.12500 0.07532
12.37500 0.06487
12.62500 0.06278
12.87500 0.05681
13.12500 0.05368
13.37500 0.04793
13.62500 0.05566
13.87500 0.09436
14.12500 0.07113
14.37500 0.08455
14.62500 0.08011
14.87500 0.12504
