0.05000 -1181.96861 -433.29410 -672.16787 2385.19303 3058.93235 2846.48584
0.15000 -2623.49990 187.51288 -444.31246 1894.33876 1886.78424 3717.51175
0.25000 -3813.87980 -13.72245 -484.07316 1871.60703 1713.66964 4737.99186
0.35000 -4386.92769 24.76683 -115.22027 2035.48857 1350.88368 5480.36121
0.45000 -4872.53667 58.67500 306.14756 1958.84374 1568.58868 5928.14061
0.55000 -5034.24538 35.62516 -0.34876 1736.30792 1060.13449 6303.71072
0.65000 -5395.20617 24.78433 -89.81909 1674.66240 1079.65809 6501.98764
0.75000 -5747.92640 29.48629 34.55342 1627.99886 1011.44460 6490.16586
0.85000 -5852.35471 16.07073 39.71988 1764.25707 990.85910 6619.94452
0.95000 -6026.78113 14.44760 -156.38851 1660.13600 1028.21529 6678.51294
1.05000 -6205.83057 25.93725 123.92551 1633.53041 792.58968 6631.26642
1.15000 -6372.50604 21.24193 -181.00427 1559.98197 872.91967 6413.19059
1.25000 -6559.37518 12.35960 -43.05878 1540.98452 907.75422 6230.38132
1.35000 -6652.23235 6.30096 121.39222 1471.70527 715.80446 6174.27404
1.45000 -6781.95453 17.84741 -40.37416 1459.07240 746.77132 5988.50532
1.55000 -6878.99496 13.78248 -69.36725 1363.68159 862.75193 5841.84279
1.65000 -6963.93031 21.63118 -53.60979 1266.12397 653.68527 5678.23669
1.75000 -7059.78247 13.29598 -77.82556 1192.57214 650.86776 5525.61058
1.85000 -7086.55485 22.67009 -138.51444 1202.96860 654.68706 5430.88646
1.95000 -7123.00593 27.09081 -133.28541 1126.18702 695.30089 5252.93629
2.05000 -7141.28925 25.46066 67.13324 1053.57554 649.06472 5093.02477
2.15000 -7159.24622 21.55141 91.60084 1072.35330 674.50620 4954.60224
2.25000 -7196.94715 18.34108 -73.53327 913.44265 601.87842 4805.60758
2.35000 -7203.81268 10.22651 -33.57720 968.24466 587.20709 4690.51019
2.45000 -7187.70765 29.03280 0.57431 930.77690 677.01030 4574.11339
2.55000 -7203.55129 19.71493 13.93570 852.59844 716.45849 4427.50072
2.65000 -7206.21974 18.78316 28.16496 863.60654 593.12027 4281.40480
2.75000 -7199.76473 17.16719 -4.39990 847.67149 535.55420 4215.01793
2.85000 -7196.08382 15.82757 21.82145 840.42149 606.08249 4085.50744
2.95000 -7197.92279 23.45123 19.12521 778.76672 519.49982 4002.44729
3.05000 -7201.72438 15.49369 -7.93541 729.14844 497.41691 3896.25349
3.15000 -7198.57610 20.36057 54.86885 726.66382 537.48116 3826.95598
3.25000 -7170.99226 12.49149 60.23185 667.88899 463.43272 3696.18376
3.35000 -7158.71152 6.21158 27.28638 736.42035 573.43419 3599.70684
3.45000 -7133.67660 22.57538 42.17304 622.52595 525.04517 3523.19532
3.55000 -7098.91812 18.69046 -16.99477 691.62044 491.93039 3408.57530
3.65000 -7080.54979 23.40597 15.72579 617.75094 441.04525 3372.60299
3.75000 -7075.55164 12.54045 54.78423 622.34880 467.96742 3248.72695
3.85000 -7050.21810 7.76389 36.82369 627.29649 530.72447 3168.90881
3.95000 -7047.85424 18.30532 27.24478 589.96418 503.75813 3052.01114
4.05000 -6998.15859 21.83018 -16.53202 646.61652 497.00788 3036.91423
4.15000 -6957.35666 13.99887 -10.05808 548.64043 410.14229 2951.66318
4.25000 -6932.42040 26.77052 73.66610 562.18602 401.97591 2832.90004
4.35000 -6891.54859 15.50046 49.65524 523.10190 426.23525 2809.35091
4.45000 -6858.95909 15.37331 -12.35174 491.27630 327.93062 2740.66565
4.55000 -6828.11539 11.67275 7.46269 516.28000 407.72914 2636.31991
4.65000 -6789.25468 12.20780 -46.65366 467.09837 318.13387 2561.56677
4.75000 -6762.72741 18.72578 -12.51508 531.76359 456.04909 2522.97426
4.85000 -6736.30741 6.69132 -4.88705 594.00996 472.89053 2457.17253
4.95000 -6709.65174 6.36434 14.06505 510.39446 468.56925 2418.35282
5.05000 -6687.06429 14.60775 -45.12617 442.61814 415.72184 2331.69101
5.15000 -6639.05782 16.88309 -40.97670 538.92789 338.17045 2301.07587
5.25000 -6605.28228 12.31574 -24.49263 493.48795 417.02325 2251.77590
5.35000 -6571.10306 11.56490 11.09992 444.89752 306.91707 2150.53747
5.45000 -6520.89873 11.11206 -32.33663 442.54306 385.95171 2139.70476
5.55000 -6486.68936 13.90251 -11.82393 438.23558 339.45663 2051.68516
5.65000 -6446.81953 10.74340 -10.97300 498.10507 324.70515 2014.73478
5.75000 -6414.75871 10.68169 -19.27362 455.37142 374.81994 1982.01953
5.85000 -6365.47522 8.66277 -9.07038 404.26419 311.75483 1914.97971
5.95000 -6328.66240 16.10943 7.66187 448.51439 349.64907 1875.33948
6.05000 -6287.17073 12.03932 -15.25984 384.69898 307.47984 1823.32164
6.15000 -6248.38812 13.19583 -9.12247 352.69380 255.50663 1767.14371
6.25000 -6207.71219 16.30090 -7.11549 442.43892 402.10049 1749.92082
6.35000 -6157.40815 11.38855 28.32437 398.15928 267.23902 1690.24322
6.45000 -6107.68714 13.51318 -1.50010 380.03266 296.76993 1667.80753
6.55000 -6055.57369 17.14533 28.84084 411.70482 310.92595 1626.10506
6.65000 -6016.28107 11.74688 11.51273 387.75566 274.68890 1613.45993
6.75000 -5956.82183 9.51750 14.71248 439.22254 260.78269 1525.75267
6.85000 -5894.06570 15.28263 31.88335 277.03203 255.86136 1498.62080
6.95000 -5846.98036 8.70361 9.83583 298.73914 276.07866 1466.73628
7.05000 -5808.36210 13.44604 20.35443 327.73818 226.48250 1414.18728
7.15000 -5746.17719 15.74732 -40.65563 279.57999 240.71835 1393.17509
7.25000 -5706.82933 6.20572 13.87693 380.66064 243.03945 1365.61798
7.35000 -5661.93339 11.56986 7.79412 395.20592 247.93623 1347.31309
7.45000 -5613.76660 9.43421 -10.20376 274.40423 214.16156 1304.05502
7.55000 -5572.85705 5.56123 30.60485 331.52330 219.67215 1268.58179
7.65000 -5524.29558 6.38731 19.19569 281.08969 228.27514 1248.80529
7.75000 -5480.73906 5.48229 17.58950 245.09393 207.01733 1215.54611
7.85000 -5441.35096 9.41486 19.60043 269.21902 352.95350 1196.14852
7.95000 -5397.56600 4.83793 -0.45690 260.32304 307.13992 1174.12680
8.05000 -5352.57861 8.08781 -4.78063 263.62304 187.02136 1121.01344
8.15000 -5310.52482 11.69864 23.82736 327.86069 213.23344 1105.88461
8.25000 -5258.71547 5.27036 9.13517 397.34841 237.91900 1085.19797
8.35000 -5222.70577 5.09264 -10.74901 371.82481 316.55890 1027.97622
8.45000 -5175.53168 9.19899 -38.31728 240.94284 197.48308 1030.42113
8.55000 -5132.91625 3.48790 2.21273 307.93074 236.81617 1002.38980
8.65000 -5079.31497 6.92998 1.71971 183.40417 164.34704 982.18936
8.75000 -5036.97399 5.32587 -20.11303 213.90856 175.60374 954.91601
8.85000 -4993.23459 0.06709 -18.33197 290.72467 296.55094 945.39671
8.95000 -4943.52824 6.17153 5.44744 261.28416 181.88662 919.59666
9.05000 -4907.36681 -0.74022 7.25086 379.32662 267.31470 913.03495
9.15000 -4848.41229 2.17897 -20.35568 194.11869 148.88627 869.61158
9.25000 -4807.94887 8.03497 -40.67623 152.59180 122.75625 840.53320
9.35000 -4761.08930 3.54289 -44.18549 197.90780 221.87672 836.94760
9.45000 -4720.56632 7.94787 -4.50631 276.26214 220.03606 811.47016
9.55000 -4677.96484 11.05704 0.30144 215.22108 249.20070 844.37736
9.65000 -4643.13499 4.96433 -20.07066 186.02531 155.56876 764.80080
9.75000 -4605.16706 4.34323 -15.13490 205.00403 173.51189 760.60332
9.85000 -4567.25356 2.16888 6.71642 209.29377 153.50828 731.14509
9.95000 -4528.89752 2.48783 -14.16201 190.71195 233.98916 707.02652
10.05000 -4496.59292 5.51860 -9.08383 179.97464 181.20987 702.45836
10.15000 -4466.01682 3.35636 7.23987 141.40169 148.10748 683.24992
10.25000 -4436.42444 5.95931 -3.96054 232.38505 176.47541 675.17054
10.35000 -4400.07061 5.61094 -10.54684 201.76638 184.02189 677.90229
10.45000 -4374.63412 4.52015 -23.69074 188.51359 123.52188 682.95214
10.55000 -4339.45076 5.68458 2.83491 274.22921 222.37393 681.66758
10.65000 -4310.74126 3.92319 2.06346 180.00121 129.60232 628.74994
10.75000 -4277.36699 5.28267 19.11060 135.97678 130.54966 613.28897
10.85000 -4240.85571 4.23024 -4.35514 214.73869 134.63331 595.49211
10.95000 -4210.30716 0.92250 -5.60393 125.47455 125.75421 589.22894
11.05000 -4177.08129 2.64562 12.27978 147.19986 110.20863 574.85341
11.15000 -4144.07643 3.21185 22.27619 205.80560 137.75746 611.06526
11.25000 -4110.51684 6.04214 7.12095 180.78340 122.20665 553.29500
11.35000 -4069.16557 10.34699 14.73259 197.81565 188.09995 549.96000
11.45000 -4033.73509 4.42160 1.83190 157.93485 116.11723 529.39909
11.55000 -4004.28573 1.23041 22.16495 145.43182 138.76164 510.30987
11.65000 -3964.26925 8.42682 28.53229 208.55429 134.92101 523.54998
11.75000 -3934.87226 3.99770 16.71816 170.81538 142.41237 507.12139
11.85000 -3894.86192 5.10846 30.64433 133.68044 99.06180 483.84081
11.95000 -3860.77277 9.52961 17.66005 162.70913 151.03708 472.72080
12.05000 -3824.50577 2.04172 9.12121 136.49372 109.84551 469.73430
12.15000 -3793.13390 2.89440 5.58020 119.38743 116.42069 451.58298
12.25000 -3756.21704 5.31778 29.43829 201.07305 138.35483 511.63489
12.35000 -3732.74157 -0.27634 19.74625 143.64156 150.40306 426.59390
12.45000 -3700.54872 5.30410 20.86298 166.69222 124.86713 444.88290
12.55000 -3674.71088 3.74680 21.75235 117.33257 120.36931 415.21493
12.65000 -3649.82805 5.09141 19.15435 124.55419 98.05785 408.81813
12.75000 -3623.52087 8.73637 31.34334 128.50225 248.38199 401.41138
12.85000 -3607.43275 0.12153 28.61065 114.75356 97.28352 387.60036
12.95000 -3576.76405 5.68220 40.54533 143.28951 132.38210 486.54040
13.05000 -3557.16627 1.28812 14.64474 166.86268 154.45485 398.44808
13.15000 -3541.50834 6.13374 48.50885 146.67831 207.65992 392.11851
13.25000 -3519.08200 2.25791 31.48042 126.67892 108.18538 359.96236
13.35000 -3498.62980 3.98715 33.31082 111.34268 86.87118 374.91426
13.45000 -3472.41120 -2.87929 31.32660 140.83568 146.41056 356.57177
13.55000 -3443.96112 1.79017 31.95363 165.92848 184.51170 390.16561
13.65000 -3421.75885 3.97228 39.87621 161.36193 80.00364 336.44555
13.75000 -3400.09593 2.84209 32.47657 83.64545 73.23151 330.21271
13.85000 -3377.25819 2.98366 26.92815 128.80338 114.78123 319.68703
13.95000 -3352.14358 5.21715 22.84899 114.87833 270.57415 318.94980
14.05000 -3332.11603 -1.94993 20.55965 154.62436 180.69208 321.24398
14.15000 -3303.97050 2.37725 10.32194 105.72694 112.60362 325.35095
14.25000 -3291.31044 3.75720 5.53451 149.72338 97.65880 318.93168
14.35000 -3262.92734 2.80870 -1.26241 94.92998 79.79778 294.67957
14.45000 -3235.01999 4.60037 -5.22265 153.11019 97.27064 290.65592
14.55000 -3218.37895 7.89977 8.22718 122.89423 162.61046 302.80562
14.65000 -3186.88205 5.13424 -2.79552 116.70899 102.32646 294.06389
14.75000 -3164.47168 4.34084 -20.09876 81.53975 69.29723 287.08113
14.85000 -3150.16786 2.00406 -10.41381 379.70691 112.15988 361.70053
14.95000 -3121.94953 2.35126 -12.69496 61.91688 76.64478 352.13355
15.05000 -3089.15569 2.49340 -25.07458 128.62221 72.13048 284.35207
15.15000 -3075.34263 3.69499 -25.12867 96.11242 149.87071 274.33269
15.25000 -3050.65151 6.25583 -24.86816 90.02034 103.37417 247.20239
15.35000 -3043.42857 15.34131 -25.71417 295.90284 300.09227 379.67589
15.45000 -3008.17502 5.14681 -20.89149 63.60237 67.24953 240.68153
15.55000 -2989.76278 4.82543 -22.07190 96.73464 91.92680 244.25580
15.65000 -2965.83673 3.30181 -35.92381 59.34574 59.79182 226.27428
15.75000 -2940.59497 4.74752 -41.22398 113.14487 86.75828 365.60652
15.85000 -2927.81790 3.43128 -40.11476 46.77952 60.24421 215.21429
15.95000 -2905.24286 4.38798 -27.95563 56.36816 47.71839 206.95148
16.05000 -2888.18806 -1.54133 -30.27730 176.07983 82.75020 244.75235
16.15000 -2864.37436 5.37997 -19.04386 80.78082 56.82391 212.64939
16.25000 -2849.19498 0.11586 -14.91655 55.04310 62.37012 200.24768
16.35000 -2827.29737 5.90426 -5.98082 76.66503 69.69430 212.11193
16.45000 -2807.65196 -1.78838 -15.23566 125.82329 79.81789 194.41924
16.55000 -2790.87182 -3.42877 -10.96287 102.11995 123.61049 210.84773
16.65000 -2768.22936 2.90924 -6.15680 124.90371 55.27886 178.50448
16.75000 -2749.35123 2.85414 0.58789 115.10105 128.81958 180.55508
16.85000 -2733.17518 4.05965 0.59449 41.86455 57.88664 183.25696
16.95000 -2714.08870 4.20184 -4.10025 113.13585 69.98619 173.18821
17.05000 -2699.90592 2.09893 4.79049 75.78591 52.16396 184.47834
17.15000 -2680.54141 2.29110 9.85531 52.44502 56.56953 171.64529
17.25000 -2664.14741 1.21297 10.67465 113.17391 70.09573 166.62340
17.35000 -2646.73725 -1.78246 5.98044 69.02190 71.25307 161.70699
17.45000 -2629.23743 0.97975 9.68940 54.75480 66.10858 196.88357
17.55000 -2614.42638 2.20445 21.43427 48.48608 63.62796 161.53970
17.65000 -2597.17331 1.35599 11.13200 64.08786 52.32217 157.71819
17.75000 -2581.41615 -3.22243 18.57131 57.66846 61.26029 156.87680
17.85000 -2567.17584 2.80661 11.47627 196.73447 118.52436 170.83856
17.95000 -2563.74771 5.10439 22.22325 346.01706 125.16573 287.32680
18.05000 -2525.95464 0.71610 26.64641 241.96355 50.63807 266.17277
18.15000 -2517.16307 1.68707 15.83072 81.73214 76.70219 148.87008
18.25000 -2500.23743 1.27577 21.01359 47.11849 46.63330 145.93365
18.35000 -2490.77661 2.66150 16.31819 53.22069 43.18668 150.66692
18.45000 -2473.87066 -4.79424 27.10711 105.77714 88.74670 182.01602
18.55000 -2457.87632 3.36860 15.62345 46.07601 36.78439 134.03980
18.65000 -2436.34750 -1.46917 30.36190 117.29060 77.10212 178.45731
18.75000 -2430.23087 2.05321 29.36998 44.72779 42.39131 130.45709
18.85000 -2411.25821 6.82923 24.39179 76.94732 81.29626 155.16088
18.95000 -2401.28552 4.07242 0.43461 51.66352 40.54078 126.25966
19.05000 -2383.08827 4.47330 17.55952 47.12628 38.88154 121.19016
19.15000 -2369.17750 2.84794 6.79439 78.11817 59.68088 141.89983
19.25000 -2356.82770 -3.32625 12.03596 74.18153 73.97861 139.72897
19.35000 -2341.95630 -0.54368 1.76815 63.26283 46.65249 128.72916
19.45000 -2327.33371 3.73758 8.96649 53.65456 36.11820 125.43891
19.55000 -2314.88003 4.18281 4.57034 68.23512 46.95477 125.79765
19.65000 -2301.67115 1.12218 8.34347 49.25079 47.49737 118.15720
19.75000 -2289.07983 0.78782 1.99192 41.30166 41.81702 127.67478
19.85000 -2277.66268 4.84766 -7.06491 65.15157 68.47771 114.48459
19.95000 -2267.06056 3.16845 -0.00918 74.22555 43.62404 116.59787
