0.05000 -4317.19109 58.78253 -142.20568 5378.63160 5403.71709 4921.44396
0.15000 -6154.30365 104.99337 25.45143 4686.95592 4746.62218 7094.95691
0.25000 -8611.99756 17.64725 -22.47405 4601.00565 4402.06821 9600.52444
0.35000 -9750.97644 78.33612 -99.86591 4217.40159 3900.01893 10382.29689
0.45000 -10538.09935 46.28558 134.86513 4132.27635 3610.26921 10945.34410
0.55000 -10839.01644 -0.86474 3.18070 4030.17958 3441.87815 11214.53559
0.65000 -11103.80165 14.98514 -9.35485 3933.11137 3240.76843 11312.98079
0.75000 -11019.20938 -3.07655 114.74126 3794.65627 3195.26877 11278.81299
0.85000 -11022.98928 27.80040 -124.09052 3689.90519 3221.35056 11028.86629
0.95000 -10993.25840 -66.81856 -155.51069 3641.63942 3243.70325 10834.65747
1.05000 -10953.72191 92.20721 -96.90768 3448.73378 3147.72543 10508.05757
1.15000 -10882.30098 -15.10934 10.22762 3405.28312 3145.71233 10219.42581
1.25000 -10799.83675 88.13669 -84.58015 3270.30790 3124.47839 9875.41713
1.35000 -10675.32529 70.84629 -3.03076 3146.45399 3084.26471 9590.07249
1.45000 -10656.78023 -9.29486 47.76792 2995.75826 2993.94212 9212.74995
1.55000 -10560.35220 26.28587 -82.87686 2827.27910 2954.53575 8890.74186
1.65000 -10449.56989 19.13737 -160.98681 2763.79742 2876.84175 8677.09538
1.75000 -10448.07582 -22.37211 -124.38479 2656.78276 2816.55109 8275.38467
1.85000 -10330.52518 2.75288 86.23059 2507.02133 2760.98228 7959.40055
1.95000 -10213.28513 14.46031 -14.76302 2407.21669 2728.44178 7733.94992
2.05000 -10004.16672 11.33284 78.60853 2365.60679 2608.67424 7562.30200
2.15000 -9966.84223 69.55280 130.40507 2185.40500 2537.82011 7185.38003
2.25000 -9834.20773 5.07957 -38.74603 2080.36482 2489.83745 6962.53655
2.35000 -9647.16172 95.40717 -93.80977 1998.81783 2418.13074 6790.01733
2.45000 -9553.40494 93.30676 -99.36249 1916.59824 2387.79926 6500.31091
2.55000 -9443.62914 13.78470 49.52671 1859.09981 2308.20760 6245.60050
2.65000 -9296.19765 27.43916 35.90122 1791.86162 2275.80040 6085.66343
2.75000 -9110.23267 51.91683 86.24687 1715.29647 2170.79675 5962.94249
2.85000 -9038.41132 17.45296 3.26096 1643.52361 2160.53325 5679.73854
2.95000 -8913.55607 16.00078 83.48608 1532.22317 2093.46372 5559.32213
3.05000 -8790.77084 52.02580 22.84104 1502.67813 2037.95109 5369.27691
3.15000 -8641.60525 27.83742 37.38932 1444.50825 1981.87313 5238.82039
3.25000 -8516.47759 -5.34254 67.16707 1417.00365 1954.13308 5083.47994
3.35000 -8423.65008 17.34603 23.58804 1348.85748 1865.28992 4912.53800
3.45000 -8306.51099 -9.76502 15.48301 1282.63762 1842.80519 4742.50263
3.55000 -8205.57133 46.83719 87.85909 1264.70001 1787.34160 4616.53439
3.65000 -8091.85002 4.30246 -8.64801 1179.77079 1750.38731 4497.45521
3.75000 -7985.11758 13.87890 -12.58383 1170.09867 1731.01669 4418.50786
3.85000 -7867.48795 -2.94233 83.16275 1161.28152 1654.30051 4285.36013
3.95000 -7778.61500 7.23255 -4.56261 1139.48561 1701.69698 4154.10861
4.05000 -7675.68411 8.70008 41.13991 1034.20284 1549.86826 4064.06624
4.15000 -7596.03735 20.13368 -62.09965 978.42515 1503.77246 3894.31671
4.25000 -7488.72509 3.98307 -2.63455 1025.89922 1509.08168 3867.89465
4.35000 -7407.97343 32.90780 -0.93741 936.50196 1436.43230 3762.68560
4.45000 -7297.92115 19.77130 27.08880 991.53163 1420.04453 3750.14588
4.55000 -7232.79147 -7.91890 81.38956 874.70100 1381.62501 3601.11885
4.65000 -7150.53389 12.20779 28.09379 829.35189 1344.53603 3462.59990
4.75000 -7093.49128 -4.02328 22.57805 870.79751 1318.25616 3382.78704
4.85000 -6990.01495 3.70569 7.98729 799.11463 1258.44664 3307.50980
4.95000 -6923.63875 23.51694 78.44916 802.94792 1232.22800 3233.16730
5.05000 -6848.74440 -32.15293 -58.67198 807.07332 1204.35354 3173.41654
5.15000 -6781.33573 -28.64355 12.89700 694.74174 1134.06718 3031.82454
5.25000 -6692.87502 -30.98923 156.90869 749.39268 1135.41879 2971.48179
5.35000 -6616.83801 -81.70906 128.49439 664.43439 1090.47851 2859.60557
5.45000 -6539.38787 -36.70062 48.74991 661.28455 1073.10765 2819.37399
5.55000 -6491.40222 -70.02110 -0.56130 678.67356 1014.76247 2677.75550
5.65000 -6409.78743 -57.00575 59.57265 660.84339 989.98266 2598.50957
5.75000 -6329.29535 -29.76592 92.88215 597.66458 965.79971 2560.15752
5.85000 -6265.41331 -33.66049 35.15105 628.60199 955.20719 2445.44925
5.95000 -6186.22935 4.90584 65.15946 593.53960 881.63903 2373.20243
6.05000 -6105.40091 -37.14727 61.71896 580.65936 885.94526 2341.94536
6.15000 -6013.60126 -48.75079 15.08003 553.01865 829.03150 2226.50498
6.25000 -5959.74436 -4.78867 1.62137 548.41614 858.72002 2151.65270
6.35000 -5913.83092 9.48312 -44.02796 565.39446 794.58513 2123.32724
6.45000 -5832.81899 5.46829 -40.44035 530.87510 795.39552 2070.56004
6.55000 -5783.20914 6.13994 -75.79715 502.00618 736.34298 1999.34144
6.65000 -5721.00256 -17.39938 -43.80088 515.22946 720.53209 1928.45375
6.75000 -5675.46073 16.39694 -33.74406 490.13016 702.04453 1872.52721
6.85000 -5632.27711 -5.41410 -72.34133 543.38834 721.12988 1826.07655
6.95000 -5571.63074 -34.71064 -65.55137 518.88672 691.92119 1762.26466
7.05000 -5538.64712 -20.92445 -21.89249 525.11273 641.92120 1691.25690
7.15000 -5508.81153 -30.46549 -71.70423 498.03150 604.80209 1656.25550
7.25000 -5469.14278 -25.53663 -65.49798 569.60730 654.67897 1642.12213
7.35000 -5431.14458 -31.31522 -83.23112 524.13867 619.07317 1553.97150
7.45000 -5393.34909 -17.11090 -54.37336 489.12176 566.72679 1512.20623
7.55000 -5356.71213 -19.20354 -65.40969 524.31517 547.91664 1460.42524
7.65000 -5333.05896 -33.77281 -59.49244 513.84236 564.28689 1419.13996
7.75000 -5295.07817 -29.79626 -81.01778 548.87047 505.91946 1394.68080
7.85000 -5270.60493 -12.24032 -93.09509 517.06666 507.37572 1335.08141
7.95000 -5274.80990 -29.30252 -53.10460 542.94219 504.65110 1308.55352
8.05000 -5223.88328 -24.11369 -20.60822 511.76760 446.68011 1261.65529
8.15000 -5211.26893 -20.67481 -41.63967 614.16620 475.62086 1263.53758
8.25000 -5164.87076 -13.76035 -77.49288 534.06401 464.81551 1200.58757
8.35000 -5145.43587 -9.25769 -22.20917 586.76632 432.36330 1160.27794
8.45000 -5110.10137 -10.04344 -25.90632 582.96823 423.85645 1162.74692
8.55000 -5061.27432 1.89916 -2.28940 542.16248 565.58356 1086.74106
8.65000 -5039.18016 5.08901 1.80668 490.20628 358.55279 1030.37882
8.75000 -4986.21599 -0.24374 4.73674 485.58394 353.22169 1031.99326
8.85000 -4966.40805 0.59137 8.09425 493.38568 395.14516 984.17979
8.95000 -4893.25273 5.17494 -5.46511 554.71878 347.33805 959.48980
9.05000 -4857.23025 -0.79106 8.98440 575.52892 355.01593 958.80707
9.15000 -4800.34714 6.76374 7.68144 446.75306 346.43895 925.41035
9.25000 -4754.78728 -6.49736 12.26611 415.41708 288.33976 896.08766
9.35000 -4722.65469 2.29808 5.64555 398.41188 278.50331 846.83266
9.45000 -4668.68450 -3.65821 7.96047 462.16421 289.13200 850.59851
9.55000 -4638.28716 4.46282 40.52897 483.60129 252.56647 818.28832
9.65000 -4598.07868 3.27488 37.35944 363.92964 248.16068 804.64311
9.75000 -4539.83183 5.66139 25.41885 341.56031 236.93503 774.99664
9.85000 -4509.66659 2.62293 36.39394 406.63047 424.69962 770.79874
9.95000 -4470.36861 7.95901 29.93206 352.79438 260.22136 737.40768
10.05000 -4420.07440 7.86757 32.93485 325.84114 222.95736 739.72222
10.15000 -4386.56653 5.21420 54.17973 320.74442 236.10971 711.36509
10.25000 -4344.84247 -1.78207 20.95961 311.54463 231.74150 697.67864
10.35000 -4306.56564 6.74971 28.47972 297.91576 212.79581 691.77974
10.45000 -4261.32893 5.75207 42.54295 411.95815 288.39339 699.79616
10.55000 -4231.13763 6.53031 17.98333 259.83276 194.17133 671.41891
10.65000 -4187.71600 4.51862 24.01120 232.23159 161.11513 632.74037
10.75000 -4154.18957 0.44662 23.47109 233.19712 175.08970 609.87991
10.85000 -4125.37635 10.99879 9.67573 209.44170 154.68302 594.22632
10.95000 -4078.11498 -3.71689 18.99281 219.96762 430.25897 607.12664
11.05000 -4053.04381 1.73360 -4.39473 237.45029 219.81753 700.01535
11.15000 -4018.64734 8.16130 29.15286 429.12846 273.38688 599.83400
11.25000 -3987.99715 -3.18503 21.57558 234.86649 183.48466 564.85369
11.35000 -3961.72977 4.10709 14.52668 240.05771 203.50705 567.68683
11.45000 -3924.28666 5.78188 -12.49836 201.59176 224.39142 583.51720
11.55000 -3898.99882 2.07464 6.85230 249.01578 157.78693 531.85420
11.65000 -3870.23428 3.90469 -0.37127 169.11096 130.88347 518.52114
11.75000 -3840.84288 -7.86883 16.29054 236.61918 330.66941 546.41869
11.85000 -3813.24530 -0.14963 7.80466 161.46289 152.36511 509.84930
11.95000 -3799.37529 -3.97059 12.06765 240.17278 194.21350 492.38443
12.05000 -3764.83976 4.48886 13.01360 161.73056 131.11781 475.61319
12.15000 -3741.54128 2.40127 -0.55392 179.59534 131.31209 472.80181
12.25000 -3711.82888 0.13713 15.84979 158.83631 245.50441 573.47274
12.35000 -3688.33148 3.88788 21.30512 148.19104 129.63723 454.05080
12.45000 -3654.51656 10.61311 16.71202 159.98534 136.95913 454.65766
12.55000 -3626.17521 1.97797 27.55646 158.33150 219.12285 469.33651
12.65000 -3603.69998 1.85476 2.22198 131.30679 120.66255 425.83833
12.75000 -3578.10406 7.43264 22.23599 112.97395 122.71881 404.59491
12.85000 -3550.04378 2.41671 9.22134 129.95838 140.85441 414.84582
12.95000 -3521.25246 3.36784 29.74064 129.65296 143.62462 402.12131
13.05000 -3491.70027 -5.61830 14.29735 477.74082 502.72271 479.21933
13.15000 -3464.07947 -1.34396 19.06192 305.38168 291.42909 468.48963
13.25000 -3449.57262 1.67234 31.14419 128.45437 156.80975 408.65570
13.35000 -3418.34883 -0.98364 23.43469 158.42701 90.86533 405.52239
13.45000 -3389.19638 1.21154 15.81579 159.27303 92.21324 373.15902
13.55000 -3364.96447 -1.67844 28.69596 143.80911 179.57731 370.34619
13.65000 -3345.27639 10.20474 25.64982 138.08644 292.90096 396.95353
13.75000 -3328.09254 -0.32489 39.08804 105.05004 90.22409 360.25263
13.85000 -3297.99867 -3.79777 -3.38606 230.75854 434.41534 509.02569
13.95000 -3274.58557 -0.79220 1.52748 102.04619 112.76756 359.09129
14.05000 -3253.15528 -4.26839 22.14869 97.40009 255.97570 350.24850
14.15000 -3232.47540 1.97169 29.20322 131.30211 93.60629 344.11793
14.25000 -3207.29134 -1.80885 14.57398 102.95085 93.19443 334.63689
14.35000 -3181.14258 0.70798 14.62906 122.73670 95.74127 342.23211
14.45000 -3159.89819 2.60920 24.28468 96.60007 77.70191 320.01110
14.55000 -3136.87984 2.81873 6.82706 112.73496 89.65289 310.77838
14.65000 -3116.95989 4.32691 23.03769 103.63421 99.02849 330.32835
14.75000 -3097.54054 -2.82813 19.57756 99.90385 87.07287 301.49639
14.85000 -3075.52544 3.68767 15.27033 95.09838 82.09841 308.13074
14.95000 -3058.07386 1.35356 11.15543 90.28524 81.25047 289.39867
15.05000 -3038.06223 -1.60413 22.95572 131.47253 100.68045 284.45323
15.15000 -3013.12149 -2.56696 0.90956 121.65655 115.65297 299.71014
15.25000 -2995.78964 0.67896 1.06200 128.97718 102.11898 298.01479
15.35000 -2973.78047 5.36297 22.85726 102.24560 96.60208 269.03811
15.45000 -2969.67871 8.39386 10.28637 410.53931 256.05700 326.54869
15.55000 -2943.23694 4.14186 7.07425 102.47081 90.50159 282.60027
15.65000 -2921.21795 1.30548 25.03379 85.03978 70.36244 261.86140
15.75000 -2896.01999 2.89491 0.40778 156.15920 109.97419 260.56514
15.85000 -2876.64563 -4.35145 16.44392 89.66003 166.17543 288.44153
15.95000 -2860.08807 -0.03624 12.06828 98.14582 76.00550 251.25959
16.05000 -2841.37481 0.76003 21.49256 93.20800 77.80946 239.68280
16.15000 -2823.71053 0.71758 9.01683 88.52507 74.98003 250.62888
16.25000 -2804.90470 -1.37990 15.53098 80.57840 64.82305 256.81811
16.35000 -2793.14945 1.90520 -3.95910 79.91331 74.45244 233.67052
16.45000 -2771.26968 3.25440 6.68450 93.73592 91.05513 245.97000
16.55000 -2751.15862 1.51457 17.28498 85.26538 57.41433 239.66417
16.65000 -2736.40447 5.56255 4.85411 86.64098 68.49781 226.98836
16.75000 -2716.51716 3.03106 2.71765 80.15559 65.02797 218.24586
16.85000 -2702.00072 4.00304 6.00400 88.43289 105.90277 228.52168
16.95000 -2683.45154 5.40004 -0.35570 87.17201 60.00858 217.15036
17.05000 -2669.70240 0.96330 -7.25115 80.60224 109.49138 213.38520
17.15000 -2654.12079 3.60659 3.01638 85.55054 50.33742 218.39857
17.25000 -2635.18426 5.51758 -1.16954 79.69988 57.88712 219.44640
17.35000 -2618.96200 1.93383 11.79824 105.21635 63.19226 219.39736
17.45000 -2605.39592 6.10609 16.66177 73.88985 54.64287 205.60838
17.55000 -2585.79627 3.80990 15.10882 83.91862 72.21383 259.19314
17.65000 -2575.42871 3.87914 11.00277 83.71076 53.33491 205.35825
17.75000 -2555.64867 7.67661 -5.41709 73.87232 56.53716 195.41615
17.85000 -2536.74475 1.00621 4.70685 108.95204 128.28140 249.89273
17.95000 -2529.16165 6.61088 -1.01906 120.59804 119.78480 242.50844
18.05000 -2509.42658 3.89858 6.16199 92.89100 110.73383 206.62234
18.15000 -2496.07461 6.50094 4.55886 65.99770 54.73451 189.64572
18.25000 -2481.00451 5.01526 3.40033 70.61527 53.38024 188.82442
18.35000 -2465.94163 6.42083 -2.75292 63.80859 57.97946 185.36367
18.45000 -2457.04011 4.24190 -2.50419 58.33328 53.58145 178.62981
18.55000 -2443.87865 3.77067 -12.54910 67.42779 191.41886 251.10437
18.65000 -2430.73341 1.80156 -10.06601 63.78827 49.30983 176.67221
18.75000 -2417.19200 5.57720 3.04016 60.99589 43.58690 173.33659
18.85000 -2404.97821 4.66016 -15.26338 55.21348 48.71880 176.39218
18.95000 -2395.87192 14.30461 -19.33994 65.13348 340.48422 429.49683
19.05000 -2375.70743 10.76594 -3.54422 59.21030 82.61040 181.28289
19.15000 -2378.59830 8.84695 -22.57000 360.95273 125.07692 240.94948
19.25000 -2331.00136 11.16117 -2.75351 604.94330 257.85383 279.29938
19.35000 -2342.03028 3.92318 -5.93003 60.45977 48.12923 163.14912
19.45000 -2324.70703 2.31806 0.90450 98.78588 73.72414 161.44695
19.55000 -2318.72051 1.49285 2.81749 69.05147 46.31195 162.93871
19.65000 -2302.92815 -1.83900 -18.35160 53.99340 112.37669 301.17823
19.75000 -2296.48639 -7.40083 -3.49841 130.55666 326.78858 163.48173
19.85000 -2285.14018 1.70553 -2.83559 59.55338 48.34682 154.85768
19.95000 -2269.34079 8.09214 0.26374 52.74515 62.48788 172.41261
