0.05000 1300.09264
0.15000 2832.49241
0.25000 4291.81824
0.35000 5450.90553
0.45000 6727.36070
0.55000 7556.93305
0.65000 8366.25130
0.75000 8850.84635
0.85000 9303.43541
0.95000 9544.66740
1.05000 9687.34110
1.15000 9721.77950
1.25000 9586.85797
1.35000 9372.87476
1.45000 9203.03826
1.55000 8941.99826
1.65000 8725.03026
1.75000 8461.85884
1.85000 8167.59641
1.95000 7818.58830
2.05000 7547.91009
2.15000 7197.40592
2.25000 7130.65171
2.35000 6793.79685
2.45000 6597.95684
2.55000 6228.36706
2.65000 6145.52236
2.75000 5878.36785
2.85000 5685.17555
2.95000 5475.41922
3.05000 5221.66110
3.15000 5100.56022
3.25000 4916.39201
3.35000 4840.96806
3.45000 4658.52461
3.55000 4540.13360
3.65000 4295.96392
3.75000 4183.24936
3.85000 4126.13310
3.95000 4008.93166
4.05000 3880.98833
4.15000 3760.59606
4.25000 3742.01857
4.35000 3598.00020
4.45000 3576.46410
4.55000 3437.20357
4.65000 3344.79432
4.75000 3310.25740
4.85000 3212.65609
4.95000 3150.69771
5.05000 3084.53972
5.15000 2987.64664
5.25000 2877.11670
5.35000 2854.63238
5.45000 2821.31298
5.55000 2797.03677
5.65000 2664.04474
5.75000 2624.55193
5.85000 2603.11677
5.95000 2479.54061
6.05000 2463.89214
6.15000 2386.13074
6.25000 2365.11012
6.35000 2258.46246
6.45000 2256.88453
6.55000 2173.88321
6.65000 2125.11153
6.75000 2103.75545
6.85000 2042.33440
6.95000 1960.22360
7.05000 1915.75221
7.15000 1856.75854
7.25000 1827.71725
7.35000 1780.47415
7.45000 1701.34013
7.55000 1692.58668
7.65000 1608.46158
7.75000 1568.44454
7.85000 1543.10990
7.95000 1457.69690
8.05000 1466.97663
8.15000 1376.36878
8.25000 1351.89406
8.35000 1290.23209
8.45000 1239.05819
8.55000 1181.13160
8.65000 1129.28374
8.75000 1084.04931
8.85000 1040.10278
8.95000 1012.90769
9.05000 981.96431
9.15000 969.91152
9.25000 928.44610
9.35000 904.18663
9.45000 866.30959
9.55000 858.20046
9.65000 844.50047
9.75000 830.10661
9.85000 789.75390
9.95000 788.50280
10.05000 775.12485
10.15000 738.21925
10.25000 739.91344
10.35000 745.53545
10.45000 715.29887
10.55000 696.20825
10.65000 695.21844
10.75000 687.14244
10.85000 666.68708
10.95000 675.71818
11.05000 640.64716
11.15000 651.78428
11.25000 638.45123
11.35000 626.54574
11.45000 623.50157
11.55000 610.64454
11.65000 602.02829
11.75000 586.38037
11.85000 559.74033
11.95000 556.87348
12.05000 542.33085
12.15000 522.20907
12.25000 519.61273
12.35000 499.79880
12.45000 487.34536
12.55000 474.45965
12.65000 462.25482
12.75000 454.19750
12.85000 425.55008
12.95000 425.04935
13.05000 409.31980
13.15000 397.17198
13.25000 393.98082
13.35000 382.72376
13.45000 370.26521
13.55000 366.67842
13.65000 355.15841
13.75000 346.39758
13.85000 358.26450
13.95000 341.38719
14.05000 340.10774
14.15000 333.74767
14.25000 322.89647
14.35000 324.99403
14.45000 310.76413
14.55000 311.70519
14.65000 304.39971
14.75000 304.73867
14.85000 299.67616
14.95000 292.81524
15.05000 301.01670
15.15000 279.43229
15.25000 269.48296
15.35000 272.76871
15.45000 271.16189
15.55000 266.20596
15.65000 267.26868
15.75000 256.31155
15.85000 255.95253
15.95000 253.98302
16.05000 245.57991
16.15000 248.43193
16.25000 234.45954
16.35000 237.30706
16.45000 234.77214
16.55000 226.88679
16.65000 219.34820
16.75000 220.65860
16.85000 212.70273
16.95000 217.19765
17.05000 213.64301
17.15000 201.43778
17.25000 207.53405
17.35000 199.51081
17.45000 199.56468
17.55000 188.92931
17.65000 197.12339
17.75000 189.24873
17.85000 185.38109
17.95000 183.05974
18.05000 181.92436
18.15000 178.83305
18.25000 172.93840
18.35000 173.10489
18.45000 172.92493
18.55000 162.62046
18.65000 165.93883
18.75000 158.00813
18.85000 166.00460
18.95000 158.68829
19.05000 160.29086
19.15000 156.21258
19.25000 150.19616
19.35000 148.98758
19.45000 148.42552
19.55000 140.30048
19.65000 146.93235
19.75000 144.13120
19.85000 138.18813
19.95000 141.55321
