0.05000 -2455.51458 6.56794 -25404.08738 1879.11347 1090.98721 467718.16872
0.15000 -4354.24750 27.71617 30039.85715 1288.27871 1066.83907 317579.37076
0.25000 -5310.75016 153.73333 15616.90197 981.05798 941.80235 489289.89281
0.35000 -6423.63053 107.39409 21794.03580 1173.04473 801.61220 331021.65527
0.45000 -7156.50252 122.83231 -2499.37720 1274.34516 665.13258 412659.64232
0.55000 -7684.47254 100.68214 5794.41643 1423.77572 610.97072 397073.45906
0.65000 -7937.59033 105.79211 2194.37832 1482.38760 578.20435 284840.18478
0.75000 -8205.72116 103.00842 1633.07719 1545.99111 558.20631 302026.99020
0.85000 -8398.57328 104.92561 7303.47658 1512.67112 522.76655 302374.96790
0.95000 -8557.21699 110.99742 -1706.96837 1525.82717 487.62756 288070.42456
1.05000 -8584.28217 95.67224 -1183.35198 1497.78619 468.73886 277024.98320
1.15000 -8618.53606 101.22147 3013.78938 1406.77165 463.49557 263678.93767
1.25000 -8647.72823 97.60387 -2230.65901 1284.44160 450.44797 241558.67383
1.35000 -8677.41525 101.73188 4824.71873 1185.86901 434.67256 254085.86228
1.45000 -8615.86349 103.87814 2460.03623 1074.41895 402.04969 228956.57651
1.55000 -8650.17061 102.56671 1085.65757 975.97295 394.32871 220325.28457
1.65000 -8598.59211 99.56118 4994.05146 908.30343 376.69880 211817.02845
1.75000 -8583.35871 104.03827 -1746.50549 860.70083 363.14582 190257.66588
1.85000 -8582.16078 106.52130 2513.30569 770.18437 343.58957 186236.45445
1.95000 -8585.65184 101.76818 -2345.25718 703.42823 331.01234 179462.77949
2.05000 -8571.42806 103.53807 0.76575 646.14461 311.91089 171804.09458
2.15000 -8543.09825 102.53413 -958.23491 608.25158 310.24449 182781.53714
2.25000 -8499.25036 107.09866 1757.36649 543.97067 290.42468 168260.58743
2.35000 -8450.89780 104.09127 2400.20201 510.83925 286.53951 149984.45814
2.45000 -8403.68256 103.04080 722.44686 472.59208 287.96596 141535.37640
2.55000 -8376.15275 103.11957 1387.46466 442.40324 284.01362 140334.52215
2.65000 -8352.57185 102.78481 2368.49981 421.64158 271.48313 140315.39953
2.75000 -8271.49959 106.94872 -319.98080 395.22519 270.82003 131376.05429
2.85000 -8215.76606 100.96035 -1944.43116 370.58174 261.93171 132786.49519
2.95000 -8149.72435 109.69902 2889.22234 349.47318 252.38123 125215.14869
3.05000 -8091.29029 105.92371 1604.41169 336.43675 248.00199 125691.92844
3.15000 -8028.81939 100.92112 -1754.34641 331.77396 245.13452 125389.73362
3.25000 -7960.77166 101.10842 -302.53012 319.80798 237.54984 114050.47963
3.35000 -7896.59793 99.32575 896.60004 309.27542 238.99001 108286.37550
3.45000 -7836.45012 96.33234 -1356.26025 281.91887 231.36789 104334.35937
3.55000 -7780.79274 98.56968 156.78643 267.05003 226.13972 101706.41574
3.65000 -7720.79636 95.23977 -939.97726 254.57273 213.52838 106006.31631
3.75000 -7674.51461 92.28588 -2180.95139 256.65661 217.48272 97712.88883
3.85000 -7628.69657 91.35904 420.63732 243.56891 214.69792 123901.28776
3.95000 -7574.47103 90.94360 211.09615 226.03794 201.22818 95268.40912
4.05000 -7525.84942 87.78548 2141.66018 219.21319 203.49206 83829.87926
4.15000 -7460.82327 86.43781 850.57654 215.08423 192.61054 82997.78772
4.25000 -7408.27531 83.93149 -1006.26511 216.75022 191.56655 74065.23839
4.35000 -7360.63104 80.57908 1438.85629 197.00664 191.98176 72361.73594
4.45000 -7306.02439 81.45418 626.50953 197.47675 183.99221 75255.07124
4.55000 -7258.13649 81.18617 1684.49329 195.34301 186.97924 82241.82280
4.65000 -7208.38583 82.86433 276.89642 193.56687 183.19355 63947.33903
4.75000 -7158.69610 77.01385 -259.16084 186.65653 181.91646 62856.79700
4.85000 -7121.27456 75.52449 450.73899 179.96311 177.11415 64903.50690
4.95000 -7059.42549 74.43699 -34.75732 176.32751 170.11575 57755.41866
5.05000 -6996.49626 73.15119 1312.32357 168.38252 167.69429 63876.24632
5.15000 -6935.31760 74.29673 545.50697 169.53064 168.31279 50816.36056
5.25000 -6883.63560 69.45784 139.56076 173.11992 166.91465 54371.91853
5.35000 -6817.74210 66.99671 -301.14094 166.44578 162.68432 55318.58426
5.45000 -6768.19444 67.36487 -409.73195 162.83943 160.17334 55797.57828
5.55000 -6715.36160 68.43000 -1689.42730 167.26940 160.89052 84228.69658
5.65000 -6672.12654 65.98180 938.77113 162.19182 159.23053 59930.70128
5.75000 -6619.68176 66.85117 -76.47233 168.90595 159.47334 45139.26692
5.85000 -6568.86031 62.18418 50.96160 166.78749 157.70275 48413.96984
5.95000 -6515.73220 62.53760 -188.20469 166.31114 159.69814 39474.29976
6.05000 -6460.44264 62.15473 -988.22939 164.45046 149.67942 43141.25345
6.15000 -6395.98730 59.15617 1494.01433 165.09317 154.29664 40955.42519
6.25000 -6340.04009 56.64313 686.14507 161.27305 146.96946 41254.13911
6.35000 -6288.88817 56.70627 1198.04571 163.06007 152.57021 35348.98264
6.45000 -6239.33852 54.59176 130.92080 157.30490 152.05245 41517.24939
6.55000 -6179.58002 53.37777 354.71877 154.32477 150.36791 47031.30901
6.65000 -6114.94878 54.44522 -333.89073 151.55245 144.67589 35294.67551
6.75000 -6056.34032 52.82861 1426.17308 149.74332 147.70672 109417.18915
6.85000 -5993.38547 52.74266 -722.18500 145.71630 138.20454 37520.74080
6.95000 -5937.83930 51.57755 -450.23920 148.96400 140.56912 32088.98883
7.05000 -5886.43333 49.76273 269.85193 146.25572 133.94167 42959.99777
7.15000 -5828.34611 51.80134 -301.84937 145.96462 130.14995 27759.17225
7.25000 -5775.09136 47.10051 -215.59492 144.04872 132.61552 35619.25143
7.35000 -5717.75211 49.33418 -307.54094 136.78100 130.03912 32435.14376
7.45000 -5671.20297 48.70119 -496.22313 134.91377 126.20370 26618.41927
7.55000 -5613.61541 45.87817 277.81769 132.85972 122.13069 26317.79903
7.65000 -5573.40593 41.48489 904.44386 132.30425 122.47354 43010.21364
7.75000 -5517.37790 46.19140 109.85232 134.50135 119.46531 29937.84007
7.85000 -5474.94203 42.94814 305.50034 132.63584 123.21276 33690.67886
7.95000 -5433.44441 44.28164 -975.44303 127.52528 123.33560 27340.66723
8.05000 -5385.09855 41.74202 -33.75486 125.49535 110.66360 23835.95089
8.15000 -5342.24069 40.76574 130.45305 124.26888 113.16136 31346.59800
8.25000 -5297.54153 39.65425 399.26973 123.79670 111.71512 27402.11918
8.35000 -5257.04701 39.65527 -148.46252 118.55327 114.72267 21058.32666
8.45000 -5212.50415 38.68607 -802.61302 121.43424 111.13891 22255.48058
8.55000 -5172.96497 40.79580 -294.94872 120.72096 112.67545 25866.92271
8.65000 -5130.38947 41.17081 61.23249 114.84960 108.09987 19267.43416
8.75000 -5089.91737 36.60474 -113.53269 113.17292 103.90555 18617.48390
8.85000 -5047.35925 36.46146 -106.23826 109.92781 106.27989 18294.09215
8.95000 -5009.60468 35.22456 -269.69233 105.46171 105.90068 23285.50885
9.05000 -4970.28103 37.71229 28.63496 115.07257 109.66399 15589.97547
9.15000 -4930.54328 35.18533 -352.34154 109.21484 101.07769 17169.38276
9.25000 -4892.56994 35.27659 -377.11413 110.57379 107.34307 15146.01815
9.35000 -4851.94318 32.07425 204.96791 107.83617 97.38043 17657.32981
9.45000 -4810.55722 34.09410 -182.65420 109.07033 95.44578 14073.86188
9.55000 -4769.84866 32.99265 -236.89763 103.97895 93.50726 15966.81929
9.65000 -4726.58130 33.34618 -180.15344 103.14963 97.31804 15221.38206
9.75000 -4685.95333 30.38830 258.59379 104.69101 93.78390 17961.90416
9.85000 -4640.79321 33.90269 32.40279 95.02581 93.67454 14098.71730
9.95000 -4594.71842 28.83605 -507.53974 94.58578 88.26245 12850.34868
10.05000 -4552.68699 30.17932 228.08161 95.31902 87.19009 12005.04621
10.15000 -4516.50027 27.45624 -211.03208 92.84997 84.28486 14527.76196
10.25000 -4474.44142 25.12229 -291.92371 91.66644 81.53324 10932.65968
10.35000 -4434.83058 23.81472 -546.17468 92.96818 93.47815 11511.61782
10.45000 -4402.61803 27.39006 -464.07292 88.32647 87.90245 11545.83712
10.55000 -4362.67077 24.13307 -346.01229 92.06433 94.94091 11426.04986
10.65000 -4329.31351 27.32192 -541.41400 87.91032 89.30048 11418.08426
10.75000 -4287.30448 27.07791 -186.57208 89.68604 88.72735 9455.00479
10.85000 -4255.69325 24.29064 -127.48824 90.38217 82.58127 9377.83445
10.95000 -4216.50226 25.37367 -113.12356 83.24142 76.77280 9385.72138
11.05000 -4184.45321 23.50320 -329.82768 90.73292 86.53565 10364.36076
11.15000 -4151.45076 25.28360 -269.57117 86.94368 85.89641 10461.81753
11.25000 -4122.52661 24.22211 -24.99151 83.04417 78.11010 8298.97675
11.35000 -4089.47698 22.69021 -227.02157 80.88911 77.09983 8272.42831
11.45000 -4053.40268 25.18193 140.77352 79.66188 82.33862 8661.91092
11.55000 -4025.38503 23.50124 -4.45840 81.58277 80.01696 10754.15768
11.65000 -3990.96641 22.92920 -278.08005 84.56126 76.78501 6735.67058
11.75000 -3960.11016 24.23373 -78.12908 73.54799 76.80491 7187.67705
11.85000 -3929.85433 21.60176 55.42038 79.03952 81.19128 6058.53524
11.95000 -3896.10729 18.92330 -33.95955 73.25556 78.96686 7621.62082
12.05000 -3866.46448 21.02434 -175.64983 76.82726 77.59125 10013.91725
12.15000 -3834.61516 21.03997 -253.99421 71.25077 71.85909 7121.30679
12.25000 -3795.04656 20.09797 -14.72785 76.53393 72.39015 7871.55505
12.35000 -3765.95785 17.65543 -250.29921 79.93161 75.40683 7471.88235
12.45000 -3737.62525 22.58122 -81.72477 71.67969 70.25499 7533.95468
12.55000 -3706.23801 21.06069 -36.79374 74.57430 76.11662 7057.55930
12.65000 -3679.10386 19.06514 48.54839 69.95112 71.72785 8563.52191
12.75000 -3647.55606 19.67572 340.10126 75.10970 69.67610 6606.25184
12.85000 -3622.76218 20.32454 33.00393 71.47318 73.68470 7026.80232
12.95000 -3597.85083 18.86379 45.25894 68.65151 72.00075 4737.92906
13.05000 -3574.63825 15.17216 4.14576 74.20906 73.50003 5768.99706
13.15000 -3547.72681 19.73393 -153.18175 72.78923 63.49735 5163.72061
13.25000 -3526.36782 18.11681 -43.64741 66.88190 75.41333 4214.39488
13.35000 -3501.57204 16.14724 97.90050 68.22669 65.58974 4202.26418
13.45000 -3483.19696 15.51891 -99.74328 71.40000 67.19964 4848.98354
13.55000 -3460.02049 16.31512 90.24848 62.34473 66.50602 4667.68805
13.65000 -3438.92554 17.04006 -98.96193 66.12775 72.27246 4862.66156
13.75000 -3415.77456 16.60203 -31.41052 71.95172 74.48023 4163.85371
13.85000 -3395.17329 17.47626 53.43165 62.55446 62.26430 3891.62185
13.95000 -3372.49679 17.54765 61.75730 68.39909 59.05079 3185.13266
14.05000 -3349.44383 15.82288 -42.06632 60.03706 71.25251 3917.37812
14.15000 -3322.06224 15.47259 -218.21804 60.99286 66.89553 4410.82589
14.25000 -3300.59004 15.12748 221.75963 63.28657 61.93402 5627.54506
14.35000 -3273.10133 15.06777 59.21781 65.28414 62.78325 3436.74116
14.45000 -3248.65899 14.36363 -129.18228 69.99447 62.55562 4133.93521
14.55000 -3225.02365 13.05095 -28.56433 68.42917 66.86053 3062.80942
14.65000 -3203.59875 14.43277 -11.38657 55.72025 61.99293 3896.07732
14.75000 -3177.03918 17.42922 110.02004 62.42188 57.82268 2915.61734
14.85000 -3152.60116 10.45284 -91.49580 51.47247 53.19436 3028.99242
14.95000 -3134.09117 12.68915 226.49181 67.86958 67.13875 3182.54304
15.05000 -3108.68333 13.29544 61.17872 66.45959 69.08536 2985.95906
15.15000 -3087.16961 11.71234 218.58268 58.75016 60.10691 3804.80738
15.25000 -3061.07868 10.68201 -49.34961 51.81524 52.88778 3365.35278
15.35000 -3037.07450 12.26165 -17.98680 48.12845 58.92735 2599.78136
15.45000 -3014.39991 14.51791 -54.84476 66.44610 57.13627 2539.92867
15.55000 -2992.76812 12.92062 -41.96462 53.54885 67.49151 2323.72852
15.65000 -2971.81720 10.54373 52.43594 52.71955 47.92090 2449.59955
15.75000 -2945.86423 12.41730 121.72923 57.83182 62.85944 2885.75366
15.85000 -2928.98308 10.06137 -9.45608 56.92410 57.20439 2973.93623
15.95000 -2907.35436 11.22474 20.36175 60.54187 61.68744 2564.14288
16.05000 -2893.47827 15.43814 3.72340 65.99532 74.36918 2345.43555
16.15000 -2870.11206 10.41451 -24.65302 50.27454 48.76910 2537.77718
16.25000 -2847.20680 10.67931 -23.36561 56.25598 53.41187 2740.15360
16.35000 -2833.16667 8.14628 -21.77270 60.06399 58.78153 1545.36050
16.45000 -2812.56545 9.86912 -38.64206 58.51087 43.97878 1698.53433
16.55000 -2798.94573 13.99898 -64.61554 65.33002 66.18313 2731.77377
16.65000 -2778.65238 11.08589 -67.22732 54.82300 51.54757 2446.38910
16.75000 -2760.76589 12.86967 25.55712 56.98487 48.63840 2168.10112
16.85000 -2741.44031 10.80635 -13.44307 58.16405 48.11059 1795.59242
16.95000 -2728.73716 11.66762 1.10033 50.98270 51.58883 1252.07640
17.05000 -2714.34812 9.63324 -73.64556 51.29823 43.55954 2453.59652
17.15000 -2696.72492 10.21848 -106.82453 42.27914 43.56951 1431.29965
17.25000 -2678.01843 11.50668 -22.33268 49.18186 46.43567 1655.30128
17.35000 -2660.35320 7.76997 40.44400 47.16808 40.74109 2626.91588
17.45000 -2644.03549 10.29382 46.03265 52.68752 38.60005 1602.82416
17.55000 -2630.21661 11.03142 -284.49060 62.11253 51.75394 2637.85354
17.65000 -2609.99466 10.53543 48.43636 51.88699 44.17636 1763.02481
17.75000 -2595.01754 11.11687 17.02170 54.74633 52.03151 1890.42574
17.85000 -2578.50165 10.83012 -20.07782 57.00122 43.95640 1380.54461
17.95000 -2562.90570 14.23098 25.00955 49.01336 47.47757 1387.61765
18.05000 -2549.15910 10.21494 3.41622 49.80731 47.38785 1425.76427
18.15000 -2528.55672 9.79457 -58.77942 70.44866 53.71981 1063.31774
18.25000 -2515.18921 8.96503 -109.32177 48.35894 36.07127 1604.10109
18.35000 -2502.29001 10.87527 -44.51075 45.31836 37.72645 1458.62390
18.45000 -2489.65373 11.49478 -11.01985 55.48561 47.50833 2018.78614
18.55000 -2470.18478 14.99915 -31.70551 49.08859 57.71688 1056.69103
18.65000 -2459.78726 8.39936 -67.94194 42.62544 41.17498 1532.95566
18.75000 -2444.40415 9.08390 -45.79078 49.49172 46.05555 1116.08871
18.85000 -2434.72090 10.90874 -79.74061 47.28402 51.82804 1265.16004
18.95000 -2414.67407 9.36845 32.14033 52.76399 52.54661 1156.14810
19.05000 -2403.65993 9.53671 59.90937 60.72068 48.13746 1338.01935
19.15000 -2390.61729 9.10196 13.19129 47.27997 51.27482 1050.74593
19.25000 -2372.43412 8.44260 -26.43268 57.20652 38.88007 1702.32950
19.35000 -2361.99102 8.88338 -48.30653 41.06387 36.75040 961.61328
19.45000 -2347.43529 11.64354 131.59613 52.71861 42.66883 1391.36155
19.55000 -2329.70152 12.55981 -73.77588 54.84018 57.96700 998.73508
19.65000 -2314.12390 16.72516 19.05180 31.63942 39.31025 1056.82270
19.75000 -2296.14127 15.32055 -124.25551 55.63615 38.78147 1236.50809
19.85000 -2288.90398 18.03612 -41.85370 40.69244 35.29822 1035.71143
19.95000 -2277.17652 17.10075 21.41099 36.20840 30.16242 794.17725
