0.05000 13248.40001 163.49672 7045.36261 72006.11902 73241.29695 40382.31365
0.15000 -35404.53072 504.57993 3314.74804 49572.25672 68840.42407 71910.65128
0.25000 -40882.29525 452.98451 514.94553 23446.43614 23273.48853 40020.18003
0.35000 -32598.40061 -27.76242 -446.43651 13983.67705 12185.17708 29102.88703
0.45000 -27606.03571 181.02433 -280.26233 10033.79182 7906.30387 23695.97093
0.55000 -24090.34670 -70.93786 67.43279 8280.53954 6118.17616 20454.04964
0.65000 -21582.79124 3.94823 -110.32135 6728.18326 4780.61770 17813.98486
0.75000 -19796.71086 71.74419 -92.76969 5838.93143 4257.27473 15981.46933
0.85000 -18276.80599 26.93837 -114.39345 5015.01897 3429.32281 14506.47634
0.95000 -17120.08236 15.63156 -231.80489 4646.29485 3287.15656 13272.93475
1.05000 -16141.06339 33.33312 -216.75009 4167.40781 2760.60417 12275.73682
1.15000 -15289.39510 31.51811 -20.79731 3648.45618 2549.52608 11343.40665
1.25000 -14592.08232 3.22584 -72.04308 3466.20657 2629.48827 10560.38935
1.35000 -13946.89718 -0.60430 -74.49633 3244.07169 2243.26442 9943.29638
1.45000 -13282.16673 16.71276 51.89368 3044.46579 2102.43551 9408.82286
1.55000 -12783.07276 -8.73448 -173.64611 2780.09045 2053.79000 8817.46097
1.65000 -12196.83431 9.19940 42.01632 2667.29462 1943.39165 8496.58898
1.75000 -11812.23944 -5.51342 -137.02071 2523.28227 1921.93307 7987.31039
1.85000 -11375.22631 0.11147 -14.20447 2205.49263 2061.50816 7609.66192
1.95000 -10939.03667 -32.50930 86.18101 2037.98015 1615.99865 7299.34969
2.05000 -10586.81526 3.54919 -48.42652 1832.95804 1562.97913 6983.05469
2.15000 -10224.93368 -34.00009 -159.66150 1762.26058 1545.53179 6706.44017
2.25000 -9952.05231 -44.58935 131.94427 1637.84757 1449.93653 6386.38501
2.35000 -9636.55958 -23.53948 -30.78095 1523.47436 1451.54249 6218.46833
2.45000 -9366.60641 -29.35752 11.18185 1424.53610 1398.49750 5925.24130
2.55000 -9120.02466 -14.46088 99.74363 1275.80647 1393.12462 5667.90702
2.65000 -8915.59059 -43.96307 27.70491 1199.71200 1333.23604 5377.85691
2.75000 -8697.38017 -1.57513 41.37857 1165.49405 1212.51711 5176.48937
2.85000 -8503.97359 -29.00668 27.33952 1103.53759 1228.04062 5026.58925
2.95000 -8315.63517 -26.84387 -14.07808 950.99345 1149.69760 4788.40032
3.05000 -8179.59855 -30.66247 13.32253 1000.61575 1247.88365 4503.77637
3.15000 -8047.25391 -18.47377 15.33443 874.00703 1121.43397 4333.10158
3.25000 -7901.10366 -9.06485 -6.35144 838.53970 1125.12616 4197.14197
3.35000 -7807.81738 8.45894 -109.16262 771.78796 1080.66577 4005.46307
3.45000 -7690.38262 8.61796 -18.00642 838.70699 1063.34191 3909.69828
3.55000 -7609.55295 11.31178 -1.21562 719.42006 1117.78998 3746.76493
3.65000 -7533.77957 9.50130 -23.15000 727.75549 977.23581 3629.51471
3.75000 -7483.17709 9.15232 17.07079 712.23448 941.76585 3515.94922
3.85000 -7421.35847 18.09440 28.64947 742.71706 935.25746 3386.99092
3.95000 -7368.81944 24.27783 -5.41054 817.78055 879.70794 3290.15576
4.05000 -7326.78542 11.20385 -54.20283 781.77597 896.48369 3205.25044
4.15000 -7281.67268 14.66119 -45.60776 698.71354 811.27774 3127.53640
4.25000 -7235.05960 17.58551 -8.72523 761.41114 832.96018 3028.07619
4.35000 -7187.65851 16.68484 28.71189 704.35392 730.52311 2969.11517
4.45000 -7147.00360 16.79010 -12.19113 676.65497 692.93804 2865.84706
4.55000 -7094.14435 15.97652 -18.76062 855.78880 751.94262 2822.51600
4.65000 -7060.69952 14.08194 5.00399 694.15658 635.65883 2757.74125
4.75000 -7014.94650 5.04288 -8.27648 732.80796 809.61338 2694.01322
4.85000 -6969.87799 18.81448 -30.32082 709.00810 594.13132 2629.34391
4.95000 -6931.97055 12.87746 -18.81201 756.40618 608.01294 2547.05998
5.05000 -6867.43595 11.37160 -23.12573 755.01153 874.97859 2498.03011
5.15000 -6828.84276 19.33265 -22.50890 607.44290 499.72682 2418.25825
5.25000 -6770.37960 19.20176 0.86109 597.91485 500.02580 2359.37483
5.35000 -6714.82400 17.60198 9.18114 638.57623 585.69451 2289.55065
5.45000 -6649.76542 10.71614 23.79967 558.75033 499.16348 2266.82536
5.55000 -6599.85270 21.61240 23.33742 596.02952 489.93009 2193.07401
5.65000 -6547.51028 5.18228 7.99544 498.19157 407.88594 2145.95927
5.75000 -6508.68896 13.34836 -12.76579 532.09074 419.76430 2078.62212
5.85000 -6439.69421 18.72849 37.76198 514.35936 500.28203 2078.88517
5.95000 -6394.68593 10.63868 -10.69863 477.17661 434.55286 2000.61379
6.05000 -6338.01194 14.10949 12.44792 462.93213 345.81618 1981.48445
6.15000 -6289.10914 8.84386 2.09778 435.40123 343.99918 1917.31252
6.25000 -6238.37483 8.78912 6.66278 412.53379 537.76785 1915.58018
6.35000 -6188.60368 4.80957 9.60252 435.58606 406.94180 1836.08706
6.45000 -6146.96658 8.42562 -8.89796 760.00952 573.44838 1800.97393
6.55000 -6110.91527 8.09018 0.65343 467.41833 317.00105 1752.60686
6.65000 -6064.46475 7.82964 4.55329 345.64926 441.18237 1697.58811
6.75000 -6027.85439 4.70418 2.60605 397.33553 346.96266 1688.66064
6.85000 -5978.45254 7.03254 -18.32423 357.44501 262.63190 1639.82017
6.95000 -5941.71968 7.26377 23.70843 358.58734 263.22205 1589.55830
7.05000 -5901.97021 8.45983 7.89025 321.56152 234.39357 1555.42367
7.15000 -5867.62353 0.52396 16.34025 335.69267 371.11009 1524.52966
7.25000 -5825.96713 4.46268 8.85909 302.75814 260.08813 1483.80331
7.35000 -5783.35630 4.87430 -4.71838 321.46865 347.93882 1471.62716
7.45000 -5744.35499 3.66933 14.24757 543.42174 584.90658 1462.95313
7.55000 -5699.25387 7.70041 3.47518 311.68349 211.57877 1393.79434
7.65000 -5655.26677 6.44811 21.77929 502.90686 321.91322 1397.36458
7.75000 -5608.43427 10.37685 5.54892 315.73824 255.12700 1346.35218
7.85000 -5575.31857 6.31460 -11.69242 354.65344 273.35559 1313.19296
7.95000 -5527.44635 8.26466 -0.41241 418.06920 254.72226 1284.36811
8.05000 -5483.63947 9.18934 -4.84633 351.86252 321.08296 1268.31243
8.15000 -5436.29633 6.48566 6.35925 253.90939 215.74534 1224.26885
8.25000 -5390.98921 6.33684 14.42061 253.93935 196.85253 1182.97328
8.35000 -5348.90242 6.61068 -0.28871 438.21433 528.35598 1209.82258
8.45000 -5304.85491 2.73255 -17.03309 235.74221 208.89681 1134.73431
8.55000 -5254.29387 4.90285 -10.67802 299.62600 326.70516 1208.42211
8.65000 -5211.64489 5.73334 -6.40254 247.37080 222.08244 1092.11725
8.75000 -5167.17558 4.52092 -17.15438 303.01233 194.94517 1061.05410
8.85000 -5119.08886 0.76727 -15.04027 311.10054 313.72234 1043.60303
8.95000 -5075.70537 2.89507 -5.02669 439.82601 177.76805 1037.36757
9.05000 -5029.42551 0.18000 -17.41077 200.38596 149.33542 1002.50641
9.15000 -4987.00108 -1.05041 -13.74679 228.91029 346.74657 986.80249
9.25000 -4937.51978 0.97185 -5.91806 213.80378 176.85173 983.56880
9.35000 -4895.98466 -0.07043 -46.76197 399.10544 212.99454 935.58055
9.45000 -4853.00228 0.67352 -10.57086 191.40095 142.54959 910.99017
9.55000 -4809.31393 4.04832 -13.56145 188.03525 229.95862 899.52940
9.65000 -4767.58328 5.67254 -20.32883 290.68150 254.90697 888.69171
9.75000 -4727.31552 -0.06246 -15.50025 203.54885 253.05370 857.94794
9.85000 -4688.39403 2.91419 -16.41313 240.63616 160.32480 843.89914
9.95000 -4648.68638 2.32863 -25.87402 225.74989 153.03702 869.88556
10.05000 -4613.55267 2.82778 -16.45400 179.93569 148.22986 807.33917
10.15000 -4578.12850 -2.61337 -30.90163 166.52449 293.16599 816.88763
10.25000 -4539.10636 3.44174 -34.50962 225.70919 215.62527 826.66703
10.35000 -4497.95858 2.20885 -21.71274 172.17003 123.21337 768.08553
10.45000 -4467.19963 3.14340 -23.37568 209.49418 117.78799 753.81978
10.55000 -4431.09673 0.87976 -24.18248 182.49214 193.66640 741.83974
10.65000 -4393.16891 3.25412 -19.13573 152.46637 113.49736 711.83569
10.75000 -4364.49690 3.83480 -22.13401 300.26683 182.33491 714.70488
10.85000 -4326.07637 2.73837 -10.31572 504.50293 514.92708 739.83486
10.95000 -4289.97413 4.58383 -9.32288 169.67823 217.33294 694.94021
11.05000 -4257.27792 2.19010 -25.75809 218.75373 195.78204 673.91444
11.15000 -4226.46892 2.46657 -2.52465 197.54909 165.94831 697.07154
11.25000 -4195.84808 4.94672 -19.92146 209.21150 296.23362 663.93754
11.35000 -4168.21028 2.29012 -6.59522 168.32216 131.47547 644.95468
11.45000 -4129.43285 2.96739 0.76788 206.75184 163.72063 660.44393
11.55000 -4100.47676 2.07844 -14.05966 160.33344 121.32938 643.32879
11.65000 -4070.35381 4.08907 -3.42661 136.47602 122.42248 607.67481
11.75000 -4038.28098 4.48204 -11.58941 233.98826 137.63883 610.94623
11.85000 -4013.77693 2.29310 9.03517 124.36729 110.17980 582.51327
11.95000 -3983.85166 4.59293 -16.28289 206.23887 252.44242 583.37023
12.05000 -3953.14628 2.47256 5.03160 174.85993 105.73891 564.96428
12.15000 -3925.96114 3.29975 5.24886 159.33149 180.42232 555.11857
12.25000 -3898.37637 0.91391 -2.93834 131.98820 134.90336 579.50035
12.35000 -3872.14030 1.39282 3.20228 158.50404 175.43022 551.13664
12.45000 -3844.11173 3.75401 -0.65564 130.37305 156.29034 541.83514
12.55000 -3816.33539 3.71503 0.13514 158.89194 129.58583 523.91705
12.65000 -3790.67460 3.34984 -6.28811 165.82998 197.48318 540.45282
12.75000 -3761.59013 -0.71678 -4.81734 185.75926 253.60832 498.45360
12.85000 -3734.04440 1.64792 -11.35855 107.97596 76.82492 488.73614
12.95000 -3704.87400 1.09840 3.97098 116.23120 123.66744 483.45339
13.05000 -3676.53352 3.87285 13.11035 171.79831 184.77327 482.83689
13.15000 -3657.02647 2.35581 -11.30635 122.46955 178.11481 456.64045
13.25000 -3627.15098 2.02516 -9.88223 94.13007 67.02336 442.94273
13.35000 -3603.98804 2.12504 4.61606 85.72344 72.83352 438.05832
13.45000 -3578.00086 1.70339 -8.03798 163.63714 139.67863 439.29383
13.55000 -3554.19397 2.64490 9.10829 122.83254 126.89993 429.92461
13.65000 -3528.90119 3.42529 -4.66785 104.58726 103.63778 423.25485
13.75000 -3501.85608 0.75594 -3.21579 105.97409 138.06354 419.07489
13.85000 -3476.67220 1.88173 -15.17376 141.06681 105.58043 400.44599
13.95000 -3451.76973 0.56900 -7.65028 149.84603 140.29128 416.43854
14.05000 -3428.79009 1.48242 1.64205 75.42477 119.70519 386.92556
14.15000 -3402.60419 2.23962 -8.91426 81.77081 140.89700 405.26754
14.25000 -3380.86918 2.91072 -6.56229 98.44234 74.78035 375.09638
14.35000 -3358.24300 4.96048 -12.96556 239.29164 290.92412 445.23306
14.45000 -3339.05472 3.10540 -10.82526 69.28736 94.83629 352.99243
14.55000 -3314.17689 3.97222 -11.83879 251.80782 204.98203 444.40344
14.65000 -3289.61901 5.83479 -21.90744 121.21654 167.71223 374.63814
14.75000 -3269.08497 3.61714 -18.72247 115.57630 147.31679 357.63480
14.85000 -3247.59663 1.98423 -22.23400 71.35942 73.60600 337.19311
14.95000 -3227.61259 0.59409 -20.75983 77.08064 79.71013 335.37744
15.05000 -3205.82411 0.53518 -10.16312 172.90896 312.54431 397.10265
15.15000 -3186.75402 0.32985 -11.79830 271.05920 428.71537 367.76888
15.25000 -3165.09587 2.21719 -14.32968 66.21729 66.32611 314.46040
15.35000 -3140.60300 0.66667 -9.49093 90.57060 99.67535 321.75673
15.45000 -3122.66636 0.64694 -10.07315 285.66978 206.51545 310.10545
15.55000 -3103.85238 0.48411 -8.43715 97.34219 65.46085 300.74615
15.65000 -3083.44444 2.05547 -21.89818 69.75695 66.20532 331.37694
15.75000 -3061.00348 0.76857 -14.79548 63.23041 71.12950 295.71373
15.85000 -3041.57428 1.66904 -17.99807 61.63904 58.73507 278.69167
15.95000 -3023.24756 0.77775 -9.37104 61.02048 58.36202 278.29127
16.05000 -3000.93464 1.47363 -10.02640 74.69315 60.25296 278.04693
16.15000 -2977.69099 0.28880 -9.65025 164.02345 59.00187 309.68148
16.25000 -2964.75602 2.29510 -17.48375 61.44655 68.86866 255.72884
16.35000 -2943.22741 1.97479 -7.85406 52.45423 52.86524 256.45998
16.45000 -2923.62501 0.99221 -11.17797 340.21231 684.65384 558.52046
16.55000 -2904.26829 -0.19224 -0.68309 110.92358 138.19106 256.72391
16.65000 -2888.98876 -0.77305 -7.43805 175.89339 156.43309 294.03738
16.75000 -2871.28424 -2.90142 -8.13998 88.25148 133.80097 268.79507
16.85000 -2848.98515 2.22444 0.80064 59.49937 72.40981 241.98071
16.95000 -2845.22442 -2.55427 -2.61561 592.80770 262.40852 251.28413
17.05000 -2813.08920 0.44521 2.41983 55.97519 58.97825 236.82721
17.15000 -2791.45273 1.88685 0.86460 60.40815 65.24094 223.81673
17.25000 -2775.03545 2.00611 -0.19921 55.54252 48.55205 217.56257
17.35000 -2756.11193 0.89766 -1.66212 69.88655 59.47113 235.97040
17.45000 -2735.67736 1.29391 1.20159 75.51543 49.92598 212.51645
17.55000 -2718.15945 1.44917 -1.56279 61.27232 45.66772 214.70300
17.65000 -2702.43911 2.14072 -7.32882 66.15311 77.78089 237.13303
17.75000 -2685.17100 0.11088 -12.87073 45.00059 48.35968 201.29843
17.85000 -2666.99107 -0.36385 -8.71697 45.09826 58.25081 202.73373
17.95000 -2651.10624 -0.59566 -3.58766 43.79468 65.56352 194.38602
18.05000 -2642.64565 3.39388 -13.68714 336.80491 201.65533 450.70847
18.15000 -2615.40122 1.89459 -0.92778 86.75493 51.53766 220.78034
18.25000 -2600.52913 -0.02299 -7.16025 40.91391 39.92584 186.41943
18.35000 -2587.27534 -0.26015 -6.45624 54.63114 78.69660 202.02901
18.45000 -2569.60342 2.31401 -6.01773 34.81834 35.89915 185.48456
18.55000 -2553.52063 1.73821 -8.20999 40.26118 38.42662 180.31515
18.65000 -2542.11253 1.46371 -6.18249 97.43515 67.60753 194.96156
18.75000 -2526.93979 -0.64748 -3.11944 41.59766 41.73976 177.47032
18.85000 -2508.04395 -1.60490 -12.47904 42.82006 67.99657 180.01943
18.95000 -2493.65576 0.85301 -14.05630 42.01849 37.74001 180.23679
19.05000 -2478.88026 -0.46941 -17.66753 43.63113 44.07241 176.89359
19.15000 -2463.80345 0.62257 -10.42160 42.43657 29.40623 165.91085
19.25000 -2447.21061 5.99169 -5.35423 95.58827 178.99386 376.61268
19.35000 -2435.77325 2.50857 -10.87100 47.39759 52.75771 160.74071
19.45000 -2420.52412 0.90156 -15.69435 49.35282 36.68664 157.46469
19.55000 -2406.79840 0.48824 -18.76796 31.07830 34.02274 154.97899
19.65000 -2390.92972 1.56766 -17.25415 42.11486 32.84018 155.58392
19.75000 -2377.91863 0.79985 -16.63542 37.18879 50.70202 153.12884
19.85000 -2365.52050 1.57858 -5.65274 44.10974 51.96100 141.21691
19.95000 -2351.92404 3.25935 -5.27375 39.00979 61.16277 146.16109
