0.05000 -5822.96921 -3417.62182 2085.45747 10499.37217 9556.21414 6799.84207
0.15000 -5602.11240 657.32977 705.92141 9585.89600 10303.20962 9657.19256
0.25000 -10756.12035 -86.83773 897.93125 7233.24508 9240.55639 12971.94035
0.35000 -12011.82508 86.05545 1258.02615 6053.99329 6581.28417 13115.01070
0.45000 -12347.89791 374.69792 -248.72813 5280.50686 5349.11935 13050.20440
0.55000 -12151.09403 83.56294 147.55421 4805.82850 4074.05502 12416.06103
0.65000 -11838.95433 112.87739 367.90628 4013.26542 3592.08784 12015.28439
0.75000 -11721.85953 82.09692 -107.84047 3782.91878 3122.15074 11266.21376
0.85000 -11305.67412 107.58200 160.00379 3693.43058 3085.33065 10741.59724
0.95000 -11047.56302 -14.64975 -580.92952 3288.86951 2567.09965 10293.32400
1.05000 -10913.79544 9.70615 -29.72580 2851.31247 2284.27090 9649.07370
1.15000 -10481.60150 -46.31036 -161.10696 2817.13834 2406.49222 9305.85784
1.25000 -10231.93210 89.37145 -257.77191 2683.94487 2238.76495 8899.76934
1.35000 -10212.02163 103.15567 -19.63788 2566.78532 2128.84884 8334.70215
1.45000 -10091.16766 100.77600 -195.22895 2401.96205 2135.17090 7994.46835
1.55000 -9922.90276 74.30230 -137.47791 2497.65037 2111.82082 7688.33786
1.65000 -9749.07008 -1.91675 219.65993 2123.69108 1872.58925 7241.28629
1.75000 -9459.24264 46.93225 27.54132 1941.30277 1875.14890 7104.01155
1.85000 -9293.92376 45.10516 89.85843 1954.27871 1884.57192 6792.74031
1.95000 -9110.81950 69.07216 -16.86066 1738.13390 1720.14460 6583.77745
2.05000 -9009.98088 3.83436 115.10847 1559.64564 1557.61940 6239.51775
2.15000 -8950.80444 18.60894 31.84597 1683.53356 1745.84293 6039.10567
2.25000 -8801.41928 111.86597 -27.56916 1578.01643 1734.51283 5798.42765
2.35000 -8633.94965 43.61605 125.43542 1284.03611 1562.96657 5550.34056
2.45000 -8479.89295 60.39949 130.96238 1437.31079 1472.94174 5481.98750
2.55000 -8457.77627 123.47916 104.28772 1362.52422 1425.38179 5224.72635
2.65000 -8275.61154 88.62582 146.10687 1287.85088 1368.88548 5070.21271
2.75000 -8210.29830 71.40645 259.81400 1193.77814 1383.55643 4783.03153
2.85000 -8151.54534 66.72132 -15.43408 1193.69120 1357.55747 4721.59085
2.95000 -8136.02666 42.59495 -30.79782 910.03877 1313.60103 4523.05943
3.05000 -8110.14172 84.14908 281.27640 887.12480 1361.32230 4452.37977
3.15000 -8034.11864 72.52238 145.58118 946.69908 1142.51589 4251.49706
3.25000 -8039.72655 48.85058 271.45369 881.15897 1266.09292 4102.94984
3.35000 -8038.21471 63.28486 113.97659 971.91894 1473.35999 4111.20490
3.45000 -7983.43504 3.38434 43.71652 946.47610 1390.58636 3883.18485
3.55000 -7953.69735 66.84580 170.11858 925.17646 1026.38118 3744.97933
3.65000 -7854.03766 -6.28579 98.74864 1052.39961 1028.30066 3778.19337
3.75000 -7877.31009 20.30485 179.93781 829.13022 995.50060 3464.87862
3.85000 -7842.06693 39.87726 105.60522 965.30787 1021.36129 3462.66734
3.95000 -7774.83288 45.11482 74.58558 819.32903 911.90317 3447.57386
4.05000 -7780.12495 31.56025 -5.58762 768.15243 866.12852 3249.23234
4.15000 -7696.34429 -26.56488 106.19789 811.60139 854.28618 3189.83184
4.25000 -7652.03720 -0.35525 8.35803 844.91857 783.79048 3128.98595
4.35000 -7566.61677 5.18194 77.98387 695.46664 732.23293 3040.94349
4.45000 -7535.63302 -30.70361 55.89836 681.11818 964.06363 2929.56692
4.55000 -7525.15098 10.33045 -16.73545 802.64014 879.96059 2816.39849
4.65000 -7457.06568 6.85003 2.71069 643.47277 700.62537 2735.19765
4.75000 -7401.86013 29.10606 53.18459 687.55466 704.07471 2681.08915
4.85000 -7329.70891 21.71709 48.17280 648.82503 636.83541 2659.57225
4.95000 -7270.67682 4.02788 10.24320 650.78805 736.62029 2570.00718
5.05000 -7197.49465 -2.30225 33.68386 615.56646 622.89265 2462.71264
5.15000 -7134.91538 32.36963 63.41710 616.19211 595.35399 2426.33967
5.25000 -7090.05177 31.34990 -44.19648 737.14194 622.99252 2354.05191
5.35000 -7053.71863 49.22716 7.42391 610.41796 589.82819 2259.46176
5.45000 -6984.92474 34.21947 -69.24158 593.43808 594.63256 2204.60498
5.55000 -6949.33569 38.35302 -11.38787 595.16643 726.45721 2192.93457
5.65000 -6869.52949 37.39500 -2.26181 653.27837 564.43325 2116.03097
5.75000 -6835.51654 35.82176 -97.56278 706.05518 555.31907 2055.55971
5.85000 -6759.02913 30.57217 36.12407 576.10007 543.33388 2042.38150
5.95000 -6692.29801 21.01592 -87.04084 509.10620 489.74054 1964.70584
6.05000 -6609.94057 22.12184 -6.38319 592.59522 701.30612 1938.42507
6.15000 -6541.08981 52.76348 -171.50262 881.50378 621.52047 1878.16690
6.25000 -6534.45391 21.10210 -72.42230 511.46428 418.77757 1779.39253
6.35000 -6440.06932 28.71209 -180.87364 489.36563 427.71933 1737.72180
6.45000 -6396.23685 28.72119 -102.03306 579.81730 479.40239 1751.05884
6.55000 -6345.51360 21.22873 -76.19336 512.44082 482.86160 1658.52795
6.65000 -6253.66607 26.70480 -90.79510 534.70328 386.78767 1647.46793
6.75000 -6202.95026 25.15269 -152.43563 445.92998 417.93612 1597.79295
6.85000 -6149.28312 32.61883 -117.60632 455.49264 437.31439 1557.11009
6.95000 -6091.90797 10.23465 -146.06589 491.41911 395.64609 1481.84255
7.05000 -6026.78887 23.09079 -182.69099 446.67764 340.14530 1448.24061
7.15000 -5967.10955 26.59663 -152.61382 502.03717 401.29282 1474.76175
7.25000 -5936.81956 42.13573 -101.53900 404.15572 368.71960 1401.77574
7.35000 -5878.87508 -4.31840 -117.10869 445.37444 363.95339 1364.85105
7.45000 -5806.93787 24.81870 -122.14414 449.13938 430.41356 1343.77579
7.55000 -5787.31640 1.14787 -134.90465 671.35923 366.30186 1287.62414
7.65000 -5680.47511 23.63346 -96.68652 389.59751 317.96945 1269.79292
7.75000 -5644.68589 19.61905 -62.10791 368.85840 329.45562 1245.20124
7.85000 -5596.85620 9.87554 -70.17941 358.92825 239.34603 1203.62536
7.95000 -5540.84989 25.68271 -48.21740 348.78655 298.94534 1159.36189
8.05000 -5489.15684 14.52785 -15.56588 326.80768 241.34153 1139.72908
8.15000 -5436.58546 3.52519 -142.70314 327.64263 317.90575 1167.64409
8.25000 -5378.60020 7.36868 -94.27046 507.42347 587.93265 1510.64868
8.35000 -5325.35565 21.11661 -59.27960 326.32661 290.09104 1109.13166
8.45000 -5272.40190 15.56750 -11.90334 317.26214 297.93686 1038.57462
8.55000 -5224.80050 17.96109 -52.56147 267.81768 217.35243 1032.46847
8.65000 -5172.33066 8.70221 -50.78064 303.40904 270.98414 1034.21535
8.75000 -5124.49042 10.69078 -48.07206 304.18619 307.96776 992.25500
8.85000 -5079.66949 12.97620 -43.87727 285.44528 250.51092 956.36754
8.95000 -5022.74426 19.85002 -78.35804 323.32780 271.48066 958.59748
9.05000 -4997.32951 5.52862 -3.85157 342.38581 280.91274 897.61609
9.15000 -4937.84280 13.06977 -42.60446 301.25630 229.76649 902.39123
9.25000 -4890.65495 23.70108 -15.27141 346.98312 298.36479 916.83937
9.35000 -4857.71169 20.22975 5.22799 296.50841 285.81132 886.77703
9.45000 -4818.02618 9.22316 9.88781 282.97920 221.17893 837.22981
9.55000 -4789.92134 6.45679 -9.46341 260.13732 325.88831 831.14666
9.65000 -4728.99328 10.99194 13.17746 275.60290 351.03161 853.54604
9.75000 -4698.32271 4.78784 -24.26247 288.47879 428.12194 810.94299
9.85000 -4655.44899 24.45261 24.42156 254.19948 205.95723 789.07359
9.95000 -4621.50700 8.70266 -38.74188 254.15025 192.56533 805.36669
10.05000 -4583.33300 -3.29808 -44.39571 714.03567 399.33148 1072.92380
10.15000 -4543.82333 37.93369 -4.73278 321.41220 396.82987 724.00010
10.25000 -4492.01141 22.44728 43.74804 256.28681 246.64909 741.70459
10.35000 -4462.16847 17.40864 -47.95296 292.46417 171.91364 718.22861
10.45000 -4414.49723 17.36119 -47.98883 248.22932 240.29139 693.86320
10.55000 -4387.93803 18.37325 -27.76317 202.26103 163.85812 661.12148
10.65000 -4361.31322 9.70813 -35.99638 302.70695 288.53700 687.29727
10.75000 -4319.61595 7.86259 -32.82325 204.19601 174.25310 661.70417
10.85000 -4291.28895 14.82202 -44.75421 175.31290 147.17924 608.87215
10.95000 -4224.17397 10.01260 -27.77691 480.00328 555.07532 685.70812
11.05000 -4208.40173 8.75104 -14.90567 231.22222 180.17913 617.35130
11.15000 -4174.18537 14.63311 -46.55245 326.40502 182.63059 623.03552
11.25000 -4136.01165 19.21753 -41.81650 195.08644 168.51991 590.50103
11.35000 -4115.22527 11.45562 -24.24735 206.62932 151.25850 584.37973
11.45000 -4073.60413 18.24908 -53.69843 212.97810 118.28959 598.85146
11.55000 -4043.08934 12.80438 -55.41938 166.84779 133.38713 535.45306
11.65000 -3999.11758 17.94789 1.04016 176.79096 158.09711 563.00691
11.75000 -3967.58406 23.11155 -54.60780 270.18526 219.63321 547.83237
11.85000 -3931.58158 0.92625 -71.56774 291.67249 366.83593 580.27340
11.95000 -3917.29777 7.26507 -35.75256 142.13304 156.54471 498.53591
12.05000 -3885.63495 1.86489 -34.76991 368.41542 221.54039 544.85173
12.15000 -3860.86673 21.46132 -61.58378 502.44098 162.95410 576.92148
12.25000 -3817.30714 13.58503 -45.44346 211.73773 127.12645 473.21241
12.35000 -3804.26527 11.81927 -46.41578 154.29722 128.78702 481.61221
12.45000 -3766.99032 6.81480 -38.00915 273.92063 182.50090 453.06534
12.55000 -3741.82018 10.52999 -33.03329 206.41309 159.62359 471.41456
12.65000 -3706.20746 11.66059 -54.69104 126.28019 113.95951 476.55740
12.75000 -3679.08194 14.41467 -44.71681 126.53114 102.06787 440.57426
12.85000 -3662.18628 2.76889 -54.46497 140.04181 129.54513 420.34418
12.95000 -3630.31373 13.17862 -1.32381 137.71880 94.59831 435.05934
13.05000 -3587.97587 -19.45159 -7.72187 236.79642 797.07664 431.51807
13.15000 -3560.35148 8.26316 -54.03975 199.61383 129.43177 414.45149
13.25000 -3541.19488 24.92701 -6.38299 159.29827 161.05757 403.01565
13.35000 -3513.05293 3.30531 -26.76430 187.47723 184.37245 410.44321
13.45000 -3492.43795 12.39788 -58.44334 177.15937 116.37788 425.18625
13.55000 -3457.32950 18.33821 -22.55674 105.70364 110.03101 385.53093
13.65000 -3439.14554 12.33424 -70.46986 136.74277 117.67720 363.47436
13.75000 -3418.79805 11.27678 -2.21285 113.61058 88.97346 360.61958
13.85000 -3393.30439 10.05477 -29.92588 121.52348 96.63343 356.82548
13.95000 -3381.05460 -4.06275 -33.86173 193.11849 214.87849 356.26373
14.05000 -3345.25000 24.14674 -40.24418 242.42370 185.94261 376.16232
14.15000 -3333.12838 13.36302 -15.10920 92.94442 77.97240 325.79368
14.25000 -3292.17702 -10.42675 -4.29277 140.58101 217.68046 363.98146
14.35000 -3279.24574 3.90881 -13.22678 107.68061 104.89676 318.04264
14.45000 -3249.74563 7.54921 -19.49026 191.23110 304.75534 345.58741
14.55000 -3225.33797 0.28936 -24.62509 156.23353 155.54775 333.19213
14.65000 -3202.47724 4.48090 -13.62642 110.43862 131.29252 330.76576
14.75000 -3183.12829 10.56438 -11.03827 99.64891 86.82598 295.73591
14.85000 -3156.99707 4.49819 -41.49105 322.60337 328.92275 302.54240
14.95000 -3154.39420 -10.92264 -29.37444 393.11023 153.30708 351.75290
15.05000 -3124.69213 16.22673 -33.68372 95.06818 108.17161 271.90741
15.15000 -3094.85555 11.52497 -31.71394 89.85489 87.21547 285.76734
15.25000 -3063.51465 13.37594 -39.18616 229.22530 142.46048 306.02555
15.35000 -3054.00890 2.28162 -17.48639 109.82493 97.45680 268.60813
15.45000 -3043.96722 6.30149 -18.53494 111.75186 112.45864 263.87552
15.55000 -3018.16132 2.61933 -26.56660 154.41302 97.28449 298.96235
15.65000 -2997.24756 7.04648 -54.03158 90.30921 92.76871 266.62036
15.75000 -2972.22796 5.31588 -43.37875 132.46261 68.60503 254.51022
15.85000 -2965.71482 10.08881 -19.03266 172.60892 185.96426 278.67225
15.95000 -2925.30629 -3.30292 -49.66800 163.80042 279.78637 275.53598
16.05000 -2915.87731 9.72900 -23.84944 101.95212 93.05148 245.47448
16.15000 -2907.53004 15.07616 -31.01053 108.13724 86.95159 241.88344
16.25000 -2866.05174 3.34984 -30.09318 170.15068 64.08151 219.29417
16.35000 -2863.95219 10.58632 -56.28587 76.31021 77.73100 216.56876
16.45000 -2845.25378 -10.37772 -24.49003 72.18825 289.08684 281.13214
16.55000 -2830.82099 10.23299 -11.09751 106.28039 51.23705 251.52198
16.65000 -2802.98414 4.70952 -41.34720 100.91886 183.20150 238.44562
16.75000 -2783.49749 10.80600 -63.99685 77.34695 78.02063 218.12271
16.85000 -2779.07256 17.11293 -24.10826 80.69738 101.89139 216.98701
16.95000 -2751.14815 5.09871 -33.67637 77.59927 80.47250 249.08903
17.05000 -2745.39349 15.12396 -45.41868 94.24939 146.95493 204.79566
17.15000 -2713.40621 7.02237 -37.01132 67.43028 43.55507 191.42886
17.25000 -2695.69138 8.68955 -39.69502 72.72248 54.58678 204.61851
17.35000 -2678.59060 7.89760 -35.76914 66.46807 50.34105 214.81527
17.45000 -2667.46508 8.50858 -39.76170 162.62385 93.72069 206.96467
17.55000 -2640.95112 16.27964 -37.60658 130.99701 140.93984 330.15194
17.65000 -2626.69978 8.50522 -37.66062 50.42689 73.68777 197.35488
17.75000 -2600.58297 19.04235 -31.67502 66.28630 105.78042 211.50286
17.85000 -2605.09726 1.48089 -19.92576 74.19107 72.38473 191.42561
17.95000 -2577.74255 14.85543 -34.02261 56.85034 63.63500 203.81954
18.05000 -2559.20023 4.70531 -19.10090 68.81795 44.93118 186.19970
18.15000 -2548.49105 0.70898 -28.07514 66.13773 59.71255 174.17715
18.25000 -2531.44222 9.97535 -31.20439 56.30937 49.75687 193.43306
18.35000 -2513.19543 5.81863 -14.39161 52.36569 63.33401 177.10470
18.45000 -2492.89544 -2.57792 -12.14518 55.15833 133.50111 179.03788
18.55000 -2485.98617 -7.58986 -41.88470 98.35345 188.68288 285.15584
18.65000 -2479.08265 8.83077 -8.88799 53.12908 62.77880 170.50306
18.75000 -2463.49613 2.46743 -7.64566 59.27438 47.86827 182.28343
18.85000 -2440.34434 3.28516 -10.72423 91.24011 53.17719 190.06863
18.95000 -2417.94898 0.57145 6.05027 79.86929 60.65481 169.36782
19.05000 -2412.27858 8.71447 6.66456 59.53119 63.10480 163.48947
19.15000 -2405.00249 4.38648 -3.03493 67.70615 42.95274 175.54768
19.25000 -2386.73529 6.44519 25.82511 58.57845 52.53223 170.25553
19.35000 -2371.59258 2.61627 10.33771 70.92349 68.31480 158.05233
19.45000 -2358.25606 11.38063 -16.79701 68.73295 124.78497 176.63715
19.55000 -2337.81178 -1.35622 -17.26930 62.23813 57.31658 177.59222
19.65000 -2330.07364 8.01043 -18.57777 47.45106 40.77709 157.13149
19.75000 -2333.03492 20.50426 -9.53640 462.99192 143.40125 158.50834
19.85000 -2308.80298 -6.61569 19.64010 55.64627 42.79053 158.45751
19.95000 -2293.78716 5.04087 -8.57777 50.43800 44.70060 146.43370
