0.05000 -24013.74399 -1581.43646 113695.46579 18441.46464 30100.37462 1992874.53185
0.15000 -45672.28599 -380.33292 17345.95883 15612.11744 19833.78204 1963101.82378
0.25000 -47348.22820 561.85347 64776.51565 8244.47863 13524.85486 1996912.11702
0.35000 -44313.79465 344.88127 -42250.70173 6855.87854 8949.75868 1749092.25584
0.45000 -39492.50930 -192.95668 -42627.99471 5866.12431 7232.89237 1647390.56730
0.55000 -36212.14323 116.91512 -5870.58387 4728.15492 5408.93487 1387082.40590
0.65000 -32870.45148 -13.24786 -7246.63701 4048.90347 4034.93251 1274305.55068
0.75000 -30319.28822 135.95074 -22479.22317 3086.39604 3424.88131 1196104.51443
0.85000 -27644.32793 21.20018 30382.36140 2614.63683 2627.18222 1107548.20601
0.95000 -25610.17719 -14.58502 28891.53819 2396.11146 2430.23278 945602.74792
1.05000 -24025.26883 115.83379 -13355.08100 2424.12878 2301.95344 924549.23782
1.15000 -22444.96819 -17.87024 2730.94262 2474.45719 2247.67552 929400.52500
1.25000 -21097.79178 64.40713 -15140.28902 2084.32510 1755.45682 853467.72959
1.35000 -19871.79678 49.08973 -24680.40047 1880.22195 1750.92535 817510.41646
1.45000 -18788.43917 -18.60359 2145.47324 1919.52717 1948.89562 744145.93523
1.55000 -17860.60680 22.02515 -2323.26146 1697.14551 1677.61108 764378.60793
1.65000 -17051.75967 96.28531 24700.57742 1313.17636 1631.01577 636887.16160
1.75000 -16322.55834 56.51556 -5288.49560 1438.68255 1519.45094 641179.79389
1.85000 -15528.75639 18.05628 2432.08442 1036.77078 1344.96661 562791.23200
1.95000 -14861.40380 41.94192 -436.70004 1465.58161 1528.11924 593627.92151
2.05000 -14291.45590 82.37973 -15949.55953 1147.18729 1270.31888 560542.85322
2.15000 -13708.48905 17.90854 7742.16858 1230.30803 1370.63805 492989.66837
2.25000 -13195.77458 28.57991 5312.55888 951.61266 1178.07803 425451.52389
2.35000 -12726.83243 25.21655 581.29579 1130.75950 1725.32034 490879.24257
2.45000 -12341.11558 41.98865 10941.34125 1035.19116 1117.43847 432528.07504
2.55000 -11945.02792 12.02615 3193.33955 1015.38975 1251.67357 510810.35469
2.65000 -11553.66126 -7.25497 24684.49083 929.00331 1070.15789 471720.76729
2.75000 -11250.01599 20.12942 3959.50003 1023.33972 1023.81203 361629.65877
2.85000 -10938.70800 1.37326 -19066.71079 1011.20666 1036.08447 370133.19305
2.95000 -10664.56434 -43.50244 10367.39548 811.93645 1000.85594 344486.35011
3.05000 -10373.65841 -3.67060 14256.22989 836.99019 1005.64081 347675.54419
3.15000 -10157.52265 -27.46992 -7971.95834 873.11810 1031.00181 337667.47911
3.25000 -9914.66742 23.71701 -2320.15026 796.02131 1058.23696 320668.26609
3.35000 -9664.24583 -27.66627 693.72255 1329.95954 951.70234 269985.43209
3.45000 -9469.87081 -5.53286 4953.50817 934.54631 870.30076 280321.52843
3.55000 -9275.00801 -1.74257 -5133.39272 801.11688 860.55699 239229.01752
3.65000 -9143.78248 31.53374 8482.11946 665.24777 859.09401 262088.06989
3.75000 -8975.65650 13.80088 6389.82026 640.48166 877.71217 258890.18831
3.85000 -8857.59884 13.08345 5917.16163 720.16393 765.35870 213967.99430
3.95000 -8712.77806 -18.35391 -4899.99429 730.30082 802.33412 243801.46377
4.05000 -8550.77293 7.23471 -1694.58801 572.45589 752.39723 209919.15031
4.15000 -8419.32037 -16.45590 -315.76053 742.91949 738.52454 229349.96194
4.25000 -8270.82670 19.33409 -3242.50282 716.50316 756.62895 202142.21613
4.35000 -8190.75442 10.84536 6024.77608 697.63013 941.91142 162489.15970
4.45000 -8126.08990 20.37946 312.75977 1389.41342 739.11472 161600.43393
4.55000 -8020.40629 28.40851 -4030.48849 612.63417 692.26192 164980.73593
4.65000 -7911.18720 27.92543 -728.16285 635.52194 767.86582 182265.82458
4.75000 -7822.10552 50.94600 3622.59150 719.79238 883.09407 172882.93517
4.85000 -7742.28076 23.46884 614.73596 524.20350 716.27641 140849.89001
4.95000 -7709.49970 22.65024 -1455.64488 663.73271 689.88478 142345.47592
5.05000 -7651.87992 20.99046 -3399.28669 481.54131 612.31388 133948.90136
5.15000 -7599.06558 34.05843 -6372.23664 544.63877 545.32609 208978.60945
5.25000 -7530.78358 37.14014 1318.24452 588.23593 697.07141 116800.49602
5.35000 -7453.23587 40.51877 -4686.10694 522.27714 588.23797 104807.36360
5.45000 -7403.64921 37.63664 -2323.99273 560.25659 684.93668 107084.11990
5.55000 -7372.13789 45.23820 1064.73720 504.51020 738.24942 102813.52080
5.65000 -7309.36663 36.04780 -712.55430 507.94996 611.49548 102863.79491
5.75000 -7254.11544 24.89135 -1437.32222 569.81254 491.91395 100334.38310
5.85000 -7244.33507 21.64920 3369.35560 1043.02925 852.47775 109827.09808
5.95000 -7155.79381 36.79202 -5691.04262 593.26373 695.91952 125615.15895
6.05000 -7132.71165 32.04707 34.06157 501.73244 443.04233 86283.60538
6.15000 -7092.65010 49.80917 2291.87530 544.33637 516.87046 87175.47458
6.25000 -7012.18075 42.16102 1364.85782 464.14838 537.00007 81561.04708
6.35000 -6928.01352 48.23436 1515.75588 477.40915 380.52149 82034.30418
6.45000 -6855.65343 28.75906 -3194.69600 387.34912 434.42626 70368.22644
6.55000 -6827.79900 39.10753 413.56934 391.78850 440.80413 67519.08582
6.65000 -6763.77019 10.18581 -1257.31187 487.16431 538.62051 82100.13389
6.75000 -6703.21113 51.87454 -1729.37438 512.23940 531.95226 57329.80357
6.85000 -6659.94833 48.24103 -2881.23929 388.86236 354.21593 81864.93771
6.95000 -6585.67027 25.71232 1844.63485 406.45983 468.55994 55531.10927
7.05000 -6518.01336 26.31121 -572.41776 413.81564 462.59970 57498.44162
7.15000 -6455.25240 19.65203 -3097.88509 332.72593 325.98637 66021.18171
7.25000 -6392.89681 37.28996 1410.22845 503.61192 368.03736 53855.99112
7.35000 -6319.89438 39.57263 705.72163 324.47441 314.02102 57129.29755
7.45000 -6260.18093 28.55663 165.40385 337.19447 307.94946 46710.94235
7.55000 -6200.30713 20.50813 -2491.67820 277.48814 262.22794 45865.74835
7.65000 -6147.89263 19.25924 763.01339 329.23136 410.62524 41643.25834
7.75000 -6088.01768 25.57275 816.63761 362.59814 336.22396 48791.48820
7.85000 -6015.97066 35.60189 49.02490 583.79581 536.31219 45642.35685
7.95000 -5939.75435 28.23797 2004.26647 521.85962 546.70248 38763.64604
8.05000 -5868.74569 30.98845 -343.36116 264.06719 264.24873 43848.81098
8.15000 -5821.62691 28.27913 439.28879 273.91646 288.56738 45575.37698
8.25000 -5781.74979 37.73274 -303.61040 300.66937 288.22717 39823.70830
8.35000 -5708.91522 26.22347 -379.71463 241.62884 357.90976 31068.32087
8.45000 -5664.23226 29.38622 1349.68691 221.31847 229.25218 42131.59332
8.55000 -5611.36813 22.36727 474.27783 255.53911 268.37871 43789.75769
8.65000 -5559.23927 21.16599 -533.00517 287.42880 260.35299 37246.78505
8.75000 -5520.05986 14.87434 -644.09615 296.85180 234.52459 32907.19902
8.85000 -5480.33028 21.26912 89.74400 382.09678 266.21167 40096.77695
8.95000 -5426.31872 -0.09293 373.48617 345.82321 520.96874 31805.48863
9.05000 -5365.08494 7.48649 -494.57543 277.79599 242.35865 31060.00223
9.15000 -5315.73735 24.50619 1606.32331 321.46008 322.55584 37209.68023
9.25000 -5258.62530 7.35076 24.86257 265.11580 232.30700 32492.02777
9.35000 -5193.57050 26.00771 -320.44915 175.34660 172.98685 32373.26995
9.45000 -5168.73894 12.99477 -61.16948 463.87740 336.64746 24713.64520
9.55000 -5121.91061 12.79721 -775.88864 361.24693 274.26552 27042.95749
9.65000 -5057.20198 16.84394 1055.62348 243.55402 290.43232 30012.77668
9.75000 -5001.73861 11.55066 -475.33033 237.12167 248.78831 23783.11473
9.85000 -4971.31382 18.59172 -555.72351 248.63912 486.56527 30353.33567
9.95000 -4916.53690 20.38400 621.67114 262.43986 250.60513 21090.55209
10.05000 -4875.90618 21.61394 -681.69228 242.66554 204.10826 26532.87158
10.15000 -4823.57550 18.56700 -1335.40105 231.65170 249.33600 22916.29403
10.25000 -4809.73967 8.48592 -1131.42186 227.42981 189.15734 27615.77394
10.35000 -4737.31974 7.55171 -81.53518 232.87677 272.83211 19023.57837
10.45000 -4709.41931 23.51739 -48.51125 255.75079 228.46283 22982.83818
10.55000 -4639.69246 22.03587 -516.37560 271.97077 292.50871 26295.74589
10.65000 -4608.20175 22.61684 -160.66776 191.80400 160.20330 27774.19277
10.75000 -4564.13287 9.14651 -351.68122 494.14197 190.52907 20476.12885
10.85000 -4540.98972 14.27131 -893.67805 310.28102 163.97919 19685.72358
10.95000 -4481.37447 12.94567 -536.40210 179.19875 164.94821 18070.68766
11.05000 -4452.29428 12.05454 -1831.49550 187.60276 182.25036 24042.72668
11.15000 -4417.30083 21.54005 -1184.87509 376.99568 171.61618 16325.36359
11.25000 -4381.49464 15.21203 -722.39786 172.88720 180.83899 17966.16018
11.35000 -4337.97999 13.21156 -667.99785 173.39352 168.26515 21192.51569
11.45000 -4288.83722 1.18887 -1004.25826 282.65630 238.26529 17898.65049
11.55000 -4271.66841 20.19369 -1025.18813 173.36756 220.17902 16589.81570
11.65000 -4228.56021 19.08947 1261.42931 195.70987 156.01036 17252.56587
11.75000 -4176.84137 18.62633 -281.55643 632.37731 210.33889 18651.42727
11.85000 -4160.47872 14.00238 416.02438 155.78508 126.00441 19378.85665
11.95000 -4124.82735 12.06165 59.11379 183.59280 170.50369 15989.35954
12.05000 -4100.73389 8.92961 -500.91841 330.80424 189.57180 17374.72598
12.15000 -4051.30747 11.40867 313.45043 146.74003 151.67310 14889.41658
12.25000 -4022.98076 10.47367 -290.13770 320.19915 205.14693 16444.63622
12.35000 -3997.13778 17.32009 34.16548 202.29006 169.80559 15083.08833
12.45000 -3958.56057 16.69597 66.29260 148.84574 132.98255 13558.56652
12.55000 -3939.55003 11.07675 179.07251 159.36688 141.99792 13777.15381
12.65000 -3907.83947 15.21408 -107.92011 142.37024 104.05227 13411.31775
12.75000 -3880.90742 6.63053 -774.40668 133.98554 114.79633 13421.57701
12.85000 -3863.42123 11.50262 -1138.92062 407.21840 347.34093 12022.92584
12.95000 -3821.96020 13.91537 -870.09214 157.95051 121.68358 17285.82818
13.05000 -3791.15504 18.19250 -642.02864 289.52151 352.17424 12756.55567
13.15000 -3756.08714 9.65374 586.58879 183.55384 127.40551 12511.85332
13.25000 -3736.62680 10.83812 -149.53616 139.08414 127.23938 12583.19275
13.35000 -3699.33725 8.90087 37.34703 221.33657 217.09402 13209.57218
13.45000 -3686.33332 13.14939 419.47615 110.36809 118.36949 14871.87020
13.55000 -3654.57768 14.41732 51.97734 103.03198 86.54904 14940.72106
13.65000 -3618.58972 14.81190 -675.02254 114.26241 102.30474 20028.52571
13.75000 -3598.55442 7.17408 -643.83418 157.39476 138.28620 17747.78098
13.85000 -3565.85003 2.02619 286.90464 123.27690 88.54442 15098.48833
13.95000 -3554.06812 14.87228 -19.93009 149.08560 128.16833 10621.44246
14.05000 -3524.78238 21.43949 -968.47167 175.68022 189.02649 14722.80715
14.15000 -3489.74380 1.27916 246.72370 196.07523 173.46818 10166.41565
14.25000 -3461.50104 -13.94046 184.37944 318.33403 360.12182 10001.86265
14.35000 -3449.17048 8.00648 -481.60219 130.54464 120.00258 8160.53739
14.45000 -3419.23707 18.35989 -389.23872 157.13553 182.21406 10200.31462
14.55000 -3394.11773 7.58942 -20.05228 131.86346 119.86495 10719.08737
14.65000 -3373.30476 14.93528 -83.57052 100.59011 106.36992 10138.00528
14.75000 -3339.65502 7.84874 -271.76706 87.73445 139.58052 11619.59030
14.85000 -3322.25050 11.06933 -354.02243 166.85136 90.80118 10690.61744
14.95000 -3297.43689 11.69262 -639.44183 81.10256 100.05486 15323.23084
15.05000 -3273.92133 10.96501 -251.47521 128.09599 96.67183 11487.93092
15.15000 -3249.65791 9.17705 1043.58740 89.05409 127.48275 11686.79375
15.25000 -3236.93968 6.64765 119.06808 94.92053 93.09080 11560.81577
15.35000 -3203.26806 -15.79169 -48.97686 233.02971 559.16906 7753.43752
15.45000 -3193.98575 9.48922 -630.36566 127.24011 89.71848 8832.95916
15.55000 -3169.62266 16.34628 272.23793 106.59666 152.68943 7377.17101
15.65000 -3153.98035 7.97833 -462.06124 88.06308 95.56204 6436.21595
15.75000 -3128.63183 17.02174 -520.00298 98.98959 120.03870 8744.45461
15.85000 -3111.64893 19.51136 182.17304 410.12054 379.87495 9272.72983
15.95000 -3097.68220 4.31833 -475.64832 106.36815 124.77011 6240.01371
16.05000 -3073.14129 10.95949 -67.95281 85.46871 90.16619 7301.45510
16.15000 -3047.36787 -6.34070 -162.89593 141.69086 186.59233 7668.84154
16.25000 -3027.78466 17.66915 -493.59826 134.33091 98.84420 9585.25760
16.35000 -3006.89884 1.55461 -137.92355 87.87162 98.52232 5003.07868
16.45000 -2993.56676 7.70886 -697.76530 85.66804 94.08352 8777.46250
16.55000 -2937.30989 17.03644 -400.74328 635.32416 235.68360 8164.54660
16.65000 -2944.64412 10.78255 -597.69302 95.14968 93.69700 8912.88262
16.75000 -2953.36245 -2.38676 -288.74874 292.26909 210.35625 8713.33594
16.85000 -2914.91302 9.12039 655.80221 113.80979 73.29869 8449.88479
16.95000 -2899.85904 6.36604 346.69815 111.04116 94.67214 7592.11085
17.05000 -2888.57108 10.55980 -238.04459 105.98324 159.40372 5902.85706
17.15000 -2860.17262 1.29718 -92.55212 78.99114 69.89112 7659.33610
17.25000 -2852.60596 -17.33195 473.48807 271.41499 360.51812 7478.49001
17.35000 -2826.55203 5.72897 -737.40688 66.20069 70.63998 7730.00775
17.45000 -2806.44164 0.64189 131.84859 88.49876 66.92851 6147.77906
17.55000 -2787.92809 4.49251 -374.15595 72.69918 62.42162 4966.60313
17.65000 -2778.65098 13.61886 89.68302 68.83953 63.45938 5154.05993
17.75000 -2755.55858 3.32635 -551.91173 59.98245 62.97851 6406.77167
17.85000 -2751.34876 7.00992 -18.14318 69.31225 60.52904 9007.78018
17.95000 -2717.15862 -2.58599 160.90851 180.33320 118.79000 5616.23596
18.05000 -2708.56261 8.77420 -131.83507 107.84600 100.44813 8817.30896
18.15000 -2684.68230 2.75124 -384.28750 68.23465 54.02699 5182.71747
18.25000 -2668.82472 11.69931 251.50164 72.08625 172.98099 5060.47470
18.35000 -2657.80126 -1.20982 -364.94633 105.59124 96.99686 5505.96695
18.45000 -2639.84442 -3.07709 176.54302 96.82341 80.14085 3994.41011
18.55000 -2630.09645 9.15540 -22.92337 117.16411 84.20339 3132.37145
18.65000 -2610.81243 8.32157 52.88526 76.95814 98.73271 5635.42809
18.75000 -2598.58432 -1.49079 -406.83355 94.33504 73.85744 6514.63123
18.85000 -2573.50225 -2.00154 438.92497 127.46905 85.77047 5586.32899
18.95000 -2569.54679 4.13970 720.86286 123.94863 103.26215 8279.14314
19.05000 -2539.44419 -1.06073 -97.14183 65.22846 65.22937 6563.18570
19.15000 -2526.48379 7.20607 340.96973 60.12113 56.86143 5129.44395
19.25000 -2538.71383 -12.67038 -630.65741 288.73934 238.24089 4019.30129
19.35000 -2499.96695 -0.12698 -246.68957 67.82471 652.44561 4565.09241
19.45000 -2479.16823 9.75692 -161.70312 98.97236 117.31526 4832.19632
19.55000 -2465.51084 2.41425 80.34331 66.45529 114.00701 6728.00157
19.65000 -2447.99465 1.98903 -105.11371 69.15930 63.34873 3472.90421
19.75000 -2433.36275 19.79444 433.59561 116.22346 140.19232 5800.60737
19.85000 -2420.67086 3.49630 -91.24599 88.81764 63.47198 5170.83942
19.95000 -2413.55312 0.84618 -65.88411 61.61238 58.09829 5711.57678
