0.05000 11140.34264
0.15000 21581.90354
0.25000 25152.22843
0.35000 24616.05686
0.45000 21823.87518
0.55000 19772.40534
0.65000 17756.87616
0.75000 15939.89333
0.85000 14534.20725
0.95000 13337.95522
1.05000 12408.98610
1.15000 11251.61873
1.25000 10755.20303
1.35000 10015.00885
1.45000 9375.73986
1.55000 8688.31405
1.65000 8182.06670
1.75000 7914.13795
1.85000 7436.84498
1.95000 7105.96805
2.05000 6782.24879
2.15000 6205.38969
2.25000 6031.14160
2.35000 5721.16105
2.45000 5639.80201
2.55000 5282.09720
2.65000 5055.36440
2.75000 4888.19398
2.85000 4706.39505
2.95000 4435.12685
3.05000 4353.93601
3.15000 4166.91279
3.25000 4093.67207
3.35000 3844.49043
3.45000 3864.97881
3.55000 3753.98943
3.65000 3483.51925
3.75000 3451.52150
3.85000 3288.93110
3.95000 3130.66868
4.05000 3065.29953
4.15000 3018.81539
4.25000 2843.04792
4.35000 2829.64557
4.45000 2737.05177
4.55000 2622.10493
4.65000 2554.66216
4.75000 2517.18852
4.85000 2468.10628
4.95000 2438.61157
5.05000 2280.70495
5.15000 2221.17434
5.25000 2204.35036
5.35000 2201.63086
5.45000 2073.19314
5.55000 2058.29395
5.65000 2001.42460
5.75000 1920.11712
5.85000 1908.10964
5.95000 1859.27900
6.05000 1777.01496
6.15000 1728.05651
6.25000 1702.53561
6.35000 1636.99478
6.45000 1601.93308
6.55000 1588.22606
6.65000 1595.26756
6.75000 1547.62896
6.85000 1463.19090
6.95000 1436.81162
7.05000 1401.24136
7.15000 1408.60187
7.25000 1349.61078
7.35000 1319.80987
7.45000 1284.46245
7.55000 1253.44758
7.65000 1202.83968
7.75000 1218.57194
7.85000 1146.04945
7.95000 1111.05442
8.05000 1076.66760
8.15000 1092.78509
8.25000 1044.48583
8.35000 1040.69207
8.45000 1005.76196
8.55000 1035.72798
8.65000 1006.81651
8.75000 934.32511
8.85000 917.69859
8.95000 908.91658
9.05000 861.00309
9.15000 856.71384
9.25000 877.24817
9.35000 813.73863
9.45000 801.30255
9.55000 805.36904
9.65000 783.17120
9.75000 777.82409
9.85000 755.63081
9.95000 769.33105
10.05000 747.11469
10.15000 714.80717
10.25000 689.17851
10.35000 670.47345
10.45000 676.98807
10.55000 648.07988
10.65000 638.16329
10.75000 619.23300
10.85000 597.85798
10.95000 585.11325
11.05000 599.19534
11.15000 560.28783
11.25000 549.36893
11.35000 531.67025
11.45000 535.80185
11.55000 562.99206
11.65000 521.60651
11.75000 518.02903
11.85000 526.04336
11.95000 495.54558
12.05000 476.47530
12.15000 507.98266
12.25000 503.26077
12.35000 477.87575
12.45000 467.52136
12.55000 454.01034
12.65000 434.36625
12.75000 447.17110
12.85000 436.33398
12.95000 419.53025
13.05000 437.32769
13.15000 393.94204
13.25000 386.72613
13.35000 397.39735
13.45000 398.98681
13.55000 387.55646
13.65000 369.45303
13.75000 379.46580
13.85000 369.80900
13.95000 369.59695
14.05000 365.29523
14.15000 361.26925
14.25000 334.93798
14.35000 332.02029
14.45000 326.82095
14.55000 317.59963
14.65000 321.55617
14.75000 311.73874
14.85000 323.16841
14.95000 281.75568
15.05000 308.08990
15.15000 298.35366
15.25000 276.32267
15.35000 277.76754
15.45000 277.85528
15.55000 271.12332
15.65000 264.19443
15.75000 259.59371
15.85000 269.74515
15.95000 253.33617
16.05000 258.78942
16.15000 247.80485
16.25000 255.16419
16.35000 242.15398
16.45000 224.20377
16.55000 250.17630
16.65000 252.14290
16.75000 223.85365
16.85000 224.29618
16.95000 232.97897
17.05000 208.91387
17.15000 207.28337
17.25000 210.29459
17.35000 214.54458
17.45000 197.28024
17.55000 197.55968
17.65000 214.63927
17.75000 200.80401
17.85000 194.55389
17.95000 189.22690
18.05000 186.71250
18.15000 191.60364
18.25000 188.33770
18.35000 200.26386
18.45000 177.43294
18.55000 183.68073
18.65000 188.49852
18.75000 167.84427
18.85000 174.00197
18.95000 163.91625
19.05000 161.65182
19.15000 162.99311
19.25000 161.24298
19.35000 162.29134
19.45000 144.43615
19.55000 170.90649
19.65000 151.96298
19.75000 149.52175
19.85000 156.06657
19.95000 148.09213
