0.125 0.000 -0.001 0.001
0.375 0.015 -0.013 0.064
0.625 0.020 0.008 0.253
0.875 0.023 0.009 0.618
1.125 0.015 -0.065 1.320
1.375 -0.034 -0.031 2.136
1.625 0.009 -0.076 3.248
1.875 0.029 -0.248 4.093
2.125 0.005 -0.204 4.689
2.375 0.087 -0.213 5.279
2.625 0.015 -0.089 5.870
2.875 -0.104 -0.171 6.239
3.125 0.011 -0.201 6.560
3.375 -0.060 -0.275 6.819
3.625 -0.136 -0.191 7.088
3.875 -0.099 -0.196 6.954
4.125 -0.083 -0.200 7.276
4.375 0.062 -0.217 7.364
4.625 0.046 -0.272 7.361
4.875 0.008 -0.241 7.463
5.125 -0.032 -0.254 7.184
5.375 0.037 -0.324 7.341
5.625 -0.101 -0.222 7.768
5.875 -0.115 -0.120 7.429
6.125 -0.063 -0.311 7.691
6.375 -0.010 -0.198 7.792
6.625 -0.008 -0.355 7.835
6.875 -0.017 -0.102 8.054
7.125 -0.075 -0.238 8.423
7.375 0.070 -0.160 9.150
7.625 0.033 -0.305 9.722
7.875 0.040 -0.337 9.467
8.125 -0.157 -0.223 10.229
8.375 -0.079 -0.114 11.148
8.625 -0.126 -0.164 12.308
8.875 -0.044 -0.287 13.122
9.125 -0.113 -0.169 14.422
9.375 0.016 -0.277 15.020
9.625 -0.103 -0.326 17.232
9.875 -0.161 -0.220 17.902
10.125 -0.299 -0.201 19.326
10.375 -0.367 -0.388 21.262
10.625 -0.314 -0.375 22.141
10.875 -0.152 -0.396 22.935
11.125 -0.417 -0.355 23.706
11.375 -0.432 -0.357 23.981
11.625 -0.393 -0.481 22.887
11.875 -0.508 -0.413 22.454
12.125 -0.532 -0.420 21.467
12.375 -0.469 -0.462 20.278
12.625 -0.536 -0.402 19.842
12.875 -0.442 -0.451 19.247
13.125 -0.504 -0.396 18.329
13.375 -0.460 -0.521 18.756
13.625 -0.430 -0.572 18.274
13.875 -0.429 -0.581 17.499
14.125 -0.358 -0.615 16.742
14.375 -0.354 -0.619 16.419
14.625 -0.238 -0.541 15.982
14.875 -0.230 -0.547 15.223
15.125 -0.261 -0.567 14.481
15.375 -0.173 -0.609 14.900
15.625 -0.160 -0.511 13.244
15.875 -0.146 -0.497 12.265
16.125 -0.016 -0.475 12.482
16.375 -0.079 -0.508 12.321
16.625 -0.066 -0.401 11.271
16.875 0.036 -0.417 10.493
17.125 0.012 -0.344 10.182
17.375 0.021 -0.374 10.890
17.625 0.041 -0.361 10.276
17.875 0.022 -0.281 9.688
18.125 0.003 -0.201 8.991
18.375 -0.047 -0.209 9.147
18.625 -0.011 -0.172 8.656
18.875 0.006 -0.115 7.955
19.125 -0.021 -0.144 7.806
19.375 0.028 -0.065 6.934
19.625 -0.023 -0.036 7.206
19.875 -0.063 -0.084 6.668
