0.05000 -872.69543 -201.65322 71.32357 1272.80014 1071.44320 1161.59451
0.15000 -1748.66608 -11.21206 -227.13206 1358.31786 1285.43092 2421.38239
0.25000 -2674.60643 7.09398 -162.95369 1145.97755 925.66597 3588.49298
0.35000 -3364.88941 63.38463 157.07910 1039.82032 856.39368 4464.53690
0.45000 -3972.79061 59.13349 -17.04130 1183.74432 723.32191 5350.03344
0.55000 -4469.28006 83.27284 157.24727 1344.07936 719.39170 5645.45087
0.65000 -4870.09174 67.24601 66.46335 1462.15920 684.24990 5885.81666
0.75000 -5175.33506 53.95552 -84.06800 1480.53029 636.63036 6066.56827
0.85000 -5431.47353 64.59837 -66.55080 1435.29332 619.60039 6172.84411
0.95000 -5601.98236 85.42891 -89.75565 1441.11712 594.14373 6413.33312
1.05000 -5843.28697 79.60137 -137.47506 1390.51058 563.99726 6310.54909
1.15000 -6006.18494 76.49184 4.41729 1373.88563 541.18258 6229.83261
1.25000 -6083.21178 75.45350 -31.51877 1380.67706 516.12551 6227.67187
1.35000 -6201.18786 80.14806 -82.62658 1339.35069 503.20321 6150.12068
1.45000 -6328.17042 72.31079 -39.91502 1265.78043 506.37177 5996.49799
1.55000 -6398.02587 53.03888 -111.84587 1266.28569 491.53203 5864.88851
1.65000 -6468.36994 76.85706 64.95286 1214.97662 491.45227 5710.04570
1.75000 -6547.39359 80.47163 -1.47841 1166.12689 492.91588 5553.69491
1.85000 -6626.54153 81.89043 -10.78760 1101.21128 487.51730 5388.86855
1.95000 -6698.88659 81.12500 -39.16981 1079.44805 484.26292 5289.29159
2.05000 -6770.61257 69.59561 -101.31544 1038.32128 476.68159 5129.70821
2.15000 -6772.49385 73.43606 56.62694 987.18662 481.12609 5078.99582
2.25000 -6851.22904 73.97653 -12.24703 910.17230 469.01639 4850.42118
2.35000 -6839.12157 65.88486 -21.67758 920.83092 468.15610 4782.79945
2.45000 -6868.12883 80.95859 -125.53864 888.37440 461.80262 4641.41948
2.55000 -6908.71400 80.67415 -37.65595 852.12350 452.57078 4554.82538
2.65000 -6928.97571 81.77837 -18.80247 825.20925 442.33239 4413.80185
2.75000 -6937.30316 80.40977 22.77090 791.99397 433.38017 4313.09511
2.85000 -6951.57618 80.85243 43.37061 747.84506 433.31291 4193.33599
2.95000 -6952.45942 68.28710 -54.76575 734.93642 431.82846 4068.91090
3.05000 -6937.63951 69.42772 -24.46559 718.46059 420.46159 4018.76363
3.15000 -6937.79976 62.61671 24.47948 694.03162 415.57544 3881.12809
3.25000 -6919.26280 63.65172 32.53448 670.96050 410.11257 3810.28539
3.35000 -6918.89700 61.79907 -5.50412 619.62519 402.57468 3711.48538
3.45000 -6897.94215 70.27272 15.86901 595.20727 396.15018 3592.17393
3.55000 -6912.77570 68.88627 6.02412 562.54421 385.67998 3471.93684
3.65000 -6867.61472 62.95946 9.63781 588.26683 369.01682 3441.19281
3.75000 -6835.62647 54.33369 -32.33833 538.48026 364.47618 3340.88520
3.85000 -6796.05869 61.76917 -74.52887 536.32294 348.09919 3296.02195
3.95000 -6781.64462 62.65020 21.55557 488.06481 345.12081 3168.13409
4.05000 -6735.66059 63.93435 -126.80140 482.89213 334.56965 3138.89747
4.15000 -6720.25766 63.11099 -0.58685 476.36579 320.05401 3031.90281
4.25000 -6721.65751 67.60268 2.13701 485.12178 318.34548 2951.04568
4.35000 -6689.85336 61.95320 -26.70363 476.86476 300.11046 2885.59012
4.45000 -6660.32399 63.84150 40.46676 473.69946 291.02315 2817.04255
4.55000 -6648.58654 57.31661 -30.01305 456.78896 279.59128 2744.30018
4.65000 -6627.93316 54.68395 47.08464 446.33615 270.05035 2673.28160
4.75000 -6588.00233 54.79774 -49.41909 444.99472 258.49466 2608.70222
4.85000 -6551.78349 51.52848 29.61958 432.56367 248.28437 2573.99936
4.95000 -6503.40107 60.47832 11.57455 410.32914 243.51510 2512.31344
5.05000 -6470.39987 52.44865 -7.91387 404.16624 230.00131 2437.44089
5.15000 -6438.41444 54.64649 -32.80573 387.85250 230.41775 2380.33456
5.25000 -6412.98201 52.66704 -9.42130 395.92939 217.53020 2327.82827
5.35000 -6370.98299 45.46443 -20.17038 374.01504 209.82227 2279.31632
5.45000 -6336.27900 49.09953 1.28867 368.62532 205.11917 2231.61218
5.55000 -6300.77623 48.21350 -31.64458 369.15327 200.42903 2163.82700
5.65000 -6257.66003 51.58134 8.18471 357.27448 190.26873 2118.68062
5.75000 -6213.60558 54.03504 65.44692 350.08220 189.96124 2077.61028
5.85000 -6175.91160 48.91698 -0.77358 345.38892 181.00930 2028.31705
5.95000 -6127.91460 47.49616 68.29805 339.23893 174.06861 1986.97400
6.05000 -6089.65986 45.07637 10.01923 316.18944 174.06717 1921.78622
6.15000 -6035.01168 39.25205 14.44987 316.36739 172.39910 1887.70452
6.25000 -5993.56454 45.33191 26.65177 308.73579 164.29690 1851.95264
6.35000 -5956.14304 44.54393 81.19649 294.98536 162.28529 1817.28571
6.45000 -5904.51015 43.38988 71.31243 292.59916 161.69973 1775.43951
6.55000 -5864.96955 41.68208 35.24845 277.50642 154.60384 1730.48991
6.65000 -5826.44587 40.14596 76.99137 263.62883 151.35451 1694.01980
6.75000 -5783.46254 41.98840 33.58326 259.65223 149.57949 1645.55757
6.85000 -5739.65135 37.35257 1.50249 248.09894 144.26696 1608.10708
6.95000 -5691.21797 38.89426 45.84694 244.65266 141.86601 1588.44275
7.05000 -5651.32784 35.03616 44.35750 244.22577 143.35854 1548.48123
7.15000 -5614.28423 35.24699 41.21452 240.93448 137.54628 1515.37155
7.25000 -5571.37460 36.43262 42.26308 234.48434 139.23681 1499.18863
7.35000 -5540.86778 30.23367 11.42109 210.64761 128.77043 1449.46860
7.45000 -5504.47350 34.23540 62.53694 208.47581 129.01299 1422.16802
7.55000 -5454.92283 29.31307 33.80947 226.83612 133.11942 1415.30305
7.65000 -5425.97631 34.54976 49.01186 199.56303 127.27558 1358.06158
7.75000 -5395.51967 31.52124 32.16139 200.75775 134.40588 1334.26890
7.85000 -5364.55366 31.91956 39.73840 195.32972 129.13294 1298.26325
7.95000 -5334.87393 30.67349 46.23136 197.78683 124.78368 1273.20490
8.05000 -5292.29378 31.15424 22.47437 196.20570 114.56667 1265.26446
8.15000 -5257.02470 31.57058 44.37057 190.45780 114.69331 1205.54020
8.25000 -5217.31583 28.08717 32.25530 189.64629 115.99483 1199.73044
8.35000 -5182.26044 29.89306 38.78730 188.65948 117.04582 1179.00975
8.45000 -5146.08587 30.00840 71.31578 187.85156 113.51982 1148.88676
8.55000 -5105.37267 29.92464 10.75827 193.95487 109.67000 1137.37208
8.65000 -5074.19096 26.84371 -11.03692 180.89320 112.59105 1100.42268
8.75000 -5042.06263 28.18328 15.66483 180.87070 109.16769 1071.57673
8.85000 -5004.57279 25.60806 28.39234 174.69934 107.68529 1053.47197
8.95000 -4965.38183 26.77382 19.49380 171.36513 105.21946 1043.10661
9.05000 -4924.99452 28.75041 -14.83528 175.15408 108.05544 1020.36560
9.15000 -4887.47586 28.41211 7.67750 168.48925 107.39983 991.66771
9.25000 -4851.37696 29.07502 -5.08709 158.44364 102.75745 978.82323
9.35000 -4818.04427 24.28410 6.76561 160.94754 102.50266 958.51862
9.45000 -4775.58711 25.57019 0.90236 159.19525 108.08657 943.31843
9.55000 -4741.03360 25.46770 -11.81970 156.15610 98.86019 918.43620
9.65000 -4703.49477 24.32651 -23.85767 147.53304 98.22078 896.70861
9.75000 -4669.46817 25.63595 -13.08443 145.64787 98.26740 875.93420
9.85000 -4629.10386 23.89257 -19.02359 140.78021 94.31086 851.00418
9.95000 -4597.27775 22.61502 -45.25100 138.54299 91.68708 840.46999
10.05000 -4555.13676 23.80133 6.15843 139.57220 96.38814 823.53158
10.15000 -4513.41231 22.90141 -26.93670 137.93795 86.55822 828.25934
10.25000 -4477.67687 19.00685 -15.35506 126.89411 85.74797 780.21552
10.35000 -4441.53008 20.19338 -21.63225 127.55103 85.99305 765.14081
10.45000 -4406.16739 20.38620 -21.85337 123.96637 89.90454 766.25271
10.55000 -4370.18640 22.97576 -12.71965 124.66147 85.06944 736.64067
10.65000 -4339.57991 21.22803 -37.73802 122.81545 94.08883 720.53130
10.75000 -4302.84502 19.57582 -19.72502 124.18881 85.69854 710.38637
10.85000 -4267.30323 20.17771 -10.44712 116.04708 81.95190 691.88629
10.95000 -4235.99086 19.53922 -8.97610 124.97288 80.39459 681.43352
11.05000 -4198.56936 19.24057 -31.09231 110.40977 74.23418 676.35756
11.15000 -4165.29281 19.71708 -20.74405 108.33562 78.42074 660.61787
11.25000 -4129.14827 22.66202 4.15107 109.28092 86.57520 652.02656
11.35000 -4100.42094 18.18313 -8.95779 106.14621 78.33577 632.29923
11.45000 -4069.47522 20.00695 -18.07222 103.33601 84.06695 616.93464
11.55000 -4040.00659 16.67760 -6.57911 102.44929 84.06167 590.35959
11.65000 -4005.59775 17.67208 4.02148 100.14322 77.29393 588.84741
11.75000 -3972.99693 18.15756 16.77848 99.02198 81.18581 581.01819
11.85000 -3947.89900 16.94482 1.70993 104.12960 81.21260 562.22772
11.95000 -3920.61849 15.87884 0.30210 103.13673 81.00830 560.69022
12.05000 -3894.66140 16.20952 -7.49397 99.40808 79.68512 549.00305
12.15000 -3866.96440 16.84373 -4.65752 97.44983 84.02279 537.55320
12.25000 -3841.39814 16.99911 13.92021 90.68174 76.24118 525.06066
12.35000 -3815.41079 14.05770 0.51842 95.65929 76.18595 514.52522
12.45000 -3785.75229 13.81959 16.80519 96.20479 81.84017 508.41625
12.55000 -3759.27434 13.55367 10.67084 90.22102 75.30391 495.54050
12.65000 -3734.95825 14.97932 -2.50377 92.76588 75.84075 481.28014
12.75000 -3707.44113 16.86467 8.76134 99.38545 76.39659 484.52392
12.85000 -3678.52320 17.26562 -6.11965 89.65293 73.11450 474.89311
12.95000 -3653.89587 14.41181 5.03635 87.10720 68.61100 473.06937
13.05000 -3628.67352 13.08106 14.55152 82.63179 73.78967 455.03881
13.15000 -3604.85163 13.40697 -2.60578 84.53127 64.43017 451.02358
13.25000 -3574.88054 16.51378 11.58732 79.97276 69.34607 445.25358
13.35000 -3549.62149 11.68608 -3.26260 85.71982 67.27957 429.12598
13.45000 -3525.67746 14.55726 -8.74877 82.18129 73.36255 421.42034
13.55000 -3503.00586 15.73601 3.99529 83.23461 68.47650 412.37027
13.65000 -3477.05228 11.29503 -14.64202 79.87781 72.42312 409.90554
13.75000 -3455.90446 12.81192 -9.60669 74.85680 68.56817 400.62383
13.85000 -3435.42512 12.97561 13.96806 80.73393 66.29034 389.81853
13.95000 -3409.32554 11.54291 8.04577 80.54784 64.48457 388.66171
14.05000 -3383.34548 14.40324 -9.06492 80.16885 77.10598 382.55025
14.15000 -3363.16399 11.74209 -11.83207 75.27304 61.55990 373.66104
14.25000 -3339.48283 13.26247 16.22231 75.57534 62.81827 372.61320
14.35000 -3317.78412 11.74791 8.28932 77.61187 59.19952 364.06486
14.45000 -3298.14008 11.54444 6.43884 76.30449 57.97190 353.93156
14.55000 -3274.00592 13.84383 -8.15556 70.30040 60.28242 353.50900
14.65000 -3254.17882 12.66722 9.48565 65.90254 62.52150 344.49490
14.75000 -3229.23531 8.49632 -14.92339 71.90401 58.03483 341.24171
14.85000 -3210.64077 10.85530 -2.06877 74.79812 57.99644 333.91699
14.95000 -3192.03421 12.54435 7.05779 74.29352 59.75490 324.96402
15.05000 -3167.71002 12.86142 8.51349 63.56232 58.05516 319.90754
15.15000 -3147.10329 9.23537 -26.83128 65.28575 57.90005 314.62178
15.25000 -3127.28352 10.77648 5.48383 76.66001 70.36491 306.95508
15.35000 -3108.24198 12.04069 2.67547 60.51746 53.02925 305.80435
15.45000 -3086.18100 9.23754 4.38526 69.11845 51.62235 300.93596
15.55000 -3064.56698 10.60687 -6.35308 71.09854 58.50404 298.57371
15.65000 -3045.00219 8.13890 5.03084 62.13089 55.01288 290.70944
15.75000 -3025.47723 7.80371 -19.95635 69.15126 60.95492 291.61615
15.85000 -3006.35670 11.93538 -8.32978 58.32890 54.02501 274.39180
15.95000 -2985.68449 11.32554 -4.71182 58.93816 53.11134 287.54686
16.05000 -2969.64611 7.31282 5.10127 49.88734 49.21928 260.87022
16.15000 -2948.22667 9.94832 -11.26860 58.16662 49.05265 269.03984
16.25000 -2934.41700 11.04295 5.04243 60.48471 48.51693 268.13588
16.35000 -2910.72172 8.47878 -1.79286 63.79591 51.32452 257.88818
16.45000 -2893.43517 8.58281 -11.40151 56.23504 52.62870 246.17920
16.55000 -2875.38694 9.30343 -4.63197 60.78596 51.41806 246.16296
16.65000 -2855.10422 10.00172 -22.90919 55.79923 56.42069 257.18734
16.75000 -2840.35880 10.77000 3.76604 49.08149 50.31347 243.84648
16.85000 -2819.10817 6.87205 -23.29046 54.90096 46.99783 245.06391
16.95000 -2800.30801 11.02154 -6.71080 53.98223 49.51327 222.26759
17.05000 -2782.00271 9.15402 -10.76356 53.61759 39.08548 229.51314
17.15000 -2764.73385 7.87743 -13.00851 61.56129 53.49971 218.37442
17.25000 -2744.89311 8.11473 -6.60493 49.87354 41.05465 223.51783
17.35000 -2728.29852 6.78278 -8.71476 54.76882 47.22643 219.37713
17.45000 -2710.99399 7.50707 -1.60690 41.01295 46.75206 208.46778
17.55000 -2694.27270 8.47303 4.46629 49.49370 50.27197 218.80407
17.65000 -2679.99685 7.72283 -10.76945 51.69699 46.04329 200.89428
17.75000 -2662.20862 9.78991 -6.70948 54.67346 48.83051 205.44320
17.85000 -2648.61198 6.37016 -7.54471 53.45413 51.33851 197.33023
17.95000 -2629.47393 7.26036 -11.54627 54.00065 42.13602 186.61290
18.05000 -2612.08312 7.18721 -7.30740 48.10398 43.70216 190.94862
18.15000 -2594.68673 7.07355 9.18581 47.65649 41.19251 199.57649
18.25000 -2579.62371 6.62877 0.63512 54.95813 45.11919 188.74781
18.35000 -2563.84239 6.06347 -4.06765 47.02106 46.83331 186.14793
18.45000 -2548.95193 9.47550 -8.49720 59.20818 46.79706 181.69017
18.55000 -2530.15053 7.76864 1.53093 54.52333 32.52835 177.11700
18.65000 -2522.20328 9.20300 0.68798 51.94690 68.51140 169.84015
18.75000 -2505.71984 6.29084 -10.20148 48.94490 48.13922 178.68031
18.85000 -2489.07514 7.93177 -1.40451 43.05583 55.22331 172.41863
18.95000 -2470.67559 8.55566 5.86532 48.41298 37.65247 165.77088
19.05000 -2461.40518 7.19087 -8.15394 44.51440 45.94572 162.18797
19.15000 -2445.42074 9.10079 5.37706 39.71956 42.66285 161.76741
19.25000 -2432.24627 6.23588 -1.88158 46.07520 37.90025 160.72695
19.35000 -2418.26536 6.62444 -0.69164 32.50582 29.77426 152.60440
19.45000 -2403.93690 3.72750 -4.17748 60.29742 49.84653 169.27959
19.55000 -2392.58038 11.24054 -4.05897 42.01347 62.64434 149.00058
19.65000 -2377.48539 4.29279 -4.12128 41.13538 33.74594 158.90071
19.75000 -2365.66087 5.94406 3.63926 42.39501 45.39208 149.85782
19.85000 -2350.12937 8.26943 -4.83230 39.94018 53.76422 152.36247
19.95000 -2337.02824 5.15514 3.02921 51.58941 42.23461 153.37461
