0.05000 -1737.41228 45.81117 2329.94010 1967.56682 1363.77365 2213.68265
0.15000 -2622.39047 58.33888 252.29949 2357.36338 2444.60262 4805.27274
0.25000 -4083.34974 125.56019 380.87723 10421.70208 6511.01556 6668.40310
0.35000 -5705.24095 -3.90422 -186.04793 2997.63285 3721.64365 8220.79754
0.45000 -6393.40826 34.11054 -73.86775 2672.92851 1762.52333 8340.36890
0.55000 -6799.88010 8.81681 -214.83246 2867.55694 2202.84963 8661.40121
0.65000 -7036.74350 13.21364 -92.77858 2384.31988 1780.86278 8484.57302
0.75000 -7378.94969 64.73273 -228.43429 2236.02766 2288.20151 8581.70388
0.85000 -7629.56420 20.41878 -133.65202 2253.46139 1457.57765 8242.31344
0.95000 -7739.75350 52.46691 -12.91516 5132.04896 2430.27443 8435.14937
1.05000 -7932.12801 48.62669 60.73178 1979.04184 1660.96132 7767.90521
1.15000 -8084.92697 42.12803 31.61760 2112.14231 1239.20913 7505.78036
1.25000 -8110.15284 9.04126 17.73490 2073.99679 1425.96652 7346.79994
1.35000 -8190.82238 30.63784 -84.65216 1525.88521 1154.76428 6923.50622
1.45000 -8328.15670 28.52740 -63.91090 1811.51727 1096.55620 6729.27269
1.55000 -8386.73003 33.40351 -59.65628 1863.99902 1144.41848 6562.46445
1.65000 -8511.85353 31.80794 -124.00990 1383.11646 967.10660 6228.41358
1.75000 -8529.50232 34.85131 -23.08809 1332.63989 1537.47812 6061.48758
1.85000 -8578.81193 10.04626 -40.82699 1365.11323 1090.86984 5864.85552
1.95000 -8626.07936 24.76151 -70.95695 1390.71477 1010.86149 5607.36715
2.05000 -8664.84090 7.81540 -55.63416 1286.95144 1174.54011 5370.40906
2.15000 -8668.06280 16.57073 51.84529 1239.99211 1254.65033 5212.99990
2.25000 -8691.18261 31.45966 -51.17295 1264.53857 1002.48975 5052.44427
2.35000 -8639.35247 20.69238 -40.84134 1230.82282 810.01622 4898.77916
2.45000 -8582.27796 5.82980 -44.70736 1014.08130 806.02701 4712.64132
2.55000 -8569.95688 8.20651 -29.29550 1208.43894 846.83174 4554.60279
2.65000 -8537.40193 10.03401 -35.63784 1158.53261 716.96904 4372.78625
2.75000 -8513.50111 -5.25256 86.83999 986.67505 841.47625 4244.15203
2.85000 -8473.14146 6.78962 1.76266 1123.10319 831.02820 4158.99752
2.95000 -8439.41620 21.96208 70.25102 962.60507 1118.51608 3977.94164
3.05000 -8355.69147 12.61027 111.82982 862.30545 672.18156 3821.27168
3.15000 -8302.02922 6.27225 63.46262 1077.18341 1043.77840 3684.25056
3.25000 -8213.07810 5.15404 -3.85019 743.10643 587.21541 3585.50388
3.35000 -8135.28404 11.94770 -3.77437 741.82769 619.25356 3458.58830
3.45000 -8067.85760 4.38357 28.22279 754.81345 856.66226 3365.31889
3.55000 -7997.35673 -1.42026 21.69360 802.76849 781.90819 3241.61651
3.65000 -7924.75048 13.20453 58.15964 669.16664 576.08237 3197.84908
3.75000 -7836.55844 -1.11311 59.90813 773.39417 805.93302 3031.25909
3.85000 -7760.73513 3.82561 74.77611 925.82299 533.02688 3035.55257
3.95000 -7677.19259 4.50553 32.52508 620.94696 576.37627 2837.99023
4.05000 -7616.06797 16.43542 42.76593 675.25118 583.07217 2773.38931
4.15000 -7552.69328 10.33618 30.55926 595.19418 478.90508 2661.04175
4.25000 -7497.12243 4.96598 54.91247 646.75333 558.27770 2610.65269
4.35000 -7441.80439 11.83986 0.80455 2137.42362 935.88164 2503.00949
4.45000 -7349.92255 6.62205 25.94812 629.93600 749.66657 2468.92331
4.55000 -7286.46211 7.74609 21.37030 630.09950 478.40343 2405.71561
4.65000 -7234.00650 8.48143 -21.72895 684.81384 1051.03449 2790.31305
4.75000 -7175.99613 6.44585 -12.91081 540.77020 565.28354 2225.09942
4.85000 -7053.46654 -31.49665 4.34858 3932.57884 3983.09393 2292.46811
4.95000 -7044.73924 10.77733 -24.50217 464.66317 435.41222 2113.45982
5.05000 -6979.08206 6.70502 40.17569 576.70374 412.89541 2324.09092
5.15000 -6922.16149 10.72934 48.14865 425.50962 392.83114 2004.14869
5.25000 -6852.34064 6.43054 47.58261 409.78208 398.68986 1960.97304
5.35000 -6789.90647 2.30024 -39.10767 726.45549 628.24309 1872.64226
5.45000 -6727.66306 5.20015 24.51024 487.66170 334.53610 1838.25831
5.55000 -6665.08951 3.74811 33.58566 663.76699 660.84880 1834.16059
5.65000 -6594.75182 5.06570 22.03336 402.70807 328.07418 1730.79578
5.75000 -6533.41126 5.50572 18.56734 607.25096 368.03903 1764.92387
5.85000 -6484.21051 0.11476 45.55038 366.18932 455.87414 1625.79990
5.95000 -6421.97754 4.37566 30.63516 438.85345 399.48663 1590.94112
6.05000 -6364.15746 13.54112 25.21846 798.37984 595.70781 1616.62520
6.15000 -6309.82174 1.31549 34.28262 777.24169 1133.74281 1530.04086
6.25000 -6261.18057 3.17045 11.58397 451.31466 462.88360 1473.64901
6.35000 -6204.39825 17.05189 28.58642 543.36945 779.77674 1622.52444
6.45000 -6148.19225 6.27933 28.33177 469.85038 437.03841 1423.69520
6.55000 -6098.44868 3.57429 31.31660 313.71656 328.88348 1353.79853
6.65000 -6034.61711 7.63977 22.57088 431.27077 324.24378 1319.70507
6.75000 -5986.72682 -7.66715 65.93721 310.87388 930.40661 2972.79874
6.85000 -5927.73943 5.59636 12.78141 371.79156 367.28002 1273.64350
6.95000 -5891.71427 6.54778 13.56473 262.53464 301.69108 1208.16195
7.05000 -5846.87446 6.20569 -16.25010 332.90092 284.04027 1169.06983
7.15000 -5783.67742 2.53254 -18.24845 262.81154 293.04381 1120.65178
7.25000 -5736.28416 9.42189 16.66047 343.60648 212.66105 1108.55556
7.35000 -5674.85798 5.31531 -37.01831 334.49850 498.14587 1563.30023
7.45000 -5617.50782 4.53703 10.35085 333.02321 215.13594 1064.59229
7.55000 -5565.08933 -1.39563 -7.96025 466.23971 375.71248 1007.32209
7.65000 -5506.36172 4.75068 -22.62662 243.82164 268.13857 984.43233
7.75000 -5451.67211 5.50550 12.39207 244.96683 207.92636 948.50969
7.85000 -5395.40989 -2.56824 12.12149 285.05502 257.05241 933.64999
7.95000 -5333.57396 8.48923 -24.61199 258.14113 256.51972 933.13692
8.05000 -5285.21686 1.50550 -22.59726 190.60866 167.03484 870.84591
8.15000 -5218.68853 4.00235 -5.05583 224.46166 226.16821 913.93135
8.25000 -5158.60305 -0.86646 -25.58038 279.17624 210.36652 841.23322
8.35000 -5104.53730 8.51275 11.60191 249.25340 294.84740 794.46515
8.45000 -5060.45167 0.99393 -14.85215 299.48131 193.49910 831.50613
8.55000 -4983.77825 3.26634 -28.67057 1554.13438 210.75732 895.91773
8.65000 -4965.02549 4.88388 -34.21477 751.82894 217.77179 829.47447
8.75000 -4910.83432 0.26083 -10.68646 283.26031 227.84947 742.29573
8.85000 -4872.32150 -0.68899 -16.91518 214.73345 269.65841 713.52996
8.95000 -4830.16444 3.13398 -27.90889 160.52929 178.27285 693.21222
9.05000 -4793.28912 4.78898 -10.59563 251.00156 243.80384 703.54913
9.15000 -4747.96002 5.30768 -4.51091 212.52893 136.07407 661.36761
9.25000 -4713.80014 6.71232 12.05915 205.41614 185.82949 635.14354
9.35000 -4674.88238 2.93719 8.39831 162.53234 162.82726 623.52323
9.45000 -4636.78936 3.57664 2.35117 185.23769 170.01439 628.99677
9.55000 -4605.75637 -8.07377 2.31722 393.19335 670.81420 629.47508
9.65000 -4556.37776 -14.39953 16.29757 157.80542 1002.08594 717.34291
9.75000 -4505.57527 0.88097 13.59718 167.02221 170.73394 577.50517
9.85000 -4444.92061 -20.15488 12.32596 1140.50740 1269.66658 571.81574
9.95000 -4416.91848 2.89450 13.45038 280.74662 214.63766 538.99030
10.05000 -4377.06041 7.59132 3.87931 167.62354 118.90975 514.82013
10.15000 -4329.48221 5.00375 2.83166 124.23081 109.03952 507.64771
10.25000 -4285.52131 1.11887 2.35719 155.79786 136.22546 508.39189
10.35000 -4235.50990 4.43823 -1.45216 253.36323 466.35459 532.22999
10.45000 -4194.89754 1.21058 12.39878 116.62677 126.60189 469.22270
10.55000 -4152.35887 1.46281 -3.53021 124.82798 98.73634 456.80961
10.65000 -4113.64223 2.22617 -15.06207 272.41902 161.78287 459.48208
10.75000 -4075.91533 6.87153 -7.80448 152.58011 162.99365 440.15439
10.85000 -4032.03082 5.65120 9.25745 146.08696 144.07662 424.28761
10.95000 -3998.96848 6.15400 9.64740 124.29901 100.70963 405.29299
11.05000 -3968.01476 7.64482 -26.10730 120.54666 122.33869 404.18355
11.15000 -3939.37714 4.37128 -7.75766 145.83839 118.69116 394.60977
11.25000 -3905.91660 1.80120 12.68623 225.32061 127.56162 392.76451
11.35000 -3875.84896 3.66514 4.58145 223.38001 168.80174 415.06335
11.45000 -3847.00242 0.17913 19.75219 129.68426 218.00734 380.12996
11.55000 -3822.73587 0.90046 10.02239 98.71099 102.37572 363.21405
11.65000 -3795.59744 1.69243 3.55666 97.17690 99.53454 349.92633
11.75000 -3774.85590 3.18578 13.15996 116.56078 137.49928 337.45919
11.85000 -3747.39527 0.50534 0.08385 162.98848 117.53761 386.09355
11.95000 -3725.30746 2.85556 27.00351 113.03940 110.37690 408.24260
12.05000 -3706.76064 -3.16778 12.13463 287.84367 228.29665 349.63674
12.15000 -3664.95014 2.13152 -1.42506 136.06320 101.68710 342.56108
12.25000 -3633.05581 6.20082 14.63441 277.37123 717.21607 884.40754
12.35000 -3611.47834 -0.00065 -8.24763 111.46599 142.04311 311.33013
12.45000 -3580.42226 2.89214 -12.51845 98.06465 83.11605 307.88970
12.55000 -3555.02658 -11.70462 2.02944 186.69473 288.35931 337.12256
12.65000 -3527.15667 -0.28576 -35.98758 93.47846 203.21067 332.64558
12.75000 -3498.71040 0.59688 -40.05229 81.28035 115.41355 292.17742
12.85000 -3472.35722 0.04349 -57.79075 282.55642 192.98611 292.90846
12.95000 -3445.02533 5.87198 -34.67526 96.35101 111.76027 273.13222
13.05000 -3365.58859 11.09564 25.50423 1768.71491 226.96096 2237.15901
13.15000 -3386.49342 -1.96633 -48.30217 270.59099 273.75121 316.66185
13.25000 -3370.33526 6.19174 -40.55234 70.27787 133.34125 253.99023
13.35000 -3337.40383 3.56559 -53.86154 76.72935 91.00311 237.81055
13.45000 -3318.90078 0.72506 -43.70034 73.07814 71.62236 241.59882
13.55000 -3291.82406 2.19524 -48.15147 66.73658 63.15857 228.70801
13.65000 -3257.57387 1.27431 -49.49471 119.84963 97.67267 265.71021
13.75000 -3234.27355 3.13353 -45.13059 89.09257 81.93700 244.98781
13.85000 -3220.16895 2.08408 -42.20781 113.07180 63.73183 234.09879
13.95000 -3188.26671 0.56743 -40.45899 82.41525 73.71004 246.23984
14.05000 -3160.00182 2.16835 -26.72666 98.13775 87.58289 262.69687
14.15000 -3143.46776 -3.94547 -22.65916 101.60171 134.33598 233.32656
14.25000 -3107.13718 2.01732 -38.00585 88.65070 54.35017 191.79118
14.35000 -3088.70093 4.06988 -23.61454 67.46711 62.78641 209.59076
14.45000 -3063.66864 3.18659 -16.40316 84.39117 71.18087 190.40187
14.55000 -3041.46794 2.52210 -26.46001 67.47459 47.44297 185.23016
14.65000 -3025.93139 2.63557 -10.24684 59.33560 61.24071 172.22635
14.75000 -3004.20231 4.72203 -3.59997 86.15919 122.71386 228.82961
14.85000 -2981.92647 2.70558 -15.10053 83.43675 62.94210 173.34286
14.95000 -2959.37591 -2.94641 -6.12571 53.15063 62.95264 167.03274
15.05000 -2941.43997 4.21076 -4.54774 69.06828 74.07773 161.40563
15.15000 -2922.10368 -0.06366 -3.10437 109.46504 63.86503 170.46264
15.25000 -2889.91139 2.16622 -11.00899 161.51800 83.78309 184.53965
15.35000 -2883.45395 5.29679 -14.29911 75.28932 70.97897 162.62850
15.45000 -2859.64834 3.38156 -7.10656 64.24403 61.35049 159.47937
15.55000 -2837.88977 8.91099 -8.09227 78.41270 76.20087 161.24053
15.65000 -2821.83240 0.84965 -2.29554 44.73526 47.96992 148.66948
15.75000 -2801.81217 2.62865 -14.06650 52.38599 48.16278 155.04845
15.85000 -2781.84918 10.67324 -7.94985 142.40106 133.07030 159.66842
15.95000 -2760.90396 3.97917 3.50452 85.20338 58.60648 158.27683
16.05000 -2747.09579 -3.18818 5.59219 68.81863 64.03969 140.97570
16.15000 -2729.98069 0.46542 -9.85008 59.97738 65.66647 138.28428
16.25000 -2715.71395 1.93095 -1.56163 44.78181 43.88695 128.69053
16.35000 -2693.96271 0.74774 -0.56211 134.48075 37.43550 159.99048
16.45000 -2677.14079 -3.49581 -11.29150 43.68385 61.83363 136.63577
16.55000 -2666.78211 1.63265 -21.54752 192.15163 135.61567 133.97103
16.65000 -2643.76778 5.33844 -17.34747 99.36955 150.56914 203.28609
16.75000 -2623.54008 4.36889 -2.92566 61.49796 63.90523 121.16596
16.85000 -2608.18555 2.70533 -8.96303 50.53737 41.74537 116.91365
16.95000 -2593.32500 3.18317 -13.23402 42.06156 37.30836 116.22591
17.05000 -2574.08899 -5.19824 -26.61487 48.35936 71.76586 135.84025
17.15000 -2558.97182 -1.74460 -29.78766 42.03619 46.28240 113.21604
17.25000 -2546.38065 4.36786 -10.03385 88.80539 61.65818 135.54416
17.35000 -2526.58925 -1.55998 -16.96301 91.71981 77.32343 142.24855
17.45000 -2516.95940 -4.67695 -22.89968 40.25227 39.60190 105.20821
17.55000 -2498.36547 -1.23884 -23.18001 43.03123 90.78416 120.58512
17.65000 -2483.81753 -2.92551 -22.95501 40.76988 47.86604 124.51182
17.75000 -2471.54941 1.51264 -13.19834 41.00398 83.88328 113.83365
17.85000 -2453.89370 -1.61523 -20.57384 266.36396 211.83460 172.34861
17.95000 -2440.81508 -1.40109 -16.06837 37.24213 54.66244 100.88289
18.05000 -2433.75964 4.91371 -14.72261 143.59952 147.67311 120.23148
18.15000 -2412.50204 -6.66172 -4.06411 112.50384 122.13692 155.48946
18.25000 -2393.55434 1.76262 -21.45251 42.36670 75.83778 106.54829
18.35000 -2381.95996 -14.89527 -20.53948 66.54842 293.54860 137.44009
18.45000 -2366.11790 1.13870 -12.94629 45.96443 46.03835 107.22446
18.55000 -2360.81885 0.32156 -15.15295 41.96025 38.55795 96.64686
18.65000 -2345.99458 -0.61263 -11.93610 40.19061 43.44356 107.22382
18.75000 -2330.74150 -1.19395 -12.07109 57.07103 67.80318 95.18000
18.85000 -2280.28842 28.24113 -18.16442 494.44427 653.54438 589.23591
18.95000 -2304.74264 3.83235 -15.49843 29.78948 33.86167 90.70267
19.05000 -2290.01806 1.42754 7.53129 49.44599 39.39826 118.70770
19.15000 -2282.74438 5.17935 -8.58451 45.85583 92.93432 82.18511
19.25000 -2265.19881 -1.24949 -3.08101 30.14479 31.58858 80.51570
19.35000 -2252.81705 0.17132 -3.12936 32.37018 43.40287 77.26046
19.45000 -2240.28568 1.63906 -9.19266 32.59579 29.09706 82.32864
19.55000 -2228.68372 -2.05651 -13.31079 33.00736 35.05470 76.75212
19.65000 -2208.36028 7.27803 -1.66865 141.40366 87.97826 137.61162
19.75000 -2203.04334 -3.56800 -13.93389 49.41244 43.89967 76.18780
19.85000 -2179.03638 -8.36829 -7.55225 94.65249 51.54937 85.77538
19.95000 -2200.83128 3.50799 -17.64281 328.24758 78.90271 241.45788
