0.05000 18300.40227
0.15000 20783.79399
0.25000 19483.94250
0.35000 17313.54663
0.45000 15397.86389
0.55000 14227.39240
0.65000 12993.56574
0.75000 12021.65213
0.85000 10970.63275
0.95000 10191.61268
1.05000 9563.27840
1.15000 8912.17507
1.25000 8401.90659
1.35000 7984.47845
1.45000 7375.01595
1.55000 7182.90379
1.65000 6792.13738
1.75000 6444.76957
1.85000 6090.80807
1.95000 5926.27486
2.05000 5784.97248
2.15000 5439.32101
2.25000 5198.29938
2.35000 4983.46329
2.45000 4811.27442
2.55000 4611.17310
2.65000 4415.81334
2.75000 4268.19922
2.85000 4064.06805
2.95000 3920.09673
3.05000 3771.67784
3.15000 3618.19978
3.25000 3455.62480
3.35000 3294.91973
3.45000 3257.22524
3.55000 3142.06426
3.65000 3005.08834
3.75000 2923.20615
3.85000 2854.94189
3.95000 2812.28450
4.05000 2721.52834
4.15000 2622.76310
4.25000 2561.99833
4.35000 2522.63607
4.45000 2452.47553
4.55000 2394.16384
4.65000 2326.79051
4.75000 2247.53187
4.85000 2188.34364
4.95000 2136.57493
5.05000 2089.30482
5.15000 2053.00887
5.25000 2017.75350
5.35000 1925.06727
5.45000 1904.30482
5.55000 1857.37130
5.65000 1803.67899
5.75000 1771.92280
5.85000 1716.74811
5.95000 1682.74611
6.05000 1636.76213
6.15000 1609.64423
6.25000 1570.82779
6.35000 1537.03166
6.45000 1500.73855
6.55000 1488.34866
6.65000 1440.36868
6.75000 1399.88820
6.85000 1373.76845
6.95000 1347.00709
7.05000 1310.28428
7.15000 1314.40351
7.25000 1249.81926
7.35000 1231.40071
7.45000 1204.73287
7.55000 1193.44111
7.65000 1163.25578
7.75000 1155.70161
7.85000 1117.50767
7.95000 1091.55443
8.05000 1061.91257
8.15000 1039.18034
8.25000 1026.01067
8.35000 1007.18933
8.45000 974.66490
8.55000 967.22416
8.65000 949.68646
8.75000 931.90576
8.85000 904.31655
8.95000 878.59591
9.05000 857.79060
9.15000 856.25846
9.25000 826.86588
9.35000 811.41691
9.45000 810.58517
9.55000 806.37677
9.65000 776.41991
9.75000 757.12257
9.85000 734.53583
9.95000 717.58755
10.05000 708.23156
10.15000 691.16781
10.25000 699.31237
10.35000 669.25808
10.45000 666.89445
10.55000 646.21597
10.65000 627.29708
10.75000 637.82148
10.85000 615.31005
10.95000 600.78197
11.05000 605.16210
11.15000 586.20747
11.25000 570.07012
11.35000 554.95349
11.45000 547.47920
11.55000 550.39550
11.65000 523.01564
11.75000 538.74702
11.85000 512.85942
11.95000 507.40681
12.05000 483.46959
12.15000 477.42721
12.25000 476.50437
12.35000 458.21700
12.45000 452.19389
12.55000 461.16872
12.65000 431.63128
12.75000 429.67435
12.85000 409.14970
12.95000 402.31624
13.05000 395.68188
13.15000 388.35030
13.25000 380.73880
13.35000 376.76256
13.45000 366.19691
13.55000 361.84014
13.65000 350.94433
13.75000 351.08136
13.85000 338.34115
13.95000 339.74464
14.05000 326.53466
14.15000 322.94727
14.25000 321.16171
14.35000 305.36033
14.45000 299.27179
14.55000 307.13353
14.65000 291.52831
14.75000 290.59718
14.85000 280.60303
14.95000 288.18215
15.05000 279.65385
15.15000 264.60960
15.25000 248.95676
15.35000 254.53482
15.45000 256.61558
15.55000 248.75939
15.65000 246.14474
15.75000 244.59191
15.85000 232.38694
15.95000 240.73450
16.05000 233.90571
16.15000 218.41564
16.25000 219.96145
16.35000 220.92607
16.45000 219.31682
16.55000 215.14438
16.65000 207.96823
16.75000 202.77381
16.85000 206.77627
16.95000 200.63886
17.05000 189.18656
17.15000 183.35936
17.25000 188.46305
17.35000 184.78243
17.45000 183.93012
17.55000 182.73946
17.65000 174.71470
17.75000 168.93249
17.85000 182.57532
17.95000 167.86688
18.05000 166.70154
18.15000 165.82224
18.25000 162.74299
18.35000 153.71881
18.45000 154.27951
18.55000 155.40355
18.65000 158.49507
18.75000 152.32193
18.85000 148.51683
18.95000 141.33734
19.05000 143.14211
19.15000 136.67985
19.25000 130.53985
19.35000 134.14132
19.45000 134.55882
19.55000 124.55507
19.65000 128.43082
19.75000 131.08469
19.85000 121.93973
19.95000 120.81444
