0.12500 0.01259
0.37500 0.07022
0.62500 0.13415
0.87500 0.20882
1.12500 0.25980
1.37500 0.30144
1.62500 0.33544
1.87500 0.37379
2.12500 0.40083
2.37500 0.43183
2.62500 0.47138
2.87500 0.49369
3.12500 0.53133
3.37500 0.55445
3.62500 0.55498
3.87500 0.57294
4.12500 0.56160
4.37500 0.52913
4.62500 0.46637
4.87500 0.39014
5.12500 0.32245
5.37500 0.23272
5.62500 0.18280
5.87500 0.17553
6.12500 0.18234
6.37500 0.19366
6.62500 0.21650
6.87500 0.21884
7.12500 0.20882
7.37500 0.20234
7.62500 0.17216
7.87500 0.14378
8.12500 0.10929
8.37500 0.10202
8.62500 0.07608
8.87500 0.08218
9.12500 0.07437
9.37500 0.06896
9.62500 0.04288
9.87500 0.03971
10.12500 0.03840
10.37500 0.03429
10.62500 0.04079
10.87500 0.05628
11.12500 0.07584
11.37500 0.05723
11.62500 0.02904
11.87500 0.05019
12.12500 0.03645
12.37500 0.04660
12.62500 0.08105
12.87500 0.06630
13.12500 0.09333
13.37500 0.13419
13.62500 0.14288
13.87500 0.16357
14.12500 0.18264
14.37500 0.21768
14.62500 0.20894
14.87500 0.21525
