0.05000 1385.47714
0.15000 2424.14334
0.25000 3508.76926
0.35000 4238.57094
0.45000 4714.41130
0.55000 5257.42660
0.65000 5375.77282
0.75000 5552.99650
0.85000 5640.48024
0.95000 5603.17286
1.05000 5477.56431
1.15000 5428.42044
1.25000 5367.64502
1.35000 5248.42929
1.45000 5079.17226
1.55000 4957.01539
1.65000 4877.71782
1.75000 4683.18359
1.85000 4578.07716
1.95000 4511.54565
2.05000 4391.42726
2.15000 4220.73376
2.25000 4186.98249
2.35000 3970.04138
2.45000 3911.97315
2.55000 3824.23530
2.65000 3682.74576
2.75000 3589.45708
2.85000 3497.74919
2.95000 3422.74418
3.05000 3331.76207
3.15000 3243.17143
3.25000 3110.45451
3.35000 3058.45062
3.45000 2974.76221
3.55000 2889.74076
3.65000 2809.46990
3.75000 2708.05352
3.85000 2667.37233
3.95000 2578.21337
4.05000 2483.82905
4.15000 2410.63450
4.25000 2365.74212
4.35000 2304.07592
4.45000 2269.69932
4.55000 2192.25875
4.65000 2144.56427
4.75000 2043.60469
4.85000 2002.18995
4.95000 1976.39828
5.05000 1932.28056
5.15000 1880.31613
5.25000 1861.67589
5.35000 1766.84756
5.45000 1747.59299
5.55000 1696.40604
5.65000 1664.02865
5.75000 1632.43995
5.85000 1590.99962
5.95000 1532.94357
6.05000 1498.27875
6.15000 1490.50521
6.25000 1454.23341
6.35000 1387.66774
6.45000 1371.58470
6.55000 1350.58207
6.65000 1321.86380
6.75000 1274.52775
6.85000 1250.12881
6.95000 1225.74132
7.05000 1176.75063
7.15000 1162.77411
7.25000 1122.22369
7.35000 1113.31854
7.45000 1087.61279
7.55000 1053.14892
7.65000 1040.30906
7.75000 1014.26703
7.85000 981.05332
7.95000 964.41252
8.05000 919.65039
8.15000 907.12942
8.25000 899.62734
8.35000 873.26743
8.45000 864.66726
8.55000 841.64440
8.65000 832.39681
8.75000 802.39315
8.85000 779.46040
8.95000 769.05789
9.05000 737.88640
9.15000 746.71049
9.25000 716.48923
9.35000 706.11652
9.45000 685.43242
9.55000 662.87234
9.65000 644.31047
9.75000 638.79459
9.85000 635.43189
9.95000 600.16080
10.05000 591.32976
10.15000 577.28508
10.25000 562.36499
10.35000 549.54849
10.45000 548.76529
10.55000 522.92614
10.65000 506.75091
10.75000 500.90533
10.85000 487.44131
10.95000 480.48434
11.05000 460.56762
11.15000 463.21671
11.25000 444.02109
11.35000 433.99788
11.45000 427.04275
11.55000 415.15893
11.65000 408.69871
11.75000 410.02015
11.85000 391.70914
11.95000 380.60834
12.05000 365.29540
12.15000 365.99667
12.25000 370.46856
12.35000 351.71100
12.45000 338.89614
12.55000 346.54603
12.65000 335.52497
12.75000 320.78106
12.85000 317.95275
12.95000 302.01129
13.05000 301.60855
13.15000 298.70190
13.25000 290.03077
13.35000 280.64016
13.45000 278.33646
13.55000 267.37734
13.65000 272.67445
13.75000 267.49676
13.85000 266.99516
13.95000 247.58128
14.05000 245.75524
14.15000 244.88491
14.25000 235.47698
14.35000 235.06015
14.45000 230.03283
14.55000 222.68302
14.65000 220.17278
14.75000 214.19913
14.85000 210.88405
14.95000 209.11419
15.05000 202.92705
15.15000 197.11605
15.25000 196.63604
15.35000 193.67451
15.45000 189.48795
15.55000 183.80440
15.65000 183.97402
15.75000 174.56043
15.85000 168.01041
15.95000 179.75332
16.05000 166.74445
16.15000 164.70220
16.25000 156.50415
16.35000 154.52209
16.45000 157.86783
16.55000 160.11961
16.65000 148.48456
16.75000 146.89691
16.85000 148.49946
16.95000 144.39974
17.05000 145.11494
17.15000 137.84175
17.25000 143.93618
17.35000 131.54162
17.45000 129.29478
17.55000 125.03364
17.65000 124.71946
17.75000 128.21867
17.85000 127.02254
17.95000 121.25316
18.05000 118.40151
18.15000 122.35924
18.25000 113.16689
18.35000 112.13013
18.45000 107.74182
18.55000 115.20586
18.65000 111.44439
18.75000 105.50785
18.85000 106.02508
18.95000 98.51468
19.05000 95.03253
19.15000 97.74561
19.25000 91.49723
19.35000 92.32610
19.45000 94.96996
19.55000 86.01564
19.65000 92.21342
19.75000 87.76889
19.85000 87.57182
19.95000 84.49625
