0.12500 0.01781
0.37500 0.01605
0.62500 0.01887
0.87500 0.01740
1.12500 0.02612
1.37500 0.03795
1.62500 0.02487
1.87500 0.02873
2.12500 0.02776
2.37500 0.02540
2.62500 0.02592
2.87500 0.01688
3.12500 0.01616
3.37500 0.00865
3.62500 0.01279
3.87500 0.01577
4.12500 0.01639
4.37500 0.00954
4.62500 0.01702
4.87500 0.03077
5.12500 0.04299
5.37500 0.04057
5.62500 0.03371
5.87500 0.01986
6.12500 0.01836
6.37500 0.01116
6.62500 0.01417
6.87500 0.01945
7.12500 0.01230
7.37500 0.00528
7.62500 0.01264
7.87500 0.00935
8.12500 0.01797
8.37500 0.03359
8.62500 0.02521
8.87500 0.02675
9.12500 0.00378
9.37500 0.00506
9.62500 0.01095
9.87500 0.02534
10.12500 0.01205
10.37500 0.01633
10.62500 0.00766
10.87500 0.02068
11.12500 0.01702
11.37500 0.01216
11.62500 0.00371
11.87500 0.00864
12.12500 0.01595
12.37500 0.00262
12.62500 0.01805
12.87500 0.01810
13.12500 0.03317
13.37500 0.02713
13.62500 0.02577
13.87500 0.01531
14.12500 0.01476
14.37500 0.02605
14.62500 0.02754
14.87500 0.02549
