0.05000 -3041.38690 296.10647 103090.05271 2795.17442 3835.03063 369856.25136
0.15000 -5823.10167 114.46460 -29263.05161 2599.19129 2476.45959 451395.15448
0.25000 -7598.53898 -18.37972 3808.73633 2560.92123 2178.33244 368136.12880
0.35000 -8690.36630 -57.33946 -323.12832 2394.20781 2163.98213 313223.32944
0.45000 -9317.14163 55.12683 505.98689 1982.53279 1904.22352 324018.95164
0.55000 -9636.88587 -0.57709 7396.79692 1815.85387 1611.54802 324989.26509
0.65000 -9788.26775 72.91196 -825.07486 1891.58059 1666.56543 336406.31546
0.75000 -9897.23548 90.36278 1665.89305 1919.77731 1833.13072 309880.16925
0.85000 -10069.19201 55.93327 2600.65090 1744.98249 1701.32924 273271.36537
0.95000 -9994.65501 10.70864 -2894.92774 1671.78991 1643.03357 276884.21966
1.05000 -9968.50583 38.10913 4424.33953 1574.97463 1555.24066 293830.91198
1.15000 -9868.80573 30.87707 354.41536 1463.42847 1586.31326 233871.01643
1.25000 -9777.01743 43.34467 2427.48378 1440.39780 1518.14078 260972.45311
1.35000 -9636.77732 67.71753 -1599.36338 1336.46217 1433.63526 230617.02076
1.45000 -9463.56775 76.23324 -2312.32699 1276.68196 1480.74027 213461.13750
1.55000 -9272.91942 48.95056 263.92897 1235.85191 1477.27009 205341.73256
1.65000 -9174.40561 47.37647 -554.59733 1232.58389 1494.50603 195459.23938
1.75000 -9009.25032 31.96568 744.81785 1163.63782 1421.97182 196994.25538
1.85000 -8864.43656 53.09457 -1663.43716 1073.57279 1419.62104 168645.41824
1.95000 -8723.84142 74.96024 441.09316 1125.89206 1385.30232 156438.62794
2.05000 -8605.04367 68.30550 873.59568 1022.07882 1369.24385 160928.89485
2.15000 -8504.83386 78.77915 473.09009 1003.22251 1398.16622 160313.23590
2.25000 -8418.97729 70.97964 -414.73040 936.00364 1406.26771 145777.20010
2.35000 -8349.98770 82.22902 4224.44538 905.48895 1364.54399 140275.21040
2.45000 -8254.22090 97.54845 2874.37207 865.00955 1376.12682 136080.61398
2.55000 -8143.93984 90.34804 311.38095 864.55989 1361.20168 131680.12253
2.65000 -8056.18201 57.59820 853.54848 794.29466 1319.16215 122920.50608
2.75000 -7981.62194 76.25708 -723.05256 797.41374 1282.14188 123235.88847
2.85000 -7916.58891 74.77723 -1526.53752 744.90036 1255.92036 111137.65153
2.95000 -7819.82152 77.99617 1022.96847 735.20762 1242.68015 108891.30149
3.05000 -7756.81672 55.24134 1044.47760 683.43172 1217.28203 118849.08062
3.15000 -7696.48865 47.29467 -324.89891 713.61397 1191.11162 103383.08361
3.25000 -7637.47701 75.34831 2383.61779 709.06956 1204.54110 105834.25784
3.35000 -7579.87058 55.94451 -186.24604 667.49241 1195.52078 93323.47708
3.45000 -7537.35261 47.07683 1953.38416 576.90206 1134.78518 88285.95843
3.55000 -7473.27708 48.30700 432.62354 589.12870 1155.85656 99507.99784
3.65000 -7428.85420 48.17258 121.63235 649.58959 1121.22769 81112.65424
3.75000 -7378.64390 56.48657 -51.31492 559.52285 1103.27646 89166.20620
3.85000 -7337.09952 37.17588 195.74821 510.68778 1056.86742 84073.55174
3.95000 -7289.03942 22.25127 -696.67130 553.61973 1040.89292 78636.21502
4.05000 -7249.95710 43.51002 1295.62496 520.90788 1051.44961 75616.49688
4.15000 -7180.25634 16.92400 39.07282 523.06699 1010.40225 69931.60379
4.25000 -7153.39578 28.49171 268.55705 569.62806 994.75315 73608.42282
4.35000 -7126.35111 26.71419 1205.24269 530.24506 944.20814 77441.16260
4.45000 -7103.71351 7.06542 -476.54680 490.48427 939.33096 70117.45155
4.55000 -7086.61490 13.48319 1703.51635 536.76424 918.32509 58700.83007
4.65000 -7069.35672 12.23645 -602.00993 557.59620 865.00339 89759.91767
4.75000 -7050.51567 10.51799 -117.30804 548.45498 852.03324 51721.18566
4.85000 -7017.68539 0.10866 -317.48550 509.17098 873.94858 57660.55925
4.95000 -6997.04943 -11.76825 0.92997 560.20878 799.44146 52794.20942
5.05000 -6956.92295 -4.89749 723.31941 504.46760 756.21990 48425.65976
5.15000 -6931.62035 -1.97616 320.66212 517.89534 750.55577 44599.36892
5.25000 -6907.19149 -11.01808 338.68110 500.46733 704.69761 44745.58488
5.35000 -6872.31383 -5.86286 274.12911 544.58158 705.63264 49371.25784
5.45000 -6830.62724 -15.84347 1585.96408 530.10436 661.03639 62551.20646
5.55000 -6808.16705 -10.36832 316.50447 517.35928 641.21386 45320.89049
5.65000 -6773.95904 1.96290 720.69059 568.10025 628.31863 38077.45011
5.75000 -6736.08205 -11.98408 271.72661 540.19869 601.23162 39486.25758
5.85000 -6710.43405 -14.29204 104.82625 528.58562 566.09381 46143.40000
5.95000 -6668.07386 -15.21803 1994.48072 541.70840 532.87288 41147.58849
6.05000 -6617.46252 -7.93073 495.19744 556.30872 541.64767 37143.57120
6.15000 -6566.20496 -12.80422 -29.52946 528.17796 497.90468 37380.71920
6.25000 -6497.62226 0.79780 533.30229 510.33860 474.41423 33407.24402
6.35000 -6440.93016 3.54476 583.80606 520.86391 478.43970 34881.13558
6.45000 -6388.97507 11.79701 715.36667 493.75135 452.74974 38481.62563
6.55000 -6329.14472 5.18993 1438.96781 513.54319 429.10071 62564.13562
6.65000 -6272.55467 11.94607 42.97217 454.91974 406.50413 32795.30316
6.75000 -6204.59504 15.15283 240.81959 438.39561 376.13858 29303.86371
6.85000 -6149.18124 12.63039 -13.06941 414.93910 359.25910 29532.17588
6.95000 -6087.27785 19.81322 339.93883 406.23230 353.67096 26419.57748
7.05000 -6023.25881 15.94632 281.80370 398.09833 354.65448 23818.46024
7.15000 -5950.17180 13.95853 -1139.87782 385.29893 346.04466 44189.47638
7.25000 -5888.50333 14.06574 56.62315 401.90079 329.09448 22585.15368
7.35000 -5828.20300 25.63843 -285.06771 354.51436 357.69358 23928.28846
7.45000 -5768.33027 16.91699 -257.68032 337.32471 295.63859 23077.29964
7.55000 -5712.84583 17.22043 599.01052 419.71872 328.38958 22752.76740
7.65000 -5659.96818 17.63371 68.93321 318.14304 281.54928 22045.82664
7.75000 -5616.33515 24.71281 110.56258 318.69055 297.88483 20075.26449
7.85000 -5553.70602 22.63643 90.06797 313.56896 257.31878 21274.38646
7.95000 -5513.19247 25.37198 802.11023 297.52629 250.41142 22142.85526
8.05000 -5459.07941 20.22391 236.90495 306.61373 277.78625 28113.91581
8.15000 -5402.64968 12.60424 513.00561 307.18963 375.45454 27403.26878
8.25000 -5357.75193 22.55901 571.37419 260.58273 225.34224 32400.09146
8.35000 -5306.47801 25.84341 495.23121 278.00691 306.97663 18907.57701
8.45000 -5257.13846 21.69543 126.45886 295.52112 245.84799 16519.30654
8.55000 -5209.78224 20.50033 -225.08337 242.76555 235.39469 19593.79043
8.65000 -5160.11133 25.33724 -378.65780 246.10419 214.10103 16671.53103
8.75000 -5105.53353 20.49122 -534.13453 273.00823 218.32099 16409.02431
8.85000 -5055.54159 17.06089 246.47648 264.04590 193.07838 17659.91599
8.95000 -5014.69768 20.48018 825.48376 239.13056 212.37154 42228.42325
9.05000 -4959.07805 15.10033 293.67274 233.23816 209.46035 13928.94983
9.15000 -4908.36409 19.67610 217.60083 245.45717 188.19647 13314.84152
9.25000 -4870.99961 16.04086 117.55765 372.31447 253.00953 15581.29258
9.35000 -4812.95157 20.66129 43.89111 238.86225 215.79770 13712.83840
9.45000 -4773.31067 18.00044 -156.27312 238.49225 195.24968 12962.94933
9.55000 -4727.75207 18.54482 2.21584 219.13510 207.09118 12798.56824
9.65000 -4676.48706 20.30789 -151.09465 200.03264 162.01051 12380.39328
9.75000 -4639.84128 22.42117 -208.05579 206.52860 177.43271 12405.63138
9.85000 -4591.77735 21.57854 74.60184 203.54105 150.66978 10356.37661
9.95000 -4557.55416 13.75250 -322.18932 222.91023 189.60847 20535.39409
10.05000 -4522.27774 16.14355 -184.14278 181.84760 169.16817 9959.23492
10.15000 -4483.81871 15.21984 -242.48502 204.19516 171.12562 29738.69704
10.25000 -4440.60094 16.43739 92.91080 190.58894 153.94733 9020.68869
10.35000 -4405.70397 18.68242 256.04981 184.41568 160.48915 12951.04612
10.45000 -4370.94980 15.51497 -102.84245 173.50392 126.31511 9333.22113
10.55000 -4328.50446 12.85610 -479.78946 173.32747 162.46864 8901.73199
10.65000 -4294.91367 18.43068 -410.86784 159.68829 121.36274 8613.79715
10.75000 -4249.18261 12.19851 16.74326 182.18270 169.47254 8196.54057
10.85000 -4221.42341 19.63147 -115.20524 157.02977 154.07041 8358.13817
10.95000 -4181.06996 13.26140 145.58936 160.81529 126.35504 6868.29779
11.05000 -4138.55368 15.54157 -341.03268 186.51396 140.65083 7756.90976
11.15000 -4107.19328 17.39091 164.98953 155.19854 124.86326 7019.50238
11.25000 -4077.07447 14.22612 173.40657 179.49922 198.28973 8558.16264
11.35000 -4036.21692 12.01721 -66.15868 198.05640 180.59162 8528.76556
11.45000 -4005.83894 11.27060 278.84852 177.20821 150.77885 7859.72191
11.55000 -3963.40807 17.94899 -2.00746 154.83399 136.12756 6721.59749
11.65000 -3932.66764 14.32427 153.41616 151.03510 98.38239 7557.76923
11.75000 -3900.93469 12.71287 28.75091 142.31320 160.70289 6565.43293
11.85000 -3862.72133 15.66959 50.69517 155.15021 120.39410 5424.14712
11.95000 -3828.35042 11.63395 -216.32191 158.99088 89.73822 7180.10390
12.05000 -3789.97449 8.22553 309.06544 179.56036 96.47566 9788.03757
12.15000 -3761.33019 10.76368 504.13022 139.04564 125.40902 14751.81698
12.25000 -3725.77928 17.80164 300.96035 147.12809 333.18880 6597.49867
12.35000 -3700.70869 13.99628 -56.72993 111.75141 110.74989 5837.78662
12.45000 -3675.48755 8.26285 64.83029 139.61720 92.96053 5341.25052
12.55000 -3647.95854 7.42144 -124.66299 106.43327 109.82997 5438.77214
12.65000 -3623.90376 11.86520 105.28317 112.99489 106.93411 5794.97274
12.75000 -3597.91463 10.30859 -114.11295 115.42128 106.01178 4928.37301
12.85000 -3569.97251 9.50871 89.26001 153.67946 104.54688 6410.68398
12.95000 -3545.70130 11.52729 -19.88506 180.68523 152.45745 6070.51861
13.05000 -3524.98653 8.31417 -180.45716 172.53038 139.99804 5303.33416
13.15000 -3499.81232 8.02470 -93.77958 104.26721 80.49528 4601.11207
13.25000 -3475.88663 1.67947 13.50154 133.05722 96.51300 4365.42890
13.35000 -3450.81908 6.63799 -17.11232 85.46271 71.92293 4590.35729
13.45000 -3428.65888 7.64611 -27.63024 134.03660 128.65031 4907.55368
13.55000 -3397.70563 7.04488 79.02158 127.87866 90.09824 4105.49875
13.65000 -3369.23903 4.62154 22.11810 116.80429 91.78282 4147.80883
13.75000 -3347.70105 11.06363 131.84945 92.96409 69.92024 3665.32364
13.85000 -3325.91372 5.56483 -154.45656 78.66327 94.11014 4035.07003
13.95000 -3300.88060 8.93578 -32.92657 73.21418 80.78665 4067.48789
14.05000 -3276.29145 6.49860 83.42909 73.91905 82.81908 4140.92868
14.15000 -3253.75750 7.57564 -96.12537 81.55455 74.47441 3480.41370
14.25000 -3228.29210 13.53615 -129.93508 102.31719 135.40432 3374.59147
14.35000 -3202.24736 3.01300 -48.29412 78.64840 135.87920 4490.58220
14.45000 -3179.74924 8.26101 -158.17069 73.42604 74.65310 4530.54119
14.55000 -3157.36295 5.79804 -201.26527 104.57640 64.37892 3740.29415
14.65000 -3137.54066 8.08503 -45.28315 79.91065 77.81363 3198.14453
14.75000 -3117.92308 4.36584 -58.25712 92.57318 97.18594 3510.57878
14.85000 -3094.70265 6.67452 83.94516 72.94088 80.69869 3826.30757
14.95000 -3075.39864 5.83837 -58.53173 129.49776 82.43524 3012.03164
15.05000 -3056.40879 5.81180 -68.12316 86.78827 59.15876 3206.16252
15.15000 -3032.75426 7.73540 -15.54210 68.62969 90.12970 3750.50450
15.25000 -3011.37443 8.88416 -117.07380 64.09239 72.87743 3910.91780
15.35000 -2987.34903 1.57463 -142.02651 68.71872 104.08735 3705.62425
15.45000 -2966.89846 6.36188 -32.86802 62.61849 50.28959 3259.67239
15.55000 -2947.80245 2.96438 -159.04924 69.93511 124.22816 2510.57404
15.65000 -2930.29672 5.64382 28.77206 56.24388 57.15517 2550.60173
15.75000 -2902.12684 5.26114 -139.67887 152.24226 75.35999 2499.16912
15.85000 -2886.24911 6.19021 -156.35703 78.25404 59.47644 2894.67527
15.95000 -2867.42965 6.42326 -165.97983 71.39997 70.77712 2893.13225
16.05000 -2846.64193 6.69516 -319.52021 94.15750 79.17943 2574.28908
16.15000 -2828.70493 8.22629 -90.89783 59.90136 80.04963 2178.27769
16.25000 -2809.03461 6.96059 -193.07177 82.01689 57.16769 2259.26264
16.35000 -2796.35195 5.20083 -175.86021 57.58184 76.41418 2107.02752
16.45000 -2776.41306 7.16517 -50.20388 52.38739 47.97889 2448.04249
16.55000 -2759.89461 9.15571 -58.08220 125.12033 102.34028 2589.63199
16.65000 -2738.23486 4.66525 -117.79112 60.44419 70.51840 1800.79064
16.75000 -2721.74925 4.39298 -25.24884 54.63493 53.16085 2113.01030
16.85000 -2702.61703 8.78134 -11.30645 55.06133 49.81964 1682.43250
16.95000 -2686.88661 7.87549 -18.38666 109.64164 77.49828 1588.17719
17.05000 -2668.26219 4.52402 -70.96855 72.87273 42.75250 2644.29208
17.15000 -2650.27794 4.55582 -201.63360 60.64259 40.16134 1935.61397
17.25000 -2632.94266 4.34125 -110.41346 51.42329 64.53213 2011.12663
17.35000 -2621.49445 7.47104 -40.64179 41.50414 55.42470 2024.93880
17.45000 -2598.17003 17.55197 -122.76322 165.67800 229.13268 1744.50330
17.55000 -2589.90418 5.09178 -139.06085 124.05516 152.14328 1889.08116
17.65000 -2572.91439 7.52226 -24.60490 77.81970 53.01770 2760.53890
17.75000 -2554.55207 4.67785 -24.85231 41.06875 33.28062 1671.78544
17.85000 -2538.66862 5.27734 178.16748 76.99685 71.13158 2111.46953
17.95000 -2524.83057 2.03477 -33.43120 61.33169 156.96865 1523.50970
18.05000 -2508.22520 3.62756 16.47669 43.82932 49.07338 1499.77343
18.15000 -2486.76127 6.72691 85.35923 145.26781 61.91317 1624.54145
18.25000 -2480.37065 7.20338 31.98273 59.76991 60.61238 1899.59963
18.35000 -2460.67613 10.07905 -131.06777 50.30434 39.38716 1426.52423
18.45000 -2446.56903 5.02621 -93.19523 57.56722 43.97296 1421.18661
18.55000 -2430.38656 4.68817 -62.16518 39.20806 38.05420 1936.57404
18.65000 -2412.98051 1.53043 71.61369 57.37184 67.90306 1449.67282
18.75000 -2407.39362 7.10572 -48.33496 116.60682 42.13553 1400.49334
18.85000 -2388.53181 1.52955 35.69777 75.93042 62.42080 1186.00084
18.95000 -2371.60112 3.27399 -88.48652 44.59796 68.70939 1629.12606
19.05000 -2362.98404 3.99096 58.80561 35.91155 31.90908 1651.89421
19.15000 -2345.91500 9.01476 -27.89222 43.90535 71.16757 1221.52498
19.25000 -2332.05243 7.40168 -9.08865 41.20014 36.68396 1006.22448
19.35000 -2318.87367 4.89915 -41.63291 31.89427 29.69293 946.82756
19.45000 -2304.06139 3.87045 -268.57194 56.63102 39.90865 2802.11758
19.55000 -2288.84345 -2.00652 1.06279 71.30234 76.06020 833.32947
19.65000 -2276.68751 6.25186 79.11929 66.37035 46.57714 1923.05154
19.75000 -2276.17579 0.85495 -8.28104 185.34607 159.85711 1159.79909
19.85000 -2250.84625 7.17526 -8.75655 105.14530 42.97469 1280.16295
19.95000 -2243.00208 5.09275 -37.86121 45.66193 40.63391 814.75067
