0.125 0.002 0.001 0.000
0.375 0.003 -0.002 0.099
0.625 -0.022 0.002 0.414
0.875 0.007 0.007 0.900
1.125 -0.028 0.006 1.497
1.375 -0.028 -0.035 2.265
1.625 -0.069 -0.019 2.970
1.875 -0.107 -0.034 3.858
2.125 -0.091 0.013 4.797
2.375 -0.132 -0.069 5.606
2.625 -0.163 -0.034 6.549
2.875 -0.145 0.070 7.709
3.125 -0.134 -0.067 8.853
3.375 -0.284 -0.026 10.083
3.625 -0.273 -0.058 11.632
3.875 -0.307 -0.082 13.036
4.125 -0.401 -0.064 14.995
4.375 -0.426 -0.223 16.970
4.625 -0.461 -0.187 18.382
4.875 -0.525 -0.136 20.360
5.125 -0.629 -0.147 21.869
5.375 -0.533 -0.121 23.812
5.625 -0.560 -0.149 23.405
5.875 -0.525 -0.188 23.986
6.125 -0.582 -0.248 24.352
6.375 -0.483 -0.234 24.094
6.625 -0.488 -0.181 23.424
6.875 -0.288 -0.161 23.597
7.125 -0.522 -0.205 23.118
7.375 -0.351 -0.230 22.554
7.625 -0.330 -0.205 21.828
7.875 -0.233 -0.210 21.962
8.125 -0.237 -0.161 21.258
8.375 -0.354 -0.081 22.184
8.625 -0.320 -0.048 21.791
8.875 -0.289 -0.007 22.091
9.125 -0.250 -0.032 21.611
9.375 -0.293 0.033 20.983
9.625 -0.350 0.032 19.926
9.875 -0.408 -0.029 20.294
10.125 -0.368 0.065 19.821
10.375 -0.435 0.018 20.123
10.625 -0.503 -0.009 19.754
10.875 -0.562 -0.008 19.981
11.125 -0.543 0.012 21.046
11.375 -0.550 -0.047 21.029
11.625 -0.671 -0.085 21.931
11.875 -0.731 -0.068 21.509
12.125 -0.725 -0.014 22.181
12.375 -0.665 -0.056 20.227
12.625 -0.763 -0.017 20.720
12.875 -0.778 -0.052 20.667
13.125 -0.657 -0.074 20.557
13.375 -0.666 -0.141 18.892
13.625 -0.638 -0.136 18.041
13.875 -0.679 -0.168 18.407
14.125 -0.599 -0.154 16.818
14.375 -0.579 -0.141 15.858
14.625 -0.574 -0.228 16.049
14.875 -0.513 -0.218 14.922
15.125 -0.448 -0.223 13.970
15.375 -0.409 -0.245 13.764
15.625 -0.356 -0.226 12.642
15.875 -0.303 -0.241 11.118
16.125 -0.207 -0.227 10.113
16.375 -0.264 -0.199 9.632
16.625 -0.211 -0.171 9.079
16.875 -0.158 -0.185 10.059
17.125 -0.234 -0.141 9.417
17.375 -0.206 -0.133 9.104
17.625 -0.166 -0.154 7.836
17.875 -0.178 -0.154 8.830
18.125 -0.114 -0.135 8.271
18.375 -0.136 -0.130 8.233
18.625 -0.109 -0.162 7.246
18.875 -0.083 -0.144 8.132
19.125 -0.077 -0.065 6.900
19.375 -0.035 -0.050 6.436
19.625 -0.047 -0.040 6.392
19.875 -0.034 -0.007 5.371
