0.05000 -2836.01199 -369.94989 983.24089 4042.52069 3818.22049 4407.69775
0.15000 -4540.42679 69.36873 39.49196 3165.44941 3757.87449 5677.59657
0.25000 -6038.30443 -50.87831 299.94199 3036.18614 2638.81790 6718.40239
0.35000 -6789.77027 -37.56095 46.13984 2781.34989 2319.46333 6935.81124
0.45000 -6943.89753 103.36611 -85.49157 2555.33785 1957.09635 7243.45147
0.55000 -6921.16147 15.61161 333.27667 2478.86638 1724.22672 7253.77052
0.65000 -7035.85307 -20.63337 -152.74960 2302.99876 1381.23841 7233.80712
0.75000 -7019.10998 51.21464 -173.33945 2142.54138 1480.49531 7264.80396
0.85000 -6955.11676 27.04889 -329.22736 2038.95511 1264.97679 7283.84393
0.95000 -6944.66254 32.54885 -341.24071 2136.09431 1325.90851 7160.79334
1.05000 -6995.06530 -19.71887 -7.87701 1937.19768 1161.23012 6980.19385
1.15000 -7043.04983 41.65204 52.73172 1803.08848 1064.40838 6867.44568
1.25000 -7127.62181 11.79495 -47.98946 1829.53750 988.27090 6698.80277
1.35000 -7173.80184 50.70552 20.72459 1728.23672 978.63184 6509.83510
1.45000 -7196.20932 23.64941 4.21253 1642.82460 1013.12846 6348.88727
1.55000 -7176.16693 46.95455 -39.13454 1704.02756 1050.43598 6281.57520
1.65000 -7249.72523 -3.11189 15.03920 1463.04105 1035.59316 5959.98097
1.75000 -7248.45897 42.59026 39.93119 1463.41257 821.88950 5824.14324
1.85000 -7264.26604 22.94067 -41.08399 1428.53364 1051.12961 5636.58435
1.95000 -7289.14033 2.86932 -105.19416 1330.78349 920.41983 5510.48248
2.05000 -7315.24134 10.27960 43.60669 1304.07564 925.41032 5341.91658
2.15000 -7294.83161 24.90479 -6.47861 1223.75618 818.52547 5205.28084
2.25000 -7272.55511 14.66989 1.64039 1215.41465 853.66335 5070.62537
2.35000 -7226.90187 20.56794 59.45072 1128.91637 795.82354 4879.63261
2.45000 -7241.59797 37.24568 -29.93646 1074.61764 852.85404 4796.58261
2.55000 -7230.05117 16.10467 -44.43386 1069.83316 766.17149 4670.67259
2.65000 -7202.67973 7.29307 114.55652 1065.22391 881.64900 4552.05349
2.75000 -7166.71026 28.10080 -2.32613 953.59539 884.84484 4376.71890
2.85000 -7161.07761 21.50046 -63.76343 947.06340 840.58241 4264.46715
2.95000 -7148.27643 26.62763 8.89331 899.71868 724.11334 4194.18088
3.05000 -7166.66894 19.47817 -99.29759 832.71583 700.24122 3991.25163
3.15000 -7133.02524 16.67478 10.90606 877.42196 774.89374 3965.66480
3.25000 -7118.71946 15.66255 -29.39281 971.44756 748.89831 3886.85984
3.35000 -7116.80941 11.65169 -60.50782 845.72063 667.46361 3682.01076
3.45000 -7069.23735 17.57795 -12.67228 755.81947 630.32686 3633.61290
3.55000 -7036.29247 15.07479 -52.09946 682.43721 597.84826 3556.78835
3.65000 -6994.21507 15.51213 13.67098 789.69222 714.88769 3444.28990
3.75000 -6947.03494 0.74360 6.31325 688.96595 577.03042 3397.65597
3.85000 -6939.33023 -2.84171 -18.54370 731.24958 682.38281 3300.36530
3.95000 -6909.27859 21.00822 56.73523 651.26932 606.13614 3187.77328
4.05000 -6855.74495 0.48957 44.21902 768.47888 621.50585 3148.57314
4.15000 -6823.45713 4.39558 -29.59156 653.20700 501.80647 3096.11208
4.25000 -6764.77186 3.85524 -8.61890 730.11865 603.23652 3017.22776
4.35000 -6755.91276 -6.14947 102.62115 674.76705 589.11878 2977.29517
4.45000 -6707.95367 -2.82184 -41.24787 606.62783 490.69131 2838.68308
4.55000 -6671.83350 4.61396 10.12964 615.68218 492.96134 2788.53851
4.65000 -6634.61621 1.44737 11.59333 728.03274 546.92520 2718.29662
4.75000 -6594.62436 1.91299 34.99010 636.53493 473.28487 2652.18935
4.85000 -6564.91219 -1.26499 100.97307 586.20855 556.19011 2589.36870
4.95000 -6498.35115 9.21252 11.44251 547.74738 419.45146 2535.05457
5.05000 -6473.28280 4.13883 47.95154 514.33483 407.09186 2451.75829
5.15000 -6425.92983 11.22428 42.62873 601.07467 425.42689 2430.15829
5.25000 -6378.43675 15.11566 52.42019 540.76595 435.00536 2378.70028
5.35000 -6351.00852 2.72508 0.90899 525.15422 437.09928 2319.81726
5.45000 -6308.64245 20.12198 51.86544 688.91397 567.63944 2275.34156
5.55000 -6263.32850 9.52848 94.44230 520.26136 368.63248 2183.69358
5.65000 -6212.14362 14.50517 44.53295 459.83640 397.96326 2144.35653
5.75000 -6163.17309 16.28281 -47.66087 558.48399 387.10285 2112.31232
5.85000 -6119.13833 9.60627 46.49118 649.56551 414.48351 2078.24488
5.95000 -6094.77581 7.08714 -0.91240 411.28178 301.40433 2001.98246
6.05000 -6064.86516 12.16319 -4.26498 445.25265 313.86228 1946.95324
6.15000 -6026.97865 13.70141 -35.74319 410.22476 324.39467 1913.31078
6.25000 -6000.91035 12.25109 -13.31180 533.87763 330.46497 1895.06727
6.35000 -5966.80973 7.99457 6.27644 385.66963 309.73572 1838.41586
6.45000 -5944.39138 17.92145 -11.22392 453.93088 314.29391 1809.08119
6.55000 -5895.84175 9.70084 11.99923 386.09954 350.16951 1773.76717
6.65000 -5870.61559 14.80297 1.76394 390.45046 393.52828 1767.49211
6.75000 -5836.18896 6.96693 -44.40915 351.46773 248.56670 1723.86306
6.85000 -5794.90755 23.51695 3.67956 374.28557 477.93871 1673.11950
6.95000 -5763.90331 13.04709 -47.05591 406.62565 248.64789 1630.52099
7.05000 -5741.05673 6.46541 34.83710 500.77786 300.54963 1599.46138
7.15000 -5696.77575 13.55811 -4.12139 432.43846 247.33899 1594.02361
7.25000 -5671.67789 18.88288 -26.23900 419.38608 375.99415 1515.92260
7.35000 -5642.08424 13.42493 -5.62414 305.92314 245.22794 1501.80038
7.45000 -5602.05810 11.94542 -18.20960 311.36109 244.08053 1477.89440
7.55000 -5560.87781 18.12790 9.87019 318.55631 227.91852 1437.42164
7.65000 -5529.26260 12.73657 -22.30404 302.63306 229.86031 1395.46913
7.75000 -5492.91165 16.95837 -13.40601 302.60698 222.10126 1371.61743
7.85000 -5455.37877 17.23753 -2.97513 265.93389 198.72961 1333.83464
7.95000 -5415.51377 17.28135 5.55125 259.20747 194.71299 1317.02682
8.05000 -5375.87045 17.38731 2.00095 247.91747 204.51541 1270.50563
8.15000 -5339.45712 13.62331 -2.58722 422.42465 389.88704 1277.83085
8.25000 -5300.63169 14.80360 -30.16539 280.99800 216.41537 1234.55075
8.35000 -5273.91003 18.98277 -9.36408 266.53533 279.25560 1193.77852
8.45000 -5237.15396 17.77502 -0.51420 233.21504 222.27499 1172.97638
8.55000 -5199.34677 10.04294 -1.51759 272.79045 212.56909 1143.18260
8.65000 -5160.83068 17.60052 2.50225 237.74219 167.95161 1131.86525
8.75000 -5119.16604 16.52382 14.90583 250.86235 184.27589 1095.45622
8.85000 -5081.47024 10.47461 -12.05045 352.23446 234.73712 1087.47970
8.95000 -5045.89407 15.58772 0.83510 255.13407 172.73875 1050.42914
9.05000 -4995.40925 12.70201 -24.68390 274.41868 215.39935 1036.99665
9.15000 -4962.54381 13.87843 0.79861 248.38413 189.28309 1024.40876
9.25000 -4926.99823 14.02081 4.46152 203.36028 170.78333 981.80529
9.35000 -4883.65829 12.79721 -21.79989 223.70548 170.50338 963.75317
9.45000 -4843.58849 14.80365 18.65972 223.05433 197.01306 928.98376
9.55000 -4803.17687 12.09034 -4.16610 184.68205 188.12564 919.52209
9.65000 -4764.79674 14.86015 -0.83586 221.69743 173.03570 898.40477
9.75000 -4726.43005 11.46234 21.55866 210.89912 171.17974 893.33881
9.85000 -4689.69306 11.30303 -4.48530 203.22010 170.92089 862.80600
9.95000 -4650.60114 12.82195 -12.99421 214.59153 179.11255 853.80838
10.05000 -4617.92596 11.07050 -11.33233 170.99878 179.41231 817.29905
10.15000 -4579.47682 11.89766 1.32241 169.08375 145.00452 812.57934
10.25000 -4543.96780 11.37432 29.30754 171.53324 141.16591 793.19660
10.35000 -4508.79829 14.39828 28.32383 222.42595 192.10466 771.60686
10.45000 -4469.25923 12.56164 32.43526 152.73178 125.97315 779.50205
10.55000 -4434.93728 7.13847 -8.70875 186.71660 144.60244 747.17713
10.65000 -4395.48502 7.61298 30.42844 169.49803 203.03577 742.27186
10.75000 -4357.76280 4.12038 24.06856 190.24829 187.31573 731.89754
10.85000 -4326.78064 7.06947 -6.27856 320.61443 163.36728 764.59152
10.95000 -4286.38316 8.58132 4.04044 262.09207 138.07875 706.09885
11.05000 -4263.81394 6.85535 20.50268 203.42353 166.39401 686.16805
11.15000 -4231.32432 5.94984 23.27554 132.04103 149.24408 665.72963
11.25000 -4195.30631 8.74478 1.44871 162.22138 128.02823 650.50533
11.35000 -4169.70864 19.53567 27.72902 334.38117 483.99546 625.90747
11.45000 -4134.03514 10.50960 42.06750 213.74870 159.33488 614.99691
11.55000 -4109.53292 6.49079 39.46652 155.84510 161.77886 612.42255
11.65000 -4079.19409 8.86502 10.19840 148.38956 181.77232 597.60773
11.75000 -4060.15258 4.06289 8.72020 269.85505 278.59781 594.87409
11.85000 -4023.80529 11.69815 32.72116 129.25273 110.71081 570.62670
11.95000 -3994.11146 7.77531 27.93865 152.08804 109.05672 570.50517
12.05000 -3964.20558 7.12974 17.77166 182.87594 159.30080 556.72548
12.15000 -3938.85431 6.81428 35.15163 136.71021 147.05573 541.45218
12.25000 -3903.97151 7.02407 6.84419 140.98223 96.45657 533.42006
12.35000 -3880.08687 8.45192 10.15371 189.51268 144.38456 520.72356
12.45000 -3853.21384 7.40269 16.15610 124.33838 94.47674 508.09804
12.55000 -3820.76553 8.71255 14.55131 117.50141 101.34271 512.49942
12.65000 -3791.06146 8.10497 -2.45322 111.36790 92.33813 488.69309
12.75000 -3762.31970 7.15942 6.94001 112.65357 126.22797 487.34082
12.85000 -3731.47429 8.47375 -20.02620 144.85300 95.02217 468.85742
12.95000 -3706.57380 9.76484 1.74779 170.14154 98.60296 485.95475
13.05000 -3680.90155 6.12303 2.60930 113.27397 124.03960 463.06836
13.15000 -3649.94740 2.12543 15.52010 96.45005 104.95597 453.85956
13.25000 -3626.62305 8.31548 -15.84643 117.14959 97.03663 456.82523
13.35000 -3603.96835 7.35300 2.01475 168.08010 122.95350 428.80989
13.45000 -3571.15562 10.68589 -0.69589 119.02214 102.62384 430.90377
13.55000 -3544.82167 2.01071 -8.65308 139.54606 112.18264 444.11306
13.65000 -3514.96179 6.47182 -0.77230 120.34337 112.49213 414.94941
13.75000 -3489.85260 2.48981 -9.94091 102.61106 118.66399 407.88231
13.85000 -3468.72658 7.07666 -7.37387 112.21660 88.06623 397.22565
13.95000 -3439.60906 11.43133 1.05751 90.60268 102.35855 386.02664
14.05000 -3414.56116 6.85177 -4.73536 111.80148 100.84857 397.40143
14.15000 -3392.26698 5.73139 -1.27096 175.53478 76.82740 366.79448
14.25000 -3368.60836 4.93360 -3.38824 91.60070 86.97507 370.92909
14.35000 -3346.21344 8.08133 -7.98835 116.36935 86.70210 364.80291
14.45000 -3323.61275 4.89753 -12.33068 89.63792 80.14292 354.52092
14.55000 -3297.49509 7.19588 -2.88472 76.25873 81.16524 348.45012
14.65000 -3274.58382 6.23425 -0.82562 87.97831 76.00483 338.00208
14.75000 -3258.30691 5.53000 1.55016 100.39535 89.66024 334.64463
14.85000 -3232.09716 7.66276 -9.58920 119.89627 158.15779 329.99766
14.95000 -3209.58530 3.92065 -21.44563 92.44087 60.98022 313.55947
15.05000 -3186.27349 5.92292 -0.74831 68.32740 60.36153 315.78012
15.15000 -3159.67553 6.88228 -11.06255 156.68183 99.68555 324.64696
15.25000 -3140.21216 7.71770 -4.13944 97.14986 104.44047 308.29114
15.35000 -3121.85777 5.72591 -11.34489 138.22051 94.87629 310.57273
15.45000 -3102.11142 6.42073 11.64378 71.71433 65.51083 301.02668
15.55000 -3078.04859 8.23916 -13.74271 126.35081 103.94493 295.73974
15.65000 -3064.70971 3.46798 10.74906 80.05778 103.18968 287.41539
15.75000 -3046.36183 5.15512 -1.11273 75.77571 89.45221 291.93448
15.85000 -3017.62993 6.86032 1.13148 184.30223 136.85844 278.15155
15.95000 -3002.44771 7.15194 -2.41644 65.02447 67.41785 280.58132
16.05000 -2985.93727 -0.00393 -0.55164 170.82413 129.65640 296.97651
16.15000 -2964.38380 7.53173 -14.62950 135.85410 77.67128 271.12421
16.25000 -2945.46442 11.21922 2.97478 106.83860 111.50445 281.37272
16.35000 -2921.40115 3.58002 10.40444 80.31453 58.34154 245.64120
16.45000 -2907.71545 4.02084 1.06199 55.73528 69.86844 253.18245
16.55000 -2889.37885 3.91829 6.08205 57.20037 93.90944 260.49829
16.65000 -2870.33860 5.65611 -3.26915 71.45169 74.35699 249.95319
16.75000 -2852.84457 4.99072 5.38816 83.04359 67.12624 233.66315
16.85000 -2833.77414 4.70332 1.73420 62.54015 63.13318 237.32652
16.95000 -2814.58585 7.40452 2.08814 102.17827 72.90803 238.38588
17.05000 -2795.16524 4.11193 10.28816 204.10977 97.42649 247.58051
17.15000 -2776.11479 7.94291 -1.15012 73.67994 54.73993 231.65551
17.25000 -2761.96388 4.19143 27.42830 78.83695 49.16214 215.01250
17.35000 -2746.79189 4.13419 3.28860 88.23847 124.43939 213.28890
17.45000 -2728.92419 4.34980 3.96741 115.78832 207.71402 215.69622
17.55000 -2701.27299 4.13900 15.82380 238.37719 64.07974 226.36477
17.65000 -2695.42450 3.85424 2.56805 72.27046 55.29637 206.39317
17.75000 -2671.74791 6.04290 6.66280 59.98318 68.31933 199.21842
17.85000 -2659.57146 4.38987 16.16089 43.04402 49.67434 188.86904
17.95000 -2641.93984 5.00469 -3.70412 58.70615 52.52716 198.53326
18.05000 -2628.68974 6.30407 3.77117 65.62548 74.21607 207.17257
18.15000 -2613.18949 5.29346 -3.48350 57.83626 70.03213 207.42699
18.25000 -2594.04828 1.98121 -0.54373 60.85397 54.49251 194.39977
18.35000 -2579.88942 0.34987 5.39330 38.86688 54.54796 186.53546
18.45000 -2562.11037 2.32449 -6.95861 38.77529 38.17160 172.51053
18.55000 -2550.42883 5.10507 -7.15380 63.60101 66.36222 168.30108
18.65000 -2530.91408 5.35437 -0.00719 69.37202 63.27308 187.98293
18.75000 -2515.55374 6.48970 12.95142 54.81759 57.02865 182.05531
18.85000 -2500.46066 5.79083 10.50554 64.84678 65.97244 182.02941
18.95000 -2485.99676 4.44438 -9.88777 121.03475 63.51720 162.71837
19.05000 -2472.94134 3.72575 2.42724 38.17321 32.10222 158.91330
19.15000 -2456.53438 2.93132 7.87991 41.82207 33.92347 160.16479
19.25000 -2441.54422 1.64328 1.32313 117.81227 72.48222 180.80497
19.35000 -2432.02608 4.24699 -0.00493 34.15116 32.00681 154.28165
19.45000 -2412.24847 5.81653 4.18285 67.00645 276.65354 163.71221
19.55000 -2402.83928 -0.51748 -1.57608 64.39172 61.80744 166.35667
19.65000 -2386.61355 4.62476 -1.91952 43.02018 55.50438 145.88296
19.75000 -2373.34800 2.78358 8.60110 45.50147 27.13952 149.92326
19.85000 -2359.20681 4.93651 5.21210 48.23955 41.94084 144.60519
19.95000 -2347.25257 6.93883 18.33979 128.81169 48.97303 151.99459
