0.12500 0.01206
0.37500 0.04836
0.62500 0.10793
0.87500 0.15946
1.12500 0.22210
1.37500 0.25756
1.62500 0.30662
1.87500 0.32707
2.12500 0.34413
2.37500 0.35835
2.62500 0.37731
2.87500 0.39762
3.12500 0.42412
3.37500 0.43445
3.62500 0.43748
3.87500 0.46541
4.12500 0.46507
4.37500 0.47092
4.62500 0.47822
4.87500 0.46550
5.12500 0.46113
5.37500 0.46759
5.62500 0.45627
5.87500 0.42882
6.12500 0.37543
6.37500 0.32771
6.62500 0.28591
6.87500 0.22599
7.12500 0.18531
7.37500 0.15390
7.62500 0.11276
7.87500 0.10897
8.12500 0.10144
8.37500 0.08045
8.62500 0.07390
8.87500 0.06852
9.12500 0.08824
9.37500 0.09704
9.62500 0.11018
9.87500 0.10449
10.12500 0.09208
10.37500 0.10400
10.62500 0.09752
10.87500 0.07964
11.12500 0.06856
11.37500 0.05405
11.62500 0.06194
11.87500 0.04900
12.12500 0.05944
12.37500 0.03741
12.62500 0.04390
12.87500 0.03539
13.12500 0.01870
13.37500 0.02244
13.62500 0.04044
13.87500 0.04471
14.12500 0.02078
14.37500 0.03116
14.62500 0.01515
14.87500 0.00226
15.12500 0.02534
15.37500 0.05980
15.62500 0.07745
15.87500 0.09714
16.12500 0.10076
16.37500 0.13190
16.62500 0.08034
16.87500 0.13261
17.12500 0.10253
17.37500 0.07515
17.62500 0.06992
17.87500 0.05624
18.12500 0.05137
18.37500 0.03888
18.62500 0.01029
18.87500 0.02387
19.12500 0.05462
19.37500 0.04797
19.62500 0.06737
19.87500 0.04223
