0.1875 -0.08804 19.87103 0.17484 87.30637 86.26562 77.01163
0.5625 -0.43617 44.28969 1.39333 85.26259 82.42574 74.74582
0.9375 -0.49239 64.55744 0.6429 81.23373 76.38773 69.59994
1.3125 -0.82201 80.72232 -0.16516 76.15069 71.68592 66.52423
1.6875 -0.74035 95.75392 -0.10078 71.55341 68.06219 63.76595
2.0625 0.55125 109.61011 -0.09202 67.1009 64.08587 60.34748
2.4375 -0.32051 122.56985 -0.8457 63.57533 60.22857 57.2627
2.8125 0.62911 133.19495 0.00167 59.78265 55.23152 54.64665
3.1875 -0.67711 142.16605 -0.52652 56.10849 51.86764 51.39483
3.5625 0.01554 150.24353 -0.17327 53.61333 48.25449 49.31179
3.9375 -0.48464 157.12599 -0.3578 51.36372 47.01553 47.31113
4.3125 -0.4535 163.76468 -0.12297 49.92464 43.20695 45.07185
4.6875 0.00512 168.49679 -0.24713 47.65703 41.6644 42.5173
5.0625 0.14035 173.12238 -0.19771 46.53555 39.1771 41.09647
5.4375 0.87686 177.3965 0.07158 44.54331 38.22833 39.66114
5.8125 -0.40306 181.42819 -0.15497 43.33838 36.02344 37.60867
6.1875 0.49706 184.62537 -0.37704 41.76863 34.66627 36.06557
6.5625 -0.20261 187.73879 -0.67421 39.98843 33.2801 34.79146
6.9375 0.01079 190.44515 -0.67432 38.55147 32.01961 33.56073
7.3125 -0.50872 193.22774 -0.7912 37.41524 31.11343 32.35375
7.6875 0.05471 195.52133 -0.3002 36.1914 29.4191 30.7236
8.0625 0.23115 198.14039 0.11219 34.85313 28.58406 29.85473
8.4375 0.53637 200.15984 -0.17305 34.13589 26.98654 28.58878
8.8125 0.34253 201.55978 -0.21688 32.96382 26.20886 27.77811
9.1875 -0.07284 203.1645 -0.19907 31.90917 25.54461 26.86767
9.5625 0.43059 203.99649 0.06326 31.00417 24.96452 25.93428
9.9375 0.58703 206.58655 0.66048 30.06091 24.30058 25.04592
10.3125 1.02496 207.28396 0.50116 29.66762 23.47113 23.93016
10.6875 0.77421 208.24791 0.55802 28.96473 22.51598 22.9848
11.0625 1.17575 208.81026 0.76926 28.07263 21.43964 22.55537
11.4375 1.04175 209.56452 0.4123 27.61181 20.62449 21.91888
11.8125 0.90008 210.17606 0.32699 26.68297 20.05978 21.17442
12.1875 0.73788 210.36001 0.50825 25.94883 19.91652 20.27661
12.5625 0.53578 210.86031 0.34859 24.84776 19.15618 19.47446
12.9375 0.87904 211.64712 -0.09081 24.49093 18.49357 18.81855
13.3125 0.42565 212.37688 0.05816 23.65493 18.38749 18.14017
13.6875 0.47041 212.88532 -0.17262 22.70368 17.70235 17.43419
14.0625 -0.11515 213.662 -0.52553 21.86295 17.04348 16.92012
14.4375 0.01548 213.95683 0.13675 20.90392 16.48767 16.4864
14.8125 0.35579 214.19632 -0.32317 20.59301 16.1323 15.97272
15.1875 -0.15692 214.33252 -0.4133 19.75638 15.20172 15.27826
15.5625 -0.12724 214.23483 0.30076 19.60849 14.53883 14.70948
15.9375 0.19327 214.00617 -0.14075 18.98602 14.67795 14.748
16.3125 0.00279 214.40319 -0.34775 18.34359 13.83302 14.29267
16.6875 -0.11182 214.39022 0.08996 18.07136 13.17103 13.78996
17.0625 -0.51464 214.20544 0.31246 17.42014 13.00023 13.27653
17.4375 -0.25784 214.0779 1.189 17.07007 12.48178 13.04471
17.8125 0.15951 214.19701 1.07443 16.59647 12.68972 12.3614
18.1875 0.4701 213.59257 1.66959 16.21383 12.29163 12.11236
18.5625 -0.04268 214.0501 1.37715 15.4023 11.74375 11.79089
18.9375 0.53505 213.7124 1.31761 15.23418 11.26011 11.38049
19.3125 -0.08071 213.59021 1.17763 14.65797 10.99651 11.14118
19.6875 0.52764 213.25423 0.7168 14.91972 10.67303 11.04188
20.0625 0.1558 213.13322 0.92244 14.1348 10.42444 10.51057
20.4375 -0.33696 213.01767 0.57827 13.71719 9.89096 10.43184
20.8125 0.32367 212.63716 0.80259 13.93075 9.60098 10.18723
21.1875 0.2545 212.38304 0.95397 13.46291 8.98745 10.11397
21.5625 -0.31945 211.55144 1.46826 13.106 9.10213 10.09245
21.9375 -1.27149 211.91928 1.88985 11.95064 8.87723 9.71221
22.3125 -0.23962 211.74263 1.82853 12.51516 9.21947 9.16847
22.6875 -0.32828 211.68915 1.91806 11.89036 8.43838 8.95988
23.0625 -0.13043 210.80154 1.9188 11.33436 8.61597 8.82462
23.4375 0.02117 210.67772 1.44513 11.4028 7.94344 8.89875
23.8125 0.00491 210.14292 0.83625 10.76164 7.70519 9.02773
24.1875 -0.07636 210.22051 0.57523 10.561 8.13018 8.65595
24.5625 0.04496 209.86898 0.87096 10.556 7.67558 8.11475
24.9375 -0.16751 209.58252 0.33604 10.32384 7.41596 7.50741
25.3125 -0.51791 209.07882 0.28507 10.23939 7.20531 7.95963
25.6875 -0.33761 208.35023 0.03936 10.15316 6.87928 7.88341
26.0625 -0.56753 208.48905 0.19726 9.46994 6.97087 7.33314
26.4375 -0.08006 208.72718 0.32932 9.22832 6.84462 7.23461
26.8125 -0.16764 207.75553 -0.45291 9.72874 7.32787 7.1519
27.1875 0.2909 208.34787 -0.26204 8.90431 7.07072 6.91121
27.5625 0.36795 208.33863 -0.36366 8.99816 6.03419 7.00241
27.9375 0.45185 207.90333 0.17669 8.88782 5.71123 5.90391
28.3125 0.06262 207.0871 0.70031 8.8184 5.49898 6.63308
28.6875 -0.15894 205.99835 1.0509 7.81303 5.71307 6.0058
29.0625 -1.48636 206.6057 0.14928 8.1174 5.67694 6.30812
29.4375 -1.17515 205.46253 0.53078 8.2825 6.12514 6.65313
29.8125 -0.48297 205.31827 0.76154 7.77643 6.09389 5.97545
