0.120000 -0.986630
0.380000 -1.136480
0.620000 -1.204260
0.880000 -1.235400
1.120000 -1.275450
1.380000 -1.228250
1.620000 -1.257150
1.880000 -1.235360
2.120000 -1.232680
2.380000 -1.235630
2.620000 -1.245190
2.880000 -1.266700
3.120000 -1.267720
3.380000 -1.293030
3.620000 -1.293640
3.880000 -1.283410
4.120000 -1.278090
4.380000 -1.303880
4.620000 -1.353080
4.880000 -1.457910
5.120000 -1.555030
5.380000 -1.748340
5.620000 -2.434670
5.880000 3.103600
6.120000 2.216170
6.380000 2.497940
6.620000 2.639300
6.880000 2.688430
7.120000 2.431880
7.380000 2.429840
7.620000 2.484020
7.880000 2.301750
8.120000 2.525790
8.380000 2.586300
8.620000 3.027540
8.880000 -2.457470
9.120000 -2.256660
9.380000 -2.184850
9.620000 -2.069600
9.880000 -3.094870
10.120000 2.959240
10.380000 2.724600
10.620000 3.074090
10.880000 2.986800
11.120000 -3.129050
11.380000 -2.978810
11.620000 -2.912920
11.880000 -2.647030
12.120000 -2.828750
12.380000 -3.138810
12.620000 -3.030930
12.880000 2.780990
13.120000 2.141970
13.380000 2.047420
13.620000 1.687660
13.880000 1.719550
14.120000 1.851410
14.380000 1.563190
14.620000 1.746090
14.880000 1.943080
