0.12500 0.02083
0.37500 0.00778
0.62500 0.01822
0.87500 0.01970
1.12500 0.01802
1.37500 0.01257
1.62500 0.01413
1.87500 0.01335
2.12500 0.02035
2.37500 0.03378
2.62500 0.04357
2.87500 0.03370
3.12500 0.04032
3.37500 0.02810
3.62500 0.02391
3.87500 0.02146
4.12500 0.02609
4.37500 0.03234
4.62500 0.03221
4.87500 0.02133
5.12500 0.01925
5.37500 0.01337
5.62500 0.01145
5.87500 0.02319
6.12500 0.01937
6.37500 0.03038
6.62500 0.02579
6.87500 0.02364
7.12500 0.02033
7.37500 0.02429
7.62500 0.01788
7.87500 0.01259
8.12500 0.01161
8.37500 0.02079
8.62500 0.01069
8.87500 0.02639
9.12500 0.01691
9.37500 0.01996
9.62500 0.01426
9.87500 0.01266
10.12500 0.01016
10.37500 0.02500
10.62500 0.01490
10.87500 0.02450
11.12500 0.01595
11.37500 0.02048
11.62500 0.03946
11.87500 0.02287
12.12500 0.03640
12.37500 0.02610
12.62500 0.01714
12.87500 0.01667
13.12500 0.00286
13.37500 0.01923
13.62500 0.02291
13.87500 0.02238
14.12500 0.03492
14.37500 0.03824
14.62500 0.00993
14.87500 0.01448
