0.120000 2.104170
0.380000 2.852960
0.620000 -3.016680
0.880000 -3.108730
1.120000 3.061090
1.380000 2.983150
1.620000 2.932210
1.880000 2.863440
2.120000 2.877420
2.380000 2.915610
2.620000 2.784880
2.880000 2.779920
3.120000 2.685140
3.380000 2.662180
3.620000 2.603020
3.880000 2.604170
4.120000 2.548670
4.380000 2.572370
4.620000 2.635800
4.880000 2.582110
5.120000 2.537090
5.380000 2.592920
5.620000 2.415010
5.880000 2.287960
6.120000 2.383900
6.380000 2.390090
6.620000 2.113420
6.880000 1.636170
7.120000 0.731940
7.380000 0.870930
7.620000 1.033320
7.880000 1.358320
8.120000 0.768280
8.380000 0.210330
8.620000 1.001640
8.880000 1.129320
9.120000 1.668210
9.380000 2.206970
9.620000 2.179840
9.880000 2.766110
10.120000 2.708960
10.380000 3.003350
10.620000 2.712080
10.880000 2.136120
11.120000 2.494730
11.380000 1.975640
11.620000 1.661720
11.880000 0.789650
12.120000 0.895200
12.380000 0.845760
12.620000 1.123960
12.880000 0.470250
13.120000 0.414100
13.380000 0.172580
13.620000 -0.069670
13.880000 -0.315480
14.120000 -0.563890
14.380000 -0.440410
14.620000 -0.738400
14.880000 -0.580430
