0.12500 0.05611
0.37500 0.00240
0.62500 0.01893
0.87500 0.01449
1.12500 0.00972
1.37500 0.00941
1.62500 0.02713
1.87500 0.01800
2.12500 0.01350
2.37500 0.03107
2.62500 0.01361
2.87500 0.02719
3.12500 0.02837
3.37500 0.02079
3.62500 0.01568
3.87500 0.00726
4.12500 0.02553
4.37500 0.01199
4.62500 0.02131
4.87500 0.02077
5.12500 0.02641
5.37500 0.00576
5.62500 0.01090
5.87500 0.01512
6.12500 0.02874
6.37500 0.03833
6.62500 0.02397
6.87500 0.02578
7.12500 0.03453
7.37500 0.03777
7.62500 0.05441
7.87500 0.07544
8.12500 0.04274
8.37500 0.05333
8.62500 0.03408
8.87500 0.01652
9.12500 0.03512
9.37500 0.02753
9.62500 0.02182
9.87500 0.02169
10.12500 0.03479
10.37500 0.02462
10.62500 0.01117
10.87500 0.02025
11.12500 0.02512
11.37500 0.03431
11.62500 0.03924
11.87500 0.03199
12.12500 0.00841
12.37500 0.01069
12.62500 0.01634
12.87500 0.02680
13.12500 0.00133
13.37500 0.02618
13.62500 0.04187
13.87500 0.03283
14.12500 0.03484
14.37500 0.01489
14.62500 0.03095
14.87500 0.00983
15.12500 0.02623
15.37500 0.00250
15.62500 0.04093
15.87500 0.12068
16.12500 0.08894
16.37500 0.04315
16.62500 0.06982
16.87500 0.01858
17.12500 0.05989
17.37500 0.04805
17.62500 0.05867
17.87500 0.01240
18.12500 0.06889
18.37500 0.09391
18.62500 0.06021
18.87500 0.05312
19.12500 0.04311
19.37500 0.09253
19.62500 0.10580
19.87500 0.06190
