0.12500 0.03570
0.37500 0.02286
0.62500 0.01159
0.87500 0.05397
1.12500 0.07210
1.37500 0.10805
1.62500 0.14485
1.87500 0.18024
2.12500 0.19403
2.37500 0.22182
2.62500 0.21820
2.87500 0.21612
3.12500 0.21159
3.37500 0.21201
3.62500 0.18892
3.87500 0.16392
4.12500 0.12732
4.37500 0.09092
4.62500 0.05766
4.87500 0.04735
5.12500 0.03157
5.37500 0.02441
5.62500 0.01778
5.87500 0.01104
6.12500 0.02694
6.37500 0.01108
6.62500 0.02911
6.87500 0.03547
7.12500 0.04497
7.37500 0.03119
7.62500 0.03582
7.87500 0.03798
8.12500 0.02875
8.37500 0.03629
8.62500 0.04183
8.87500 0.03896
9.12500 0.05501
9.37500 0.05777
9.62500 0.04606
9.87500 0.05279
10.12500 0.04485
10.37500 0.05636
10.62500 0.05594
10.87500 0.06048
11.12500 0.04331
11.37500 0.04705
11.62500 0.03901
11.87500 0.03918
12.12500 0.03106
12.37500 0.04245
12.62500 0.03388
12.87500 0.05830
13.12500 0.05041
13.37500 0.06467
13.62500 0.05631
13.87500 0.03465
14.12500 0.03467
14.37500 0.02736
14.62500 0.01099
14.87500 0.02944
