0.12500 0.03037
0.37500 0.05049
0.62500 0.11300
0.87500 0.16857
1.12500 0.21908
1.37500 0.27272
1.62500 0.30133
1.87500 0.32734
2.12500 0.36012
2.37500 0.39751
2.62500 0.42270
2.87500 0.45852
3.12500 0.46718
3.37500 0.49460
3.62500 0.50211
3.87500 0.48237
4.12500 0.47370
4.37500 0.43072
4.62500 0.40925
4.87500 0.37150
5.12500 0.31494
5.37500 0.30160
5.62500 0.26750
5.87500 0.26007
6.12500 0.21345
6.37500 0.21319
6.62500 0.17583
6.87500 0.17322
7.12500 0.15903
7.37500 0.13568
7.62500 0.11663
7.87500 0.10945
8.12500 0.10892
8.37500 0.09972
8.62500 0.08018
8.87500 0.08785
9.12500 0.05421
9.37500 0.06814
9.62500 0.05561
9.87500 0.08647
10.12500 0.05899
10.37500 0.10619
10.62500 0.13268
10.87500 0.10340
11.12500 0.08731
11.37500 0.09670
11.62500 0.09529
11.87500 0.09767
12.12500 0.06026
12.37500 0.10421
12.62500 0.09134
12.87500 0.11506
13.12500 0.12007
13.37500 0.11349
13.62500 0.14556
13.87500 0.12806
14.12500 0.12228
14.37500 0.16836
14.62500 0.15381
14.87500 0.11522
15.12500 0.12985
15.37500 0.08541
15.62500 0.09598
15.87500 0.08344
16.12500 0.12231
16.37500 0.10515
16.62500 0.08495
16.87500 0.06304
17.12500 0.09727
17.37500 0.09369
17.62500 0.06067
17.87500 0.02026
18.12500 0.04009
18.37500 0.08098
18.62500 0.03789
18.87500 0.04594
19.12500 0.06920
19.37500 0.02670
19.62500 0.09250
19.87500 0.14055
