0.12500 0.00823
0.37500 0.07707
0.62500 0.17133
0.87500 0.26750
1.12500 0.33643
1.37500 0.38841
1.62500 0.40671
1.87500 0.42582
2.12500 0.44281
2.37500 0.44536
2.62500 0.46957
2.87500 0.47331
3.12500 0.49377
3.37500 0.50410
3.62500 0.51114
3.87500 0.52049
4.12500 0.53425
4.37500 0.53534
4.62500 0.56158
4.87500 0.56680
5.12500 0.58203
5.37500 0.58416
5.62500 0.58595
5.87500 0.59516
6.12500 0.59493
6.37500 0.56950
6.62500 0.57109
6.87500 0.55208
7.12500 0.52355
7.37500 0.50898
7.62500 0.48770
7.87500 0.44512
8.12500 0.41045
8.37500 0.38543
8.62500 0.36748
8.87500 0.34010
9.12500 0.31368
9.37500 0.29062
9.62500 0.27834
9.87500 0.29026
10.12500 0.27932
10.37500 0.28084
10.62500 0.27493
10.87500 0.25770
11.12500 0.23776
11.37500 0.22210
11.62500 0.19521
11.87500 0.17267
12.12500 0.17190
12.37500 0.15832
12.62500 0.14235
12.87500 0.15079
13.12500 0.14524
13.37500 0.14631
13.62500 0.15315
13.87500 0.12557
14.12500 0.12913
14.37500 0.12943
14.62500 0.10448
14.87500 0.10403
15.12500 0.05950
15.37500 0.05584
15.62500 0.07273
15.87500 0.06714
16.12500 0.06286
16.37500 0.06642
16.62500 0.06640
16.87500 0.09179
17.12500 0.10167
17.37500 0.12600
17.62500 0.12510
17.87500 0.11783
18.12500 0.14723
18.37500 0.14355
18.62500 0.16151
18.87500 0.17277
19.12500 0.16156
19.37500 0.16971
19.62500 0.17688
19.87500 0.19605
