0.120000 2.878080
0.380000 2.795640
0.620000 2.661450
0.880000 2.691370
1.120000 2.687160
1.380000 2.668310
1.620000 2.663280
1.880000 2.649160
2.120000 2.664060
2.380000 2.653360
2.620000 2.658120
2.880000 2.649230
3.120000 2.635580
3.380000 2.631650
3.620000 2.629350
3.880000 2.665490
4.120000 2.641470
4.380000 2.655880
4.620000 2.658070
4.880000 2.653580
5.120000 2.663690
5.380000 2.653440
5.620000 2.645770
5.880000 2.649800
6.120000 2.651550
6.380000 2.649440
6.620000 2.649230
6.880000 2.659700
7.120000 2.675730
7.380000 2.662380
7.620000 2.665310
7.880000 2.682080
8.120000 2.692970
8.380000 2.687810
8.620000 2.709690
8.880000 2.708220
9.120000 2.715880
9.380000 2.739270
9.620000 2.790760
9.880000 2.756890
10.120000 2.788930
10.380000 2.801160
10.620000 2.775120
10.880000 2.841660
11.120000 2.867680
11.380000 2.815870
11.620000 2.844530
11.880000 2.792010
12.120000 2.822660
12.380000 2.697810
12.620000 2.660640
12.880000 2.467960
13.120000 2.550230
13.380000 2.117120
13.620000 2.257820
13.880000 2.106760
14.120000 2.355370
14.380000 1.737730
14.620000 2.160980
14.880000 2.331110
