0.12500 0.01815
0.37500 0.05849
0.62500 0.06779
0.87500 0.11519
1.12500 0.10366
1.37500 0.15244
1.62500 0.16755
1.87500 0.19673
2.12500 0.19807
2.37500 0.18921
2.62500 0.20287
2.87500 0.19731
3.12500 0.19518
3.37500 0.18462
3.62500 0.19375
3.87500 0.21462
4.12500 0.18532
4.37500 0.19041
4.62500 0.19855
4.87500 0.19856
5.12500 0.17322
5.37500 0.17152
5.62500 0.15263
5.87500 0.14008
6.12500 0.14570
6.37500 0.12389
6.62500 0.12682
6.87500 0.08908
7.12500 0.08110
7.37500 0.07002
7.62500 0.05613
7.87500 0.09059
8.12500 0.05583
8.37500 0.06338
8.62500 0.04990
8.87500 0.03159
9.12500 0.06124
9.37500 0.05054
9.62500 0.04688
9.87500 0.06059
10.12500 0.04615
10.37500 0.05896
10.62500 0.03623
10.87500 0.04026
11.12500 0.02097
11.37500 0.03335
11.62500 0.03343
11.87500 0.03391
12.12500 0.02302
12.37500 0.03985
12.62500 0.04355
12.87500 0.04207
13.12500 0.05775
13.37500 0.03861
13.62500 0.08003
13.87500 0.07592
14.12500 0.07283
14.37500 0.08778
14.62500 0.05871
14.87500 0.04619
