0.12500 0.03471
0.37500 0.01846
0.62500 0.02964
0.87500 0.03747
1.12500 0.05955
1.37500 0.04728
1.62500 0.08675
1.87500 0.08881
2.12500 0.08537
2.37500 0.09626
2.62500 0.08390
2.87500 0.08622
3.12500 0.07348
3.37500 0.06057
3.62500 0.06211
3.87500 0.08318
4.12500 0.04752
4.37500 0.04150
4.62500 0.05955
4.87500 0.02092
5.12500 0.04212
5.37500 0.03577
5.62500 0.03737
5.87500 0.03559
6.12500 0.03757
6.37500 0.02017
6.62500 0.00945
6.87500 0.02965
7.12500 0.02980
7.37500 0.03134
7.62500 0.02295
7.87500 0.01409
8.12500 0.02120
8.37500 0.02602
8.62500 0.03865
8.87500 0.01898
9.12500 0.02980
9.37500 0.01816
9.62500 0.01968
9.87500 0.02872
10.12500 0.02516
10.37500 0.03336
10.62500 0.02676
10.87500 0.00361
11.12500 0.01259
11.37500 0.01046
11.62500 0.03212
11.87500 0.04193
12.12500 0.04475
12.37500 0.04309
12.62500 0.02273
12.87500 0.03122
13.12500 0.08678
13.37500 0.02997
13.62500 0.09167
13.87500 0.05129
14.12500 0.04311
14.37500 0.01282
14.62500 0.02408
14.87500 0.04801
