0.125 0.000 0.000 0.000
0.375 0.000 -0.000 -0.000
0.625 -0.001 0.000 0.000
0.875 -0.003 -0.001 -0.000
1.125 -0.006 0.002 0.003
1.375 -0.001 0.008 0.005
1.625 0.001 0.006 0.005
1.875 -0.005 -0.004 0.004
2.125 -0.001 -0.001 0.000
2.375 -0.004 -0.005 0.010
2.625 -0.011 0.002 0.014
2.875 -0.008 -0.013 0.005
3.125 -0.003 0.008 0.018
3.375 -0.011 -0.015 0.011
3.625 0.000 -0.002 0.013
3.875 0.009 -0.004 0.018
4.125 0.009 0.002 0.000
4.375 -0.004 -0.011 -0.005
4.625 0.006 -0.025 -0.013
4.875 -0.029 0.004 0.043
5.125 -0.009 -0.009 0.013
5.375 -0.015 0.001 0.025
5.625 -0.016 0.006 0.040
5.875 -0.003 0.014 0.019
6.125 0.017 0.013 0.035
6.375 0.014 0.006 0.026
6.625 -0.007 -0.007 0.015
6.875 -0.018 0.000 0.039
7.125 0.002 -0.003 0.036
7.375 0.013 0.016 0.038
7.625 0.043 0.021 0.013
7.875 -0.007 -0.007 0.066
8.125 0.029 -0.007 0.042
8.375 0.011 0.003 0.015
8.625 -0.007 0.039 -0.026
8.875 -0.030 0.013 0.033
9.125 0.035 -0.039 0.033
9.375 0.003 0.004 0.046
9.625 -0.044 -0.023 0.046
9.875 -0.002 -0.007 -0.011
10.125 0.014 0.001 0.015
10.375 -0.033 0.023 0.042
10.625 0.020 -0.023 0.020
10.875 0.023 -0.016 0.039
11.125 0.042 -0.028 -0.007
11.375 0.039 0.069 0.074
11.625 -0.034 -0.058 0.041
11.875 -0.017 -0.004 -0.015
12.125 0.015 -0.036 -0.002
12.375 0.092 -0.018 0.005
12.625 -0.026 0.002 0.060
12.875 -0.015 0.048 0.074
13.125 -0.009 0.020 0.032
13.375 0.042 0.038 0.062
13.625 0.069 -0.016 0.031
13.875 0.009 -0.021 0.108
14.125 -0.003 -0.031 0.047
14.375 0.051 0.029 -0.037
14.625 -0.081 0.056 0.051
14.875 -0.061 0.000 0.082
