0.12500 0.02258
0.37500 0.01092
0.62500 0.01131
0.87500 0.00541
1.12500 0.00853
1.37500 0.00845
1.62500 0.00564
1.87500 0.01445
2.12500 0.01201
2.37500 0.01602
2.62500 0.01425
2.87500 0.01367
3.12500 0.00684
3.37500 0.00899
3.62500 0.00566
3.87500 0.00177
4.12500 0.01453
4.37500 0.00969
4.62500 0.02433
4.87500 0.01782
5.12500 0.01465
5.37500 0.01106
5.62500 0.01120
5.87500 0.00067
6.12500 0.00611
6.37500 0.00847
6.62500 0.00873
6.87500 0.00555
7.12500 0.00802
7.37500 0.01226
7.62500 0.00562
7.87500 0.00365
8.12500 0.01408
8.37500 0.01359
8.62500 0.00734
8.87500 0.02596
9.12500 0.01344
9.37500 0.01315
9.62500 0.01874
9.87500 0.01359
10.12500 0.01307
10.37500 0.00205
10.62500 0.01956
10.87500 0.00612
11.12500 0.00206
11.37500 0.02141
11.62500 0.02972
11.87500 0.00993
12.12500 0.03646
12.37500 0.04079
12.62500 0.02979
12.87500 0.00506
13.12500 0.02051
13.37500 0.01444
13.62500 0.01638
13.87500 0.00914
14.12500 0.02921
14.37500 0.02339
14.62500 0.01264
14.87500 0.01391
