0.05000 3190.09545 -1082.02581 96510.36530 156515.83354 175237.93119 3719809.77232
0.15000 -113277.33807 -3027.91316 -40157.83859 118042.97042 191349.72598 3633878.47301
0.25000 -152314.64154 -125.05207 2596.37421 68244.54953 82880.81969 2840863.76570
0.35000 -111016.28795 54.37130 -19138.01880 33634.07573 36254.94123 2217404.33137
0.45000 -84973.35343 154.59135 -39781.49333 19929.32523 20698.26532 1807291.07342
0.55000 -68032.20811 78.96203 -3903.07501 13150.65312 13419.66790 1518538.83568
0.65000 -56537.32384 56.25883 -15882.30988 10396.97547 10064.60632 1265052.07792
0.75000 -48160.11093 73.97139 -28914.52821 8304.52711 7147.47731 1052115.44818
0.85000 -41796.35315 88.37508 10015.92054 5663.05386 5539.77159 971160.89920
0.95000 -37029.84788 6.80581 -8508.80080 4585.38663 4362.83489 843610.83065
1.05000 -33036.56002 46.42983 -7667.49345 3733.63914 3757.33689 725891.79536
1.15000 -29871.36790 -27.59344 -6635.79268 3288.40288 3153.59419 624837.51524
1.25000 -27340.41022 -5.06839 -8692.18679 2934.45124 2447.74324 603946.06169
1.35000 -25064.50731 -7.04166 -6942.38934 2551.64116 2387.11649 531804.83553
1.45000 -23198.50362 -13.68293 -3643.06493 2252.49961 2005.52212 491119.27230
1.55000 -21590.34001 5.23460 -6094.56183 1914.26117 1925.70047 439996.34424
1.65000 -20175.95185 -6.78560 -1675.57267 3045.59374 2567.66286 412072.53300
1.75000 -18995.34713 -35.36714 -1002.55375 1738.00768 1638.85706 388502.03145
1.85000 -17906.22549 -6.38431 -11074.27733 1512.55808 1421.59290 337206.82689
1.95000 -16901.37990 -9.32267 2690.29795 1526.03072 1497.10045 313572.33862
2.05000 -16060.96423 -27.00929 -2168.18172 1711.93419 1566.79625 319187.32118
2.15000 -15273.79377 -20.39515 -4617.24709 1188.36577 1202.01070 301609.57420
2.25000 -14587.11716 -12.44277 -4103.29656 1152.93731 1159.43565 268600.81601
2.35000 -13945.36207 -27.35699 -361.44806 1049.74971 955.65361 246292.99424
2.45000 -13379.16350 -18.93093 641.67468 1125.64607 1107.63796 230411.76904
2.55000 -12875.11563 -15.80822 -2530.74777 1108.43587 904.64141 217330.43696
2.65000 -12396.79779 -26.91485 247.78293 902.33038 784.53790 215169.28364
2.75000 -11952.12414 -24.06080 -2810.96654 1023.26236 994.89560 191355.03767
2.85000 -11586.02432 -42.78802 1126.69630 1634.46369 2306.38142 172946.71221
2.95000 -11207.41211 -20.11124 -763.46975 867.04559 1304.43472 156386.01715
3.05000 -10865.42770 2.96902 -107.33373 1316.57648 1103.05101 154818.12025
3.15000 -10539.48099 11.90106 -2113.83283 728.19545 670.29063 145537.39042
3.25000 -10283.60646 20.75676 724.76524 811.55873 815.47298 140261.50279
3.35000 -10021.30381 7.98277 506.58133 1296.19339 867.87568 131229.68702
3.45000 -9761.58939 14.68724 -1049.95101 834.81136 953.76000 130274.08723
3.55000 -9536.22709 12.98287 -78.46035 546.34553 625.03264 121741.91448
3.65000 -9291.55869 22.01779 -1990.75140 697.19948 605.95754 114859.64945
3.75000 -9089.19303 25.15969 -1345.68303 574.31509 664.75760 100225.41514
3.85000 -8891.18455 11.93689 708.65309 551.32545 794.12566 118908.63674
3.95000 -8718.05580 25.86257 -981.91656 596.13387 593.26935 91388.11245
4.05000 -8563.85354 13.05057 -1008.61689 601.28450 523.54727 84107.51365
4.15000 -8434.09186 6.10458 500.07974 1890.89952 862.35281 84061.32041
4.25000 -8276.21953 17.44481 -608.39914 455.88755 585.34556 77310.72205
4.35000 -8128.79644 9.40953 -1646.32641 458.81254 462.89935 66742.58031
4.45000 -8012.54490 6.13890 -1137.65537 600.91309 638.34671 66648.77689
4.55000 -7911.61874 -4.94644 -612.63051 554.83829 694.27359 69706.02213
4.65000 -7808.67823 -40.05195 -848.08991 959.18714 3912.81220 58922.76624
4.75000 -7722.14793 -4.73169 -1148.15934 557.36198 627.70379 55221.07679
4.85000 -7647.49313 0.07486 -697.96771 773.56581 1098.37918 56728.00242
4.95000 -7579.72068 11.50259 106.47935 436.51811 428.57180 52608.71307
5.05000 -7473.11960 14.61247 -2053.31963 1254.15335 661.51898 52668.64153
5.15000 -7408.98016 18.53700 1338.95396 564.04479 968.53014 52455.89467
5.25000 -7294.42244 -4.57307 -56.06044 670.78082 1011.97646 42339.46235
5.35000 -7223.01179 3.97564 -354.67508 349.22879 350.89501 41414.37678
5.45000 -7139.80962 12.20349 581.78326 454.26570 375.96848 43293.64480
5.55000 -7060.84908 7.11734 -587.65540 586.34283 321.24032 44731.84911
5.65000 -6964.53783 1.99674 -469.50356 468.04252 364.07851 36508.54750
5.75000 -6891.84653 13.62472 516.82767 365.80965 423.38710 40776.33619
5.85000 -6774.27860 4.30417 135.38883 1372.99211 620.59005 37926.78894
5.95000 -6723.27305 1.55423 57.20828 422.17353 427.58081 33128.94973
6.05000 -6643.19233 5.83654 283.12898 544.03052 391.59458 35084.02520
6.15000 -6564.62629 10.79833 182.79464 990.33205 692.88083 40923.92285
6.25000 -6488.64523 1.96986 144.11476 375.55557 293.86262 29332.40925
6.35000 -6410.33495 3.51586 19.01343 309.89152 287.88967 29964.77067
6.45000 -6324.87752 3.09361 195.43033 393.56080 413.46098 29708.63875
6.55000 -6253.78482 3.24526 -494.15124 370.84130 306.83586 32294.09906
6.65000 -6174.51234 6.39165 175.38691 347.85407 268.04810 26958.24822
6.75000 -6106.84028 -0.15496 717.16637 328.52953 306.06196 26672.65005
6.85000 -6024.49159 -0.43951 152.06265 315.32948 271.12626 24875.19906
6.95000 -5957.16488 -1.60528 -145.22390 375.48352 283.27376 24911.37753
7.05000 -5877.13541 -1.70265 -325.44934 419.87117 367.40911 21434.93551
7.15000 -5834.29342 -0.26422 -384.06978 277.96325 227.54355 22498.09313
7.25000 -5765.13329 -0.31928 127.83126 317.84184 445.94356 24929.43666
7.35000 -5719.94020 14.25149 -405.97324 484.17406 647.26115 22939.64308
7.45000 -5651.05888 -4.50241 248.54685 248.46490 278.06387 19894.09533
7.55000 -5597.26000 6.16260 169.40814 260.69805 373.01439 20204.54522
7.65000 -5546.33515 2.86744 148.65741 323.94472 207.49726 19962.62100
7.75000 -5491.87989 -3.56259 157.42418 219.44063 218.50909 18152.40004
7.85000 -5439.87921 8.66763 31.35624 612.47394 436.44902 18389.47347
7.95000 -5400.31580 5.82120 -95.50042 272.23412 252.24792 20950.09782
8.05000 -5357.64957 1.82394 33.31682 407.88911 577.74023 17163.25577
8.15000 -5306.71637 7.83722 297.32188 473.56453 383.99992 16980.15260
8.25000 -5267.40889 3.25276 24.11534 317.09194 327.32149 17515.57941
8.35000 -5207.39446 -6.39193 516.12489 759.97067 412.84722 18991.03062
8.45000 -5176.86948 3.26157 244.66214 220.96242 230.08208 16459.43043
8.55000 -5132.60555 -0.72141 70.51106 377.10862 229.44300 17186.40876
8.65000 -5091.61207 0.08509 -61.38412 430.52734 445.59906 14220.58051
8.75000 -5048.49040 3.00340 227.90888 220.20871 209.97914 14455.44488
8.85000 -5002.82012 6.34622 -135.02422 217.70772 225.36349 14650.52567
8.95000 -4957.08417 -1.08671 362.79833 347.64716 378.34974 17215.54085
9.05000 -4923.07856 -7.57384 300.97253 293.45992 689.13076 15511.61211
9.15000 -4874.88537 -3.27182 84.19505 193.12008 201.70835 15024.27732
9.25000 -4836.41215 -0.64378 431.35739 191.71099 309.39391 13537.66330
9.35000 -4786.46051 4.87708 105.84800 258.36757 165.68112 14754.15269
9.45000 -4741.39157 5.49094 311.21990 232.63837 173.11460 13214.55428
9.55000 -4713.33555 -2.24157 719.97524 238.09914 220.04968 12563.83210
9.65000 -4662.44101 -0.74013 634.69119 240.73418 205.23633 12346.03118
9.75000 -4620.95945 -0.11463 43.98116 154.17513 178.18972 17440.65642
9.85000 -4581.15159 -2.25180 -432.99678 241.33464 292.97266 13033.44480
9.95000 -4540.75660 8.69152 30.58102 218.12272 301.15571 10460.74772
10.05000 -4495.49180 0.51290 458.60444 243.52332 231.39029 11849.69851
10.15000 -4462.16227 0.37979 165.86317 385.97553 169.82204 10390.08499
10.25000 -4421.65801 -10.17839 594.37659 463.16911 479.51155 10046.55807
10.35000 -4371.38074 -2.73634 293.16060 216.91273 164.80541 15060.12282
10.45000 -4339.79479 1.36928 159.35405 161.35590 255.05383 9788.70951
10.55000 -4301.18025 3.11263 15.58515 146.86782 120.91352 9447.16235
10.65000 -4264.85449 -15.12985 99.92676 220.01120 820.31399 8704.17337
10.75000 -4228.34242 -0.93007 148.05332 162.31884 165.43198 9423.07017
10.85000 -4191.49967 -0.69121 145.84849 124.03257 118.56612 8823.19825
10.95000 -4154.07450 2.78327 226.80892 162.01214 147.02758 9128.62280
11.05000 -4121.82218 -1.05351 432.64408 234.52744 131.87114 9023.70579
11.15000 -4091.28499 1.12870 26.96256 128.36517 119.83253 8556.91576
11.25000 -4052.20999 -2.66463 96.77635 154.60985 200.42006 7761.12071
11.35000 -4012.40449 -3.22861 305.32808 118.10392 109.60067 7372.49196
11.45000 -3976.94751 -1.48817 300.46325 170.61856 122.84656 6357.50666
11.55000 -3945.99716 -0.44095 -245.07683 118.04644 114.88960 7680.06794
11.65000 -3918.08893 -18.12513 322.88365 390.54761 631.03185 6961.54560
11.75000 -3889.01344 -12.99397 30.29230 251.64779 567.06492 6750.22009
11.85000 -3846.49024 -3.01883 57.92136 1358.67032 1724.61859 6599.78222
11.95000 -3821.63228 1.90615 -85.44892 173.22707 102.67157 6679.25481
12.05000 -3797.28481 6.35403 -1.98256 278.61925 263.74095 5765.00271
12.15000 -3764.81088 1.77224 39.76700 125.27365 83.46047 5764.57713
12.25000 -3740.17209 -39.87512 14.56663 218.75394 1655.80773 5720.10124
12.35000 -3699.83238 0.66379 -6.01059 144.32029 114.41752 4420.49920
12.45000 -3670.25509 -1.57307 -4.75780 114.54860 90.21848 5622.93156
12.55000 -3642.76927 1.66554 26.05010 85.70241 101.94963 4747.71800
12.65000 -3618.46953 0.83079 64.91825 120.44394 217.29530 5919.43301
12.75000 -3589.86700 0.30653 -46.44142 126.09119 115.18322 4456.95387
12.85000 -3552.26764 0.93772 -227.21671 120.20005 102.38388 6233.48824
12.95000 -3540.49664 -2.53891 -166.11890 282.47112 106.34744 4994.29144
13.05000 -3498.09335 -0.41739 218.43292 89.76344 68.89499 4875.90271
13.15000 -3467.93194 2.04878 122.15323 90.84821 170.08116 4549.27405
13.25000 -3443.08978 4.15375 66.04052 77.97509 84.29188 3842.83213
13.35000 -3413.90826 -0.38766 200.62415 75.09445 79.59337 5415.01765
13.45000 -3394.74939 -4.44740 -65.96765 126.84483 115.68936 4245.19503
13.55000 -3376.80757 3.58807 -15.87093 215.18198 146.86388 4118.35377
13.65000 -3341.13978 -1.07572 179.29923 90.28906 60.33340 3628.96890
13.75000 -3309.58792 1.85790 6.20811 68.98254 79.02891 4408.68397
13.85000 -3283.30135 -1.21088 25.67584 86.66182 92.70293 3752.22744
13.95000 -3259.93270 -0.91474 225.17296 79.43348 82.07455 4072.65905
14.05000 -3239.36613 0.68839 76.97399 148.06310 167.18637 4237.02696
14.15000 -3206.69251 1.26858 -145.02046 72.42342 64.44034 4033.57478
14.25000 -3182.72894 0.86891 -10.03368 70.42786 70.24997 4530.95696
14.35000 -3158.18138 -4.32031 -66.58150 85.91788 131.71269 3291.52785
14.45000 -3139.06643 8.95588 32.39126 141.18679 146.11513 5374.48715
14.55000 -3108.45846 2.38535 -42.55296 98.03695 104.36551 3015.88137
14.65000 -3084.69674 -1.03314 118.74379 71.39686 138.38070 3714.82000
14.75000 -3064.88691 0.50240 149.31946 66.19053 101.54853 3345.66620
14.85000 -3037.66135 1.81467 117.01471 256.56780 335.78865 2661.57414
14.95000 -3019.78388 -4.61176 89.41428 108.42479 155.19489 2927.38721
15.05000 -2995.83515 2.35940 63.45460 105.43058 85.05865 2652.10725
15.15000 -2975.98887 0.25184 197.39562 189.43397 193.38628 2757.48990
15.25000 -2948.84439 2.52874 183.70318 66.86663 64.09837 2678.53453
15.35000 -2935.85209 5.50007 234.39116 75.52687 59.41444 2347.46883
15.45000 -2910.64658 2.29997 353.60947 71.96790 62.52579 3183.07104
15.55000 -2894.89938 4.31261 0.33651 58.14134 55.02208 2229.93032
15.65000 -2875.67856 1.53266 149.50589 123.91357 101.45392 2363.40962
15.75000 -2857.21423 -1.67682 42.04542 60.13841 49.09922 2354.04659
15.85000 -2837.54869 1.88058 12.20298 67.63666 62.75278 2759.50881
15.95000 -2813.57471 -4.46297 -29.98333 209.42450 93.88875 2469.59407
16.05000 -2793.69190 4.46216 -79.45059 75.50243 76.04275 3527.54388
16.15000 -2784.53146 -3.40574 76.15519 76.12900 79.07231 1714.55264
16.25000 -2757.46590 0.24077 -85.19235 83.66864 53.60381 3246.77008
16.35000 -2743.21803 1.13776 -63.05840 189.82844 71.98717 2001.87951
16.45000 -2728.63804 0.98150 -87.69293 71.36168 56.69795 2604.62652
16.55000 -2721.54045 1.41687 33.53056 241.32605 80.69414 1990.16540
16.65000 -2691.59228 1.33763 57.87205 56.07696 52.81391 1820.98749
16.75000 -2677.21468 2.64615 -34.26613 58.73909 64.88194 2196.38504
16.85000 -2658.30038 1.70558 207.47055 81.31865 97.98216 2270.48008
16.95000 -2642.48652 -1.36480 53.82240 78.42686 85.62987 1761.18792
17.05000 -2656.43608 -39.63877 -111.15440 529.07113 831.36273 3190.06967
17.15000 -2609.30130 -1.83273 -91.60525 63.39135 54.59654 2160.69763
17.25000 -2594.49495 1.99292 5.84745 87.30169 64.54472 2040.04128
17.35000 -2571.69255 2.49319 -158.41141 84.01417 70.83188 2068.14607
17.45000 -2565.93897 -3.16256 -136.03801 51.32249 54.36002 2875.25403
17.55000 -2542.94887 -5.51813 140.46772 87.20621 85.80628 2937.59000
17.65000 -2529.31618 -3.05814 -137.65429 57.54899 58.18771 1826.21468
17.75000 -2516.01953 -2.29182 -142.68566 52.64318 50.16461 2263.38197
17.85000 -2475.66443 2.73389 -394.91321 428.35058 51.63476 2651.88564
17.95000 -2483.82094 3.95899 -401.40080 55.58561 53.82842 2830.63428
18.05000 -2464.18324 -21.37369 -241.70550 60.66406 231.79763 2281.44477
18.15000 -2454.66714 -3.53561 -88.04395 65.96183 64.92005 1981.27402
18.25000 -2442.84191 0.80198 1.87979 56.97670 75.45000 2576.00650
18.35000 -2428.71892 3.22633 -3.80228 48.69030 54.97970 2007.61793
18.45000 -2410.11992 -0.91367 39.48560 73.90552 44.07819 2023.63579
18.55000 -2394.22168 -2.05894 -221.45766 49.68194 57.87100 2293.68397
18.65000 -2377.49931 8.68747 -86.41168 61.53240 62.24437 2525.35620
18.75000 -2370.07602 0.56659 -123.73646 51.29341 42.46881 2202.19050
18.85000 -2359.74678 1.48876 -363.96192 50.81410 47.55647 2307.54050
18.95000 -2337.13455 3.30525 -136.01617 80.10902 81.22276 2219.77959
19.05000 -2326.89902 0.41435 -87.49439 54.91951 65.32335 1886.46629
19.15000 -2311.82182 7.45536 -206.81541 50.69459 53.42300 1940.14923
19.25000 -2293.39561 9.09978 -296.93856 69.00916 55.83170 2051.73101
19.35000 -2285.66280 4.35706 -11.89459 60.19229 52.64361 1638.55626
19.45000 -2267.67941 0.58178 -261.34674 50.11014 41.83223 1885.16346
19.55000 -2265.14540 7.60795 -278.51635 80.76375 64.23410 1815.84549
19.65000 -2240.09403 9.08273 -99.46686 51.12297 44.55993 2339.57752
19.75000 -2232.64346 4.08710 -76.61528 39.81721 49.58746 1657.01022
19.85000 -2214.71741 -13.29181 34.73817 107.29202 233.77794 2447.04481
19.95000 -2206.43645 9.54381 -299.95896 51.66182 43.13953 3346.17978
