0.125 0.001 0.002 0.013
0.375 -0.007 0.001 0.164
0.625 -0.002 0.011 0.537
0.875 0.010 0.016 1.015
1.125 0.028 0.038 1.582
1.375 0.034 0.018 2.077
1.625 0.057 0.053 2.600
1.875 0.046 0.044 3.246
2.125 0.051 0.093 3.872
2.375 0.059 0.103 4.682
2.625 0.057 0.110 5.558
2.875 0.095 0.071 6.645
3.125 0.106 0.094 7.959
3.375 0.116 0.148 9.436
3.625 0.115 0.178 11.156
3.875 0.119 0.207 13.251
4.125 0.184 0.203 15.263
4.375 0.129 0.183 16.327
4.625 0.193 0.250 17.663
4.875 0.181 0.211 18.431
5.125 0.161 0.292 18.871
5.375 0.235 0.254 20.263
5.625 0.220 0.298 20.555
5.875 0.250 0.303 21.287
6.125 0.202 0.327 21.623
6.375 0.141 0.338 22.158
6.625 0.191 0.329 22.702
6.875 0.210 0.293 22.201
7.125 0.220 0.315 22.539
7.375 0.211 0.356 23.403
7.625 0.198 0.297 23.411
7.875 0.185 0.292 23.143
8.125 0.187 0.304 23.524
8.375 0.185 0.301 23.431
8.625 0.204 0.300 23.811
8.875 0.171 0.254 23.487
9.125 0.159 0.278 23.663
9.375 0.205 0.263 24.203
9.625 0.195 0.257 24.774
9.875 0.214 0.251 25.029
10.125 0.231 0.270 25.188
10.375 0.206 0.222 25.333
10.625 0.216 0.260 25.480
10.875 0.219 0.282 26.075
11.125 0.238 0.214 25.633
11.375 0.263 0.200 24.743
11.625 0.221 0.209 24.459
11.875 0.229 0.199 24.042
12.125 0.251 0.228 22.729
12.375 0.244 0.139 22.374
12.625 0.277 0.197 21.542
12.875 0.296 0.147 21.002
13.125 0.281 0.133 20.755
13.375 0.278 0.158 20.135
13.625 0.306 0.146 20.216
13.875 0.291 0.166 20.086
14.125 0.281 0.160 19.329
14.375 0.311 0.112 18.344
14.625 0.241 0.210 17.842
14.875 0.282 0.209 17.359
15.125 0.272 0.189 16.778
15.375 0.269 0.186 15.885
15.625 0.235 0.216 15.812
15.875 0.273 0.198 15.699
16.125 0.219 0.193 14.814
16.375 0.219 0.255 14.244
16.625 0.215 0.194 14.512
16.875 0.180 0.207 13.556
17.125 0.174 0.219 12.817
17.375 0.168 0.219 12.854
17.625 0.185 0.220 12.141
17.875 0.156 0.221 11.654
18.125 0.131 0.218 11.421
18.375 0.163 0.209 11.186
18.625 0.093 0.225 10.401
18.875 0.102 0.232 10.277
19.125 0.077 0.240 9.934
19.375 0.041 0.218 9.079
19.625 0.028 0.200 9.086
19.875 0.021 0.199 8.642
