0.120000 -0.210680
0.380000 0.551390
0.620000 0.730560
0.880000 0.630980
1.120000 0.675640
1.380000 0.670920
1.620000 0.667850
1.880000 0.643490
2.120000 0.688590
2.380000 0.670640
2.620000 0.681270
2.880000 0.667770
3.120000 0.645590
3.380000 0.684710
3.620000 0.642460
3.880000 0.687090
4.120000 0.651900
4.380000 0.653060
4.620000 0.680280
4.880000 0.660420
5.120000 0.688480
5.380000 0.650000
5.620000 0.925070
5.880000 0.151400
6.120000 0.415930
6.380000 -0.272310
6.620000 -0.401970
6.880000 0.444730
7.120000 -0.917050
7.380000 -1.005150
7.620000 -0.782310
7.880000 -1.240190
8.120000 -0.801150
8.380000 -0.985690
8.620000 -1.085640
8.880000 -1.595600
9.120000 -1.459590
9.380000 -1.432710
9.620000 -1.806180
9.880000 -1.706780
10.120000 -1.168060
10.380000 -0.841510
10.620000 -1.331850
10.880000 -2.045120
11.120000 -1.701030
11.380000 2.121770
11.620000 0.798780
11.880000 0.594150
12.120000 0.733260
12.380000 0.548790
12.620000 0.325620
12.880000 1.464770
13.120000 1.651730
13.380000 1.393520
13.620000 -2.234210
13.880000 -2.638300
14.120000 -3.000930
14.380000 2.772970
14.620000 2.747590
14.880000 3.120800
