0.05000 3912.80473
0.15000 6315.85504
0.25000 8282.06458
0.35000 10070.94793
0.45000 11372.14176
0.55000 12185.89310
0.65000 12330.33267
0.75000 12341.42579
0.85000 12007.22273
0.95000 11753.04287
1.05000 11187.63153
1.15000 10642.80164
1.25000 10158.31070
1.35000 9601.15549
1.45000 9141.11154
1.55000 8593.00932
1.65000 8170.26064
1.75000 7778.63642
1.85000 7392.73489
1.95000 7047.43939
2.05000 6725.72734
2.15000 6390.59991
2.25000 6114.28034
2.35000 5840.40443
2.45000 5596.56433
2.55000 5349.85985
2.65000 5198.60627
2.75000 4964.67369
2.85000 4734.99334
2.95000 4566.48003
3.05000 4386.63850
3.15000 4228.71594
3.25000 4127.05010
3.35000 3963.40885
3.45000 3777.61690
3.55000 3713.04519
3.65000 3586.45464
3.75000 3411.60595
3.85000 3318.38084
3.95000 3222.04265
4.05000 3157.06174
4.15000 3077.51206
4.25000 2922.75947
4.35000 2837.28670
4.45000 2773.16905
4.55000 2665.58879
4.65000 2583.12937
4.75000 2481.41319
4.85000 2420.86628
4.95000 2329.09511
5.05000 2247.79403
5.15000 2177.65008
5.25000 2070.76962
5.35000 2012.91709
5.45000 1911.46764
5.55000 1874.63769
5.65000 1849.71103
5.75000 1750.91329
5.85000 1695.25683
5.95000 1659.75022
6.05000 1584.95802
6.15000 1532.94489
6.25000 1490.10888
6.35000 1447.38135
6.45000 1384.10545
6.55000 1338.92984
6.65000 1295.97616
6.75000 1249.98563
6.85000 1240.85576
6.95000 1181.87419
7.05000 1150.27098
7.15000 1140.48505
7.25000 1111.87939
7.35000 1078.27992
7.45000 1055.98368
7.55000 1030.11985
7.65000 986.06594
7.75000 965.27983
7.85000 949.57413
7.95000 899.90202
8.05000 869.43916
8.15000 831.43309
8.25000 812.67462
8.35000 779.68127
8.45000 757.37483
8.55000 734.55830
8.65000 704.68465
8.75000 666.57706
8.85000 645.62336
8.95000 636.67113
9.05000 605.77606
9.15000 599.55890
9.25000 577.67169
9.35000 557.15683
9.45000 536.84244
9.55000 527.45181
9.65000 517.04821
9.75000 501.07108
9.85000 491.81245
9.95000 476.58872
10.05000 473.86179
10.15000 467.82651
10.25000 460.55082
10.35000 450.79408
10.45000 439.84039
10.55000 428.07455
10.65000 420.08877
10.75000 412.71808
10.85000 410.08413
10.95000 393.24588
11.05000 396.28903
11.15000 389.55896
11.25000 381.27287
11.35000 370.54626
11.45000 372.78711
11.55000 357.09273
11.65000 359.78489
11.75000 348.15408
11.85000 333.40188
11.95000 325.08154
12.05000 318.97550
12.15000 316.39474
12.25000 307.83122
12.35000 304.22729
12.45000 301.47916
12.55000 286.67790
12.65000 279.21376
12.75000 283.24647
12.85000 260.26419
12.95000 265.71289
13.05000 265.02159
13.15000 244.53302
13.25000 244.41670
13.35000 233.06796
13.45000 241.91941
13.55000 235.64734
13.65000 227.50866
13.75000 218.01598
13.85000 210.05640
13.95000 204.35459
14.05000 205.36937
14.15000 196.54125
14.25000 202.24695
14.35000 193.85290
14.45000 192.86257
14.55000 186.04660
14.65000 180.24678
14.75000 176.43541
14.85000 174.76043
14.95000 175.56416
15.05000 172.23625
15.15000 162.67251
15.25000 151.40679
15.35000 161.96695
15.45000 156.39349
15.55000 160.13906
15.65000 151.10689
15.75000 147.43924
15.85000 154.41878
15.95000 145.28487
16.05000 146.14707
16.15000 144.83971
16.25000 140.82430
16.35000 137.55356
16.45000 143.29330
16.55000 127.80602
16.65000 131.14003
16.75000 137.41051
16.85000 127.61844
16.95000 120.36499
17.05000 117.43501
17.15000 130.22056
17.25000 119.66908
17.35000 119.78925
17.45000 126.70788
17.55000 119.48913
17.65000 127.43108
17.75000 118.38474
17.85000 115.38678
17.95000 111.34563
18.05000 114.49751
18.15000 111.03163
18.25000 117.62470
18.35000 111.79261
18.45000 100.74467
18.55000 113.08653
18.65000 107.57314
18.75000 109.39999
18.85000 108.08463
18.95000 105.15111
19.05000 106.99284
19.15000 112.65745
19.25000 101.71204
19.35000 94.84461
19.45000 102.54325
19.55000 104.95893
19.65000 97.84298
19.75000 97.00266
19.85000 89.96089
19.95000 96.62574
