0.2 -0.24031 16.82 -0.33779 112.02261 109.72347 88.39065
0.6 0.78798 38.86313 0.51122 111.1219 103.28659 85.68547
1.0 -0.55943 57.31247 2.21789 111.09289 95.6531 82.05957
1.4 0.54701 68.29238 1.02841 109.56445 88.65667 78.79678
1.8 -0.62699 77.22611 1.90297 108.69763 84.11185 74.64164
2.2 0.5375 83.61216 1.29052 105.99136 80.00425 70.71591
2.6 0.74173 88.67302 0.96305 102.09013 76.46981 66.3736
3.0 0.05115 91.76486 0.61795 97.82277 72.98314 61.52782
3.4 1.05977 96.74388 -0.29536 93.46297 70.45481 58.98388
3.8 0.19448 102.79076 -0.5047 86.76176 68.98221 57.25447
4.2 -0.0743 110.14811 -0.81444 81.17018 67.83641 55.26024
4.6 1.78632 120.51457 -0.95925 73.99207 69.10721 52.18612
5.0 0.69456 129.86246 -1.25335 66.63821 69.24369 49.04303
5.4 1.29543 144.2532 0.51121 60.79968 66.10965 46.74819
5.8 2.34593 155.89726 0.27356 55.24503 60.26427 43.27323
6.2 3.19836 167.39398 0.05593 50.01556 51.94232 40.11848
6.6 1.66869 175.91695 0.48586 45.68275 45.19648 36.63097
7.0 1.06813 182.71726 0.0278 42.58391 39.26729 33.60337
7.4 0.12922 187.9083 -0.42429 40.38294 35.79299 31.25837
7.8 0.02155 191.24019 -0.61021 38.09919 32.07706 29.01815
8.2 0.20329 192.48823 -1.13722 37.62502 29.70811 27.7477
8.6 0.65072 192.89361 -1.35228 37.09985 28.64663 26.35428
9.0 0.98187 193.24347 -1.28782 37.2296 27.36161 25.36842
9.4 0.92371 194.85379 -1.4517 36.83303 26.64523 24.10857
9.8 -0.12609 196.19291 -1.16747 35.78203 25.40064 23.06154
10.2 0.32847 197.83822 -1.05237 35.19139 24.31466 22.13502
10.6 0.56299 198.99866 -0.92019 33.03468 23.1332 21.3013
11.0 0.57089 200.25916 -1.01424 31.41315 22.23663 20.88612
11.4 0.09018 200.75966 -0.60316 29.33833 22.35719 19.87319
11.8 0.76374 200.72337 -0.96485 28.24392 22.47223 19.31251
12.2 0.86317 201.08488 -0.85003 26.57556 22.85011 18.58295
12.6 0.72388 201.87851 -1.13255 24.98027 22.38176 18.02011
13.0 0.30414 202.83914 -0.87283 23.58712 21.90864 17.30716
13.4 -0.20141 204.84162 -1.4694 23.3047 20.20163 16.83062
13.8 -0.46586 206.38823 -1.63905 22.21578 18.78833 16.1976
14.2 -0.20133 208.01242 -1.48386 21.35718 17.10972 15.84214
14.6 -0.30033 208.99663 -1.31433 20.80947 17.09859 15.12931
15.0 0.10447 210.20726 -0.94523 20.16473 15.73836 14.60261
15.4 0.62302 210.62131 -0.55509 19.72136 14.80908 14.65125
15.8 0.0634 210.44465 -0.28806 18.97542 13.42233 14.41978
16.2 1.19283 209.76222 -0.07604 18.99192 12.74288 14.05763
16.6 1.13411 209.16692 0.49474 18.17315 11.94244 13.6873
17.0 1.59185 208.13472 1.23414 17.88441 11.84099 13.10966
17.4 0.87031 207.46606 0.99065 17.73845 12.14306 12.6508
17.8 1.10368 207.18502 1.4676 17.05226 12.83018 12.33665
18.2 0.44969 207.10224 1.08951 16.09255 12.89371 11.61497
18.6 -0.26168 207.70486 1.2875 15.64919 12.90615 11.0359
19.0 -0.74284 207.7873 1.41787 15.13556 12.97874 11.02159
19.4 -0.29943 208.79806 0.60939 15.04301 11.95374 10.51255
19.8 -0.83617 209.11924 0.99497 14.40329 10.49223 10.12224
