0.12500 0.02244
0.37500 0.05435
0.62500 0.11255
0.87500 0.16250
1.12500 0.22084
1.37500 0.24534
1.62500 0.29894
1.87500 0.36048
2.12500 0.40943
2.37500 0.45318
2.62500 0.45685
2.87500 0.44384
3.12500 0.44011
3.37500 0.41420
3.62500 0.40433
3.87500 0.36591
4.12500 0.33210
4.37500 0.28570
4.62500 0.25846
4.87500 0.24746
5.12500 0.23793
5.37500 0.21878
5.62500 0.20231
5.87500 0.18355
6.12500 0.16711
6.37500 0.15024
6.62500 0.12729
6.87500 0.10960
7.12500 0.08528
7.37500 0.06252
7.62500 0.05935
7.87500 0.03984
8.12500 0.05437
8.37500 0.07626
8.62500 0.08702
8.87500 0.09609
9.12500 0.07114
9.37500 0.03801
9.62500 0.03030
9.87500 0.02968
10.12500 0.06590
10.37500 0.08227
10.62500 0.09526
10.87500 0.09875
11.12500 0.11673
11.37500 0.11033
11.62500 0.12501
11.87500 0.11375
12.12500 0.08789
12.37500 0.10255
12.62500 0.08162
12.87500 0.07701
13.12500 0.07036
13.37500 0.04005
13.62500 0.03147
13.87500 0.01681
14.12500 0.03034
14.37500 0.04303
14.62500 0.01990
14.87500 0.04393
