0.15 0.20007 12.42883 2.60109 72.13635 73.04248 69.80315
0.45 -1.773 26.99159 1.63889 70.99138 72.29179 68.33635
0.75 0.46504 46.38629 1.01281 70.10035 68.94389 66.17285
1.05 -0.49957 61.74655 0.19715 66.38832 67.23815 63.72042
1.35 0.44113 75.96704 -0.2225 63.91622 63.49351 61.40292
1.65 0.09892 90.52817 0.06599 61.53206 61.86266 59.10784
1.95 0.1262 102.6662 0.4515 60.0122 58.21824 56.51126
2.25 0.38895 111.5824 0.2185 58.77666 56.83977 55.66785
2.55 0.21833 119.64648 -0.49903 56.71675 54.20048 53.24187
2.85 -0.34041 127.22524 -0.4596 54.45064 52.43282 51.78389
3.15 -0.17698 134.44275 -0.33057 52.76296 50.34127 50.01859
3.45 -0.06685 140.3471 0.10271 51.08628 48.64351 48.30974
3.75 -0.92993 146.68165 -0.11221 49.99469 47.003 46.52049
4.05 -0.23395 152.61514 -0.0536 48.14037 45.47518 45.2911
4.35 -0.21413 158.23778 -0.35098 46.83844 43.72472 44.18549
4.65 0.28943 164.04238 -0.33162 45.9392 41.50051 42.3124
4.95 0.97404 167.86793 -0.21811 44.35816 39.76078 40.8995
5.25 1.1236 171.48683 -0.03879 43.78564 38.19593 39.56322
5.55 1.19584 175.46837 -0.23726 42.83216 37.38065 38.25383
5.85 1.54236 178.66868 0.62635 41.8582 36.07722 37.1639
6.15 1.58174 182.15769 0.53973 40.79366 34.8867 35.49003
6.45 1.50812 185.41348 1.27374 39.52122 33.99452 34.66973
6.75 1.26734 188.24533 0.9005 38.49644 32.95316 33.62303
7.05 1.36285 190.97846 1.19965 37.17014 31.7984 32.53517
7.35 1.37181 193.29592 1.35319 36.31274 30.74627 31.53135
7.65 1.7724 194.93741 0.83107 35.5496 29.52428 30.94077
7.95 1.88635 197.09071 1.06217 35.10239 28.31708 29.95382
8.25 1.25588 198.4039 0.34984 34.01503 27.61425 29.20404
8.55 1.34791 200.01003 0.87593 33.26281 26.965 28.03191
8.85 0.54368 201.746 -0.2132 32.72368 26.26646 27.29455
9.15 0.47981 203.18832 -0.17036 31.90893 25.28352 26.28916
9.45 -0.06435 204.79556 -0.42989 30.59292 24.88808 25.54758
9.75 0.35762 205.38881 -0.74618 29.86649 23.98727 24.59349
10.05 0.01099 206.44685 -0.63746 29.20368 22.82561 23.96459
10.35 0.40434 206.99975 -0.7687 28.38672 22.67841 23.26714
10.65 -0.23162 207.92965 -0.96678 27.46999 21.72303 22.48812
10.95 -0.35454 208.86568 -0.858 26.84394 21.24868 21.89966
11.25 0.12605 209.5516 -0.73955 26.32934 20.66645 21.65555
11.55 -0.0658 210.4068 -0.09176 25.55743 20.19472 21.11312
11.85 0.67063 210.65671 0.16477 25.0693 19.40186 20.37253
12.15 -0.14582 211.17477 0.29498 24.6533 18.56114 19.49135
12.45 -0.00163 210.91664 0.45144 23.87454 18.15828 19.34386
12.75 0.39489 210.92367 0.05303 23.75349 17.7213 18.34921
13.05 -0.01739 211.88993 -0.14094 23.06125 17.62718 17.98751
13.35 -0.1477 212.3507 -0.12843 21.96112 16.84179 17.39922
13.65 0.22518 212.89147 -0.47701 21.77939 16.83058 17.1073
13.95 -0.21785 213.56014 -1.01484 20.88396 15.84466 16.26864
14.25 0.50704 213.76031 -0.96933 20.67148 15.58302 15.836
14.55 0.5738 213.25921 -1.03882 20.16511 15.37167 15.78455
14.85 0.76256 213.50376 -1.10312 19.89035 14.52307 15.12653
15.15 0.02038 212.91157 -1.1034 19.31911 14.04311 14.99692
15.45 0.06656 212.87259 -1.86543 18.62045 13.5318 14.33479
15.75 -0.0945 212.49005 -1.69063 18.45349 13.88455 14.15296
16.05 -0.25538 213.14227 -1.04307 17.49787 13.82862 13.84243
16.35 0.75076 213.65011 -1.13129 17.88424 13.73728 13.39307
16.65 0.29299 213.49403 -1.21882 17.25859 12.86822 12.95096
16.95 -0.23959 213.39295 -1.10748 16.83513 12.6137 13.03608
17.25 1.00666 213.50968 -0.59511 16.43967 11.82044 12.46039
17.55 1.2433 212.99602 -0.5167 16.45395 11.65563 12.25836
17.85 0.59759 212.94631 -0.39372 15.56869 12.09936 11.93102
18.15 1.02956 213.03398 0.31484 15.62953 11.79476 11.36879
18.45 0.61415 213.10738 0.55959 15.13437 11.90411 11.28251
18.75 0.6055 213.64049 0.84702 14.40864 11.28467 11.01827
19.05 0.8745 213.57451 0.54675 14.53111 10.91676 10.72583
19.35 0.60926 212.90407 0.34314 14.13322 10.51153 10.37006
19.65 0.04379 212.61016 -0.06355 13.92231 10.01178 10.24059
19.95 0.11244 212.20149 -0.05396 14.17022 9.84173 10.31667
20.25 -0.57478 211.51802 -0.24169 13.82264 9.72679 10.13128
20.55 -0.37382 212.00873 -0.6577 12.99518 10.23242 9.89204
20.85 -0.7888 211.9687 -1.35318 13.09129 9.83552 9.68236
21.15 -1.03811 212.78099 -0.92741 12.44344 9.20518 9.24045
21.45 0.42657 212.74825 -1.06879 11.99159 9.01479 8.80675
21.75 1.62472 212.57856 -0.7802 11.42294 9.01273 8.79788
22.05 2.24597 211.77512 -0.74777 11.90158 8.77194 8.62908
22.35 1.52711 211.9883 -0.86089 11.80337 8.13432 8.38145
22.65 1.47078 211.23259 -0.70719 11.44399 7.63276 8.56901
22.95 2.25255 210.799 -1.19518 11.21331 7.91193 8.21203
23.25 0.95739 210.29152 -1.38695 11.08375 7.97235 8.08672
23.55 0.91621 210.74819 -2.17523 10.87731 7.50956 7.8847
23.85 -0.66664 210.06722 -1.37769 11.18427 7.45723 7.84322
24.15 -0.15903 209.8944 -1.91441 10.62888 7.5035 7.46225
24.45 -0.67065 209.51339 -2.14561 9.62937 7.78717 7.27547
24.75 -1.07835 209.64545 -1.04455 9.53196 7.01303 6.96956
25.05 -0.94751 208.89644 -0.62827 9.62132 7.52919 7.55379
25.35 -0.69825 209.43342 -0.48013 9.93654 7.95613 7.39688
25.65 0.7556 210.04358 -0.48417 8.59221 6.31414 6.51328
25.95 1.20283 209.83105 -0.29417 8.84257 5.75726 6.60041
26.25 0.85985 209.48891 -0.97822 9.05631 5.84039 6.74747
26.55 1.5994 208.35733 -0.67368 8.98821 5.8388 6.71536
26.85 0.42661 207.52144 -0.71637 8.1556 5.73686 6.3683
27.15 0.69013 206.67009 -1.0795 8.71712 6.19923 6.24272
27.45 -0.35647 207.27621 -1.19362 8.25218 5.8925 6.67249
27.75 -0.44657 207.15849 -1.29095 7.88708 6.19372 6.01557
28.05 -0.56998 207.21359 -1.015 7.63407 5.6948 5.70407
28.35 0.10987 206.91636 -1.31318 6.99883 5.33991 5.70133
28.65 -0.54461 206.80034 -1.27346 8.65103 4.58928 5.87978
28.95 -0.37976 205.88821 -1.07359 8.15161 4.6632 5.91016
29.25 -0.39685 206.3399 -0.75813 7.07976 4.42536 5.69035
29.55 -0.62206 205.41704 -1.04021 6.8653 4.61866 5.63723
29.85 -1.31526 204.95457 -0.83701 6.766 4.72464 5.74382
