0.12500 0.03061
0.37500 0.05613
0.62500 0.11594
0.87500 0.17845
1.12500 0.23332
1.37500 0.27158
1.62500 0.31404
1.87500 0.33602
2.12500 0.35919
2.37500 0.38138
2.62500 0.40997
2.87500 0.42268
3.12500 0.44910
3.37500 0.47532
3.62500 0.49302
3.87500 0.51218
4.12500 0.54419
4.37500 0.55013
4.62500 0.56364
4.87500 0.55415
5.12500 0.55264
5.37500 0.53044
5.62500 0.51252
5.87500 0.48030
6.12500 0.45078
6.37500 0.39802
6.62500 0.36213
6.87500 0.33760
7.12500 0.29404
7.37500 0.27045
7.62500 0.21324
7.87500 0.18122
8.12500 0.14090
8.37500 0.10794
8.62500 0.05763
8.87500 0.03187
9.12500 0.00844
9.37500 0.04923
9.62500 0.08055
9.87500 0.09130
10.12500 0.11589
10.37500 0.11469
10.62500 0.12536
10.87500 0.10576
11.12500 0.10388
11.37500 0.07555
11.62500 0.06602
11.87500 0.03931
12.12500 0.02901
12.37500 0.02978
12.62500 0.04846
12.87500 0.05374
13.12500 0.07777
13.37500 0.08630
13.62500 0.07886
13.87500 0.07443
14.12500 0.05919
14.37500 0.04026
14.62500 0.05943
14.87500 0.06605
15.12500 0.05542
15.37500 0.07426
15.62500 0.07658
15.87500 0.10013
16.12500 0.08522
16.37500 0.09137
16.62500 0.10402
16.87500 0.12627
17.12500 0.11336
17.37500 0.13064
17.62500 0.11408
17.87500 0.09451
18.12500 0.07115
18.37500 0.06744
18.62500 0.06136
18.87500 0.06037
19.12500 0.07112
19.37500 0.05558
19.62500 0.03501
19.87500 0.02540
