0.12500 0.03766
0.37500 0.07557
0.62500 0.14359
0.87500 0.18944
1.12500 0.22829
1.37500 0.27816
1.62500 0.26047
1.87500 0.28132
2.12500 0.27583
2.37500 0.26615
2.62500 0.24250
2.87500 0.20478
3.12500 0.14639
3.37500 0.10005
3.62500 0.08093
3.87500 0.09354
4.12500 0.10373
4.37500 0.08680
4.62500 0.09350
4.87500 0.07016
5.12500 0.06064
5.37500 0.04490
5.62500 0.05204
5.87500 0.06452
6.12500 0.06673
6.37500 0.07862
6.62500 0.06255
6.87500 0.05798
7.12500 0.03709
7.37500 0.01033
7.62500 0.04721
7.87500 0.05530
8.12500 0.07086
8.37500 0.06934
8.62500 0.07643
8.87500 0.06755
9.12500 0.04278
9.37500 0.01711
9.62500 0.01999
9.87500 0.02428
10.12500 0.01098
10.37500 0.02947
10.62500 0.00864
10.87500 0.03301
11.12500 0.04116
11.37500 0.07210
11.62500 0.04878
11.87500 0.04948
12.12500 0.08411
12.37500 0.08365
12.62500 0.00679
12.87500 0.06954
13.12500 0.05732
13.37500 0.05724
13.62500 0.10095
13.87500 0.02536
14.12500 0.04203
14.37500 0.04100
14.62500 0.03072
14.87500 0.10509
15.12500 0.06623
15.37500 0.02543
15.62500 0.04286
15.87500 0.08671
16.12500 0.06927
16.37500 0.06333
16.62500 0.02902
16.87500 0.11904
17.12500 0.04123
17.37500 0.03951
17.62500 0.08581
17.87500 0.07421
18.12500 0.09308
18.37500 0.11457
18.62500 0.13654
18.87500 0.12115
19.12500 0.14010
19.37500 0.10502
19.62500 0.11029
19.87500 0.07940
