0.12500 0.02655
0.37500 0.06596
0.62500 0.12548
0.87500 0.16733
1.12500 0.22937
1.37500 0.27749
1.62500 0.28764
1.87500 0.29507
2.12500 0.28554
2.37500 0.27431
2.62500 0.26729
2.87500 0.23615
3.12500 0.22811
3.37500 0.20315
3.62500 0.17760
3.87500 0.14536
4.12500 0.11198
4.37500 0.09108
4.62500 0.08193
4.87500 0.07118
5.12500 0.06725
5.37500 0.07396
5.62500 0.07661
5.87500 0.07936
6.12500 0.06236
6.37500 0.06363
6.62500 0.07919
6.87500 0.07898
7.12500 0.08036
7.37500 0.08691
7.62500 0.08207
7.87500 0.07569
8.12500 0.07890
8.37500 0.06508
8.62500 0.05476
8.87500 0.03491
9.12500 0.04333
9.37500 0.02263
9.62500 0.02481
9.87500 0.01441
10.12500 0.01844
10.37500 0.01637
10.62500 0.02905
10.87500 0.05251
11.12500 0.04861
11.37500 0.04161
11.62500 0.03686
11.87500 0.02705
12.12500 0.02574
12.37500 0.02578
12.62500 0.01895
12.87500 0.01452
13.12500 0.03438
13.37500 0.02084
13.62500 0.04923
13.87500 0.03160
14.12500 0.03464
14.37500 0.06118
14.62500 0.03880
14.87500 0.04389
