0.125 -0.001 -0.000 0.004
0.375 0.000 -0.007 0.092
0.625 -0.004 -0.001 0.451
0.875 -0.054 -0.052 1.163
1.125 -0.088 -0.054 2.060
1.375 -0.042 -0.048 2.948
1.625 -0.080 -0.056 3.628
1.875 -0.066 -0.080 4.258
2.125 -0.104 -0.068 4.822
2.375 -0.082 -0.088 5.127
2.625 -0.116 -0.078 5.568
2.875 -0.120 -0.071 5.908
3.125 -0.129 -0.119 6.119
3.375 -0.114 -0.086 6.355
3.625 -0.168 -0.131 6.588
3.875 -0.203 -0.119 6.849
4.125 -0.100 -0.139 7.067
4.375 -0.115 -0.111 7.218
4.625 -0.130 -0.176 7.672
4.875 -0.159 -0.133 8.332
5.125 -0.144 -0.132 8.962
5.375 -0.169 -0.130 10.290
5.625 -0.134 -0.156 11.463
5.875 -0.129 -0.093 13.383
6.125 -0.220 -0.151 15.602
6.375 -0.254 -0.115 17.741
6.625 -0.340 -0.208 19.940
6.875 -0.250 -0.202 21.632
7.125 -0.274 -0.156 22.952
7.375 -0.334 -0.187 23.352
7.625 -0.329 -0.190 23.775
7.875 -0.251 -0.146 22.738
8.125 -0.288 -0.106 22.177
8.375 -0.281 -0.084 21.397
8.625 -0.280 -0.053 20.545
8.875 -0.270 -0.053 20.010
9.125 -0.304 -0.035 19.920
9.375 -0.250 -0.014 19.620
9.625 -0.299 -0.049 20.428
9.875 -0.313 -0.050 20.324
10.125 -0.336 -0.038 20.967
10.375 -0.370 -0.023 21.353
10.625 -0.398 -0.027 21.111
10.875 -0.406 -0.056 21.308
11.125 -0.383 -0.066 20.983
11.375 -0.391 -0.054 19.973
11.625 -0.384 -0.037 19.271
11.875 -0.382 -0.073 19.210
12.125 -0.374 -0.040 18.089
12.375 -0.356 -0.075 17.850
12.625 -0.374 -0.080 16.740
12.875 -0.321 -0.091 16.382
13.125 -0.314 -0.096 15.749
13.375 -0.318 -0.069 15.683
13.625 -0.296 -0.053 15.635
13.875 -0.319 -0.074 15.244
14.125 -0.274 -0.080 14.786
14.375 -0.296 -0.089 14.693
14.625 -0.299 -0.081 14.120
14.875 -0.258 -0.065 14.098
