0.1875 1.47157 12.9551 -0.39438 135.74625 133.09836 106.09177
0.5625 -0.72123 30.98592 -0.24132 133.54126 128.79876 101.96386
0.9375 -0.65477 52.71669 0.73101 134.79902 120.96308 97.00403
1.3125 -0.19204 63.22962 0.31232 132.30898 111.72935 91.31663
1.6875 1.7235 71.27873 0.70547 130.44883 104.13571 86.43904
2.0625 -0.26891 78.81917 -0.15124 125.65097 97.83917 81.9599
2.4375 -0.35634 81.44151 0.78862 122.72444 92.83569 78.53332
2.8125 -0.0743 84.04391 0.13407 120.10991 86.72258 75.52638
3.1875 0.17548 87.48074 0.50895 117.09174 84.19098 71.78832
3.5625 -2.38751 89.24843 0.17701 112.83789 81.23032 69.18112
3.9375 -1.35991 90.18669 -0.00921 109.63225 76.85754 66.6205
4.3125 -1.15544 95.02078 0.74728 107.50703 73.2429 64.33434
4.6875 -1.05828 95.52777 0.54251 102.5811 72.12097 62.18759
5.0625 -1.9019 99.09136 -0.8767 99.46777 70.97261 61.2464
5.4375 -3.79217 103.45234 1.41046 94.0475 70.49643 57.85732
5.8125 -2.14626 108.55473 1.10888 90.91257 68.44486 55.71316
6.1875 -3.76549 114.85959 0.65407 87.41858 69.91608 52.99137
6.5625 -0.93303 124.51658 -0.2493 83.65948 69.54954 50.82029
6.9375 -1.72917 132.99004 2.58603 75.59387 69.0226 47.84804
7.3125 -3.60586 142.02597 0.41023 70.01628 68.25669 44.89233
7.6875 -1.69175 152.1514 1.41529 64.12892 66.15174 41.11988
8.0625 -2.02585 160.40441 1.20948 58.58534 63.28738 38.30799
8.4375 -2.1674 167.18641 1.97083 54.0651 58.48509 36.31715
8.8125 -0.0882 174.19053 0.68952 49.1581 54.12401 34.15894
9.1875 -0.24305 177.93745 0.08437 45.39358 49.99789 33.03943
9.5625 0.36291 183.51637 -1.23367 41.25031 45.53577 30.6416
9.9375 -0.5225 186.80129 -1.94792 37.75975 42.6409 29.37105
10.3125 -0.11609 189.7856 -2.82623 35.24278 39.69902 26.78533
10.6875 -0.83016 194.59137 -1.30586 33.09926 35.6446 25.65804
11.0625 0.29443 200.56084 -1.91967 32.6738 29.9652 24.32003
11.4375 -0.24862 201.96014 -2.1294 31.09289 26.02809 23.56943
11.8125 -0.67896 202.57697 -2.23718 30.85736 23.91383 24.13439
12.1875 1.52657 204.64379 -1.34019 30.53423 23.19602 22.03463
12.5625 1.10033 204.56035 -0.99337 29.83024 22.5243 22.02116
12.9375 0.94457 205.96305 -1.61574 28.05355 22.17964 21.17687
13.3125 0.4968 206.11681 -1.17898 28.56937 21.70404 21.34779
13.6875 0.00552 205.89745 -1.48531 27.19669 21.88271 20.31061
14.0625 0.18655 206.53828 -1.66846 26.46555 20.4231 20.1769
14.4375 1.1021 206.54343 -0.96611 25.56993 20.10501 19.81497
14.8125 0.37121 206.7001 -2.03881 25.79312 18.58228 20.16899
15.1875 0.17591 206.20074 -1.05278 24.64243 18.28034 19.10302
15.5625 0.2905 206.35882 -1.97567 24.03828 17.21921 18.2346
15.9375 0.40875 206.19759 -0.99492 23.27745 16.73033 18.43196
16.3125 0.27537 205.49714 -1.18302 23.33192 17.66283 17.97923
16.6875 0.48608 206.01897 -0.62712 22.16953 16.60249 17.65233
17.0625 -0.307 206.43255 -0.02096 21.48413 16.07548 16.91631
17.4375 0.71376 206.51666 1.41316 22.32276 16.43406 15.96738
17.8125 1.09618 206.86759 0.81241 21.13192 16.90417 16.04607
18.1875 0.10768 207.24142 0.4778 20.81936 17.00807 16.06088
18.5625 1.56535 206.88141 0.98865 19.61945 16.13998 16.77972
18.9375 0.65795 208.34805 0.63197 19.91856 16.48715 16.0206
19.3125 1.55326 209.32168 1.36653 19.4692 16.25842 14.96543
19.6875 1.08487 209.34597 0.98464 19.57349 15.64297 15.15842
20.0625 0.81533 209.50992 0.69946 19.50133 15.19752 14.76324
20.4375 1.39846 210.82194 0.48025 18.86008 13.53598 14.43425
20.8125 0.03879 209.37446 0.35599 18.59548 13.69325 14.44819
21.1875 0.26159 208.9773 -0.38046 19.74731 11.10635 14.453
21.5625 1.73642 208.0832 -0.9552 18.77258 10.19809 13.92242
21.9375 -0.15374 206.81995 -0.84316 18.31751 10.25607 14.05004
22.3125 0.19416 206.25775 -1.09668 17.5068 9.72658 14.03711
22.6875 -0.42875 204.7991 -2.00347 17.78698 9.01015 13.35252
23.0625 2.15728 203.36046 -1.03934 17.50634 8.71532 13.32256
23.4375 -0.85272 203.20399 -2.58678 16.93866 9.90761 13.08279
23.8125 0.256 202.08222 -2.56576 16.57371 10.41367 13.13667
24.1875 -0.0677 201.06966 -0.13584 15.98578 10.55121 12.60415
24.5625 -1.57129 200.31157 -1.26953 15.58291 11.68005 12.96446
24.9375 -0.6086 202.01559 -0.61473 14.98997 11.29303 11.07465
25.3125 -1.21011 201.3699 -0.00457 15.79624 12.14431 10.93664
25.6875 -0.39065 201.67492 1.35079 16.13815 12.28452 11.05553
26.0625 1.96544 202.14435 -0.64757 14.14895 12.27014 11.36592
26.4375 0.83854 203.60883 -0.29986 12.40993 10.53127 11.35115
26.8125 -0.05767 201.36936 -0.28976 13.65572 12.80325 11.16093
27.1875 -0.88001 204.1089 0.45939 12.58275 10.33259 11.15842
27.5625 0.46369 202.39928 -1.19274 14.51023 11.4358 11.28893
27.9375 1.96367 204.76874 -2.53008 10.86478 8.10662 9.6535
28.3125 1.72174 206.58392 2.23088 12.35839 7.95365 9.90228
28.6875 0.0991 204.52416 -0.77509 12.58124 8.36299 10.8648
29.0625 -3.43904 203.6383 0.2859 12.13901 8.29615 9.832
29.4375 -1.83854 202.19466 1.50513 11.54663 9.03099 9.83512
29.8125 0.30775 201.86786 0.92125 12.488 8.5222 9.98553
