0.125 -0.005 -0.001 0.005
0.375 -0.005 -0.003 0.089
0.625 0.024 0.000 0.406
0.875 -0.016 -0.038 1.002
1.125 -0.016 0.016 1.710
1.375 0.029 -0.050 2.595
1.625 -0.010 -0.068 3.288
1.875 0.044 -0.130 3.870
2.125 0.005 -0.060 4.374
2.375 -0.054 -0.045 4.993
2.625 -0.014 -0.094 5.300
2.875 0.128 -0.280 5.673
3.125 0.064 -0.049 6.094
3.375 0.084 -0.084 6.516
3.625 0.095 -0.137 6.462
3.875 -0.056 -0.137 6.837
4.125 -0.130 -0.023 6.923
4.375 0.000 0.015 7.054
4.625 -0.027 -0.025 7.745
4.875 -0.024 -0.047 7.678
5.125 -0.093 -0.101 7.955
5.375 -0.076 -0.103 8.454
5.625 0.083 -0.184 8.791
5.875 -0.074 -0.073 9.235
6.125 -0.020 -0.112 9.888
6.375 -0.040 -0.137 10.451
6.625 -0.090 -0.057 11.508
6.875 -0.103 -0.043 12.162
7.125 -0.112 -0.064 13.213
7.375 -0.174 -0.108 14.504
7.625 -0.234 0.038 15.783
7.875 -0.326 -0.109 16.930
8.125 -0.196 0.020 18.782
8.375 -0.201 -0.137 19.431
8.625 -0.177 -0.010 20.210
8.875 -0.197 -0.060 21.212
9.125 -0.286 0.032 21.114
9.375 -0.256 -0.078 21.586
9.625 -0.345 0.106 21.454
9.875 -0.270 -0.102 20.928
10.125 -0.427 -0.037 20.517
10.375 -0.290 -0.033 20.354
10.625 -0.338 0.057 20.087
10.875 -0.353 0.064 21.054
11.125 -0.494 0.046 19.901
11.375 -0.418 0.037 20.331
11.625 -0.461 -0.023 19.476
11.875 -0.400 -0.036 20.694
12.125 -0.495 0.021 19.652
12.375 -0.429 0.001 19.726
12.625 -0.341 -0.008 19.632
12.875 -0.484 -0.072 19.408
13.125 -0.382 -0.097 18.082
13.375 -0.415 -0.031 17.488
13.625 -0.416 -0.024 16.927
13.875 -0.459 -0.068 16.580
14.125 -0.480 -0.045 17.090
14.375 -0.379 -0.031 15.491
14.625 -0.450 -0.007 14.965
14.875 -0.417 -0.074 14.808
15.125 -0.446 -0.175 14.727
15.375 -0.448 -0.135 13.465
15.625 -0.474 -0.085 12.806
15.875 -0.376 -0.175 12.710
16.125 -0.389 -0.208 12.113
16.375 -0.433 -0.203 12.093
16.625 -0.361 -0.217 11.889
16.875 -0.405 -0.292 11.901
17.125 -0.355 -0.254 10.890
17.375 -0.325 -0.308 10.953
17.625 -0.258 -0.371 10.278
17.875 -0.217 -0.327 9.940
18.125 -0.182 -0.334 9.912
18.375 -0.159 -0.354 9.689
18.625 -0.120 -0.301 9.754
18.875 -0.060 -0.341 9.683
19.125 -0.029 -0.316 9.449
19.375 -0.043 -0.294 9.041
19.625 -0.004 -0.303 8.829
19.875 0.066 -0.283 8.636
