0.125 0.002 0.003 0.019
0.375 0.006 -0.013 0.226
0.625 -0.048 -0.036 0.706
0.875 -0.038 -0.059 1.348
1.125 -0.031 -0.047 2.037
1.375 -0.142 -0.099 2.823
1.625 -0.116 -0.134 3.935
1.875 -0.123 -0.156 5.001
2.125 -0.069 -0.190 6.116
2.375 -0.218 -0.210 7.470
2.625 -0.180 -0.395 9.020
2.875 -0.215 -0.405 10.290
3.125 -0.187 -0.434 11.878
3.375 -0.304 -0.475 13.043
3.625 -0.349 -0.442 14.514
3.875 -0.450 -0.574 16.203
4.125 -0.406 -0.590 17.406
4.375 -0.443 -0.741 18.648
4.625 -0.533 -0.765 19.547
4.875 -0.510 -0.863 21.170
5.125 -0.621 -0.756 21.902
5.375 -0.649 -0.844 22.002
5.625 -0.667 -0.975 23.298
5.875 -0.732 -0.971 23.597
6.125 -0.655 -0.895 23.857
6.375 -0.727 -1.037 23.693
6.625 -0.751 -0.997 24.068
6.875 -0.755 -0.901 23.994
7.125 -0.713 -0.962 24.072
7.375 -0.724 -0.933 23.432
7.625 -0.673 -0.903 22.903
7.875 -0.715 -0.955 24.205
8.125 -0.656 -0.949 22.221
8.375 -0.763 -0.921 22.327
8.625 -0.726 -0.971 22.779
8.875 -0.793 -0.903 22.191
9.125 -0.755 -0.806 21.460
9.375 -0.729 -0.841 21.648
9.625 -0.721 -0.806 20.128
9.875 -0.618 -0.821 19.140
10.125 -0.693 -0.846 19.176
10.375 -0.698 -0.850 19.027
10.625 -0.601 -0.875 18.052
10.875 -0.601 -0.664 16.421
11.125 -0.519 -0.736 16.339
11.375 -0.538 -0.665 14.895
11.625 -0.427 -0.633 14.090
11.875 -0.452 -0.650 14.410
12.125 -0.397 -0.599 13.899
12.375 -0.425 -0.474 12.966
12.625 -0.367 -0.409 11.754
12.875 -0.337 -0.447 11.371
13.125 -0.325 -0.380 10.891
13.375 -0.344 -0.352 10.342
13.625 -0.299 -0.311 9.914
13.875 -0.340 -0.355 9.422
14.125 -0.297 -0.327 8.338
14.375 -0.309 -0.307 9.182
14.625 -0.282 -0.300 8.292
14.875 -0.230 -0.249 7.375
15.125 -0.207 -0.247 6.665
15.375 -0.247 -0.217 7.080
15.625 -0.223 -0.205 6.773
15.875 -0.205 -0.146 5.584
16.125 -0.172 -0.136 5.089
16.375 -0.183 -0.129 5.006
16.625 -0.183 -0.119 4.768
16.875 -0.191 -0.121 4.790
17.125 -0.176 -0.110 3.889
17.375 -0.210 -0.092 4.397
17.625 -0.191 -0.115 3.659
17.875 -0.204 -0.115 4.463
18.125 -0.143 -0.089 3.225
18.375 -0.143 -0.109 3.291
18.625 -0.153 -0.103 3.473
18.875 -0.151 -0.059 3.217
19.125 -0.145 -0.090 3.039
19.375 -0.124 -0.060 2.930
19.625 -0.117 -0.060 2.508
19.875 -0.114 -0.049 2.272
