0.05000 16865.73269
0.15000 25470.11535
0.25000 25756.60894
0.35000 24287.60636
0.45000 21645.38252
0.55000 19719.98131
0.65000 17493.34236
0.75000 15952.43306
0.85000 14895.59829
0.95000 13583.70098
1.05000 12390.42919
1.15000 11229.72018
1.25000 10725.02407
1.35000 9930.14871
1.45000 9512.41677
1.55000 8914.38993
1.65000 8384.59910
1.75000 7924.37498
1.85000 7360.61824
1.95000 6955.86852
2.05000 6791.01930
2.15000 6328.72482
2.25000 5964.17803
2.35000 5857.28747
2.45000 5571.71480
2.55000 5357.59501
2.65000 5127.83094
2.75000 4990.97200
2.85000 4761.65077
2.95000 4674.41937
3.05000 4400.80492
3.15000 4316.67413
3.25000 4210.98808
3.35000 3961.49349
3.45000 3838.39989
3.55000 3734.72170
3.65000 3591.07525
3.75000 3511.14930
3.85000 3356.04496
3.95000 3275.15441
4.05000 3156.37616
4.15000 3063.05304
4.25000 2979.45457
4.35000 2898.20425
4.45000 2778.45107
4.55000 2720.79615
4.65000 2635.39729
4.75000 2529.75816
4.85000 2419.48671
4.95000 2470.77095
5.05000 2376.25314
5.15000 2319.64320
5.25000 2280.69147
5.35000 2197.26410
5.45000 2119.94123
5.55000 2087.92057
5.65000 2049.57034
5.75000 1994.69301
5.85000 1947.82913
5.95000 1959.55561
6.05000 1840.02943
6.15000 1779.01653
6.25000 1724.07464
6.35000 1689.24683
6.45000 1731.82249
6.55000 1585.85336
6.65000 1558.69905
6.75000 1551.10239
6.85000 1514.89199
6.95000 1431.38028
7.05000 1445.66556
7.15000 1401.54366
7.25000 1347.25033
7.35000 1299.85337
7.45000 1276.81345
7.55000 1256.66189
7.65000 1229.98630
7.75000 1213.77865
7.85000 1183.57090
7.95000 1120.24506
8.05000 1124.68863
8.15000 1101.42946
8.25000 1071.07207
8.35000 1074.39949
8.45000 1021.88511
8.55000 1020.02898
8.65000 998.41758
8.75000 957.84311
8.85000 921.70198
8.95000 943.65761
9.05000 876.12695
9.15000 824.75501
9.25000 843.93709
9.35000 850.81774
9.45000 847.73563
9.55000 792.71961
9.65000 792.26412
9.75000 794.12068
9.85000 749.07855
9.95000 719.48480
10.05000 741.04405
10.15000 725.04229
10.25000 720.79966
10.35000 683.72913
10.45000 661.59883
10.55000 659.96796
10.65000 656.92908
10.75000 642.91809
10.85000 629.66743
10.95000 593.77793
11.05000 599.80424
11.15000 584.28498
11.25000 566.36105
11.35000 529.86365
11.45000 541.73047
11.55000 579.47836
11.65000 520.32671
11.75000 504.29535
11.85000 541.76943
11.95000 490.77365
12.05000 490.73573
12.15000 491.20231
12.25000 453.09085
12.35000 458.43797
12.45000 461.65925
12.55000 461.53685
12.65000 438.60950
12.75000 462.63068
12.85000 442.31586
12.95000 441.97998
13.05000 393.13078
13.15000 410.38207
13.25000 407.96684
13.35000 417.68174
13.45000 397.05447
13.55000 387.26745
13.65000 389.77187
13.75000 381.80413
13.85000 370.79581
13.95000 386.65246
14.05000 376.95238
14.15000 363.98050
14.25000 370.74657
14.35000 345.14709
14.45000 330.16611
14.55000 337.43161
14.65000 334.15481
14.75000 330.89915
14.85000 323.52982
14.95000 313.88585
15.05000 291.21370
15.15000 285.58163
15.25000 288.65172
15.35000 281.27500
15.45000 267.32125
15.55000 280.04824
15.65000 264.13356
15.75000 267.34847
15.85000 275.56854
15.95000 273.57549
16.05000 273.83396
16.15000 248.84609
16.25000 258.88600
16.35000 259.63371
16.45000 257.08922
16.55000 233.48338
16.65000 230.15846
16.75000 240.14710
16.85000 250.63483
16.95000 236.65127
17.05000 223.62683
17.15000 232.38663
17.25000 208.00899
17.35000 184.96556
17.45000 201.72354
17.55000 201.83244
17.65000 184.47946
17.75000 215.52297
17.85000 203.59686
17.95000 197.46295
18.05000 195.37857
18.15000 192.89697
18.25000 202.35187
18.35000 171.07164
18.45000 156.81118
18.55000 188.46265
18.65000 170.24861
18.75000 171.94553
18.85000 170.59565
18.95000 161.19966
19.05000 156.27342
19.15000 157.11674
19.25000 193.37321
19.35000 160.13764
19.45000 157.82481
19.55000 152.73624
19.65000 163.12166
19.75000 169.68442
19.85000 152.21062
19.95000 154.43459
