0.120000 -2.552760
0.380000 2.475190
0.620000 2.528460
0.880000 2.535460
1.120000 2.557580
1.380000 2.587990
1.620000 2.554570
1.880000 2.527010
2.120000 2.515220
2.380000 2.488290
2.620000 2.448450
2.880000 2.411770
3.120000 2.356530
3.380000 2.345270
3.620000 2.354350
3.880000 2.355470
4.120000 2.339920
4.380000 2.315250
4.620000 2.351520
4.880000 2.302310
5.120000 2.234850
5.380000 2.096970
5.620000 1.873830
5.880000 1.786780
6.120000 1.564320
6.380000 1.404390
6.620000 1.257500
6.880000 1.227240
7.120000 1.081150
7.380000 1.526070
7.620000 2.071420
7.880000 1.988640
8.120000 2.062220
8.380000 1.939330
8.620000 1.832320
8.880000 1.452970
9.120000 1.404420
9.380000 1.076840
9.620000 0.871260
9.880000 1.007620
10.120000 0.689150
10.380000 0.499290
10.620000 0.443280
10.880000 0.301720
11.120000 0.066790
11.380000 -0.020420
11.620000 -0.098690
11.880000 -0.236630
12.120000 -0.420130
12.380000 -0.514480
12.620000 -0.848710
12.880000 -0.967740
13.120000 -1.509350
13.380000 -1.742770
13.620000 -2.693950
13.880000 -1.684880
14.120000 -0.412170
14.380000 -1.500090
14.620000 -0.604170
14.880000 -1.844400
