0.12500 0.01779
0.37500 0.01442
0.62500 0.01098
0.87500 0.01553
1.12500 0.00710
1.37500 0.03296
1.62500 0.04404
1.87500 0.03870
2.12500 0.03295
2.37500 0.04380
2.62500 0.03636
2.87500 0.03310
3.12500 0.01532
3.37500 0.01362
3.62500 0.01120
3.87500 0.00461
4.12500 0.02043
4.37500 0.01343
4.62500 0.00366
4.87500 0.01353
5.12500 0.00677
5.37500 0.01572
5.62500 0.01109
5.87500 0.01367
6.12500 0.01393
6.37500 0.01482
6.62500 0.02725
6.87500 0.02324
7.12500 0.02350
7.37500 0.01842
7.62500 0.01947
7.87500 0.02194
8.12500 0.01052
8.37500 0.00282
8.62500 0.01715
8.87500 0.00666
9.12500 0.01384
9.37500 0.01507
9.62500 0.00846
9.87500 0.03490
10.12500 0.01492
10.37500 0.02021
10.62500 0.04007
10.87500 0.02951
11.12500 0.02057
11.37500 0.02109
11.62500 0.01711
11.87500 0.01210
12.12500 0.01310
12.37500 0.02779
12.62500 0.03081
12.87500 0.02220
13.12500 0.01661
13.37500 0.03145
13.62500 0.00812
13.87500 0.03184
14.12500 0.03413
14.37500 0.02122
14.62500 0.01017
14.87500 0.02058
