0.1875 0.93433 22.36483 -0.13193 102.76587 100.92944 90.52352
0.5625 -1.12555 48.79017 -0.07155 95.86773 89.99577 82.19395
0.9375 0.57325 68.37486 -1.43554 89.89218 80.15356 72.76972
1.3125 -2.08441 83.54286 -0.30914 81.65558 74.24734 67.93422
1.6875 -0.54006 96.93374 -0.64 75.82522 69.57045 64.04307
2.0625 -0.65549 111.60083 -0.44753 70.58359 65.79966 59.73276
2.4375 -0.41114 124.35803 0.23247 66.70225 61.35404 55.44561
2.8125 -0.39783 136.85918 0.05373 62.28812 56.55829 50.97555
3.1875 0.94347 145.28455 1.03538 56.23944 51.0176 47.54791
3.5625 -0.99548 154.24518 0.49216 51.84857 46.52846 44.31979
3.9375 0.29386 161.14077 0.15756 48.36688 43.26435 41.58882
4.3125 -1.41314 167.91566 0.08492 46.50508 40.95565 38.29402
4.6875 -0.46978 173.76095 -0.00411 44.19071 37.41231 35.89165
5.0625 -0.34473 177.84218 -0.80087 41.74351 34.87589 34.93239
5.4375 0.04669 181.25996 -0.51598 40.26121 33.52397 33.2059
5.8125 0.60739 184.39988 -0.84826 38.68363 32.31493 31.74302
6.1875 0.70338 187.87286 -0.45128 37.76215 31.24009 29.33068
6.5625 0.86682 190.11526 -1.5104 35.19879 29.60683 28.58195
6.9375 1.19772 192.60285 -0.79022 33.94762 28.43762 27.69678
7.3125 1.76506 195.2474 0.19993 32.98887 27.47075 26.2302
7.6875 0.78631 197.87228 1.04549 31.98627 26.42811 25.01112
8.0625 0.43333 200.00489 1.68602 30.19532 24.89144 24.38028
8.4375 -0.29332 202.1308 2.20855 30.13809 23.75186 22.92135
8.8125 -1.61717 202.34744 1.70874 28.92007 22.37499 22.25553
9.1875 -1.31953 202.90055 1.73038 28.34147 21.01921 21.74406
9.5625 -1.61744 203.42109 1.9607 27.88308 19.04846 21.17351
9.9375 -2.15467 204.10097 1.2831 26.25636 18.71554 20.48147
10.3125 -1.15711 204.29102 0.84357 25.49215 18.35045 19.37728
10.6875 -1.66313 204.38106 -0.35009 24.61354 17.75645 18.79973
11.0625 -0.92873 204.451 -0.70868 23.77594 17.49254 18.42281
11.4375 -0.14552 204.8815 -1.84382 22.82203 17.54856 17.45417
11.8125 -0.31322 205.63517 -2.07826 22.36797 16.91799 16.72101
12.1875 0.44003 206.63758 -0.52762 20.95748 16.11717 16.59326
12.5625 1.81352 206.06326 -0.48531 19.86324 14.77632 15.9548
12.9375 0.07901 205.70041 -0.08635 19.74655 15.31772 15.69905
13.3125 0.05359 205.93816 0.89103 19.05185 15.19833 15.35057
13.6875 -1.30794 206.90326 1.93614 18.54121 14.02856 14.24768
14.0625 -1.16736 207.3196 1.46176 17.86422 13.81667 14.7049
14.4375 -1.98068 206.80819 1.4518 17.46851 13.88604 13.82021
14.8125 -1.96293 206.78479 0.13518 17.00339 12.42618 13.6327
15.1875 -0.83063 206.96492 -0.35671 16.66015 12.46376 13.08812
15.5625 -0.57728 206.99815 -1.86123 16.41105 10.96811 12.12258
15.9375 -1.36391 206.69526 -2.13393 15.75815 10.28796 11.58451
16.3125 -1.42805 206.17374 -2.65275 15.7931 10.70697 11.61112
16.6875 -0.4284 206.27987 -0.92174 15.01672 10.11172 11.44496
17.0625 -0.55839 206.74768 -1.17314 13.99111 9.64961 10.29047
17.4375 -0.23057 205.93694 0.30223 13.76699 9.54857 9.8346
17.8125 -0.47561 204.95897 1.05506 13.94423 10.43469 9.65441
18.1875 -0.34405 205.82223 1.66646 12.41055 9.25197 9.19389
18.5625 -0.99954 206.03125 2.16249 12.61759 8.84322 9.17925
18.9375 -0.62713 206.61835 2.42597 12.27844 8.13825 8.32014
19.3125 0.2134 205.40363 3.03345 11.86084 9.37141 8.44734
19.6875 -0.40701 205.55559 2.9834 11.11266 8.51986 7.83328
20.0625 0.85312 205.41859 3.38926 11.39087 8.66114 7.30953
20.4375 1.08917 205.80421 4.06364 10.85316 8.5337 7.7894
20.8125 1.08716 205.53438 3.04578 10.95857 8.49233 7.77897
21.1875 0.10785 206.97333 3.60271 10.48103 7.9015 8.04825
21.5625 0.99836 206.37449 3.54053 9.34524 7.76026 7.16815
21.9375 0.96399 205.97586 3.05448 10.66481 7.39405 7.27055
22.3125 -1.16311 204.90075 3.06291 9.4893 6.92828 7.6767
22.6875 -1.50336 204.56526 1.87406 8.03505 6.6239 8.90712
23.0625 -2.8231 204.2953 1.05586 8.43172 7.50097 6.44404
23.4375 -2.40693 204.72974 1.66319 9.23647 7.33794 6.61169
23.8125 -1.3487 204.67755 0.57463 8.89122 5.44089 7.46691
24.1875 1.60706 203.80667 0.83135 8.75463 5.3235 5.32206
24.5625 1.67445 203.0335 1.40705 6.7383 5.55337 6.82478
24.9375 -1.3272 202.63118 2.55309 8.42914 6.06675 5.58549
25.3125 0.62402 202.33434 2.08516 10.07359 5.5213 5.29769
25.6875 -1.11834 203.70864 2.63238 9.74436 5.29632 5.38677
26.0625 -4.75755 202.69879 3.79849 8.27226 4.43055 5.05353
26.4375 0.1866 204.94922 -0.71449 8.43252 5.0112 5.26526
26.8125 -3.85697 200.86757 2.42613 8.6487 7.66994 6.11083
27.1875 2.81966 202.29951 2.67354 7.24028 5.67435 5.67008
27.5625 1.38826 202.3969 0.39788 6.91688 6.48528 4.97953
27.9375 5.89208 200.95899 0.94963 5.44379 4.58932 5.36984
28.3125 -0.65662 203.03053 3.21972 10.70055 5.59272 4.4222
28.6875 -2.52339 203.06174 1.5579 9.187 7.48662 4.07182
29.0625 -2.7024 199.99687 -0.21121 7.12619 7.85044 3.11951
29.4375 -4.29573 205.3347 3.39736 8.20003 2.09727 4.64089
29.8125 1.22256 198.33088 -1.6504 3.03458 3.34771 3.49082
