0.12500 0.02510
0.37500 0.01882
0.62500 0.03834
0.87500 0.05353
1.12500 0.10479
1.37500 0.13059
1.62500 0.16373
1.87500 0.20675
2.12500 0.23318
2.37500 0.25358
2.62500 0.26009
2.87500 0.27711
3.12500 0.28190
3.37500 0.27672
3.62500 0.27616
3.87500 0.26660
4.12500 0.26505
4.37500 0.25832
4.62500 0.24177
4.87500 0.23527
5.12500 0.22184
5.37500 0.20250
5.62500 0.18864
5.87500 0.15688
6.12500 0.12957
6.37500 0.09948
6.62500 0.07866
6.87500 0.06936
7.12500 0.06787
7.37500 0.05969
7.62500 0.06229
7.87500 0.06345
8.12500 0.07747
8.37500 0.06913
8.62500 0.06923
8.87500 0.07309
9.12500 0.07654
9.37500 0.08339
9.62500 0.10350
9.87500 0.09583
10.12500 0.11286
10.37500 0.11086
10.62500 0.07400
10.87500 0.05672
11.12500 0.06215
11.37500 0.05074
11.62500 0.05481
11.87500 0.05505
12.12500 0.04677
12.37500 0.05249
12.62500 0.07266
12.87500 0.04866
13.12500 0.04662
13.37500 0.03211
13.62500 0.07025
13.87500 0.08552
14.12500 0.08533
14.37500 0.09085
14.62500 0.05965
14.87500 0.05083
