0.05000 1407.13851
0.15000 2358.24758
0.25000 3630.94754
0.35000 4160.07939
0.45000 4455.50994
0.55000 4895.63134
0.65000 5065.13527
0.75000 5179.18348
0.85000 5304.71570
0.95000 5345.13094
1.05000 5242.07216
1.15000 5287.55634
1.25000 5104.65257
1.35000 5066.41835
1.45000 4998.06715
1.55000 4882.49280
1.65000 4764.37019
1.75000 4703.92433
1.85000 4533.88017
1.95000 4462.12314
2.05000 4409.76496
2.15000 4212.25319
2.25000 4139.18249
2.35000 3983.78596
2.45000 3897.25993
2.55000 3816.52916
2.65000 3733.66926
2.75000 3692.97786
2.85000 3536.43214
2.95000 3510.80917
3.05000 3395.71774
3.15000 3336.42694
3.25000 3215.54553
3.35000 3122.84882
3.45000 3045.72754
3.55000 2982.31950
3.65000 2918.47365
3.75000 2795.38303
3.85000 2776.06251
3.95000 2700.99053
4.05000 2615.50584
4.15000 2563.14206
4.25000 2508.07889
4.35000 2444.24842
4.45000 2387.13804
4.55000 2350.01454
4.65000 2255.07276
4.75000 2230.70192
4.85000 2164.42193
4.95000 2121.51490
5.05000 2066.31273
5.15000 2040.01630
5.25000 1965.26260
5.35000 1955.49900
5.45000 1864.35280
5.55000 1831.08723
5.65000 1808.22495
5.75000 1757.37573
5.85000 1695.56359
5.95000 1687.63272
6.05000 1640.02180
6.15000 1595.70365
6.25000 1570.63822
6.35000 1521.15840
6.45000 1490.19827
6.55000 1470.57306
6.65000 1450.70321
6.75000 1413.51134
6.85000 1360.96316
6.95000 1333.23847
7.05000 1312.11465
7.15000 1277.61351
7.25000 1252.68198
7.35000 1227.18870
7.45000 1207.02093
7.55000 1168.81900
7.65000 1164.31230
7.75000 1124.36926
7.85000 1105.19981
7.95000 1068.84653
8.05000 1053.58037
8.15000 1040.61626
8.25000 998.08561
8.35000 992.73510
8.45000 973.48730
8.55000 951.19181
8.65000 936.19927
8.75000 913.76324
8.85000 889.22033
8.95000 875.15346
9.05000 842.70119
9.15000 839.51193
9.25000 827.04187
9.35000 785.13726
9.45000 802.44442
9.55000 768.99999
9.65000 741.23838
9.75000 739.56072
9.85000 722.61126
9.95000 703.57258
10.05000 691.60890
10.15000 676.48163
10.25000 670.03193
10.35000 658.23714
10.45000 638.41487
10.55000 638.42665
10.65000 632.49530
10.75000 613.69220
10.85000 600.88573
10.95000 593.94343
11.05000 578.54728
11.15000 566.14695
11.25000 551.49203
11.35000 543.57424
11.45000 533.01404
11.55000 519.03712
11.65000 512.61046
11.75000 488.22705
11.85000 490.72040
11.95000 476.48442
12.05000 470.22238
12.15000 451.83587
12.25000 453.93186
12.35000 438.18107
12.45000 442.18613
12.55000 427.93424
12.65000 415.24580
12.75000 407.62479
12.85000 411.26794
12.95000 388.57444
13.05000 382.67210
13.15000 392.40343
13.25000 367.57732
13.35000 355.48434
13.45000 354.74833
13.55000 357.88782
13.65000 349.64076
13.75000 337.93482
13.85000 330.92971
13.95000 322.22073
14.05000 310.85359
14.15000 317.73630
14.25000 303.25886
14.35000 296.49280
14.45000 297.03271
14.55000 283.29317
14.65000 279.85744
14.75000 268.52010
14.85000 267.62351
14.95000 262.90826
15.05000 259.61279
15.15000 256.67176
15.25000 249.11449
15.35000 257.22405
15.45000 245.53125
15.55000 235.05920
15.65000 233.18663
15.75000 227.63479
15.85000 234.78545
15.95000 216.85008
16.05000 224.21715
16.15000 220.91302
16.25000 209.00203
16.35000 212.75142
16.45000 209.17312
16.55000 204.54874
16.65000 197.50812
16.75000 196.26680
16.85000 196.19428
16.95000 197.03197
17.05000 184.26914
17.15000 181.90950
17.25000 179.17046
17.35000 179.05514
17.45000 183.01402
17.55000 175.02749
17.65000 181.67960
17.75000 172.61436
17.85000 160.69930
17.95000 160.98517
18.05000 151.92986
18.15000 147.61364
18.25000 149.87664
18.35000 150.00410
18.45000 142.49634
18.55000 147.96631
18.65000 142.15929
18.75000 136.22271
18.85000 139.43876
18.95000 144.02632
19.05000 130.07050
19.15000 128.78990
19.25000 120.75979
19.35000 128.39716
19.45000 119.56387
19.55000 116.25723
19.65000 113.86415
19.75000 116.65532
19.85000 105.90663
19.95000 111.69462
