0.125 0.001 -0.001 0.007
0.375 -0.003 0.004 0.131
0.625 -0.013 0.008 0.487
0.875 -0.022 0.006 1.100
1.125 -0.036 -0.007 1.812
1.375 -0.067 -0.028 2.745
1.625 -0.063 -0.052 3.794
1.875 -0.101 -0.008 5.143
2.125 -0.112 -0.031 6.661
2.375 -0.165 -0.068 8.428
2.625 -0.176 -0.042 10.203
2.875 -0.226 -0.070 11.783
3.125 -0.192 -0.058 12.996
3.375 -0.257 -0.071 14.421
3.625 -0.258 -0.101 15.819
3.875 -0.264 -0.060 17.065
4.125 -0.231 -0.105 18.586
4.375 -0.271 -0.074 19.505
4.625 -0.250 -0.101 21.098
4.875 -0.226 -0.110 21.600
5.125 -0.292 -0.059 22.688
5.375 -0.250 -0.065 23.775
5.625 -0.269 -0.076 23.984
5.875 -0.353 -0.050 24.255
6.125 -0.345 -0.076 24.493
6.375 -0.322 0.014 24.410
6.625 -0.386 -0.068 25.413
6.875 -0.381 -0.012 25.890
7.125 -0.418 -0.075 25.877
7.375 -0.402 -0.102 26.639
7.625 -0.341 -0.072 26.233
7.875 -0.432 -0.075 25.578
8.125 -0.345 -0.092 25.718
8.375 -0.345 -0.103 24.768
8.625 -0.397 -0.108 24.194
8.875 -0.360 -0.109 23.736
9.125 -0.318 -0.121 23.634
9.375 -0.306 -0.108 22.218
9.625 -0.268 -0.132 21.210
9.875 -0.230 -0.131 21.022
10.125 -0.188 -0.140 20.653
10.375 -0.181 -0.101 20.518
10.625 -0.182 -0.062 19.252
10.875 -0.172 -0.070 19.080
11.125 -0.169 -0.056 17.788
11.375 -0.195 -0.032 16.887
11.625 -0.173 -0.043 16.305
11.875 -0.201 -0.053 15.540
12.125 -0.194 -0.049 14.935
12.375 -0.192 -0.050 14.391
12.625 -0.157 -0.038 14.042
12.875 -0.197 -0.064 13.381
13.125 -0.158 -0.073 13.221
13.375 -0.153 -0.073 13.446
13.625 -0.141 -0.064 12.419
13.875 -0.147 -0.067 11.799
14.125 -0.131 -0.053 11.226
14.375 -0.132 -0.040 10.395
14.625 -0.150 -0.053 9.977
14.875 -0.133 -0.056 10.124
