0.05000 0.00000 0.00000 0.00000 0.00000 0.00000 0.00000
0.15000 -205.06832 801.42826 5217.29132 1546.05411 1331.85112 432.03885
0.25000 -906.29187 -167.88843 4774.13064 1511.72865 1711.74916 443.47278
0.35000 -658.60439 -139.09005 4918.89452 1662.86420 1583.49995 496.10811
0.45000 -743.49884 -515.51034 4850.92578 1603.70230 1481.67994 519.03965
0.55000 -1016.87806 320.75028 4961.46521 1491.58604 1762.50873 1647.68113
0.65000 -1374.86846 -168.09570 4539.15843 1972.68850 1699.09603 1783.01531
0.75000 -1514.84731 104.00123 4531.96272 1552.16883 1910.54028 743.40002
0.85000 -1753.28336 27.20121 4472.98801 1636.78664 1925.39590 838.60484
0.95000 -1994.87554 -67.43303 4302.29770 1733.11784 1942.97294 983.25443
1.05000 -2110.40440 -136.27392 4160.80104 1779.70846 1988.53452 1034.22860
1.15000 -2344.23240 71.21439 3982.28813 1779.37255 2053.08790 1163.47523
1.25000 -2416.35877 -38.40347 3882.92167 2045.06297 2203.64256 1183.07648
1.35000 -2438.93400 24.95875 3649.77949 2150.99651 2377.34985 1378.81963
1.45000 -2726.91316 35.65191 3221.59471 2191.56186 2456.25171 1668.40419
1.55000 -3058.97322 -7.94542 2873.04902 1882.80925 2400.69216 1420.03510
1.65000 -3105.12787 26.75813 2386.99688 2391.30078 2500.56450 1869.22822
1.75000 -3360.75221 25.17881 1800.56657 2144.08348 2570.95844 2210.47652
1.85000 -3482.71601 30.44893 1361.49638 2146.31853 2371.73330 2598.91589
1.95000 -3627.07022 -91.67748 1161.48695 1930.58940 2029.84526 2790.30154
2.05000 -3805.01856 -14.33398 1073.52474 1621.19271 2075.21972 2747.17618
2.15000 -3786.58770 23.86857 965.55754 1716.26224 1768.57027 2913.42755
2.25000 -3867.74750 -77.36576 942.90144 1681.37654 1685.69127 2709.97358
2.35000 -3824.14953 25.09283 678.00325 1530.36298 1506.63229 2835.39529
2.45000 -3823.86057 -1.59829 544.13265 1509.61108 1430.52149 2923.64626
2.55000 -3851.89172 23.25853 629.24261 1413.47459 1305.97978 2727.24254
2.65000 -3773.27368 28.41506 619.79345 1439.90312 1204.71724 2756.62636
2.75000 -3828.97006 4.14216 535.69588 1407.81591 1136.96063 2671.98116
2.85000 -3691.54810 -47.48155 464.28751 1375.28899 1095.15466 2762.72180
2.95000 -3714.17614 -55.99373 483.25147 1355.82250 1240.80314 2764.32240
3.05000 -3703.88233 -7.48249 309.89090 1337.59952 1102.46255 2738.32441
3.15000 -3686.96090 45.78268 476.37986 1357.62395 1272.60677 2711.61364
3.25000 -3647.65989 -16.13832 347.31033 1270.54516 995.07839 2700.42592
3.35000 -3674.42747 4.36324 299.28622 1202.23459 846.48602 2624.14003
3.45000 -3587.00988 -12.73635 142.29482 1180.98086 789.10757 2652.25567
3.55000 -3577.23427 12.84290 242.65229 1161.28132 794.49779 2576.02564
3.65000 -3561.72970 18.09719 224.54481 1210.30037 888.49502 2585.37667
3.75000 -3450.43569 -11.39055 405.60717 1173.23508 683.23907 2597.65683
3.85000 -3485.81970 -1.75006 295.86152 1088.19191 647.08165 2504.09758
3.95000 -3418.31107 -20.20773 179.75237 1106.18422 668.90989 2571.90293
4.05000 -3443.96056 -11.89474 160.62396 1081.01470 627.30478 2581.34039
4.15000 -3385.38683 10.91069 257.67844 1068.38288 570.01123 2471.58937
4.25000 -3409.41906 -16.86723 139.79183 1071.50119 636.84538 2441.65137
4.35000 -3357.43144 -14.48498 168.00816 1341.47857 694.41326 2473.53411
4.45000 -3358.43416 -9.98667 199.01401 1023.63262 597.62636 2484.35536
4.55000 -3312.35647 8.97679 119.39808 1003.61501 829.63514 2449.41799
4.65000 -3248.26342 10.33516 126.93242 1027.78076 497.04116 2429.12948
4.75000 -3256.17402 10.55686 169.85966 1006.91619 495.65418 2360.41860
4.85000 -3184.88201 1.03949 18.11705 1107.04999 700.65949 2444.13320
4.95000 -3229.98628 -0.62360 66.35817 986.71942 469.66841 2323.99217
5.05000 -3198.29770 20.28032 107.85801 1009.27694 764.46412 2332.05186
5.15000 -3182.36967 5.56000 86.70666 1018.97784 565.61822 2358.66830
5.25000 -3144.07455 -4.26264 128.26024 952.34868 445.06237 2287.40331
5.35000 -3110.50431 -20.86008 45.50339 970.22620 429.43050 2298.91553
5.45000 -3085.29472 3.12673 98.66683 944.26746 429.82580 2294.56144
5.55000 -3071.83596 2.02881 71.98616 975.88575 392.79929 2287.31652
5.65000 -2985.84326 -7.18901 188.68515 997.94129 455.78144 2298.43843
5.75000 -3037.43408 -4.84083 91.94134 927.63009 361.57135 2209.14464
5.85000 -3013.33340 5.33907 27.53995 893.51316 360.81233 2227.73242
5.95000 -2998.45623 3.98692 39.04609 1023.25365 379.29899 2184.10443
6.05000 -2966.17795 -0.85509 59.90594 924.65809 594.98442 2209.16303
6.15000 -2942.10265 5.12108 89.55709 902.79692 329.33012 2166.41363
6.25000 -2943.40236 4.53243 18.69979 880.58083 436.11805 2152.51514
6.35000 -2920.53045 7.78831 -12.85967 1003.07769 446.07337 2137.42579
6.45000 -2897.09190 15.26891 102.35840 885.36092 524.24509 2118.52428
6.55000 -2864.89135 -10.32767 4.82823 946.21834 740.00417 2173.78754
6.65000 -2875.14501 1.99979 1.57772 917.96604 417.85560 2129.06754
6.75000 -2864.97802 -5.26082 29.00447 885.61435 398.18072 2118.70367
6.85000 -2862.17786 -5.72312 -29.78414 819.31212 284.63166 2049.99516
6.95000 -2833.67135 -6.24779 -72.27122 904.16413 332.30383 2064.68035
7.05000 -2819.44284 0.25210 16.97072 833.78188 405.82053 2042.83086
7.15000 -2790.86808 3.29852 56.85028 855.74584 436.44599 2037.78856
7.25000 -2783.11380 1.07171 -7.58897 837.39418 305.35248 2032.47767
7.35000 -2715.92918 8.56576 -28.78562 857.92681 343.12873 2071.73672
7.45000 -2736.40289 3.49536 36.70873 801.54784 321.20212 2016.31763
7.55000 -2758.54179 -1.31099 -43.85737 883.47705 379.40573 1991.94006
7.65000 -2682.63897 4.22531 -29.43699 859.02467 312.94762 2013.95829
7.75000 -2709.53709 -0.29982 -50.34845 843.76485 744.87198 1979.52107
7.85000 -2687.91672 -1.36439 -66.14602 850.16606 280.24821 1964.61346
7.95000 -2651.69841 4.09755 41.30418 803.77802 259.01914 1960.78667
8.05000 -2639.57506 -2.33641 -26.42281 791.52225 266.92867 1954.95795
8.15000 -2640.54152 1.40927 -32.11366 772.93169 236.62465 1937.44441
8.25000 -2610.72832 -0.05473 -21.77092 897.77494 491.19021 1944.96903
8.35000 -2589.83162 0.16319 -34.52182 817.11923 229.68256 1922.21984
8.45000 -2595.39536 -2.23876 -77.16371 891.60775 412.33955 1904.31460
8.55000 -2595.37504 -2.35263 -75.12432 768.04744 263.13957 1863.01076
8.65000 -2546.60101 1.04996 -56.32118 784.44676 220.90734 1896.93572
8.75000 -2567.88760 -3.79064 -90.27415 785.61310 506.28935 1847.21923
8.85000 -2537.77783 -2.09258 -106.41423 749.69038 381.94864 1874.18264
8.95000 -2499.92414 3.79641 -86.41519 758.75377 219.30402 1873.51423
9.05000 -2491.44668 -0.30588 -61.52012 739.75883 193.11203 1843.52342
9.15000 -2482.50115 4.51200 -94.69379 727.97200 189.98433 1843.87501
9.25000 -2483.53404 -5.45482 -38.34198 829.52762 343.14952 1836.59042
9.35000 -2441.69007 0.70234 -31.04792 734.22297 201.08596 1824.21714
9.45000 -2439.11481 -6.87382 -82.92622 719.51379 222.45750 1804.65502
9.55000 -2423.56444 5.28705 -88.85130 741.05069 219.73783 1795.27569
9.65000 -2400.27369 -1.54241 -85.42678 737.50538 191.19091 1794.38879
9.75000 -2407.52174 1.51258 -21.40325 733.88307 197.77726 1793.43242
9.85000 -2379.35166 1.02807 -41.24124 712.20738 254.44402 1765.80723
9.95000 -2400.93397 1.04079 -98.08532 686.75916 242.74065 1726.67799
10.05000 -2352.90243 -1.64136 -22.54087 713.38363 222.64458 1743.24346
10.15000 -2373.44554 -2.73117 -88.52370 808.41502 343.86947 1722.57693
10.25000 -2342.70039 -1.05681 -70.55152 674.97735 183.28324 1709.10702
10.35000 -2312.15388 1.10554 -68.98338 691.89379 169.42495 1716.87027
10.45000 -2314.71880 -2.92022 -98.28210 676.10982 150.41968 1689.25696
10.55000 -2296.93027 -2.89978 -49.11659 664.78665 156.05237 1689.80603
10.65000 -2299.19758 -2.97469 -27.70488 646.78997 208.80733 1658.76798
10.75000 -2250.65457 2.23527 -29.47746 682.02405 157.39528 1683.76267
10.85000 -2241.41441 0.82935 -76.01449 670.35623 156.67469 1682.68291
10.95000 -2249.24001 -1.31915 -48.67487 653.61333 166.81056 1649.26124
11.05000 -2234.28967 -0.80385 -86.60870 659.40746 171.15595 1644.12764
11.15000 -2234.66034 -0.57506 -70.63947 687.34307 286.16650 1627.41913
11.25000 -2189.05360 -0.79201 -80.44304 655.67022 151.74539 1660.03150
11.35000 -2193.01976 -2.86966 -62.60033 643.99774 176.69347 1627.93738
11.45000 -2178.43847 -0.87458 -52.81084 712.23945 360.81528 1630.07620
11.55000 -2164.49688 -0.51801 3.22894 647.77686 134.54286 1595.86263
11.65000 -2172.18167 -5.80094 -36.23379 623.45726 132.82391 1576.54705
11.75000 -2154.21253 -1.74040 -89.41745 791.79114 430.61260 1588.90835
11.85000 -2126.91707 0.62644 -111.84232 675.75927 204.02834 1599.53164
11.95000 -2119.60660 -2.03721 -71.16257 630.70019 185.02265 1573.69021
12.05000 -2110.40869 1.05906 -64.26008 624.25762 162.38688 1563.51788
12.15000 -2118.20390 -1.13186 -54.59933 613.62618 199.83612 1530.94504
12.25000 -2078.20204 -3.30123 -135.78474 617.01609 126.75365 1566.58378
12.35000 -2077.08059 1.56606 -71.36502 601.80023 172.25909 1548.57656
12.45000 -2066.27547 -2.94895 -58.06112 607.40140 143.33274 1540.74157
12.55000 -2075.70031 2.62403 -87.68229 582.98554 123.71582 1515.85535
12.65000 -2048.42285 0.07139 -102.15593 596.75923 242.56106 1520.80756
12.75000 -2058.79972 -1.00915 -36.19392 589.75799 124.00848 1481.87859
12.85000 -2063.82057 -0.14276 -92.66489 578.70562 127.86389 1460.45292
12.95000 -2011.25607 -2.17297 -86.84195 595.07141 143.41008 1506.88112
13.05000 -1987.84956 0.55457 -44.95311 613.99038 190.97640 1499.51942
13.15000 -2002.49888 3.14968 -103.01470 585.02246 113.31394 1469.15967
13.25000 -1997.10209 -1.75982 -88.19306 568.85995 117.08585 1461.49764
13.35000 -1986.50534 1.60922 -93.31319 578.67947 120.74350 1452.27877
13.45000 -1968.19280 0.78695 -95.92968 608.96323 153.73057 1457.15902
13.55000 -1958.23197 -1.15483 -50.37995 567.70928 108.00309 1445.92373
13.65000 -1958.20187 0.19299 -65.32241 548.80497 101.73600 1459.10395
13.75000 -1948.55443 1.14117 -109.51758 569.13320 114.75345 1430.12368
13.85000 -1915.73222 -1.47942 -80.94538 582.71862 104.19106 1436.37375
13.95000 -1922.71523 5.53566 -50.56309 536.63955 105.55029 1416.17870
14.05000 -1897.46693 -1.63610 -65.63711 564.84190 139.40396 1421.67418
14.15000 -1907.75705 -1.37822 -50.06974 552.57460 97.27277 1389.71607
14.25000 -1884.98549 -1.55288 -58.22801 548.11217 107.24219 1400.29897
14.35000 -1873.89415 1.37450 -93.61729 542.25616 99.83926 1400.15866
14.45000 -1879.39317 2.09722 -65.19495 557.52210 127.31939 1375.66635
14.55000 -1858.04047 0.45422 -53.18185 540.42137 99.41863 1382.48477
14.65000 -1871.25483 -3.19364 -137.07301 551.11974 162.00031 1349.99159
14.75000 -1834.21949 3.46502 -76.42229 547.15124 106.11931 1376.04733
14.85000 -1834.85081 -0.83794 -51.03096 523.03399 112.79560 1354.72811
14.95000 -1833.66379 -1.44602 -56.96398 528.01211 125.60130 1337.52436
15.05000 -1829.56589 -3.77840 -49.63087 524.99022 111.28360 1326.53982
15.15000 -1812.56333 1.79810 -116.89013 521.40713 85.54089 1328.54797
15.25000 -1800.30231 0.50852 -25.62967 510.64719 120.91002 1327.45786
15.35000 -1793.52748 -2.66966 -63.42156 527.99594 207.82464 1337.62415
15.45000 -1770.81094 6.43111 -77.80298 677.35088 407.04864 1419.41175
15.55000 -1791.15659 -7.35849 -33.41268 527.33612 356.22477 1298.42942
15.65000 -1759.58812 -0.53311 -47.39916 518.82540 111.58561 1308.09200
15.75000 -1769.89660 -4.65388 -72.00728 496.96841 196.91758 1286.84602
15.85000 -1746.93094 0.51613 -75.64887 520.06198 102.52714 1293.03335
15.95000 -1757.64353 0.64706 -70.97008 501.66599 291.60344 1274.18320
16.05000 -1735.85210 -0.84602 -29.75353 490.13067 113.97022 1276.53421
16.15000 -1714.92659 -0.11325 -81.40417 537.99383 170.52298 1285.74324
16.25000 -1715.18752 -1.85424 -44.11237 503.31041 88.26626 1265.78900
16.35000 -1716.54900 0.62523 -104.36350 487.13929 86.59791 1254.54812
16.45000 -1702.99174 0.50890 -71.99710 493.48109 77.52273 1255.33297
16.55000 -1696.38718 0.20174 -43.96408 485.66339 74.54411 1243.59479
16.65000 -1693.48283 1.57630 -74.88468 493.24592 74.65846 1233.78950
16.75000 -1696.58592 1.39369 -88.70634 476.55720 75.38496 1218.66101
16.85000 -1669.52693 -1.46405 -53.74966 476.85626 83.55512 1238.27574
16.95000 -1668.15970 1.24363 -94.61491 487.49742 114.17938 1220.80883
17.05000 -1669.69915 0.61988 -82.10542 476.20657 74.77053 1203.82231
17.15000 -1654.25994 -0.93939 -86.18714 473.10833 143.24168 1218.12536
17.25000 -1642.16609 0.34659 -105.62105 473.10681 77.24125 1212.00355
17.35000 -1645.38970 0.56506 -52.42503 469.00840 77.40155 1191.87231
17.45000 -1628.78179 -1.12838 -17.81586 472.33593 91.15264 1188.92538
17.55000 -1619.86394 0.33201 -88.00241 465.40478 76.10616 1192.42815
17.65000 -1595.98236 1.90343 -29.90528 463.82922 71.74947 1198.90059
17.75000 -1591.63185 0.56643 -48.25619 467.86430 67.55654 1189.75208
17.85000 -1593.48098 0.06128 -46.78174 462.38380 81.72177 1176.55925
17.95000 -1579.92474 -1.44383 -61.52477 468.23698 120.28633 1177.54134
18.05000 -1573.43965 0.75078 -89.05042 455.68660 136.22332 1174.03404
18.15000 -1586.72876 0.42875 -56.77343 446.24934 70.98527 1148.19218
18.25000 -1575.64752 0.16865 -103.58922 455.41826 73.64182 1143.05371
18.35000 -1568.01177 -1.70576 -51.43655 449.69912 85.57085 1142.94523
18.45000 -1553.23025 -1.88846 -61.23778 458.87609 74.26909 1136.58689
18.55000 -1537.07985 2.67629 -88.09764 450.42318 66.72452 1149.75568
18.65000 -1538.01636 -0.62757 -17.41471 446.17592 74.80468 1130.14665
18.75000 -1507.74602 -1.38645 -58.13037 438.01448 73.23207 1161.67550
18.85000 -1520.49988 -1.16732 -54.29355 443.41799 72.60254 1129.47585
18.95000 -1537.77906 2.29299 -79.58922 494.91993 111.81299 1102.29731
19.05000 -1505.49550 -0.65168 -35.67542 435.49598 63.59830 1122.59895
19.15000 -1500.33403 0.92396 -34.75332 435.70916 58.21178 1112.64481
19.25000 -1483.67466 2.22771 -78.70248 450.38776 77.92593 1121.79775
19.35000 -1485.80826 -0.39161 -43.09631 434.06714 59.60702 1104.45368
19.45000 -1475.06798 0.91057 -30.60514 430.89866 59.88253 1106.81530
19.55000 -1470.18842 -1.35425 -81.55071 429.26076 65.10876 1104.83943
19.65000 -1472.57335 2.49112 -57.43637 428.12030 55.80307 1083.82579
19.75000 -1465.93637 0.47979 -53.71081 429.34129 158.26269 1101.52251
19.85000 -1470.78095 -2.46014 -54.15034 414.60370 61.97700 1064.48421
19.95000 -1445.48221 -0.36318 -42.97033 422.56019 60.42366 1077.66926
