0.12500 0.00980
0.37500 0.05872
0.62500 0.12589
0.87500 0.19013
1.12500 0.24812
1.37500 0.27770
1.62500 0.31174
1.87500 0.33825
2.12500 0.37339
2.37500 0.40045
2.62500 0.43128
2.87500 0.46392
3.12500 0.47378
3.37500 0.48252
3.62500 0.46346
3.87500 0.41764
4.12500 0.36819
4.37500 0.30966
4.62500 0.26558
4.87500 0.23996
5.12500 0.21027
5.37500 0.18632
5.62500 0.16667
5.87500 0.17714
6.12500 0.18113
6.37500 0.18266
6.62500 0.18577
6.87500 0.17575
7.12500 0.12943
7.37500 0.09989
7.62500 0.09780
7.87500 0.09217
8.12500 0.08562
8.37500 0.06037
8.62500 0.04288
8.87500 0.01595
9.12500 0.02854
9.37500 0.04463
9.62500 0.04473
9.87500 0.04568
10.12500 0.04854
10.37500 0.05608
10.62500 0.06626
10.87500 0.09725
11.12500 0.11105
11.37500 0.10436
11.62500 0.09317
11.87500 0.12509
12.12500 0.14268
12.37500 0.16093
12.62500 0.18380
12.87500 0.18942
13.12500 0.18205
13.37500 0.16679
13.62500 0.14454
13.87500 0.11796
14.12500 0.10088
14.37500 0.07687
14.62500 0.05833
14.87500 0.02819
