0.05000 -2120.74272 75.29301 313.39101 1482.16817 1401.12610 1055.74438
0.15000 -3327.60150 112.09883 254.24054 1723.24014 1603.63375 3630.08150
0.25000 -4196.72977 -13.75659 156.44702 1675.49677 1439.95801 4686.61126
0.35000 -4775.96784 62.90637 113.04315 1593.99532 1186.16903 5390.48320
0.45000 -5036.36110 10.84197 35.24504 1658.60237 1089.82003 6046.33127
0.55000 -5445.89100 49.06588 173.35454 1610.07655 997.43650 6560.53555
0.65000 -5727.38091 74.13211 92.85972 1716.08506 866.55577 6793.42866
0.75000 -5947.37794 52.63936 121.68128 1632.91532 785.96016 6853.59554
0.85000 -6049.77298 47.24909 26.03096 1582.79227 780.00911 6897.82589
0.95000 -6282.80065 61.53991 233.48571 1524.33414 781.44103 6783.32733
1.05000 -6470.04586 52.33492 117.93752 1483.67832 735.37221 6763.00851
1.15000 -6606.70555 43.29436 -29.23733 1407.80246 732.07432 6657.55811
1.25000 -6804.05372 61.97522 -107.19155 1309.54661 724.55265 6512.05751
1.35000 -6937.54643 57.50119 -67.59164 1355.06521 682.74787 6437.28004
1.45000 -7112.79973 57.44379 -63.78872 1240.25926 685.66220 6207.18684
1.55000 -7244.35277 56.62903 64.52833 1273.49589 659.89360 6016.62784
1.65000 -7339.65816 62.36884 59.87885 1239.16721 631.86429 5921.29631
1.75000 -7458.27729 62.69087 24.73137 1166.32710 632.47073 5690.19813
1.85000 -7520.82092 60.93348 -76.51992 1109.86940 583.39133 5622.57920
1.95000 -7544.84771 38.31999 0.23248 1067.78804 581.95154 5409.87087
2.05000 -7583.73598 61.42942 35.36990 1043.39384 567.84282 5206.19061
2.15000 -7591.97774 59.90408 -5.24801 1003.12400 562.59966 5082.43478
2.25000 -7647.67978 56.77098 19.07830 905.35189 541.98331 4906.02802
2.35000 -7673.68136 50.56450 40.38820 914.06365 538.99375 4769.93940
2.45000 -7697.05598 51.57227 -22.98782 880.37949 531.37685 4624.78613
2.55000 -7686.84742 51.27632 -51.11014 842.64601 508.22687 4484.00667
2.65000 -7660.57074 46.05128 -39.31808 793.44681 489.76402 4325.93631
2.75000 -7638.14905 49.40565 -71.83774 767.32598 463.06333 4199.88340
2.85000 -7609.73216 45.17828 24.70260 712.19507 459.52276 4073.21592
2.95000 -7611.82530 37.86848 5.17264 707.71553 454.12848 3936.70007
3.05000 -7574.97738 46.99670 -41.68057 691.54224 434.92437 3841.34616
3.15000 -7562.37707 48.82460 -26.25776 654.82075 416.80854 3732.62698
3.25000 -7529.18254 49.62988 -9.21394 655.76369 397.82611 3677.08361
3.35000 -7515.16160 39.32023 -66.69884 607.64320 394.41128 3527.34578
3.45000 -7471.05387 39.57936 -41.96203 592.85141 399.03922 3408.17799
3.55000 -7410.26924 46.81102 -55.78439 571.24077 373.05658 3316.58916
3.65000 -7363.24636 42.02766 -61.32375 549.96642 380.58457 3215.77329
3.75000 -7306.92742 38.68209 -61.90613 540.89972 367.29653 3175.03505
3.85000 -7253.62726 40.27433 -43.00095 521.24007 365.97507 3059.08789
3.95000 -7203.16805 40.51615 -43.46018 505.07468 349.16466 2984.43760
4.05000 -7158.05699 38.47207 0.89701 515.75387 350.98566 2893.32922
4.15000 -7117.42468 45.13019 -37.57703 508.83995 328.47308 2830.35846
4.25000 -7099.32384 37.09490 -11.45085 475.69553 307.28450 2737.05151
4.35000 -7053.77626 37.06181 -61.09702 459.51178 320.10436 2655.91582
4.45000 -7004.04808 39.71824 -7.45233 447.07621 312.49139 2582.86186
4.55000 -6962.67952 30.81444 -79.57659 430.86241 282.61663 2537.00072
4.65000 -6919.15231 32.89357 -16.15053 443.44846 318.18559 2479.96326
4.75000 -6886.73666 32.06659 32.63671 442.10601 295.59743 2406.00102
4.85000 -6831.24871 35.29401 -49.90914 421.83179 274.91315 2339.08221
4.95000 -6794.02719 36.22211 24.68867 390.45482 266.88143 2245.80147
5.05000 -6730.47841 29.80078 47.05844 398.62854 279.99770 2217.34780
5.15000 -6689.40569 29.04079 -2.63290 366.96772 252.86589 2143.78437
5.25000 -6635.09744 28.98371 9.36034 382.28000 268.85497 2094.94563
5.35000 -6589.99049 33.07788 6.44411 388.00628 275.29233 2050.56246
5.45000 -6543.58249 28.57602 -3.97696 375.97682 243.64936 1998.38917
5.55000 -6483.42419 28.78625 61.95401 341.34122 252.03433 1947.71673
5.65000 -6432.92852 29.51750 47.94753 342.26818 226.48915 1897.20705
5.75000 -6376.75694 27.75818 50.43407 336.73179 243.08354 1892.66909
5.85000 -6339.07610 26.62187 42.94816 341.46534 246.93361 1825.59574
5.95000 -6289.09538 27.22708 65.48454 340.81345 247.47732 1754.98430
6.05000 -6232.21172 28.56679 52.13031 315.52188 231.49437 1716.77156
6.15000 -6178.33160 25.83251 52.47020 320.96247 224.96521 1690.80188
6.25000 -6138.37584 25.71110 42.71928 306.67393 215.42236 1639.98140
6.35000 -6090.45765 27.81943 50.32150 291.65318 235.03771 1606.85184
6.45000 -6040.23205 20.74956 13.75089 319.17567 222.59361 1561.02349
6.55000 -5991.65912 22.26767 38.81813 305.11318 200.54825 1521.25218
6.65000 -5944.33068 27.55038 22.00364 289.42627 233.81486 1473.05852
6.75000 -5901.59531 26.33259 52.64669 271.80990 223.92889 1453.16441
6.85000 -5863.49620 22.29659 29.47955 292.83449 204.06786 1402.51158
6.95000 -5816.76404 24.89853 32.90142 269.62743 186.79519 1367.95227
7.05000 -5772.90506 21.60839 60.36938 249.55449 224.13651 1336.11125
7.15000 -5724.41697 16.92699 27.67335 284.64019 221.90930 1303.95426
7.25000 -5685.02119 22.59203 41.58849 264.31996 236.99505 1279.86276
7.35000 -5644.22971 17.97226 15.60538 239.47783 180.64624 1235.07793
7.45000 -5593.31503 23.19122 47.84928 253.97647 208.61841 1210.28816
7.55000 -5554.72529 14.89902 12.40663 237.88313 200.78198 1173.32675
7.65000 -5516.01120 17.01663 32.93441 252.98903 213.14640 1160.35472
7.75000 -5465.03511 17.09865 50.12656 228.76327 182.60393 1121.06779
7.85000 -5410.57192 20.73769 11.55115 246.92203 211.99415 1094.22415
7.95000 -5366.68378 21.57198 21.22754 254.24934 199.29283 1077.93993
8.05000 -5326.78832 18.05302 11.73761 236.91266 208.65587 1037.54113
8.15000 -5274.61516 18.47833 22.97233 217.98801 188.44827 1029.12429
8.25000 -5231.36133 18.69330 -0.85183 237.66569 151.86402 993.62927
8.35000 -5184.82315 18.68304 -3.37073 207.72344 166.45002 967.86153
8.45000 -5133.68269 16.46462 -27.17544 222.94308 175.02938 948.98392
8.55000 -5090.67794 19.62297 -10.28140 205.19728 160.42710 933.78114
8.65000 -5048.72038 16.64358 -27.98969 202.17110 160.62300 905.06530
8.75000 -4999.39062 13.70453 5.99225 185.97644 161.83317 874.59756
8.85000 -4950.77875 19.73965 -37.43552 205.88946 177.67507 859.49417
8.95000 -4909.58672 17.72479 15.52032 194.06084 130.34015 838.54809
9.05000 -4856.99489 16.00696 -43.23727 182.85986 152.60936 808.47886
9.15000 -4810.75804 18.34721 -18.40724 159.21081 149.41063 806.40656
9.25000 -4765.93976 13.53217 -17.90990 181.22010 160.59251 775.62465
9.35000 -4724.05296 16.99122 -10.28878 166.34663 135.50418 778.16219
9.45000 -4686.48320 15.08490 -37.75250 155.38796 136.89763 733.21995
9.55000 -4645.54866 15.70244 -6.27416 185.06479 128.13441 726.34176
9.65000 -4605.33267 10.24733 -6.93002 142.42507 144.22691 724.82472
9.75000 -4566.61282 11.42639 -33.21025 177.96661 118.97040 702.81349
9.85000 -4532.12100 16.53112 -15.07020 168.39112 171.77134 684.46088
9.95000 -4493.11963 13.32578 3.66987 172.55511 131.95831 675.00781
10.05000 -4450.91869 17.29832 0.23516 156.73803 136.08831 655.63207
10.15000 -4410.53704 9.12901 -5.44540 158.05188 144.87783 641.51625
10.25000 -4374.35033 14.52465 2.28337 165.10451 150.52672 621.83061
10.35000 -4343.84867 12.48199 6.43480 140.08780 144.68387 614.94908
10.45000 -4306.15180 13.76423 -1.58810 159.98516 137.56130 588.13818
10.55000 -4281.18584 11.09163 -11.77419 177.66018 123.03608 587.20156
10.65000 -4246.88634 11.73919 -7.13201 156.47817 112.19988 561.51466
10.75000 -4218.40882 11.49382 0.92784 150.38445 147.71248 561.39138
10.85000 -4187.99736 16.33847 -5.39661 131.00084 154.73463 546.95746
10.95000 -4155.22596 12.05734 15.15892 130.34013 128.76510 532.99575
11.05000 -4124.40449 8.45831 -13.80435 116.19277 113.02836 521.43657
11.15000 -4089.07310 10.81308 -8.07919 137.36711 120.95146 514.28548
11.25000 -4061.71092 12.94170 3.07559 147.37864 152.65740 495.48114
11.35000 -4024.19942 9.05901 -28.53516 121.26102 131.44041 493.45312
11.45000 -3992.62613 9.14704 -4.06603 169.05390 133.85639 472.82937
11.55000 -3966.20320 13.01389 -21.34221 131.01699 122.66823 465.47819
11.65000 -3931.55719 10.59428 -25.14290 180.59308 116.28847 466.74217
11.75000 -3892.10809 11.35499 -2.15917 169.09169 96.47299 458.11868
11.85000 -3855.04897 9.09413 -22.42745 165.18464 150.83474 447.12287
11.95000 -3826.21375 5.77728 -2.63037 112.17786 111.91777 421.55157
12.05000 -3788.42700 15.22610 -9.81306 164.26452 157.10210 425.88494
12.15000 -3762.68469 12.91187 -0.67814 110.12370 103.78188 408.32211
12.25000 -3732.31526 16.85542 -14.41782 143.88424 93.72775 427.75298
12.35000 -3693.00415 13.89036 10.91705 158.61642 162.57905 393.92780
12.45000 -3665.71075 17.81194 8.19915 96.52964 81.58019 380.07066
12.55000 -3641.00118 18.37074 -15.53943 103.24495 87.89844 375.15973
12.65000 -3612.34559 17.86165 0.71540 116.59195 101.69759 361.86130
12.75000 -3588.60046 16.98258 -7.03909 84.65609 82.05749 359.60650
12.85000 -3563.67357 18.41955 -11.15416 128.32804 87.70019 342.56697
12.95000 -3539.05254 17.74432 -12.92917 101.24568 73.71693 332.94211
13.05000 -3519.82617 14.77109 -14.05380 105.74187 74.09630 342.11800
13.15000 -3496.71089 18.05564 -6.64559 79.36761 70.52275 321.58875
13.25000 -3469.88537 16.83951 -12.51369 100.84039 77.43070 316.83925
13.35000 -3442.96961 22.17278 -15.78046 105.27954 111.50542 320.85309
13.45000 -3425.98653 13.06134 -17.61829 88.32605 84.78744 313.58262
13.55000 -3400.94513 14.20556 -25.36268 87.67222 92.90153 304.64997
13.65000 -3383.50789 16.26792 -42.48482 113.27215 68.68663 282.65747
13.75000 -3357.62120 13.99520 -29.13956 79.57717 70.77542 292.59317
13.85000 -3329.90611 15.91072 -38.38009 130.08812 85.30612 294.62682
13.95000 -3312.58374 14.16147 -41.20327 73.20945 61.78490 282.65676
14.05000 -3284.71509 19.11640 -52.19872 77.44529 61.29537 277.49289
14.15000 -3259.31642 16.30940 -54.93948 80.70761 69.92399 282.23986
14.25000 -3240.14431 12.65817 -44.15498 117.66858 83.23998 273.01656
14.35000 -3218.90488 15.45812 -64.61014 73.18310 68.28858 251.12561
14.45000 -3195.70864 15.36567 -38.65729 64.94469 68.62725 252.52150
14.55000 -3171.17797 12.41386 -48.88710 72.22800 69.41228 249.50866
14.65000 -3147.46367 13.61673 -42.72873 57.70964 71.47031 240.67018
14.75000 -3122.65663 14.50728 -53.79725 69.58331 74.48985 241.62925
14.85000 -3095.11249 13.84282 -59.04229 139.10925 65.00532 229.32421
14.95000 -3072.18146 13.11494 -54.02237 55.00863 57.57931 228.55680
15.05000 -3049.07905 14.34840 -47.40534 51.60889 54.60917 228.58645
15.15000 -3021.52031 16.45061 -42.22712 74.91690 101.14706 261.26580
15.25000 -3001.48713 12.82674 -31.31962 55.08900 53.50148 212.22055
15.35000 -2973.91262 14.18682 -25.49835 90.54143 59.15036 219.40639
15.45000 -2959.16859 13.45677 -23.46134 58.61127 52.96955 197.57052
15.55000 -2934.97956 10.45799 -30.80051 72.49267 73.79515 193.96977
15.65000 -2915.38915 14.35162 -16.46554 41.55949 53.96814 195.83764
15.75000 -2890.39665 12.45670 -10.96568 55.93561 96.80961 213.19115
15.85000 -2871.26555 12.46827 -5.46883 51.55622 50.58535 188.84542
15.95000 -2858.96746 10.81015 5.59540 65.16381 56.61159 188.86363
16.05000 -2833.67711 9.20518 18.31545 61.04960 61.68422 206.83732
16.15000 -2820.83778 8.82356 3.39939 56.21301 58.25281 169.80913
16.25000 -2800.84035 10.68562 7.89005 59.16438 53.69727 181.36857
16.35000 -2781.58736 13.92197 11.79315 57.62495 53.42655 175.54628
16.45000 -2765.98449 12.15485 12.00828 68.71503 52.54461 167.71231
16.55000 -2740.55250 10.59536 4.01253 80.14662 50.49204 165.91851
16.65000 -2725.45542 10.07888 11.83407 47.92187 58.05700 159.30137
16.75000 -2711.15005 11.29702 2.29521 56.70625 54.49315 163.35992
16.85000 -2695.44736 10.75427 9.61770 70.94920 57.01858 171.84141
16.95000 -2682.55744 9.58820 2.83098 54.16092 61.15673 164.35600
17.05000 -2662.10685 10.13534 -2.48919 50.54202 53.96382 159.56800
17.15000 -2644.41721 9.36441 8.23608 57.49180 69.51233 160.51023
17.25000 -2629.12850 11.27694 1.45562 45.19344 42.98104 149.27064
17.35000 -2611.01074 8.69382 -3.34002 79.91816 69.67916 167.27757
17.45000 -2591.55620 12.68504 -9.46994 113.38393 93.41082 158.65795
17.55000 -2582.61429 7.97605 -8.03754 51.03982 47.59623 140.62359
17.65000 -2569.96422 12.16456 -14.00372 64.99591 42.40050 145.67880
17.75000 -2551.58230 8.39357 -15.06322 58.57907 53.73898 141.28353
17.85000 -2538.42400 8.26651 -8.98999 44.85276 51.75839 150.41202
17.95000 -2521.59456 9.86072 -17.95436 55.76847 57.64224 146.11414
18.05000 -2510.43027 5.57123 -13.75025 53.66671 70.88430 155.54277
18.15000 -2493.91551 9.88962 -24.99596 59.53724 52.24085 130.62142
18.25000 -2479.50206 6.53427 -20.54554 39.89700 55.60551 139.41313
18.35000 -2464.30486 7.07173 -30.54370 56.90522 65.92614 143.74608
18.45000 -2440.51702 4.74221 -23.84558 144.44622 82.70073 176.77530
18.55000 -2433.68827 8.65894 -4.00107 44.55783 50.62587 121.04272
18.65000 -2421.97553 7.05588 -7.73869 40.62879 62.50120 122.24314
18.75000 -2405.63781 9.49146 -13.89292 34.69213 36.58102 121.12341
18.85000 -2393.41190 9.38327 -20.47817 48.13432 51.70626 127.12214
18.95000 -2379.03639 10.23044 -15.30476 45.57815 85.43776 114.44822
19.05000 -2365.30144 9.03965 -12.40520 57.27387 105.98245 131.88343
19.15000 -2352.17137 7.22819 -5.68074 58.49965 44.78184 121.83436
19.25000 -2339.69366 8.19152 -15.70760 41.09171 42.41374 117.33119
19.35000 -2320.28601 8.65962 -30.08282 66.90023 32.58690 117.39469
19.45000 -2310.50785 7.85968 -4.70397 37.64443 40.76363 101.90341
19.55000 -2302.54693 7.42953 -13.56410 63.94538 59.38422 144.64874
19.65000 -2285.48425 7.36376 -16.45178 54.02399 45.14818 108.31812
19.75000 -2266.20878 1.19808 -16.36020 31.26196 36.16224 95.41606
19.85000 -2253.10060 9.42279 -15.98442 58.92283 42.90218 105.07646
19.95000 -2240.38089 5.69398 -5.97683 27.93739 25.88277 90.36995
