0.05000 507.63319 -290.93970 233046.55042 2569.42423 1250.69992 624148.62059
0.15000 -1040.24534 -621.82209 321911.73360 3065.76972 1194.81482 1288621.70337
0.25000 -601.62902 59.42049 559884.71452 2733.85019 1597.65942 1130083.68770
0.35000 -819.36297 -125.48669 -227947.50297 2779.91599 1492.56149 1501987.36074
0.45000 -627.79375 1.99455 88433.35770 3115.52633 1571.55912 1150447.71536
0.55000 -279.58118 96.72830 -110347.12805 2884.89717 1637.64449 1365856.92685
0.65000 -862.53306 -198.94055 24993.82552 2858.82187 1654.85691 1377943.77980
0.75000 -939.22975 -46.14538 -202798.07758 2748.49156 1640.22915 1603239.04948
0.85000 -1093.20795 -8.02026 -93423.74261 2717.17275 1726.94089 1012007.49468
0.95000 -967.70204 -77.17381 -62597.66864 2677.35992 1981.93369 1607339.91358
1.05000 -1525.89419 -17.80209 -124984.54679 2227.96921 2147.72240 1219099.79810
1.15000 -1596.70182 -12.91478 -31906.60512 2122.14798 1953.96295 884541.12504
1.25000 -2051.79960 103.65316 -31119.59216 1683.94935 1913.76056 1230025.92245
1.35000 -2587.00706 -34.78755 -4313.74221 1654.95840 1989.94822 1177361.67014
1.45000 -2900.15345 -30.16283 -774.37829 974.35742 1814.36486 1072166.41057
1.55000 -3204.72196 -66.71023 47831.92971 883.70540 1848.63928 1402127.59475
1.65000 -3444.27785 48.05023 -7206.57755 687.13364 1492.97150 1576564.92498
1.75000 -3622.81355 -10.65149 -53798.26358 815.88257 1461.24731 1867965.77840
1.85000 -3752.98193 40.39016 14428.43619 878.19923 1373.75017 1651477.53033
1.95000 -3826.76938 44.64049 -67785.58983 992.08917 1452.04188 1576004.11987
2.05000 -3878.40990 8.33984 1881.63129 488.33023 1164.69879 2006759.89560
2.15000 -3919.25746 0.05201 64057.75382 518.07685 1068.80474 1817471.71937
2.25000 -3946.88189 12.99345 -56714.43684 784.39860 1167.72791 1622230.25848
2.35000 -3959.59871 5.76560 -41746.42063 745.19803 1179.95870 1741213.45107
2.45000 -4026.77595 7.62628 43196.30971 536.34678 946.85041 1960022.82437
2.55000 -4050.34475 -3.60725 -9699.54796 592.56880 1054.04721 1683949.28556
2.65000 -4082.60663 46.13118 -15574.49185 541.19619 893.17643 2135278.24349
2.75000 -4098.36541 -4.35017 2496.14793 550.90149 935.00519 1825522.18177
2.85000 -4114.28848 -19.57796 32788.48009 439.28984 829.56012 1784388.29393
2.95000 -4131.61201 -21.98875 28638.22345 522.74870 795.47205 2157240.47855
3.05000 -4139.03674 -23.78712 469.61347 320.36503 712.82940 1886375.73330
3.15000 -4121.33439 -22.89835 -64009.66409 529.63012 934.94355 1915529.94779
3.25000 -4118.96382 -12.55473 -42982.99542 413.08154 645.86125 2276251.69316
3.35000 -4091.67028 -1.89909 -33793.44079 442.36594 670.05982 2188922.67396
3.45000 -4082.73114 -18.82081 -13360.35400 348.32933 600.48651 2005879.24972
3.55000 -4063.05570 -1.50882 -40132.91918 420.28237 590.51595 2412979.88840
3.65000 -4068.94071 16.09481 -38602.76354 418.61395 625.08443 2235738.38793
3.75000 -4041.94148 2.43543 -1804.45548 394.58416 573.15665 1970325.70301
3.85000 -4037.65196 18.80931 -85066.70869 348.66388 555.92963 2297395.48977
3.95000 -4016.23510 -13.95912 -24995.33088 452.77846 639.85543 2227307.78638
4.05000 -4004.11122 9.24644 79678.50090 489.55382 516.64095 2239311.93539
4.15000 -3998.85405 4.63796 -66511.69749 308.26618 482.80548 2287332.24319
4.25000 -3978.26347 4.93163 -17653.88915 490.08048 521.83215 2526741.33820
4.35000 -3959.84055 -5.13478 -27653.04993 372.67439 471.70713 2424976.56111
4.45000 -3946.95176 2.49936 13018.23553 440.08038 487.89661 2129367.98673
4.55000 -3930.61832 1.83157 22607.79126 319.25516 432.88940 2259625.95201
4.65000 -3906.46824 5.37018 -10383.83301 287.19498 414.79888 2363744.13251
4.75000 -3894.64721 -5.69728 41338.74404 258.18120 401.64260 2258708.64893
4.85000 -3877.17663 9.14224 -23938.80616 326.46278 463.40109 2304181.80245
4.95000 -3862.65093 -5.62284 -43598.96759 334.43163 441.84505 2366140.10144
5.05000 -3836.04939 -0.63782 48241.77338 306.92159 356.67767 2026192.64879
5.15000 -3822.13969 -2.10321 25010.77699 264.37999 422.05768 2106001.32583
5.25000 -3794.97749 2.26185 -31361.95190 361.94513 379.12862 2446030.78313
5.35000 -3765.22008 -5.21030 58653.70675 300.51583 383.16596 2174593.88207
5.45000 -3747.56457 5.51411 -12203.31794 253.67274 337.41694 2292905.60371
5.55000 -3742.20059 2.06487 30611.89695 250.77708 324.22977 2306002.21851
5.65000 -3711.38927 -5.02235 12071.42418 371.48021 368.35752 1949208.77604
5.75000 -3701.81745 2.56077 -37371.45486 310.23680 337.42374 2448576.66319
5.85000 -3674.46430 -4.30723 -30790.83951 509.77952 534.28921 2447017.27102
5.95000 -3671.03112 -0.30451 -51879.96396 310.67778 353.70739 2351344.23883
6.05000 -3640.04139 0.07232 -73080.80159 411.76617 363.88030 2531037.06592
6.15000 -3617.14843 -1.68440 48953.54940 224.83085 284.21129 2160856.41306
6.25000 -3606.50889 1.36941 -24619.29445 301.34342 452.79945 2259152.10777
6.35000 -3584.35881 -5.32775 43389.64127 228.39883 294.53251 2321392.45235
6.45000 -3568.92161 0.43724 -6120.85519 247.55684 291.93001 2480372.43789
6.55000 -3556.72559 -0.59133 -35569.47170 487.88431 439.29865 2173283.63887
6.65000 -3528.34399 7.33802 46845.96084 223.62449 273.90353 2325753.91026
6.75000 -3514.31590 3.61363 -22643.14305 321.61629 363.25510 2264268.79320
6.85000 -3497.26282 -3.55408 37688.23028 213.00169 274.90390 2214632.48037
6.95000 -3475.41227 -2.78952 -101322.57112 209.39157 257.84743 2570462.78423
7.05000 -3459.71442 -1.52550 28278.43999 239.50695 241.65754 2560571.35350
7.15000 -3450.12124 2.04510 27891.05857 288.89180 267.88711 1960138.30593
7.25000 -3428.80656 -0.18647 -27958.86286 246.04549 330.11230 2148521.55576
7.35000 -3392.60658 -3.77230 -25504.78003 226.73536 245.31047 2325831.16166
7.45000 -3391.97911 1.81186 28586.96440 226.50906 240.20772 2402514.23249
7.55000 -3369.67646 -2.19101 -14580.05638 275.49026 235.63988 2232122.16097
7.65000 -3355.61074 1.01711 26997.49666 220.36539 234.59717 2275554.80747
7.75000 -3336.71737 2.16148 -3867.71978 238.74456 223.95742 2277507.06914
7.85000 -3320.47505 -7.39529 -96950.87055 253.81019 218.98721 2245258.58475
7.95000 -3303.06357 -6.81192 -101109.70819 238.04912 225.87929 2547982.06450
8.05000 -3287.41575 -3.14658 -42526.60110 209.71039 236.32067 2007263.75377
8.15000 -3263.97126 2.38363 29082.79037 234.45360 215.57174 2293888.68917
8.25000 -3253.40068 3.62240 -4096.06061 213.91097 205.13851 2355714.60322
8.35000 -3227.53436 -3.43821 9429.27022 371.52441 379.17504 2400502.98940
8.45000 -3212.51020 -4.86217 9656.64660 190.91526 213.06108 1977933.56572
8.55000 -3199.91566 -3.41097 18181.05895 280.07163 570.18177 2228889.99555
8.65000 -3183.17855 2.11390 30702.88303 512.87528 469.00286 2218164.71455
8.75000 -3161.18274 3.27744 19496.36530 219.53215 256.51476 2260077.26676
8.85000 -3145.07884 0.50389 -24499.62971 254.68657 506.50455 2242147.80066
8.95000 -3129.07761 -2.85980 -1864.14172 172.67414 216.48624 2438792.92709
9.05000 -3117.19683 3.61999 12186.24215 299.92578 217.65687 2055922.53654
9.15000 -3100.59380 0.38307 6683.40632 264.92716 196.42481 2328774.39101
9.25000 -3089.07939 2.80836 -35433.21372 350.90647 308.37797 2145315.73247
9.35000 -3065.54884 0.31926 -20726.05523 205.60808 197.99316 2036614.83648
9.45000 -3055.11854 -0.44095 64351.25362 221.25499 228.88459 2258070.27753
9.55000 -3038.86168 -4.41951 30128.73194 151.10142 192.02337 2038485.40739
9.65000 -3016.91704 7.43550 -34921.51579 196.62137 191.85168 2160847.62094
9.75000 -3007.12417 0.19760 -13462.05094 182.63685 224.52779 2103949.90416
9.85000 -2982.90507 -2.15765 7248.03171 300.68137 202.14757 2162414.30705
9.95000 -2966.46902 -4.61548 61741.74910 240.92539 170.90807 2166342.81592
10.05000 -2949.72206 1.42737 -19675.37844 187.28082 186.36530 2148137.75106
10.15000 -2936.96243 1.34969 65469.97515 204.00042 153.77644 2255959.03950
10.25000 -2914.20555 -4.38193 -40351.33845 164.44817 171.34329 2170467.60988
10.35000 -2903.74072 -5.08572 -58493.75913 152.71551 150.57773 2159315.44520
10.45000 -2880.97956 2.91532 72122.48310 403.81785 260.03002 2090688.87617
10.55000 -2876.32495 -1.92164 4952.25555 403.48762 245.04779 2286816.46588
10.65000 -2852.18139 -1.52251 70151.64324 164.82025 159.23235 2214119.05963
10.75000 -2835.87349 -1.12603 8521.80650 175.68421 193.00707 2240186.97902
10.85000 -2823.59116 -0.32234 91436.42241 193.45118 164.73335 2258041.18331
10.95000 -2813.40930 -1.93081 -15123.43967 385.81015 148.25740 2287312.15511
11.05000 -2794.84084 2.97003 55504.17550 279.12205 255.72042 2348065.86580
11.15000 -2786.35086 -1.79177 45069.78667 305.34343 253.12356 2214093.00029
11.25000 -2765.90523 0.48240 81128.87532 129.51003 126.73425 1987337.70169
11.35000 -2751.70163 0.66630 21748.16326 149.11920 133.00369 1909532.51428
11.45000 -2729.42078 -8.18540 -57842.62882 336.99764 315.89939 2030173.67997
11.55000 -2720.37066 1.09479 15014.11343 152.05053 131.58616 1942556.49352
11.65000 -2706.75232 0.03823 -1952.80921 160.70870 137.92777 1946615.43574
11.75000 -2689.81985 -1.06141 -19313.22186 137.03698 140.85591 2110277.39460
11.85000 -2681.54523 -1.90714 72506.46866 147.59317 129.09443 2022648.70807
11.95000 -2664.71150 0.61746 -59295.79411 212.64141 208.59695 2244000.91167
12.05000 -2650.99446 3.83295 4376.03944 182.04198 154.96900 2265531.74085
12.15000 -2641.69441 -1.45560 55925.76365 128.57838 122.98570 2020659.76606
12.25000 -2624.64626 -1.74081 25916.97412 244.64890 137.80742 2048002.00174
12.35000 -2612.79129 -0.27474 49553.48561 125.16244 141.00930 1992865.84677
12.45000 -2599.28354 -2.37241 74635.65849 111.59166 112.99125 2246415.07163
12.55000 -2585.96343 1.13387 6973.71451 144.23273 121.96519 1919981.26094
12.65000 -2572.43669 -0.22901 -16024.24787 143.99289 121.53413 1910864.03795
12.75000 -2562.20935 -0.56526 29837.53562 131.27284 116.28301 2063053.62261
12.85000 -2552.68147 2.97788 -391.43235 282.69820 324.86399 2070400.75146
12.95000 -2535.42298 1.77574 -42897.99661 123.23277 145.42347 2010388.96485
13.05000 -2525.91201 0.13080 89145.34231 116.82357 112.34847 2352935.01898
13.15000 -2508.11642 6.01077 1338.12885 136.66497 115.12342 2025024.93838
13.25000 -2495.78573 -0.64243 -92312.80960 150.03581 158.81687 2178809.47590
13.35000 -2484.38157 0.77353 5614.20560 129.00254 208.50545 2069004.90378
13.45000 -2467.44654 -0.20396 18338.07694 126.32666 100.47973 2073605.27320
13.55000 -2459.18869 -0.00737 -22366.24285 113.11129 96.97447 1954082.55982
13.65000 -2448.04473 -1.41464 -57339.16079 114.39133 103.42811 2031928.59936
13.75000 -2432.04855 -1.42295 30659.68212 112.40834 102.69971 2201510.89358
13.85000 -2421.55445 0.99617 4550.36518 120.50256 102.62663 1976427.81325
13.95000 -2412.25072 -0.72587 42027.93938 112.64207 93.30690 1989654.76811
14.05000 -2392.06690 2.09882 26825.84012 189.82898 516.56416 1930209.94251
14.15000 -2386.52541 4.67171 12247.05899 112.97347 92.34750 2070844.63003
14.25000 -2370.31753 3.04384 27581.70649 116.40834 101.88294 2123925.56920
14.35000 -2361.97143 -1.04899 256.52881 107.16612 106.72592 2205829.02604
14.45000 -2350.75100 1.43400 -86044.70570 108.38396 109.83982 1996935.96285
14.55000 -2339.97493 1.26227 -2718.18494 130.85530 98.22563 1969413.39214
14.65000 -2325.85027 -0.32251 41918.35342 111.87141 97.25724 2306170.66739
14.75000 -2318.47434 -0.65623 43311.32390 171.70945 208.52348 1894534.76998
14.85000 -2302.61143 3.27458 -11072.81989 99.30875 88.55316 1959358.41891
14.95000 -2296.60619 3.53128 34408.17020 117.06525 110.29169 2118502.74933
15.05000 -2281.57207 -1.00036 -18635.09543 97.54523 80.27233 1820753.40062
15.15000 -2274.96975 -1.46663 -10836.07335 97.03184 83.77832 2042292.43124
15.25000 -2262.19989 -0.35108 22877.39985 156.62254 102.67416 1905386.31786
15.35000 -2256.99617 1.01374 48959.32433 139.70066 96.23101 1887774.12612
15.45000 -2243.09859 1.12370 10040.57507 149.24959 120.17821 1791616.78413
15.55000 -2229.19839 -1.46503 -27664.38464 150.36746 189.43055 2014538.78528
15.65000 -2221.64726 1.14468 -16507.99151 118.43254 165.87282 1954711.02829
15.75000 -2211.32517 1.43712 -14656.33837 133.73349 132.12082 1914934.11582
15.85000 -2200.82045 -0.74134 9694.44666 113.12375 102.96442 1930513.66288
15.95000 -2187.75770 -0.78623 6634.01469 114.99751 83.34753 1824017.78215
16.05000 -2179.48135 1.04206 -5040.03543 107.28409 101.87511 2012003.91103
16.15000 -2170.33351 -2.78052 -19486.01961 94.18589 78.67910 2087084.64421
16.25000 -2158.66329 2.44199 -14241.71526 124.86252 92.45903 2081642.14007
16.35000 -2147.62266 0.91901 30727.09571 110.21261 82.14868 1807023.59203
16.45000 -2143.08510 0.00779 -6057.68517 121.96816 132.09606 1912402.59759
16.55000 -2131.57604 0.73397 -31304.96493 100.34999 84.75886 1742882.82505
16.65000 -2122.70867 -0.20921 -3979.52098 139.81539 111.57964 1933762.54200
16.75000 -2111.59905 0.95654 36751.06396 144.40314 85.39885 1848826.31270
16.85000 -2105.70440 0.07922 29447.57447 159.76241 110.36223 1878546.24270
16.95000 -2095.29388 0.54522 7254.08798 93.82336 80.44024 1904480.88434
17.05000 -2083.50114 -2.08695 32611.35971 109.85165 100.14775 1817087.56084
17.15000 -2075.58863 0.56171 -21918.01280 110.02327 89.80195 1871073.56202
17.25000 -2061.13654 -1.99942 -77219.64535 92.92102 70.66837 1941246.12376
17.35000 -2054.97742 0.99314 -4958.94450 141.06202 142.02826 1751418.45876
17.45000 -2041.91175 -4.10260 8468.96323 89.49098 68.54609 1900416.36865
17.55000 -2036.98070 1.80849 -4811.56014 85.62106 82.65071 1899068.00467
17.65000 -2023.04459 0.64843 4838.90577 126.15799 98.71986 2052766.09763
17.75000 -2017.12665 0.37238 10440.17737 84.90328 67.84018 1828331.43675
17.85000 -2007.04176 -0.08973 -71546.37688 108.94281 84.14363 1755005.45052
17.95000 -1999.51373 -1.43606 4804.32930 114.50021 160.21787 1741146.04629
18.05000 -1990.08516 3.54238 40278.42791 307.97235 205.04865 1944532.45917
18.15000 -1981.10988 -0.05012 184.15563 83.06053 59.36977 1623144.46097
18.25000 -1972.73630 0.32134 -66980.03804 107.34298 65.42709 1752105.88776
18.35000 -1963.72705 -0.65016 -30596.40556 90.22264 67.90218 1875102.27631
18.45000 -1956.67012 0.28752 36225.08334 82.67441 60.21495 1790210.13299
18.55000 -1948.50932 -0.80596 23413.59475 94.03201 60.14447 1859547.49986
18.65000 -1938.13923 0.47485 -43776.13321 89.57866 69.44467 1764506.93978
18.75000 -1927.83290 0.69333 74047.04607 77.10360 77.04234 1696549.63063
18.85000 -1919.92055 -0.04919 -27128.66244 97.33053 111.44851 1965729.75815
18.95000 -1913.65717 0.03242 2916.77701 79.72299 67.80366 1763924.40313
19.05000 -1904.80989 1.51075 17087.80911 81.13195 67.82448 1732367.69721
19.15000 -1894.67685 1.85554 -6992.85728 93.53499 82.67579 1936541.70462
19.25000 -1888.54798 0.78069 11122.93286 88.37769 62.82005 1946871.71746
19.35000 -1876.61477 3.75221 -36507.56619 91.34730 63.48506 1760301.18463
19.45000 -1871.31486 -0.16774 5996.92487 82.53675 59.09488 1716776.25997
19.55000 -1862.78983 -1.80371 -14264.96303 75.71145 62.74596 1872268.28117
19.65000 -1855.45887 -0.55796 31403.96297 74.55766 69.53435 1841060.43833
19.75000 -1843.82372 0.25331 -66967.70347 82.29779 59.01882 1855177.29791
19.85000 -1840.55318 1.94816 -227.64350 99.44695 88.86953 1623674.15996
19.95000 -1831.03785 -0.61615 25332.59257 81.99618 75.12333 1766822.80439
