0.05000 3422.21147 1517.93375 -84747.66303 0.00000 0.00000 0.00000
0.15000 13.99322 388.03070 -39151.91893 1899.72783 1239.36259 354679.27374
0.25000 671.89330 -152.87275 -98452.85806 2384.07557 991.33121 681846.61795
0.35000 -928.30538 19.96170 10845.52743 2504.16987 1003.37913 1913978.62970
0.45000 -97.24647 43.99888 138174.18751 2450.18171 1106.71660 1155295.52351
0.55000 -349.78024 120.57573 -3106.91858 2441.76634 1123.05653 868790.53597
0.65000 -660.25586 -39.74022 116178.21135 2492.30042 1182.99559 1446805.12927
0.75000 -1012.58779 -14.44879 -45232.05146 2261.05631 1163.84110 962398.19904
0.85000 -1047.56530 44.83265 6519.36319 2282.74102 1139.38056 2555625.13682
0.95000 -1139.30855 -46.91255 -98049.30900 2155.70022 1242.85268 1472225.09039
1.05000 -1540.26288 -38.05030 -93677.64930 1821.11738 1178.07670 2013176.00413
1.15000 -1501.23724 66.50596 -9716.98545 1764.84990 1361.66660 1611243.21264
1.25000 -2046.98269 -44.65678 32150.45664 1464.08971 1237.25517 1307876.68116
1.35000 -2428.53818 9.17275 -6743.55707 1160.02746 1199.30341 946730.55717
1.45000 -2672.51388 -20.88513 29712.31782 923.48493 1214.99229 1481838.92037
1.55000 -2948.95734 32.11519 -38821.75128 683.63915 1142.71633 1391008.16986
1.65000 -3239.49011 -19.65863 8935.77223 545.06363 1019.34425 2013863.98856
1.75000 -3358.86125 6.36542 69740.71187 464.59001 950.36483 2295353.82273
1.85000 -3461.03004 11.45537 -26556.52109 404.76099 882.50840 1349870.02803
1.95000 -3574.41352 2.35047 29457.46006 342.77593 824.64468 1617405.62370
2.05000 -3654.40805 11.41774 -23870.59663 295.86291 736.55074 1632241.59353
2.15000 -3697.23476 6.73475 -25026.56617 264.83388 742.92220 1761974.80058
2.25000 -3754.66012 -20.14877 -103034.82178 234.22404 671.66758 1953428.36236
2.35000 -3800.99729 7.47637 -17506.92942 212.15913 658.47960 1998723.60032
2.45000 -3845.53863 -24.87860 -116265.75322 199.40422 621.33375 2162979.03802
2.55000 -3886.80671 15.21591 13237.50993 189.49338 615.43281 1785141.10380
2.65000 -3910.88599 13.54974 -38653.71659 171.44404 566.95266 2069897.39893
2.75000 -3931.52184 10.84099 8604.91477 175.95569 540.44929 2035673.32332
2.85000 -3940.36804 11.36378 -20171.41994 169.99717 522.00697 2122066.67981
2.95000 -3947.52085 -5.20725 24738.76687 163.43601 489.64263 1875741.58580
3.05000 -3959.48119 -0.21298 37663.42642 153.37457 482.98542 1800434.00619
3.15000 -3959.27343 -4.62072 -8256.10686 162.13001 449.17952 1971315.14308
3.25000 -3966.47679 18.83045 -20282.04165 158.96662 451.59110 2196214.50470
3.35000 -3958.87792 -5.98855 -12512.92070 160.94589 433.67243 2209772.41939
3.45000 -3963.27878 12.56965 -16353.70856 171.35920 412.73727 2486646.32374
3.55000 -3945.82204 -5.45848 33776.36198 164.35239 395.13283 2121268.15033
3.65000 -3944.60803 8.35578 -67128.16387 176.23432 382.56662 2074897.55427
3.75000 -3939.46761 -3.82183 -32986.21738 180.35269 363.78393 2282247.79607
3.85000 -3923.77505 -7.07844 -45358.73769 173.26639 361.70413 2375742.44664
3.95000 -3923.49855 10.56566 77884.57061 181.77527 351.44442 1956131.95512
4.05000 -3901.34872 5.34690 -40556.44212 177.40421 336.21562 2283966.92253
4.15000 -3895.01498 -7.24763 104553.44555 186.59916 323.53313 2393604.16033
4.25000 -3873.25343 -10.75243 -32804.97467 174.88907 318.54821 2260330.52045
4.35000 -3860.77514 2.07004 1311.08202 175.88308 306.70295 2337094.10729
4.45000 -3853.35729 0.75758 -102648.54032 178.60304 299.79852 2478873.12771
4.55000 -3841.74505 0.95026 34017.38035 181.54889 287.87794 2333608.91744
4.65000 -3822.14875 10.11126 1743.02286 175.60231 278.26036 1978710.29186
4.75000 -3816.24548 -6.15024 -125527.41974 174.41123 276.57738 2367847.80308
4.85000 -3802.01301 1.87392 -19540.12474 179.64714 261.22102 2393268.60440
4.95000 -3778.09637 -11.33729 35955.18003 179.73244 264.78341 2455656.26748
5.05000 -3754.66926 -8.60664 -15045.95250 177.19804 250.70251 2158600.69274
5.15000 -3746.35009 9.17338 26972.42012 171.55204 252.41802 2258588.05295
5.25000 -3726.62779 4.32234 30103.74669 173.95669 240.73974 2250616.93981
5.35000 -3703.24099 0.30231 52314.02456 171.50552 230.29291 2394474.82080
5.45000 -3690.25044 -6.41908 -78432.87229 171.09491 229.83603 2165236.08585
5.55000 -3667.09564 4.91014 -6073.98613 170.56268 221.98650 2483692.88969
5.65000 -3643.78085 -5.45410 -71895.29512 164.10617 220.05224 2206296.90308
5.75000 -3628.75394 1.80223 6620.84356 160.56839 212.94069 2453162.88448
5.85000 -3617.00310 5.49461 -33100.07281 157.62702 210.56131 2187522.63284
5.95000 -3596.86777 -6.05557 -11391.57058 156.56582 204.26874 2487014.61473
6.05000 -3576.31427 -4.21337 -61566.16191 151.29789 199.10954 2428280.85130
6.15000 -3568.45187 7.97403 -13160.43403 152.28445 197.62681 2180551.23646
6.25000 -3551.66548 4.66118 -26286.35636 147.07577 192.17695 2134172.10433
6.35000 -3538.14692 -7.81681 157846.26269 152.92762 189.84636 2384831.06102
6.45000 -3510.82501 -2.60948 35567.84711 145.32063 183.85262 2271027.52873
6.55000 -3503.38086 2.18846 50896.84050 146.64392 182.76810 2511000.78512
6.65000 -3485.81323 7.42176 -49568.16662 146.38209 179.26934 2494527.64067
6.75000 -3472.02564 -1.07899 32336.05900 145.30101 175.59205 2208231.02344
6.85000 -3452.39758 0.33980 -17465.65553 149.46288 171.07130 2263568.03787
6.95000 -3432.25726 0.31948 -190.50614 148.44794 170.65573 2317387.20018
7.05000 -3423.60015 -2.34903 60253.84893 146.19974 166.99646 2378327.04359
7.15000 -3400.38197 0.95170 -20451.61995 146.69002 158.62171 2192729.88820
7.25000 -3390.10326 -2.25208 52707.82556 149.42208 161.75531 2265721.06577
7.35000 -3369.52077 -1.47675 -65556.41103 148.57812 156.68021 2266947.21970
7.45000 -3357.00126 5.45823 -30860.19119 147.64708 152.05656 2131494.59492
7.55000 -3339.31934 -2.68237 -62510.49948 144.49206 151.29357 2505430.86691
7.65000 -3322.39110 -0.42403 -121601.65838 146.96025 148.60650 2214048.87289
7.75000 -3309.53891 0.66862 13037.89152 147.10909 141.72122 2176038.46048
7.85000 -3290.41187 -1.65226 83759.54246 145.43033 142.31403 2422576.14335
7.95000 -3278.62911 -3.26738 -8067.07607 145.96429 143.33779 2117520.60925
8.05000 -3254.54899 -2.27632 -21916.82916 146.00998 136.72928 2219127.91016
8.15000 -3245.42402 1.96381 -42181.07886 145.79425 134.84613 2188895.13701
8.25000 -3222.27140 2.19945 1333.76360 141.72830 133.57970 2214961.93630
8.35000 -3214.92548 2.46854 -29451.32760 141.14224 130.63240 2291571.87965
8.45000 -3200.33755 2.60769 27971.51670 142.65335 127.88693 2187331.55208
8.55000 -3182.66856 3.97159 3028.11447 141.61257 127.30902 1971619.71086
8.65000 -3162.54912 1.16357 -5322.91595 141.64707 125.00152 2166938.85543
8.75000 -3147.54830 1.00314 -14875.13633 139.16215 123.40060 2148327.82484
8.85000 -3126.94035 4.59298 -15766.87930 138.56537 117.94017 2455466.29061
8.95000 -3110.54371 -5.25165 -45428.73233 138.93151 120.29133 2043631.03462
9.05000 -3098.05243 -1.52226 -14983.35310 136.56947 116.23006 2313753.95679
9.15000 -3081.14531 -2.10947 33916.14005 136.50994 116.24657 2464420.74569
9.25000 -3062.26542 3.20246 68497.82204 134.50543 112.44162 2305686.07209
9.35000 -3047.04038 2.10067 31209.88583 134.66573 113.24706 2284351.71564
9.45000 -3030.91865 1.23982 -35487.20708 132.50394 109.59145 2130155.92244
9.55000 -3014.27772 -2.31454 -16184.46468 131.41978 107.06631 2200086.41746
9.65000 -3000.06077 -2.58499 19721.64740 132.59987 106.33061 2045111.64482
9.75000 -2979.05487 -0.89003 -42901.03368 127.83389 104.86185 2152747.32288
9.85000 -2970.94654 0.45036 84454.38172 125.72301 105.18693 2278072.40926
9.95000 -2952.78538 1.72155 -42407.85849 126.37715 103.70125 2028714.49957
10.05000 -2934.10998 1.14653 -14201.18409 126.93881 100.34151 2167249.61327
10.15000 -2921.51233 2.72707 19159.13345 125.37219 99.88322 2161611.60129
10.25000 -2906.03498 -0.11938 26841.92733 125.01258 99.40303 2143486.96376
10.35000 -2894.29485 0.04491 -48901.42221 124.97078 98.46365 2204138.00692
10.45000 -2876.10374 2.82879 -34947.37325 124.19304 95.01786 2066071.68223
10.55000 -2859.92041 -2.27508 -62137.93922 124.65475 94.55698 2042764.07934
10.65000 -2845.81774 2.17711 -84857.90613 122.31103 93.19487 2329069.77698
10.75000 -2831.18548 0.45547 -10143.52406 120.60139 91.83873 2024686.60347
10.85000 -2822.55344 4.68242 4642.84924 119.87573 90.49977 1942229.06190
10.95000 -2802.37753 -0.47767 -23395.19905 119.88095 89.68665 2244942.26289
11.05000 -2788.88544 -0.27664 8255.03660 118.87191 89.78836 2272606.71926
11.15000 -2771.53795 -0.84646 30815.57763 119.32663 87.15984 2338317.91375
11.25000 -2760.33155 1.68556 -24205.44180 115.51012 87.21258 2379021.54836
11.35000 -2745.03679 -1.69887 -7311.32544 117.12395 85.38164 2157434.23918
11.45000 -2734.35055 -0.91374 -2202.27906 116.53946 85.84135 1927295.30539
11.55000 -2714.88933 -1.46409 47395.79957 113.68071 84.17249 1835878.09130
11.65000 -2705.02956 0.59837 -43530.52078 111.77786 82.59629 2107383.14554
11.75000 -2694.34189 -0.57291 -15567.29677 112.06815 83.93090 1978455.90333
11.85000 -2680.78887 -0.94710 24320.79560 111.66116 80.55983 2009376.90468
11.95000 -2666.50022 -3.83906 10105.75005 110.24426 80.53944 2017813.25139
12.05000 -2658.80778 3.81022 35701.09340 112.14237 80.29561 2214177.96922
12.15000 -2639.93551 -0.25883 -49856.92698 110.72821 77.52624 2311678.50881
12.25000 -2626.96074 2.27374 5251.08145 112.07799 78.70475 2090310.10272
12.35000 -2616.59831 3.26110 -17587.88546 110.94900 75.94063 2118115.94070
12.45000 -2603.34946 0.76874 -63844.01174 110.13147 75.83331 2038849.40698
12.55000 -2587.82810 -0.37545 -25220.84110 110.33743 74.75037 2194244.16137
12.65000 -2576.97467 2.01940 7153.87683 108.96771 72.90365 2229779.79599
12.75000 -2563.84186 -1.80231 61642.96970 110.10485 73.21456 2014346.48187
12.85000 -2550.68034 -1.77093 100898.04410 106.79650 72.46512 2151855.11414
12.95000 -2539.06296 -0.23070 -82586.67952 106.13083 70.20773 1916486.48149
13.05000 -2528.76678 -1.31868 41517.38321 107.58864 71.04143 2126861.57341
13.15000 -2512.46610 0.11987 -22752.36430 103.82033 70.34596 2126357.78813
13.25000 -2499.06225 0.04155 37459.02102 103.61462 69.13475 2149765.18345
13.35000 -2487.14918 -0.48744 -98862.20850 105.74150 68.79555 2108712.66064
13.45000 -2476.60473 0.31905 9248.86363 104.33233 68.71784 2094702.72506
13.55000 -2462.09047 0.06012 11531.87594 104.37337 66.43536 2077564.29080
13.65000 -2451.78107 -1.24909 -19096.19198 103.01535 65.96324 1832376.31043
13.75000 -2435.62708 -1.45687 -23513.28192 104.44847 65.68944 2211224.63605
13.85000 -2425.71281 -1.28554 57755.59402 103.12001 64.64448 2062206.11778
13.95000 -2415.58427 -0.70971 29862.26609 103.14298 64.51380 1992430.96002
14.05000 -2403.49486 -1.23552 41384.05003 99.67960 64.28442 2310534.47061
14.15000 -2389.50742 -1.56712 63351.38416 99.24956 62.96595 2036296.01498
14.25000 -2378.96117 0.88223 -53112.95599 98.35954 62.26347 1983914.27092
14.35000 -2371.18984 1.12030 -75855.69300 98.13385 61.93447 2119802.21280
14.45000 -2354.62855 0.31075 4632.26488 97.41176 60.15860 1945624.08383
14.55000 -2346.99300 -0.67388 -24439.98134 97.21710 60.00816 2090195.04107
14.65000 -2334.00192 0.07331 17432.90377 94.50480 59.19992 1953411.36993
14.75000 -2321.56689 0.64301 41226.68024 93.53541 60.12726 1832587.74521
14.85000 -2311.36933 -0.25000 -20439.97885 93.59931 58.03483 2210461.21447
14.95000 -2299.95399 0.10070 88555.10011 91.08050 58.32513 2120936.02795
15.05000 -2290.41675 -2.87973 -37636.97084 90.68111 57.76076 2035469.13365
15.15000 -2280.10453 0.68760 12954.67811 90.15129 56.75512 1966720.57126
15.25000 -2270.29699 -1.49628 -78813.00830 90.78386 56.77245 2183753.28851
15.35000 -2257.73826 1.53583 -43800.36834 87.68105 56.74208 1806394.50284
15.45000 -2247.21933 1.58610 -49622.16148 87.31430 56.27840 2090556.39421
15.55000 -2235.95786 -1.06463 -31395.97281 87.54810 55.22910 1957729.96922
15.65000 -2229.97109 -1.17780 60694.35450 85.22546 54.38491 2149660.30912
15.75000 -2218.49990 0.76994 -45060.75352 85.68998 53.88101 1995125.59729
15.85000 -2210.42164 -1.24134 78304.42608 87.26337 53.87267 2234309.25008
15.95000 -2198.49819 0.62443 82574.73746 85.70080 53.24439 1998240.85732
16.05000 -2188.57023 -0.56415 45792.05153 85.59559 53.54636 1975059.53741
16.15000 -2174.82663 0.02745 -2215.59305 84.14737 52.44412 2292866.74788
16.25000 -2166.94710 -0.73386 93767.12928 84.72179 53.71642 2069033.27248
16.35000 -2159.68086 -2.88911 34757.50748 85.87537 52.39257 2046108.97846
16.45000 -2152.38176 -0.54394 636.83107 84.45846 51.47916 1929555.17890
16.55000 -2141.36056 -0.19185 7605.10143 84.40275 51.46756 1888548.56399
16.65000 -2128.05323 0.28472 -70217.31164 85.96803 49.38484 1811246.79428
16.75000 -2119.63779 0.58456 -96193.49797 81.31842 49.86053 1924390.57547
16.85000 -2109.08568 -0.41868 2135.52503 82.87553 50.41684 1813035.89560
16.95000 -2100.84275 -0.96634 -115473.48542 82.55680 48.57006 1928166.54278
17.05000 -2091.81628 0.67416 -19867.39564 82.27574 48.34450 1936608.42030
17.15000 -2080.97028 0.54891 -6448.08721 81.74542 47.77798 1973263.98199
17.25000 -2070.98206 -2.03644 -77273.28741 81.53946 48.14745 2091195.04217
17.35000 -2060.48186 0.19610 -23070.27756 80.17248 47.30898 1825176.15570
17.45000 -2050.78438 -1.97884 7275.34010 80.43819 46.46301 1912602.68660
17.55000 -2042.19548 0.04911 31359.34850 78.60392 46.66220 2069521.35609
17.65000 -2032.38393 -0.45894 4537.28731 78.21627 45.98532 1991351.06599
17.75000 -2023.36131 -0.90809 6622.52714 77.11850 45.51100 1628525.98022
17.85000 -2016.22436 1.35691 26858.11990 76.94552 45.15960 1815483.93550
17.95000 -2007.79999 1.33204 -43156.00026 77.28736 43.98638 1843264.21529
18.05000 -1997.08060 0.73219 -12042.64512 76.61962 44.57148 1684438.89789
18.15000 -1991.31280 -0.17511 65257.52870 76.42209 45.39891 1837288.97097
18.25000 -1979.68448 0.22475 -6409.03959 76.23381 43.13628 1646880.37564
18.35000 -1973.40545 -0.57006 14109.54092 76.38494 43.83539 1832623.25275
18.45000 -1961.09555 -1.61176 -23649.47185 75.57896 42.92742 1856084.41087
18.55000 -1952.86910 0.42139 -25381.32588 74.03398 42.86424 1946090.18356
18.65000 -1943.09803 0.76672 28351.30604 72.59464 42.11039 1837910.26618
18.75000 -1936.39646 1.04476 -124424.27588 73.74065 42.61726 1988671.45672
18.85000 -1929.41569 0.15839 -2247.56860 72.72536 40.94993 2094534.14252
18.95000 -1918.42169 0.10499 45484.57922 70.49375 41.53060 1727730.38189
19.05000 -1911.36205 0.38683 14309.76454 69.79787 40.99535 1681820.48919
19.15000 -1902.38581 -0.29111 -7085.11280 70.70440 39.73705 1734500.68722
19.25000 -1891.63507 0.19091 -20092.12800 69.87703 40.37857 1965613.85920
19.35000 -1884.77281 -0.43536 -10189.86744 69.84810 39.82111 1740391.44668
19.45000 -1878.04110 -0.96441 43001.79722 68.91059 39.48704 1787845.48760
19.55000 -1871.71551 1.07423 -24767.09392 67.73891 39.94608 1752673.37639
19.65000 -1864.34823 0.33399 -84610.59376 67.74269 38.12620 1942793.07663
19.75000 -1854.67362 -1.34901 -18921.72346 67.22551 38.72656 1767918.92963
19.85000 -1845.40679 1.17902 -40661.78613 66.39593 38.39873 1837027.54640
19.95000 -1837.37653 0.86060 -75341.86085 66.01711 37.91662 1784271.52509
