0.12500 0.01503
0.37500 0.05833
0.62500 0.09085
0.87500 0.15051
1.12500 0.18481
1.37500 0.23524
1.62500 0.27199
1.87500 0.29080
2.12500 0.30865
2.37500 0.30548
2.62500 0.31759
2.87500 0.31839
3.12500 0.32184
3.37500 0.32109
3.62500 0.33584
3.87500 0.32534
4.12500 0.33275
4.37500 0.32026
4.62500 0.29747
4.87500 0.25230
5.12500 0.21939
5.37500 0.16620
5.62500 0.13395
5.87500 0.11622
6.12500 0.09248
6.37500 0.09252
6.62500 0.08151
6.87500 0.07349
7.12500 0.07629
7.37500 0.06481
7.62500 0.06439
7.87500 0.06347
8.12500 0.07796
8.37500 0.07038
8.62500 0.05135
8.87500 0.06630
9.12500 0.07086
9.37500 0.06030
9.62500 0.06054
9.87500 0.05129
10.12500 0.04719
10.37500 0.04936
10.62500 0.03050
10.87500 0.01058
11.12500 0.01972
11.37500 0.06163
11.62500 0.06365
11.87500 0.07808
12.12500 0.09201
12.37500 0.10438
12.62500 0.10134
12.87500 0.09807
13.12500 0.08895
13.37500 0.08719
13.62500 0.09820
13.87500 0.05755
14.12500 0.05188
14.37500 0.01433
14.62500 0.05179
14.87500 0.05803
