0.05000 -1241.53486 -92.89407 -2007.54698 2814.25043 2777.77953 3817.85240
0.15000 -3680.13621 150.66165 -830.11127 2671.08597 2455.41790 5695.18763
0.25000 -5769.19762 60.29695 -582.99213 2788.16217 2269.39304 7892.86347
0.35000 -7706.36017 167.11168 -741.80859 3075.24549 2140.51602 9773.25906
0.45000 -9280.50658 263.39245 -311.72191 3373.83619 2338.23144 11017.43478
0.55000 -10454.81644 190.54506 -116.81199 3647.58996 2492.27130 11850.21493
0.65000 -11309.15933 190.21499 -365.84533 3773.90647 2670.16575 12142.90552
0.75000 -11905.93136 196.66005 32.50196 3863.54407 2827.85235 12214.34332
0.85000 -12402.20246 290.99113 22.38340 3888.69895 2962.91279 12049.24587
0.95000 -12671.94217 275.15651 34.59524 3783.24984 3021.45464 11668.66647
1.05000 -12837.02151 336.60668 38.03046 3617.58880 3068.62804 11156.59709
1.15000 -12740.96076 237.97921 43.75875 3456.80800 3056.42351 10809.01332
1.25000 -12673.83594 252.28816 245.41061 3246.73234 3048.06949 10232.78255
1.35000 -12583.34038 251.73019 229.21645 3088.85404 3033.96386 9672.19674
1.45000 -12404.02205 257.84204 206.69364 2899.21730 2987.14607 9208.51677
1.55000 -12116.52732 230.03634 248.77622 2761.76625 2908.71062 8922.50181
1.65000 -11962.56758 232.05974 196.99549 2564.17821 2862.46993 8431.93784
1.75000 -11661.81029 201.97596 258.53363 2436.24807 2770.43087 8164.83898
1.85000 -11516.49999 222.93490 120.62469 2256.56431 2729.92488 7681.27566
1.95000 -11261.88381 209.87477 -52.86244 2144.25252 2640.54930 7408.79521
2.05000 -11036.84401 165.21551 -55.39603 2035.57283 2560.86352 7109.03133
2.15000 -10847.26261 213.81308 106.80143 1915.41212 2498.92453 6786.64852
2.25000 -10586.05285 170.26338 -75.73927 1872.01712 2389.98793 6590.44176
2.35000 -10340.60983 203.63490 -54.41951 1789.65205 2316.30505 6387.21984
2.45000 -10173.75445 132.01809 -84.18818 1650.94623 2249.78258 6076.16691
2.55000 -9938.01508 146.75318 47.74613 1580.92831 2167.57671 5885.41666
2.65000 -9735.96509 174.52936 -69.66597 1499.48680 2086.59972 5677.70633
2.75000 -9529.79520 126.42608 -40.32795 1445.18317 2017.14302 5495.39510
2.85000 -9306.52531 138.91342 -39.19912 1375.76464 1928.12198 5369.89467
2.95000 -9129.21316 110.51555 -4.57850 1304.78295 1852.76456 5189.65498
3.05000 -8970.95887 134.74207 -104.66164 1233.50609 1798.18874 5003.44459
3.15000 -8794.33234 85.11824 51.33212 1189.08655 1716.51011 4847.05141
3.25000 -8636.04963 84.90740 43.65920 1122.42267 1668.67751 4753.42025
3.35000 -8482.19042 82.77751 -41.85385 1080.34196 1581.67133 4621.50119
3.45000 -8339.96021 65.08353 23.30050 1026.88418 1518.76257 4470.19301
3.55000 -8154.17418 94.25532 -28.35660 1012.26968 1445.55098 4367.94571
3.65000 -8012.32699 117.54318 -87.03577 935.62246 1399.55114 4225.75188
3.75000 -7875.68675 62.89872 37.01649 899.01539 1345.73027 4083.49781
3.85000 -7742.52682 84.09676 15.42598 853.51449 1288.46278 4005.09946
3.95000 -7606.19684 76.88237 -89.67658 820.03691 1237.99087 3890.55035
4.05000 -7515.33107 76.86653 9.21035 761.89178 1199.88844 3698.29790
4.15000 -7356.75600 23.48589 -92.52470 739.02051 1127.16512 3659.04037
4.25000 -7263.66725 89.94134 -37.36185 712.77686 1109.01803 3513.74721
4.35000 -7137.88005 57.70711 -97.16585 690.41462 1058.19048 3431.48979
4.45000 -7025.21949 47.65195 -132.08018 669.48435 1021.60699 3301.50170
4.55000 -6918.02397 29.26631 7.25970 650.28222 963.03913 3182.01953
4.65000 -6826.52737 32.43203 38.99453 602.26123 935.60264 3080.14515
4.75000 -6721.05413 30.92154 -50.59773 584.82877 908.78714 2949.32645
4.85000 -6615.43368 55.81976 -34.91720 567.32225 876.13389 2850.36416
4.95000 -6535.56838 54.48770 3.39723 527.70995 834.36937 2711.83098
5.05000 -6435.58533 80.56876 -49.19084 505.56795 816.31003 2615.13725
5.15000 -6358.75872 64.15385 -57.70977 492.21245 798.12413 2523.70292
5.25000 -6293.53684 75.94784 12.28916 488.04062 774.56463 2394.01993
5.35000 -6220.52878 111.12708 37.10949 473.85793 746.10876 2264.72527
5.45000 -6166.97871 90.59034 -47.28273 464.42772 724.81295 2166.83077
5.55000 -6113.13227 107.58347 -16.34343 469.47396 698.82994 2034.29929
5.65000 -6069.79197 97.98529 -10.23474 468.38689 678.05707 1976.31064
5.75000 -6022.33201 116.46842 -3.13012 478.88180 645.03693 1900.85943
5.85000 -5989.96054 103.30370 -10.40419 492.43079 623.13344 1841.72876
5.95000 -5953.32086 115.95938 -10.16039 501.51318 595.18547 1742.89610
6.05000 -5916.02452 107.81241 -22.47499 511.91381 570.88690 1691.38051
6.15000 -5864.73116 125.56610 -42.08806 521.34211 548.84470 1611.89527
6.25000 -5827.08224 119.21810 -52.36025 533.51331 517.60978 1568.64978
6.35000 -5795.32447 128.82460 10.20530 536.55605 501.30449 1494.76992
6.45000 -5761.80054 123.55973 -45.29908 541.61073 478.32481 1445.13695
6.55000 -5713.23324 129.46332 -41.85588 545.27568 455.18664 1408.75496
6.65000 -5650.68943 130.65345 -7.93646 544.98536 430.49342 1346.85228
6.75000 -5623.13548 130.72527 -40.93662 542.27373 410.11250 1310.77740
6.85000 -5580.46626 129.10626 -46.29852 536.00269 390.48948 1253.25948
6.95000 -5513.27131 130.95203 -13.57332 523.47869 368.41100 1225.25966
7.05000 -5454.79130 134.91213 0.39977 504.27656 351.93593 1183.08273
7.15000 -5398.31218 118.65087 -13.96995 493.59259 334.89955 1148.23380
7.25000 -5348.71310 119.20511 -29.74277 473.81452 317.25931 1120.54341
7.35000 -5290.61766 122.70920 -7.85663 456.81160 295.29460 1076.24603
7.45000 -5237.07084 126.62871 -1.23432 428.67269 282.70122 1056.36548
7.55000 -5205.77081 120.75339 -20.41133 414.55467 268.85157 1018.34639
7.65000 -5134.38315 127.03841 12.26649 383.44451 256.29090 995.81407
7.75000 -5095.52271 119.01012 14.19847 366.00960 242.47807 963.89003
7.85000 -5057.66725 120.39383 1.29275 357.98222 226.91411 958.02569
7.95000 -5012.12714 113.77775 -9.29094 339.58407 224.42949 920.50304
8.05000 -4957.21626 110.73128 6.27207 335.80315 207.85880 898.56053
8.15000 -4909.92655 109.26372 -15.14785 312.17268 199.12018 884.55378
8.25000 -4869.04720 101.49075 -4.43382 301.41729 190.28726 848.80220
8.35000 -4821.51417 93.35932 11.69390 289.06764 182.05574 836.06849
8.45000 -4777.21916 95.92795 -9.76536 276.48627 172.94719 808.12386
8.55000 -4735.95901 88.73778 -23.98791 265.38585 168.99355 797.95287
8.65000 -4694.10548 83.62268 0.26978 255.97962 157.54186 779.60470
8.75000 -4648.95537 78.22056 4.44816 244.14669 150.73607 771.65501
8.85000 -4615.95992 76.54367 -26.43752 235.06205 144.44006 747.32100
8.95000 -4569.26423 74.73830 8.53123 226.03754 139.15661 723.29569
9.05000 -4531.34163 69.46204 -16.62504 218.11676 132.15437 709.97132
9.15000 -4495.44828 65.33158 -13.23151 210.94971 126.32017 689.14107
9.25000 -4458.58102 63.67544 -1.29091 198.97356 120.32655 682.48371
9.35000 -4419.45897 59.81895 -17.08667 193.37837 116.95493 661.09263
9.45000 -4388.86694 63.21171 27.98044 189.02165 114.22977 641.43824
9.55000 -4357.38410 58.09254 -9.00891 175.88895 106.25349 628.19655
9.65000 -4318.28391 59.98460 -2.19299 164.23108 105.97276 608.21152
9.75000 -4281.57177 58.45710 2.85358 157.54514 101.10399 610.17257
9.85000 -4251.09000 54.53620 1.92057 152.41303 99.44465 579.09518
9.95000 -4217.83879 57.93610 -0.32258 151.68439 98.00674 595.19714
10.05000 -4189.79750 57.56114 -14.02259 144.55487 95.36789 563.18888
10.15000 -4156.71503 58.78914 9.81453 142.76400 92.06292 555.36087
10.25000 -4125.06797 56.02830 9.48421 149.23620 89.51477 530.04316
10.35000 -4098.41505 57.09886 18.43788 131.33397 87.03809 523.39995
10.45000 -4065.48262 54.61946 18.83891 128.47783 84.77299 522.08955
10.55000 -4037.71520 56.67550 16.22804 124.20452 85.97933 508.56072
10.65000 -4006.19666 54.94587 34.49171 120.45889 81.41052 500.14360
10.75000 -3974.95356 50.10112 21.72706 117.54198 77.98364 489.22504
10.85000 -3942.96425 55.18742 34.53944 117.21850 77.20425 480.13610
10.95000 -3917.76548 51.81722 39.67394 115.04783 77.84932 464.41370
11.05000 -3888.78691 51.60132 25.44557 107.23380 75.25304 447.33731
11.15000 -3857.91209 47.30231 12.37921 112.92502 74.12672 447.63717
11.25000 -3835.12387 49.32651 19.33768 105.96670 71.88513 424.74432
11.35000 -3803.62489 49.44508 27.58002 103.16541 69.53307 413.69063
11.45000 -3775.01021 49.18679 37.35645 100.91860 68.90419 419.11699
11.55000 -3742.11110 47.98886 23.92983 96.89640 67.82917 399.72462
11.65000 -3715.52139 46.63595 39.25768 97.32496 67.75124 395.74208
11.75000 -3679.56691 45.40852 30.39333 94.13784 66.72453 391.30550
11.85000 -3650.09906 45.80860 18.70479 90.24632 66.51040 374.75024
11.95000 -3624.61230 43.19076 25.15291 88.19889 65.56930 364.66071
12.05000 -3596.36650 44.78723 12.41760 86.94025 64.04925 345.11256
12.15000 -3571.85040 41.56445 29.66601 84.90751 61.87901 341.82225
12.25000 -3540.38335 42.66366 16.75630 82.70072 61.67156 342.10138
12.35000 -3511.92778 46.02385 17.75967 80.12350 59.80433 327.45181
12.45000 -3486.93444 39.76483 22.95491 77.14076 59.39824 320.22301
12.55000 -3459.45211 41.84404 7.81521 74.84882 58.64024 315.98718
12.65000 -3428.13323 35.08012 6.82267 75.51576 57.20909 306.41351
12.75000 -3400.18862 38.37085 12.57679 73.64441 58.97342 299.44160
12.85000 -3371.57241 36.90420 11.96163 73.64830 57.51582 294.57677
12.95000 -3350.90920 37.50862 11.40913 73.44493 56.90461 290.32062
13.05000 -3324.15661 36.28828 11.98925 73.44420 58.79478 288.17722
13.15000 -3302.21229 35.17307 22.20589 73.83467 55.82055 283.72702
13.25000 -3279.38540 36.46220 -5.59097 75.53157 54.54419 265.66431
13.35000 -3251.32263 35.67599 13.05087 74.22715 55.93503 265.84450
13.45000 -3227.25239 34.48937 0.40919 75.68322 54.98180 264.31342
13.55000 -3204.64223 34.90172 2.82964 75.56555 54.55587 254.32681
13.65000 -3181.39265 32.59942 -3.99460 72.81930 52.51298 255.29276
13.75000 -3160.25199 34.78007 -2.89162 71.14183 51.92253 250.20968
13.85000 -3135.89380 34.56147 13.36140 72.57255 54.24065 241.83331
13.95000 -3115.89008 32.94686 1.51042 70.66644 53.08012 241.85626
14.05000 -3091.85700 31.70948 8.82100 70.66071 53.02651 249.76171
14.15000 -3067.37723 33.77857 -5.51454 70.36437 49.44229 240.19904
14.25000 -3044.89151 33.88909 15.16492 72.17597 51.42108 236.64380
14.35000 -3024.55853 32.51158 7.39088 71.67183 49.86776 234.92224
14.45000 -3002.23259 33.94821 18.34276 70.83006 50.03362 225.87343
14.55000 -2982.51925 35.88665 23.41299 70.08361 49.16101 231.70494
14.65000 -2965.48339 34.51383 10.49193 69.25949 49.72107 219.04224
14.75000 -2938.56272 34.76178 22.54420 69.80663 46.34285 225.52380
14.85000 -2922.01596 34.17072 18.37807 70.69563 47.87414 217.00620
14.95000 -2903.59593 34.76953 0.35347 65.90775 45.76468 210.54762
15.05000 -2883.02112 33.35451 16.78971 65.04620 44.47855 213.05552
15.15000 -2861.74062 35.03084 20.58855 63.56826 43.94001 220.67162
15.25000 -2844.92013 34.00528 21.16870 63.82267 45.30916 208.78577
15.35000 -2826.21539 33.49426 12.93563 63.75228 44.23194 205.54715
15.45000 -2807.53763 36.14884 32.87290 63.55629 43.28587 205.28236
15.55000 -2793.68659 31.07683 6.50893 60.24542 43.73526 201.82834
15.65000 -2779.60195 34.63122 21.52950 61.38376 45.66472 202.53881
15.75000 -2761.21955 28.77648 4.04214 59.17630 44.63565 185.37857
15.85000 -2742.96090 29.64147 15.77973 59.54148 42.81256 193.68844
15.95000 -2729.90601 33.48599 5.27772 60.44578 42.91902 189.87120
16.05000 -2718.94454 27.35262 17.17483 56.73045 43.18889 184.10151
16.15000 -2700.64277 31.57636 20.37074 59.65506 42.66350 179.00515
16.25000 -2679.46126 27.96163 28.13553 55.80631 43.73078 185.38722
16.35000 -2669.72438 31.34039 12.64306 56.87682 40.22248 176.53226
16.45000 -2652.20648 30.92318 22.38585 57.49778 40.24850 178.99158
16.55000 -2630.56158 27.36670 20.93719 57.48488 43.14876 179.68197
16.65000 -2620.35825 26.85583 22.28266 55.22557 40.67863 164.28844
16.75000 -2605.70711 28.21105 18.97369 58.64092 42.25078 170.86414
16.85000 -2590.47468 23.77500 17.84734 54.90747 40.78688 166.61125
16.95000 -2567.47733 23.24971 7.38511 55.11242 41.41187 173.48600
17.05000 -2551.04791 26.29680 8.40830 54.83258 40.89573 155.57941
17.15000 -2542.87902 25.97270 10.54735 53.18182 41.99232 160.77710
17.25000 -2528.39248 23.93330 4.69573 55.41718 42.78540 147.53799
17.35000 -2511.08482 25.69294 20.85214 54.76752 43.14272 157.54841
17.45000 -2493.44252 18.76773 -1.89260 52.61916 42.72332 152.80436
17.55000 -2478.29136 22.38019 -3.31832 55.38197 41.07277 141.53413
17.65000 -2464.45931 24.26501 2.64357 57.28057 42.65676 142.91732
17.75000 -2449.56102 21.26309 13.23032 55.15923 41.71102 130.45232
17.85000 -2433.52479 22.72949 1.42216 53.92921 42.50557 144.51982
17.95000 -2420.85678 27.39795 21.62789 53.08194 42.10367 132.99326
18.05000 -2404.39024 21.34482 6.11050 55.29894 40.50876 131.80724
18.15000 -2388.10057 23.50648 14.12842 52.66557 39.72330 126.61652
18.25000 -2374.24703 21.38094 6.26273 52.14306 42.04854 121.62754
18.35000 -2364.44220 22.50588 4.85886 50.13927 41.38309 114.84672
18.45000 -2342.16738 26.85470 7.89031 49.92946 41.51650 120.20517
18.55000 -2336.84815 24.84111 14.31279 49.09777 40.53775 120.34489
18.65000 -2319.84565 31.45303 25.29671 51.01297 42.24855 122.76908
18.75000 -2304.70571 33.94130 20.22423 50.41208 42.16299 115.78861
18.85000 -2300.54117 36.25750 15.61670 48.12431 42.29416 115.43110
18.95000 -2284.13147 39.36725 16.72893 48.14727 42.15251 111.33248
19.05000 -2274.00123 38.60888 19.94617 48.75999 41.52658 107.81511
19.15000 -2262.80954 35.00979 17.95705 46.36592 42.83706 108.43108
19.25000 -2249.75070 34.75107 13.06680 44.60564 45.02004 104.68700
19.35000 -2237.41907 37.65177 7.94107 46.01147 42.74806 105.25222
19.45000 -2222.36107 35.36270 -3.75712 45.68661 42.79039 112.71635
19.55000 -2208.84679 37.52738 8.13076 48.43651 40.34465 99.24468
19.65000 -2195.05567 33.89459 16.07685 51.69075 38.64200 105.98619
19.75000 -2184.85297 37.50570 11.70195 47.94500 42.53088 87.71525
19.85000 -2170.12515 36.04700 5.81528 45.70407 41.25820 88.53002
19.95000 -2162.87023 31.16879 3.17584 46.94784 39.74509 93.26356
