0.10101 0.19334 0.27723
0.30303 0.15837 0.19295
0.50505 0.11990 0.12101
0.70707 0.09397 0.07862
0.90909 0.07399 0.05162
1.11111 0.06080 0.03588
1.31313 0.05065 0.02597
1.51515 0.04376 0.01896
1.71717 0.03719 0.01446
1.91919 0.03325 0.01170
2.12121 0.02811 0.00916
2.32323 0.02515 0.00734
2.52525 0.02260 0.00617
2.72727 0.02011 0.00508
2.92929 0.01842 0.00433
3.13131 0.01665 0.00370
3.33333 0.01511 0.00322
3.53535 0.01391 0.00277
3.73737 0.01285 0.00240
3.93939 0.01197 0.00216
4.14141 0.01144 0.00194
4.34343 0.01098 0.00180
4.54545 0.01077 0.00165
4.74747 0.01068 0.00156
4.94949 0.01079 0.00150
5.15152 0.01070 0.00142
5.35354 0.01134 0.00141
5.55556 0.01120 0.00137
5.75758 0.01127 0.00132
5.95960 0.01134 0.00128
6.16162 0.01100 0.00121
6.36364 0.01073 0.00115
6.56566 0.01056 0.00108
6.76768 0.01001 0.00100
6.96970 0.00959 0.00093
7.17172 0.00914 0.00086
7.37374 0.00865 0.00079
7.57576 0.00819 0.00072
7.77778 0.00774 0.00067
7.97980 0.00728 0.00062
8.18182 0.00670 0.00055
8.38384 0.00636 0.00051
8.58586 0.00582 0.00046
8.78788 0.00535 0.00041
8.98990 0.00502 0.00038
9.19192 0.00472 0.00035
9.39394 0.00446 0.00032
9.59596 0.00405 0.00029
9.79798 0.00389 0.00026
10.00000 0.00358 0.00024
10.20202 0.00338 0.00022
10.40404 0.00313 0.00020
10.60606 0.00296 0.00019
10.80808 0.00276 0.00017
11.01010 0.00264 0.00016
11.21212 0.00246 0.00015
11.41414 0.00233 0.00014
11.61616 0.00219 0.00013
11.81818 0.00208 0.00012
12.02020 0.00207 0.00012
12.22222 0.00191 0.00010
12.42424 0.00181 0.00010
12.62626 0.00174 0.00009
12.82828 0.00167 0.00009
13.03030 0.00164 0.00008
13.23232 0.00154 0.00008
13.43434 0.00150 0.00008
13.63636 0.00147 0.00007
13.83838 0.00140 0.00007
14.04040 0.00138 0.00007
14.24242 0.00130 0.00006
14.44444 0.00127 0.00006
14.64646 0.00118 0.00005
14.84848 0.00118 0.00005
15.05051 0.00115 0.00005
15.25253 0.00109 0.00005
15.45455 0.00102 0.00004
15.65657 0.00103 0.00004
15.85859 0.00093 0.00004
16.06061 0.00088 0.00004
16.26263 0.00085 0.00004
16.46465 0.00079 0.00003
16.66667 0.00073 0.00003
16.86869 0.00073 0.00003
17.07071 0.00066 0.00003
17.27273 0.00061 0.00002
17.47475 0.00059 0.00002
17.67677 0.00056 0.00002
17.87879 0.00051 0.00002
18.08081 0.00049 0.00002
18.28283 0.00046 0.00002
18.48485 0.00044 0.00002
18.68687 0.00040 0.00001
18.88889 0.00038 0.00001
19.09091 0.00039 0.00001
19.29293 0.00037 0.00001
19.49495 0.00033 0.00001
19.69697 0.00033 0.00001
19.89899 0.00030 0.00001
