0.12500 0.01068
0.37500 0.01181
0.62500 0.00473
0.87500 0.01208
1.12500 0.00780
1.37500 0.00323
1.62500 0.01590
1.87500 0.02536
2.12500 0.01267
2.37500 0.00468
2.62500 0.00621
2.87500 0.00556
3.12500 0.00260
3.37500 0.00560
3.62500 0.00485
3.87500 0.01499
4.12500 0.01781
4.37500 0.01363
4.62500 0.01373
4.87500 0.01900
5.12500 0.01196
5.37500 0.01178
5.62500 0.01239
5.87500 0.00164
6.12500 0.00465
6.37500 0.00666
6.62500 0.00860
6.87500 0.01959
7.12500 0.01509
7.37500 0.01376
7.62500 0.00358
7.87500 0.01088
8.12500 0.00429
8.37500 0.00572
8.62500 0.01299
8.87500 0.00633
9.12500 0.01104
9.37500 0.00311
9.62500 0.01467
9.87500 0.01072
10.12500 0.00114
10.37500 0.02843
10.62500 0.02003
10.87500 0.00985
11.12500 0.02018
11.37500 0.00397
11.62500 0.01952
11.87500 0.02259
12.12500 0.02748
12.37500 0.02066
12.62500 0.03309
12.87500 0.01751
13.12500 0.02350
13.37500 0.00387
13.62500 0.00218
13.87500 0.02384
14.12500 0.00397
14.37500 0.01268
14.62500 0.01095
14.87500 0.02512
