0.12500 0.03122
0.37500 0.00667
0.62500 0.00245
0.87500 0.00329
1.12500 0.01484
1.37500 0.01740
1.62500 0.01136
1.87500 0.01226
2.12500 0.00600
2.37500 0.02175
2.62500 0.03025
2.87500 0.01163
3.12500 0.01672
3.37500 0.00539
3.62500 0.03817
3.87500 0.02844
4.12500 0.01113
4.37500 0.00706
4.62500 0.00597
4.87500 0.00796
5.12500 0.01545
5.37500 0.01026
5.62500 0.01793
5.87500 0.03589
6.12500 0.01249
6.37500 0.02349
6.62500 0.02135
6.87500 0.00757
7.12500 0.01189
7.37500 0.00937
7.62500 0.01508
7.87500 0.02248
8.12500 0.01784
8.37500 0.02489
8.62500 0.03499
8.87500 0.02267
9.12500 0.02865
9.37500 0.01264
9.62500 0.02027
9.87500 0.00458
10.12500 0.00627
10.37500 0.02579
10.62500 0.01205
10.87500 0.01617
11.12500 0.01025
11.37500 0.05144
11.62500 0.06668
11.87500 0.05169
12.12500 0.01789
12.37500 0.02626
12.62500 0.02705
12.87500 0.01619
13.12500 0.00612
13.37500 0.08844
13.62500 0.03178
13.87500 0.01376
14.12500 0.03225
14.37500 0.11370
14.62500 0.06555
14.87500 0.04702
15.12500 0.09303
15.37500 0.06716
15.62500 0.04526
15.87500 0.08120
16.12500 0.03694
16.37500 0.05788
16.62500 0.09250
16.87500 0.01987
17.12500 0.03051
17.37500 0.03568
17.62500 0.08422
17.87500 0.04613
18.12500 0.07593
18.37500 0.06808
18.62500 0.13600
18.87500 0.02078
19.12500 0.07982
19.37500 0.07801
19.62500 0.08409
19.87500 0.17540
