0.2 1.76155 18.80246 1.24474 78.63402 78.14521 69.25077
0.6 -0.05919 40.33985 0.42454 77.56712 76.57145 68.25172
1.0 -0.87238 61.1857 -0.23678 75.48319 74.03196 65.90959
1.4 -1.05172 78.51627 -1.42252 74.6764 70.38059 62.76215
1.8 -0.249 93.63176 -0.50257 72.21666 67.24545 59.63567
2.2 0.36538 104.4607 -1.0402 70.77425 64.20263 57.74622
2.6 -0.49409 114.37905 -0.37032 68.19671 60.97166 55.44006
3.0 0.12047 122.78403 -0.80553 64.93655 57.88966 52.68368
3.4 -0.32437 131.72954 -0.15089 62.10167 55.66461 50.48627
3.8 -0.10619 140.54887 0.19594 57.92081 52.41334 48.4623
4.2 -0.38749 149.64856 -0.50528 54.49189 49.55906 46.49112
4.6 -0.91923 157.47347 0.31205 51.64589 46.07959 44.34726
5.0 -0.71905 164.5814 0.1897 48.78229 43.30446 42.17535
5.4 -0.4227 170.78371 0.08092 45.76879 40.771 40.10658
5.8 -0.3004 176.40776 -0.05812 44.06377 38.16406 38.10047
6.2 -0.27313 180.78073 -0.34965 41.6802 36.44035 36.40329
6.6 -0.41274 185.37922 -0.22791 40.05959 34.4035 34.81195
7.0 -0.26906 189.64574 0.1111 38.76698 32.68874 33.42436
7.4 -0.10128 192.07813 -0.11556 37.59722 31.37756 32.03093
7.8 0.0073 194.73008 -0.36039 36.0847 29.51298 30.64776
8.2 -0.13386 196.97055 0.27011 35.10858 28.30649 29.70309
8.6 -0.35826 198.92071 0.03413 33.31118 27.26209 28.23253
9.0 -0.68525 200.98414 -0.19473 32.65724 26.77528 27.33677
9.4 -1e-05 202.80364 -0.39067 31.56347 25.54485 26.06521
9.8 0.10466 204.41354 -0.61859 30.61825 24.97919 24.92985
10.2 0.01634 205.85436 -0.57587 29.50004 23.7558 24.18465
10.6 -0.04642 207.15755 -0.6914 28.93262 22.63142 23.20217
11.0 -0.44411 207.45059 -0.16462 27.88028 21.84465 22.2252
11.4 -0.70155 208.51764 -0.28837 27.50454 21.54543 21.31002
11.8 -0.56363 210.07318 0.22339 26.08195 20.62125 20.91466
12.2 -0.62744 210.11348 0.59095 25.62131 20.29787 20.07513
12.6 -1.20208 210.91713 0.15994 24.76867 19.10387 19.69994
13.0 -0.57264 211.50958 1.33284 23.86165 18.12552 18.5823
13.4 -0.74906 211.59238 1.21542 23.70319 17.38493 17.95269
13.8 -0.56501 211.88235 1.35518 22.74785 16.39798 17.29711
14.2 -0.60846 211.77905 1.47661 22.15925 15.84842 17.00689
14.6 -0.81038 211.45966 1.23014 21.71993 15.33508 16.43774
15.0 -0.20453 211.49091 1.18865 20.80862 14.92525 15.81798
15.4 -0.5909 211.76946 1.18161 20.05984 15.18149 15.44549
15.8 0.03227 212.12417 1.16132 19.58335 14.84192 15.10003
16.2 0.46083 211.7573 1.01 18.26918 14.617 14.65184
16.6 0.48121 212.81719 1.31068 18.0123 13.92241 13.96045
17.0 0.3694 213.31111 1.1798 17.17825 13.38493 13.26113
17.4 0.85127 212.80308 0.96296 17.01909 13.02053 12.9851
17.8 0.11928 212.5093 1.29852 16.25155 12.2406 12.72064
18.2 0.18997 212.79764 1.06212 15.94523 12.02171 12.07399
18.6 0.32531 213.01955 0.90838 15.12894 11.91196 11.44437
19.0 0.34771 213.03842 1.02966 15.21823 11.54943 11.44352
19.4 -0.24829 212.86134 0.93532 14.73846 10.83437 11.06114
19.8 0.13448 212.66132 0.63723 14.20935 10.72955 10.55699
