0.125 -0.001 -0.001 0.013
0.375 0.001 -0.005 0.220
0.625 -0.002 -0.019 0.765
0.875 -0.015 -0.028 1.466
1.125 -0.029 -0.038 2.222
1.375 -0.054 -0.021 2.959
1.625 -0.058 -0.024 3.817
1.875 -0.034 -0.047 4.617
2.125 -0.029 -0.049 5.446
2.375 -0.092 -0.060 6.434
2.625 -0.092 -0.062 7.657
2.875 -0.094 -0.087 9.075
3.125 -0.133 -0.104 10.674
3.375 -0.194 -0.082 12.420
3.625 -0.227 -0.089 14.298
3.875 -0.293 -0.114 16.633
4.125 -0.323 -0.106 18.705
4.375 -0.388 -0.102 20.778
4.625 -0.393 -0.138 22.297
4.875 -0.404 -0.086 23.082
5.125 -0.395 -0.116 23.298
5.375 -0.477 -0.115 23.370
5.625 -0.427 -0.108 23.647
5.875 -0.481 -0.124 23.790
6.125 -0.544 -0.101 24.310
6.375 -0.510 -0.074 24.600
6.625 -0.459 -0.118 24.512
6.875 -0.485 -0.116 24.791
7.125 -0.495 -0.143 25.088
7.375 -0.436 -0.147 24.790
7.625 -0.443 -0.152 24.630
7.875 -0.470 -0.114 24.706
8.125 -0.419 -0.115 24.256
8.375 -0.456 -0.184 25.084
8.625 -0.442 -0.104 25.270
8.875 -0.426 -0.093 25.029
9.125 -0.372 -0.112 24.687
9.375 -0.439 -0.108 23.834
9.625 -0.374 -0.177 22.712
9.875 -0.361 -0.141 22.547
10.125 -0.381 -0.187 22.297
10.375 -0.335 -0.139 20.815
10.625 -0.352 -0.204 20.310
10.875 -0.325 -0.175 19.270
11.125 -0.314 -0.135 17.901
11.375 -0.271 -0.195 17.052
11.625 -0.234 -0.168 15.835
11.875 -0.230 -0.163 16.136
12.125 -0.241 -0.157 14.993
12.375 -0.213 -0.170 14.614
12.625 -0.173 -0.127 13.935
12.875 -0.193 -0.125 13.321
13.125 -0.178 -0.126 13.061
13.375 -0.166 -0.111 11.649
13.625 -0.156 -0.129 11.317
13.875 -0.158 -0.112 10.914
14.125 -0.128 -0.119 10.605
14.375 -0.144 -0.088 10.027
14.625 -0.145 -0.092 9.633
14.875 -0.122 -0.079 9.675
