0.125 -0.000 -0.001 0.001
0.375 -0.000 0.000 0.032
0.625 -0.000 0.009 0.192
0.875 -0.006 0.018 0.522
1.125 -0.009 0.008 1.039
1.375 -0.007 -0.001 1.716
1.625 -0.044 0.036 2.535
1.875 -0.019 0.008 3.460
2.125 -0.028 0.043 4.502
2.375 -0.013 0.026 5.638
2.625 -0.046 0.043 6.986
2.875 -0.103 0.077 8.357
3.125 -0.062 0.071 9.794
3.375 -0.127 0.145 11.189
3.625 -0.141 0.129 12.746
3.875 -0.147 0.157 13.983
4.125 -0.181 0.157 15.311
4.375 -0.211 0.196 16.834
4.625 -0.207 0.153 17.743
4.875 -0.323 0.203 19.045
5.125 -0.208 0.164 19.926
5.375 -0.270 0.165 21.001
5.625 -0.296 0.167 21.840
5.875 -0.336 0.232 22.763
6.125 -0.301 0.231 23.198
6.375 -0.297 0.225 24.200
6.625 -0.356 0.222 24.008
6.875 -0.322 0.223 24.904
7.125 -0.325 0.201 25.415
7.375 -0.339 0.202 25.413
7.625 -0.318 0.178 25.483
7.875 -0.291 0.242 25.627
8.125 -0.412 0.189 26.322
8.375 -0.312 0.199 26.512
8.625 -0.360 0.236 26.781
8.875 -0.362 0.242 26.799
9.125 -0.413 0.222 26.739
9.375 -0.360 0.188 26.239
9.625 -0.348 0.207 25.784
9.875 -0.359 0.174 25.307
10.125 -0.342 0.120 24.757
10.375 -0.324 0.154 23.621
10.625 -0.356 0.105 23.051
10.875 -0.320 0.117 23.004
11.125 -0.294 0.165 22.213
11.375 -0.299 0.153 21.762
11.625 -0.253 0.109 21.231
11.875 -0.257 0.092 20.994
12.125 -0.273 0.126 20.193
12.375 -0.270 0.128 20.635
12.625 -0.253 0.133 20.451
12.875 -0.231 0.109 19.892
13.125 -0.296 0.120 20.380
13.375 -0.264 0.140 19.901
13.625 -0.227 0.128 20.574
13.875 -0.257 0.110 19.739
14.125 -0.240 0.169 19.101
14.375 -0.210 0.103 18.002
14.625 -0.220 0.125 17.368
14.875 -0.213 0.113 15.948
