0.05000 -903.33571 -805.70915 4305.76164 1409.12363 208.90870 386.39120
0.15000 -941.50775 -26.94302 4018.03403 1243.52363 1543.20267 395.19238
0.25000 -309.89762 221.05785 4042.35175 1396.88414 1223.20933 426.31726
0.35000 -521.28625 -312.92819 3976.59198 1324.83178 1317.61301 482.55180
0.45000 -1151.00288 47.19534 3798.29113 1271.50878 1428.78397 491.39330
0.55000 -1231.95325 -110.30447 3723.86612 1470.76247 1363.58777 530.58043
0.65000 -1582.34167 -22.66035 3691.42077 1285.07518 1452.28208 605.01013
0.75000 -1543.62721 -74.33103 3562.22069 1516.31499 1455.83765 721.66870
0.85000 -1756.76085 142.19167 3399.02327 1533.41351 1513.38028 878.79812
0.95000 -1854.41545 85.65548 3261.37060 1396.45110 1679.28823 908.78785
1.05000 -1958.52873 -34.59654 3126.35809 1558.15510 1616.15063 1057.99323
1.15000 -2072.70734 15.68662 2885.12294 1591.18308 1701.33663 1152.96461
1.25000 -2384.03361 41.20186 2602.77196 1456.58831 1717.73952 1242.29676
1.35000 -2531.82771 -56.60405 2285.88054 1468.21136 1781.17635 1436.91323
1.45000 -2660.53350 -24.66921 2166.74372 1447.26047 1627.18236 1575.01634
1.55000 -2834.38399 -67.29465 1741.25519 1396.13996 1721.73202 1766.50660
1.65000 -2959.66648 -8.14879 1339.86275 1429.68553 1602.92956 2044.49516
1.75000 -3149.44866 -55.41010 1251.16589 1285.17869 1467.52474 2079.19318
1.85000 -3172.29342 -70.10796 1082.18556 1281.67605 1394.96893 2252.15917
1.95000 -3265.09037 18.29115 990.47160 1258.18891 1282.94115 2287.67203
2.05000 -3244.13770 19.07443 943.94610 1232.73123 1189.57655 2364.94984
2.15000 -3329.10270 -7.51608 786.23606 1205.35568 1150.17284 2334.44355
2.25000 -3319.30131 16.95177 673.67184 1184.76802 1065.56003 2395.54634
2.35000 -3373.29553 -24.84360 705.68685 1092.82573 990.73074 2360.49203
2.45000 -3380.73742 39.88146 724.88217 1104.62132 933.52138 2357.02979
2.55000 -3368.61149 2.96738 611.57576 1124.52800 902.77948 2398.63492
2.65000 -3340.25741 13.66059 607.37222 1139.84656 849.90521 2433.08661
2.75000 -3335.37632 -30.72202 507.33351 1138.43020 804.03194 2461.31377
2.85000 -3405.74555 -29.31440 503.97214 1061.72892 782.25931 2400.49988
2.95000 -3322.52464 -5.82592 356.87424 1109.08983 756.41809 2511.00424
3.05000 -3410.36855 -15.08566 215.80857 1047.69945 705.05230 2430.13414
3.15000 -3314.89248 9.64170 301.23588 1054.21088 670.33683 2509.08791
3.25000 -3359.83647 6.16770 313.72041 1052.31336 659.69390 2420.60509
3.35000 -3342.36483 9.32882 368.37880 1033.26932 626.39038 2421.05831
3.45000 -3340.18302 -23.19617 317.82853 1044.15259 591.04622 2387.18443
3.55000 -3306.34659 5.88382 289.34496 1013.74949 584.77906 2443.98566
3.65000 -3287.17447 4.81798 334.17153 974.23768 555.98063 2399.72401
3.75000 -3273.02062 8.49161 253.80172 998.22798 534.26234 2413.73068
3.85000 -3240.85274 -13.72558 228.34807 1025.48731 519.48645 2402.74859
3.95000 -3238.71837 -18.62737 176.58248 978.01539 503.52510 2393.32751
4.05000 -3222.36962 10.08451 180.87841 992.47052 494.46009 2379.99463
4.15000 -3221.78168 -7.11702 55.24622 939.36013 471.26021 2377.12945
4.25000 -3173.23815 -9.97064 185.22311 977.32480 451.83515 2377.21904
4.35000 -3188.57968 8.41991 104.49022 947.23121 450.10373 2328.18132
4.45000 -3104.62694 1.79342 90.75338 999.84512 439.47095 2396.50454
4.55000 -3100.33483 -13.04106 126.61205 978.54488 420.13142 2356.27910
4.65000 -3120.63500 -10.10212 248.66748 922.63820 407.88395 2263.40918
4.75000 -3101.64696 -4.25367 144.58581 913.35583 396.62532 2289.11236
4.85000 -3061.56958 17.45074 63.21422 896.20051 377.30265 2307.14857
4.95000 -3058.75735 6.65033 25.19317 883.62329 387.79929 2282.33312
5.05000 -3073.66541 -0.71198 108.20935 864.97205 366.78005 2218.03332
5.15000 -3045.00754 -2.77772 66.55118 867.32270 356.25565 2217.79422
5.25000 -3018.16147 -11.82977 92.21962 867.68434 347.28801 2212.66948
5.35000 -3018.54641 9.90177 6.80210 878.34844 342.29635 2182.36891
5.45000 -3021.67317 -7.44657 43.59334 874.19754 327.94296 2139.50002
5.55000 -2965.71138 -2.56158 23.38895 882.55392 318.09432 2188.72537
5.65000 -2960.95715 6.23854 50.40924 873.97621 309.04140 2153.40007
5.75000 -2930.32154 -3.07875 72.27480 880.26125 316.65894 2155.19764
5.85000 -2941.18853 -2.49007 76.53532 845.05609 300.29745 2119.85230
5.95000 -2887.63333 -4.51361 28.29536 845.50872 286.14522 2163.34661
6.05000 -2863.15794 -0.01608 108.51707 873.32834 286.44675 2136.82811
6.15000 -2869.32602 2.06900 75.48963 856.00943 282.88969 2103.19791
6.25000 -2836.44187 -7.34735 18.55004 839.58494 279.90145 2124.74055
6.35000 -2842.13171 4.71163 79.28095 836.33662 264.99010 2075.11410
6.45000 -2811.28846 -5.28807 -30.73929 832.75025 266.95962 2085.66202
6.55000 -2800.27711 -1.62136 69.52267 818.05122 260.51756 2060.31972
6.65000 -2801.08889 6.62051 -36.51418 823.03558 255.64464 2049.69270
6.75000 -2794.64865 -3.01573 39.48257 802.04880 248.37793 2016.25044
6.85000 -2762.09251 -3.62553 1.90030 809.47246 242.76766 2036.93085
6.95000 -2768.44462 1.87476 29.33042 788.44618 237.51489 2002.48211
7.05000 -2703.78702 -6.47308 -9.40674 838.22550 233.62016 2031.27473
7.15000 -2697.20783 8.31745 20.80484 816.95923 230.87742 2006.60773
7.25000 -2725.17470 -1.01212 -30.91958 791.32638 227.57500 1956.72171
7.35000 -2700.12360 5.51770 -7.14719 784.13415 227.05987 1961.93726
7.45000 -2685.58644 -1.26133 -57.32357 777.33774 218.45317 1946.91284
7.55000 -2646.55034 -1.83937 -15.31865 770.10369 213.34540 1963.46267
7.65000 -2646.60781 0.99867 64.66322 763.53874 207.48958 1926.13898
7.75000 -2606.18390 2.79830 23.83337 775.31102 211.21815 1946.47298
7.85000 -2632.84054 1.40470 5.34809 743.57059 200.57060 1893.22008
7.95000 -2567.61506 1.77794 -40.21979 777.43598 200.22958 1938.80541
8.05000 -2571.48939 5.47859 21.96944 763.65619 195.00844 1906.73434
8.15000 -2576.34029 -0.13992 -77.99669 748.57398 192.80924 1884.90414
8.25000 -2551.26921 -2.28084 2.65944 756.48456 195.20630 1884.20668
8.35000 -2543.67766 -1.48908 -2.66198 743.98108 189.10807 1870.74444
8.45000 -2557.91509 -5.91032 -80.91079 724.46535 182.09711 1834.85252
8.55000 -2528.04359 6.03105 -26.00912 731.57919 180.60963 1836.94112
8.65000 -2516.21285 0.18232 -118.38109 725.13702 176.93069 1835.65743
8.75000 -2480.25668 2.56466 -0.49011 733.88390 175.07480 1837.62959
8.85000 -2469.84250 -0.67531 21.18341 733.57544 174.32309 1816.15019
8.95000 -2491.86187 5.44799 -42.87419 707.71775 166.75058 1774.54377
9.05000 -2442.45064 1.65820 -6.06973 720.36297 166.02768 1807.21583
9.15000 -2425.85338 -2.37740 15.21485 715.54919 164.68087 1800.88553
9.25000 -2440.49717 -7.08706 -3.30806 706.64938 166.10184 1759.44887
9.35000 -2423.94321 0.44140 -116.00769 691.03158 161.47815 1764.89530
9.45000 -2402.05228 0.98094 -71.08832 690.71427 172.24576 1764.02463
9.55000 -2379.31982 1.01750 -65.17432 711.00304 157.58060 1758.67499
9.65000 -2379.23484 4.89559 -19.14485 686.26337 156.28865 1737.14528
9.75000 -2355.05925 -1.35676 -27.47341 683.95202 152.07589 1740.35030
9.85000 -2343.24191 -0.45065 3.44174 684.99160 151.74298 1720.32048
9.95000 -2349.98846 -0.41478 -28.31038 655.04770 147.18335 1706.57496
10.05000 -2311.73526 2.24247 33.13583 684.65149 145.17461 1710.55146
10.15000 -2314.45099 -2.50377 2.36330 676.65303 146.80553 1685.43285
10.25000 -2291.83464 -1.91576 -94.73838 679.12398 141.57624 1690.79110
10.35000 -2272.10590 0.06354 -86.63838 672.55185 139.34571 1695.25937
10.45000 -2262.68553 0.08673 -97.68879 662.58323 142.90829 1685.03420
10.55000 -2260.83234 -0.37443 -22.17338 662.49319 137.78345 1664.06261
10.65000 -2248.72683 1.80460 -103.85314 657.60138 139.23812 1655.77138
10.75000 -2226.35528 0.91930 -46.83975 666.13319 133.42039 1654.28004
10.85000 -2234.54130 3.09496 -63.15625 634.91099 135.97787 1626.59460
10.95000 -2234.99102 -1.86175 -32.26880 630.45806 127.90467 1607.24781
11.05000 -2200.62271 -0.27089 -25.43102 631.91454 130.01520 1619.46694
11.15000 -2202.71064 0.94831 -81.89147 624.97045 122.42625 1601.10557
11.25000 -2151.41748 1.63706 12.76625 638.02349 122.94905 1627.44456
11.35000 -2171.50731 -2.00937 -38.80413 628.65639 123.50891 1590.92804
11.45000 -2144.86714 -3.16358 -15.65482 627.85035 120.46758 1596.78664
11.55000 -2142.17621 0.74800 -124.45747 617.84262 122.80422 1591.81708
11.65000 -2149.54178 -1.20888 22.57440 610.48078 118.47298 1546.16142
11.75000 -2129.41761 2.51057 -10.20388 618.77354 114.83497 1553.20384
11.85000 -2124.41149 -0.30325 -87.27174 606.43001 115.28720 1543.99618
11.95000 -2117.85881 0.78459 -75.77241 602.96197 112.78640 1529.07203
12.05000 -2084.08920 -1.40438 -19.71004 609.88073 114.79883 1543.98216
12.15000 -2084.33941 -0.48493 -35.46620 612.51632 112.70372 1520.63022
12.25000 -2071.78953 3.99339 -58.85769 594.70793 107.33558 1523.15275
12.35000 -2057.89421 -0.92334 -35.42001 606.26322 106.69025 1508.24478
12.45000 -2050.97667 -2.56558 -38.44485 587.96505 105.21336 1504.58638
12.55000 -2050.53290 -0.81863 -81.20445 578.54004 106.00754 1487.48289
12.65000 -2043.56554 -2.31955 -72.36662 585.78541 106.75816 1470.71874
12.75000 -2007.72453 -1.55497 -72.41030 582.22781 102.91851 1500.12308
12.85000 -1998.50489 2.83647 13.30811 595.69206 108.55093 1479.83692
12.95000 -2002.67257 -2.52952 -65.16832 576.60064 105.12078 1461.37088
13.05000 -1991.15038 -2.78089 -46.77835 576.42247 103.53805 1453.59029
13.15000 -1991.30935 1.23506 -73.18384 568.62391 101.48185 1434.83984
13.25000 -1965.92787 -3.81275 -64.28308 575.36464 104.48873 1448.05398
13.35000 -1975.65494 0.60393 -65.60296 548.85883 99.04640 1420.64432
13.45000 -1936.69331 3.17854 -37.69543 570.28601 95.83693 1444.35898
13.55000 -1934.03642 -0.61021 -41.51051 556.19902 98.56954 1431.97391
13.65000 -1917.20609 0.21274 -50.28632 560.50673 97.06130 1427.06555
13.75000 -1925.61032 1.55079 -59.40112 551.96104 89.73448 1407.40331
13.85000 -1917.10766 0.28985 -62.86672 546.48973 97.04015 1403.27198
13.95000 -1906.09750 -0.82658 -84.70809 538.89759 87.67855 1397.39211
14.05000 -1878.11549 2.33098 -51.74676 555.85597 86.06761 1408.37954
14.15000 -1863.95376 -3.40935 -40.68305 542.28471 90.63185 1408.07670
14.25000 -1862.35602 -1.35148 -61.09581 549.29831 98.83861 1389.94413
14.35000 -1868.66864 2.43144 -99.04151 527.72115 91.92851 1373.10994
14.45000 -1848.46208 0.04663 -10.48819 536.98788 92.86298 1370.46899
14.55000 -1852.69393 -0.52675 -35.17040 528.25036 87.70533 1355.56045
14.65000 -1838.25640 1.17256 -79.71249 524.40066 85.03003 1354.61600
14.75000 -1828.48252 -1.54726 -89.61014 528.79213 82.19614 1349.67617
14.85000 -1826.63967 0.07635 -56.08618 522.21361 80.88796 1337.32323
14.95000 -1819.77115 2.04564 -51.34342 515.11722 81.56641 1324.74361
15.05000 -1803.21696 1.05551 -9.76872 522.98078 78.28025 1320.84792
15.15000 -1787.38989 1.31020 -71.36810 515.02577 85.28283 1335.21229
15.25000 -1784.41280 -0.40337 -62.46470 526.29076 85.90920 1315.44943
15.35000 -1762.94738 -0.89342 -68.33329 521.75379 80.96523 1328.80478
15.45000 -1765.70564 1.33977 -28.79095 517.65863 81.10624 1308.35699
15.55000 -1743.89009 0.51220 -80.25056 518.34135 82.82634 1321.62469
15.65000 -1767.77966 -0.81915 -23.21712 491.44893 76.82342 1273.66891
15.75000 -1745.98370 -0.63443 -0.27726 507.33552 75.67483 1279.33734
15.85000 -1729.42735 1.39314 -75.62912 513.14653 83.74938 1290.75403
15.95000 -1719.58143 -2.11698 -60.33504 501.07565 82.36121 1289.93903
16.05000 -1737.96258 -0.83151 -86.89292 492.48573 76.42754 1252.46610
16.15000 -1714.84487 -0.17187 -73.13776 492.51472 70.64721 1261.77747
16.25000 -1711.34664 1.95691 -39.23336 493.65105 71.36250 1248.76779
16.35000 -1677.22249 -1.34592 -60.27982 504.01893 72.03006 1274.26315
16.45000 -1686.19909 -1.41299 -19.11379 492.20786 71.98471 1244.14450
16.55000 -1689.97854 -1.29091 -40.42757 477.08803 75.64990 1233.00762
16.65000 -1669.29551 2.03998 -37.91048 491.15989 71.54691 1233.34806
16.75000 -1678.71142 2.13803 -32.44663 470.68635 73.08704 1215.28652
16.85000 -1664.79316 -0.10901 -7.98701 479.59435 78.10960 1210.82617
16.95000 -1659.11380 0.54369 0.80457 479.65564 70.31435 1205.01484
17.05000 -1642.31966 0.63500 -67.08904 484.32711 70.10021 1209.15248
17.15000 -1649.87519 2.39141 -82.67252 467.80435 68.55929 1191.89510
17.25000 -1624.74553 -2.01675 -34.25944 468.38701 71.92954 1205.03458
17.35000 -1636.59681 -0.12922 -25.42999 460.10321 69.26605 1176.33374
17.45000 -1620.79207 1.33065 -29.46597 458.96664 63.13096 1181.13072
17.55000 -1610.08974 0.48964 -15.37932 459.24608 70.70790 1179.39132
17.65000 -1596.16546 -0.33953 -54.03347 455.40918 76.45134 1185.41220
17.75000 -1604.25318 1.11783 -51.80801 452.79213 75.69405 1162.30277
17.85000 -1598.20885 0.75441 -17.05679 447.58911 67.26134 1152.70549
17.95000 -1581.49861 -0.88946 -12.06825 456.37546 63.95610 1156.25088
18.05000 -1568.66652 0.92678 -50.96748 453.70788 64.15683 1162.59466
18.15000 -1568.54177 0.05128 4.76351 454.70284 61.08420 1142.83200
18.25000 -1554.57129 -0.96439 -74.78860 448.60634 60.02617 1154.35980
18.35000 -1541.42286 0.78426 -27.98776 450.50203 65.25386 1151.62871
18.45000 -1551.38746 1.27486 -29.92844 432.75838 68.38311 1128.95453
18.55000 -1538.82579 -0.72923 -72.36316 442.60522 69.74805 1135.17830
18.65000 -1535.58314 -1.00360 -69.42027 437.58642 61.05854 1123.71929
18.75000 -1534.48870 -0.44807 -42.94774 441.94409 58.72588 1111.25710
18.85000 -1524.22200 0.89446 -59.24719 431.81972 60.99177 1109.27060
18.95000 -1504.64781 0.42889 -18.58589 447.30613 66.01847 1116.04620
19.05000 -1517.14586 -1.25036 -33.42812 423.26208 60.68593 1091.79793
19.15000 -1487.01817 0.10554 -59.18751 433.14394 53.40363 1116.94380
19.25000 -1480.12900 0.47711 -58.58187 439.94114 57.15918 1110.41901
19.35000 -1485.80745 0.54997 1.09806 420.58723 59.40035 1091.46030
19.45000 -1478.62540 1.24127 -56.54006 423.79183 54.51455 1088.10196
19.55000 -1470.98088 -1.25346 -55.67286 428.81076 57.92868 1085.46891
19.65000 -1454.07008 -0.89025 -40.51685 431.03931 64.86336 1090.99056
19.75000 -1459.31113 2.66864 -56.05117 415.08005 52.67717 1078.01136
19.85000 -1445.35174 -0.05900 -44.93971 419.56090 50.48500 1079.61778
19.95000 -1450.97504 0.25483 -53.16845 417.80278 54.96376 1064.57500
