0.1875 1.54093 23.99402 0.97947 88.4067 88.75479 77.58403
0.5625 0.21073 48.82466 0.06652 86.59026 82.88452 74.31992
0.9375 -0.31055 71.15752 -0.37633 82.36884 76.79817 70.09736
1.3125 -0.32607 86.61685 0.01688 78.50547 71.24944 66.30494
1.6875 0.98486 101.57089 0.54463 74.37138 66.73805 61.9009
2.0625 0.98923 114.62088 0.71592 69.69293 62.38807 58.77754
2.4375 -0.09224 126.01807 1.10591 64.46464 58.15108 55.64851
2.8125 -0.88477 136.16876 0.6877 59.15119 54.86978 53.20743
3.1875 -0.75382 145.61437 0.95215 54.87242 51.27041 50.65556
3.5625 -1.18536 154.9193 0.26463 51.52992 47.60154 47.54109
3.9375 -0.26093 161.93003 0.31759 49.48165 44.20848 45.01451
4.3125 -0.23463 168.14616 0.55224 47.37331 40.94419 43.6154
4.6875 -0.33985 174.10167 0.11581 44.88894 38.90312 41.50237
5.0625 -0.27842 178.06646 0.33518 43.74509 37.79931 39.78706
5.4375 0.76772 182.25409 -0.52453 42.10436 36.22125 38.42486
5.8125 0.70138 186.30525 -0.351 40.63652 34.39811 36.74453
6.1875 0.63057 189.00851 -0.78517 39.70792 33.09906 35.26479
6.5625 0.41902 191.81895 -0.88586 38.19262 31.34439 34.03744
6.9375 0.27611 194.20214 -1.74669 37.27131 30.48183 32.49888
7.3125 0.49219 196.82922 -1.36726 36.07611 29.74625 31.38538
7.6875 0.439 199.29134 -0.85536 35.04502 28.62172 29.93696
8.0625 0.65129 201.53588 -0.60954 34.08522 27.40236 28.6956
8.4375 0.34582 203.50487 -0.37538 33.48143 26.09435 28.34335
8.8125 -0.31026 204.72997 0.09342 32.23667 25.10755 27.15742
9.1875 -0.21241 205.98158 0.23309 31.25998 24.32905 26.41682
9.5625 -0.3805 206.72011 0.52878 30.30366 23.53928 25.35471
9.9375 -0.20463 207.51053 0.18935 29.77078 22.20938 24.41232
10.3125 0.01714 208.3476 0.31252 28.87154 21.7032 23.51358
10.6875 -0.62185 209.0864 0.31129 28.09739 21.54566 22.79665
11.0625 -0.34825 209.90344 0.44973 27.17747 21.12286 22.15786
11.4375 -0.33682 210.84403 0.41761 26.39169 20.54706 21.20698
11.8125 -0.69339 211.98085 0.69613 25.41762 19.81276 20.41995
12.1875 -0.01389 212.39918 0.3723 24.84978 19.16159 19.90007
12.5625 0.16365 212.7555 0.49225 24.15568 18.53408 19.05248
12.9375 -0.48486 212.75383 0.3678 23.62256 18.21442 18.57301
13.3125 -0.26454 213.0923 0.36651 23.29862 17.65921 17.85989
13.6875 -0.07794 213.53652 0.41461 22.12137 17.33374 17.15533
14.0625 0.11841 213.97843 -0.05511 21.10176 16.55667 16.70224
14.4375 -0.10905 214.35687 -0.51599 21.06516 15.9666 15.84647
14.8125 -0.41712 214.30941 -0.542 20.32145 15.23676 15.6384
15.1875 -0.40265 214.30638 -0.46134 19.86228 14.90125 15.13312
15.5625 -0.4984 213.76153 -0.55463 19.44496 14.50251 14.97309
15.9375 -0.00683 213.81573 -0.70573 19.18295 14.06491 14.23799
16.3125 -0.62725 213.7077 -0.61991 18.54292 13.75689 13.89253
16.6875 -0.43248 214.03711 -0.68231 18.00331 13.30704 13.20373
17.0625 0.08313 213.86068 -0.55847 17.59067 13.34019 13.15772
17.4375 0.36506 214.29464 -0.45016 16.94306 12.42682 12.54208
17.8125 0.12629 213.97931 -0.5866 16.59765 12.20322 12.19321
18.1875 -0.03925 213.779 -0.26832 16.34732 12.28917 11.87535
18.5625 -0.01186 213.16085 -0.57734 16.0558 11.87334 11.71166
18.9375 -0.08149 213.40824 -1.07756 15.03332 11.37409 10.91146
19.3125 -0.41029 212.77588 -0.64531 15.14188 11.48115 10.78893
19.6875 -0.55419 212.62106 -1.04984 14.29311 11.20204 10.37
20.0625 -0.40463 213.08684 -0.76245 14.05749 10.97413 10.17308
20.4375 0.00681 213.60347 -1.14459 13.44095 10.24573 9.69463
20.8125 0.20469 212.89948 -1.31426 13.37958 9.69817 9.63751
21.1875 0.76566 212.57384 -1.06359 13.45147 8.70489 9.10271
21.5625 0.27637 212.72214 -1.18342 13.15574 9.07954 9.1134
21.9375 -0.15597 212.01303 -0.78101 11.67623 9.24647 8.96955
22.3125 -0.53492 211.88113 0.11702 12.26107 9.0902 8.83877
22.6875 -0.19666 211.97674 -0.04086 11.53571 8.77878 8.60855
23.0625 0.37262 211.80446 0.08595 11.42702 8.17253 8.61175
23.4375 0.39276 211.36395 0.47854 10.81629 7.90672 8.22004
23.8125 -0.17693 210.66097 0.6918 10.9325 7.38692 7.80948
24.1875 0.33097 209.96613 0.61762 10.82885 7.39081 7.75181
24.5625 -1.21715 209.535 0.19224 10.29372 7.60505 7.45423
24.9375 -1.48083 209.45995 0.19712 10.6491 7.66574 7.31919
25.3125 -1.09668 210.23706 -0.21067 10.358 7.43231 6.6668
25.6875 -1.58387 210.44616 0.08024 9.63433 6.4464 6.59021
26.0625 -0.4846 209.94509 0.01652 9.86475 6.56135 7.18007
26.4375 0.05146 208.65581 -0.13789 9.38929 6.19748 6.57209
26.8125 -0.67219 207.94332 0.31458 8.89286 5.9259 6.67185
27.1875 -0.87652 208.1574 0.18067 8.64531 6.33052 6.40291
27.5625 -1.41053 206.99322 0.8173 8.69008 5.85613 6.60278
27.9375 -0.69529 207.0963 0.42548 8.96664 6.31507 5.71653
28.3125 -0.88262 206.83087 0.60056 8.63696 6.15771 5.93429
28.6875 -1.29665 206.68195 -0.06898 8.37507 6.03543 6.3052
29.0625 -0.91461 206.52653 0.5156 7.62336 6.25213 6.51372
29.4375 -0.54055 206.63098 -1.36931 8.25981 5.31057 5.8908
29.8125 0.43659 206.56367 -0.69892 8.2121 5.64382 5.71957
