0.2 -1.59018 22.95798 2.01232 100.04317 100.19731 72.62529
0.6 -0.0183 47.16829 1.81055 100.59647 95.14372 70.89977
1.0 -0.63446 65.75522 1.38995 101.45519 88.51078 68.51452
1.4 0.7239 78.72236 1.98595 101.85906 83.88596 65.13743
1.8 -0.31906 85.26441 1.39357 102.40761 78.7028 62.26894
2.2 -0.32818 91.64235 1.01255 101.73036 73.92494 59.95303
2.6 -1.38106 95.9717 0.27993 99.70699 71.11089 57.80691
3.0 -0.98077 101.25677 0.11692 97.34544 67.98247 56.0804
3.4 0.15782 106.78417 -0.23572 92.467 65.03845 54.08065
3.8 1.21086 114.69116 -1.19524 87.07749 62.39745 51.36541
4.2 1.55857 124.1226 -1.06579 81.1333 59.85555 49.84708
4.6 1.12608 133.40077 -1.07265 74.35108 57.77085 47.31304
5.0 1.87575 142.73916 -1.67716 69.0088 55.14951 45.29585
5.4 2.22522 152.26881 -1.3427 63.0718 52.34574 43.40619
5.8 1.57712 160.24287 -0.9102 57.32453 49.59619 41.76251
6.2 1.51015 167.9275 -1.65172 52.36627 46.41845 39.4529
6.6 0.77646 175.14717 -1.30317 46.83035 42.50355 37.06294
7.0 -0.33736 181.32686 -0.40456 43.31524 37.87958 34.82377
7.4 -0.66284 187.54409 -0.44367 40.26832 34.60245 32.96963
7.8 -0.39681 191.96786 0.03145 38.17644 31.90113 31.45532
8.2 -0.56208 195.3644 0.18154 36.2932 29.583 30.09264
8.6 0.34107 197.44175 0.46929 34.47746 28.44123 28.99234
9.0 0.36011 199.01528 0.59216 33.64672 26.81619 27.45419
9.4 0.42339 200.60736 0.33894 32.2934 26.36406 26.5175
9.8 0.07962 202.38462 0.08691 31.36346 25.16734 25.35324
10.2 0.08347 203.33159 0.27591 30.13672 24.70113 24.25743
10.6 0.23328 204.76116 -0.07228 28.91956 22.64548 23.42117
11.0 -0.29407 205.84857 0.0274 28.35094 22.23985 22.56422
11.4 -0.33075 206.68664 -0.52104 26.97496 21.73642 21.61695
11.8 0.23848 207.61072 -0.46493 26.16949 21.09613 20.93582
12.2 0.4082 208.77144 0.14089 25.22461 20.34255 19.83823
12.6 0.34032 209.74593 -0.03011 24.43282 19.90359 19.45156
13.0 0.80729 210.96733 0.32279 23.9697 19.01003 18.23514
13.4 0.15078 211.357 0.49188 23.12025 18.19012 18.14293
13.8 0.53159 212.24143 0.57024 22.44717 17.27596 17.57129
14.2 0.83985 212.01869 1.01063 22.06876 16.55998 17.15942
14.6 0.50356 212.20565 0.7802 21.85327 15.70036 16.28469
15.0 0.50612 211.60022 0.79869 21.04956 15.31778 15.90586
15.4 0.26514 210.73785 0.34428 20.85507 14.5074 16.01794
15.8 0.23569 211.03458 0.35966 20.48437 14.40072 14.70172
16.2 1.01776 210.71227 0.53151 19.61682 14.27968 14.93628
16.6 0.72215 211.2045 -0.03044 18.68461 14.20673 14.19367
17.0 0.52653 211.8265 0.12647 18.21316 14.06655 13.54028
17.4 1.16895 211.4621 -0.45708 17.51235 13.70605 13.17063
17.8 0.72762 211.38611 0.02568 17.10488 13.16557 12.86552
18.2 0.75222 211.38987 -0.08501 16.33497 12.63347 12.27163
18.6 0.2916 211.72062 -0.03804 16.03048 12.18016 11.92665
19.0 1.32657 212.10396 -0.05238 15.84641 11.86755 11.70304
19.4 1.21526 212.29094 0.35123 15.39275 12.06588 11.01296
19.8 0.60604 212.69616 0.20389 15.05177 11.59455 11.05836
