0.05000 72951.39579
0.15000 60523.87549
0.25000 47584.72041
0.35000 36206.81594
0.45000 28949.95349
0.55000 24057.81987
0.65000 20746.95879
0.75000 17587.87944
0.85000 15451.10113
0.95000 14031.71417
1.05000 12912.41751
1.15000 11580.30116
1.25000 10678.48956
1.35000 9892.58975
1.45000 8909.84957
1.55000 8324.37981
1.65000 8015.60534
1.75000 7258.53766
1.85000 6871.28132
1.95000 6428.27343
2.05000 6120.32869
2.15000 5850.61746
2.25000 5433.22854
2.35000 5051.81468
2.45000 4847.19934
2.55000 4562.19761
2.65000 4278.18146
2.75000 4046.41040
2.85000 3751.91254
2.95000 3629.57491
3.05000 3528.63616
3.15000 3330.59605
3.25000 3272.08578
3.35000 3040.00476
3.45000 3010.51064
3.55000 2861.13686
3.65000 2723.31961
3.75000 2564.86125
3.85000 2486.14297
3.95000 2507.97492
4.05000 2401.48513
4.15000 2333.16872
4.25000 2277.14373
4.35000 2192.70712
4.45000 2157.26847
4.55000 2099.49279
4.65000 2042.65321
4.75000 1941.11190
4.85000 1907.02500
4.95000 1849.63587
5.05000 1813.74406
5.15000 1761.09923
5.25000 1672.58058
5.35000 1614.45105
5.45000 1567.67579
5.55000 1547.91307
5.65000 1506.98059
5.75000 1499.95128
5.85000 1413.54088
5.95000 1402.96048
6.05000 1386.33932
6.15000 1305.52592
6.25000 1290.55311
6.35000 1249.64508
6.45000 1220.90986
6.55000 1166.39483
6.65000 1180.92986
6.75000 1150.51808
6.85000 1093.80174
6.95000 1071.89195
7.05000 1099.01100
7.15000 1033.37097
7.25000 1016.04171
7.35000 1001.46458
7.45000 972.25655
7.55000 960.36197
7.65000 924.71347
7.75000 913.06648
7.85000 883.37942
7.95000 854.10226
8.05000 831.10767
8.15000 788.95283
8.25000 798.27194
8.35000 795.59726
8.45000 780.29901
8.55000 756.92871
8.65000 742.41530
8.75000 714.35125
8.85000 710.10701
8.95000 696.86257
9.05000 707.66970
9.15000 689.91056
9.25000 623.20945
9.35000 640.60286
9.45000 594.46116
9.55000 606.97638
9.65000 584.33656
9.75000 564.51186
9.85000 568.50299
9.95000 560.74525
10.05000 518.77831
10.15000 508.21638
10.25000 499.78636
10.35000 499.85643
10.45000 519.07029
10.55000 487.64612
10.65000 462.59488
10.75000 458.50157
10.85000 446.33835
10.95000 442.79625
11.05000 453.92807
11.15000 417.44976
11.25000 421.54511
11.35000 404.17510
11.45000 412.72353
11.55000 396.40018
11.65000 361.36543
11.75000 358.75056
11.85000 358.84110
11.95000 351.65791
12.05000 347.49400
12.15000 328.23997
12.25000 345.72687
12.35000 356.41335
12.45000 343.37596
12.55000 337.24430
12.65000 307.01510
12.75000 293.06396
12.85000 305.70485
12.95000 287.03414
13.05000 303.72651
13.15000 278.81902
13.25000 288.89197
13.35000 265.66253
13.45000 287.28704
13.55000 249.85729
13.65000 274.92505
13.75000 274.75221
13.85000 284.64838
13.95000 258.68558
14.05000 226.75806
14.15000 240.89232
14.25000 231.17337
14.35000 230.11134
14.45000 204.23390
14.55000 215.49659
14.65000 230.73644
14.75000 223.43453
14.85000 228.03602
14.95000 210.36201
15.05000 209.28221
15.15000 195.32803
15.25000 208.69299
15.35000 207.48542
15.45000 195.61779
15.55000 185.91115
15.65000 229.74638
15.75000 193.87891
15.85000 206.90042
15.95000 176.58614
16.05000 184.30580
16.15000 186.66542
16.25000 181.35657
16.35000 176.27570
16.45000 176.76438
16.55000 176.37508
16.65000 182.80168
16.75000 165.34325
16.85000 145.61733
16.95000 162.37478
17.05000 149.17290
17.15000 146.65436
17.25000 164.43070
17.35000 148.88792
17.45000 185.32872
17.55000 143.01359
17.65000 178.78136
17.75000 182.09332
17.85000 152.75925
17.95000 151.59566
18.05000 156.10612
18.15000 157.97243
18.25000 126.17608
18.35000 128.76143
18.45000 122.73763
18.55000 132.16042
18.65000 114.24798
18.75000 129.54121
18.85000 113.27947
18.95000 107.34708
19.05000 118.95707
19.15000 129.34570
19.25000 113.80224
19.35000 119.93417
19.45000 108.02715
19.55000 133.38078
19.65000 122.51617
19.75000 142.70018
19.85000 114.10995
19.95000 115.50391
