0.12500 0.01746
0.37500 0.06588
0.62500 0.12507
0.87500 0.21049
1.12500 0.27341
1.37500 0.34725
1.62500 0.40437
1.87500 0.46497
2.12500 0.51132
2.37500 0.55160
2.62500 0.57192
2.87500 0.58275
3.12500 0.56996
3.37500 0.55734
3.62500 0.51206
3.87500 0.48459
4.12500 0.45465
4.37500 0.42232
4.62500 0.39237
4.87500 0.38557
5.12500 0.37927
5.37500 0.38061
5.62500 0.36281
5.87500 0.33835
6.12500 0.30152
6.37500 0.28529
6.62500 0.23649
6.87500 0.18179
7.12500 0.15141
7.37500 0.14862
7.62500 0.13670
7.87500 0.12685
8.12500 0.12460
8.37500 0.09207
8.62500 0.08312
8.87500 0.07600
9.12500 0.08508
9.37500 0.09181
9.62500 0.07464
9.87500 0.09206
10.12500 0.07700
10.37500 0.07697
10.62500 0.09963
10.87500 0.09068
11.12500 0.12702
11.37500 0.14274
11.62500 0.15859
11.87500 0.18304
12.12500 0.17438
12.37500 0.16924
12.62500 0.16265
12.87500 0.15981
13.12500 0.14547
13.37500 0.11761
13.62500 0.11059
13.87500 0.07571
14.12500 0.10499
14.37500 0.13373
14.62500 0.08843
14.87500 0.08354
