0.12500 0.06340
0.37500 0.03833
0.62500 0.04180
0.87500 0.05782
1.12500 0.07486
1.37500 0.09990
1.62500 0.12334
1.87500 0.14434
2.12500 0.15840
2.37500 0.17215
2.62500 0.17136
2.87500 0.13723
3.12500 0.09498
3.37500 0.05526
3.62500 0.05430
3.87500 0.06528
4.12500 0.06087
4.37500 0.04985
4.62500 0.02985
4.87500 0.04157
5.12500 0.04238
5.37500 0.05319
5.62500 0.07113
5.87500 0.07409
6.12500 0.08521
6.37500 0.07834
6.62500 0.09439
6.87500 0.06775
7.12500 0.05687
7.37500 0.04536
7.62500 0.04156
7.87500 0.04842
8.12500 0.04484
8.37500 0.05145
8.62500 0.04214
8.87500 0.02069
9.12500 0.00452
9.37500 0.00806
9.62500 0.02890
9.87500 0.04147
10.12500 0.05078
10.37500 0.04684
10.62500 0.04128
10.87500 0.05104
11.12500 0.03523
11.37500 0.03691
11.62500 0.02992
11.87500 0.03678
12.12500 0.05116
12.37500 0.06894
12.62500 0.03033
12.87500 0.05163
13.12500 0.05697
13.37500 0.06586
13.62500 0.04218
13.87500 0.07412
14.12500 0.05159
14.37500 0.09276
14.62500 0.06690
14.87500 0.08779
