0.05000 -953.16220 229.57507 604.17393 1820.81909 2205.79683 1661.27121
0.15000 -2677.63044 17.31337 -208.75362 1573.94364 1584.45925 2998.72674
0.25000 -3687.52627 -4.98270 300.56385 1415.23562 1102.87294 4126.74305
0.35000 -4495.70669 46.50184 164.71172 1492.08357 758.70887 4752.66810
0.45000 -4731.88785 -2.43107 -205.34081 1417.05544 585.58971 5555.98791
0.55000 -4968.75655 15.20616 46.16749 1338.66432 475.03625 5857.71603
0.65000 -5143.32211 10.36888 64.94052 1317.77306 404.45371 6095.50446
0.75000 -5285.82937 18.10317 71.38268 1327.99740 385.93470 6272.53280
0.85000 -5507.08284 9.33112 104.74086 1296.78507 353.64321 6302.58258
0.95000 -5703.82812 21.18332 43.96668 1265.78559 339.16329 6332.49429
1.05000 -5913.91402 11.74402 197.34379 1254.49235 307.99165 6254.03482
1.15000 -6061.37268 29.13916 112.22809 1270.78844 306.42045 6209.38210
1.25000 -6195.60626 19.57609 147.49412 1251.93932 287.27580 6153.34720
1.35000 -6323.45116 15.75241 4.20389 1211.54004 277.33359 6014.50633
1.45000 -6479.22314 13.96424 47.03415 1149.63872 270.47847 5877.62219
1.55000 -6555.32119 20.50511 -42.83859 1177.06163 257.49937 5806.55850
1.65000 -6680.82608 21.51512 206.89685 1094.66280 247.66533 5586.31606
1.75000 -6750.58993 16.40245 12.53992 1048.73864 241.89749 5464.21375
1.85000 -6830.66093 16.86940 61.90256 1026.09996 239.52377 5324.98794
1.95000 -6898.05651 16.96034 -35.05097 985.95678 236.12714 5226.14745
2.05000 -6970.39718 19.08330 -2.97913 933.56998 227.33551 5076.26328
2.15000 -7024.49084 19.77574 20.48117 889.68157 218.74191 4913.62145
2.25000 -7061.55138 18.23877 2.31921 832.43783 201.65489 4803.97832
2.35000 -7087.98503 14.04820 33.38757 836.46487 204.14522 4674.08743
2.45000 -7129.45995 20.31885 -57.60319 795.41575 198.08959 4579.55052
2.55000 -7165.38498 19.53865 -15.25208 783.23661 190.86531 4439.54036
2.65000 -7195.57523 18.58409 -87.87123 771.34850 187.63825 4334.80770
2.75000 -7229.65858 17.33221 -70.32208 726.33227 183.87759 4209.75188
2.85000 -7244.44369 14.95095 -45.96520 732.19456 179.31863 4104.68855
2.95000 -7237.48031 17.04097 51.71472 679.37497 168.81382 4018.53616
3.05000 -7249.41623 14.60785 7.54673 639.36889 168.86948 3841.87783
3.15000 -7225.26341 15.06112 -36.98046 616.98328 168.84577 3775.38918
3.25000 -7198.25939 14.67478 -4.69845 584.40826 162.56211 3658.21263
3.35000 -7143.03592 10.76648 -7.19618 565.54984 160.50300 3550.58526
3.45000 -7080.81306 14.98333 -32.96529 549.05461 157.16548 3492.67391
3.55000 -7026.02291 13.91403 -74.11934 503.38068 156.88720 3411.84509
3.65000 -6990.94042 15.09212 -8.28943 465.81356 158.85083 3296.51047
3.75000 -6961.29553 11.85301 12.50048 431.03829 158.26099 3184.32806
3.85000 -6902.80627 17.31195 -17.01732 424.03709 151.66369 3116.61658
3.95000 -6842.01732 13.10439 -32.74349 417.09202 147.12799 3076.69531
4.05000 -6775.00271 11.39337 -26.79746 400.71069 139.57228 3013.60103
4.15000 -6717.36454 12.54187 -120.19109 366.91267 143.22629 2917.66928
4.25000 -6681.01722 11.84491 -125.59097 342.94641 139.49605 2854.34121
4.35000 -6640.50686 11.38745 -95.64308 332.11055 134.53087 2804.87918
4.45000 -6595.19136 11.81871 -82.69955 335.51839 133.55480 2757.23523
4.55000 -6565.77734 9.87611 -128.39544 312.19861 133.94573 2637.49365
4.65000 -6528.55870 10.98787 -121.35259 295.24860 134.34275 2609.22698
4.75000 -6515.06777 11.55593 -171.90974 295.20198 134.80445 2556.01191
4.85000 -6507.89099 14.10029 -169.22762 299.39941 131.04105 2482.65777
4.95000 -6483.60113 11.49386 -192.06871 291.23050 127.13272 2449.61714
5.05000 -6472.42005 11.84853 -133.11331 295.63032 127.52263 2375.37501
5.15000 -6468.58291 10.73425 -74.98904 279.94142 125.82938 2340.46110
5.25000 -6462.07956 10.80074 -107.26611 272.80282 124.16762 2267.51059
5.35000 -6442.41312 11.87525 -102.71222 284.83736 119.75358 2228.64287
5.45000 -6422.44917 11.00999 -70.98321 277.39872 119.30184 2175.60260
5.55000 -6409.36455 9.86044 -54.24176 289.94203 114.45521 2108.58436
5.65000 -6387.38535 10.52632 -37.53529 285.37491 113.00165 2067.98690
5.75000 -6365.97853 9.59743 7.92585 297.09175 115.04751 2021.32730
5.85000 -6348.93106 8.09894 -18.90374 283.56692 117.26862 1976.18134
5.95000 -6312.40881 7.32630 17.65210 285.42981 112.47625 1928.98246
6.05000 -6267.15713 11.64785 16.46186 289.17896 110.64385 1892.23290
6.15000 -6226.75246 10.61139 91.70201 276.51646 108.48822 1836.44759
6.25000 -6175.13997 8.69833 119.60977 272.52206 107.23927 1797.44233
6.35000 -6136.37463 8.53125 98.54555 264.32846 106.08143 1735.99689
6.45000 -6096.18197 11.34564 122.01808 266.06104 104.87048 1701.63937
6.55000 -6050.83916 7.15884 88.30986 254.11977 104.54918 1661.89363
6.65000 -5988.40062 8.63454 104.18991 248.57384 101.90965 1647.90507
6.75000 -5944.68392 6.40608 116.52702 230.92961 98.98067 1577.53340
6.85000 -5888.30959 7.85738 154.28547 215.58320 95.64966 1539.89504
6.95000 -5833.36964 7.41401 152.63773 207.33437 94.30253 1510.27512
7.05000 -5776.86269 7.63612 171.22706 213.10161 94.69381 1483.03600
7.15000 -5728.66117 8.09348 149.44317 190.16284 95.74777 1453.91869
7.25000 -5687.74796 5.90081 147.09642 187.09767 96.14204 1427.64326
7.35000 -5643.06426 8.71441 140.50225 186.50477 91.20044 1405.13786
7.45000 -5606.14513 8.32829 119.77847 193.01869 93.30702 1360.49251
7.55000 -5572.03493 6.93854 110.91257 184.32243 91.57569 1324.26646
7.65000 -5532.80845 7.16479 106.00515 184.09332 92.47753 1307.66448
7.75000 -5501.27142 5.80601 86.99516 183.88154 87.72499 1269.87562
7.85000 -5467.18744 4.57037 86.99199 177.61615 91.18483 1243.26865
7.95000 -5429.29983 8.99156 58.70746 188.69232 87.09162 1234.68208
8.05000 -5392.00194 5.11938 88.70572 176.81050 83.94756 1210.68468
8.15000 -5367.14702 5.91046 84.27172 168.93636 84.50606 1170.77225
8.25000 -5324.28118 7.17406 35.96683 180.85359 83.12578 1150.78299
8.35000 -5289.45912 5.58892 72.18787 166.94464 81.89995 1117.31081
8.45000 -5246.31116 5.86296 52.26011 166.04788 80.88295 1100.03487
8.55000 -5210.90818 3.81262 50.69905 171.23354 79.61405 1061.12598
8.65000 -5174.90288 5.34306 38.18063 154.93696 77.06934 1022.32842
8.75000 -5129.95516 6.65923 25.55757 154.49818 76.98241 1012.32250
8.85000 -5085.91113 5.62680 26.95231 148.98512 75.23165 980.10220
8.95000 -5039.61976 5.24103 20.66846 157.93963 72.39606 957.69601
9.05000 -4997.55520 4.19479 -14.96780 135.82611 78.03406 926.28891
9.15000 -4957.24237 5.44725 2.01349 159.36668 75.59136 900.75860
9.25000 -4913.39579 4.63547 -10.10818 132.52811 71.42939 879.32991
9.35000 -4862.64908 5.47403 -22.46871 171.01411 69.43530 873.18379
9.45000 -4829.50887 6.46162 -33.61313 138.36196 71.05190 833.28680
9.55000 -4784.26391 6.50415 -11.63759 117.14052 67.92746 818.54366
9.65000 -4741.76074 4.53035 -24.76804 137.79801 67.94149 803.50986
9.75000 -4693.70868 4.45359 -37.73561 127.25484 65.60226 787.38878
9.85000 -4651.32333 6.78071 -56.25363 109.89226 65.83399 754.60292
9.95000 -4612.43712 4.65107 -39.68294 102.24372 66.45405 740.98135
10.05000 -4571.66782 5.85138 -45.06715 96.99350 65.70606 715.85187
10.15000 -4530.87131 3.90633 -53.33275 96.57223 65.90925 698.02144
10.25000 -4490.13068 4.72663 -57.15573 94.81800 62.52806 698.48441
10.35000 -4453.19196 3.15225 -57.61734 94.54270 63.20399 670.01163
10.45000 -4413.06104 3.66881 -39.66482 96.23388 64.60021 664.12346
10.55000 -4380.88617 4.20619 -49.46674 85.45343 61.36851 632.22866
10.65000 -4347.32503 2.97008 -20.73970 86.95091 61.53303 622.13059
10.75000 -4309.38166 5.35340 -55.49370 103.25051 62.04857 619.45827
10.85000 -4277.14159 3.41224 -42.66982 86.52137 61.53454 604.88051
10.95000 -4242.80289 4.10833 -48.48288 87.31373 58.61655 591.84820
11.05000 -4207.75067 4.20510 -40.08477 99.69654 60.43583 576.94711
11.15000 -4170.86250 3.89758 -49.62206 98.49173 59.39571 576.18994
11.25000 -4138.16799 3.09368 -40.23445 90.78394 57.02001 562.00975
11.35000 -4104.91838 2.01811 -53.75650 79.01957 56.97820 547.36724
11.45000 -4075.83681 4.97237 -36.12272 77.82955 57.47499 545.50969
11.55000 -4042.04408 3.88828 -25.09956 73.11867 55.23181 519.23772
11.65000 -4009.88019 2.46445 -47.87540 74.85604 57.24441 509.46920
11.75000 -3977.07902 4.20140 -39.15524 73.43638 56.37334 511.17240
11.85000 -3944.93519 3.27651 -39.90582 73.75959 52.12143 497.67892
11.95000 -3914.25092 1.56407 -25.03816 70.80414 54.13608 487.83875
12.05000 -3887.41897 3.00410 -37.91293 71.08889 55.24285 475.85849
12.15000 -3857.10383 0.92971 -14.98819 78.12453 51.52458 463.22715
12.25000 -3826.15101 4.32219 -21.08953 64.36030 50.29141 460.12270
12.35000 -3796.44990 3.83508 -24.23873 65.95362 50.96450 449.38210
12.45000 -3766.66227 3.86667 -27.22326 69.33860 55.26168 455.42421
12.55000 -3742.16750 2.42473 -35.38612 64.99777 53.88077 436.95739
12.65000 -3716.87258 4.49481 -39.84869 65.99216 52.65395 440.16109
12.75000 -3689.24579 2.62022 -41.69245 64.12044 50.60184 419.65420
12.85000 -3662.86827 4.72240 -10.29104 61.29928 49.17942 405.45876
12.95000 -3631.69319 2.28964 -25.16420 63.27694 49.73283 403.47002
13.05000 -3604.10325 5.10805 -24.39909 65.10107 50.39053 397.42846
13.15000 -3574.70943 3.03227 -6.98593 59.37024 50.79675 386.57296
13.25000 -3550.46529 2.22915 0.31192 59.69111 52.00257 378.84955
13.35000 -3523.93760 3.09364 -13.44252 58.30703 49.27188 372.51296
13.45000 -3498.07463 1.63104 -21.10449 57.53181 49.16994 372.12150
13.55000 -3473.47350 1.39859 -11.86121 58.99932 50.34777 361.94180
13.65000 -3452.39605 3.45403 -14.99493 58.91506 47.98957 346.46844
13.75000 -3429.85785 1.82227 -0.76620 55.41855 46.54247 347.27210
13.85000 -3404.21853 0.66982 1.65919 56.48700 46.20864 347.29076
13.95000 -3380.34179 1.74571 -6.92239 51.56426 44.55829 331.28466
14.05000 -3356.15039 3.20814 -3.72592 55.38948 47.05832 325.26809
14.15000 -3330.55110 3.67848 -4.47126 54.68361 43.01073 321.37967
14.25000 -3307.75250 1.99316 -12.44977 52.96292 43.02996 313.01259
14.35000 -3286.21436 2.31181 -4.23623 51.36745 40.73615 303.45530
14.45000 -3262.86202 0.53913 -3.72094 50.16736 44.50290 301.22338
14.55000 -3238.32148 1.03476 13.20371 49.08630 41.65310 293.15522
14.65000 -3217.15090 0.94513 9.19437 50.96261 41.50086 288.58653
14.75000 -3194.37855 2.99694 9.63297 48.70814 41.96393 289.71779
14.85000 -3169.44480 1.70064 -2.11453 49.03639 41.81777 277.26027
14.95000 -3146.16582 1.67279 14.88747 48.77893 42.35656 275.11494
15.05000 -3127.13241 2.94413 2.59555 44.51689 43.19120 273.21075
15.15000 -3107.09452 3.11962 -1.33272 47.65066 38.89400 265.96322
15.25000 -3081.19901 -0.38603 0.31359 45.30351 41.30495 272.49954
15.35000 -3062.05987 2.28502 11.21401 45.69732 39.56987 256.17569
15.45000 -3041.56518 1.01148 1.56966 45.02501 43.61201 251.75342
15.55000 -3023.04947 1.72253 2.57548 42.79563 40.42087 242.12669
15.65000 -3001.03776 1.31375 19.98327 44.40945 41.77339 243.04744
15.75000 -2978.09304 3.81018 8.50732 43.79016 41.58607 238.28483
15.85000 -2957.76934 3.03753 11.38994 43.04941 34.91493 227.26527
15.95000 -2937.80454 1.19468 5.34274 41.55274 38.54795 223.82528
16.05000 -2917.30553 0.95175 10.59630 41.79803 36.70040 226.66470
16.15000 -2898.39037 3.38638 -1.60732 43.41243 39.14292 216.40089
16.25000 -2878.95160 2.68401 -8.78325 39.22818 40.22522 221.08387
16.35000 -2858.58477 2.29000 11.78055 42.53233 36.40634 213.74188
16.45000 -2842.04778 -0.42745 8.71808 38.84611 36.88518 209.73484
16.55000 -2821.35483 3.22620 2.14685 40.08786 36.91551 202.37990
16.65000 -2800.64141 3.07401 7.92434 40.60940 41.32199 198.07825
16.75000 -2784.71577 2.20021 1.21050 41.07511 41.79532 200.51544
16.85000 -2767.40502 1.81123 16.39491 38.45555 32.12882 194.97997
16.95000 -2747.30666 2.38068 6.04434 38.13002 33.04294 194.03388
17.05000 -2729.14086 1.57138 10.87040 37.52738 33.96536 197.46923
17.15000 -2713.53668 3.02312 17.81620 37.61890 34.80957 186.42126
17.25000 -2696.38031 1.58873 5.35984 39.53102 37.49450 171.33635
17.35000 -2679.85795 -0.49338 5.24724 39.74250 33.76830 186.03211
17.45000 -2660.76898 0.52234 12.51575 34.75653 29.92119 170.48346
17.55000 -2646.07629 3.39824 2.13358 37.28386 34.38743 168.65029
17.65000 -2626.12860 0.02219 16.82961 33.97337 31.95104 174.25311
17.75000 -2613.17431 -0.25901 7.76624 34.79153 30.93221 168.62320
17.85000 -2596.02317 0.15699 3.51083 32.78849 32.26872 159.21957
17.95000 -2577.08991 3.29136 14.56235 34.35295 34.39345 164.09907
18.05000 -2559.97465 1.20154 5.22507 36.23189 33.21884 167.79824
18.15000 -2547.27592 2.66451 2.62564 32.62973 30.60824 158.33118
18.25000 -2532.15759 0.92383 0.62466 34.15953 33.43617 156.92515
18.35000 -2513.86791 1.29655 8.40068 33.26585 30.95251 160.11620
18.45000 -2503.38076 3.24847 8.75093 32.01391 30.77632 149.60393
18.55000 -2489.88542 1.99251 3.24717 34.68279 32.92959 149.66864
18.65000 -2474.16014 0.17079 -0.17772 31.35740 27.65291 140.33944
18.75000 -2459.07379 -2.39570 9.90396 30.81207 27.82606 140.51407
18.85000 -2441.81935 1.37235 3.36267 31.18140 28.74677 143.56031
18.95000 -2428.94774 2.06831 15.46879 30.28583 30.06721 140.65009
19.05000 -2416.26046 2.28374 9.65768 29.89670 26.68446 137.13684
19.15000 -2402.59540 1.49567 12.71107 30.52368 28.73104 132.12946
19.25000 -2384.53031 0.83869 -0.98200 26.97517 31.43333 137.92879
19.35000 -2374.70920 1.74339 1.34922 34.93284 32.18784 134.64071
19.45000 -2358.20989 1.64125 10.20430 29.74683 27.83159 130.56799
19.55000 -2342.93825 -1.54689 7.16978 30.14693 34.05893 130.27011
19.65000 -2330.81747 -0.20320 2.34237 28.85096 29.27064 132.52345
19.75000 -2319.41152 2.34833 7.48960 29.87862 29.16052 125.56239
19.85000 -2302.66157 0.50657 5.73543 34.40708 28.27848 125.83390
19.95000 -2292.04877 -0.52249 5.22364 29.34503 29.06975 123.98191
