0.2 0.28917 18.65623 0.88732 65.00176 65.64683 64.94121
0.6 0.75554 45.7155 -0.4172 60.84265 62.72435 60.85801
1.0 -0.13412 71.38166 -1.08029 57.37329 58.43907 56.72269
1.4 -0.30282 92.69952 -0.80158 54.7885 54.9086 53.25409
1.8 -0.07847 108.16565 -0.61732 52.79107 51.44517 50.23942
2.2 -1.45808 121.35215 -0.36391 49.80603 48.05682 47.71144
2.6 -1.54856 132.50343 0.16758 47.44803 44.646 45.2791
3.0 -2.03691 141.19287 0.25666 44.71845 42.83448 42.35253
3.4 -2.3655 150.21668 0.12197 42.79 39.54007 40.16748
3.8 -1.98239 157.69784 -0.55329 40.81358 34.77534 38.21322
4.2 -0.49759 162.06799 -1.47268 39.47325 32.57656 35.9872
4.6 1.26853 167.29781 -0.43961 36.79686 33.1748 33.98618
5.0 4.87474 174.85378 1.03082 35.30711 31.66834 31.96498
5.4 6.77004 180.51071 2.16757 33.56215 29.28588 29.69123
5.8 5.32812 184.68221 3.01534 31.61369 27.60565 28.31366
6.2 2.20705 189.48628 2.5234 30.16868 26.10637 26.75543
6.6 1.10777 194.12279 0.94704 28.72984 24.39308 25.94939
7.0 2.62499 196.89331 -0.47279 28.97755 23.6802 24.94948
7.4 4.29482 198.69298 -1.97742 28.84026 23.1099 23.28387
7.8 4.16789 199.36222 -2.38921 28.49001 22.92559 22.17628
8.2 2.0379 200.67414 -2.33813 26.95218 21.94279 20.40931
8.6 -1.60563 202.69218 -2.1523 24.07258 20.19911 18.99752
9.0 -4.04386 204.47278 -1.60858 21.01749 18.21067 18.06925
9.4 -5.11427 205.06848 -1.29014 18.7959 15.62044 17.31742
9.8 -5.28782 205.50034 -0.84682 17.74221 14.00072 15.98978
10.2 -4.44557 205.10619 -0.11706 17.38599 13.22638 15.34869
10.6 -4.32531 205.45905 0.01948 17.65249 12.48289 14.48951
11.0 -3.23539 205.56616 0.43398 17.39368 11.3864 13.89927
11.4 -2.36421 205.98937 0.85149 17.26809 10.72309 13.2629
11.8 -1.95658 206.26516 1.02866 17.36298 10.13119 12.27501
12.2 -2.06378 206.58594 1.39175 16.91502 9.56875 11.92757
12.6 -2.50231 207.15069 1.19101 16.4373 9.08189 11.43006
13.0 -2.63054 207.31284 1.40786 15.74554 8.54251 11.08808
13.4 -2.77005 207.42563 1.22634 15.32133 8.26348 10.50155
13.8 -3.03837 207.73422 1.16407 14.65274 8.17058 10.06238
14.2 -2.97913 207.16494 1.2651 13.22734 7.99749 9.81721
14.6 -3.15052 206.88158 1.17727 12.52713 8.06933 9.71736
15.0 -3.32192 206.59299 0.93693 11.87039 8.11338 9.14552
15.4 -3.81494 206.34301 0.83531 10.82617 8.18788 8.77613
15.8 -3.46702 206.14585 1.19974 10.30039 8.11574 8.74319
16.2 -3.11853 206.02797 0.95328 9.66378 8.15248 8.33451
16.6 -2.72861 205.67019 1.1376 9.11592 7.92852 7.91228
17.0 -2.44723 205.47588 0.88462 8.53634 7.89921 7.40782
17.4 -2.32377 205.05838 0.87799 7.83441 7.82153 7.5207
17.8 -1.55285 205.14232 0.76459 7.69259 7.77842 7.31172
18.2 -1.94147 204.84043 0.52218 7.06419 7.75409 6.89115
18.6 -1.57254 204.62454 0.9856 6.86017 7.28004 6.82613
19.0 -1.2641 204.53575 0.82635 6.61519 7.06625 6.1855
19.4 -0.65904 204.28058 0.24054 5.90862 6.89139 6.31742
19.8 -0.4036 203.91438 0.82679 6.3133 6.70279 6.30465
