0.05000 -10837.17858 1159.21630 88876.82932 14639.02981 17987.43151 1044307.54577
0.15000 -19307.02980 -103.51319 -802.51582 7198.90779 7503.64134 1026631.63089
0.25000 -23914.82383 215.08902 18296.45860 9061.42440 9467.53219 865044.59344
0.35000 -25208.54348 71.68504 -8281.15626 5768.38611 7399.40562 840277.27036
0.45000 -25425.99169 -80.60602 -8281.36645 4455.24667 6454.72025 774936.71358
0.55000 -24430.08375 -10.39345 -1879.19923 4185.60291 6462.45116 667834.59177
0.65000 -23252.55424 41.15924 -1073.55186 3506.76717 5835.71518 621300.95267
0.75000 -21980.12523 19.16299 -4885.08954 2850.51379 5334.72810 585245.03952
0.85000 -20612.63690 33.09487 -8672.81414 2672.40019 5249.30367 514951.91539
0.95000 -19536.22126 -88.82867 2040.22625 3086.47782 5663.50003 514204.09931
1.05000 -18401.74618 32.52578 1755.83481 2095.38645 4722.62739 463115.60247
1.15000 -17525.25762 -106.47924 115.72571 1963.01858 4576.59216 465682.55175
1.25000 -16729.74756 -62.89804 4482.17825 3068.32608 4598.11577 406357.35949
1.35000 -15926.92634 -12.70975 -5573.77967 1737.75477 4292.41879 386348.64829
1.45000 -15283.80142 -127.82143 -3812.29065 1459.75356 4101.93368 349309.57430
1.55000 -14634.01001 4.52478 -6169.82347 1389.45808 3953.88191 326820.05175
1.65000 -14022.59011 -50.33682 -1930.64586 1212.73868 3776.81937 343886.15304
1.75000 -13498.15403 -121.30562 6872.75187 1417.43141 3771.12951 324402.93287
1.85000 -13024.47034 -9.85184 -853.39342 1163.02009 3650.39069 275380.75211
1.95000 -12641.74791 -117.22312 -3631.41268 902.66643 3459.56460 267468.57150
2.05000 -12181.66517 -46.63834 41.13872 1010.69037 3352.86557 252818.21728
2.15000 -11829.29637 -81.66476 1507.20044 1000.82934 3304.74617 237943.01794
2.25000 -11513.27563 -144.58428 4357.02234 1025.20745 3191.59300 217580.76149
2.35000 -11184.16424 -14.36846 -725.90495 900.30914 3000.44583 211653.91455
2.45000 -10894.18454 -41.64492 1591.70734 1037.62839 3003.73346 211657.95375
2.55000 -10660.96623 -86.47844 2913.27146 897.80937 2784.31313 181801.11735
2.65000 -10369.83869 -53.83577 4116.55068 1231.63503 2714.38856 175861.22364
2.75000 -10129.32194 -91.32520 -2971.60671 864.66371 2848.31538 169935.77941
2.85000 -9927.19303 -115.17925 -1534.24560 908.23353 2466.73970 178628.23266
2.95000 -9741.43149 -38.79848 709.90602 947.67327 2367.54673 155660.83287
3.05000 -9538.47769 -97.98621 2700.71735 1295.18052 2294.47502 150138.31290
3.15000 -9329.74677 -103.29575 1489.04802 987.36706 2159.05032 141818.35302
3.25000 -9134.19845 -79.90335 2255.25841 887.86452 2079.20702 128454.60843
3.35000 -8976.84625 -76.10911 541.44587 916.39922 2433.07134 122210.97026
3.45000 -8811.11727 -32.61718 1020.71652 971.22584 1848.18642 119562.22672
3.55000 -8695.65157 -23.45517 -1372.60986 945.59382 1758.68673 113329.78545
3.65000 -8556.52807 9.56638 -2495.68748 940.60575 1687.94345 110814.31395
3.75000 -8442.04618 8.40407 762.44478 921.14838 1558.27286 93299.04077
3.85000 -8333.76774 10.61156 855.99821 1123.48608 1671.79079 96602.23770
3.95000 -8211.31949 29.44780 179.42402 1175.06432 1470.24487 100918.07394
4.05000 -8087.84373 48.54412 -492.82738 978.05518 1382.67158 91868.07804
4.15000 -8004.37957 61.15626 -2376.32715 973.11808 1310.02954 87988.50931
4.25000 -7901.51511 72.69407 -1437.79343 888.23119 1187.58707 86382.66618
4.35000 -7823.52575 54.71419 366.43589 912.59212 1150.09929 83958.56089
4.45000 -7741.02389 57.21630 2485.76918 915.40536 1043.05863 77374.38960
4.55000 -7686.84247 50.29139 -411.23923 1172.84461 1110.32262 65661.73566
4.65000 -7627.75244 33.89301 1009.77318 934.01206 997.12765 69457.85913
4.75000 -7523.38693 29.97776 360.45389 839.51131 913.12479 68418.75698
4.85000 -7449.46423 24.52554 -110.51417 793.54153 806.47729 69701.21817
4.95000 -7363.51144 25.23816 -995.75966 835.73875 815.26529 65040.72018
5.05000 -7282.82565 16.02597 807.35987 768.49834 924.81907 56905.52496
5.15000 -7208.38342 19.95450 274.37751 741.45387 734.18865 58090.47175
5.25000 -7139.43044 25.13054 -518.47097 770.27081 725.40817 53545.34762
5.35000 -7077.68316 14.66353 -661.90560 686.89358 676.06744 51219.69317
5.45000 -7001.40489 9.43077 -702.38527 625.73997 654.33080 92615.45868
5.55000 -6948.09775 16.73956 -958.14661 636.73877 586.43762 52319.49673
5.65000 -6911.32587 29.03343 228.92720 627.64912 716.14667 46834.83547
5.75000 -6845.80747 5.25795 -590.77027 605.15386 570.46073 42702.78858
5.85000 -6787.88142 2.27910 -375.35714 1023.50049 731.50859 42604.37447
5.95000 -6722.49761 5.41721 27.19424 938.75010 733.28593 41488.47258
6.05000 -6661.95157 9.97355 -370.72936 978.52525 594.03529 42257.36092
6.15000 -6614.17343 9.64710 1055.69073 682.53894 611.56723 38460.55291
6.25000 -6539.19649 3.72820 -204.07337 470.24950 447.95912 36822.64693
6.35000 -6459.30425 -2.67728 466.36556 530.46827 1114.09059 35744.03024
6.45000 -6409.52935 -6.03297 -161.03708 465.82238 509.00971 36739.59110
6.55000 -6360.58227 11.82155 157.06855 395.62739 390.84838 32608.67832
6.65000 -6296.70700 10.83799 42.59573 430.29328 511.47316 32367.80173
6.75000 -6237.14466 12.40180 -91.38555 409.03804 399.81904 30245.29086
6.85000 -6172.82162 9.68314 -519.41088 443.16798 392.62935 31372.53367
6.95000 -6110.81594 16.02416 290.41531 407.19592 330.26677 30612.55569
7.05000 -6038.45808 7.34161 614.18016 534.84538 369.48340 47863.44915
7.15000 -5982.21079 8.70485 596.01791 477.62818 406.73601 25676.22462
7.25000 -5932.34779 4.86884 533.10251 417.19681 395.15409 26787.57200
7.35000 -5855.99888 5.18389 628.54028 376.47078 381.21329 23577.72216
7.45000 -5809.46389 2.38962 377.52569 349.27441 345.72510 51716.22179
7.55000 -5741.65841 11.06342 -80.64375 346.19656 320.94436 27519.09121
7.65000 -5685.41785 5.70447 328.39616 331.93473 297.37158 20324.85353
7.75000 -5613.78646 8.12604 233.69830 469.19890 540.16547 21243.34192
7.85000 -5561.36148 10.46876 92.06031 306.00085 290.40740 22934.56774
7.95000 -5499.38899 8.77981 129.88739 297.39436 264.13898 31491.49265
8.05000 -5448.92953 15.44415 -357.61389 467.93189 694.24933 23095.06767
8.15000 -5376.28826 6.08989 367.35188 295.04327 216.91742 22446.05478
8.25000 -5328.20355 6.04904 242.03423 382.10018 254.07756 18676.05014
8.35000 -5274.61596 8.22366 -210.73915 286.11058 230.40813 18919.32850
8.45000 -5226.48395 11.23468 217.00869 278.69408 226.31820 21232.77784
8.55000 -5163.97503 13.11550 288.08403 278.48583 247.66073 17887.31455
8.65000 -5110.93364 4.43386 -259.96497 257.90939 206.62099 21240.31067
8.75000 -5061.41753 3.81179 71.59891 266.53433 230.64840 17311.77419
8.85000 -5021.54569 13.91051 765.80379 891.86839 746.43308 17005.70917
8.95000 -4970.63520 7.62589 487.07157 359.13082 393.95592 17248.87920
9.05000 -4918.02386 8.47332 24.16648 234.35784 160.99744 16108.94770
9.15000 -4873.05941 6.81607 869.95400 233.16535 172.71494 20930.26075
9.25000 -4830.57884 8.60171 110.39281 240.62093 190.03095 18056.28247
9.35000 -4790.80279 13.31879 336.32984 241.68861 190.49219 14553.74993
9.45000 -4753.68073 8.81314 100.53995 320.48593 173.70744 14209.27596
9.55000 -4719.86200 -4.75244 118.55019 714.78227 975.28724 12685.91878
9.65000 -4679.54751 9.33058 154.76183 212.19327 152.70271 13114.46691
9.75000 -4640.06202 11.62863 58.07714 194.74105 145.26426 12720.86074
9.85000 -4594.37515 5.37029 -92.58620 222.08951 153.33109 13685.01466
9.95000 -4565.08396 11.59887 148.39579 389.53671 205.09477 12983.50946
10.05000 -4527.47793 9.93674 796.99075 199.01800 194.81893 30210.02612
10.15000 -4489.38068 10.11277 220.84013 183.23144 160.30419 11884.05781
10.25000 -4461.92689 9.22665 309.80835 199.73456 177.10577 10860.96567
10.35000 -4425.88712 9.24335 35.99394 177.38615 169.94973 11319.43771
10.45000 -4389.59927 9.53973 313.47395 151.51220 142.74056 19321.31614
10.55000 -4352.07298 8.92212 223.44526 205.98324 153.70802 14340.93910
10.65000 -4321.72920 1.57139 43.04288 207.42247 227.26761 11150.93167
10.75000 -4293.61104 9.99211 552.34450 170.61381 189.35531 10345.07182
10.85000 -4260.33729 10.94880 269.75193 216.92093 1335.29640 10158.27259
10.95000 -4222.69742 9.31689 54.66383 143.95735 162.20767 9276.69988
11.05000 -4193.38988 -0.53783 296.32385 148.84881 565.75479 9797.16303
11.15000 -4161.39194 3.90552 -53.76737 130.40168 143.66678 7868.46248
11.25000 -4129.86497 10.12659 242.77427 128.02563 147.45305 8249.75933
11.35000 -4099.73177 4.58595 11.09947 212.63416 106.05714 9028.19695
11.45000 -4071.88188 14.78050 205.41316 241.45942 288.67337 9055.22228
11.55000 -4036.21656 5.83531 -216.97090 154.97004 118.36037 7611.51739
11.65000 -3994.66732 6.25370 409.66121 139.92156 161.07040 7316.63072
11.75000 -3966.90731 7.38125 -191.14619 166.88884 144.04382 7265.07579
11.85000 -3936.06318 5.12341 31.04959 109.01761 110.32914 6271.48001
11.95000 -3898.79174 6.51284 1.46481 205.30746 153.43438 7849.10358
12.05000 -3875.79623 8.91892 -125.43898 161.06746 124.70190 7090.81036
12.15000 -3840.04411 5.07685 46.02321 368.80829 288.97942 6850.55274
12.25000 -3816.11861 4.67220 -143.41680 94.42322 97.64397 6769.61566
12.35000 -3786.01271 4.02976 65.89495 82.11050 121.02144 6602.50537
12.45000 -3746.46747 7.17373 19.65370 107.96596 103.68322 7112.60530
12.55000 -3719.81900 4.34482 -57.22082 109.48843 114.38075 5377.47177
12.65000 -3692.57614 -1.00957 187.37433 126.89454 356.82794 6144.84147
12.75000 -3659.96665 4.10461 -57.76657 197.01804 149.59563 5680.44411
12.85000 -3628.55111 0.90059 23.54612 207.19729 168.60764 5735.19198
12.95000 -3599.41728 2.19534 -18.71922 114.39773 141.43775 5463.58916
13.05000 -3575.44216 4.18039 44.16125 115.77775 105.14559 4538.76751
13.15000 -3541.06056 7.58132 65.18402 102.96815 101.28041 4890.74948
13.25000 -3518.18675 3.43124 14.15816 119.57070 94.73917 4757.80487
13.35000 -3497.29828 4.79895 -21.38043 196.60732 96.71548 4464.56023
13.45000 -3464.71427 1.81414 150.40658 83.20269 113.80157 4748.39191
13.55000 -3442.79877 6.73489 -276.74624 77.95972 102.10305 4036.35540
13.65000 -3414.28177 4.33097 -115.69520 77.55119 80.78731 4833.53549
13.75000 -3391.80404 3.92446 -111.92793 92.13163 86.54663 4135.76344
13.85000 -3362.92478 2.83140 -31.73730 371.10469 72.76838 4818.10004
13.95000 -3346.32262 2.04372 -105.16485 183.83291 141.63440 5337.56048
14.05000 -3312.70344 6.62287 218.31411 94.11706 90.95774 4216.66203
14.15000 -3283.61551 8.26011 8.09742 225.11549 89.40834 3397.29408
14.25000 -3262.09260 14.85901 168.70335 142.15889 166.87189 3779.34148
14.35000 -3243.01277 6.42048 -114.63479 75.99662 110.79705 3843.15754
14.45000 -3207.04819 -1.95350 188.93756 360.54769 270.83979 3821.89713
14.55000 -3196.20181 6.67921 -167.12760 80.27035 65.59614 3683.99905
14.65000 -3167.39426 7.81577 111.84916 61.41124 112.13550 3261.43882
14.75000 -3147.84280 1.71663 144.14284 57.33613 69.01309 3350.28599
14.85000 -3122.64206 9.25799 -143.12746 148.51418 72.79236 2980.48628
14.95000 -3101.32814 2.67347 -29.87768 63.10205 47.81655 3381.33420
15.05000 -3083.25085 3.91968 -88.01191 73.37619 77.06259 3791.06132
15.15000 -3059.08836 1.39890 22.52492 68.54171 60.39562 3888.90794
15.25000 -3033.11645 3.05592 -142.23908 65.88688 58.47625 3344.35195
15.35000 -3058.35233 46.20481 -38.70187 1130.54471 1362.92750 3728.29493
15.45000 -2990.43460 4.53237 -37.73910 58.37314 118.40300 3353.65876
15.55000 -2976.87489 6.21442 2.23047 106.20879 59.16833 3320.00402
15.65000 -2947.26807 -0.46820 10.49737 95.21966 80.95671 2598.43676
15.75000 -2931.24938 2.34706 -110.01006 50.52220 64.11309 2708.51393
15.85000 -2908.89527 2.70390 -306.45516 77.66998 89.72932 3850.97593
15.95000 -2893.00778 5.24102 -0.93529 144.90781 151.55941 3298.32592
16.05000 -2878.71658 0.28527 -90.36391 86.37675 56.08362 2976.38844
16.15000 -2854.61918 4.28673 -143.51662 54.72214 56.12949 2965.66377
16.25000 -2836.49937 3.59985 -120.13367 105.99286 86.77146 2675.27181
16.35000 -2813.46969 1.88638 -153.24425 96.31517 82.96597 2902.55988
16.45000 -2796.34507 2.70295 41.27110 69.67608 59.27356 4121.45858
16.55000 -2779.15158 2.58370 -66.10382 106.77531 85.50695 2082.39431
16.65000 -2758.94584 1.32527 58.15134 275.64952 62.95548 2191.51742
16.75000 -2738.22583 0.80269 -93.86637 74.06658 78.44002 2521.95818
16.85000 -2723.46834 5.97336 80.60174 46.48669 61.13107 2409.91807
16.95000 -2701.76266 7.06492 -4.53062 72.06521 76.76568 2516.04667
17.05000 -2692.10709 1.44650 -37.10915 62.50688 70.14240 2049.14303
17.15000 -2672.64097 4.15178 105.53809 47.28364 46.69196 2156.64892
17.25000 -2657.00341 0.47929 -232.51919 47.54926 48.29151 2750.35715
17.35000 -2641.78010 1.89649 50.76871 79.72427 39.11973 2666.70437
17.45000 -2627.55567 -0.52979 10.78406 80.74866 84.23321 1777.43124
17.55000 -2605.55091 0.56790 -46.23220 54.71684 38.56813 1649.02935
17.65000 -2589.86114 4.84300 155.26509 54.27333 54.52898 2655.67204
17.75000 -2564.29034 7.06617 18.91615 120.73145 95.82856 1317.35328
17.85000 -2562.47249 5.66106 18.16211 38.93613 50.95594 1617.77487
17.95000 -2541.39088 4.65746 38.75758 50.50335 53.40362 1808.75637
18.05000 -2529.64779 2.02493 11.48171 42.48405 53.85521 2295.56771
18.15000 -2516.43081 -0.65572 0.27741 86.37871 91.68674 1925.15867
18.25000 -2491.03737 0.66239 55.87757 235.63576 122.13136 1775.93247
18.35000 -2482.73485 3.43016 58.27267 45.55916 42.00177 1328.72978
18.45000 -2466.58535 5.32365 33.64809 34.59968 30.71607 1549.32453
18.55000 -2447.31460 3.75991 -186.22219 47.62928 47.56027 1422.62608
18.65000 -2438.28196 6.11122 160.01593 70.69941 183.97436 1281.48750
18.75000 -2422.06351 3.97063 11.11628 53.84286 190.06426 1156.47696
18.85000 -2407.03197 11.69088 -72.86568 38.27064 125.76189 1027.77118
18.95000 -2388.63842 -8.40244 129.08133 109.19796 174.01791 1289.09611
19.05000 -2376.15464 3.34668 25.00819 59.46603 43.92426 1274.41944
19.15000 -2364.67031 -0.35536 17.58220 41.04023 35.60835 1300.25452
19.25000 -2351.00016 7.05163 -91.04262 72.12217 86.24046 1944.12781
19.35000 -2339.36241 -0.49307 17.16581 53.07816 36.19416 1040.64507
19.45000 -2323.69345 2.12370 -92.50442 47.17219 33.59093 1235.39577
19.55000 -2311.05557 6.76195 -7.43311 66.76788 51.02831 1332.37105
19.65000 -2288.63364 -4.46390 40.49869 182.92533 218.33729 887.25925
19.75000 -2288.11959 -0.28982 115.21540 58.04604 83.48833 1292.98662
19.85000 -2266.90615 6.37653 136.27535 77.15807 51.63932 1522.80376
19.95000 -2255.29403 3.35779 43.98382 42.63421 36.60883 731.75521
