0.05000 -1601.83565 68.86545 -332.60683 1352.62961 1114.13021 2127.07335
0.15000 -2837.91224 85.76777 -75.20901 1241.88699 1088.87421 3649.55845
0.25000 -3836.02782 96.93994 123.39955 1388.95188 1013.33061 5082.53869
0.35000 -4700.14279 96.81359 -89.32396 1465.05819 935.79261 6084.96935
0.45000 -5271.55102 92.04004 21.63032 1586.74976 933.19995 6875.48046
0.55000 -5679.69894 121.61805 -34.48553 1568.93333 920.74619 7286.63832
0.65000 -5991.14650 138.73429 -263.89531 1617.30150 918.12046 7495.48159
0.75000 -6278.23035 94.74396 -226.13630 1622.16518 894.26008 7582.96853
0.85000 -6608.67733 122.77212 -97.23643 1625.49125 906.55659 7461.48020
0.95000 -6839.81344 91.34031 -176.08193 1616.35416 901.23160 7345.60488
1.05000 -7047.27816 101.29565 -114.92186 1591.55890 944.89973 7205.10174
1.15000 -7235.48102 97.89393 -54.56346 1551.39084 977.01726 7067.00385
1.25000 -7391.59128 78.76566 -72.22045 1473.77091 1000.17213 6845.20064
1.35000 -7509.93853 90.38784 -86.90219 1413.89366 1001.42021 6720.64321
1.45000 -7646.85541 74.02648 -2.50152 1339.46348 1021.28530 6429.49978
1.55000 -7746.63417 86.07372 18.55063 1234.89834 1018.00768 6165.65886
1.65000 -7778.21845 80.57957 -29.24528 1206.84898 998.91236 5993.79342
1.75000 -7841.20120 64.67216 -2.94156 1098.10768 1009.39801 5751.83806
1.85000 -7873.35882 73.98694 101.30272 1045.52934 985.86313 5610.03742
1.95000 -7919.32896 64.16355 -57.83340 944.49859 978.81128 5379.85887
2.05000 -7915.12551 56.81594 -17.56903 904.71451 951.50969 5206.10101
2.15000 -7921.61776 53.39483 52.98609 842.82325 925.21326 5046.10907
2.25000 -7946.00525 37.87026 49.53514 797.86364 899.68307 4841.42646
2.35000 -7950.38189 35.92084 -12.75372 755.68086 866.74463 4741.19663
2.45000 -7960.48192 70.29445 -52.17121 709.27371 841.77618 4554.72870
2.55000 -7953.99591 55.57255 73.86632 742.41177 813.49580 4436.55047
2.65000 -7958.85694 41.72015 44.60188 684.56763 773.38458 4337.21564
2.75000 -7959.48144 47.07774 83.84649 690.47862 747.79912 4147.18783
2.85000 -7944.63721 63.50532 56.21718 697.57634 706.52303 4019.28735
2.95000 -7923.98266 61.45940 -37.50696 670.20710 665.29092 3914.03625
3.05000 -7890.36392 63.84762 35.47443 687.20943 627.40970 3811.95583
3.15000 -7840.27862 74.80845 39.79848 658.92977 599.96795 3687.35978
3.25000 -7813.17561 66.54457 28.37391 617.41236 565.74828 3533.16197
3.35000 -7770.79173 74.80884 -16.82616 601.60463 531.73583 3424.48939
3.45000 -7726.68035 78.11499 43.64616 587.74299 498.08973 3327.30133
3.55000 -7670.62185 75.87263 48.60218 591.93947 473.15629 3212.84094
3.65000 -7620.31386 84.19108 49.64756 577.21915 435.25801 3108.55716
3.75000 -7585.27206 90.16926 6.84666 548.11855 410.21200 2985.32438
3.85000 -7527.75890 81.41541 4.16739 531.28029 385.48387 2913.69421
3.95000 -7473.24533 85.36487 2.44473 488.00132 357.89430 2832.21033
4.05000 -7429.70736 79.59887 34.39469 467.97984 335.83654 2736.59186
4.15000 -7383.44416 69.32968 11.26055 454.29223 316.62941 2666.96507
4.25000 -7340.24529 74.08630 -15.58894 441.30772 300.13675 2577.24205
4.35000 -7272.62611 65.07922 -13.56935 431.19779 279.94871 2536.16689
4.45000 -7213.02377 64.15310 33.87121 414.81860 264.68032 2463.99301
4.55000 -7159.91002 55.85854 -49.28462 397.84728 249.12925 2403.36257
4.65000 -7121.38289 56.65829 14.45114 401.02522 233.99529 2280.68216
4.75000 -7068.48258 55.87672 -49.14037 378.16273 220.79942 2227.48881
4.85000 -7025.29679 52.54689 13.63869 364.85813 209.67524 2153.21298
4.95000 -6977.32045 51.13354 -30.86697 361.81438 195.13744 2106.48697
5.05000 -6929.41029 49.77683 2.71095 352.82934 188.23937 2015.68054
5.15000 -6875.24354 50.61574 14.70321 334.10833 178.27970 1960.67614
5.25000 -6818.10857 46.63548 -17.47938 325.07674 166.23340 1914.81067
5.35000 -6765.98206 48.88792 14.91861 309.73606 156.55571 1856.31701
5.45000 -6718.29446 46.30592 2.31151 301.64748 149.27569 1790.49354
5.55000 -6647.51887 45.58754 17.71682 303.69439 143.44968 1750.25548
5.65000 -6587.26077 47.70791 -9.86278 283.33402 135.45057 1695.51943
5.75000 -6525.23085 41.42701 -8.78629 264.08073 129.46854 1633.14529
5.85000 -6460.73109 40.73582 -0.73213 242.03854 123.09656 1594.23388
5.95000 -6396.70323 41.73894 25.00348 236.60139 119.13660 1541.85691
6.05000 -6332.51779 40.57926 -21.54754 241.48637 113.58329 1505.30407
6.15000 -6267.90876 38.04493 -28.05080 242.69016 109.94197 1476.90220
6.25000 -6205.56509 41.20085 10.22407 215.78584 106.28896 1412.29276
6.35000 -6145.10970 38.95577 10.82410 206.56420 103.44220 1378.36046
6.45000 -6083.91400 36.07261 -0.48142 194.97649 99.29069 1340.23543
6.55000 -6029.18714 35.92805 -11.08848 195.53488 95.84766 1293.00778
6.65000 -5969.54645 34.05571 7.67515 191.00134 93.15657 1256.44221
6.75000 -5908.05805 33.25161 -21.68824 186.03763 89.93710 1221.56404
6.85000 -5848.77679 33.51879 3.97388 179.38223 87.62542 1198.73723
6.95000 -5791.15672 33.52436 53.73271 173.90366 84.89314 1153.63606
7.05000 -5736.03275 31.03390 22.65407 161.17504 82.30629 1118.21188
7.15000 -5684.75305 31.95508 26.28302 165.92151 79.48954 1088.16267
7.25000 -5622.34518 31.79924 -3.33455 159.82189 76.11866 1058.16597
7.35000 -5555.16987 31.17638 15.31598 160.53357 75.65424 1039.06336
7.45000 -5500.74435 28.76215 53.31031 168.30490 74.65669 1000.40630
7.55000 -5443.95353 29.45348 8.24625 149.41923 71.63773 981.45535
7.65000 -5397.69739 28.34958 17.90217 141.31034 68.06436 947.39873
7.75000 -5344.22940 26.25083 9.47767 137.75614 67.52277 923.75387
7.85000 -5285.61165 28.48135 21.43645 130.69402 65.07230 907.91525
7.95000 -5233.04142 24.95665 30.49923 143.81582 65.58433 873.72615
8.05000 -5177.57518 22.74303 17.06721 123.78892 64.44946 871.11370
8.15000 -5129.14049 26.41465 4.77965 128.51239 63.07696 838.93637
8.25000 -5082.71925 24.81220 17.75305 115.22510 61.44617 818.94092
8.35000 -5042.61248 24.64580 -4.77303 103.72807 61.65236 784.72733
8.45000 -5002.04389 23.92401 -21.33577 121.44748 60.45652 767.92009
8.55000 -4960.23265 23.21590 26.63840 115.11079 59.78836 750.67123
8.65000 -4918.36095 22.10308 -14.86829 109.00307 57.56713 737.37478
8.75000 -4872.33413 23.77509 27.64029 106.90453 55.99827 714.06260
8.85000 -4826.52873 20.96146 3.87590 121.21664 55.06423 700.08455
8.95000 -4785.64731 21.71355 8.00248 104.09774 53.56132 677.61078
9.05000 -4742.22314 19.18322 9.46284 103.01187 53.38425 668.68458
9.15000 -4699.18604 20.38847 10.93716 100.71238 49.98312 651.46820
9.25000 -4659.70312 19.73581 -5.87232 96.35737 48.42521 614.80054
9.35000 -4615.87621 18.58558 3.73347 110.35211 47.13353 610.85488
9.45000 -4574.03230 19.73623 9.98106 89.88760 46.72931 598.26632
9.55000 -4529.44981 18.78032 -11.06732 89.35697 46.53388 588.59640
9.65000 -4488.14448 18.84360 -1.77098 86.09691 44.82155 578.89310
9.75000 -4442.68297 17.83485 -6.83209 82.54558 43.32064 549.86015
9.85000 -4398.84375 15.75874 -8.36574 77.38444 43.70316 537.53348
9.95000 -4357.12971 17.50763 -12.08040 77.94833 43.46520 535.47444
10.05000 -4317.29871 16.62797 -26.50143 74.02954 42.57207 518.26046
10.15000 -4279.55983 16.33090 -28.67990 71.22482 43.18540 506.42468
10.25000 -4240.18937 15.06987 5.14057 68.46739 44.48790 486.10138
10.35000 -4203.49780 14.94728 -14.68857 66.66231 43.11947 474.19016
10.45000 -4167.81024 15.71126 -19.97977 68.78860 43.17382 475.93998
10.55000 -4137.21751 16.39812 -19.86484 60.89187 44.09164 457.67481
10.65000 -4105.88288 13.98910 -22.63631 62.54870 42.50576 446.66206
10.75000 -4073.81598 15.04840 -0.01027 60.60817 41.65041 432.42471
10.85000 -4039.75948 12.60426 -2.68226 60.03257 41.01694 426.37576
10.95000 -4006.84451 13.76518 8.25504 58.99629 40.09980 416.53667
11.05000 -3977.09652 14.18376 3.22906 58.64126 39.86586 408.89974
11.15000 -3945.39682 13.16670 11.96343 54.44213 38.83685 393.76704
11.25000 -3913.00601 13.98104 2.26856 55.27863 38.28829 394.10678
11.35000 -3880.91504 14.34031 20.16348 54.75904 37.54964 388.34698
11.45000 -3850.01568 13.25497 13.10337 49.49188 37.61906 364.09409
11.55000 -3817.40902 12.86609 9.06455 51.22721 37.82079 361.29873
11.65000 -3783.97596 13.08739 21.29533 53.52695 36.59444 357.91065
11.75000 -3753.98511 13.19822 -6.22310 51.36237 36.98781 347.24916
11.85000 -3724.29637 13.63118 3.23135 50.32480 37.60916 342.43479
11.95000 -3697.08385 12.58914 3.71689 47.22504 35.73367 324.79625
12.05000 -3668.33234 12.22000 -4.26385 47.30485 35.03032 315.10557
12.15000 -3639.46906 13.19956 4.32250 47.74358 33.03184 306.52238
12.25000 -3610.73492 10.85744 -18.29801 44.54790 33.59095 303.08835
12.35000 -3582.97496 12.38010 -10.83531 49.14400 33.88949 301.90935
12.45000 -3555.83083 11.08629 -8.81277 42.37932 33.51826 288.63928
12.55000 -3532.27980 12.17620 -5.36718 44.03018 32.53796 278.86787
12.65000 -3499.68136 11.36361 -6.28942 42.52535 32.69692 280.77766
12.75000 -3470.59032 11.11177 5.97547 41.13737 32.48463 271.58226
12.85000 -3442.16512 10.81796 -9.47596 42.19389 32.06987 267.50283
12.95000 -3412.03762 11.28429 -9.63073 41.04257 31.01338 265.82832
13.05000 -3386.99180 11.14520 -0.57989 40.22334 31.44092 256.94096
13.15000 -3359.72384 11.99255 15.60925 37.89745 32.73587 254.83932
13.25000 -3332.94671 10.42625 1.36721 38.29028 30.38668 246.32506
13.35000 -3307.93658 9.27667 22.06196 37.07009 31.59636 237.83250
13.45000 -3281.52375 11.03302 13.32831 35.25823 30.34747 233.33776
13.55000 -3255.80435 9.78885 8.26175 33.09376 29.84186 223.96046
13.65000 -3232.82098 10.72458 21.10401 32.92663 31.91175 217.57273
13.75000 -3208.86363 10.47147 19.21201 34.18892 31.05814 215.61009
13.85000 -3186.01426 10.30273 16.14085 34.50052 32.20216 218.52046
13.95000 -3163.79278 8.77901 30.20207 33.19984 31.07282 208.47141
14.05000 -3143.60049 12.38604 22.56393 33.96529 31.72047 202.36135
14.15000 -3121.77926 8.94403 23.99670 32.12863 29.42672 196.50710
14.25000 -3102.77727 9.30051 28.06893 32.22746 30.56378 195.31554
14.35000 -3080.85147 9.11699 11.77922 33.94326 28.71821 192.09883
14.45000 -3057.79446 8.64644 23.93709 35.09392 27.92298 190.58373
14.55000 -3034.92828 8.20471 20.95283 33.46125 30.06674 186.84574
14.65000 -3013.16582 7.52371 21.33618 32.86123 27.93875 185.90123
14.75000 -2988.17691 6.94974 36.36588 32.57899 29.89728 184.15673
14.85000 -2973.05556 8.44887 25.89783 29.04700 29.12585 175.16849
14.95000 -2948.75404 8.02241 24.00322 30.53256 27.56968 170.78017
15.05000 -2928.54013 6.68855 24.20611 31.73752 29.08664 176.94537
15.15000 -2909.08489 7.70380 18.92795 32.24038 30.36732 173.25204
15.25000 -2883.84256 7.35189 18.40951 31.01164 27.75585 164.00768
15.35000 -2862.77106 8.19095 8.43268 29.54330 29.76835 162.58004
15.45000 -2843.16792 7.29535 6.61470 28.05748 26.28517 156.01332
15.55000 -2822.52957 7.48904 16.90415 27.87059 27.83623 159.54528
15.65000 -2803.11260 9.07059 10.51745 28.32676 25.83759 158.15585
15.75000 -2786.15856 5.72588 11.02522 28.25403 24.98187 148.65613
15.85000 -2765.29704 6.24316 7.29826 28.18240 26.97185 143.70481
15.95000 -2746.59464 8.65315 8.65442 27.12149 27.65410 151.99642
16.05000 -2732.80897 9.32361 8.24839 27.10510 27.10341 137.51118
16.15000 -2713.28724 6.73230 13.50566 27.16159 26.04216 134.59481
16.25000 -2695.86654 6.17062 16.21595 24.64595 26.89403 139.57031
16.35000 -2680.26922 7.41531 9.55994 24.86378 25.10392 128.45332
16.45000 -2663.59696 6.30010 3.88335 24.50875 27.89702 126.36809
16.55000 -2648.49972 5.57620 13.81458 24.74918 26.01996 127.33041
16.65000 -2631.28107 5.12104 23.57838 23.84439 26.91441 126.65321
16.75000 -2614.79925 6.35845 15.85802 22.93649 24.33411 124.66356
16.85000 -2597.77247 5.76220 13.77827 23.26952 22.25323 116.09151
16.95000 -2579.08991 5.42672 30.81984 24.37009 24.32731 113.84901
17.05000 -2561.59958 5.50322 33.12517 24.80378 24.73624 116.03027
17.15000 -2547.44211 5.97587 20.88654 24.07462 24.09576 115.75296
17.25000 -2533.18572 6.16015 19.45758 25.77286 24.23637 118.54906
17.35000 -2517.43278 5.28726 22.99256 25.32363 23.09732 107.18025
17.45000 -2501.06699 5.19318 25.59030 23.85867 24.20082 114.35551
17.55000 -2487.27306 6.52404 23.38144 21.70997 24.13959 107.15640
17.65000 -2472.98155 5.11032 24.00435 22.72031 23.24958 101.60605
17.75000 -2457.61008 6.77675 15.29115 22.61391 22.93130 106.43374
17.85000 -2442.11111 6.87964 21.80434 22.95298 25.16326 105.48802
17.95000 -2426.19220 3.74106 33.81120 24.79366 22.98500 103.24971
18.05000 -2411.51920 7.58074 20.16869 24.58680 25.13472 95.91853
18.15000 -2396.91239 8.92239 31.94557 20.94655 23.33736 96.71277
18.25000 -2384.07751 6.45354 22.35347 23.17892 24.38642 94.76734
18.35000 -2372.57250 4.92127 28.88944 23.67719 19.68636 94.23810
18.45000 -2359.36749 4.18681 27.63441 24.54242 22.95978 83.95148
18.55000 -2344.45527 6.00038 24.72667 23.48771 21.91914 92.07653
18.65000 -2332.56872 4.41547 30.67330 24.34079 20.99964 87.02985
18.75000 -2320.04495 6.05680 45.79061 24.08142 23.71980 86.22890
18.85000 -2305.73391 6.32105 36.76214 23.98912 21.02729 86.28722
18.95000 -2290.42892 2.44936 43.47622 24.92114 23.93192 83.17552
19.05000 -2274.55667 6.76672 34.08436 20.96264 24.30642 94.48614
19.15000 -2266.46579 2.96678 38.57639 22.99031 21.44406 81.31467
19.25000 -2254.45856 5.82962 30.96465 19.62177 24.24920 75.24947
19.35000 -2241.09806 4.98723 32.78599 17.95897 21.52357 81.42681
19.45000 -2227.25718 2.97696 43.86055 22.40121 21.25135 78.58522
19.55000 -2212.89301 8.00948 35.80934 17.38917 20.18679 75.50273
19.65000 -2204.17006 8.09233 32.45493 23.17217 21.74530 74.52022
19.75000 -2191.75078 3.41826 34.52216 18.89731 20.80878 77.14077
19.85000 -2179.13850 4.98412 32.54490 18.80076 20.20450 70.77052
19.95000 -2166.50649 5.05718 22.57671 20.14808 21.99967 77.28710
