0.120000 -2.511070
0.380000 -2.845850
0.620000 2.835700
0.880000 2.646380
1.120000 2.802470
1.380000 2.887920
1.620000 2.774740
1.880000 2.674250
2.120000 2.788240
2.380000 2.851170
2.620000 2.795420
2.880000 2.933880
3.120000 2.921220
3.380000 3.106580
3.620000 3.029950
3.880000 3.009560
4.120000 2.964240
4.380000 2.649260
4.620000 2.543370
4.880000 2.817340
5.120000 2.543540
5.380000 2.654370
5.620000 2.694400
5.880000 1.904090
6.120000 1.894210
6.380000 1.457780
6.620000 1.404840
6.880000 2.401640
7.120000 2.472340
7.380000 2.731810
7.620000 2.930260
7.880000 2.715750
8.120000 2.122460
8.380000 2.155290
8.620000 2.116750
8.880000 1.970750
9.120000 1.297040
9.380000 1.456920
9.620000 0.272320
9.880000 0.725850
10.120000 0.569650
10.380000 0.247470
10.620000 0.091270
10.880000 -0.378770
11.120000 -0.483230
11.380000 -0.640700
11.620000 -0.737570
11.880000 -1.265420
12.120000 -1.233180
12.380000 -2.269910
12.620000 -2.232800
12.880000 -1.906190
13.120000 -1.251870
13.380000 -3.140030
13.620000 1.671060
13.880000 2.036530
14.120000 -1.227280
14.380000 -0.258690
14.620000 -1.115620
14.880000 -0.866820
