0.120000 -2.978750
0.380000 -3.062250
0.620000 2.496450
0.880000 2.405730
1.120000 2.471430
1.380000 2.858850
1.620000 2.867970
1.880000 2.786850
2.120000 2.891810
2.380000 2.801370
2.620000 2.777640
2.880000 2.819390
3.120000 2.844600
3.380000 2.896250
3.620000 2.871160
3.880000 2.930780
4.120000 2.881460
4.380000 2.865740
4.620000 2.916640
4.880000 2.904880
5.120000 2.999690
5.380000 3.000010
5.620000 3.139890
5.880000 3.131740
6.120000 2.872700
6.380000 -3.105940
6.620000 2.792910
6.880000 2.828750
7.120000 2.784920
7.380000 2.449180
7.620000 2.982020
7.880000 2.482330
8.120000 2.448070
8.380000 2.256880
8.620000 2.335070
8.880000 2.360530
9.120000 2.230200
9.380000 1.969170
9.620000 1.622190
9.880000 1.686800
10.120000 1.486860
10.380000 1.301350
10.620000 1.360630
10.880000 1.198930
11.120000 1.327020
11.380000 1.090520
11.620000 0.705050
11.880000 0.899690
12.120000 0.091730
12.380000 0.091260
12.620000 -0.436520
12.880000 -0.202990
13.120000 -0.292810
13.380000 -0.831260
13.620000 -0.786620
13.880000 -0.306320
14.120000 -1.214870
14.380000 0.013740
14.620000 -1.890310
14.880000 0.270730
