0.05000 670.06327 737.80380 4068.17090 842.90195 1149.94074 349.14856
0.15000 -491.06460 625.75195 4325.90817 1282.93848 1423.52658 440.57986
0.25000 -928.41530 -106.00412 4267.27190 1264.80656 1441.04646 513.71566
0.35000 -1066.63547 108.76200 4242.11000 1375.85919 1424.53997 336.17190
0.45000 -813.31362 -285.53624 4276.85905 1441.48064 1435.16086 414.94885
0.55000 -983.21678 144.17266 4267.32103 1548.14536 1614.93154 932.79540
0.65000 -1203.13094 -5.29954 4212.54813 1580.79817 1762.63983 649.17770
0.75000 -1409.34271 -66.58302 4130.14008 1517.85574 1608.33461 686.40981
0.85000 -1603.21752 212.21186 3978.76277 1570.53037 1767.86116 902.55024
0.95000 -1856.77936 -84.66925 3875.53216 1472.71956 1711.36287 863.34135
1.05000 -1835.15207 -16.21765 3732.77010 1822.83660 1779.14656 930.44597
1.15000 -2201.70501 52.91385 3453.17486 2285.69112 1864.12152 1018.60281
1.25000 -2383.10186 83.76887 3262.25533 1606.11228 1860.33227 1151.40606
1.35000 -2386.54412 -111.56821 3073.46549 1631.54068 2015.50816 1214.32017
1.45000 -2646.56155 -41.87175 2705.18947 1612.98635 2066.12026 1523.80479
1.55000 -2869.34731 5.81380 2450.58205 1647.66744 2366.02525 2019.68703
1.65000 -2976.16744 -42.49072 2043.21369 1708.12076 1957.38377 1773.69657
1.75000 -3138.36053 -50.62742 1805.12564 1638.70252 1857.23445 1910.50589
1.85000 -3305.18407 14.59347 1544.29131 1609.01638 1882.92445 2096.43235
1.95000 -3326.41432 -34.01008 1433.32056 1517.21426 1617.33535 2188.66051
2.05000 -3383.49728 -2.50907 1191.35643 1508.41542 1561.34077 2362.59740
2.15000 -3491.67382 75.41223 1099.91174 1356.17039 1510.52699 2444.97577
2.25000 -3539.09275 42.44627 818.07834 1395.81317 1410.90388 2528.14690
2.35000 -3530.75900 42.76206 853.70489 18309.44769 14667.56183 2646.20613
2.45000 -3570.70578 -29.81967 736.58576 1333.74597 1212.66730 2585.03783
2.55000 -3565.84907 -12.32057 670.13679 1627.62317 1727.86875 2577.21860
2.65000 -3564.05242 -4.49858 573.99896 1483.06691 1191.15270 2661.54308
2.75000 -3601.50353 -15.03806 696.13085 1329.41918 1144.56748 2603.37764
2.85000 -3624.51595 35.67418 426.59507 1247.68591 988.74890 2571.82976
2.95000 -3573.69900 -27.37993 455.86579 1209.38806 970.96591 2616.40931
3.05000 -3528.00821 15.54524 398.88785 1342.02819 1048.52815 2717.49770
3.15000 -3514.74912 -3.71169 494.61013 1253.04619 885.50886 2621.98772
3.25000 -3523.32992 -1.49532 250.87410 1341.74708 879.97333 2662.55797
3.35000 -3546.90713 -27.99208 326.16949 1115.04976 845.66005 2601.75846
3.45000 -3500.66382 -22.61155 281.53013 1703.72015 872.29552 2656.82553
3.55000 -3443.44427 -5.44642 272.31446 1194.21808 764.68463 2645.70905
3.65000 -3501.70069 -35.26455 365.17433 1067.98709 716.41261 2484.03857
3.75000 -3446.93941 15.39060 287.39700 1136.67952 689.22725 2476.28295
3.85000 -3452.23983 -16.51732 216.29606 1072.82699 697.41027 2471.97533
3.95000 -3397.98113 20.66534 310.75645 2570.21778 2098.37377 2932.70559
4.05000 -3399.36110 -8.30188 172.43862 1081.96299 782.95797 2474.69434
4.15000 -3338.26579 6.98676 219.65103 1083.04391 581.41830 2498.99855
4.25000 -3323.43111 17.55305 321.75746 1064.40382 603.09656 2462.82162
4.35000 -3313.02423 13.24426 134.50208 1048.23737 551.63012 2467.91452
4.45000 -3316.57099 11.52853 38.45648 1031.67900 593.09726 2443.86502
4.55000 -3246.27377 25.91822 48.96436 2475.25246 1152.02475 2491.65568
4.65000 -3315.71901 -19.24395 153.98784 2465.88043 1140.45052 2550.39065
4.75000 -3203.71271 -7.75697 170.84148 7963.94179 3615.39796 7509.61338
4.85000 -3240.01991 8.41657 145.59934 1033.66289 643.32131 2391.32739
4.95000 -3222.19385 9.81445 77.84423 955.01265 454.77858 2337.61704
5.05000 -3197.82210 -4.98698 122.44185 974.15424 493.67627 2330.23436
5.15000 -3180.27617 0.90668 193.77832 953.93758 421.66812 2305.93652
5.25000 -3149.87860 -18.83673 126.83594 1003.79831 460.58698 2323.14590
5.35000 -3168.49220 2.21547 97.17816 941.70672 428.56140 2259.61744
5.45000 -3117.01998 1.23117 -6.89463 945.26930 440.69333 2287.16236
5.55000 -3075.34553 -7.30534 78.55582 1030.61008 415.24802 2278.20978
5.65000 -3088.66835 11.20152 -43.49032 919.19456 403.94401 2276.62463
5.75000 -3039.49720 -8.77346 10.22324 975.21240 410.97131 2307.44405
5.85000 -3004.70979 -5.85282 74.68246 932.00402 364.01717 2270.81115
5.95000 -3014.16692 9.04588 107.63777 923.49476 380.18877 2191.63264
6.05000 -3040.96024 -11.94669 -0.22930 877.65484 399.15701 2165.86603
6.15000 -2974.28740 -0.10814 1.90005 890.56118 397.18712 2225.37691
6.25000 -2987.46165 5.03053 56.45927 909.89242 428.27725 2178.04950
6.35000 -2948.61684 -6.72656 123.98873 877.47148 307.53842 2134.82177
6.45000 -2951.88783 9.59282 13.68166 876.98554 343.93786 2136.80851
6.55000 -2888.81973 8.88120 26.60193 887.07538 362.15834 2158.90218
6.65000 -2893.05567 -5.83706 92.56777 892.05856 363.23373 2120.87182
6.75000 -2883.83412 0.15070 -4.12174 877.64595 309.19231 2107.20780
6.85000 -2871.13577 4.43131 30.93069 868.54925 300.59813 2087.18367
6.95000 -2835.12049 -7.91994 -36.45091 855.38644 283.72492 2110.45521
7.05000 -2823.88914 0.63166 19.22668 850.38572 271.48682 2078.55018
7.15000 -2833.83980 1.72233 -12.35397 813.32056 271.59045 2042.20154
7.25000 -2796.10168 2.73908 -20.02007 892.63715 1581.02335 2045.10742
7.35000 -2790.68268 -0.78324 -2.42385 828.13272 301.27536 2031.69894
7.45000 -2774.69120 -1.80514 -11.48833 833.27261 265.97750 2015.06631
7.55000 -2734.85983 -2.14084 16.97519 829.65157 248.89659 2026.48981
7.65000 -2729.00738 7.52916 -17.30547 869.71128 261.97859 2000.97607
7.75000 -2731.34684 -7.80359 -86.50493 789.85387 249.81152 1982.57594
7.85000 -2708.39225 0.59994 -88.65342 803.59395 245.39793 1976.84603
7.95000 -2702.18321 7.22922 17.52846 793.79795 334.28647 1939.50655
8.05000 -2669.30372 2.42742 -72.17103 798.60205 231.47888 1962.77564
8.15000 -2660.61663 3.29922 -28.16369 789.10936 285.83081 1948.41919
8.25000 -2621.75992 0.72363 -51.99942 810.38783 547.26912 1985.79789
8.35000 -2654.91798 0.76944 -43.82203 755.37030 222.59834 1901.40431
8.45000 -2589.23533 -8.42741 -31.54892 778.44906 224.69593 1942.87872
8.55000 -2565.23955 -2.36552 -67.28198 797.24745 239.13470 1936.01173
8.65000 -2584.46191 2.30304 -3.30761 761.57117 222.79271 1883.41166
8.75000 -2566.48468 -3.79951 -88.17733 749.75076 202.79401 1883.90616
8.85000 -2550.22168 4.20017 -9.08831 765.72008 231.99090 1870.61367
8.95000 -2546.17923 3.01557 -88.02321 744.32106 209.12673 1853.97325
9.05000 -2523.52503 1.27890 -64.08079 742.21962 203.67609 1856.08970
9.15000 -2505.64139 0.82404 -79.65565 734.85636 219.46070 1852.29272
9.25000 -2489.02517 -5.13539 -64.55420 728.69384 201.26446 1840.71488
9.35000 -2474.16956 2.81810 -56.67940 722.61618 201.34248 1831.66295
9.45000 -2482.49515 -1.02746 -102.98042 722.91935 182.30939 1804.40597
9.55000 -2458.99297 2.50943 -37.56596 721.34266 191.76544 1788.15495
9.65000 -2430.46201 -0.78872 -83.25682 720.84773 204.52973 1804.78893
9.75000 -2405.73618 3.36329 -60.24763 746.43986 356.50388 1837.71168
9.85000 -2391.09155 -0.56316 -125.34051 731.28607 280.54867 1838.91253
9.95000 -2402.32855 5.57971 -38.69710 695.38515 180.01618 1759.08016
10.05000 -2402.07576 0.08586 -130.37598 694.48935 167.47231 1735.64821
10.15000 -2371.06808 0.09718 -84.36722 688.01660 187.91315 1745.00350
10.25000 -2362.63455 0.17109 -112.77185 698.35659 185.87934 1729.09161
10.35000 -2330.44029 -2.93737 0.90943 713.77212 183.85943 1724.60166
10.45000 -2330.03708 -0.03430 -32.78579 687.04645 151.55506 1710.31485
10.55000 -2317.40500 0.25577 -28.59407 743.88193 246.72253 1756.51770
10.65000 -2314.43357 -2.49660 -70.79261 667.18641 211.43301 1695.14876
10.75000 -2278.49955 0.49655 -31.64835 683.75717 161.73770 1698.35517
10.85000 -2251.17458 -6.94868 -71.30271 681.94010 159.30800 1704.21570
10.95000 -2271.39076 0.61873 -30.33296 652.50629 162.63515 1665.57944
11.05000 -2260.22885 4.23557 -52.79294 669.67537 161.34802 1655.28919
11.15000 -2264.84580 0.20260 -65.65379 638.75547 138.94950 1623.58199
11.25000 -2241.59090 1.63705 -67.76157 646.90180 145.42880 1629.09872
11.35000 -2232.48678 0.26772 -89.69569 646.14954 133.72365 1618.40713
11.45000 -2196.47034 0.53346 -99.87899 650.27561 168.16648 1641.30464
11.55000 -2184.36063 0.23642 -33.73951 638.09102 141.44321 1626.31511
11.65000 -2180.71548 -2.07490 -114.63899 644.47702 244.59968 1613.20258
11.75000 -2203.06252 -1.58449 -47.25746 621.34532 151.78642 1559.36369
11.85000 -2140.31825 2.71675 9.81181 642.18203 172.45795 1601.72430
11.95000 -2133.69403 0.01751 -109.97085 629.80975 140.99297 1602.16605
12.05000 -2146.09781 0.20370 -22.96945 611.23126 143.07278 1560.49133
12.15000 -2123.59426 -0.52838 6.34571 627.10852 138.83968 1557.36507
12.25000 -2107.37103 -1.71454 -53.95375 617.32673 128.22151 1570.41884
12.35000 -2104.30508 0.35489 -59.74621 618.36382 138.22184 1547.26993
12.45000 -2083.34532 -0.27955 -62.15490 615.73295 117.67064 1550.39446
12.55000 -2084.29509 1.14384 -84.48037 606.80189 128.19156 1527.79829
12.65000 -2081.46344 0.85355 -71.17148 594.38956 147.73004 1513.97980
12.75000 -2063.54318 -3.34708 -84.20489 594.51993 119.79025 1514.02341
12.85000 -2052.55923 -2.56714 -82.98736 591.73389 110.53777 1507.89432
12.95000 -2026.98986 -3.54074 -83.81638 619.67689 131.70133 1514.01965
13.05000 -2031.66564 0.01072 -12.45469 596.01266 122.73047 1840.54765
13.15000 -2038.23110 2.18664 -91.12921 579.77380 106.86985 1463.54048
13.25000 -2012.58719 1.13635 -64.15541 581.83560 127.33109 1476.72797
13.35000 -1976.48119 -3.64669 -43.00274 1078.36818 306.21283 1468.53202
13.45000 -2005.15223 3.09217 -60.27805 1100.91033 309.89693 1468.02983
13.55000 -1954.67049 1.62168 -97.57754 577.77730 123.48161 1483.33967
13.65000 -1979.75577 1.82980 -86.54084 582.82297 164.90165 1443.72101
13.75000 -1957.53405 1.32663 -113.70428 570.75580 106.79073 1439.45348
13.85000 -1935.91112 -0.96912 -54.96330 575.31559 98.54944 1444.76014
13.95000 -1938.64329 0.05143 -86.92727 574.17457 126.84872 1427.18603
14.05000 -1928.58682 0.84585 -83.76634 556.56375 141.17372 1420.38758
14.15000 -1921.54504 -0.58775 -82.77783 563.58454 98.01042 1409.07667
14.25000 -1901.82901 0.52520 -87.55539 563.32620 105.93185 1407.56215
14.35000 -1894.61660 2.84525 -84.24197 553.82837 108.24904 1405.60654
14.45000 -1897.76253 2.94855 -107.25272 546.13916 113.58424 1383.61041
14.55000 -1878.98122 -0.28810 -37.96528 544.07493 93.59361 1386.94738
14.65000 -1888.98272 -0.06036 -55.81919 528.46337 106.89005 1367.33140
14.75000 -1846.77589 -0.72230 -48.64140 548.09369 84.87070 1382.35181
14.85000 -1843.89563 -0.41196 -51.36615 550.00229 98.71121 1371.42450
14.95000 -1822.33202 -1.26130 -60.73013 546.56144 92.46876 1380.81864
15.05000 -1834.06272 -0.80917 -87.48899 523.43838 110.77997 1352.04599
15.15000 -1835.99725 -1.63729 -70.07011 523.00983 143.08484 1330.71487
15.25000 -1820.04195 1.49309 -63.65736 519.01914 97.03997 1335.42593
15.35000 -1820.46437 6.59859 -70.69512 536.52927 253.79626 1322.21180
15.45000 -1803.23908 -0.43914 -95.07517 510.56333 78.59875 1323.51486
15.55000 -1789.26575 2.33500 -67.12066 573.85082 115.80512 1326.10597
15.65000 -1781.03695 -2.44085 -84.01066 522.39688 79.43857 1313.41532
15.75000 -1777.04492 1.72311 -52.02167 515.23798 96.83644 1295.79304
15.85000 -1742.13866 -0.90639 -43.44066 526.56974 95.32222 1321.71985
15.95000 -1756.19419 -0.02002 -98.72945 509.26734 78.54179 1290.43840
16.05000 -1740.67169 -0.13978 -25.43101 510.66343 85.86197 1290.16804
16.15000 -1754.52362 -1.72394 -45.80020 491.60602 91.40937 1265.59931
16.25000 -1737.39959 -3.12473 -98.53531 497.51711 83.56610 1270.08432
16.35000 -1733.99549 -1.44633 -68.58542 492.81469 153.84811 1252.84078
16.45000 -1721.22153 -0.09150 -69.36227 502.53640 93.52866 1253.25533
16.55000 -1704.08534 1.34774 -34.16288 488.10286 119.68272 1263.87269
16.65000 -1697.93510 -2.46106 -115.63452 499.13435 103.43469 1255.52591
16.75000 -1668.07158 1.79049 -39.21377 488.15617 66.49529 1270.96750
16.85000 -1703.27238 -0.87598 -30.68045 476.34921 66.41637 1209.66123
16.95000 -1667.44173 -1.66863 -46.94562 488.42297 128.59962 1243.95296
17.05000 -1668.10454 1.64020 -64.94742 477.97656 91.64721 1228.37301
17.15000 -1674.00886 -0.17141 -108.85577 462.24605 87.67705 1211.23343
17.25000 -1657.95522 1.18326 -43.57123 467.99424 64.51012 1208.22596
17.35000 -1643.67738 1.32050 -93.08285 470.62535 66.88355 1211.90038
17.45000 -1641.34824 -0.82232 -43.97020 474.69625 70.12451 1195.67138
17.55000 -1624.38440 0.71050 -75.92544 470.63423 65.23560 1202.81353
17.65000 -1623.15051 0.13991 -89.15184 472.69547 89.38645 1187.26246
17.75000 -1620.41376 -0.57856 -29.87573 454.81459 136.33187 1178.15349
17.85000 -1613.39717 0.17632 -52.73542 461.09619 62.32241 1171.31912
17.95000 -1605.95224 -0.65372 -57.20085 463.53374 74.10137 1165.68096
18.05000 -1589.07677 0.70080 -42.15979 459.18492 85.12438 1172.68574
18.15000 -1575.13022 -0.95228 -37.41828 461.70420 61.82919 1171.99815
18.25000 -1569.54040 -0.95069 -68.81498 600.10923 281.68259 1172.53747
18.35000 -1564.38619 -0.04158 -63.60394 463.50775 114.10337 1162.38333
18.45000 -1555.13252 0.50729 -62.82416 461.61979 66.54086 1149.14065
18.55000 -1548.75352 0.00106 -83.65534 451.36611 68.99718 1157.83088
18.65000 -1524.43128 1.84156 -23.40868 458.67910 83.40499 1161.72384
18.75000 -1533.22759 -2.52932 -32.85942 456.94904 75.58064 1137.32319
18.85000 -1527.72208 -0.62886 -55.46860 447.59169 63.43471 1131.58570
18.95000 -1522.27800 1.37408 -47.26453 451.11955 67.99354 1132.34667
19.05000 -1534.75432 0.55601 -52.30337 429.95923 85.03954 1106.66647
19.15000 -1494.03214 0.95001 -81.03926 444.01789 86.30303 1136.68970
19.25000 -1510.25405 -1.14969 -32.13782 430.41090 61.75749 1102.38791
19.35000 -1488.65257 1.14735 -52.27914 434.14690 63.91122 1118.05173
19.45000 -1500.96302 0.47449 -49.55399 431.99941 96.56597 1088.61918
19.55000 -1492.22943 1.92420 -76.84791 422.74703 51.16864 1088.50709
19.65000 -1466.36980 -1.19293 -50.74354 443.45642 56.84141 1108.53416
19.75000 -1471.84157 0.82484 -71.96334 425.82017 84.23002 1085.53673
19.85000 -1472.08108 -0.30698 -26.57820 417.56434 54.18436 1071.30931
19.95000 -1452.07719 -0.84436 -24.82622 428.40271 78.69342 1081.91402
