0.12500 0.01230
0.37500 0.02626
0.62500 0.07202
0.87500 0.11176
1.12500 0.14776
1.37500 0.18343
1.62500 0.18292
1.87500 0.22122
2.12500 0.21994
2.37500 0.24242
2.62500 0.25913
2.87500 0.24463
3.12500 0.26013
3.37500 0.24127
3.62500 0.24322
3.87500 0.20962
4.12500 0.21079
4.37500 0.16259
4.62500 0.14041
4.87500 0.09169
5.12500 0.08533
5.37500 0.10386
5.62500 0.10575
5.87500 0.10821
6.12500 0.11337
6.37500 0.12896
6.62500 0.12371
6.87500 0.14036
7.12500 0.14466
7.37500 0.10474
7.62500 0.14084
7.87500 0.12361
8.12500 0.11096
8.37500 0.10264
8.62500 0.10787
8.87500 0.10908
9.12500 0.09874
9.37500 0.09059
9.62500 0.08568
9.87500 0.08121
10.12500 0.05457
10.37500 0.06273
10.62500 0.08313
10.87500 0.04429
11.12500 0.05787
11.37500 0.05063
11.62500 0.04726
11.87500 0.05786
12.12500 0.05582
12.37500 0.05160
12.62500 0.07211
12.87500 0.03277
13.12500 0.04720
13.37500 0.03809
13.62500 0.01598
13.87500 0.01366
14.12500 0.01607
14.37500 0.04003
14.62500 0.05466
14.87500 0.06545
15.12500 0.05281
15.37500 0.05944
15.62500 0.10119
15.87500 0.09109
16.12500 0.03116
16.37500 0.11776
16.62500 0.11659
16.87500 0.07719
17.12500 0.08917
17.37500 0.06668
17.62500 0.06101
17.87500 0.03361
18.12500 0.09487
18.37500 0.00772
18.62500 0.04718
18.87500 0.00640
19.12500 0.04637
19.37500 0.06343
19.62500 0.07080
19.87500 0.03446
