0.12500 0.02659
0.37500 0.04035
0.62500 0.10484
0.87500 0.14132
1.12500 0.20504
1.37500 0.26576
1.62500 0.32376
1.87500 0.36910
2.12500 0.41872
2.37500 0.46070
2.62500 0.47510
2.87500 0.49427
3.12500 0.49259
3.37500 0.48550
3.62500 0.44629
3.87500 0.41715
4.12500 0.37571
4.37500 0.35028
4.62500 0.32168
4.87500 0.30316
5.12500 0.27165
5.37500 0.26411
5.62500 0.24960
5.87500 0.23467
6.12500 0.20352
6.37500 0.18329
6.62500 0.15418
6.87500 0.12911
7.12500 0.10605
7.37500 0.11620
7.62500 0.08884
7.87500 0.06665
8.12500 0.07154
8.37500 0.05854
8.62500 0.07846
8.87500 0.06955
9.12500 0.05419
9.37500 0.06418
9.62500 0.05992
9.87500 0.06211
10.12500 0.01673
10.37500 0.04462
10.62500 0.05826
10.87500 0.10436
11.12500 0.12511
11.37500 0.12189
11.62500 0.14337
11.87500 0.14782
12.12500 0.13558
12.37500 0.13539
12.62500 0.11572
12.87500 0.09361
13.12500 0.05665
13.37500 0.05706
13.62500 0.02990
13.87500 0.02119
14.12500 0.02475
14.37500 0.03203
14.62500 0.01516
14.87500 0.03155
