0.05000 37019.20103
0.15000 38540.74205
0.25000 31737.72105
0.35000 24432.84632
0.45000 21096.23442
0.55000 17916.46977
0.65000 16124.66228
0.75000 14213.03895
0.85000 12869.42988
0.95000 11785.11212
1.05000 10922.06883
1.15000 10114.05148
1.25000 9397.93623
1.35000 8738.42763
1.45000 8284.10199
1.55000 7863.33415
1.65000 7466.91293
1.75000 7042.46093
1.85000 6669.95788
1.95000 6414.16532
2.05000 6071.17747
2.15000 5861.71611
2.25000 5580.50177
2.35000 5262.69872
2.45000 5121.19491
2.55000 4898.47089
2.65000 4620.15072
2.75000 4489.81350
2.85000 4336.92344
2.95000 4144.87077
3.05000 3920.81843
3.15000 3721.64299
3.25000 3661.23412
3.35000 3549.85217
3.45000 3376.50504
3.55000 3207.21280
3.65000 3082.99565
3.75000 2955.30670
3.85000 2903.83750
3.95000 2784.30036
4.05000 2686.37772
4.15000 2602.12864
4.25000 2585.56092
4.35000 2472.12117
4.45000 2397.01152
4.55000 2340.93615
4.65000 2298.66279
4.75000 2212.22584
4.85000 2169.17821
4.95000 2135.64680
5.05000 2057.80134
5.15000 2018.68420
5.25000 1989.33701
5.35000 1928.18500
5.45000 1877.71367
5.55000 1834.33394
5.65000 1817.68368
5.75000 1762.77378
5.85000 1698.68884
5.95000 1678.86658
6.05000 1630.73035
6.15000 1626.20751
6.25000 1539.83363
6.35000 1510.46665
6.45000 1489.40721
6.55000 1478.51334
6.65000 1441.01421
6.75000 1403.24951
6.85000 1377.23780
6.95000 1356.67016
7.05000 1327.48133
7.15000 1281.31009
7.25000 1272.56513
7.35000 1237.69060
7.45000 1166.34732
7.55000 1184.52263
7.65000 1153.50164
7.75000 1145.69207
7.85000 1129.35541
7.95000 1111.46413
8.05000 1076.44637
8.15000 1067.21953
8.25000 1017.48867
8.35000 996.27136
8.45000 996.40347
8.55000 963.55735
8.65000 944.97033
8.75000 934.25726
8.85000 902.67926
8.95000 902.75503
9.05000 877.17682
9.15000 838.56172
9.25000 844.02268
9.35000 828.34634
9.45000 804.91100
9.55000 793.67045
9.65000 777.84315
9.75000 765.39953
9.85000 750.85610
9.95000 735.20415
10.05000 731.95069
10.15000 691.39590
10.25000 687.96524
10.35000 686.75356
10.45000 671.22504
10.55000 648.72779
10.65000 648.94172
10.75000 636.19961
10.85000 625.95903
10.95000 619.39949
11.05000 593.41962
11.15000 589.47440
11.25000 573.90595
11.35000 567.21502
11.45000 565.92439
11.55000 548.37698
11.65000 539.32072
11.75000 519.38473
11.85000 505.63054
11.95000 507.42346
12.05000 494.14059
12.15000 475.03549
12.25000 468.66756
12.35000 476.59141
12.45000 455.01678
12.55000 452.04196
12.65000 434.12827
12.75000 430.58983
12.85000 430.56449
12.95000 419.44904
13.05000 410.86155
13.15000 387.53466
13.25000 388.72412
13.35000 377.09012
13.45000 374.57248
13.55000 354.91378
13.65000 367.93437
13.75000 349.94653
13.85000 359.22942
13.95000 332.86340
14.05000 335.53155
14.15000 330.34205
14.25000 326.52084
14.35000 312.19095
14.45000 311.69786
14.55000 305.41467
14.65000 291.77345
14.75000 287.16134
14.85000 281.78930
14.95000 282.33798
15.05000 265.10514
15.15000 278.93231
15.25000 262.70638
15.35000 259.26814
15.45000 249.26258
15.55000 254.42691
15.65000 250.13870
15.75000 250.15093
15.85000 255.84672
15.95000 235.87231
16.05000 223.67408
16.15000 237.66706
16.25000 225.44763
16.35000 220.45304
16.45000 221.89869
16.55000 217.47339
16.65000 211.37038
16.75000 208.22902
16.85000 202.52962
16.95000 195.45346
17.05000 204.23263
17.15000 192.37487
17.25000 188.97704
17.35000 182.34823
17.45000 183.95509
17.55000 182.34256
17.65000 176.76431
17.75000 166.94744
17.85000 170.30408
17.95000 164.03667
18.05000 165.46337
18.15000 162.07822
18.25000 163.38037
18.35000 157.97643
18.45000 148.20964
18.55000 148.61600
18.65000 153.59779
18.75000 155.18623
18.85000 144.64927
18.95000 141.80393
19.05000 143.99408
19.15000 144.37370
19.25000 128.39554
19.35000 145.41274
19.45000 129.63375
19.55000 130.10880
19.65000 121.71068
19.75000 123.57275
19.85000 124.56321
19.95000 125.87920
