0.05000 -1496.17499 373.80976 692.78218 2360.67417 2640.61188 2439.66962
0.15000 -3336.35415 -73.06398 739.56178 4977.57370 3231.55514 5016.20209
0.25000 -5442.80626 -96.50269 72.66783 3305.60886 3050.80692 6649.18259
0.35000 -6543.66160 114.32757 90.86542 3416.58978 6519.15926 8108.51772
0.45000 -7297.10745 -19.33769 246.11626 2776.78741 2509.30191 8408.25674
0.55000 -7918.48240 116.50659 195.59968 3168.40830 2489.09733 8806.01024
0.65000 -8035.40763 -36.40079 47.89642 3262.99272 3198.31122 9903.97405
0.75000 -8180.51597 91.71122 -175.15756 2874.27729 2157.27766 8791.93866
0.85000 -8207.93635 71.73310 200.15992 2621.22626 2055.17878 8537.29204
0.95000 -8283.20066 25.24583 -90.72186 2251.12676 1550.40933 8232.66970
1.05000 -8299.30665 9.04933 -92.73716 7907.98073 3553.77929 8526.35502
1.15000 -8333.04769 -4.36392 -249.66956 2393.93018 4902.49483 8434.07643
1.25000 -8421.72390 69.67821 -171.67288 2058.28412 1326.24522 7399.00310
1.35000 -8395.16123 36.61857 -89.44191 1930.60033 1304.74583 7254.95371
1.45000 -8440.98741 17.86419 -238.01916 1844.95757 1284.98145 6965.74154
1.55000 -8412.19396 14.63071 -6.28758 1858.82417 1360.06125 6728.57818
1.65000 -8362.22714 14.38631 -279.60924 1599.41924 1281.83973 6527.41675
1.75000 -8354.39139 21.94730 -129.70379 1527.33607 1100.64648 6243.49376
1.85000 -8343.36329 28.83469 -203.39581 1530.43254 1461.11623 6078.25810
1.95000 -8336.34722 36.28137 -18.04898 1584.83417 1470.59920 5869.66075
2.05000 -8305.69635 1.42173 8.69477 1518.04918 1276.64347 5654.37518
2.15000 -8268.33639 19.53369 -108.33147 1295.57209 1037.74552 5405.83686
2.25000 -8247.75989 10.64458 -30.40946 1233.27282 953.29873 5291.91806
2.35000 -8204.76711 3.51991 54.98748 1263.45260 1025.99985 5132.91734
2.45000 -8172.79712 5.81776 -48.45340 1126.91584 954.22837 4909.23830
2.55000 -8116.27456 7.41758 -8.87202 1081.62461 965.38669 4794.41874
2.65000 -8070.35314 -17.91684 -48.69911 1159.55669 1369.53749 4674.70864
2.75000 -8028.75538 -4.52304 37.77746 1059.32356 1072.71445 4496.16285
2.85000 -8005.78686 -0.35135 -70.00541 1385.30613 941.22385 4351.15349
2.95000 -7923.49433 13.43254 -2.10610 954.13817 801.25284 4199.22228
3.05000 -7893.45391 -2.82441 -72.02842 1039.43828 1190.29327 4093.64068
3.15000 -7836.34950 5.50363 31.58967 820.09434 863.10854 3973.72805
3.25000 -7781.71158 10.51595 -4.57851 865.44532 774.75251 3882.51738
3.35000 -7736.70148 19.30059 -9.68457 917.45262 939.07231 3920.62794
3.45000 -7689.69815 0.18984 51.31529 820.79244 719.64536 3708.88662
3.55000 -7644.15468 11.19875 -31.63268 759.69841 891.79886 3560.71026
3.65000 -7587.94728 -1.51820 23.10519 698.65784 690.74966 3448.20280
3.75000 -7530.86415 9.80075 92.06715 682.77504 633.97507 3341.84079
3.85000 -7460.95780 20.73673 65.87910 651.64724 566.83915 3244.54527
3.95000 -7393.34591 14.75295 -45.99042 656.55579 527.15275 3210.45161
4.05000 -7327.58740 13.32546 -41.64100 771.67497 945.33173 3144.00765
4.15000 -7296.70961 14.44141 43.32950 729.36823 543.19936 3014.54636
4.25000 -7241.88914 16.37359 45.54985 669.47489 564.43679 2946.63836
4.35000 -7180.08102 10.85614 1.25506 704.26509 575.69168 2877.58393
4.45000 -7107.89560 16.04723 5.69924 730.31060 522.04186 3120.98758
4.55000 -7051.07568 15.42412 -11.10182 604.56035 655.38427 2740.88583
4.65000 -6985.60783 6.34894 32.90361 1347.73572 1692.16921 3119.52971
4.75000 -6950.64126 14.17294 0.50608 631.12413 602.86047 2621.96831
4.85000 -6911.16109 21.93977 46.73232 670.36247 647.00166 2493.55583
4.95000 -6848.97392 6.51694 -6.21944 854.93829 1134.13687 2645.70774
5.05000 -6802.67831 18.05911 -0.58620 562.36810 410.53753 2403.17689
5.15000 -6756.09644 26.85878 21.17841 584.21182 474.68028 2351.82861
5.25000 -6711.57466 15.81735 -8.23030 489.30039 410.67367 2308.66233
5.35000 -6672.80876 10.52977 22.72167 573.03179 534.78176 2262.72385
5.45000 -6604.80869 15.43802 -9.68030 700.88486 530.54040 2215.19773
5.55000 -6583.58341 12.74982 13.02244 480.44092 412.24087 2135.53402
5.65000 -6548.25952 19.72250 3.83074 490.85043 363.35880 2101.55214
5.75000 -6504.24339 8.95061 58.66914 473.05544 422.73562 2024.07451
5.85000 -6465.37267 4.72122 -0.30434 480.92395 634.36029 1970.07816
5.95000 -6423.29233 8.69765 4.12850 923.12300 709.28814 2058.66298
6.05000 -6372.14093 2.96910 28.73914 572.58431 390.36649 1879.15092
6.15000 -6333.59559 13.02635 -12.64849 477.63274 484.43501 1904.62226
6.25000 -6296.39352 4.39104 -3.88563 464.15464 359.37163 1809.37935
6.35000 -6252.22553 7.91364 19.58872 499.49373 455.13997 1766.21921
6.45000 -6204.18905 4.34121 58.28100 446.54357 262.33221 1734.64162
6.55000 -6159.98554 1.51007 44.95720 455.02905 451.61023 1706.60290
6.65000 -6099.51953 6.25271 16.47436 367.24466 373.78372 1645.29488
6.75000 -6049.15973 9.89489 -0.62082 395.52586 257.83032 1601.80001
6.85000 -6006.63281 4.89554 19.14111 447.33379 410.67081 1558.89209
6.95000 -5950.65797 5.85696 8.90610 438.99467 317.30662 1532.74146
7.05000 -5899.10802 7.29280 42.19579 337.68255 238.77627 1513.98165
7.15000 -5859.69042 9.64874 34.54916 398.94947 273.75458 1464.96399
7.25000 -5803.69854 8.83844 37.56470 423.58909 310.91144 1473.84561
7.35000 -5773.37736 11.90764 15.84860 895.43278 371.73499 1543.44182
7.45000 -5696.45607 16.60769 51.56404 297.25241 228.48883 1363.53391
7.55000 -5650.60188 10.51337 22.56561 349.28130 296.86043 1328.74030
7.65000 -5597.11828 14.56707 57.26183 299.20692 463.73842 1374.97448
7.75000 -5552.68935 13.35759 42.68406 301.86086 250.68609 1268.87596
7.85000 -5507.19592 8.20903 54.79150 267.47271 224.74577 1237.22805
7.95000 -5456.69394 11.22416 2.04328 299.52174 232.38610 1213.23728
8.05000 -5401.19315 13.76166 60.77214 441.43641 404.39923 1231.41244
8.15000 -5361.31809 12.04487 47.53985 250.00072 236.54458 1157.74670
8.25000 -5309.00256 14.32010 40.13488 274.05318 190.27067 1145.70125
8.35000 -5270.71044 14.50799 9.71717 847.26062 244.59542 1212.93416
8.45000 -5222.23585 14.12308 38.57417 338.81541 231.14642 1118.09467
8.55000 -5178.31044 14.36385 14.64382 276.73199 192.23799 1065.58922
8.65000 -5152.86816 12.06953 19.49777 205.98235 191.30297 1023.50280
8.75000 -5097.50195 10.91229 24.56447 266.29477 213.85644 1034.87622
8.85000 -5053.72549 16.15467 21.35715 277.04086 328.65963 1084.25592
8.95000 -5017.05838 10.62454 50.97736 270.89656 386.96589 1000.18386
9.05000 -4970.70187 10.84195 13.68682 208.08608 167.88744 960.33248
9.15000 -4930.44165 12.47172 37.91949 230.03755 283.79437 948.49497
9.25000 -4895.42869 7.39605 22.85032 320.38314 309.47290 942.28321
9.35000 -4852.70936 13.82380 37.50375 176.80618 189.93814 891.41913
9.45000 -4811.12717 8.04526 38.80052 294.59659 424.98057 970.88789
9.55000 -4777.22842 5.80449 56.79690 354.81079 390.31359 871.22943
9.65000 -4741.56165 8.32369 35.93336 259.88753 185.16567 851.12250
9.75000 -4708.48216 12.42786 28.11137 204.92140 234.28362 829.13248
9.85000 -4668.52932 5.41683 23.62999 179.70043 182.68627 808.50326
9.95000 -4632.23530 13.51850 27.92538 250.75501 263.82245 793.33579
10.05000 -4599.31601 8.52919 18.75510 218.04787 168.14808 772.50913
10.15000 -4566.02535 6.78780 41.92523 207.23800 287.25775 760.40116
10.25000 -4536.48135 10.40435 39.83901 372.94873 169.20619 778.72184
10.35000 -4493.26876 8.47795 16.92534 162.71417 144.37759 732.77666
10.45000 -4461.43265 4.56589 23.22045 172.51528 205.59783 703.77305
10.55000 -4418.63102 8.97519 48.43184 270.06776 313.25315 740.12735
10.65000 -4390.07536 9.81282 32.90981 203.13005 213.15956 674.99371
10.75000 -4359.43516 14.51950 21.65490 183.52215 175.84071 677.12854
10.85000 -4316.75845 7.79752 8.52744 152.93694 222.29656 658.34830
10.95000 -4285.59553 9.96992 3.95842 151.19272 127.16752 639.18680
11.05000 -4254.77724 10.31120 24.16764 154.73474 144.41863 666.51843
11.15000 -4225.28509 3.37247 13.74608 409.14417 612.32008 887.89731
11.25000 -4194.29390 4.89251 -7.11821 156.74975 138.05936 599.38713
11.35000 -4161.72175 6.58610 0.75684 193.07086 186.66427 593.57681
11.45000 -4129.43530 8.10106 0.18620 131.23445 121.66809 577.94760
11.55000 -4095.09156 8.96819 -17.98655 127.13649 122.22865 578.97964
11.65000 -4057.31883 4.47756 3.71451 144.72853 475.09660 661.60654
11.75000 -4033.52494 5.92589 1.68787 116.33546 121.19367 548.07790
11.85000 -3997.08182 6.61009 -9.56596 224.80633 188.11489 544.26283
11.95000 -3972.00114 -0.66598 9.66360 184.55326 163.97536 525.04888
12.05000 -3937.62726 7.61312 0.99405 119.91460 151.10670 515.55691
12.15000 -3903.56910 9.49486 -9.80804 152.03222 138.33681 525.99880
12.25000 -3875.44385 3.59259 -0.98316 118.85329 142.84153 505.34702
12.35000 -3847.30731 2.96724 -3.00067 169.42620 104.97044 507.33544
12.45000 -3819.00179 6.51472 2.37671 101.35038 115.41654 462.32453
12.55000 -3783.97483 4.43992 -0.28766 105.54172 76.30454 464.16033
12.65000 -3750.53301 9.47671 -22.65759 204.07158 177.59706 462.20639
12.75000 -3724.33614 7.65228 -1.37176 110.94865 157.17971 443.89255
12.85000 -3694.29167 4.52896 -18.00959 142.51985 92.40384 432.78384
12.95000 -3672.89587 6.87453 -1.29506 97.45161 118.61161 422.21359
13.05000 -3643.75535 3.81531 -26.74799 115.25403 115.58822 426.62956
13.15000 -3619.33326 6.69713 -1.14680 93.44864 91.75090 404.78021
13.25000 -3584.43041 -1.89113 -6.68348 180.83426 250.55554 543.98133
13.35000 -3562.13446 2.67325 -5.05089 147.72981 123.36611 419.48523
13.45000 -3532.45755 10.01778 -8.56350 146.65484 95.04988 394.23017
13.55000 -3509.59838 6.12259 -12.78856 88.96530 91.90579 380.06346
13.65000 -3481.68708 2.82990 8.61778 156.46526 92.80286 374.72076
13.75000 -3456.37979 7.88498 4.37043 85.48667 75.04917 360.18243
13.85000 -3426.79228 4.91022 -2.00808 121.30809 136.64477 354.77632
13.95000 -3408.32742 3.17859 3.30494 162.47339 152.66032 561.72379
14.05000 -3391.37166 -0.06080 -10.18302 101.50576 105.00243 340.56583
14.15000 -3365.46022 3.80106 5.58010 113.29649 93.25410 344.73133
14.25000 -3340.04962 4.35401 6.77188 109.29374 87.75086 340.93253
14.35000 -3321.57518 5.51225 4.88038 68.33403 106.67438 322.89006
14.45000 -3300.05730 -1.54228 2.25779 106.69842 188.34371 331.06616
14.55000 -3265.79465 8.18591 -10.66419 197.43278 184.32269 618.50845
14.65000 -3251.44681 6.99725 -1.78664 86.09236 76.50402 308.95184
14.75000 -3228.64371 5.13378 22.98279 80.82415 69.15973 296.10092
14.85000 -3202.26536 5.72810 -7.41626 135.15450 91.84864 297.32058
14.95000 -3180.27927 7.08939 -6.06713 100.65976 96.94680 302.00899
15.05000 -3154.49789 3.58793 4.55371 77.41822 90.24353 294.53723
15.15000 -3136.40171 1.27859 2.06122 121.93157 90.74248 290.45971
15.25000 -3117.09740 6.17773 3.37666 70.68590 67.48045 282.81438
15.35000 -3092.39019 2.54769 4.77494 67.08891 56.84960 274.44668
15.45000 -3072.52319 6.11089 -1.39583 64.76707 76.06919 267.64070
15.55000 -3047.86624 -0.36812 1.68107 172.10978 413.87551 343.68393
15.65000 -3030.53564 5.63983 -2.58056 105.27521 218.77323 250.11981
15.75000 -3011.04319 5.19943 1.55850 54.97907 46.59602 255.47606
15.85000 -2990.30804 4.79882 -3.11402 54.96543 57.35178 256.47384
15.95000 -2977.23627 6.28626 -3.89235 210.80712 210.86575 255.40636
16.05000 -2950.81147 5.37159 -1.41098 57.82274 63.22717 236.96884
16.15000 -2935.23443 -0.47297 14.40787 119.48267 127.89992 281.30676
16.25000 -2915.88023 -0.53338 -5.52007 60.30553 86.82609 225.49629
16.35000 -2891.33586 -2.94912 5.37034 125.63622 290.52383 405.93803
16.45000 -2873.90990 6.22494 2.53050 62.19846 64.87560 228.58757
16.55000 -2854.12533 3.78236 -1.28264 55.99223 53.96671 216.34879
16.65000 -2838.12543 5.24440 -6.32354 131.39402 133.00593 241.63894
16.75000 -2812.31730 2.42195 -5.64871 1452.39340 2237.77027 1000.39876
16.85000 -2799.51641 3.36522 2.98945 49.48242 68.06590 213.25919
16.95000 -2784.50926 2.88609 1.91130 51.60954 57.28309 203.45529
17.05000 -2766.30772 5.67084 0.08431 55.04452 43.42692 205.72129
17.15000 -2748.70250 2.41335 -13.65103 65.46361 57.44289 188.29729
17.25000 -2732.90300 4.73605 -6.57013 64.26069 52.92779 196.20510
17.35000 -2711.91103 3.81935 1.18934 54.98360 46.77480 193.12877
17.45000 -2694.64485 2.27362 -2.82884 95.92442 67.95325 192.99030
17.55000 -2672.37150 3.11771 0.47162 71.50269 57.35074 186.46875
17.65000 -2656.60966 3.70421 14.12899 59.79141 55.54906 179.52163
17.75000 -2642.17143 2.45239 -2.44494 51.81296 58.91406 190.98361
17.85000 -2625.05079 6.73844 11.25575 86.33650 62.15563 184.77041
17.95000 -2610.08642 4.60704 -0.64614 85.06478 60.02584 176.35840
18.05000 -2599.46854 0.01073 1.34497 80.61027 68.56945 175.95702
18.15000 -2585.75126 -0.78243 9.36578 101.82514 83.21596 182.93317
18.25000 -2567.52652 1.83182 7.93336 38.93557 35.41424 154.90519
18.35000 -2549.91625 3.04901 -2.55922 82.12659 46.60704 164.39118
18.45000 -2539.98404 8.58559 5.35137 47.54709 175.22145 174.39675
18.55000 -2525.18493 1.83143 2.68617 54.29859 64.03398 173.71480
18.65000 -2506.46604 9.23662 6.53429 110.25596 260.74732 169.43252
18.75000 -2495.58676 -0.34319 13.82224 61.72435 47.89211 153.95472
18.85000 -2479.87067 -1.16213 -1.59914 64.41189 65.67114 220.97627
18.95000 -2464.83511 3.11350 14.33573 57.32310 64.88749 150.99696
19.05000 -2450.24304 -0.06086 10.62497 66.94621 69.45304 198.94189
19.15000 -2435.92150 1.96967 7.06052 42.94332 45.80810 154.93999
19.25000 -2418.27283 3.97134 5.75533 66.02457 61.12500 189.12688
19.35000 -2404.39479 1.88267 9.65559 53.14269 48.53403 145.42260
19.45000 -2395.01540 4.15446 7.44208 89.63353 59.24440 175.68086
19.55000 -2377.31524 4.06869 7.60097 44.20028 41.55509 139.83453
19.65000 -2364.02826 4.25229 4.26138 43.98429 33.54769 136.29195
19.75000 -2347.51740 4.13801 -4.17992 36.04874 41.36596 132.80453
19.85000 -2336.40109 7.17121 -0.95259 54.01859 60.11387 139.13621
19.95000 -2322.66311 3.03835 15.04852 44.83326 37.27689 142.34267
