0.2 -2.42315 19.2393 -1.462 111.78468 109.93836 89.94686
0.6 0.00076 39.30364 -0.16537 111.37216 104.96114 85.89195
1.0 -0.3194 57.98405 0.36484 110.81655 96.67399 83.02217
1.4 0.52164 69.27798 0.72349 109.81292 90.7741 79.66242
1.8 0.04372 77.34263 -0.42511 107.25879 85.58012 76.24241
2.2 0.55897 84.41576 -0.10911 105.78301 81.97816 73.00723
2.6 -0.34222 90.76685 0.20525 102.71427 78.86343 69.3924
3.0 0.05735 96.13409 -0.62893 98.84627 74.53803 65.57163
3.4 0.25157 100.63084 -0.1678 94.6846 71.66364 62.25366
3.8 -0.48239 105.74875 -0.20208 89.68668 68.97476 59.30559
4.2 -1.78372 111.74488 0.098 83.51398 67.65004 57.50347
4.6 -1.3954 118.4864 0.62474 77.82235 68.57128 55.35536
5.0 -1.04087 126.72198 1.58328 71.76288 68.90327 54.10901
5.4 -0.73154 136.07772 1.4513 65.49011 68.33226 51.13456
5.8 0.52591 144.80795 0.16509 60.50929 67.50466 48.62516
6.2 0.40647 157.00188 -0.18736 55.31792 62.16093 46.08377
6.6 0.76745 168.11695 -0.20977 50.81766 55.26957 43.26209
7.0 1.37047 177.76686 -0.29595 47.62379 46.69917 39.96221
7.4 1.92056 184.44633 0.33855 45.03585 41.06908 36.98992
7.8 1.39626 189.62881 -0.21749 42.24949 37.96703 34.27433
8.2 0.20999 192.21909 0.08324 40.62628 35.46033 31.48673
8.6 0.4773 194.26881 0.57882 39.6782 33.37739 29.70229
9.0 0.20207 195.8736 0.3063 39.37102 30.9685 28.48103
9.4 -0.46671 195.7543 0.39024 38.89976 29.63921 27.39924
9.8 0.1375 196.91982 0.56781 38.81741 28.88111 26.49374
10.2 0.61662 196.80512 -0.06158 38.35321 28.55552 25.58342
10.6 0.63564 197.68528 0.29265 37.63047 28.18521 24.35528
11.0 0.79511 199.72699 0.23161 36.94614 26.44849 23.62881
11.4 0.20817 201.09587 0.15175 36.5632 25.29894 22.71732
11.8 0.3583 201.3221 -0.10171 35.48149 24.64738 21.88143
12.2 0.26312 202.46729 -0.56947 33.88669 24.20113 21.12793
12.6 0.1026 202.48829 -0.42357 32.65556 23.93191 20.61551
13.0 0.37057 203.44743 -0.53223 30.95556 23.54773 19.5835
13.4 0.60983 203.52703 -0.66567 29.40599 23.31308 19.29477
13.8 -0.21001 204.12299 -0.26218 28.23349 22.89732 18.53122
14.2 0.69568 204.20403 -0.84082 26.61314 22.81968 18.03994
14.6 0.00241 204.5195 -0.5438 25.46053 22.5063 17.36563
15.0 0.30594 205.20625 -0.63622 24.34522 22.18137 16.75232
15.4 0.05196 206.79815 -0.53113 23.38152 21.08293 16.21176
15.8 -0.54182 207.81107 -0.6826 22.05605 19.85127 16.09522
16.2 -1.09474 209.61124 -0.98066 21.45973 18.37449 15.64923
16.6 -0.59369 210.79464 -0.92085 21.1293 16.4122 15.21834
17.0 -0.62714 211.5632 -0.49018 20.3808 15.10271 14.92316
17.4 0.12671 211.54492 -0.96031 19.43874 13.89718 14.4874
17.8 0.17496 211.03001 -0.50707 19.4082 13.48616 14.22669
18.2 0.6313 210.80943 -0.98142 19.23732 12.84813 13.92775
18.6 0.73433 209.58272 -0.8896 18.83557 12.49407 13.55283
19.0 0.80801 209.1732 -0.53268 17.86833 12.87513 12.79841
19.4 1.16846 208.48655 -0.67786 17.37476 12.76358 12.71155
19.8 1.24848 208.48416 -0.06386 16.76015 13.35563 12.16358
