0.120000 1.141730
0.380000 -1.798610
0.620000 -0.687280
0.880000 -0.611650
1.120000 -1.666360
1.380000 -1.313360
1.620000 -1.787120
1.880000 3.133760
2.120000 1.994970
2.380000 2.758870
2.620000 2.082460
2.880000 2.477540
3.120000 1.994820
3.380000 2.977430
3.620000 -0.541570
3.880000 -0.893060
4.120000 -0.957750
4.380000 -1.039800
4.620000 -1.002730
4.880000 -1.407500
5.120000 -1.051740
5.380000 -1.279770
5.620000 3.076710
5.880000 1.283170
6.120000 2.530780
6.380000 2.160540
6.620000 2.992560
6.880000 0.491050
7.120000 -2.591450
7.380000 -1.987700
7.620000 -1.888780
7.880000 2.627140
8.120000 2.608090
8.380000 1.483490
8.620000 1.548600
8.880000 0.374390
9.120000 1.808670
9.380000 1.929380
9.620000 -0.094870
9.880000 0.834060
10.120000 1.131620
10.380000 -0.147070
10.620000 -0.039510
10.880000 -2.783530
11.120000 -1.148720
11.380000 2.557000
11.620000 -0.445390
11.880000 0.525340
12.120000 0.183420
12.380000 1.274580
12.620000 0.967610
12.880000 1.128220
13.120000 1.856430
13.380000 1.327580
13.620000 -0.172570
13.880000 -1.368020
14.120000 0.018830
14.380000 0.940080
14.620000 -0.797240
14.880000 1.041360
