0.05000 -3563.69621 -115.58517 -84655.21911 1934.46939 1575.24734 547855.65301
0.15000 -5199.77759 -54.39378 21237.51534 1243.22231 982.51703 399674.89687
0.25000 -6905.71177 30.80693 -1414.98190 1329.91929 960.60321 398474.61763
0.35000 -7995.23154 6.17386 -10985.03054 1561.14604 759.29475 313959.02298
0.45000 -8561.94591 24.26564 1000.01120 1621.41924 643.19781 271353.16184
0.55000 -9078.72900 22.71095 -409.02517 1662.68449 552.48047 265865.74776
0.65000 -9384.47498 37.40569 -6300.94253 1700.98363 501.38457 230804.19815
0.75000 -9510.35452 31.77411 785.94029 1661.93364 476.24140 245260.60111
0.85000 -9587.97195 37.68999 3283.32033 1612.87663 462.43993 255671.17104
0.95000 -9603.96770 43.62156 -735.06412 1523.78317 444.32468 244318.63019
1.05000 -9593.07998 39.01279 2216.90806 1370.20498 455.58242 207959.29967
1.15000 -9598.59385 40.92821 1672.71402 1288.63777 433.58178 195473.16751
1.25000 -9548.55460 38.63772 1948.64493 1179.76198 415.79119 197049.71355
1.35000 -9529.79724 37.83712 3659.28214 1072.36069 395.47336 197042.94971
1.45000 -9487.62446 34.49844 2274.44587 981.52620 371.39352 178598.96252
1.55000 -9443.13686 37.52160 -1636.64896 911.95444 360.69690 178497.68190
1.65000 -9376.26157 36.86434 1650.19390 817.57088 354.26083 159631.96681
1.75000 -9340.91916 35.41325 2318.81327 726.41099 354.64691 144988.67891
1.85000 -9308.55080 34.91453 -1822.44128 649.03942 337.06402 141554.70480
1.95000 -9273.55150 36.29736 2225.78415 601.99218 325.44502 131393.11449
2.05000 -9208.98396 29.64462 1682.09376 535.98351 300.78759 131974.48599
2.15000 -9116.24754 38.90334 169.84646 491.52198 298.01912 128189.01696
2.25000 -9059.82345 36.76228 2265.56908 452.89415 296.80124 118243.20612
2.35000 -8991.16648 27.86953 784.63889 414.42964 288.52181 124049.74548
2.45000 -8928.89389 32.71845 52.34295 393.20355 276.78749 118837.75067
2.55000 -8850.61248 30.29888 384.21215 373.17990 269.33887 110221.23986
2.65000 -8777.67790 30.98041 1524.95679 348.06310 261.91568 98810.84538
2.75000 -8686.68311 31.82245 1842.07109 326.49054 260.24183 94180.08026
2.85000 -8622.60071 34.19999 -404.05494 317.84369 261.02718 89503.69200
2.95000 -8571.80024 22.73590 446.10338 305.46666 267.31528 85207.38065
3.05000 -8497.76615 31.28967 1016.60459 283.15433 263.79636 85825.82672
3.15000 -8418.85937 29.26742 -830.74137 267.95300 255.11466 75619.19008
3.25000 -8355.26739 29.20821 -1007.23124 269.45869 246.92471 75446.20470
3.35000 -8277.00730 24.30026 232.73138 254.07248 238.13897 71856.68209
3.45000 -8178.82223 23.83747 759.09919 239.84740 231.37528 71265.79351
3.55000 -8104.16874 23.37456 925.17736 229.34765 235.55955 64733.38898
3.65000 -8023.10407 22.26794 -1404.82472 213.86543 223.14796 67948.26941
3.75000 -7932.66363 23.58977 197.11229 211.69544 218.31863 61814.02429
3.85000 -7833.15663 22.88051 363.03715 228.41362 217.35005 56410.95528
3.95000 -7751.02587 24.74033 958.36792 229.82182 218.99627 54071.15976
4.05000 -7693.79734 23.45449 20.36161 227.97333 212.60799 58382.69081
4.15000 -7630.97842 22.85597 -264.93875 233.38434 209.64302 50454.02253
4.25000 -7572.63267 20.58291 447.82857 229.88130 207.09769 50851.40080
4.35000 -7532.56701 21.67127 300.21111 222.88108 201.97595 45268.50493
4.45000 -7494.93658 20.76144 -301.28263 214.81320 197.73741 49105.86130
4.55000 -7458.78232 19.59393 530.71926 200.72611 196.79554 41175.57608
4.65000 -7425.11403 21.18408 586.11693 194.87626 191.73032 40793.84003
4.75000 -7402.92581 20.80578 626.04324 193.10134 190.66833 39641.55766
4.85000 -7376.03133 21.26145 -241.42412 191.13922 186.91301 36939.07245
4.95000 -7338.55077 20.32568 -96.57527 189.80049 180.94978 35975.96630
5.05000 -7308.30395 19.60427 176.49126 196.38788 183.75555 33784.64886
5.15000 -7252.11140 20.07546 -51.18692 198.18451 176.08902 34261.80074
5.25000 -7190.52962 24.50511 98.74777 197.26154 175.61068 34060.63958
5.35000 -7114.73759 16.97202 252.57433 196.25615 165.53957 29753.45120
5.45000 -7040.82102 18.95520 -150.17926 193.07111 164.07029 39286.57743
5.55000 -6960.60347 17.35154 -306.13357 189.67382 162.38646 35815.99477
5.65000 -6870.94722 19.12352 -251.57740 186.95977 153.90808 26216.43514
5.75000 -6779.93671 16.33826 147.11475 177.52995 157.35468 27757.51055
5.85000 -6698.62715 16.09880 -316.21344 177.03371 152.96286 27219.94423
5.95000 -6627.68302 16.29388 506.79347 177.70767 147.25094 25790.28432
6.05000 -6532.10566 16.16868 103.73182 172.30041 144.23685 23705.99210
6.15000 -6450.46296 14.87824 289.47718 164.10562 139.94553 23871.76087
6.25000 -6358.69699 13.25677 -378.74678 162.01377 138.13508 45342.60158
6.35000 -6291.68648 12.63912 130.19716 165.98904 142.24387 22290.96340
6.45000 -6226.29002 14.28169 167.98483 164.54535 135.75691 21780.40917
6.55000 -6146.64627 11.00425 623.56094 160.44113 134.12751 21839.03731
6.65000 -6070.14233 12.44061 -19.14997 151.41085 126.09312 20219.71912
6.75000 -5998.22679 12.16123 -221.16134 146.76597 125.89244 18830.09215
6.85000 -5929.79382 13.97111 -120.60532 146.77236 125.59166 28193.79577
6.95000 -5854.71988 13.96640 -153.45516 140.37781 127.27661 23192.59703
7.05000 -5781.29207 10.58769 108.00560 134.45362 119.40741 18466.31463
7.15000 -5706.21023 9.58669 146.00448 138.35097 120.48499 15951.85131
7.25000 -5640.41983 9.93130 -57.39096 139.21239 123.25798 14149.18246
7.35000 -5582.72672 9.51068 35.60002 119.55000 118.06897 14429.95697
7.45000 -5512.49897 10.49603 570.00753 127.32034 114.85213 51774.50320
7.55000 -5453.52085 10.22380 23.71788 122.25612 118.37796 13088.70694
7.65000 -5395.58537 10.06539 139.57529 124.57012 116.37647 14741.98484
7.75000 -5345.93418 11.14514 -159.89131 117.81812 113.37834 10980.72593
7.85000 -5295.05224 8.50325 170.52468 120.12728 110.45741 11176.93867
7.95000 -5246.13409 4.20112 -163.99154 118.74301 114.61411 13453.93641
8.05000 -5203.34729 9.16498 -51.28007 119.62488 112.39980 10115.76084
8.15000 -5165.99009 10.86868 -15.94433 121.08434 113.29184 12711.75641
8.25000 -5131.29236 9.22091 956.28214 121.84986 108.87342 67268.25771
8.35000 -5093.67875 5.96690 64.68445 112.04910 105.22721 10183.76554
8.45000 -5061.02907 6.91623 378.98451 113.10280 100.02278 24398.44401
8.55000 -5024.91620 7.57797 79.21141 113.62072 108.88418 9355.60378
8.65000 -4983.25690 9.02637 -116.46501 114.30296 101.14712 9225.65921
8.75000 -4949.08006 6.77134 111.07746 117.12667 94.32059 9043.95194
8.85000 -4899.51335 6.29364 1081.09629 108.42996 100.81705 63602.81931
8.95000 -4857.35868 7.96200 -62.12485 108.03722 99.33524 7815.43283
9.05000 -4817.41286 9.05273 -59.05617 107.63393 95.64275 6665.36577
9.15000 -4769.32427 8.90098 107.24537 110.84398 106.04156 8401.62718
9.25000 -4727.69221 9.87150 650.90393 107.99810 94.84137 47066.24458
9.35000 -4679.65281 5.96409 -18.90289 100.84213 95.90027 7213.96429
9.45000 -4632.91972 8.03839 -66.41569 106.75382 91.84557 8003.73985
9.55000 -4592.35846 8.61227 -160.71688 101.87590 94.75944 5996.16610
9.65000 -4542.52912 7.79453 -135.56442 93.48720 95.74854 7076.98206
9.75000 -4499.36800 5.94540 -197.16877 93.21018 83.42726 6265.62465
9.85000 -4452.21690 6.14035 -140.06643 93.10775 85.79945 6998.12631
9.95000 -4407.59875 5.99571 85.95593 96.93328 88.78497 7217.10193
10.05000 -4368.57091 8.21066 24.77652 88.52438 91.70223 5814.43221
10.15000 -4336.97375 6.86801 -85.55033 99.12606 92.70859 5681.60206
10.25000 -4296.22970 6.28607 150.16048 93.48769 86.55703 5363.01136
10.35000 -4259.29349 5.03657 -9.68226 87.50274 85.87271 5863.28621
10.45000 -4219.86789 5.39362 -50.66082 86.33143 81.06805 5711.78476
10.55000 -4182.83675 8.25997 83.57089 91.63820 86.95670 4508.57183
10.65000 -4149.31550 4.99588 -109.01179 80.67674 81.48370 5895.27696
10.75000 -4117.66412 5.58040 2.92268 89.30016 87.91352 4770.25066
10.85000 -4088.70917 4.51345 108.03889 84.27243 79.59619 5006.37565
10.95000 -4051.35764 5.63455 67.38229 84.51113 76.77266 4047.06435
11.05000 -4020.84987 4.63699 6.55302 84.49195 82.52056 4376.40107
11.15000 -3986.15050 5.70387 -38.05178 81.52505 76.87072 4310.60641
11.25000 -3952.16588 3.43601 87.93058 80.66310 83.30730 4242.02670
11.35000 -3927.93818 5.13989 -126.66066 82.55159 80.54683 4185.78543
11.45000 -3898.81725 5.03439 80.19031 79.46433 75.35014 3818.54952
11.55000 -3871.53832 7.81685 64.43343 88.99962 80.66611 3421.74694
11.65000 -3846.68166 7.09822 109.47330 76.32293 68.59034 4434.39147
11.75000 -3814.00397 3.37641 -57.38488 83.09248 78.03369 4290.71607
11.85000 -3786.50324 2.89705 106.05348 74.12305 80.08644 4719.15167
11.95000 -3751.85104 5.02323 -29.98600 75.77357 68.14777 3454.87468
12.05000 -3721.21317 4.20205 -105.17302 70.64293 68.25901 4552.54198
12.15000 -3692.61760 5.20396 16.54095 74.31125 78.36390 2742.21751
12.25000 -3664.86336 3.66307 -14.31514 75.14561 72.68812 3602.57323
12.35000 -3633.57833 2.03071 82.82300 82.61679 67.26375 2950.66950
12.45000 -3605.83664 5.19236 -30.64944 68.16591 70.46706 2768.41571
12.55000 -3576.33439 4.42353 -81.19300 84.56608 81.56011 3169.35763
12.65000 -3548.37251 7.72182 -5.99959 76.74157 78.20101 2423.63548
12.75000 -3518.74724 3.82100 -26.84496 67.83226 63.39519 2856.53822
12.85000 -3484.87877 6.99271 -104.28524 69.00256 74.99175 1968.80393
12.95000 -3459.68200 6.28802 -160.39743 61.87733 59.45554 2512.46713
13.05000 -3433.24503 2.14246 -159.92033 64.31915 59.44954 2600.65869
13.15000 -3407.03136 2.73410 32.34643 68.77427 61.06688 3680.35214
13.25000 -3386.09795 4.35403 65.47446 69.41273 72.93201 2192.81313
13.35000 -3352.13902 1.12887 -76.87035 66.81993 60.20683 1854.33158
13.45000 -3325.36224 2.77758 50.53133 59.83612 56.15244 2499.58781
13.55000 -3301.91739 4.63179 -57.14270 62.82894 64.28539 2123.86718
13.65000 -3277.41323 1.61457 1.80388 62.51017 56.72122 1397.08226
13.75000 -3250.36742 6.92008 -34.06270 62.11016 74.88070 1735.49133
13.85000 -3225.30407 4.56748 -31.07845 59.93223 70.93665 2038.81639
13.95000 -3200.96137 5.18970 -26.30172 54.24177 61.26305 1677.21531
14.05000 -3177.13841 5.05939 -96.05829 56.81510 63.71206 2106.12016
14.15000 -3151.03208 5.31378 -66.82102 57.80089 55.13733 1468.20914
14.25000 -3126.28143 5.85686 -125.13705 62.09989 55.93247 3013.61789
14.35000 -3110.73751 4.48475 -6.03259 57.20044 56.27176 2229.53562
14.45000 -3082.64588 3.08732 -4.00504 62.88639 57.67432 1536.27179
14.55000 -3056.36760 2.11425 -103.58825 52.12414 66.88763 1423.62465
14.65000 -3031.59886 5.69579 -71.62334 63.10426 56.55027 1364.50080
14.75000 -3013.87503 7.29260 -19.96333 58.45855 63.25457 1431.38609
14.85000 -2985.67437 1.48787 -99.23342 52.66369 57.70716 1165.57191
14.95000 -2966.21590 0.56012 -74.85537 64.63116 65.52623 1172.51025
15.05000 -2942.18186 1.31725 32.76897 62.40315 68.41576 1454.36686
15.15000 -2930.93749 5.05017 -27.61279 59.75931 59.45897 1334.92103
15.25000 -2913.07341 4.59915 70.11196 74.86414 66.58563 1366.29289
15.35000 -2891.22374 2.78444 15.43001 59.98941 50.72359 1035.40892
15.45000 -2871.07151 5.62952 -34.56729 61.47061 59.16086 1199.04305
15.55000 -2847.87587 -2.70292 -45.23359 67.61933 55.01417 1034.33433
15.65000 -2821.24747 0.72127 -8.93079 72.12708 53.61273 990.07587
15.75000 -2805.76465 4.54664 -0.35624 63.28152 64.37448 1005.62654
15.85000 -2791.56181 1.97035 -75.85511 57.20647 43.59710 1446.86206
15.95000 -2772.45609 3.68176 21.47211 52.51856 44.98075 1193.33467
16.05000 -2754.30924 -2.24247 27.34115 51.72232 54.04130 934.26279
16.15000 -2733.12799 3.46472 -22.32659 66.56580 48.52855 935.75911
16.25000 -2716.14593 5.34157 -15.28610 56.44449 49.85666 909.91215
16.35000 -2703.43618 5.89863 14.42855 40.14699 40.63487 774.69342
16.45000 -2680.17937 4.92125 -71.58739 76.07498 57.63449 744.75682
16.55000 -2673.47994 2.92031 -146.49842 52.18177 39.06371 1139.30701
16.65000 -2650.31569 0.61630 35.22381 55.84321 44.73116 839.17788
16.75000 -2635.11847 5.76467 -3.54202 47.47640 51.61944 968.28121
16.85000 -2615.84630 -0.74055 74.48025 39.69072 43.47613 996.29833
16.95000 -2600.54528 3.84846 -9.11294 39.84016 37.03819 689.81544
17.05000 -2584.56670 2.69804 -16.05926 51.23731 58.39830 578.62468
17.15000 -2566.95961 1.06446 -56.66639 32.84248 40.37764 650.30024
17.25000 -2548.43250 3.00612 -22.16628 67.58301 48.07093 810.09278
17.35000 -2535.86094 -1.10421 -13.82314 42.03641 52.34108 537.85228
17.45000 -2509.31472 -1.17369 28.97298 45.85196 39.87099 802.05545
17.55000 -2500.04296 5.22827 -53.12857 47.98774 45.36198 589.85680
17.65000 -2483.49281 -1.62077 18.45379 42.28485 31.99922 440.92232
17.75000 -2467.55349 5.30996 -24.11969 48.52156 48.54173 581.58734
17.85000 -2446.28600 -1.39267 1.26524 57.80431 59.43938 540.51377
17.95000 -2435.28513 4.85911 1.72276 42.22904 40.14663 660.96596
18.05000 -2422.27178 -0.89965 -62.75871 70.62146 52.38322 796.42338
18.15000 -2414.89509 0.82261 -31.59425 61.27174 39.69198 489.60022
18.25000 -2396.89844 2.32944 -16.86352 39.48047 35.07837 410.23892
18.35000 -2387.64238 3.24706 1.52653 48.26509 59.96936 550.97162
18.45000 -2368.34569 7.52402 11.70040 55.92660 58.65343 372.75279
18.55000 -2357.74036 3.83782 -8.54651 39.95955 39.96403 373.39531
18.65000 -2340.06605 6.48371 -19.80746 45.13738 46.24499 385.52165
18.75000 -2330.51990 13.44052 -47.63967 31.86137 57.62563 488.46501
18.85000 -2318.18674 7.35781 42.06325 35.64254 33.13824 797.00110
18.95000 -2299.60147 5.92499 25.00805 56.09462 49.09084 742.44263
19.05000 -2289.42176 11.43818 -35.14016 26.97825 29.91062 596.41478
19.15000 -2272.41189 7.89737 4.42991 62.87343 34.76013 310.95646
19.25000 -2265.35947 5.87212 -30.29846 30.28350 43.91746 517.29663
19.35000 -2253.34272 10.41307 -65.48016 27.58911 26.48138 533.46151
19.45000 -2236.82523 10.17760 54.58931 35.41807 35.41660 521.93524
19.55000 -2224.90904 7.48304 -42.69409 64.50133 31.48777 382.52475
19.65000 -2211.62335 5.04671 19.59631 26.38728 44.68726 478.89558
19.75000 -2196.42446 10.38533 2.34108 46.04072 29.18974 327.92212
19.85000 -2184.99131 2.13957 -21.75691 50.75016 69.62915 388.39972
19.95000 -2178.07870 11.46046 -5.30784 31.91638 24.25353 265.53615
