0.05000 35441.89092
0.15000 37664.49264
0.25000 30932.95683
0.35000 24421.59737
0.45000 20491.69622
0.55000 17548.40760
0.65000 15668.45180
0.75000 14045.19018
0.85000 12880.10060
0.95000 11834.67256
1.05000 10799.44777
1.15000 9982.07090
1.25000 9420.87840
1.35000 8773.19918
1.45000 8224.32595
1.55000 7799.04703
1.65000 7325.25613
1.75000 6975.16885
1.85000 6535.62633
1.95000 6311.99063
2.05000 6043.43645
2.15000 5730.17467
2.25000 5498.11479
2.35000 5260.50434
2.45000 5049.35323
2.55000 4816.60315
2.65000 4668.99491
2.75000 4521.40362
2.85000 4296.91361
2.95000 4105.76313
3.05000 3954.22000
3.15000 3755.56790
3.25000 3621.79556
3.35000 3500.19967
3.45000 3308.63044
3.55000 3216.37992
3.65000 3095.06609
3.75000 2965.69990
3.85000 2914.14066
3.95000 2772.75836
4.05000 2716.87311
4.15000 2661.01817
4.25000 2554.47527
4.35000 2479.05931
4.45000 2421.91090
4.55000 2350.44748
4.65000 2308.58624
4.75000 2250.85976
4.85000 2170.15757
4.95000 2149.49461
5.05000 2077.35893
5.15000 2039.78597
5.25000 2013.92996
5.35000 1895.21548
5.45000 1879.16881
5.55000 1845.37531
5.65000 1790.38169
5.75000 1764.31640
5.85000 1705.65954
5.95000 1678.17053
6.05000 1626.73823
6.15000 1566.92578
6.25000 1570.35265
6.35000 1530.03426
6.45000 1517.17418
6.55000 1467.41642
6.65000 1429.25774
6.75000 1416.39123
6.85000 1380.78574
6.95000 1348.51115
7.05000 1308.46264
7.15000 1290.34975
7.25000 1255.36885
7.35000 1232.39581
7.45000 1205.75820
7.55000 1176.16732
7.65000 1145.23224
7.75000 1148.72031
7.85000 1110.29840
7.95000 1089.75530
8.05000 1056.29531
8.15000 1058.79151
8.25000 1022.49480
8.35000 1022.37958
8.45000 975.73313
8.55000 967.08933
8.65000 947.13617
8.75000 928.28539
8.85000 909.38978
8.95000 901.39602
9.05000 874.59370
9.15000 853.55958
9.25000 845.63084
9.35000 844.53227
9.45000 808.10056
9.55000 804.96810
9.65000 787.62269
9.75000 754.83805
9.85000 759.93372
9.95000 747.90534
10.05000 725.71836
10.15000 721.01004
10.25000 702.56483
10.35000 684.32974
10.45000 667.44480
10.55000 665.39618
10.65000 643.03735
10.75000 635.00807
10.85000 618.53183
10.95000 608.73419
11.05000 609.34062
11.15000 595.70524
11.25000 572.55895
11.35000 572.81580
11.45000 554.70366
11.55000 555.81828
11.65000 533.06831
11.75000 524.90101
11.85000 508.93585
11.95000 503.95043
12.05000 494.08693
12.15000 503.65261
12.25000 479.79966
12.35000 465.77373
12.45000 457.75727
12.55000 448.00214
12.65000 436.83170
12.75000 427.14833
12.85000 427.16370
12.95000 418.81318
13.05000 398.14278
13.15000 390.80197
13.25000 388.93938
13.35000 379.65472
13.45000 377.22063
13.55000 360.56495
13.65000 357.24822
13.75000 347.76416
13.85000 344.32380
13.95000 341.40600
14.05000 325.85660
14.15000 327.66049
14.25000 321.14959
14.35000 310.61363
14.45000 310.52362
14.55000 304.00666
14.65000 296.86196
14.75000 290.07496
14.85000 296.83261
14.95000 278.71221
15.05000 273.98923
15.15000 279.30956
15.25000 277.38982
15.35000 265.83127
15.45000 256.98607
15.55000 252.69002
15.65000 257.17143
15.75000 240.52418
15.85000 248.74278
15.95000 235.83807
16.05000 235.97947
16.15000 229.01535
16.25000 222.75549
16.35000 232.34922
16.45000 212.83979
16.55000 215.56464
16.65000 208.30635
16.75000 210.10766
16.85000 195.19610
16.95000 204.41623
17.05000 194.06795
17.15000 195.10800
17.25000 184.65058
17.35000 193.01479
17.45000 182.25179
17.55000 169.46881
17.65000 174.60129
17.75000 169.70073
17.85000 168.21091
17.95000 174.08340
18.05000 159.70576
18.15000 168.33868
18.25000 154.31196
18.35000 149.16250
18.45000 150.15872
18.55000 153.87757
18.65000 153.16839
18.75000 143.76748
18.85000 135.37403
18.95000 140.54313
19.05000 145.47158
19.15000 141.72520
19.25000 135.10256
19.35000 139.42265
19.45000 140.78027
19.55000 132.01429
19.65000 128.79856
19.75000 126.39619
19.85000 124.37882
19.95000 125.50985
