0.125 -0.001 -0.002 0.002
0.375 0.006 0.001 0.049
0.625 0.005 0.018 0.258
0.875 -0.021 0.008 0.754
1.125 -0.000 0.030 1.450
1.375 -0.086 0.039 2.219
1.625 -0.016 0.052 2.984
1.875 0.020 0.101 3.700
2.125 -0.059 0.087 4.299
2.375 0.015 0.099 4.732
2.625 -0.023 0.078 5.137
2.875 -0.028 0.058 5.444
3.125 -0.009 0.115 5.901
3.375 -0.072 0.073 6.033
3.625 -0.048 0.111 6.275
3.875 -0.119 0.071 6.588
4.125 -0.002 0.168 7.007
4.375 -0.063 0.137 7.392
4.625 -0.081 0.112 7.934
4.875 -0.096 0.131 8.551
5.125 -0.115 0.129 9.094
5.375 0.001 0.197 10.030
5.625 -0.098 0.163 10.543
5.875 -0.034 0.165 11.656
6.125 -0.042 0.189 12.771
6.375 -0.036 0.198 14.059
6.625 -0.052 0.237 14.827
6.875 0.045 0.270 16.557
7.125 0.035 0.332 18.385
7.375 0.016 0.404 20.288
7.625 0.016 0.437 22.451
7.875 -0.002 0.484 24.430
8.125 0.013 0.481 25.607
8.375 0.016 0.481 26.496
8.625 -0.026 0.499 26.991
8.875 0.032 0.484 26.515
9.125 0.024 0.513 26.285
9.375 0.073 0.529 25.599
9.625 0.031 0.473 24.672
9.875 0.024 0.434 24.285
10.125 -0.022 0.457 22.936
10.375 -0.008 0.453 22.214
10.625 0.021 0.463 21.376
10.875 0.056 0.428 20.915
11.125 0.002 0.436 20.695
11.375 0.045 0.416 20.106
11.625 0.008 0.502 20.281
11.875 0.076 0.462 20.016
12.125 0.031 0.497 20.649
12.375 0.007 0.478 20.529
12.625 0.034 0.471 21.074
12.875 0.040 0.484 20.268
13.125 -0.026 0.474 20.420
13.375 -0.031 0.491 20.407
13.625 -0.029 0.474 20.024
13.875 -0.034 0.433 19.322
14.125 -0.067 0.433 18.966
14.375 -0.031 0.408 18.421
14.625 -0.040 0.401 17.978
14.875 -0.033 0.330 17.088
