0.120000 -1.807490
0.380000 0.062280
0.620000 0.355680
0.880000 0.307880
1.120000 0.397890
1.380000 0.320240
1.620000 0.291710
1.880000 0.288370
2.120000 0.337290
2.380000 0.326930
2.620000 0.311430
2.880000 0.327690
3.120000 0.392330
3.380000 0.462560
3.620000 0.553480
3.880000 0.678730
4.120000 0.743870
4.380000 0.811560
4.620000 0.908550
4.880000 0.602630
5.120000 -0.158320
5.380000 -0.866920
5.620000 -1.149420
5.880000 -1.277230
6.120000 -1.402030
6.380000 -1.542800
6.620000 -1.415180
6.880000 -0.846710
7.120000 0.934970
7.380000 0.730960
7.620000 0.532650
7.880000 0.569820
8.120000 0.294770
8.380000 0.165560
8.620000 0.093020
8.880000 -0.139650
9.120000 -0.312990
9.380000 -0.402360
9.620000 -0.782530
9.880000 -0.459440
10.120000 -0.835360
10.380000 -2.245880
10.620000 -2.054700
10.880000 -2.305720
11.120000 -2.652200
11.380000 -2.723580
11.620000 -2.873800
11.880000 3.106550
12.120000 2.929280
12.380000 3.099330
12.620000 2.298270
12.880000 2.063770
13.120000 1.607470
13.380000 1.509050
13.620000 0.855390
13.880000 0.115370
14.120000 -0.266000
14.380000 0.759080
14.620000 -1.090210
14.880000 -1.915410
