0.120000 0.275700
0.380000 0.532470
0.620000 0.391540
0.880000 -0.082650
1.120000 0.419720
1.380000 -0.967110
1.620000 1.261370
1.880000 1.787730
2.120000 1.925250
2.380000 0.896600
2.620000 2.228290
2.880000 0.598370
3.120000 0.338920
3.380000 -0.825680
3.620000 -0.201160
3.880000 -0.995710
4.120000 -1.538890
4.380000 -1.883590
4.620000 -2.040570
4.880000 -3.051780
5.120000 -2.928090
5.380000 -1.396970
5.620000 -1.555140
5.880000 -0.445100
6.120000 -1.693120
6.380000 -1.846690
6.620000 -1.417660
6.880000 -1.748710
7.120000 -2.266590
7.380000 2.997660
7.620000 -2.997200
7.880000 1.934180
8.120000 2.708830
8.380000 2.199700
8.620000 2.000470
8.880000 2.337040
9.120000 3.066250
9.380000 2.449300
9.620000 2.310270
9.880000 2.909990
10.120000 3.076690
10.380000 2.899620
10.620000 -3.034270
10.880000 2.685280
11.120000 -3.071500
11.380000 2.328370
11.620000 0.239780
11.880000 0.951540
12.120000 0.537580
12.380000 0.648290
12.620000 0.935390
12.880000 -0.614480
13.120000 1.399720
13.380000 -1.582630
13.620000 -2.855670
13.880000 -2.000670
14.120000 -1.941530
14.380000 1.617250
14.620000 -3.004100
14.880000 2.447440
15.120000 2.395790
15.380000 2.236580
15.620000 1.695770
15.880000 0.696720
16.120000 0.499190
16.380000 0.803710
16.620000 -0.123290
16.880000 0.302600
17.120000 0.951510
17.380000 1.169470
17.620000 0.868580
17.880000 0.596380
18.120000 0.410590
18.380000 1.709390
18.620000 -2.550220
18.880000 -0.893290
19.120000 0.015510
19.380000 -0.892770
19.620000 -0.467590
19.880000 -2.339470
