0.05000 885.11235 158.77693 -1696.80789 3123.88555 2505.66259 2725.93548
0.15000 -3191.22014 262.62490 -193.98434 3696.23589 4653.51631 4196.97752
0.25000 -4318.25227 116.37655 559.23734 3684.47497 3402.50037 5981.09497
0.35000 -5895.60409 -239.64344 -549.33744 2946.25532 2708.81508 7461.12260
0.45000 -6682.91179 -97.46372 13.43768 3302.05800 2685.77353 8228.13249
0.55000 -6905.93885 76.85861 -389.51213 2750.37339 1962.98603 8524.37184
0.65000 -7307.26164 55.35980 -436.09406 2873.34544 2275.69025 8739.77669
0.75000 -7738.24804 16.68743 -262.88584 2810.14662 1928.06352 8514.54574
0.85000 -8108.83450 32.07306 -380.29701 2523.64875 1667.51134 8363.09646
0.95000 -7915.50496 58.77448 -304.41641 2358.84892 1656.26389 8271.93493
1.05000 -8040.04071 28.93118 -75.92289 2467.36609 1971.15347 8070.90997
1.15000 -8199.04810 36.00870 -177.72317 2297.59140 1697.35402 7771.98421
1.25000 -8290.31853 29.02324 -112.02411 2153.88763 1374.30945 7592.11552
1.35000 -8359.10267 49.28816 -116.19935 1955.85089 1502.10069 7354.28850
1.45000 -8469.65748 67.24291 -92.46061 1740.06232 1436.14031 7090.41779
1.55000 -8562.48748 39.02174 150.85565 1874.95214 1378.42127 6853.58328
1.65000 -8577.23620 48.84126 -107.45553 1647.32904 1291.45515 6419.15663
1.75000 -8578.62772 30.02116 -287.03694 1680.98694 1311.61208 6292.30749
1.85000 -8459.95649 53.65700 110.98420 1640.87284 1250.99369 6233.25297
1.95000 -8549.37794 90.02579 -61.79452 1565.34994 1140.06676 5984.38675
2.05000 -8536.34637 43.78684 82.08427 1369.95798 1208.75775 5741.24238
2.15000 -8490.19747 36.73058 91.20367 1347.37617 1199.08506 5469.75266
2.25000 -8413.20958 49.09315 63.71242 1317.05731 1081.23891 5239.31360
2.35000 -8360.48644 32.79382 10.55630 1242.39877 1215.01666 5211.93187
2.45000 -8382.92983 35.18655 61.78633 1324.58076 1148.05481 5022.99673
2.55000 -8351.93698 57.18805 63.82532 1153.81180 1000.14655 4889.99119
2.65000 -8325.24656 84.26371 11.87119 1065.32078 919.44315 4686.17062
2.75000 -8279.34276 19.53726 118.40905 1173.65504 932.04628 4557.17202
2.85000 -8229.68571 54.63057 191.49836 1069.72136 951.30121 4406.84920
2.95000 -8205.85225 19.14775 106.96085 967.29152 931.33665 4265.19079
3.05000 -8126.18380 29.17701 105.82604 930.78529 803.31030 4066.93741
3.15000 -8061.07346 36.58050 152.58681 872.16073 1001.55343 3974.64005
3.25000 -7990.39302 8.08412 64.34154 878.15806 958.73848 3874.91226
3.35000 -7940.63481 39.42027 -47.26234 1246.70087 979.41335 3743.10147
3.45000 -7921.08642 23.48282 50.58525 875.45381 668.14331 3493.60643
3.55000 -7805.75768 29.57578 -11.38162 831.81925 647.59345 3494.48730
3.65000 -7698.14232 47.47206 27.74316 872.41591 637.86334 3436.92564
3.75000 -7639.98036 30.05054 -2.40737 706.12086 577.54251 3241.69975
3.85000 -7564.95561 18.05177 162.93271 812.52263 923.67301 3221.31683
3.95000 -7503.13586 28.54052 185.81605 722.33451 544.14047 3075.61545
4.05000 -7414.48766 30.83971 86.09879 694.47191 518.14639 2995.41215
4.15000 -7343.17011 16.77916 59.39014 737.12458 725.31345 2977.64767
4.25000 -7267.99964 39.92894 8.02235 742.16383 498.21548 2863.05926
4.35000 -7199.96662 25.27477 -4.99469 714.47906 554.90160 2781.50614
4.45000 -7172.97505 17.70800 29.11188 612.36177 449.55554 2654.17389
4.55000 -7088.02151 24.63146 47.45158 644.79131 449.21195 2667.30289
4.65000 -7017.85344 21.40109 25.21139 592.29582 468.91109 2626.18170
4.75000 -6983.52905 26.05045 25.51809 575.96577 526.08337 2520.71712
4.85000 -6963.43259 22.21783 77.10306 583.38185 447.18818 2370.94639
4.95000 -6890.49765 10.92681 12.92915 648.99641 542.23870 2426.60371
5.05000 -6827.58536 35.76746 8.53319 584.99175 477.81205 2311.99060
5.15000 -6794.53796 24.49684 55.06068 554.58340 424.09164 2255.01398
5.25000 -6712.44558 19.89597 -16.52529 618.94236 511.53117 2289.83485
5.35000 -6685.46259 26.66467 56.14271 851.05587 412.84604 2178.58124
5.45000 -6625.06943 26.58747 48.05755 500.10136 425.86179 2088.08363
5.55000 -6565.61626 28.61909 40.54714 506.61173 426.32449 2061.81684
5.65000 -6513.91001 23.02511 -88.13047 476.80079 345.18569 2048.76570
5.75000 -6489.81999 19.29981 -77.97574 776.84818 414.53138 1926.27221
5.85000 -6418.99479 27.63214 6.94818 450.47508 357.29171 1923.71896
5.95000 -6346.39825 30.61193 28.97565 561.45762 393.95967 1889.59013
6.05000 -6290.04329 25.76857 -44.70261 449.27495 346.69053 1837.51767
6.15000 -6269.74207 30.42767 -72.59095 465.67937 357.74033 1777.12259
6.25000 -6208.41705 19.78883 -7.36885 417.52908 319.64836 1752.56254
6.35000 -6165.38439 24.38137 -15.65172 451.89708 396.35161 1692.92095
6.45000 -6107.71470 30.97177 -79.57565 393.38138 375.44754 1673.59327
6.55000 -6079.41692 28.04532 -44.90499 378.86965 428.50712 1584.65486
6.65000 -6004.83711 33.78523 -16.45645 438.23812 362.64551 1579.98414
6.75000 -5966.85190 7.96369 -109.50372 350.35248 349.55831 1565.36777
6.85000 -5940.34101 19.94784 -21.09499 402.56081 334.53467 1514.45047
6.95000 -5892.56814 15.48693 -25.51640 374.83113 354.16278 1448.95600
7.05000 -5845.63418 24.87737 -33.61602 531.93514 391.85870 1547.99117
7.15000 -5800.59850 25.29342 -99.67269 420.06775 342.08135 1419.23192
7.25000 -5754.41733 11.57045 -12.44567 340.73723 295.73492 1357.68685
7.35000 -5698.12325 23.14151 -25.05921 442.03974 396.31388 1359.71981
7.45000 -5679.76539 18.71355 -59.63596 382.58245 320.50415 1299.74150
7.55000 -5623.69070 13.54933 -19.74132 386.83542 302.70204 1303.34167
7.65000 -5588.31424 23.72230 43.48043 372.44103 353.00598 1272.53093
7.75000 -5525.89864 5.10499 35.53709 484.58192 364.28733 1250.27739
7.85000 -5500.67955 23.77194 -44.51771 327.70545 288.14189 1191.31355
7.95000 -5457.72777 15.04484 45.80561 293.87413 305.14736 1170.88695
8.05000 -5406.34898 14.04191 -20.63121 316.78564 242.64548 1153.42748
8.15000 -5349.49780 20.49488 5.80336 325.24418 228.63195 1132.07870
8.25000 -5304.81720 25.02530 5.65142 325.01778 231.43842 1081.57438
8.35000 -5254.25469 1.66032 103.26019 304.02026 322.22239 1064.23567
8.45000 -5210.73552 23.05548 44.30935 387.95766 198.64395 1047.08800
8.55000 -5158.34842 21.15183 35.31765 285.30825 304.13427 1027.25887
8.65000 -5123.04063 11.86007 45.20755 261.98089 266.39782 991.05078
8.75000 -5077.66986 21.57170 2.11207 285.84237 309.57820 996.95011
8.85000 -5032.99850 17.41641 -19.85330 282.18574 303.09009 940.38242
8.95000 -4959.93367 15.29559 32.39872 246.82648 192.96756 942.47349
9.05000 -4927.19563 12.17603 106.07190 242.11977 318.40136 880.96501
9.15000 -4876.90314 23.51945 66.27557 310.67275 293.57848 871.15308
9.25000 -4847.99105 13.59710 45.25251 272.91942 220.47727 866.97793
9.35000 -4790.36954 20.14510 75.36230 374.63337 234.42891 835.13730
9.45000 -4755.58128 4.93674 75.76697 246.04581 373.13075 838.24103
9.55000 -4714.45387 18.94047 59.70084 218.75090 232.19255 796.24012
9.65000 -4672.73604 9.28063 60.34767 245.23556 275.87411 811.30459
9.75000 -4630.70116 18.34105 97.23106 260.02355 186.48126 770.92539
9.85000 -4594.17748 11.81063 54.08094 231.43694 263.30945 792.46111
9.95000 -4548.74137 12.50957 37.59695 225.95334 178.52360 776.78983
10.05000 -4521.60970 22.34879 48.35864 233.97526 221.04119 709.33773
10.15000 -4482.61040 -1.41561 6.00256 280.99276 283.13365 724.93043
10.25000 -4456.52220 3.35367 61.94687 207.32029 229.60058 687.07488
10.35000 -4426.84468 5.55083 30.94979 190.54597 263.60764 677.88398
10.45000 -4388.73589 17.78636 24.75394 279.48903 162.53645 676.20751
10.55000 -4353.90405 9.72076 10.92753 175.44962 251.71676 699.04495
10.65000 -4332.71474 11.52406 14.66937 169.33389 228.16013 653.02985
10.75000 -4293.14045 8.05550 12.68461 166.93498 155.09622 619.11003
10.85000 -4257.61950 9.21169 5.43548 248.22356 310.89418 611.44647
10.95000 -4216.12719 11.86321 43.42769 279.21906 201.13271 624.49022
11.05000 -4207.80374 13.67194 16.95502 286.53826 300.05694 635.88315
11.15000 -4165.85608 18.81242 11.28907 262.97096 250.91321 595.04638
11.25000 -4125.46766 11.68301 1.13867 265.28752 202.77340 600.61216
11.35000 -4110.97240 6.73479 -35.56891 170.84250 144.58617 581.92745
11.45000 -4062.22806 5.32837 0.82053 224.69788 317.38110 552.92368
11.55000 -4037.63685 6.07299 -40.93634 302.08775 185.31587 543.72908
11.65000 -4017.40527 2.50884 -38.25035 166.63619 155.43229 515.38622
11.75000 -3984.40556 14.69750 -18.07041 143.76446 247.45756 590.00995
11.85000 -3942.54308 4.09458 -64.77006 237.16852 233.74713 494.27879
11.95000 -3915.88718 6.20864 -28.47552 151.36571 189.24534 484.45952
12.05000 -3870.59586 -1.97143 -60.38501 231.52241 344.12368 592.73999
12.15000 -3834.40909 9.28437 -45.54834 299.06613 186.94804 520.09766
12.25000 -3802.53955 14.95513 -20.39033 179.13208 197.35545 452.55857
12.35000 -3779.48681 8.14750 -54.65764 150.73924 163.46806 449.43119
12.45000 -3737.63614 6.53720 -41.89696 164.45326 170.96996 437.15949
12.55000 -3714.01967 2.08166 -45.51579 120.85134 107.34855 424.46650
12.65000 -3697.54092 1.30119 -34.49029 171.63069 167.20086 425.97270
12.75000 -3645.10231 9.23578 -29.11678 201.56797 145.27847 433.87560
12.85000 -3633.40678 7.18067 -52.87658 197.10562 150.20174 416.60920
12.95000 -3602.69585 9.07059 -27.44594 148.90404 184.50241 423.86447
13.05000 -3576.47251 10.58653 -8.03511 234.41331 214.54644 491.20450
13.15000 -3567.69438 5.15431 -48.49213 261.73320 178.09850 428.59002
13.25000 -3535.30572 9.11573 -50.59514 128.48573 118.36526 383.04817
13.35000 -3523.47787 14.24816 -27.68485 135.91329 98.20030 385.17787
13.45000 -3498.30302 -8.11655 -40.55396 260.15630 309.91168 372.45193
13.55000 -3487.65164 4.02291 -28.76640 128.22208 93.22079 349.24662
13.65000 -3456.00413 10.04151 -38.57883 180.45343 180.01641 357.19330
13.75000 -3418.53266 16.31207 -31.62860 282.15381 167.88029 384.16424
13.85000 -3404.98376 16.11062 -56.55232 208.73312 181.86815 406.43056
13.95000 -3373.35777 18.58080 -56.56434 217.02553 160.97386 340.89089
14.05000 -3356.47259 9.61554 -19.39032 245.75953 141.12730 364.99993
14.15000 -3335.52319 15.55774 -49.94726 243.44065 129.68493 482.99757
14.25000 -3303.86255 3.92726 -39.40289 237.82937 154.20699 399.95706
14.35000 -3286.07570 8.90978 -23.91663 107.51888 91.89962 315.70860
14.45000 -3267.04311 4.70824 -45.44984 140.40147 105.53609 306.06620
14.55000 -3242.33681 7.44051 -48.28452 92.19353 101.07385 294.48923
14.65000 -3217.53273 17.05811 -37.81999 116.22547 273.69596 303.58831
14.75000 -3184.10393 18.81472 -49.71204 118.31836 243.13900 303.51223
14.85000 -3170.58270 -2.19728 -37.79011 88.94740 100.58515 294.40932
14.95000 -3132.55516 12.45384 -53.57734 117.59016 77.12985 274.95740
15.05000 -3114.71421 8.41279 -23.90367 138.52530 85.59423 271.82162
15.15000 -3096.30342 13.54823 -34.71392 135.99068 73.16087 252.98189
15.25000 -3067.26126 4.84950 -48.86944 116.69814 129.29172 265.89986
15.35000 -3048.02683 0.69308 -25.39709 73.82862 118.29530 275.47427
15.45000 -3023.18153 8.79694 -19.13435 81.11796 79.44410 246.22033
15.55000 -3004.15877 7.75137 -26.21645 127.17154 71.63200 234.67009
15.65000 -2988.69753 -2.71511 -21.81342 118.40424 63.68254 226.01934
15.75000 -2952.81525 14.06787 8.08210 110.14412 147.26101 247.67334
15.85000 -2936.08380 9.50824 -9.06117 91.09014 71.40684 250.88314
15.95000 -2923.15157 -6.85274 -24.31667 109.07361 96.70736 240.57875
16.05000 -2898.46878 3.50414 -1.21186 155.25298 88.99605 211.88770
16.15000 -2882.77870 -5.02197 9.28769 312.23889 193.03254 256.76111
16.25000 -2850.30877 1.07479 -5.64600 78.93164 75.81168 211.80239
16.35000 -2828.96834 4.49388 3.70809 86.10543 67.45181 199.86282
16.45000 -2815.05841 0.51786 -1.14741 72.50731 93.93175 203.10837
16.55000 -2799.30484 0.45799 -16.23469 68.78741 213.33672 218.87930
16.65000 -2776.67701 4.58075 13.34476 89.65834 77.35720 212.50903
16.75000 -2771.75631 12.83357 15.30903 109.05427 100.81232 194.62520
16.85000 -2748.20440 14.15475 -3.61296 101.41633 107.54763 196.82404
16.95000 -2733.75137 3.31667 22.72953 75.12991 62.70460 196.29794
17.05000 -2713.26024 5.47644 16.52961 55.08738 61.24314 197.90834
17.15000 -2694.31884 2.37731 3.52769 71.41497 58.20692 197.77714
17.25000 -2678.42608 4.47404 6.75961 64.44657 73.19613 172.19196
17.35000 -2663.69404 -5.04773 26.87136 62.05218 62.71362 190.78126
17.45000 -2632.49553 8.36143 -28.14380 76.88824 97.33982 187.34377
17.55000 -2624.96146 8.16255 -13.88837 59.93953 69.65188 170.87789
17.65000 -2610.18777 8.66037 8.03618 73.18331 100.51618 166.05593
17.75000 -2596.72416 9.91608 -13.16999 84.49367 79.18593 196.51905
17.85000 -2590.73621 6.86284 -13.08625 55.07349 61.39043 167.44248
17.95000 -2580.67122 5.29155 -29.02304 94.97153 54.11230 169.86646
18.05000 -2578.55817 11.08141 -26.04023 125.21693 112.94675 184.11038
18.15000 -2539.84106 9.90834 -8.54455 76.08476 110.32390 165.47791
18.25000 -2534.44763 12.72396 -34.37336 94.36489 69.61937 177.44930
18.35000 -2516.00363 3.41605 -29.36146 92.75094 66.69600 181.82347
18.45000 -2504.54093 10.73627 -15.92856 54.00890 49.59235 142.87193
18.55000 -2485.66541 3.01623 -19.47002 86.62245 82.97376 155.72949
18.65000 -2472.06406 -1.47006 -9.65081 94.21859 172.79156 173.57312
18.75000 -2444.52555 -5.77277 -26.95481 204.90702 197.88282 167.57566
18.85000 -2414.29369 -5.99873 -21.11254 413.97868 130.25171 315.75246
18.95000 -2430.03012 6.90130 -33.03646 63.95106 59.77876 129.71003
19.05000 -2416.25675 5.02440 -4.76728 45.80956 79.68569 139.71141
19.15000 -2400.22538 8.60826 -20.86381 60.87257 67.30671 149.62193
19.25000 -2387.38626 15.07155 -1.04175 73.49281 70.53662 139.03703
19.35000 -2389.77930 8.66824 -10.18551 123.15794 62.26766 154.20448
19.45000 -2362.20646 7.33578 -1.40248 50.91556 54.53139 137.81580
19.55000 -2346.71422 16.76804 -17.54678 93.14274 56.98468 123.16702
19.65000 -2340.84741 10.19006 -31.73598 41.30119 48.06799 120.23323
19.75000 -2321.65254 13.46868 -4.95636 42.88470 48.72008 118.67230
19.85000 -2310.02333 10.47543 14.74102 58.24247 51.15267 154.02659
19.95000 -2292.92934 13.44772 0.96175 42.95055 46.39998 110.02698
