0.05000 6646.44472 3257.28659 217838.84399 107096.58596 124469.37196 3206017.69494
0.15000 20737.02018 -617.06749 41825.97619 131440.38122 154883.61018 3172701.00727
0.25000 -83950.50574 3225.56193 -3470.06378 98891.58757 184384.40300 3056967.49990
0.35000 -144032.33354 1581.49891 -8484.88858 84597.50261 95465.08449 2499271.99022
0.45000 -107727.99361 39.79667 -18888.77773 47037.07516 45150.30769 2123139.57130
0.55000 -82631.22942 426.14395 7697.06205 27859.83672 26853.09103 1737197.04016
0.65000 -66658.96350 204.70307 -5619.80748 19335.15800 17854.53268 1474146.13463
0.75000 -54952.96042 -126.43209 -4691.17642 13748.99257 12660.99281 1263939.42643
0.85000 -46644.46190 194.85889 11486.65952 10468.47304 9517.36814 1128168.74487
0.95000 -40407.19001 120.64735 12167.12658 8257.08302 7403.32736 960779.60201
1.05000 -35568.12411 -40.83564 -5179.44303 6557.59341 5737.05391 882747.20653
1.15000 -31810.84055 26.39304 3930.30969 5218.03416 4928.27907 801632.96744
1.25000 -28704.69239 -4.40089 -163.28950 4468.84605 3997.34940 667961.03938
1.35000 -26249.77784 73.44830 1157.81245 4201.87052 3460.56430 645364.81698
1.45000 -24016.18954 26.48449 -3993.31425 3338.93961 2910.18644 604042.43159
1.55000 -22234.25313 31.09019 -3685.51126 3158.30079 2792.49662 539454.12361
1.65000 -20617.80468 -9.22579 -2411.29276 2558.36597 2416.89032 520920.16635
1.75000 -19248.13898 29.41675 -2408.87864 2202.60070 1843.37382 468766.79973
1.85000 -18002.79645 -46.42374 10347.56517 2112.27091 2623.10210 436977.00590
1.95000 -16977.04997 -5.69106 -1911.60719 2421.44199 1611.75769 441865.49918
2.05000 -16035.76192 -21.30067 4417.34834 1662.28018 1437.51650 365117.32056
2.15000 -15205.05260 31.94674 -6008.78706 1680.55244 1263.28318 338027.65001
2.25000 -14496.00329 1.76891 2163.86833 3044.05377 1748.67471 335818.83513
2.35000 -13800.97302 -10.05396 421.78366 1557.91653 1293.66268 327833.37744
2.45000 -13191.35674 -3.89936 4064.75561 1316.79196 1063.62130 301175.65208
2.55000 -12670.50856 -20.71988 -2768.38325 1733.17205 1242.64453 285176.58341
2.65000 -12164.65662 -15.09410 -2197.42341 1328.77002 1121.85467 263685.92098
2.75000 -11811.93715 -0.99265 1179.93235 1232.90770 960.20563 257279.24948
2.85000 -11400.74863 -20.89490 1554.95717 1061.03120 878.66809 245237.78008
2.95000 -11046.70878 -16.04036 -3604.37815 1085.42342 920.39797 228451.51214
3.05000 -10751.68017 -25.48981 -19.34836 1536.08187 1309.67388 221027.22777
3.15000 -10432.43526 -9.59005 -1565.87344 1134.74726 866.45784 181066.50239
3.25000 -10162.65299 5.37005 2566.17612 1144.65866 876.95611 186276.41983
3.35000 -9966.60301 -0.73984 3993.57748 1302.71763 904.09567 174605.36465
3.45000 -9695.39004 -10.38903 -416.41397 846.16006 702.03829 164515.32158
3.55000 -9487.49237 -1.97246 -196.81190 1057.35181 797.02651 156684.43220
3.65000 -9345.98598 -12.77628 -5061.55507 851.34312 606.80175 162566.90510
3.75000 -9152.37796 5.74001 -1624.20511 1007.82417 532.70240 146087.18212
3.85000 -9019.11720 -1.50216 1133.38507 789.93899 862.48788 141088.78468
3.95000 -8869.90167 12.83213 -1255.86797 732.03654 983.83857 124704.65083
4.05000 -8731.18403 4.46648 -989.99180 609.90260 585.47847 132753.19813
4.15000 -8602.56046 2.06860 -339.66978 698.60441 824.79218 114387.92413
4.25000 -8485.67977 2.45110 -957.89945 1219.87680 772.09059 108693.31844
4.35000 -8413.91069 11.61086 -299.66107 562.93143 485.80296 119509.79070
4.45000 -8319.42651 14.09792 444.71245 740.55314 830.33566 111505.03543
4.55000 -8243.04970 -11.68128 -2331.11003 1027.98936 608.23642 92812.55401
4.65000 -8142.34895 5.73155 -1378.43910 524.12240 451.57963 94438.47916
4.75000 -8042.69981 6.31906 -1407.43576 710.30800 460.61672 99596.40252
4.85000 -7952.53074 13.40417 -3079.05179 1042.02054 525.88397 88604.67953
4.95000 -7873.77081 5.33942 -667.77827 494.88494 452.07579 87591.12505
5.05000 -7799.59773 3.47277 288.19359 553.40924 679.31590 79870.34269
5.15000 -7738.56054 4.51632 580.52302 498.77512 502.34778 86472.90098
5.25000 -7685.31750 0.71363 138.32977 629.37261 621.25799 72971.34069
5.35000 -7598.90222 3.27701 1243.12086 441.75922 348.77893 95771.35180
5.45000 -7528.45869 4.12082 -291.69768 500.60932 467.55727 67478.54408
5.55000 -7453.65659 -0.74083 -439.01734 407.19576 354.06081 77091.57466
5.65000 -7394.24379 10.75225 -988.72951 481.42782 539.70241 71832.40389
5.75000 -7326.97761 1.70883 -1187.22789 460.07838 392.82349 93821.09956
5.85000 -7259.34212 2.05048 -1850.06506 672.29514 390.43438 63164.68314
5.95000 -7178.63053 7.89644 -2049.61133 339.00980 403.51173 59539.74979
6.05000 -7126.65343 3.86925 -903.74278 889.79704 757.28669 53797.35327
6.15000 -7056.06853 13.67358 -420.99659 344.28489 370.31553 56788.18574
6.25000 -6981.96330 5.54198 -1056.63570 355.52201 384.50676 48123.91003
6.35000 -6905.65373 11.99407 -451.41557 351.49353 314.72301 57716.90228
6.45000 -6843.94041 11.55528 -448.22221 343.44857 360.81526 46091.67157
6.55000 -6765.63828 13.14582 -216.22597 774.78610 1357.25978 59788.92142
6.65000 -6691.42045 11.14720 -731.64756 326.76463 304.89219 52226.19046
6.75000 -6623.29349 12.93381 -709.40575 410.73338 553.19082 50133.43251
6.85000 -6544.40878 16.50661 749.63442 385.00796 284.20534 46696.05066
6.95000 -6487.04158 6.65753 -922.05729 283.70218 341.74779 44858.50082
7.05000 -6413.46173 16.35626 -1544.94394 639.97957 539.13092 49112.36150
7.15000 -6339.54314 12.83100 -433.27604 392.37775 379.65882 46908.52830
7.25000 -6278.66212 14.07301 -789.44169 245.43325 240.66818 48814.79962
7.35000 -6193.12783 5.37481 -1382.79755 1071.83808 329.79789 42359.12538
7.45000 -6142.55945 4.96199 -1914.94696 313.44146 337.23805 71286.33177
7.55000 -6075.91246 9.84261 367.29818 243.59514 206.35127 41107.30603
7.65000 -6013.46191 7.88487 -1004.80376 224.35476 244.26786 45923.81310
7.75000 -5953.01312 6.17035 -911.68148 246.58369 299.17375 35672.59246
7.85000 -5903.12017 18.78147 -131.38300 466.96629 782.33265 35010.84958
7.95000 -5843.50210 9.86706 -832.16098 321.20010 497.66553 35215.36473
8.05000 -5782.86975 5.19454 13.74519 403.91653 453.82118 32364.59960
8.15000 -5731.48958 1.50792 211.70742 341.67713 255.23381 33772.06831
8.25000 -5680.84077 0.50199 -75.87928 298.69839 264.37286 32289.13365
8.35000 -5623.43900 -0.41499 128.95665 244.83900 199.32928 30886.30400
8.45000 -5574.60006 -3.39381 -908.52028 220.18794 206.58639 28252.31162
8.55000 -5530.66715 -2.89664 -115.20270 250.74587 422.19807 26804.78568
8.65000 -5483.35703 -5.19129 -525.15291 544.85508 444.44236 28932.51305
8.75000 -5418.98776 10.09263 -604.83280 452.04402 642.32127 27972.79754
8.85000 -5384.18548 -3.24893 605.30940 229.29537 316.39909 65759.91192
8.95000 -5321.87818 -0.71996 -150.61753 540.87434 514.41215 25211.39604
9.05000 -5303.92590 -11.93354 -648.46199 1502.47504 793.13010 24659.16493
9.15000 -5245.47818 -11.83495 -73.93435 345.06194 422.94826 26531.69507
9.25000 -5195.20021 -2.57179 -667.43328 240.59336 257.75228 23560.40163
9.35000 -5143.69355 1.00444 -44.87455 195.31156 179.55945 23064.75461
9.45000 -5096.59253 -0.26302 -168.65328 294.39473 198.11538 22912.53372
9.55000 -5048.39566 -5.76355 258.79746 274.09452 206.46413 24133.45839
9.65000 -4999.59557 -4.91350 -106.20685 181.07192 183.37169 20065.84268
9.75000 -4963.18194 0.76344 472.04415 193.89218 175.26060 19714.86922
9.85000 -4906.59318 -3.23636 58.00594 196.33984 253.39906 21424.32085
9.95000 -4862.46945 -14.01220 -570.91394 329.36367 872.10055 25712.53884
10.05000 -4823.37404 2.83351 -40.31441 202.06239 190.47216 20343.21707
10.15000 -4776.39657 0.76949 -174.80472 223.51427 367.47623 19465.90717
10.25000 -4728.65924 -1.81910 278.58738 206.58094 307.44861 19232.40043
10.35000 -4687.36067 3.74405 -99.94661 394.67641 158.36201 19025.54939
10.45000 -4655.79264 0.24988 1603.33583 164.58464 172.70768 86921.08627
10.55000 -4612.64078 5.38566 49.76591 147.96916 137.44713 19075.85963
10.65000 -4573.36734 6.90910 147.26833 228.69747 145.00798 15375.46447
10.75000 -4540.84260 -0.08807 -29.45768 192.94988 214.96015 19064.44735
10.85000 -4497.76480 6.75405 26.97267 302.74925 172.22864 14228.33962
10.95000 -4467.40759 1.61875 -17.80893 183.93413 134.66338 18951.64345
11.05000 -4423.62680 -1.82869 463.56464 246.77758 313.03017 18673.18501
11.15000 -4392.83101 0.02063 -257.08928 186.37416 177.11136 16636.51324
11.25000 -4353.40690 2.99220 78.45433 127.07425 122.50978 13384.54324
11.35000 -4300.28187 -7.89834 -414.40640 793.64519 694.46978 13133.84116
11.45000 -4290.59273 4.55682 144.92140 185.69948 627.38136 14872.03590
11.55000 -4249.93609 2.44841 -44.15500 190.17083 159.06049 13886.29027
11.65000 -4204.67517 -0.72374 531.84373 565.86053 202.14795 15485.58287
11.75000 -4178.95928 -0.44114 547.38037 392.56111 259.33294 13863.67563
11.85000 -4145.24447 4.10241 -66.60261 214.32582 172.85242 13552.05794
11.95000 -4110.02114 2.41947 -975.05605 134.79176 109.60559 35014.77488
12.05000 -4075.32316 1.43444 145.36047 144.20014 417.73937 14291.75568
12.15000 -4039.80235 3.95084 -68.65865 149.76011 152.99070 11361.62369
12.25000 -4010.50805 5.54241 15.06123 145.99181 144.40294 13437.39976
12.35000 -3969.33865 2.91010 -269.92747 142.62078 121.93276 13273.41788
12.45000 -3946.82620 2.52534 270.36090 116.89928 103.76404 11399.50988
12.55000 -3913.04475 3.32001 70.46276 148.72812 104.35766 14435.79611
12.65000 -3884.53702 -0.55027 -200.69878 121.32932 113.49638 12092.63310
12.75000 -3834.20924 1.02249 322.04272 749.33816 202.68286 10637.13021
12.85000 -3824.63814 1.44278 312.33352 120.34347 105.74592 9689.13082
12.95000 -3795.54670 2.04060 192.40372 117.80220 123.91887 9268.50523
13.05000 -3760.25164 3.33835 69.78194 106.76566 107.87904 9776.79858
13.15000 -3729.75109 2.42420 428.91117 127.62267 109.16095 9906.93129
13.25000 -3711.44097 12.49894 -221.56088 141.46763 429.04625 9136.92103
13.35000 -3677.74690 -0.09852 -192.99893 272.19883 112.61679 9304.36865
13.45000 -3658.59667 1.49650 -306.68379 118.54923 110.46336 7984.59052
13.55000 -3628.26163 5.78503 457.18361 108.41532 106.86433 9093.29045
13.65000 -3604.80344 -2.17374 194.87810 159.75022 122.93073 8829.66603
13.75000 -3573.56642 2.63191 96.28567 273.53678 114.78062 9188.03970
13.85000 -3543.01598 6.85338 239.83670 181.48957 134.81198 8341.84167
13.95000 -3526.13179 4.26569 -23.02777 121.60846 130.90461 8821.02009
14.05000 -3495.11776 -1.74957 189.61142 132.41332 118.80723 6692.84453
14.15000 -3471.00359 5.10727 -93.30083 101.56545 82.36448 7152.23537
14.25000 -3443.05645 0.46189 220.23028 145.92917 93.11332 7600.31768
14.35000 -3419.09048 0.47312 263.15315 105.65389 82.30519 8364.10669
14.45000 -3387.46973 7.84146 -108.09466 183.17549 306.46807 7281.20165
14.55000 -3371.83464 13.61241 56.07070 251.30325 394.39524 6514.45600
14.65000 -3334.53704 2.87220 298.02350 103.63827 123.81733 7468.33377
14.75000 -3313.22665 -0.60134 232.89553 96.27108 81.97569 6599.46096
14.85000 -3287.51875 2.54808 8.17429 96.53819 80.93750 6069.18425
14.95000 -3254.26331 0.13481 270.23352 124.44656 158.77021 7241.86884
15.05000 -3242.22752 5.30396 -160.61111 220.53071 129.53265 8167.68061
15.15000 -3212.87168 -1.12618 202.87802 92.97809 94.73082 6389.80288
15.25000 -3195.28697 -1.90434 156.93387 201.01598 133.17621 5431.39523
15.35000 -3169.19411 10.23874 -192.59343 101.95508 112.40585 4708.22912
15.45000 -3149.60594 2.46947 119.59418 210.60254 126.91738 6239.03707
15.55000 -3120.89513 1.27185 -192.34421 113.18150 122.02773 5553.85855
15.65000 -3100.61692 6.81611 -146.71221 101.78102 84.97570 6063.44486
15.75000 -3073.46943 1.40766 168.04663 98.36571 80.96521 7138.47641
15.85000 -3063.93033 1.90982 -215.94227 109.62909 96.10954 6675.51292
15.95000 -3033.64056 3.22657 -209.29646 99.69127 84.41434 5544.62965
16.05000 -3011.13698 2.87744 -289.63520 93.50915 86.90933 5881.66249
16.15000 -2993.00154 0.97208 -1.33836 144.96725 127.28674 7158.83683
16.25000 -2974.84154 1.97765 -51.16496 102.77477 84.94127 4751.70574
16.35000 -2953.19228 3.90756 -78.09911 98.83289 103.13115 5857.16775
16.45000 -2927.76683 7.13417 395.43892 152.92868 121.41104 4614.95602
16.55000 -2912.50433 5.28063 -180.98636 99.58262 160.85036 3870.88165
16.65000 -2895.30494 -0.12378 153.78449 94.33520 92.18628 5452.47873
16.75000 -2878.73855 3.70577 -317.27173 101.04105 102.54042 4681.88843
16.85000 -2855.24237 5.80091 2.91225 86.83353 83.13807 4151.04488
16.95000 -2834.64435 4.74519 37.23329 111.56476 98.81026 4563.36131
17.05000 -2809.62028 3.06278 -147.64754 94.27364 74.75966 5035.09474
17.15000 -2793.43495 4.09319 -76.78157 85.64276 83.94371 3699.24457
17.25000 -2765.40211 29.96153 -125.73624 282.68989 633.80165 4673.72181
17.35000 -2760.56711 5.79224 -283.88799 89.58271 69.22791 4441.66439
17.45000 -2746.63620 2.32372 -124.02510 112.84645 123.64896 4147.72072
17.55000 -2725.27067 1.20749 -263.67398 90.39830 78.74679 4122.16393
17.65000 -2714.84463 4.57391 -265.38995 120.03501 72.48075 4192.87040
17.75000 -2694.96454 0.22064 149.60105 82.53747 91.49039 4161.72505
17.85000 -2675.71416 6.24163 -119.07055 95.67631 108.04795 3750.20191
17.95000 -2657.63261 2.33999 -175.96232 84.62668 71.38266 4700.07053
18.05000 -2649.65137 17.06413 130.42433 302.42999 304.96716 3847.49092
18.15000 -2629.34736 8.59422 130.33519 87.01849 71.41661 3667.89881
18.25000 -2611.12613 8.14943 -232.94718 81.79230 67.44585 3755.19278
18.35000 -2595.69013 -0.17801 154.74883 78.14115 78.26357 4268.66515
18.45000 -2579.63970 -1.55369 329.80305 101.30855 165.20615 4370.38695
18.55000 -2556.55803 7.97493 -231.26322 146.90428 109.98536 3445.01300
18.65000 -2547.19863 6.13830 51.30015 74.65949 82.12240 3317.29358
18.75000 -2529.67293 4.23915 97.67787 81.69876 116.34150 3294.45439
18.85000 -2522.27739 -0.38784 120.04894 114.08016 102.94788 3217.19097
18.95000 -2505.46633 6.88615 98.74364 83.63029 96.02496 3816.94279
19.05000 -2489.17741 8.65463 -82.89510 96.37317 93.10073 2881.44329
19.15000 -2475.85041 2.95363 -14.33171 77.48934 92.05755 2916.35731
19.25000 -2457.35791 -7.85013 -416.66519 88.28009 103.97069 5116.11596
19.35000 -2446.33677 -1.72677 243.12564 93.17871 75.43046 3151.42449
19.45000 -2433.52482 4.13150 -234.53162 67.16110 69.74136 3025.14967
19.55000 -2413.91355 -0.73154 -41.31008 70.12175 68.44184 2457.82231
19.65000 -2408.38299 5.57657 -39.71971 67.92756 77.72931 2841.20697
19.75000 -2388.55519 4.54601 -122.94062 76.40313 76.61536 2712.09187
19.85000 -2380.05179 3.35716 -132.39683 84.66689 98.60442 3344.73977
19.95000 -2358.22440 -1.11817 86.86828 66.87584 66.71745 2642.51200
