0.125 -0.007 -0.004 0.036
0.375 -0.010 0.002 0.487
0.625 -0.023 0.018 1.059
0.875 -0.014 0.029 1.477
1.125 -0.026 0.009 1.869
1.375 -0.035 0.031 2.246
1.625 -0.067 0.061 2.758
1.875 -0.077 0.067 3.474
2.125 -0.122 0.079 4.286
2.375 -0.169 0.087 5.556
2.625 -0.178 0.115 6.697
2.875 -0.179 0.115 8.008
3.125 -0.222 0.137 9.185
3.375 -0.294 0.149 10.683
3.625 -0.306 0.190 12.073
3.875 -0.303 0.241 13.562
4.125 -0.360 0.150 15.255
4.375 -0.462 0.200 16.897
4.625 -0.516 0.251 18.609
4.875 -0.494 0.242 19.999
5.125 -0.523 0.272 21.448
5.375 -0.604 0.250 22.018
5.625 -0.614 0.291 23.000
5.875 -0.565 0.269 23.305
6.125 -0.590 0.255 23.905
6.375 -0.660 0.268 23.578
6.625 -0.546 0.269 23.456
6.875 -0.596 0.253 22.994
7.125 -0.566 0.247 23.231
7.375 -0.574 0.248 23.261
7.625 -0.494 0.175 23.209
7.875 -0.530 0.197 23.103
8.125 -0.521 0.197 23.131
8.375 -0.548 0.255 23.856
8.625 -0.519 0.230 24.714
8.875 -0.525 0.258 24.252
9.125 -0.536 0.223 24.876
9.375 -0.544 0.246 25.017
9.625 -0.505 0.308 25.219
9.875 -0.476 0.282 24.864
10.125 -0.495 0.298 23.749
10.375 -0.397 0.285 23.295
10.625 -0.390 0.272 22.392
10.875 -0.392 0.262 21.652
11.125 -0.397 0.301 20.795
11.375 -0.384 0.280 20.023
11.625 -0.338 0.254 19.238
11.875 -0.329 0.240 18.647
12.125 -0.357 0.257 18.249
12.375 -0.320 0.239 17.239
12.625 -0.308 0.237 16.483
12.875 -0.246 0.203 15.460
13.125 -0.257 0.191 15.028
13.375 -0.242 0.193 13.857
13.625 -0.236 0.169 13.491
13.875 -0.213 0.181 12.857
14.125 -0.180 0.180 11.686
14.375 -0.210 0.174 11.147
14.625 -0.161 0.176 10.297
14.875 -0.160 0.140 10.380
