0.125 0.005 0.005 0.081
0.375 -0.031 0.012 0.600
0.625 -0.030 -0.009 1.206
0.875 -0.032 0.005 1.795
1.125 -0.043 0.013 2.200
1.375 -0.022 0.026 2.725
1.625 -0.045 0.021 3.285
1.875 -0.014 0.034 3.997
2.125 -0.058 0.058 5.008
2.375 -0.014 0.050 6.166
2.625 -0.043 0.075 7.483
2.875 -0.089 0.071 8.891
3.125 -0.070 0.056 9.669
3.375 -0.080 0.088 11.000
3.625 -0.090 0.105 12.284
3.875 -0.139 0.135 13.905
4.125 -0.135 0.154 15.727
4.375 -0.176 0.150 17.643
4.625 -0.210 0.232 19.246
4.875 -0.248 0.200 20.052
5.125 -0.261 0.210 21.078
5.375 -0.317 0.225 21.012
5.625 -0.275 0.215 20.900
5.875 -0.303 0.203 21.691
6.125 -0.339 0.211 21.959
6.375 -0.355 0.233 21.945
6.625 -0.342 0.259 22.441
6.875 -0.373 0.271 22.634
7.125 -0.424 0.280 22.373
7.375 -0.371 0.278 22.501
7.625 -0.380 0.293 22.887
7.875 -0.362 0.242 23.250
8.125 -0.415 0.270 23.868
8.375 -0.427 0.330 24.300
8.625 -0.428 0.312 24.179
8.875 -0.457 0.284 23.856
9.125 -0.408 0.268 23.572
9.375 -0.422 0.228 23.386
9.625 -0.406 0.229 22.303
9.875 -0.366 0.236 21.456
10.125 -0.361 0.220 20.230
10.375 -0.364 0.255 19.450
10.625 -0.319 0.206 18.525
10.875 -0.308 0.250 17.402
11.125 -0.337 0.235 16.585
11.375 -0.295 0.199 15.636
11.625 -0.299 0.209 15.136
11.875 -0.296 0.167 14.453
12.125 -0.280 0.143 13.756
12.375 -0.304 0.151 12.994
12.625 -0.256 0.125 12.220
12.875 -0.212 0.089 11.081
13.125 -0.207 0.072 10.265
13.375 -0.197 0.055 9.689
13.625 -0.181 0.053 9.042
13.875 -0.146 0.041 8.668
14.125 -0.166 0.037 8.602
14.375 -0.137 0.036 8.378
14.625 -0.127 0.039 8.428
14.875 -0.124 -0.000 7.913
