0.05000 23546.19451
0.15000 30808.41390
0.25000 29216.57794
0.35000 26505.92116
0.45000 23183.64597
0.55000 20990.82804
0.65000 19268.15719
0.75000 17359.98788
0.85000 15795.86083
0.95000 14528.32469
1.05000 13407.06117
1.15000 12204.74587
1.25000 11442.64083
1.35000 10561.48811
1.45000 10028.59243
1.55000 9422.73438
1.65000 8714.90542
1.75000 8194.66306
1.85000 7632.89717
1.95000 7279.60033
2.05000 7065.92877
2.15000 6564.63944
2.25000 6261.72376
2.35000 5964.00282
2.45000 5696.29351
2.55000 5467.56014
2.65000 5283.72454
2.75000 5158.30407
2.85000 4822.71542
2.95000 4746.84237
3.05000 4492.59639
3.15000 4385.17486
3.25000 4103.58199
3.35000 3997.80335
3.45000 3879.42843
3.55000 3633.32693
3.65000 3561.59818
3.75000 3447.78764
3.85000 3241.91657
3.95000 3178.05247
4.05000 3031.77634
4.15000 2945.36686
4.25000 2812.78852
4.35000 2758.37134
4.45000 2638.23822
4.55000 2568.30224
4.65000 2463.88650
4.75000 2455.23878
4.85000 2310.05643
4.95000 2204.22474
5.05000 2152.70578
5.15000 2072.52625
5.25000 2012.29182
5.35000 1928.42742
5.45000 1802.54664
5.55000 1898.00514
5.65000 1748.04748
5.75000 1696.69970
5.85000 1626.80990
5.95000 1605.53379
6.05000 1532.19254
6.15000 1512.57622
6.25000 1412.32459
6.35000 1416.88771
6.45000 1348.36085
6.55000 1309.36763
6.65000 1283.66893
6.75000 1228.48253
6.85000 1175.23845
6.95000 1166.23780
7.05000 1124.97359
7.15000 1084.48769
7.25000 1054.18662
7.35000 1022.69251
7.45000 976.33767
7.55000 966.60252
7.65000 924.93778
7.75000 926.69401
7.85000 865.21220
7.95000 866.03053
8.05000 830.48416
8.15000 799.45220
8.25000 793.99357
8.35000 792.66118
8.45000 764.33297
8.55000 722.88693
8.65000 701.85086
8.75000 695.49367
8.85000 691.13683
8.95000 673.46877
9.05000 663.93571
9.15000 642.62830
9.25000 612.28639
9.35000 590.18085
9.45000 601.44820
9.55000 611.74461
9.65000 599.45475
9.75000 543.35052
9.85000 544.26757
9.95000 524.10543
10.05000 508.95018
10.15000 516.53884
10.25000 475.37292
10.35000 482.50832
10.45000 486.65235
10.55000 483.02433
10.65000 453.79880
10.75000 472.84872
10.85000 437.01711
10.95000 423.79879
11.05000 438.48282
11.15000 425.43396
11.25000 396.45127
11.35000 403.58982
11.45000 401.60931
11.55000 407.49894
11.65000 381.69231
11.75000 391.79207
11.85000 334.01805
11.95000 357.87375
12.05000 345.83875
12.15000 341.12622
12.25000 354.11404
12.35000 350.77951
12.45000 330.85580
12.55000 325.70470
12.65000 324.62510
12.75000 318.63722
12.85000 307.50833
12.95000 314.66200
13.05000 282.44923
13.15000 297.61850
13.25000 311.57535
13.35000 323.05038
13.45000 270.85497
13.55000 278.67534
13.65000 270.10956
13.75000 276.19946
13.85000 275.36851
13.95000 278.70433
14.05000 257.33401
14.15000 259.48684
14.25000 258.91026
14.35000 266.21732
14.45000 232.14864
14.55000 237.15055
14.65000 259.68409
14.75000 224.70659
14.85000 236.90267
14.95000 241.92172
15.05000 237.85440
15.15000 207.47490
15.25000 220.92781
15.35000 205.54699
15.45000 223.30077
15.55000 218.89223
15.65000 208.05030
15.75000 195.27724
15.85000 182.45803
15.95000 199.95152
16.05000 205.48593
16.15000 194.05859
16.25000 194.93942
16.35000 190.82895
16.45000 192.36913
16.55000 187.04383
16.65000 160.22101
16.75000 157.13828
16.85000 169.45849
16.95000 175.64879
17.05000 159.50408
17.15000 165.57211
17.25000 146.21267
17.35000 157.30920
17.45000 152.13684
17.55000 169.64726
17.65000 182.76707
17.75000 177.33833
17.85000 146.87440
17.95000 170.04170
18.05000 146.40292
18.15000 153.56856
18.25000 155.11176
18.35000 154.09525
18.45000 138.26123
18.55000 151.09886
18.65000 130.87212
18.75000 147.78983
18.85000 121.62009
18.95000 139.94439
19.05000 204.50283
19.15000 142.82888
19.25000 149.17534
19.35000 164.42628
19.45000 146.78004
19.55000 150.80638
19.65000 164.40943
19.75000 146.68911
19.85000 152.24619
19.95000 129.69790
