0.0 0.0698
0.1 0.05584
0.2 0.07009
0.3 0.09626
0.4 0.11332
0.5 0.08523
0.6 0.11162
0.7 0.14295
0.8 0.13377
0.9 0.11641
1.0 0.16298
1.1 0.13035
1.2 0.13181
1.3 0.18227
1.4 0.14185
1.5 0.19772
1.6 0.14995
1.7 0.20685
1.8 0.16856
1.9 0.17266
2.0 0.20515
2.1 0.22312
2.2 0.2306
2.3 0.29367
2.4 0.29209
2.5 0.30217
2.6 0.35548
2.7 0.4044
2.8 0.44827
2.9 0.40841
3.0 0.47112
3.1 0.48203
3.2 0.50826
3.3 0.52841
3.4 0.56113
3.5 0.54729
3.6 0.53949
3.7 0.49989
3.8 0.39928
3.9 0.41349
4.0 0.43487
4.1 0.46961
4.2 0.47261
4.3 0.43691
4.4 0.38516
4.5 0.39503
4.6 0.4422
4.7 0.44492
4.8 0.40728
4.9 0.4284
5.0 0.47924
5.1 0.50818
5.2 0.52563
5.3 0.53253
5.4 0.4946
5.5 0.49609
5.6 0.48851
5.7 0.50503
5.8 0.50791
5.9 0.50589
6.0 0.50213
6.1 0.54591
6.2 0.54379
6.3 0.54381
6.4 0.54304
6.5 0.53233
6.6 0.53955
6.7 0.54201
6.8 0.5502
6.9 0.55879
7.0 0.54433
7.1 0.56473
7.2 0.57598
7.3 0.56852
7.4 0.59184
7.5 0.59914
7.6 0.59315
7.7 0.60473
7.8 0.60892
7.9 0.59933
8.0 0.61992
8.1 0.62101
8.2 0.60134
8.3 0.62885
8.4 0.6309
8.5 0.62984
8.6 0.61737
8.7 0.64852
8.8 0.65047
8.9 0.62263
9.0 0.64848
9.1 0.65645
9.2 0.63525
9.3 0.64652
9.4 0.67358
9.5 0.62536
9.6 0.63776
9.7 0.67303
9.8 0.63014
9.9 0.65144
10.0 0.6212
10.1 0.63299
10.2 0.64972
10.3 0.63465
10.4 0.63995
10.5 0.65679
10.6 0.63943
10.7 0.66781
10.8 0.6401
10.9 0.65259
11.0 0.68233
11.1 0.65716
11.2 0.67149
11.3 0.64728
11.4 0.64848
11.5 0.662
11.6 0.64734
11.7 0.67635
11.8 0.65785
11.9 0.65811
12.0 0.67556
