0.05000 25513.97121
0.15000 53224.37838
0.25000 161185.59090
0.35000 148304.41595
0.45000 70849.86353
0.55000 47277.88069
0.65000 35419.25821
0.75000 29120.69065
0.85000 24111.51770
0.95000 20531.55819
1.05000 17836.48465
1.15000 16112.42809
1.25000 14153.41821
1.35000 13362.43855
1.45000 11799.80223
1.55000 10693.60207
1.65000 9896.79930
1.75000 9048.76571
1.85000 8398.77778
1.95000 7941.34059
2.05000 7428.21473
2.15000 6914.38191
2.25000 6519.16727
2.35000 6079.35042
2.45000 5824.12567
2.55000 5517.08722
2.65000 5343.03866
2.75000 5109.98937
2.85000 4796.49483
2.95000 4447.09320
3.05000 4288.30117
3.15000 4066.50866
3.25000 3915.77969
3.35000 3850.51585
3.45000 3573.11005
3.55000 3539.43796
3.65000 3352.15244
3.75000 3289.67655
3.85000 3175.85635
3.95000 3040.50952
4.05000 2985.45180
4.15000 2855.52850
4.25000 2730.57584
4.35000 2743.70112
4.45000 2631.79943
4.55000 2505.98259
4.65000 2513.22209
4.75000 2403.73026
4.85000 2379.98757
4.95000 2233.44235
5.05000 2199.26435
5.15000 2187.93108
5.25000 2144.69288
5.35000 2061.33047
5.45000 2032.22691
5.55000 1999.25127
5.65000 1976.25427
5.75000 1808.53471
5.85000 1794.74248
5.95000 1784.74924
6.05000 1775.86170
6.15000 1678.97236
6.25000 1645.97143
6.35000 1642.22605
6.45000 1583.86626
6.55000 1535.51319
6.65000 1548.30939
6.75000 1485.25932
6.85000 1462.23991
6.95000 1433.40779
7.05000 1387.00855
7.15000 1372.37857
7.25000 1333.70392
7.35000 1301.45373
7.45000 1287.16586
7.55000 1247.66259
7.65000 1208.15455
7.75000 1166.22401
7.85000 1150.81461
7.95000 1125.43362
8.05000 1113.10896
8.15000 1097.07931
8.25000 1113.29202
8.35000 1044.21966
8.45000 1027.57461
8.55000 1002.54789
8.65000 989.99068
8.75000 964.19447
8.85000 981.37042
8.95000 913.34003
9.05000 912.62773
9.15000 904.26169
9.25000 878.60923
9.35000 831.06767
9.45000 872.79878
9.55000 843.83776
9.65000 805.25897
9.75000 820.21135
9.85000 783.48999
9.95000 775.09505
10.05000 754.84594
10.15000 766.29348
10.25000 737.98246
10.35000 713.68940
10.45000 698.29651
10.55000 738.68368
10.65000 706.71646
10.75000 672.86799
10.85000 657.81182
10.95000 645.58347
11.05000 646.84681
11.15000 628.22578
11.25000 624.54811
11.35000 600.63560
11.45000 580.90817
11.55000 602.32198
11.65000 584.57356
11.75000 570.63509
11.85000 554.36455
11.95000 586.33476
12.05000 554.08182
12.15000 532.92909
12.25000 554.16034
12.35000 517.95586
12.45000 522.47985
12.55000 472.10548
12.65000 490.89755
12.75000 511.25540
12.85000 480.51404
12.95000 479.99966
13.05000 468.12436
13.15000 443.48786
13.25000 455.05240
13.35000 443.65228
13.45000 432.50516
13.55000 417.60606
13.65000 413.24450
13.75000 434.46148
13.85000 432.57672
13.95000 408.22935
14.05000 380.83887
14.15000 388.20756
14.25000 382.88385
14.35000 369.01703
14.45000 364.93454
14.55000 351.71533
14.65000 378.59219
14.75000 356.88524
14.85000 363.96696
14.95000 353.41456
15.05000 337.95300
15.15000 358.92674
15.25000 308.80956
15.35000 305.92740
15.45000 307.96835
15.55000 339.38313
15.65000 312.97258
15.75000 287.31934
15.85000 291.52744
15.95000 290.94254
16.05000 296.09543
16.15000 288.07765
16.25000 317.08763
16.35000 289.28431
16.45000 317.05911
16.55000 266.39358
16.65000 286.66842
16.75000 276.16931
16.85000 253.26222
16.95000 263.95741
17.05000 268.77798
17.15000 250.03934
17.25000 246.49286
17.35000 260.77570
17.45000 254.78573
17.55000 228.95483
17.65000 251.80821
17.75000 230.72254
17.85000 247.29465
17.95000 220.72004
18.05000 220.10496
18.15000 226.30193
18.25000 213.64963
18.35000 216.08319
18.45000 214.05306
18.55000 203.90824
18.65000 198.99832
18.75000 228.95669
18.85000 230.37856
18.95000 195.49677
19.05000 221.54453
19.15000 210.23955
19.25000 208.03350
19.35000 229.74875
19.45000 212.23625
19.55000 207.52152
19.65000 213.06618
19.75000 196.06279
19.85000 215.74709
19.95000 222.76363
