0.05000 0.00000 0.00000 0.00000 0.00000 0.00000 0.00000
0.15000 -13.97134 434.85525 -896111.57847 2504.19776 1307.57579 2647133.17838
0.25000 -837.92012 -222.14278 -598703.27608 2838.58738 1439.20691 2258332.21210
0.35000 31.94483 52.61069 -112611.93191 2765.23477 1479.26657 1723310.60297
0.45000 -872.12985 -134.51931 -130622.05666 2737.03152 1644.91338 1492748.29061
0.55000 -564.05424 33.80740 -139528.23121 2896.29815 1670.26698 955228.98261
0.65000 -897.09652 33.84785 -268293.93471 3581.02440 1974.85327 3531295.22403
0.75000 -779.70913 -272.67277 -24167.09641 2664.07025 1948.95161 1048661.25267
0.85000 -997.73581 -59.38413 -129340.95628 2905.92865 2203.42808 2400451.13657
0.95000 -1074.84185 54.16137 52251.91634 2493.80585 1889.69615 1285249.77628
1.05000 -1305.56107 76.59225 -3079.92406 2398.65200 2016.27503 1730368.38763
1.15000 -1309.97098 -41.64017 31483.19860 2321.12391 2143.92872 1577754.47103
1.25000 -1940.08814 70.78650 45813.33320 1903.12373 2174.74869 1250613.96448
1.35000 -2291.68234 -45.79669 -6319.67383 1541.85213 2055.46107 1360611.12081
1.45000 -2622.89204 -30.30932 43015.79180 1246.21205 2325.57245 1630094.85308
1.55000 -2905.82267 -11.21107 924.25765 1073.15875 2037.54115 1504183.34682
1.65000 -3240.14413 0.08996 5458.48025 758.05860 1758.65156 1291932.72826
1.75000 -3471.67344 -12.07428 54294.02371 876.93786 1777.58457 1260307.64783
1.85000 -3612.98548 -55.85739 -29833.38031 1042.70139 1469.10404 1676444.95686
1.95000 -3696.27620 -27.19399 -16669.65136 585.33157 1426.38456 1856415.81757
2.05000 -3800.91599 11.47301 -3905.63091 747.84789 1684.58731 1721322.80356
2.15000 -3882.12952 -5.43018 36308.29357 1143.37610 1340.89705 2162186.02925
2.25000 -3952.37515 27.18809 -42231.68782 651.58131 1201.72683 1635307.75814
2.35000 -3999.39882 -18.25951 -7683.99626 938.01436 1364.98047 1599532.03410
2.45000 -4055.95862 0.38410 -42513.51188 576.70465 1091.68705 1903324.59599
2.55000 -4083.21075 -10.00981 -31357.08460 720.72977 1181.87897 1866033.72791
2.65000 -4077.73313 11.56137 -32652.33594 468.01497 964.75751 1799412.11621
2.75000 -4095.91207 -16.52736 -52337.74892 420.31550 930.28288 1824841.60827
2.85000 -4104.33643 -12.93969 46204.60164 631.75431 1174.89968 1858700.15076
2.95000 -4099.87652 19.13840 -34214.49895 981.72436 882.95406 1896869.49123
3.05000 -4118.33181 -40.76421 25474.57703 442.63611 941.26299 2310655.00343
3.15000 -4115.68813 -9.36736 -41437.67298 575.04338 779.45759 2084058.14890
3.25000 -4127.06249 13.48327 43499.71567 702.74415 899.79645 2157635.06266
3.35000 -4103.34834 6.37412 -11562.96890 372.74042 946.61544 2091314.48671
3.45000 -4096.33659 -17.11453 1923.32137 431.01250 735.00467 2116957.63822
3.55000 -4106.41274 -33.33100 107785.23393 392.48319 658.35239 2612025.08802
3.65000 -4070.96801 -21.36928 15798.17779 339.28454 705.46749 1875666.35755
3.75000 -4061.48983 14.27088 35478.43831 349.89160 658.06871 1979985.68986
3.85000 -4058.31182 -11.57627 -21780.76415 456.64945 606.31996 2254906.83289
3.95000 -4015.00908 -0.36744 23927.69546 308.99795 579.15952 2417488.11302
4.05000 -4004.58879 14.25364 -36157.82579 559.56464 597.71071 2094386.65800
4.15000 -3971.15894 14.87162 30205.75416 272.97261 525.35197 2374774.83602
4.25000 -3966.49842 14.06032 62513.73197 363.37204 559.95804 2594537.51413
4.35000 -3951.63091 21.06794 124287.22150 358.51317 551.20603 2166755.32912
4.45000 -3931.60374 -8.48277 35615.23846 328.57943 630.58715 1988023.93633
4.55000 -3926.07323 -0.81579 34570.77387 396.46022 542.71593 2489035.39741
4.65000 -3893.39700 -12.50786 51413.08546 595.38283 630.66402 2222467.26873
4.75000 -3875.73062 -3.21023 -51061.47558 286.23538 558.81577 2373732.53829
4.85000 -3859.93723 15.36281 16003.27500 318.57662 466.49084 2367714.23959
4.95000 -3824.95106 6.32878 14244.98120 426.66194 547.37486 2074077.13210
5.05000 -3799.33678 5.25915 -30772.39159 606.97710 600.68037 2261291.59264
5.15000 -3786.04657 -8.64153 -22762.89963 590.71718 462.86920 2375057.73149
5.25000 -3767.06250 4.39979 -2682.51443 295.47335 435.18112 2830875.33456
5.35000 -3743.98238 13.17823 -22022.46235 239.99480 407.31562 2173239.52384
5.45000 -3730.09485 6.04351 -30680.41530 275.74287 403.89128 2162953.31321
5.55000 -3717.38220 8.51141 -58026.23578 269.61015 373.03798 2710444.36575
5.65000 -3696.44197 -8.23133 66639.31786 480.50821 537.52333 2407493.42558
5.75000 -3672.43949 11.21834 35120.39884 227.55390 350.60196 2424015.19241
5.85000 -3659.06424 -5.05938 5335.71349 250.58015 381.82980 2171302.43340
5.95000 -3635.30217 0.36380 59271.61993 234.96630 369.23360 2387351.36006
6.05000 -3609.41362 3.66761 42654.54282 364.67757 397.03194 2133523.86038
6.15000 -3601.44433 -0.82010 -20599.70187 370.27953 364.79960 2573464.92757
6.25000 -3573.00693 -10.54877 144584.85965 308.62162 499.31221 2421892.94786
6.35000 -3568.76075 0.38375 -10853.00335 287.35314 666.27706 2124731.58590
6.45000 -3545.08207 1.04422 -4628.00012 298.92536 391.27130 2186172.10592
6.55000 -3516.84463 2.11325 43077.32476 219.58135 303.69835 2148030.47614
6.65000 -3502.75671 -2.40118 15431.00076 487.96685 662.45380 2222314.26696
6.75000 -3487.98818 -3.70942 41456.83415 230.13971 303.17634 2420584.41843
6.85000 -3471.68780 -4.43095 1132.97981 256.31114 292.87872 2038055.72519
6.95000 -3455.09093 -7.63803 32236.73934 238.55441 384.69777 2298388.50546
7.05000 -3434.92931 -9.06928 -61743.29924 251.96409 309.77704 2730704.97539
7.15000 -3423.32615 16.21402 45144.97638 271.82142 490.97335 2066445.06182
7.25000 -3395.89046 1.04445 30319.62164 239.42868 323.42216 2343806.89160
7.35000 -3384.73559 -7.76407 120198.56568 262.78611 334.44458 2458654.44379
7.45000 -3358.26793 -7.97099 -144197.86336 239.22994 529.20034 2486151.99626
7.55000 -3346.68919 3.07222 15580.97580 469.18919 572.88508 2591793.56841
7.65000 -3325.41112 -9.68778 4516.39225 231.22122 263.67199 2338396.89326
7.75000 -3317.86291 -0.10139 52010.11175 431.36294 320.00673 2327491.53531
7.85000 -3307.33526 0.78054 -11932.23892 260.34633 285.36195 2300881.54598
7.95000 -3285.23506 -2.47655 47904.00036 211.55883 257.02837 2160164.60976
8.05000 -3272.46175 6.19157 4943.95960 258.93308 266.39014 2178280.58168
8.15000 -3252.48316 -4.09021 52311.26253 207.80093 260.83221 2433206.30496
8.25000 -3231.07307 -8.86494 -14751.37309 182.75450 216.71751 2256455.04054
8.35000 -3218.15623 2.20035 -1805.13854 244.04439 303.05998 2302509.98253
8.45000 -3193.94400 7.10577 -10025.59956 256.71978 223.36509 2061383.73110
8.55000 -3182.19910 1.54840 77668.06944 248.79060 232.17381 2521034.60138
8.65000 -3163.31919 -2.33194 72155.39222 256.64686 208.08266 2306871.90867
8.75000 -3145.36020 -0.95838 -105340.18951 191.04680 230.98348 2363283.83248
8.85000 -3132.39154 3.15145 -52181.29484 447.06850 454.72920 2044161.48349
8.95000 -3113.75116 -1.18541 -64133.63020 233.30837 359.42902 2465214.89252
9.05000 -3099.17875 -8.68332 -36126.59497 216.49772 201.78326 2391402.47505
9.15000 -3083.19585 2.30981 -66066.71296 246.35335 501.90578 2261915.32040
9.25000 -3061.25604 1.94841 -22446.08208 198.56111 207.16651 2099270.90540
9.35000 -3051.53874 2.64290 91630.35549 195.98184 210.70208 2190971.74839
9.45000 -3029.21456 -1.82654 -4071.14288 206.03969 210.28358 2187913.23549
9.55000 -3019.02080 -3.78162 21546.20664 195.70038 193.23829 2183269.88983
9.65000 -2997.76542 -1.09568 33333.52789 228.51558 180.28812 2246775.15582
9.75000 -2988.56168 3.04766 -37913.68175 205.42631 209.17936 2259376.62021
9.85000 -2966.49465 -5.63693 4042.96562 219.81766 211.34866 2378520.95494
9.95000 -2955.34528 -1.64084 8441.21331 210.52067 187.61005 2383163.44524
10.05000 -2939.86159 1.86331 -5465.25677 540.57795 236.83158 2455057.25077
10.15000 -2927.75426 -5.56616 38411.19693 344.55273 275.63690 2432718.55779
10.25000 -2914.67621 8.59097 -41223.61014 192.80969 325.14057 2400987.67337
10.35000 -2899.97703 -2.89429 -20809.29851 169.06356 179.59762 2304331.06002
10.45000 -2883.04497 -0.81305 7237.10864 158.63961 173.26089 2098050.76984
10.55000 -2868.17170 0.77764 -8147.55587 174.18037 235.80651 2025797.42611
10.65000 -2853.77132 -1.08707 -26211.21417 155.45912 150.34517 2119759.23229
10.75000 -2839.61211 6.13155 -16890.99850 151.61660 150.98061 2050224.07498
10.85000 -2827.23869 -2.17593 86963.26449 184.79339 157.73082 2292455.91872
10.95000 -2803.98685 3.64507 6100.95672 152.48639 153.31025 2167468.09642
11.05000 -2795.43715 0.42159 57993.75167 231.37137 246.35376 2032018.65312
11.15000 -2780.17577 1.14919 -26544.68235 143.90833 138.15418 2244014.40759
11.25000 -2762.66145 -0.88285 32986.54399 154.22262 138.92164 2058842.65481
11.35000 -2744.73781 0.86206 525.36463 181.98640 181.58442 2003123.90035
11.45000 -2735.12125 2.00918 -84787.05261 162.51867 149.20133 2169618.21197
11.55000 -2718.17377 1.69898 -62999.62336 148.94874 152.76559 2008913.01331
11.65000 -2702.83370 -1.97856 12558.46941 142.42034 142.05324 2221832.54145
11.75000 -2692.06926 0.49984 44889.70674 154.95641 135.90152 2390190.32940
11.85000 -2678.11916 -3.06595 -15580.18543 150.65031 136.51019 2115285.30554
11.95000 -2666.33303 -0.37891 -10853.20345 142.88248 135.45344 2101435.58804
12.05000 -2652.50855 1.44586 -18826.66110 158.15273 592.25141 1861593.42457
12.15000 -2641.01989 1.43547 -101284.45939 146.16370 168.07458 2179929.11698
12.25000 -2623.01435 -1.44351 21273.00336 130.68103 180.07326 2132924.14008
12.35000 -2610.47225 0.58811 -4394.78805 148.76692 279.74472 1915803.64931
12.45000 -2599.92791 -0.34503 33651.13476 140.12411 145.85998 2262776.27248
12.55000 -2584.42219 2.74343 -26990.17423 140.22069 142.51142 2055599.05213
12.65000 -2574.62544 -0.28687 67540.73612 147.65656 159.88457 2259552.03639
12.75000 -2562.39463 1.28575 52654.15746 143.66411 151.38166 2124189.66930
12.85000 -2551.07087 -3.62969 13517.93146 149.68416 131.63367 2071849.52684
12.95000 -2533.49139 2.54928 33145.44165 132.90532 139.26773 1857644.83205
13.05000 -2528.42549 -0.59938 47363.91361 129.44829 145.21889 2146031.89261
13.15000 -2509.44700 0.78884 65727.39077 155.96674 144.83782 2243940.29891
13.25000 -2496.91565 0.45366 -16577.61109 204.51875 163.26185 2016398.00710
13.35000 -2488.00024 2.64418 -66362.38049 143.07799 121.59307 2201150.23748
13.45000 -2478.59399 0.26933 46622.88052 137.24648 114.50886 2107388.26454
13.55000 -2463.79508 -0.00492 -21075.74637 119.11078 112.84664 1901480.09579
13.65000 -2451.12973 -0.19378 -462.36905 132.34752 109.65558 2044692.73989
13.75000 -2441.21044 0.06454 -24148.87015 117.52258 102.67970 2153124.04999
13.85000 -2428.37757 -1.38019 -4435.04092 166.94680 182.73460 2045630.72118
13.95000 -2415.24738 -0.17973 30986.17119 127.04479 113.06290 1957326.18161
14.05000 -2406.75742 -0.12066 -5787.89943 148.76402 123.91468 2221637.42020
14.15000 -2389.87324 0.56721 -4822.07975 200.11405 125.00974 1914783.17734
14.25000 -2380.49327 1.20471 -28017.88031 124.14309 109.64501 2050923.39345
14.35000 -2371.32531 -2.23945 34952.29525 133.21379 104.40434 1910659.24790
14.45000 -2356.95045 1.14370 61000.04406 118.01842 99.30827 2189096.97375
14.55000 -2346.84246 -1.67351 21150.36501 133.64293 106.38409 1912734.86040
14.65000 -2335.12980 1.36959 -34433.85866 113.33172 97.01111 2224514.84817
14.75000 -2326.69804 2.46419 4632.90246 312.03670 189.23782 2007847.34582
14.85000 -2306.98706 0.02852 -35340.09770 140.32459 203.46272 1824825.63108
14.95000 -2302.80671 -1.41684 -11097.14177 118.16901 109.36896 1879484.08334
15.05000 -2293.94372 2.09087 -29700.32491 119.24390 87.62375 1824610.22905
15.15000 -2280.47956 -2.26334 -11260.28587 110.39389 112.79335 2129566.09714
15.25000 -2272.71851 1.76673 -32093.45388 123.45210 98.59535 1879349.15799
15.35000 -2257.85036 0.97216 -11064.25200 269.36445 217.97281 1877656.64246
15.45000 -2249.13835 -0.10251 35080.48712 120.34559 131.73356 1870424.01276
15.55000 -2237.41841 3.04379 20805.87959 111.70918 102.18943 2005703.49719
15.65000 -2226.69676 2.04559 21302.64722 543.40813 356.07650 1985462.28752
15.75000 -2217.61359 -0.96343 35673.96967 100.77545 86.08836 2026634.00954
15.85000 -2208.35443 1.02398 -13321.01398 113.33600 133.53983 1985103.67909
15.95000 -2198.36566 0.27995 23016.19982 105.96362 104.15712 2069022.42058
16.05000 -2189.45492 1.17075 50827.56622 100.84349 81.73025 1827373.79239
16.15000 -2176.86050 -0.32616 5064.05310 100.24257 82.34416 1893423.46482
16.25000 -2170.34781 -0.16191 -79890.74361 137.97018 215.99451 1917082.97943
16.35000 -2159.05389 -0.68705 28502.62959 94.67293 82.17194 2078496.40129
16.45000 -2154.38058 -0.84180 2426.72306 100.20328 89.39250 2095582.58299
16.55000 -2140.11213 0.48748 4555.02091 101.34245 371.28773 1919567.45332
16.65000 -2136.56286 -0.90717 9531.76540 99.42267 106.06961 1896628.95056
16.75000 -2117.77014 -2.74684 -44746.05773 330.50299 188.19452 1889071.71399
16.85000 -2114.04631 3.25518 24528.05813 97.38384 76.56172 1890964.05850
16.95000 -2098.97247 -1.92018 27228.24299 117.23442 90.19626 1814568.73741
17.05000 -2092.62077 2.17844 32046.02427 323.40443 476.96623 1828528.51438
17.15000 -2081.70690 1.84255 15562.16205 119.63007 99.87928 1790455.85966
17.25000 -2074.13447 1.68467 12052.18050 105.22509 72.04309 1708492.16733
17.35000 -2063.95386 -0.51929 -12267.36133 131.80176 128.09197 1908686.09959
17.45000 -2055.56276 0.60050 -54759.44522 105.05121 79.31698 2203736.23531
17.55000 -2046.56873 -0.69855 33562.71768 90.45838 82.27836 1800656.36471
17.65000 -2036.76337 0.13004 -23008.73691 92.95694 123.05666 1800525.32303
17.75000 -2024.53282 -0.79856 26735.19828 85.05609 68.75974 1817468.47213
17.85000 -2016.33832 -0.82812 87573.08475 101.51336 92.13549 1831747.38676
17.95000 -2009.52120 -0.54687 1299.14812 98.73089 77.86600 1924143.39681
18.05000 -2000.25942 1.62701 -41530.81305 86.86073 65.47940 1795644.17147
18.15000 -1993.26946 -0.89104 -63936.16618 83.62815 72.58173 1787156.99110
18.25000 -1984.35774 -0.29894 -17203.94306 93.00393 146.38450 1845302.08560
18.35000 -1970.67174 -1.30316 39568.10947 95.01160 68.26876 1885416.49106
18.45000 -1963.15827 -0.37645 32717.40479 82.17519 68.81196 1815456.84752
18.55000 -1954.78588 0.17287 32266.21914 87.08103 67.71235 1852041.36617
18.65000 -1947.67647 -1.58962 -49050.69223 83.20404 61.80643 1870934.63154
18.75000 -1936.47071 -1.50200 -36749.19750 89.85916 92.62320 1790488.49310
18.85000 -1928.75271 2.65998 36475.87021 91.64768 66.54634 1856652.73387
18.95000 -1923.73631 -0.27407 -57004.86983 102.56181 89.46634 1943834.52033
19.05000 -1912.24118 -1.14471 48678.23054 82.43286 83.48586 1842314.86976
19.15000 -1903.56351 -1.13547 37295.76108 89.70816 73.59400 1766527.59884
19.25000 -1899.66157 0.00025 -18908.33205 86.08072 97.78820 1824977.47965
19.35000 -1885.92908 -1.10665 25955.47510 80.56311 62.70388 1811458.06606
19.45000 -1883.06769 -0.19371 -9994.08759 85.80191 66.30139 1597687.88031
19.55000 -1870.33540 2.16100 32252.84417 86.15162 67.28734 1750721.18975
19.65000 -1863.41643 -0.27446 -4087.31630 78.71832 57.80412 1815020.67302
19.75000 -1854.34706 -0.34758 33326.59529 80.51621 55.65683 1867076.85118
19.85000 -1846.38219 -1.56050 -78312.32689 80.49986 74.95518 1830792.52028
19.95000 -1838.31569 0.23126 4741.30927 89.88794 65.71538 1961681.22829
