0.2 0.16574 19.79273 -0.70325 96.69578 96.09291 72.92653
0.6 0.33572 50.76909 0.49442 98.16728 92.44586 69.77492
1.0 1.35733 71.40017 0.51905 99.93263 85.44162 65.53909
1.4 1.25057 82.34269 -0.37228 100.18995 78.2138 61.61196
1.8 -0.18079 88.83021 -0.00646 99.72114 72.09298 57.7568
2.2 -0.93682 91.77872 -0.38709 97.87944 68.21746 54.87845
2.6 -3.28187 95.44474 -0.44935 93.6865 65.2575 52.19656
3.0 -3.21391 101.57555 -0.47791 87.85516 63.32596 49.35841
3.4 -4.28163 110.6813 -0.88736 80.95002 61.65857 46.99513
3.8 -3.86599 123.87209 -0.57974 72.95937 58.51611 44.78717
4.2 -2.88482 136.23388 -0.70907 65.2209 55.66459 42.65841
4.6 -2.86172 147.62155 -0.76925 58.34123 51.5011 39.84026
5.0 -1.20344 157.76739 -1.09853 52.50329 47.5015 37.64542
5.4 1.09437 166.97313 -0.65478 47.33786 43.0142 35.01935
5.8 2.6744 173.74186 -0.52176 43.04509 38.64958 32.03545
6.2 2.83481 178.54667 -0.32291 40.09101 34.22458 29.62066
6.6 1.6643 184.02544 -0.45704 37.52369 31.26478 27.59748
7.0 -0.4457 189.083 0.51795 34.59995 28.17566 25.45879
7.4 -0.06202 193.38447 0.97596 32.04693 25.628 24.49522
7.8 0.41999 195.15356 1.23954 29.68285 23.29838 22.91298
8.2 -0.11941 196.09671 1.31281 28.23773 22.03537 21.6183
8.6 0.0955 197.45229 1.52318 26.61238 20.95935 20.49337
9.0 -0.08289 198.4534 1.35393 24.97086 20.48328 19.61807
9.4 0.7994 200.18138 0.98635 23.80819 19.72833 18.55809
9.8 0.44259 201.53572 1.42358 22.65291 18.82717 17.56563
10.2 0.28592 202.60546 1.47404 21.88597 18.02199 17.08296
10.6 0.2187 204.08496 1.50126 21.49735 16.98705 16.44468
11.0 0.72183 205.47647 0.89217 21.05872 16.00368 15.8663
11.4 1.28807 205.79695 1.12824 20.38665 14.19939 15.66218
11.8 1.87787 205.08832 0.98052 20.27924 13.18476 15.35384
12.2 1.20655 204.05472 0.79049 19.73647 12.8861 14.81239
12.6 1.5127 202.99531 0.98105 19.21758 12.98291 14.21687
13.0 0.72813 202.74278 0.97508 18.41547 13.06408 13.08909
13.4 0.57129 203.27633 0.59719 16.97016 13.39076 12.73814
13.8 0.33138 203.76016 0.00994 16.16146 13.39433 12.09225
14.2 1.22615 204.54902 -0.16939 15.2614 13.17778 11.48746
14.6 1.34583 205.33324 -0.12067 14.6866 12.61879 10.97619
15.0 1.97934 206.38576 0.22386 13.91213 11.39541 10.93317
15.4 1.44573 206.33614 0.56985 13.55696 10.62416 10.50722
15.8 1.57674 206.52213 0.15805 13.36559 10.89567 9.84572
16.2 0.96411 206.83049 -0.26422 12.51259 10.36411 9.37775
16.6 0.59417 206.97512 -0.5661 12.5058 9.66325 8.99003
17.0 0.3979 206.76204 -0.92233 12.22768 8.80225 8.88647
17.4 -0.07557 206.592 -0.85284 12.1503 8.89926 8.41574
17.8 -0.5899 206.62592 -0.41737 12.02252 8.65292 7.84804
18.2 0.00061 206.43005 -0.79482 11.32524 8.11911 7.62818
18.6 -0.22783 205.76926 -0.26313 10.72732 8.02758 7.23253
19.0 -0.3301 205.75589 -0.44874 10.92639 7.53939 7.20084
19.4 0.68391 206.01582 0.05039 10.1865 7.79602 6.64432
19.8 1.12304 206.4568 -0.18345 9.35762 7.36947 6.82132
