0.120000 2.214510
0.380000 1.896800
0.620000 1.575490
0.880000 1.608490
1.120000 1.779220
1.380000 1.769910
1.620000 1.772590
1.880000 1.768150
2.120000 1.804520
2.380000 1.822820
2.620000 1.712490
2.880000 1.979280
3.120000 1.692190
3.380000 1.769130
3.620000 2.069260
3.880000 1.882790
4.120000 2.137140
4.380000 1.641640
4.620000 1.614700
4.880000 2.357560
5.120000 1.563230
5.380000 1.527850
5.620000 1.329470
5.880000 0.779790
6.120000 0.477020
6.380000 0.098570
6.620000 1.251150
6.880000 -0.842920
7.120000 -3.020380
7.380000 2.928010
7.620000 1.917380
7.880000 2.004710
8.120000 1.905370
8.380000 1.557990
8.620000 1.173050
8.880000 1.050460
9.120000 0.113080
9.380000 -0.129090
9.620000 -0.347800
9.880000 -0.741160
10.120000 -0.559750
10.380000 -0.338030
10.620000 -0.783280
10.880000 0.044830
11.120000 -0.790640
11.380000 2.904650
11.620000 1.598030
11.880000 2.903560
12.120000 2.796770
12.380000 1.607770
12.620000 1.535160
12.880000 0.939530
13.120000 0.237890
13.380000 -0.148250
13.620000 -0.655520
13.880000 -0.203890
14.120000 -0.181940
14.380000 -0.318110
14.620000 0.502170
14.880000 -0.277010
15.120000 -0.350030
15.380000 -2.345270
15.620000 -0.632530
15.880000 -2.116710
16.120000 -1.594680
16.380000 -0.119550
16.620000 -2.265750
16.880000 -1.188890
17.120000 -2.079130
17.380000 -2.226890
17.620000 2.758830
17.880000 -0.670330
18.120000 -0.900880
18.380000 -2.736650
18.620000 1.104520
18.880000 0.452900
19.120000 -0.912640
19.380000 0.611400
19.620000 -2.908270
19.880000 -0.325880
