0.12500 0.01685
0.37500 0.04976
0.62500 0.12101
0.87500 0.17194
1.12500 0.23805
1.37500 0.27947
1.62500 0.31895
1.87500 0.34464
2.12500 0.37983
2.37500 0.41949
2.62500 0.44711
2.87500 0.46305
3.12500 0.49266
3.37500 0.50072
3.62500 0.52324
3.87500 0.53355
4.12500 0.55158
4.37500 0.57650
4.62500 0.57163
4.87500 0.58351
5.12500 0.59923
5.37500 0.60260
5.62500 0.60078
5.87500 0.60488
6.12500 0.58815
6.37500 0.57175
6.62500 0.56524
6.87500 0.55517
7.12500 0.52676
7.37500 0.50673
7.62500 0.45329
7.87500 0.46029
8.12500 0.44509
8.37500 0.42674
8.62500 0.40351
8.87500 0.42146
9.12500 0.40111
9.37500 0.38227
9.62500 0.37193
9.87500 0.33940
10.12500 0.29104
10.37500 0.24753
10.62500 0.17236
10.87500 0.14808
11.12500 0.10377
11.37500 0.07277
11.62500 0.05169
11.87500 0.05642
12.12500 0.04476
12.37500 0.04621
12.62500 0.05733
12.87500 0.06688
13.12500 0.05745
13.37500 0.03413
13.62500 0.03467
13.87500 0.03683
14.12500 0.03166
14.37500 0.02427
14.62500 0.01411
14.87500 0.02313
