0.05000 1118.76677
0.15000 1968.28569
0.25000 3160.54043
0.35000 4227.14144
0.45000 4909.63771
0.55000 5460.37042
0.65000 5832.83222
0.75000 6122.63483
0.85000 6230.95068
0.95000 6140.65571
1.05000 6151.63382
1.15000 6073.20201
1.25000 5977.51820
1.35000 5892.10736
1.45000 5669.70194
1.55000 5516.23701
1.65000 5367.39162
1.75000 5185.46648
1.85000 5059.55409
1.95000 4893.53464
2.05000 4738.59764
2.15000 4646.68415
2.25000 4469.10609
2.35000 4338.00532
2.45000 4259.48820
2.55000 4043.77901
2.65000 4018.68326
2.75000 3810.10551
2.85000 3714.75883
2.95000 3638.45123
3.05000 3514.55443
3.15000 3472.77342
3.25000 3392.76532
3.35000 3238.30743
3.45000 3176.23506
3.55000 3099.43116
3.65000 2981.76780
3.75000 2925.14851
3.85000 2829.35632
3.95000 2737.57279
4.05000 2757.55051
4.15000 2649.96710
4.25000 2651.09874
4.35000 2594.08606
4.45000 2480.04585
4.55000 2426.59781
4.65000 2406.05610
4.75000 2328.75064
4.85000 2326.38896
4.95000 2255.84809
5.05000 2194.22029
5.15000 2103.33277
5.25000 2098.93379
5.35000 2048.52015
5.45000 1949.75354
5.55000 1939.14996
5.65000 1865.64220
5.75000 1835.90316
5.85000 1765.57838
5.95000 1738.79286
6.05000 1705.66024
6.15000 1662.67195
6.25000 1622.13908
6.35000 1578.58571
6.45000 1525.08702
6.55000 1511.68239
6.65000 1449.66228
6.75000 1446.89763
6.85000 1411.02108
6.95000 1362.88366
7.05000 1365.56937
7.15000 1308.76013
7.25000 1287.02809
7.35000 1265.78596
7.45000 1241.19777
7.55000 1187.19904
7.65000 1182.00137
7.75000 1154.56602
7.85000 1128.78209
7.95000 1081.48459
8.05000 1072.20866
8.15000 1067.33869
8.25000 1036.16396
8.35000 1006.71193
8.45000 995.99255
8.55000 955.99922
8.65000 962.11671
8.75000 944.99283
8.85000 921.42986
8.95000 904.20498
9.05000 877.85944
9.15000 847.52660
9.25000 852.71515
9.35000 820.12847
9.45000 806.01453
9.55000 792.36882
9.65000 769.81549
9.75000 761.59244
9.85000 738.31893
9.95000 731.85426
10.05000 714.98020
10.15000 703.44122
10.25000 696.82343
10.35000 669.54020
10.45000 661.54248
10.55000 641.98909
10.65000 638.96107
10.75000 626.81435
10.85000 609.90046
10.95000 595.83788
11.05000 582.18760
11.15000 576.78467
11.25000 571.19743
11.35000 553.86784
11.45000 537.54382
11.55000 520.92938
11.65000 530.42002
11.75000 516.70343
11.85000 498.98114
11.95000 489.69985
12.05000 472.38245
12.15000 474.68979
12.25000 455.07817
12.35000 450.00902
12.45000 453.73488
12.55000 425.15704
12.65000 426.34844
12.75000 412.01402
12.85000 401.21596
12.95000 397.65678
13.05000 399.09543
13.15000 374.47257
13.25000 374.18058
13.35000 379.20869
13.45000 353.00331
13.55000 365.28048
13.65000 349.48305
13.75000 335.50269
13.85000 331.21689
13.95000 324.85469
14.05000 316.17973
14.15000 311.98614
14.25000 307.28236
14.35000 301.90023
14.45000 297.67663
14.55000 287.64826
14.65000 288.64472
14.75000 277.76110
14.85000 284.52490
14.95000 269.17125
15.05000 266.75157
15.15000 258.97636
15.25000 256.15826
15.35000 249.30287
15.45000 241.42694
15.55000 245.68152
15.65000 239.99529
15.75000 232.34646
15.85000 236.88697
15.95000 219.68308
16.05000 228.21790
16.15000 221.99052
16.25000 215.59286
16.35000 207.52542
16.45000 211.69202
16.55000 210.03781
16.65000 205.51635
16.75000 202.63318
16.85000 203.62986
16.95000 203.75731
17.05000 195.16898
17.15000 185.74539
17.25000 183.71417
17.35000 182.42611
17.45000 181.58375
17.55000 169.19440
17.65000 181.57940
17.75000 168.55185
17.85000 166.33800
17.95000 163.99772
18.05000 158.18624
18.15000 154.62816
18.25000 150.75328
18.35000 153.20825
18.45000 153.44391
18.55000 142.65351
18.65000 147.96564
18.75000 145.97398
18.85000 141.81311
18.95000 130.35914
19.05000 137.07195
19.15000 127.91653
19.25000 135.39423
19.35000 135.90558
19.45000 133.46941
19.55000 124.75079
19.65000 122.93520
19.75000 123.86926
19.85000 121.94320
19.95000 113.95631
