0.125 0.000 -0.000 0.001
0.375 -0.002 0.000 0.033
0.625 -0.009 -0.003 0.183
0.875 -0.003 -0.012 0.511
1.125 -0.016 -0.003 1.081
1.375 -0.021 -0.013 1.836
1.625 -0.016 -0.006 2.821
1.875 -0.030 -0.005 4.025
2.125 -0.032 -0.036 5.304
2.375 -0.056 -0.019 6.842
2.625 -0.078 -0.002 8.155
2.875 -0.099 -0.018 9.806
3.125 -0.125 -0.034 11.317
3.375 -0.144 -0.023 13.016
3.625 -0.143 -0.062 14.392
3.875 -0.200 -0.075 15.766
4.125 -0.191 -0.074 16.971
4.375 -0.177 -0.116 17.830
4.625 -0.121 -0.089 18.904
4.875 -0.156 -0.143 19.497
5.125 -0.200 -0.141 20.602
5.375 -0.207 -0.140 21.417
5.625 -0.220 -0.168 22.134
5.875 -0.239 -0.210 23.726
6.125 -0.181 -0.186 24.010
6.375 -0.244 -0.187 24.782
6.625 -0.233 -0.141 24.871
6.875 -0.185 -0.173 25.520
7.125 -0.139 -0.136 25.357
7.375 -0.180 -0.149 25.899
7.625 -0.115 -0.195 25.275
7.875 -0.180 -0.134 25.644
8.125 -0.147 -0.196 25.492
8.375 -0.180 -0.150 25.092
8.625 -0.172 -0.156 25.217
8.875 -0.153 -0.128 25.110
9.125 -0.153 -0.124 24.546
9.375 -0.149 -0.130 25.089
9.625 -0.154 -0.118 25.183
9.875 -0.140 -0.134 24.743
10.125 -0.105 -0.079 24.590
10.375 -0.107 -0.105 24.685
10.625 -0.068 -0.043 23.814
10.875 -0.135 -0.059 23.587
11.125 -0.071 -0.048 22.348
11.375 -0.110 -0.040 21.982
11.625 -0.097 0.003 21.272
11.875 -0.156 -0.017 20.608
12.125 -0.111 -0.020 19.619
12.375 -0.163 -0.015 19.647
12.625 -0.126 -0.039 18.579
12.875 -0.172 -0.033 18.126
13.125 -0.105 -0.023 17.691
13.375 -0.098 -0.058 16.451
13.625 -0.106 -0.072 16.863
13.875 -0.108 -0.057 16.327
14.125 -0.114 -0.080 15.822
14.375 -0.111 -0.048 15.113
14.625 -0.117 -0.032 14.619
14.875 -0.123 -0.088 13.560
