0.05000 13486.51881
0.15000 21250.57810
0.25000 27805.15920
0.35000 31960.84183
0.45000 32287.92487
0.55000 30932.14353
0.65000 28726.02328
0.75000 26037.98317
0.85000 23603.52520
0.95000 21353.67042
1.05000 19285.44689
1.15000 17512.41106
1.25000 15689.49500
1.35000 14187.68500
1.45000 13317.87852
1.55000 12242.01233
1.65000 11216.06686
1.75000 10536.46763
1.85000 9816.41445
1.95000 9147.70035
2.05000 8599.59889
2.15000 8293.82000
2.25000 7699.30687
2.35000 7220.81499
2.45000 6957.75142
2.55000 6653.55573
2.65000 6375.49306
2.75000 5995.87942
2.85000 5789.54100
2.95000 5544.38424
3.05000 5414.67619
3.15000 5036.24333
3.25000 4963.16853
3.35000 4713.31466
3.45000 4506.11851
3.55000 4364.66162
3.65000 4119.09886
3.75000 4041.95461
3.85000 3856.17363
3.95000 3698.64536
4.05000 3545.52432
4.15000 3378.39204
4.25000 3296.92512
4.35000 3089.43794
4.45000 2983.42062
4.55000 2927.35953
4.65000 2784.49061
4.75000 2663.82387
4.85000 2618.19631
4.95000 2460.53938
5.05000 2382.38512
5.15000 2260.31796
5.25000 2194.20642
5.35000 2098.02748
5.45000 2006.77344
5.55000 1917.31076
5.65000 1858.97535
5.75000 1847.78080
5.85000 1757.19801
5.95000 1696.63883
6.05000 1673.70481
6.15000 1593.70397
6.25000 1554.84093
6.35000 1509.15293
6.45000 1463.48773
6.55000 1429.88698
6.65000 1428.79225
6.75000 1369.07306
6.85000 1325.65715
6.95000 1263.37602
7.05000 1276.86945
7.15000 1218.75223
7.25000 1213.50485
7.35000 1180.53439
7.45000 1155.81576
7.55000 1146.64090
7.65000 1080.23375
7.75000 1053.34854
7.85000 1055.41292
7.95000 1025.11501
8.05000 987.11810
8.15000 962.50657
8.25000 965.91928
8.35000 912.45233
8.45000 954.19088
8.55000 900.51583
8.65000 886.75889
8.75000 870.71256
8.85000 846.82952
8.95000 806.55349
9.05000 807.21557
9.15000 789.10364
9.25000 783.03019
9.35000 759.22907
9.45000 759.70920
9.55000 745.73273
9.65000 715.74529
9.75000 717.76437
9.85000 706.16460
9.95000 683.33820
10.05000 672.32076
10.15000 657.56702
10.25000 665.44462
10.35000 649.89973
10.45000 646.35894
10.55000 627.18068
10.65000 623.41565
10.75000 600.82121
10.85000 600.85307
10.95000 605.63934
11.05000 579.68998
11.15000 571.74366
11.25000 578.80085
11.35000 576.14891
11.45000 545.98049
11.55000 545.46842
11.65000 537.65647
11.75000 531.77929
11.85000 520.13483
11.95000 504.21556
12.05000 491.20587
12.15000 480.82385
12.25000 479.98428
12.35000 473.95346
12.45000 461.75457
12.55000 444.75278
12.65000 449.46368
12.75000 440.75995
12.85000 426.08517
12.95000 423.79907
13.05000 424.10260
13.15000 411.37525
13.25000 410.98891
13.35000 404.17869
13.45000 396.88639
13.55000 385.82354
13.65000 389.94316
13.75000 376.17081
13.85000 366.04784
13.95000 361.99831
14.05000 351.77244
14.15000 348.88402
14.25000 337.58276
14.35000 328.22674
14.45000 323.00373
14.55000 325.32168
14.65000 320.95696
14.75000 311.55068
14.85000 308.95126
14.95000 300.42779
15.05000 290.10171
15.15000 293.88290
15.25000 286.50227
15.35000 282.86233
15.45000 274.90079
15.55000 266.05614
15.65000 265.98146
15.75000 258.02807
15.85000 256.27092
15.95000 248.16591
16.05000 250.38415
16.15000 237.00814
16.25000 238.42485
16.35000 234.98578
16.45000 222.53438
16.55000 226.42027
16.65000 222.42913
16.75000 217.39235
16.85000 213.97671
16.95000 206.77687
17.05000 206.30806
17.15000 204.04530
17.25000 202.43396
17.35000 197.05139
17.45000 191.60778
17.55000 194.71423
17.65000 184.34003
17.75000 184.45801
17.85000 177.69196
17.95000 176.37915
18.05000 172.98881
18.15000 165.18290
18.25000 159.37361
18.35000 165.33014
18.45000 163.06485
18.55000 147.77662
18.65000 155.30296
18.75000 147.41197
18.85000 147.89212
18.95000 147.18275
19.05000 145.58749
19.15000 143.25720
19.25000 142.45072
19.35000 143.45839
19.45000 133.70267
19.55000 132.65789
19.65000 126.17926
19.75000 128.99352
19.85000 122.08826
19.95000 117.35483
