0.05000 -14021.04973 2787.12124 -250889.00940 172542.70625 210706.02528 4425154.47908
0.15000 -155331.01343 1498.85979 -21215.08440 112336.79751 198583.47762 4414637.36807
0.25000 -171530.98269 -108.00525 -29209.04434 70954.31622 80646.89713 3203801.03966
0.35000 -121593.08583 228.75863 -27948.13458 35096.96171 36722.89366 2512761.63725
0.45000 -91815.22465 -158.47978 -39410.91002 20412.01325 20203.36206 2003185.81172
0.55000 -72736.54603 64.84795 -5800.92522 13957.18170 13107.53140 1657054.67455
0.65000 -60031.79806 -10.45369 17797.46940 9857.78923 9689.56888 1427734.32024
0.75000 -51012.41221 82.64891 6938.23227 7587.13630 6824.85181 1264924.19341
0.85000 -43945.42443 56.35492 17744.86167 5676.88722 5069.52041 1152689.43894
0.95000 -38600.32139 108.88535 6605.92416 4343.36439 4052.05479 959112.45575
1.05000 -34447.69025 -86.06229 -124.89129 4827.53814 3983.82895 841567.19617
1.15000 -31002.30440 54.64745 2846.59401 4813.35331 3061.11918 764655.87565
1.25000 -28113.64520 13.94596 7410.95613 2681.81703 2417.13554 736541.82747
1.35000 -25759.73673 1.47811 2461.97519 2332.96403 2114.66543 663702.69131
1.45000 -23834.43161 -7.15834 -8907.10254 2171.82400 1953.59248 599676.44416
1.55000 -22025.11087 -18.52248 -6119.03976 2376.35007 2025.32366 544140.58693
1.65000 -20552.98841 9.90538 -3875.50435 1838.11102 1929.47502 482084.52221
1.75000 -19203.47972 -7.41651 3199.21774 1524.20518 1272.58954 485185.18097
1.85000 -18095.95328 4.03780 -11732.29811 2077.26370 1358.86931 446467.86847
1.95000 -16994.55556 -58.82993 -8468.69688 5746.91902 4043.78684 398529.04644
2.05000 -16174.01044 13.85837 150.04355 1086.16506 1009.13613 388933.21762
2.15000 -15377.81460 17.18950 1475.37385 1224.18399 1258.01747 360592.22496
2.25000 -14634.21764 25.37307 -5232.79606 1702.81156 1121.64792 359192.35090
2.35000 -14016.96113 -16.81338 -6527.82423 901.04039 873.49740 299606.40061
2.45000 -13418.07573 6.72899 276.18885 1005.08075 1031.53334 286290.05998
2.55000 -12891.94968 -8.60940 229.44359 1120.03059 881.80404 262877.35412
2.65000 -12411.72259 -6.85799 496.84230 1255.92654 803.40753 256132.31963
2.75000 -11960.35559 14.32057 2178.83393 923.29660 1082.04437 248001.08348
2.85000 -11558.26531 -27.13446 2485.07565 900.56401 2501.31845 243579.06092
2.95000 -11196.86646 3.54161 -2993.40909 799.75699 1417.04996 197796.12482
3.05000 -10846.00701 14.02792 -1662.97582 964.86774 831.37477 204228.04833
3.15000 -10545.24938 18.77830 3120.46228 1312.74228 1367.84100 180128.68780
3.25000 -10226.29809 19.14439 -2118.82964 689.98621 574.88001 171531.37499
3.35000 -9912.61333 16.81798 1744.86915 1224.47924 1048.12204 166022.93428
3.45000 -9679.49291 18.04834 -390.82106 681.50432 681.34206 142794.90307
3.55000 -9463.70776 15.33884 1680.88087 652.92995 644.19070 135798.56423
3.65000 -9250.84614 11.95700 -384.88745 545.28926 559.82156 133656.26929
3.75000 -9046.91628 23.11771 2277.08840 644.82487 667.56261 129625.53453
3.85000 -8856.72679 6.82936 1373.83025 1167.76183 1417.39185 117825.87924
3.95000 -8687.26832 13.53332 1265.68814 514.37616 545.38026 124857.70248
4.05000 -8529.04029 13.75872 -996.75594 740.46601 644.17818 106508.43620
4.15000 -8374.91608 17.69989 -880.20755 468.10430 466.79013 103328.41863
4.25000 -8243.52900 18.38220 -992.40763 518.52517 569.40090 100773.74236
4.35000 -8118.12341 17.09929 -21.15345 515.13687 532.40177 89328.49555
4.45000 -8024.75872 11.78551 1381.54547 580.28070 616.55094 87422.09824
4.55000 -7919.74911 5.31379 336.38245 370.03993 381.01672 78595.25004
4.65000 -7824.24171 3.42754 -1090.86966 600.53230 930.51107 80880.07521
4.75000 -7754.97905 12.40715 -811.97302 602.65557 500.94357 69992.77400
4.85000 -7689.30494 -4.37237 113.59390 540.27342 480.54288 73929.94911
4.95000 -7610.60242 0.35896 436.23674 338.98226 377.11043 109246.94838
5.05000 -7532.04513 5.99804 -828.61147 367.76657 367.97306 79393.20061
5.15000 -7456.11905 18.69807 -1075.87300 444.20076 961.46610 63322.86405
5.25000 -7389.34232 6.25554 -843.98989 407.41502 395.43445 68079.07945
5.35000 -7321.93197 -7.57594 -288.85956 972.94814 956.71288 57514.77983
5.45000 -7260.23298 6.73794 -1549.83872 488.88024 512.65157 58036.69568
5.55000 -7173.63623 9.97350 -1067.12721 435.64178 448.73308 58926.67845
5.65000 -7101.13772 0.45322 -1399.36728 409.01033 369.01076 50509.61466
5.75000 -7014.33393 3.74192 -661.69918 422.49639 376.67941 50193.63771
5.85000 -6946.75917 1.41861 -25.74704 840.25034 1487.51669 48992.86372
5.95000 -6884.46177 8.11616 -1286.03008 455.66022 420.99519 51528.23530
6.05000 -6834.76183 17.52074 -1568.35209 341.99048 467.46201 53236.89716
6.15000 -6757.19189 14.83642 -515.14511 343.25815 469.58125 47042.85637
6.25000 -6692.48518 3.76246 -252.37152 369.69143 494.84420 45745.43268
6.35000 -6624.66557 1.28279 119.61259 368.91736 418.07006 41064.84629
6.45000 -6558.33645 -2.17095 -67.25478 264.86820 260.68372 41562.48381
6.55000 -6498.52012 1.15730 618.57190 368.25640 493.80516 58407.20057
6.65000 -6441.24978 -4.62100 -1053.54396 284.62878 371.80253 37278.34098
6.75000 -6366.56276 5.20306 42.87980 273.89948 290.91233 39144.69820
6.85000 -6306.21907 -3.22629 -1008.46644 499.33735 624.57301 35590.95459
6.95000 -6238.28809 -0.97693 64.60725 295.46308 345.93941 41018.17533
7.05000 -6166.20609 4.91048 1259.60052 407.51750 211.30687 81025.31221
7.15000 -6102.97374 1.57848 -1160.92309 544.71363 704.73462 31927.82516
7.25000 -6027.86586 0.90670 -266.35420 221.37174 210.15941 37117.09753
7.35000 -5972.15855 8.10586 -264.38382 273.77339 253.78069 32932.37135
7.45000 -5905.38207 4.54156 -84.24641 277.22267 216.43186 29660.21887
7.55000 -5837.11127 7.41934 -580.18836 345.86947 258.42890 29743.92507
7.65000 -5784.84172 7.90117 669.55017 998.03516 1096.44770 25445.93330
7.75000 -5720.88832 3.94229 -859.36848 258.02094 237.25429 28459.00552
7.85000 -5663.24662 10.12240 123.58316 268.23467 234.98874 27744.24867
7.95000 -5605.36500 6.80511 753.41773 1147.50955 478.45663 42505.52856
8.05000 -5556.45236 13.76011 -159.06420 534.57277 722.61821 25902.45588
8.15000 -5483.77041 1.02213 -98.79321 502.72898 402.18153 33817.11205
8.25000 -5439.90083 2.99338 247.14721 204.72463 186.77958 21492.39865
8.35000 -5386.48403 6.49488 371.02385 209.44989 234.52738 23444.02095
8.45000 -5339.68285 4.75052 686.50665 153.06979 210.80608 23548.53514
8.55000 -5293.39699 6.55689 225.87219 192.70246 169.42123 24368.58182
8.65000 -5249.15781 1.56508 367.99700 396.10976 377.44235 21714.83524
8.75000 -5200.19511 0.32517 642.67653 294.87148 278.16404 21569.45135
8.85000 -5150.51402 1.08002 390.91989 199.15625 284.55023 21639.95897
8.95000 -5101.29291 11.61866 434.70824 241.30096 249.76692 20998.82730
9.05000 -5121.89529 -20.03480 203.74688 4142.42721 1645.03138 21420.18193
9.15000 -5002.90035 16.58764 521.15715 494.38100 400.57055 22650.74192
9.25000 -4965.96111 11.40839 424.81491 202.78608 300.91944 17005.12526
9.35000 -4928.54097 7.62361 502.41585 213.32256 208.61975 18012.39742
9.45000 -4878.28561 3.65456 375.28348 204.77754 179.90463 48552.34274
9.55000 -4843.28910 7.81672 601.29660 227.80354 138.01012 15764.74927
9.65000 -4797.87589 8.64512 544.26365 156.43989 128.71198 17854.69588
9.75000 -4760.19065 3.17721 697.28691 232.54830 378.84320 17383.65573
9.85000 -4719.60849 7.25072 390.50925 144.01738 127.36028 22008.45573
9.95000 -4686.24488 6.16695 998.19776 126.61035 125.27957 50761.15924
10.05000 -4646.96654 5.68039 454.64945 225.89815 158.17438 17523.05428
10.15000 -4573.25725 11.70470 679.86166 1615.66054 607.62747 16180.18591
10.25000 -4571.93048 13.01364 807.14629 201.03743 322.72552 16700.11785
10.35000 -4534.34078 5.85643 368.66051 113.26076 140.24228 17488.36019
10.45000 -4503.50684 6.54184 229.49910 163.69396 147.29689 13727.74277
10.55000 -4462.20490 7.20363 221.07164 310.31954 394.88406 11965.33512
10.65000 -4433.41272 7.23163 244.75253 196.75461 149.04248 13852.88833
10.75000 -4398.81049 3.97041 440.86645 133.14105 134.69858 11627.56770
10.85000 -4363.90019 1.12510 116.80467 268.31828 207.89217 12619.30975
10.95000 -4326.64022 3.00683 439.77264 134.97288 151.81475 14948.74751
11.05000 -4286.51117 6.12364 287.22198 164.85726 134.01254 11532.94209
11.15000 -4256.05360 3.81570 296.65019 131.28940 146.43581 10695.79798
11.25000 -4221.80575 1.45508 167.20235 158.09343 262.27970 12907.72262
11.35000 -4189.40430 -1.55345 -24.20778 119.40544 164.80935 8465.41444
11.45000 -4150.99839 -0.52488 162.91425 304.15635 167.28736 11760.86888
11.55000 -4121.81545 -1.17513 194.80532 101.96918 139.72433 9895.64710
11.65000 -4088.08377 5.02497 29.73472 133.49963 106.57261 10203.18921
11.75000 -4057.70086 -0.03562 -7.75786 116.39877 141.30066 9563.51073
11.85000 -4023.27749 1.17213 5.23609 101.83271 109.73411 9273.52616
11.95000 -3987.53371 -0.83728 122.63196 131.12428 132.81176 11182.51904
12.05000 -3952.68119 1.00682 96.76564 203.86587 153.74456 9126.21607
12.15000 -3921.44577 0.66580 -117.71101 93.71038 132.82460 8957.64598
12.25000 -3893.88643 5.33962 54.82071 96.38083 128.96050 7892.74683
12.35000 -3865.80008 3.21419 -125.36385 102.38142 124.81006 9842.51336
12.45000 -3832.43821 3.87108 236.25488 102.16517 100.46136 7996.02868
12.55000 -3800.25089 4.96315 334.19859 110.49163 102.36608 7799.56097
12.65000 -3766.71541 1.17563 117.36619 163.38321 153.28212 7662.06880
12.75000 -3740.56635 3.15743 -159.15278 103.40856 120.21224 6980.80012
12.85000 -3707.84621 2.95325 37.80620 115.49312 114.19696 7497.14454
12.95000 -3677.10778 1.10409 -96.06323 113.20246 96.55066 7193.29726
13.05000 -3645.55081 6.22285 -29.43197 104.79872 90.20646 5982.14689
13.15000 -3616.17221 2.99328 -290.19460 101.69418 89.04892 7800.21945
13.25000 -3586.39963 4.72185 -152.82969 107.29329 125.52009 6445.24910
13.35000 -3558.76282 4.59307 13.50713 116.88665 153.04419 6744.71564
13.45000 -3531.99117 4.54409 50.03491 85.87403 101.42498 5752.74216
13.55000 -3501.98342 2.66592 -20.42197 64.71877 68.71086 5716.24301
13.65000 -3475.35315 2.36760 -45.30846 79.67444 91.22320 5578.82454
13.75000 -3448.17660 3.21589 -142.66076 68.62519 84.54138 5609.66013
13.85000 -3418.06664 -2.73971 -157.17754 147.09573 172.78094 6771.11256
13.95000 -3415.56090 4.66805 -131.91065 539.84536 247.78184 5448.33958
14.05000 -3372.91712 0.80897 -570.52948 65.72712 74.08849 7424.16568
14.15000 -3347.68609 3.44853 -82.11818 124.85273 86.77474 4572.73075
14.25000 -3316.80927 -1.71574 -149.92721 95.83836 78.49517 4800.67110
14.35000 -3295.16614 4.07428 -33.62685 56.81932 64.38472 4662.81062
14.45000 -3272.13196 4.68324 -3.84251 59.09745 68.69475 4424.70705
14.55000 -3246.74371 4.90192 -133.29704 64.47069 89.85766 4445.40804
14.65000 -3220.94325 5.20529 -298.14906 62.10520 64.32472 4909.78262
14.75000 -3194.40124 7.37352 5.53797 67.87595 78.11952 4441.51731
14.85000 -3172.14216 8.20608 -95.34807 79.45189 133.54998 3859.91970
14.95000 -3153.39518 3.85360 -412.77270 62.77708 62.47491 5181.73628
15.05000 -3129.77995 2.25855 12.03605 75.81672 72.28859 4047.57840
15.15000 -3104.74061 1.68453 51.26911 59.38375 115.00720 5265.83624
15.25000 -3080.77656 3.12846 -6.64576 69.08350 61.20780 3646.48506
15.35000 -3062.27540 4.57524 -118.37687 57.93083 77.97388 3613.93249
15.45000 -3034.58961 2.42743 162.99526 70.21979 251.61896 4890.59545
15.55000 -3016.08038 2.83927 -193.78061 45.57269 48.83014 4132.48251
15.65000 -2996.96058 7.97672 -39.96861 69.65793 74.00575 3480.87556
15.75000 -2971.90328 3.62357 -222.41109 69.10733 58.89054 4020.78921
15.85000 -2952.23268 1.34541 -117.38499 74.10278 69.85159 3412.27313
15.95000 -2931.65700 5.57723 -221.23586 87.24079 169.17333 6914.29921
16.05000 -2909.40498 -4.53219 28.24154 183.83076 150.40520 5380.50419
16.15000 -2893.59482 3.52940 -161.12744 128.68692 102.59383 5264.81896
16.25000 -2873.30547 4.31701 -90.81361 60.68174 62.50695 3910.58092
16.35000 -2850.59281 -0.14151 -8.91399 52.22643 50.74819 4794.00182
16.45000 -2830.76461 9.54975 -139.65543 146.84106 208.05427 3885.99706
16.55000 -2816.31129 3.32135 53.55984 74.45764 57.46763 4688.49255
16.65000 -2793.01976 1.88371 -185.32504 65.42662 60.86938 4126.11015
16.75000 -2777.26083 -0.26824 49.75916 64.86155 65.15984 4162.15486
16.85000 -2760.68474 4.76603 -121.57281 43.54973 50.14806 4322.26486
16.95000 -2739.59790 2.59569 -296.37705 72.20379 50.55156 4073.40192
17.05000 -2725.23966 2.24031 -339.44369 40.36982 43.51598 3435.10704
17.15000 -2707.91849 9.83235 -139.61916 112.30874 118.43101 4136.78479
17.25000 -2688.44078 0.57830 -33.83038 55.76850 39.96906 3015.68246
17.35000 -2673.15463 1.72537 -119.64746 107.91942 73.61204 4074.42621
17.45000 -2652.11384 2.32508 61.50232 69.01620 54.25009 4084.06088
17.55000 -2641.90764 0.95964 -196.25009 44.42526 49.57753 4413.71357
17.65000 -2624.84017 2.17671 -507.34267 56.96638 52.52590 3983.21364
17.75000 -2605.97150 3.77812 -374.51842 50.61676 43.43979 4264.01095
17.85000 -2589.17460 3.56796 98.16090 42.66027 42.26593 3709.52603
17.95000 -2576.07978 2.10581 -120.19752 50.47585 59.07536 3155.74714
18.05000 -2556.06434 1.86692 322.99265 115.94691 55.37291 3521.20436
18.15000 -2570.17724 -16.96177 -229.37153 469.20231 442.05529 3222.32470
18.25000 -2528.57733 -0.79096 -241.05353 49.34703 62.72610 2906.79244
18.35000 -2509.99016 3.21027 -158.17568 152.51254 243.11708 3685.50698
18.45000 -2492.34715 4.93461 -132.35566 44.43710 57.53553 3490.54223
18.55000 -2473.04504 1.09576 -55.25579 147.30409 59.73810 3645.08688
18.65000 -2468.09708 2.75551 32.73661 39.15996 37.15536 3091.33569
18.75000 -2455.53795 1.02423 -91.96404 76.47971 42.56898 2835.83703
18.85000 -2433.28816 1.64136 -37.40557 50.20406 54.87421 3038.32547
18.95000 -2422.63267 2.61363 -255.62382 54.52720 42.97459 3693.17188
19.05000 -2407.38711 -0.11313 -276.01692 53.14334 63.20104 3463.86357
19.15000 -2394.65234 4.04218 69.93593 49.88342 49.49336 2847.16384
19.25000 -2384.64052 8.76836 -218.50320 55.18346 86.25456 2470.74405
19.35000 -2368.43050 4.06827 -5.84714 47.91349 46.69422 2729.42638
19.45000 -2353.12518 1.23469 100.61435 40.04158 42.65227 2139.49781
19.55000 -2335.97876 4.87809 -112.84519 56.87575 55.53708 2829.67867
19.65000 -2319.23075 2.78622 38.91426 117.26545 154.07289 2465.49392
19.75000 -2309.58123 3.07211 256.34377 80.32707 55.91517 2748.31568
19.85000 -2291.57209 3.38624 -225.32135 41.82570 42.43847 2567.34575
19.95000 -2286.31308 -5.22410 -112.08655 50.94149 117.26532 2012.48124
