0.05000 -1833.46691 152.25367 64468.81152 1829.46886 1200.72896 852794.74798
0.15000 -3589.74448 39.98757 -23057.22442 1891.18531 1191.11468 599806.69911
0.25000 -5359.51688 87.42995 64142.16762 1889.43999 1301.25751 746652.52422
0.35000 -6883.21208 57.32264 15856.93616 1911.41026 1542.45740 684272.09608
0.45000 -8036.48357 114.48629 10591.58062 2069.35754 1759.67860 603074.33649
0.55000 -8854.50365 124.36224 8979.72879 2135.65955 2018.73819 601123.73522
0.65000 -9535.83922 161.21976 19390.61741 2220.82406 2162.03066 601200.68524
0.75000 -9888.73737 222.39240 1224.70900 2249.91320 2359.28624 578592.26867
0.85000 -10204.96089 192.21262 3477.98234 2228.40944 2489.16621 575976.79183
0.95000 -10352.29422 203.30793 3010.63446 2181.45180 2608.61081 563791.94851
1.05000 -10413.81446 267.25021 -322.78575 2147.62501 2699.77428 517589.19654
1.15000 -10417.19214 155.82228 -3074.74259 2072.67713 2788.68310 514099.55947
1.25000 -10352.25706 227.52485 -562.35208 2001.76395 2856.17289 487675.09408
1.35000 -10231.64668 210.05621 -3435.14115 1923.15373 2907.86231 478411.84877
1.45000 -10136.83500 249.82272 -19382.97271 1830.62558 2945.60315 444611.62119
1.55000 -10010.31554 262.30705 -12288.94922 1740.74248 2953.01889 422337.77471
1.65000 -9828.15465 149.13954 -2718.71993 1631.65085 2992.69422 394959.31348
1.75000 -9742.37719 158.85071 -7305.29087 1522.18482 3011.59644 377876.23462
1.85000 -9635.17097 120.70767 -1381.42338 1407.96494 3045.72697 372280.44290
1.95000 -9518.22640 122.87372 -7160.11519 1296.21012 3007.13169 358594.55346
2.05000 -9398.96549 185.28043 -7355.08066 1183.60914 3049.20369 334818.14910
2.15000 -9331.72611 159.48224 -9895.72040 1084.60077 2999.19057 353410.70990
2.25000 -9210.63989 125.44816 -2474.90427 999.85875 2995.39395 315957.75654
2.35000 -9076.55299 74.07156 903.18589 949.64467 2967.75314 295705.99547
2.45000 -8967.00054 59.36847 -8827.58463 866.48046 2962.98513 281394.84979
2.55000 -8854.75740 83.16175 -13284.01152 787.04401 2923.67857 298021.53714
2.65000 -8736.76089 -19.98251 -9282.31434 714.71680 2943.30876 277972.46027
2.75000 -8662.56706 43.13370 -4793.38571 669.44990 2851.63991 259614.32146
2.85000 -8549.64231 45.70635 -2387.98081 627.97939 2819.85553 250843.82585
2.95000 -8432.79429 62.18433 -10780.82230 591.96843 2777.98776 225810.77602
3.05000 -8333.79364 78.82146 -3281.12803 552.14040 2761.28740 231741.95974
3.15000 -8240.80849 28.48437 -4101.03243 493.57198 2728.37278 215023.38308
3.25000 -8159.04388 38.91061 -477.01671 452.80701 2676.30694 215266.56268
3.35000 -8067.26975 36.32565 -3534.23712 421.42627 2600.11093 204003.01589
3.45000 -7972.92922 45.46251 -8849.54310 396.07648 2573.10723 188917.25521
3.55000 -7880.54549 -37.79483 -9653.40746 362.29736 2537.12926 205275.35058
3.65000 -7776.37969 51.82493 -5828.52496 343.49686 2449.64072 183679.80001
3.75000 -7697.37555 32.51458 -1976.93746 325.07122 2452.16825 170590.92581
3.85000 -7616.43752 -12.55944 -4230.33385 328.26044 2406.68007 170857.03429
3.95000 -7542.42410 3.05433 -5521.57865 335.96486 2321.84841 146628.98352
4.05000 -7455.66720 25.30558 -4798.52553 344.66664 2274.45067 148142.71707
4.15000 -7383.79797 33.00288 -2842.37779 342.67229 2230.17160 157949.22507
4.25000 -7311.98143 87.10565 -4336.94599 359.12463 2170.85269 139915.02826
4.35000 -7245.83700 6.72718 -3817.26436 388.03053 2136.84792 141354.06073
4.45000 -7160.97607 41.53539 -5926.56319 414.70526 2057.31020 135941.84638
4.55000 -7099.51706 18.17112 -3868.79278 439.71006 1999.17729 140387.25012
4.65000 -7019.84864 21.19621 -2989.93292 464.52577 1949.58825 117681.22249
4.75000 -6965.37758 -17.23980 -4755.61901 481.59620 1899.35455 115525.07699
4.85000 -6893.80498 -19.88533 -5378.47347 502.18041 1847.65370 122145.24813
4.95000 -6834.84558 -12.44197 -1840.07397 531.88293 1768.76170 115884.72844
5.05000 -6774.15667 -8.70541 -7154.60746 554.81811 1733.69979 109354.02714
5.15000 -6704.83204 0.07905 -3229.64360 571.59455 1659.52910 118940.62999
5.25000 -6645.58196 -0.95001 -5019.51681 589.68506 1606.39060 97796.22339
5.35000 -6596.54944 -16.96175 -5359.41267 595.70275 1565.31851 104020.75999
5.45000 -6541.92012 -12.21497 -3702.68401 617.96836 1509.60133 87881.57971
5.55000 -6509.12277 6.86721 -4199.52187 628.63086 1476.49873 126673.74489
5.65000 -6460.76216 25.50543 -2854.60118 637.94812 1427.88754 124531.47144
5.75000 -6391.21715 26.23557 -3314.26032 644.69682 1360.63862 79949.83442
5.85000 -6335.01059 15.96972 -3517.66455 658.53774 1297.97185 76728.71339
5.95000 -6301.27723 40.06269 -4450.42026 663.17048 1264.83731 115993.19302
6.05000 -6274.50913 21.77397 -5277.78807 671.94131 1221.78400 74186.00292
6.15000 -6236.60234 45.89491 -3317.71026 684.27636 1170.11024 74202.31939
6.25000 -6197.73405 28.50049 -2075.44125 685.37336 1130.36850 67356.38165
6.35000 -6163.89471 26.73404 -1839.28719 699.51405 1078.62040 65370.08127
6.45000 -6133.52619 80.90539 -2568.39692 706.64494 1050.90951 64158.72300
6.55000 -6106.46273 54.96049 -2841.52756 727.57810 992.71024 62217.95810
6.65000 -6097.19014 51.07492 -1130.92199 732.03097 963.72514 75587.69432
6.75000 -6073.16096 84.50322 -2400.03944 738.79413 927.03822 58943.87894
6.85000 -6053.77913 68.09098 -1042.07038 746.80930 876.23367 56999.55053
6.95000 -6042.37379 48.48586 -2103.77977 756.07929 838.23180 53364.92547
7.05000 -6011.85251 58.97409 -1847.36014 761.61343 804.52280 51656.37170
7.15000 -5966.11445 51.87083 -1207.41999 766.99823 758.90681 50834.83243
7.25000 -5930.89938 51.71945 -2063.56194 762.28149 721.36808 52800.56901
7.35000 -5889.93519 53.80340 -2364.57038 753.63797 683.20402 49428.65283
7.45000 -5844.10204 57.91902 -1943.34103 750.13985 651.80425 45332.97032
7.55000 -5790.59217 43.60675 -1705.55719 726.23147 620.60803 49609.81013
7.65000 -5716.45583 60.76304 -1033.98634 702.27640 583.95840 48896.66648
7.75000 -5684.09814 48.07932 -2709.02579 695.42718 552.43875 39166.14813
7.85000 -5638.84525 49.93783 -936.06923 672.00016 530.67310 40556.66424
7.95000 -5569.68888 47.70055 -83.18768 636.79919 502.57931 31307.76638
8.05000 -5522.70557 51.46526 -1155.44492 627.18946 473.87444 34444.36073
8.15000 -5461.18856 44.99140 -706.92858 599.03400 452.32569 35270.17556
8.25000 -5397.09575 66.54361 -886.82835 581.23550 425.93687 37376.76016
8.35000 -5341.95260 62.62516 -688.10596 551.24971 404.68738 35314.44688
8.45000 -5306.68476 53.33936 -423.70022 527.99326 394.76363 33159.13664
8.55000 -5229.52471 58.86658 -135.93859 505.24927 368.16750 29946.17954
8.65000 -5197.92123 58.24413 -1115.68103 484.06492 353.60420 30690.56088
8.75000 -5136.27050 55.48727 156.81872 464.38461 339.13603 29485.30497
8.85000 -5101.88039 61.04381 -712.36525 446.82635 322.89289 33057.64912
8.95000 -5051.55075 61.54684 -660.35216 436.70181 306.94688 26064.21615
9.05000 -4991.10208 50.58287 -351.11849 411.59723 294.67179 29866.45240
9.15000 -4947.82146 45.76807 -182.50026 390.19149 282.00624 26871.01847
9.25000 -4903.05598 49.15592 -355.81044 367.15475 270.04650 25602.89925
9.35000 -4869.90988 47.25105 -202.67518 347.92814 259.93692 24677.92736
9.45000 -4843.19461 50.41314 -1249.41495 332.88601 253.17581 26001.42980
9.55000 -4798.47265 45.44376 -548.20335 323.89713 239.95013 22886.72659
9.65000 -4758.86136 42.44153 -1077.42812 314.20781 230.51070 35014.40324
9.75000 -4726.32870 39.78090 59.43464 300.56562 221.60997 23248.56147
9.85000 -4682.17536 36.68009 -510.11211 284.72865 216.24467 24843.58012
9.95000 -4644.82042 41.45252 -330.61292 272.26032 204.79026 21121.62703
10.05000 -4617.25765 36.63287 351.80051 258.88672 200.09906 24473.22851
10.15000 -4582.29344 36.98362 64.65263 251.46601 192.97721 19094.27620
10.25000 -4539.03996 31.80907 66.29419 236.81579 186.40900 20030.83378
10.35000 -4511.69104 26.58547 191.92797 226.76319 183.05448 18916.12823
10.45000 -4477.42604 30.17000 -131.41525 221.95475 176.31457 16593.49216
10.55000 -4443.58637 25.27844 -64.32821 218.40868 170.29162 18495.12578
10.65000 -4403.19273 30.27094 -135.53840 212.39840 167.31459 20243.00371
10.75000 -4366.32988 34.27880 -217.97124 205.19355 161.23609 16349.93501
10.85000 -4330.59845 29.04738 212.14341 203.83387 154.38182 15784.71517
10.95000 -4294.42662 26.15952 185.18528 200.10911 150.49565 17245.31292
11.05000 -4265.22889 28.64401 -272.23494 195.11598 146.94804 15108.64975
11.15000 -4235.33148 24.55672 247.31022 195.48985 142.28604 14175.25654
11.25000 -4205.10471 29.45478 -56.92912 191.15755 138.21547 15773.69508
11.35000 -4164.45098 29.74987 105.13844 186.24199 133.97496 14379.34265
11.45000 -4139.38986 25.63806 517.76658 188.60241 129.49724 13563.15055
11.55000 -4107.43631 20.52571 263.81358 190.51533 123.66243 13384.51193
11.65000 -4061.64951 26.54505 378.32146 185.97642 121.12304 15887.35176
11.75000 -4030.98193 27.16211 -344.74215 180.67572 115.08386 10274.65822
11.85000 -4001.07518 24.47672 -73.36182 180.13996 111.47439 12724.36141
11.95000 -3971.26946 23.37338 -342.76832 176.06200 110.85721 11424.96433
12.05000 -3941.08184 22.48009 -56.02300 173.49812 105.36860 11546.15615
12.15000 -3913.64209 20.85681 -159.30019 175.92946 103.53533 10338.54820
12.25000 -3871.08049 22.67623 71.15035 165.67273 99.31532 10036.39119
12.35000 -3850.09246 24.80825 -252.54786 166.03035 96.50722 9934.80359
12.45000 -3817.47422 20.29576 -17.18963 162.31653 93.00461 8132.45136
12.55000 -3779.58556 23.61094 -318.86132 161.36666 89.49771 10995.40357
12.65000 -3750.75488 23.63336 -312.98788 156.28584 87.98490 10857.27252
12.75000 -3707.51680 24.04503 329.78982 152.57300 84.96396 10411.63305
12.85000 -3689.82070 22.42587 -102.61670 155.34975 79.40093 9366.55837
12.95000 -3655.41933 21.85633 -77.92781 154.21765 79.98819 8820.15183
13.05000 -3621.89286 20.99097 81.72408 147.21488 75.43819 8966.79341
13.15000 -3599.08476 20.52746 4.82061 144.98078 72.66838 9236.34734
13.25000 -3562.70983 23.91278 -369.21260 141.66219 70.12609 8263.74371
13.35000 -3531.35802 23.21932 -164.42498 136.33937 69.82389 8455.84378
13.45000 -3507.58697 22.31558 54.29400 135.36351 65.54031 9105.48623
13.55000 -3487.03293 23.87391 37.49367 130.34563 65.46920 8082.87782
13.65000 -3459.74351 23.17128 -163.70563 125.98916 63.94123 8073.05972
13.75000 -3431.40516 21.75669 -125.68303 123.63853 61.21452 7448.98706
13.85000 -3404.33916 22.66182 18.80026 121.66037 58.93858 7058.95956
13.95000 -3377.56508 22.69253 -82.48966 120.41505 57.67795 7294.26959
14.05000 -3352.04084 20.47407 248.62650 113.26654 56.99881 7452.63976
14.15000 -3330.78226 19.62754 -57.36388 107.13872 54.82676 7084.56583
14.25000 -3312.68553 20.45405 -90.20453 107.24711 53.51473 6458.43170
14.35000 -3283.48465 20.14410 151.21037 104.20553 52.18887 6872.25009
14.45000 -3262.03054 19.30607 268.69710 99.34473 50.56226 9367.41890
14.55000 -3242.63959 21.22281 -158.50495 96.16987 48.79549 6107.73720
14.65000 -3223.43986 17.93062 -457.73515 91.66309 47.81992 7780.97301
14.75000 -3199.83645 18.91500 -88.89747 87.49178 46.08226 6587.16097
14.85000 -3178.23498 18.92898 -383.79498 82.92691 45.00381 6561.27565
14.95000 -3161.27974 16.93293 -98.10475 82.09889 44.09321 5788.10220
15.05000 -3139.64629 17.02674 -154.68131 77.79545 44.69479 6439.26505
15.15000 -3120.44618 18.01683 26.10309 74.68696 42.26676 5516.47818
15.25000 -3101.40100 17.64584 -73.37700 70.99100 41.32949 5483.42729
15.35000 -3084.21459 16.69440 -241.75295 67.46250 40.15305 5074.61033
15.45000 -3062.07062 17.21334 89.17561 63.92173 39.42273 5522.97835
15.55000 -3045.24295 17.69872 52.08661 64.96171 39.53804 5071.62105
15.65000 -3024.80093 16.26860 -176.86267 61.09572 38.92267 4992.63812
15.75000 -3004.42248 15.02948 -273.32291 59.38948 37.83275 5882.48600
15.85000 -2989.32300 16.59421 -17.32091 57.72231 36.31814 5113.79431
15.95000 -2970.19779 17.90059 152.35812 55.96453 36.82372 4487.57999
16.05000 -2951.99680 14.69878 -14.15472 56.57677 36.07394 5327.52747
16.15000 -2937.49169 14.80286 82.23199 55.73097 35.57664 5272.10961
16.25000 -2918.24555 14.46174 8.41508 52.76840 34.38141 4403.71806
16.35000 -2900.96528 13.66671 -90.13384 51.22409 34.56035 5544.14083
16.45000 -2884.29729 13.94719 -116.38358 49.76229 34.11279 4813.07359
16.55000 -2863.45405 14.81046 -61.75734 48.19444 32.34793 4201.52930
16.65000 -2849.02579 14.44815 61.40530 46.89418 32.63439 4261.95414
16.75000 -2832.12781 12.21561 -114.18341 44.47206 31.58127 4073.55780
16.85000 -2817.40884 13.11640 -35.47017 44.66658 31.56507 3567.43543
16.95000 -2800.94438 12.49063 -20.71371 42.30082 30.98300 3052.61031
17.05000 -2785.01034 11.77620 -169.97991 41.37100 31.61364 3625.41716
17.15000 -2764.21030 11.92891 -6.99824 42.13397 30.40813 3457.38914
17.25000 -2747.30869 11.22710 -28.70953 39.28853 28.96932 3738.61305
17.35000 -2726.68863 10.84635 -4.18209 35.86738 29.24528 3626.20868
17.45000 -2714.96772 12.01498 -102.96309 37.76411 31.03866 3679.82589
17.55000 -2696.11568 12.06504 -96.43387 35.68628 29.21680 2894.89301
17.65000 -2678.93679 10.89192 70.09355 34.78982 28.50928 3770.85559
17.75000 -2662.87399 11.92140 -196.50292 37.16476 28.13841 3418.12829
17.85000 -2645.74513 10.53198 61.59278 35.05788 27.28305 2964.40116
17.95000 -2631.20841 11.09627 7.73862 33.47920 27.92386 2698.65235
18.05000 -2611.53759 11.86034 -81.53067 32.37747 27.09631 2525.93420
18.15000 -2596.46517 9.99643 120.40295 33.52365 28.92095 2745.85257
18.25000 -2581.80648 11.89691 58.78575 33.04347 28.99399 2289.30941
18.35000 -2567.03729 12.23143 57.66246 32.53799 28.38398 2727.18212
18.45000 -2551.70494 9.43122 212.15185 31.47970 27.55193 3407.80313
18.55000 -2538.54775 11.80018 5.79806 33.12798 28.16004 2383.56284
18.65000 -2521.55581 10.81046 -52.32373 30.34225 25.74493 2290.51401
18.75000 -2506.99494 8.18490 122.41680 30.77701 27.56658 2691.69439
18.85000 -2492.53979 10.48221 201.84503 29.37924 26.80508 2310.63332
18.95000 -2477.68100 9.76700 16.08021 28.59825 24.97304 2661.00975
19.05000 -2461.43976 10.41539 -216.67014 29.12177 25.45989 2356.47906
19.15000 -2447.34487 9.32999 209.86399 30.07832 25.51591 2279.75611
19.25000 -2431.22880 10.88134 -105.77310 29.50371 24.45396 2851.71466
19.35000 -2421.07171 9.90333 53.21318 28.01700 23.61099 2225.62709
19.45000 -2407.43075 9.71352 20.86398 26.93450 23.98334 1573.49105
19.55000 -2393.33025 11.70018 -4.79496 27.66421 22.59405 2612.70056
19.65000 -2379.02319 8.81865 208.57320 28.37399 24.41515 2412.61424
19.75000 -2367.35435 9.70097 -58.19028 28.99541 23.99258 2400.42348
19.85000 -2353.06705 11.89716 83.41037 29.40282 23.86501 2428.61445
19.95000 -2340.22378 13.57437 8.62520 28.26678 23.29584 1731.82561
