0.120000 0.430590
0.380000 1.808790
0.620000 -0.421010
0.880000 0.145240
1.120000 -0.225710
1.380000 -0.248470
1.620000 -0.500980
1.880000 -0.410470
2.120000 -0.300000
2.380000 -0.577900
2.620000 -0.694650
2.880000 -0.809290
3.120000 -0.767130
3.380000 -0.827240
3.620000 -1.387990
3.880000 -0.838300
4.120000 -1.548560
4.380000 -1.797110
4.620000 -0.940380
4.880000 0.353970
5.120000 1.952070
5.380000 2.103520
5.620000 2.229070
5.880000 0.800750
6.120000 -0.065830
6.380000 0.329160
6.620000 -0.141460
6.880000 0.546510
7.120000 -0.026420
7.380000 -0.310130
7.620000 -0.261700
7.880000 0.344680
8.120000 0.256520
8.380000 -0.212450
8.620000 -0.508430
8.880000 -0.964440
9.120000 -1.275300
9.380000 -0.852060
9.620000 -1.209600
9.880000 -0.920640
10.120000 -1.872620
10.380000 1.068200
10.620000 1.361880
10.880000 0.238370
11.120000 0.485230
11.380000 1.147640
11.620000 0.120990
11.880000 -0.239420
12.120000 -0.350430
12.380000 -2.136010
12.620000 1.416200
12.880000 2.738190
13.120000 -1.152080
13.380000 1.974450
13.620000 2.868010
13.880000 -0.109860
14.120000 2.080470
14.380000 -2.395450
14.620000 -1.521020
14.880000 -3.011100
