0.05000 -178079.31057 2361.53031 -25048.26204 119647.00179 142227.35447 177176.13643
0.15000 -110884.53146 244.65287 1902.59665 49172.32998 30678.74514 91591.75523
0.25000 -67833.72536 93.44610 569.96295 22647.68068 11580.07031 52811.54542
0.35000 -50195.01775 149.05359 1382.84805 15752.09388 6651.48548 39871.71132
0.45000 -40420.71680 27.94727 255.08109 12205.28684 4802.17891 32023.53417
0.55000 -34374.93582 46.63518 516.23103 9856.70722 3553.46248 26666.26270
0.65000 -29962.23413 34.12547 128.13970 8313.63920 2616.42972 22791.39306
0.75000 -26615.89487 18.70752 530.07841 7157.44900 2410.29772 20135.36420
0.85000 -23986.26614 46.66740 283.92836 6374.94824 2086.08440 17869.07804
0.95000 -21890.42607 8.33658 311.35899 5682.53528 2108.66449 16056.30708
1.05000 -20208.66110 28.91112 158.08928 5096.10498 1773.50775 14577.23052
1.15000 -18829.51466 30.15451 76.67916 4517.65749 1586.35307 13346.55945
1.25000 -17560.12547 18.59201 50.66765 4120.48932 1437.48888 12332.23020
1.35000 -16496.95428 4.01740 95.31450 3783.51687 1595.20463 11380.08531
1.45000 -15528.66514 8.16723 19.77650 3427.87165 1309.34889 10684.10559
1.55000 -14709.73243 7.21546 -88.89529 3509.57039 1791.70690 10081.58387
1.65000 -13961.30283 29.85149 -53.00705 2983.10660 1214.23826 9444.23768
1.75000 -13273.88496 42.41540 141.05895 2843.97422 1477.66591 8951.00558
1.85000 -12719.27414 -8.05936 -7.21782 2529.55662 1362.92498 8419.47934
1.95000 -12163.52429 10.29972 2.68336 2346.21929 1141.92025 7982.36203
2.05000 -11634.79890 -2.51473 87.73693 2188.09873 1075.63397 7627.92185
2.15000 -11189.90748 4.71321 70.05914 2224.53669 1071.16789 7291.15332
2.25000 -10815.12849 4.27038 66.85763 1936.31781 1071.06397 6942.17850
2.35000 -10422.61337 14.81226 -7.48462 1838.27188 970.25009 6630.57969
2.45000 -10140.53069 -10.20644 83.56659 1745.76874 1011.65949 6297.72930
2.55000 -9843.51644 15.63613 105.71781 1456.22485 958.66104 6018.85361
2.65000 -9567.87934 2.42943 45.80391 1343.28034 937.22388 5807.09188
2.75000 -9305.68051 -17.14573 18.67640 1444.03789 1420.66422 5660.76918
2.85000 -9110.53276 25.19208 18.92213 1209.29657 861.33384 5287.54410
2.95000 -8921.66924 20.69521 -97.68470 1123.22955 852.48529 5087.44023
3.05000 -8717.70769 5.76788 74.44369 1015.19061 806.67661 4813.47063
3.15000 -8555.20133 29.76381 70.59286 924.17715 809.74738 4577.22284
3.25000 -8397.76528 10.33819 66.62369 943.91289 832.59665 4426.83691
3.35000 -8257.10958 18.27704 -9.69447 819.42428 837.17124 4218.98049
3.45000 -8104.23523 15.32618 -43.48283 892.23897 887.22915 4020.32265
3.55000 -7972.71352 12.87549 -21.16929 706.60269 675.18440 3797.84165
3.65000 -7864.01899 6.65622 4.29111 795.31483 778.20970 3675.91275
3.75000 -7761.35413 8.39406 49.53493 723.89436 954.91755 3511.17884
3.85000 -7655.50860 11.94636 -8.74037 753.92180 649.74564 3370.86006
3.95000 -7570.49671 4.17142 30.70570 1142.89498 874.60480 3262.75554
4.05000 -7470.21848 13.49128 -3.05257 735.79820 753.49099 3170.66253
4.15000 -7395.83099 -2.61270 28.38522 722.51696 768.78876 3120.71948
4.25000 -7320.29835 -9.00627 27.89778 697.75678 706.99309 2944.81056
4.35000 -7254.59846 -0.41627 -18.09160 1065.01543 715.79241 2906.91972
4.45000 -7182.35918 0.14405 12.01267 813.78044 580.54039 2835.50048
4.55000 -7124.98294 2.09269 74.84558 491.01229 481.28075 2730.35736
4.65000 -7069.36477 -2.00541 20.78378 684.75328 557.68225 2682.69002
4.75000 -7013.47993 5.70591 6.84001 495.83661 503.72675 2597.36723
4.85000 -6964.82238 9.00525 -24.81109 526.61804 519.32388 2573.25195
4.95000 -6922.10474 0.69620 13.85616 658.87209 480.48670 2544.57672
5.05000 -6876.58803 4.73542 4.29048 506.24946 488.18220 2472.31412
5.15000 -6837.47945 4.02687 30.34209 757.92526 482.00580 2408.04772
5.25000 -6782.74485 7.42415 7.10798 595.39849 510.52271 2332.60396
5.35000 -6736.59798 7.63032 -26.27798 701.80132 506.20550 2347.70073
5.45000 -6688.10025 11.45038 7.97475 680.00772 488.02705 2252.44681
5.55000 -6647.55689 7.48697 -6.71692 441.68999 364.97246 2201.16400
5.65000 -6604.52034 4.34376 13.89998 487.79283 440.90464 2139.38143
5.75000 -6560.87469 8.60692 -11.78147 513.45826 452.85877 2098.31425
5.85000 -6525.18845 6.23115 -9.34168 473.85540 405.85321 2034.64665
5.95000 -6483.69456 5.56932 -40.01387 435.15882 296.07924 1992.19248
6.05000 -6433.87024 6.73586 -31.48444 468.12290 299.67276 1957.87831
6.15000 -6397.63283 3.81606 -33.53682 523.09928 279.19408 1918.19132
6.25000 -6344.13448 7.91485 -53.70849 444.44153 396.89050 1884.19508
6.35000 -6304.19242 9.83302 -14.61048 392.53991 433.54692 1829.64890
6.45000 -6254.90391 12.93868 -36.32884 623.50107 474.51943 1839.08828
6.55000 -6204.95050 1.20131 -32.33957 594.19153 427.78829 1884.48519
6.65000 -6158.70312 3.58062 -20.90610 622.00978 430.99462 1718.15112
6.75000 -6114.13181 11.00496 -5.15123 716.66483 653.97706 1682.53311
6.85000 -6073.07507 2.43715 -38.18731 489.83631 587.17914 1646.16055
6.95000 -6035.17693 0.21977 -47.43748 510.43704 383.10904 1605.61642
7.05000 -5982.13703 8.96479 -63.93615 418.10931 327.46887 1566.08952
7.15000 -5945.82529 -0.67670 -41.09249 615.14256 365.19788 1605.07538
7.25000 -5899.91511 6.49106 -41.61745 327.71815 229.66646 1522.95893
7.35000 -5857.94189 5.22887 -46.01177 415.85867 345.65130 1476.55837
7.45000 -5808.54825 9.80467 -30.18655 287.82800 418.56121 1481.32788
7.55000 -5761.02688 9.37175 -35.25866 313.89749 308.43013 1442.50021
7.65000 -5720.01339 9.67612 5.45461 305.03417 292.16141 1430.71668
7.75000 -5673.97384 4.87028 -27.93569 309.90525 246.82047 1351.52557
7.85000 -5628.70724 9.54491 -36.36023 258.87372 209.42183 1306.44337
7.95000 -5586.99284 7.94824 -19.67001 444.44893 284.88838 1263.71546
8.05000 -5541.34455 7.11882 -21.38784 322.86675 262.41014 1357.54374
8.15000 -5497.58825 10.08763 -23.82843 263.13223 255.68240 1227.87673
8.25000 -5454.01336 4.44329 -15.78829 325.35095 228.23516 1200.85861
8.35000 -5407.72314 3.96577 -17.17321 247.02277 159.55539 1163.94587
8.45000 -5368.44397 8.65664 -8.37346 201.18198 146.57704 1126.29176
8.55000 -5319.42051 7.89603 -3.76116 220.43330 162.06725 1157.90575
8.65000 -5275.02441 7.10691 13.19492 295.38016 212.14896 1107.87320
8.75000 -5229.15473 2.01782 18.33057 442.67193 276.53288 1106.27736
8.85000 -5188.58676 8.29602 -13.29327 233.52438 177.91400 1044.85083
8.95000 -5143.93818 7.71848 3.77769 256.58911 190.86002 1020.62175
9.05000 -5103.49199 5.66205 19.77939 310.77063 298.63685 1021.35628
9.15000 -5054.67748 2.80935 -8.43141 203.82118 199.30729 986.36585
9.25000 -5012.38042 5.19949 11.57542 270.03988 567.44652 1018.47252
9.35000 -4970.49069 6.78197 -4.16427 180.75601 209.07824 928.76699
9.45000 -4923.70223 6.89560 6.02521 203.70463 146.14288 913.04913
9.55000 -4884.20747 5.97901 -2.23098 192.88617 141.86646 881.90334
9.65000 -4836.62272 7.57915 4.72296 205.17119 156.22580 883.08849
9.75000 -4796.90822 6.66475 3.22075 225.02127 185.46428 863.57618
9.85000 -4753.57211 4.06774 3.06560 208.03720 241.17971 850.39807
9.95000 -4712.90096 5.04496 -1.10592 164.08526 124.62184 829.07061
10.05000 -4676.21661 7.64634 -4.56368 182.34115 178.90350 808.92962
10.15000 -4636.68915 5.08183 3.39017 462.24137 570.72684 988.41339
10.25000 -4602.37292 5.12201 0.80147 225.79676 186.33905 780.71100
10.35000 -4555.17752 6.27559 16.06820 346.36810 183.54645 792.89824
10.45000 -4519.07195 5.92907 -9.85033 150.46058 119.71041 746.54477
10.55000 -4478.06047 5.60432 -9.16779 156.72592 129.08461 744.64206
10.65000 -4443.31270 6.38367 15.95318 260.55880 471.59342 876.81451
10.75000 -4411.38294 5.07156 -1.66335 181.13409 147.18993 703.98197
10.85000 -4373.66363 0.68561 -11.14062 133.89325 176.09656 704.23359
10.95000 -4337.16430 6.20964 -4.60391 133.40808 110.94876 690.65260
11.05000 -4301.59938 7.36699 -14.13854 158.56972 124.87123 677.75345
11.15000 -4268.68673 4.05586 4.86012 172.86785 125.21167 657.64404
11.25000 -4235.77188 0.94913 -24.71177 202.48020 319.90386 968.97359
11.35000 -4204.28195 4.46534 -20.11455 148.96795 107.30956 642.41269
11.45000 -4172.82518 1.65604 -12.00789 142.19648 219.34493 653.71141
11.55000 -4138.42244 1.97817 -5.75161 129.88316 160.67576 621.47645
11.65000 -4108.02652 2.27907 -13.07765 144.62825 136.56382 612.65714
11.75000 -4074.15011 2.32654 -14.07411 138.57435 162.22265 589.49689
11.85000 -4046.20893 4.46989 -36.47731 126.07237 96.40122 574.86028
11.95000 -4023.60004 10.09443 -16.80808 392.06103 262.33168 775.12834
12.05000 -3990.47073 4.87915 -23.74808 130.28068 103.70697 550.82621
12.15000 -3954.49138 3.70551 -36.82792 527.07545 147.92198 647.71518
12.25000 -3934.24616 2.75088 -21.46014 188.15598 182.04569 533.60470
12.35000 -3900.37036 4.02784 -22.99712 129.68409 86.16574 527.13887
12.45000 -3872.92706 4.35219 -26.72812 126.91396 102.66628 523.88580
12.55000 -3845.66572 3.46078 -21.54705 118.15857 96.97921 509.95118
12.65000 -3816.12367 2.46403 -20.79995 131.46871 119.46806 507.61751
12.75000 -3789.19011 2.45270 -35.13523 142.03823 118.59263 499.81625
12.85000 -3761.53790 5.66621 -20.58176 131.65640 126.22150 489.08816
12.95000 -3732.97328 2.64615 -28.59024 107.99352 74.48043 473.83997
13.05000 -3705.04259 4.62089 -24.72277 112.90671 107.85133 469.14364
13.15000 -3677.28612 5.89583 -6.02233 97.94712 80.44793 449.91687
13.25000 -3654.36726 3.48271 -35.14353 95.69785 87.85047 442.58902
13.35000 -3626.10105 4.32513 -28.35472 111.99890 89.13598 438.30442
13.45000 -3600.49022 4.84030 -26.31337 94.12294 108.30133 425.95444
13.55000 -3571.40511 1.51399 -20.24575 288.37412 199.70738 447.82380
13.65000 -3551.95648 3.13812 -13.44128 94.84055 99.95668 407.44798
13.75000 -3527.79092 2.90750 -34.49818 291.60620 244.42210 555.51849
13.85000 -3503.03586 2.30026 -27.09453 94.25259 89.36381 401.62615
13.95000 -3479.30157 3.53036 -25.15692 262.83410 94.50870 466.70015
14.05000 -3449.79057 3.50401 -23.94574 108.30717 65.97010 378.74668
14.15000 -3422.66610 3.75337 -18.32393 128.74603 123.34557 379.68348
14.25000 -3396.94367 4.52394 -16.53940 164.35775 80.04773 388.73230
14.35000 -3377.28222 5.79525 -20.10237 730.31774 227.08342 360.84691
14.45000 -3350.23882 3.95547 -20.60430 85.41537 78.85437 364.52181
14.55000 -3327.94569 3.60097 -13.30978 80.72397 89.35371 345.45948
14.65000 -3303.98081 2.26876 -20.70655 87.43496 93.84685 349.74268
14.75000 -3282.72874 3.33482 -13.20571 58.59336 55.31194 334.18957
14.85000 -3258.64979 4.59745 -23.25630 116.61388 143.73229 336.00461
14.95000 -3235.14150 1.89860 -9.16888 71.68409 116.82960 326.09014
15.05000 -3214.68504 3.62008 -24.63324 60.82777 58.50031 312.38075
15.15000 -3194.57210 5.75059 -18.27997 91.17117 71.25939 320.18664
15.25000 -3169.04776 1.16426 -10.25768 101.28441 81.05800 324.16523
15.35000 -3149.37041 3.10029 -19.12288 71.62483 55.56526 302.90754
15.45000 -3132.38733 3.16948 -16.29187 78.46710 85.57436 306.99299
15.55000 -3109.60185 3.77087 -16.98823 73.10722 54.29992 295.20080
15.65000 -3085.75371 3.31129 -0.91478 81.73033 47.36172 301.61278
15.75000 -3064.86419 2.59180 -11.42194 77.58822 57.96109 285.69008
15.85000 -3042.18941 2.95626 -14.34433 112.27740 95.73666 281.32258
15.95000 -3025.21889 3.31423 -11.64539 67.44677 68.13547 277.92035
16.05000 -3004.45768 2.56056 -21.94325 59.94286 48.76535 272.18760
16.15000 -2985.95794 2.88162 -10.43663 81.90467 63.41323 273.46981
16.25000 -2966.25868 2.60041 -13.69310 66.67813 52.75342 261.41870
16.35000 -2946.61698 3.83869 -8.95524 84.92218 55.71281 265.18340
16.45000 -2926.05722 0.03015 -7.52514 66.18026 112.92998 255.05380
16.55000 -2908.30451 5.26529 -6.04505 68.39422 69.74266 251.97102
16.65000 -2892.02485 0.35635 -14.18281 114.40772 124.66750 281.84168
16.75000 -2869.12995 1.42040 -11.61755 108.64322 73.01454 244.00575
16.85000 -2853.76015 2.27747 -17.24231 92.33410 65.15919 254.03452
16.95000 -2838.89014 -2.35144 -6.56756 140.54097 182.99352 281.54255
17.05000 -2816.39516 2.71173 -17.52993 144.18939 56.97034 255.60113
17.15000 -2799.99813 8.90204 -9.56015 113.07443 354.23315 251.54685
17.25000 -2784.58476 2.40227 -8.75573 75.33192 51.22868 226.29178
17.35000 -2765.34977 3.65718 1.03681 41.60132 40.26584 217.23563
17.45000 -2747.24629 0.87681 -9.08196 68.79503 59.94689 217.77514
17.55000 -2728.74248 2.25056 -8.72822 48.75573 49.03777 213.48810
17.65000 -2709.76969 1.68360 -11.66392 44.39703 62.61656 214.31097
17.75000 -2691.99436 1.77851 -6.52123 107.98772 45.37836 240.04814
17.85000 -2679.37612 5.37698 -9.90447 53.92098 102.06624 208.14076
17.95000 -2662.77071 0.55627 1.56590 57.10146 61.35542 206.36282
18.05000 -2643.43939 1.99504 -18.56586 42.70932 52.36126 195.50044
18.15000 -2628.55923 -2.86797 0.33093 63.93259 259.76961 565.99656
18.25000 -2609.45083 3.70402 -15.04965 88.04477 48.32365 201.46189
18.35000 -2591.96213 0.28010 -16.10858 120.98766 73.70425 226.00574
18.45000 -2576.92723 1.23035 -17.64859 49.91784 41.91717 192.29657
18.55000 -2561.35352 2.46524 -19.37053 53.41865 45.17750 191.54902
18.65000 -2546.12389 -0.31053 -12.83854 43.64498 49.56964 174.12102
18.75000 -2529.99635 0.85141 -17.64729 73.73183 62.66324 178.61915
18.85000 -2515.41846 1.81225 -28.32047 850.94927 398.35850 210.98409
18.95000 -2504.52605 6.04629 -15.16075 90.52686 93.78517 182.93178
19.05000 -2487.61913 4.03927 -20.17456 35.36376 41.49601 170.75530
19.15000 -2473.94956 3.93229 -25.48540 79.64882 79.84982 169.93419
19.25000 -2456.65221 1.30686 -21.71641 49.11283 39.75185 175.25558
19.35000 -2441.55393 2.55480 -26.86343 40.45011 55.08139 170.51528
19.45000 -2426.37386 1.57075 -28.82523 37.26788 33.55940 169.95708
19.55000 -2413.19973 -0.01325 -24.67521 31.14572 31.66306 160.54019
19.65000 -2397.61498 0.88356 -29.90924 74.71046 52.69319 160.84908
19.75000 -2387.98944 -0.74501 -25.99246 81.29861 60.72153 157.88846
19.85000 -2374.67305 -0.48886 -31.35877 38.55438 49.96823 155.05609
19.95000 -2360.14594 3.34516 -28.94177 35.24997 35.13586 151.75093
