0.12500 0.01714
0.37500 0.04346
0.62500 0.10731
0.87500 0.18654
1.12500 0.28001
1.37500 0.35346
1.62500 0.41083
1.87500 0.43731
2.12500 0.50390
2.37500 0.54657
2.62500 0.55454
2.87500 0.56414
3.12500 0.54840
3.37500 0.51790
3.62500 0.45963
3.87500 0.41844
4.12500 0.37374
4.37500 0.35113
4.62500 0.31334
4.87500 0.32129
5.12500 0.30372
5.37500 0.29010
5.62500 0.22906
5.87500 0.19124
6.12500 0.15332
6.37500 0.13065
6.62500 0.13126
6.87500 0.11347
7.12500 0.10643
7.37500 0.12150
7.62500 0.11583
7.87500 0.11079
8.12500 0.08668
8.37500 0.09772
8.62500 0.11192
8.87500 0.10864
9.12500 0.08672
9.37500 0.07785
9.62500 0.05347
9.87500 0.07392
10.12500 0.10115
10.37500 0.12336
10.62500 0.15897
10.87500 0.19367
11.12500 0.21555
11.37500 0.21890
11.62500 0.20617
11.87500 0.16183
12.12500 0.17580
12.37500 0.14457
12.62500 0.15689
12.87500 0.13585
13.12500 0.13036
13.37500 0.10470
13.62500 0.11167
13.87500 0.08645
14.12500 0.06900
14.37500 0.01995
14.62500 0.03040
14.87500 0.07653
