0.05000 -747.75225 -161.00366 428.97692 1200.13140 952.83998 1118.86385
0.15000 -2161.42220 173.09004 528.65877 1168.56776 1006.87322 2648.35774
0.25000 -3008.99363 122.41827 406.79253 1199.03546 808.81053 3815.15330
0.35000 -3770.45569 146.96262 371.77534 1149.39347 748.21639 4550.27246
0.45000 -4239.56594 146.12138 349.93588 1254.61462 704.44669 5175.38031
0.55000 -4675.10570 178.68866 201.33017 1344.27696 673.47340 5574.39947
0.65000 -5008.33742 186.97935 88.69724 1388.07721 668.32485 6014.62261
0.75000 -5353.04542 186.58756 143.24156 1426.07545 657.24119 6188.41853
0.85000 -5589.07103 190.15455 -63.18673 1509.58679 692.47653 6308.13194
0.95000 -5785.52045 167.73800 59.12995 1473.77440 735.29946 6375.59550
1.05000 -5942.79364 146.06863 60.05495 1491.13697 755.00171 6380.30603
1.15000 -6135.10911 188.94035 16.25366 1476.15641 804.15013 6287.36740
1.25000 -6233.83669 168.49545 37.45390 1471.47826 842.82685 6318.04480
1.35000 -6435.03861 146.06431 24.71430 1399.44006 890.34850 6066.85291
1.45000 -6474.70743 162.72930 -42.50610 1418.60630 905.09549 6056.99417
1.55000 -6560.34921 160.37429 138.22973 1391.76386 929.50576 6018.60738
1.65000 -6693.94950 172.65331 1.75692 1339.59891 964.02001 5810.06919
1.75000 -6774.83706 148.33485 -42.36515 1287.57109 981.86872 5621.52425
1.85000 -6797.87354 140.98681 -14.62258 1259.02330 995.31623 5567.39315
1.95000 -6878.99804 140.88309 -20.98963 1185.98906 1017.07983 5382.55183
2.05000 -6943.29982 174.77834 60.77584 1126.96678 1021.84900 5247.39882
2.15000 -6932.96337 185.47787 120.67892 1104.98279 1031.03054 5118.25437
2.25000 -6974.81379 147.88563 -88.95960 1037.49013 1029.04309 4944.37355
2.35000 -6979.32863 162.08625 62.44618 980.83924 1033.99289 4822.15972
2.45000 -6970.63938 149.10447 -8.22416 973.68615 1023.34337 4780.07998
2.55000 -7001.08253 156.26934 -91.71720 906.31199 1020.45913 4617.04231
2.65000 -6989.15544 175.70227 -4.77013 902.94835 1015.20605 4549.53041
2.75000 -6987.53185 162.57395 88.00344 818.69918 1012.58566 4412.50456
2.85000 -6976.79552 161.46179 76.05196 774.33324 997.67769 4276.22537
2.95000 -6979.79738 156.42109 5.12036 713.92819 986.49842 4146.73690
3.05000 -6938.83380 152.91468 142.37757 694.35119 969.22473 4091.41574
3.15000 -6936.57307 166.05704 44.61666 645.44470 951.86062 3967.18257
3.25000 -6918.08310 160.02025 129.63787 635.32761 948.63937 3875.33007
3.35000 -6898.83952 137.86223 43.12496 595.43293 909.31210 3812.18208
3.45000 -6896.15323 143.91230 -28.75792 537.30414 887.63175 3697.14385
3.55000 -6888.71597 132.35599 97.27666 509.08927 869.79914 3569.95298
3.65000 -6859.84043 156.31830 -26.11376 528.22743 840.62810 3476.96677
3.75000 -6829.88093 145.24622 42.75747 514.67186 817.52315 3444.62993
3.85000 -6813.93576 137.10846 70.27600 511.10800 801.87911 3367.82529
3.95000 -6789.96135 133.92280 39.06625 491.80738 765.88359 3279.35206
4.05000 -6780.30866 140.89550 34.43431 502.65490 746.87157 3178.70995
4.15000 -6770.16700 139.57399 -9.24236 478.70782 711.33008 3091.87363
4.25000 -6741.32217 132.45865 -46.94164 483.33225 688.04630 3011.62913
4.35000 -6709.80095 139.84774 -51.19878 504.53602 659.75490 2935.46649
4.45000 -6685.77378 137.83379 11.23620 503.27169 623.82530 2880.22218
4.55000 -6653.00991 124.94543 -23.45374 512.99601 605.77999 2783.76194
4.65000 -6608.18936 130.78200 -9.96459 519.76340 575.97199 2733.67518
4.75000 -6566.90132 135.22204 -16.07737 509.89659 547.98264 2669.98839
4.85000 -6525.34602 136.98555 -10.34811 518.96226 529.94599 2615.10419
4.95000 -6500.42377 131.23052 -12.90763 496.59545 493.07558 2536.17018
5.05000 -6465.79981 128.77805 -38.42553 488.03202 477.68143 2467.02872
5.15000 -6405.35296 111.98237 -23.08371 478.66964 458.58578 2409.44067
5.25000 -6369.41947 122.96134 -76.43517 464.24196 436.53786 2353.88249
5.35000 -6330.70450 104.34161 16.92192 456.31300 412.72602 2278.49140
5.45000 -6287.74479 113.85020 -48.87893 434.74222 391.84246 2240.50712
5.55000 -6249.99139 101.19990 -63.89452 424.79518 374.29292 2164.45717
5.65000 -6200.10237 103.69122 -48.00337 424.15937 352.73386 2148.48255
5.75000 -6174.06396 93.45718 -43.35838 416.62817 342.40843 2084.24291
5.85000 -6137.16825 102.27669 -61.14822 406.10241 324.47738 2028.67635
5.95000 -6095.11179 96.28151 -93.15473 402.57990 308.00447 1992.54616
6.05000 -6058.28597 99.81565 -54.50022 386.04427 291.93182 1949.66826
6.15000 -6017.80303 89.88126 -6.34496 389.92786 280.82967 1927.20479
6.25000 -5999.09641 96.05082 -21.68673 366.09732 267.90949 1833.33985
6.35000 -5960.20662 95.37395 -4.15214 361.94244 257.13755 1820.93343
6.45000 -5921.66642 91.18836 -37.18938 358.01788 247.14087 1764.01916
6.55000 -5887.08001 86.95800 -22.88677 348.91846 234.34250 1733.95150
6.65000 -5858.72102 98.01943 35.01776 336.45033 223.42724 1712.62571
6.75000 -5817.15298 85.56677 -31.09326 333.90552 214.95462 1666.62510
6.85000 -5779.03425 91.41110 -1.51255 324.77985 204.94127 1625.14324
6.95000 -5741.03832 84.62592 -21.27663 309.48363 196.98874 1582.17997
7.05000 -5697.47449 88.99260 -41.73456 301.48677 186.77983 1569.19138
7.15000 -5647.60736 83.67140 -20.57959 291.39668 179.05422 1538.45858
7.25000 -5610.84689 81.95492 -10.40944 279.10743 171.54050 1492.30482
7.35000 -5562.32266 77.28911 -12.81050 271.82278 165.77535 1463.14574
7.45000 -5528.64710 79.49247 18.03683 262.81147 159.47010 1397.99951
7.55000 -5483.56099 77.40431 27.46456 254.17414 151.72253 1379.52205
7.65000 -5441.25283 76.96446 -22.70321 245.83208 145.22647 1347.58207
7.75000 -5403.88949 72.03484 -4.82165 236.72994 139.75666 1331.72444
7.85000 -5362.40224 69.49938 5.35094 223.98030 135.84107 1298.59256
7.95000 -5329.56997 68.80666 30.01983 215.24928 131.41203 1270.62856
8.05000 -5290.62465 61.48528 6.81942 210.63505 126.68078 1248.49584
8.15000 -5254.63865 63.97386 8.50156 206.71834 122.39174 1217.08786
8.25000 -5219.22925 63.78347 12.36516 214.51358 118.61653 1201.26499
8.35000 -5184.26627 64.58588 -1.89080 205.88481 112.85171 1164.02685
8.45000 -5141.18740 64.52214 34.05547 211.98426 108.96009 1148.72487
8.55000 -5102.40162 60.58681 22.47916 192.91175 107.09387 1121.83736
8.65000 -5067.32878 58.41269 43.32969 181.42470 102.51638 1085.06848
8.75000 -5025.69811 63.33613 -14.94549 177.26580 99.45015 1071.01841
8.85000 -4987.17426 57.60508 -14.89485 180.89118 97.17201 1058.29316
8.95000 -4940.90747 58.59836 18.50800 171.27352 94.18118 1031.05097
9.05000 -4905.53843 57.45416 -2.57114 163.19983 93.42008 994.33705
9.15000 -4865.74087 57.74860 20.83881 159.94823 88.91509 976.46565
9.25000 -4829.51427 56.59269 -21.62945 153.99667 86.94022 961.53794
9.35000 -4788.30342 56.65286 1.22745 150.53503 85.77370 955.02174
9.45000 -4754.94737 54.09493 1.10392 144.31627 83.43071 916.95901
9.55000 -4718.34316 54.29820 7.77494 149.09820 82.73334 899.14228
9.65000 -4681.30295 54.80069 11.00376 143.07555 80.46550 881.00621
9.75000 -4641.39780 55.42470 -8.46333 137.45345 78.38192 868.79101
9.85000 -4605.17834 55.84333 -1.26061 131.04060 75.07868 848.30833
9.95000 -4569.81905 51.30966 -15.31330 126.20264 75.21198 838.49605
10.05000 -4538.34482 53.63437 -16.57149 120.13507 70.98797 806.77319
10.15000 -4503.63223 50.18430 -7.72569 124.65830 70.99884 794.92627
10.25000 -4476.17011 49.43445 -23.62333 113.03990 69.74771 764.71122
10.35000 -4439.96001 48.46665 -35.78427 115.63331 67.92185 771.15805
10.45000 -4401.71701 48.88324 -40.34063 110.27095 65.92242 755.07396
10.55000 -4370.47469 46.45582 -29.29281 106.55229 63.58721 735.06867
10.65000 -4330.51472 46.72978 -33.14597 106.47833 60.76258 728.87700
10.75000 -4301.37996 44.04633 -25.84190 105.95271 62.86803 702.08575
10.85000 -4267.70978 44.89315 -10.94359 99.26627 60.37698 686.57061
10.95000 -4237.33956 45.85764 -30.83683 97.13263 59.23385 682.78957
11.05000 -4205.64696 42.53946 -11.51969 102.24411 57.49899 665.06673
11.15000 -4175.87755 43.99203 -28.98920 92.86848 56.66857 646.99449
11.25000 -4144.01349 42.99081 -15.33108 94.75185 57.22305 641.22447
11.35000 -4109.94118 42.26296 -14.40842 93.23906 55.62212 634.79102
11.45000 -4084.53349 42.00350 -29.59589 90.86307 55.20039 603.81836
11.55000 -4055.26694 40.00026 -0.19354 90.12000 52.62369 591.55034
11.65000 -4021.43884 41.27270 -11.14385 90.34139 51.02006 591.91210
11.75000 -3990.02396 38.20955 -16.76287 88.71810 51.71217 583.53189
11.85000 -3961.87124 38.52302 -10.81317 88.62195 50.01148 569.18578
11.95000 -3938.22559 36.77708 -27.30719 83.32589 48.67777 559.49078
12.05000 -3903.69258 37.70239 2.20885 86.37684 48.62515 555.94353
12.15000 -3878.34675 36.55091 -20.68488 87.35406 47.07123 542.43943
12.25000 -3847.95741 35.70205 -0.82615 85.50238 45.22179 525.77397
12.35000 -3819.75245 35.37615 5.67142 80.93364 44.44322 516.86932
12.45000 -3791.32162 35.36135 -11.11008 81.75041 44.02170 496.69679
12.55000 -3763.85819 36.22322 7.68703 79.83026 42.13906 495.67925
12.65000 -3735.34591 33.80457 -13.83261 80.86468 40.34805 485.09059
12.75000 -3703.63941 33.66097 -21.87611 78.48657 40.18111 481.07486
12.85000 -3678.22596 32.27978 -6.23826 77.56341 38.43705 464.89347
12.95000 -3647.97277 32.29936 -7.75455 82.18606 38.23848 465.96934
13.05000 -3619.50856 33.04133 -13.56644 75.44456 38.24741 448.66435
13.15000 -3595.97248 31.99638 -14.71033 71.86145 37.06915 441.52007
13.25000 -3572.27789 30.90056 -8.98083 72.63531 36.44699 430.37086
13.35000 -3545.64512 31.58197 0.60424 68.67657 37.19591 424.76255
13.45000 -3521.14174 29.57963 -5.58705 67.43413 35.37198 417.54590
13.55000 -3494.19149 27.87347 -15.26941 64.83145 35.26638 413.38658
13.65000 -3469.16289 27.53749 -19.64607 61.87203 34.93722 401.48140
13.75000 -3444.27884 27.93047 -14.86947 58.64675 34.24865 394.18082
13.85000 -3420.21470 27.72848 -10.62243 57.58513 33.55271 390.83756
13.95000 -3394.40948 26.45934 -12.61963 58.70302 33.82679 384.79752
14.05000 -3373.29539 27.37182 -28.56678 52.30280 32.68412 366.73964
14.15000 -3347.39891 27.26188 -15.43244 54.10679 32.68307 366.87680
14.25000 -3329.31648 24.55399 -6.31008 51.75712 31.74080 352.55270
14.35000 -3303.34156 25.42611 -16.86176 52.34026 33.38321 359.38677
14.45000 -3282.67018 24.59703 5.69821 49.50412 33.32430 341.20024
14.55000 -3260.40480 25.80972 -6.99651 49.56846 31.65284 344.00155
14.65000 -3237.50181 25.71017 -26.45008 46.42362 31.85846 334.52853
14.75000 -3214.48928 24.78925 -29.22357 45.40995 32.45736 327.86757
14.85000 -3196.07941 23.26022 -17.06330 44.62573 32.35570 326.94426
14.95000 -3176.32006 22.54490 -24.22084 42.44159 31.80292 317.51813
15.05000 -3153.27466 24.61712 -10.60255 41.28721 31.92466 312.69266
15.15000 -3133.41643 22.92588 -8.79480 42.63542 30.98216 309.84370
15.25000 -3114.88963 23.53909 -24.76533 40.03513 30.60766 298.47741
15.35000 -3097.76250 22.29584 -13.77083 42.67171 31.88895 304.98901
15.45000 -3078.12463 22.47313 -20.31292 40.76422 30.23028 288.50665
15.55000 -3057.57481 22.32131 -6.23989 40.70610 29.49443 283.70580
15.65000 -3036.27337 23.23148 -7.87532 40.65971 29.99461 281.44521
15.75000 -3017.87541 21.74902 -7.11506 39.49345 29.61556 274.66797
15.85000 -2998.32021 21.41227 -18.86649 39.47301 29.66770 275.91705
15.95000 -2977.18282 20.72262 -18.62530 37.78780 29.64401 267.32288
16.05000 -2956.62317 21.59605 -14.49844 38.09809 28.55625 258.91729
16.15000 -2938.56198 21.27603 -6.77656 37.49017 27.98908 259.23430
16.25000 -2920.19202 21.41498 -8.15928 37.66957 29.44605 255.23700
16.35000 -2902.04157 19.56990 -11.93897 36.48752 27.58563 247.07991
16.45000 -2883.15051 18.90134 -17.91313 37.14435 28.27099 247.93072
16.55000 -2864.78149 19.24246 -11.97711 35.80893 28.92593 242.32103
16.65000 -2847.77908 21.35612 -7.71515 35.79510 28.07557 231.63914
16.75000 -2827.86082 19.24010 4.16128 36.27966 26.22689 229.97309
16.85000 -2810.36722 18.37739 -11.42074 35.23768 27.38077 225.61094
16.95000 -2792.39755 18.47533 -6.56349 34.03858 26.21641 224.47464
17.05000 -2775.62458 16.96426 -8.48853 32.67589 25.98840 220.11661
17.15000 -2758.13411 18.63252 -1.31217 33.16637 26.52915 216.11739
17.25000 -2740.10859 18.07806 3.34844 34.09780 26.24182 219.30597
17.35000 -2723.25482 18.22066 0.71908 32.14015 25.25608 213.63829
17.45000 -2707.27490 17.02891 -7.06186 32.36236 25.09812 205.19871
17.55000 -2691.64681 18.00632 -9.08796 32.52712 24.64197 202.62370
17.65000 -2674.14577 16.11491 -2.26747 30.67396 24.73135 201.87749
17.75000 -2656.65566 17.27200 -13.88922 32.22319 25.08408 194.60124
17.85000 -2638.39464 16.26075 -12.82121 31.38359 24.24995 194.82145
17.95000 -2623.75565 15.73868 -17.05044 29.28108 25.65159 188.11845
18.05000 -2606.79950 16.79690 -6.40057 30.26133 24.98348 188.53620
18.15000 -2592.04085 15.87830 -5.44670 30.21059 25.05862 185.47817
18.25000 -2575.66542 14.68242 -5.02680 29.60266 24.18427 185.89528
18.35000 -2561.22910 15.96577 -2.39010 28.84671 24.41520 175.07525
18.45000 -2545.84323 16.60723 1.13422 28.35445 23.11091 181.64990
18.55000 -2532.54255 14.34475 -1.01636 28.05844 23.04437 167.52934
18.65000 -2516.07235 14.50513 -0.47638 27.76439 23.05441 167.62642
18.75000 -2503.35209 14.47120 -5.81855 26.51218 24.04485 161.27269
18.85000 -2487.52358 13.48505 4.58807 25.91468 23.04566 170.96252
18.95000 -2476.37576 14.20743 0.97987 25.66363 24.40630 150.46271
19.05000 -2460.15004 15.05248 4.84948 28.63165 23.23835 168.92669
19.15000 -2444.24465 13.81313 -4.50262 26.72271 21.96641 160.12728
19.25000 -2432.11949 14.12168 -4.68294 26.14186 21.27561 154.44004
19.35000 -2417.31783 15.13238 2.44045 25.93122 21.46492 155.31364
19.45000 -2401.89716 13.53232 3.69973 25.33100 20.83132 158.53438
19.55000 -2389.06595 13.67367 -0.54664 24.68021 21.93105 148.75372
19.65000 -2374.66646 14.02786 -2.68537 26.10862 21.84765 150.79930
19.75000 -2361.27802 14.80150 -5.49484 26.49406 21.58530 141.18146
19.85000 -2346.84287 17.02160 -11.60402 26.39502 23.33983 144.09868
19.95000 -2331.39544 19.66109 -21.09342 23.05207 21.43493 139.19487
