0.120000 3.017310
0.380000 2.218390
0.620000 2.138240
0.880000 2.134740
1.120000 2.132430
1.380000 2.125160
1.620000 2.118810
1.880000 2.100690
2.120000 2.104870
2.380000 2.116470
2.620000 2.105430
2.880000 2.102250
3.120000 2.093380
3.380000 2.092420
3.620000 2.098150
3.880000 2.084890
4.120000 2.082040
4.380000 2.070250
4.620000 2.061840
4.880000 2.082630
5.120000 2.071720
5.380000 2.065460
5.620000 2.047000
5.880000 2.043330
6.120000 2.020520
6.380000 2.027980
6.620000 2.045100
6.880000 2.080310
7.120000 2.125900
7.380000 2.157430
7.620000 2.159770
7.880000 2.186150
8.120000 2.152990
8.380000 2.143010
8.620000 2.235400
8.880000 2.202890
9.120000 2.186520
9.380000 2.239070
9.620000 2.212360
9.880000 2.217980
10.120000 2.322560
10.380000 2.262030
10.620000 2.420240
10.880000 2.524060
11.120000 2.316170
11.380000 2.553010
11.620000 2.397180
11.880000 2.438070
12.120000 2.272380
12.380000 2.379380
12.620000 1.992470
12.880000 1.998080
13.120000 1.761640
13.380000 1.650150
13.620000 1.697160
13.880000 1.986220
14.120000 1.914660
14.380000 1.828940
14.620000 2.079540
14.880000 2.237640
