0.12500 0.05637
0.37500 0.01453
0.62500 0.02495
0.87500 0.03465
1.12500 0.06676
1.37500 0.07091
1.62500 0.08938
1.87500 0.10289
2.12500 0.12662
2.37500 0.14263
2.62500 0.12651
2.87500 0.12175
3.12500 0.11142
3.37500 0.12240
3.62500 0.11348
3.87500 0.11860
4.12500 0.10911
4.37500 0.09712
4.62500 0.09487
4.87500 0.08281
5.12500 0.09090
5.37500 0.08344
5.62500 0.06822
5.87500 0.06776
6.12500 0.06159
6.37500 0.06222
6.62500 0.05055
6.87500 0.02702
7.12500 0.02746
7.37500 0.02924
7.62500 0.01594
7.87500 0.01394
8.12500 0.00464
8.37500 0.00951
8.62500 0.02271
8.87500 0.01095
9.12500 0.02547
9.37500 0.01464
9.62500 0.03104
9.87500 0.01202
10.12500 0.01490
10.37500 0.01465
10.62500 0.02834
10.87500 0.01720
11.12500 0.00498
11.37500 0.02897
11.62500 0.01465
11.87500 0.03005
12.12500 0.01653
12.37500 0.01265
12.62500 0.02688
12.87500 0.01811
13.12500 0.02623
13.37500 0.03109
13.62500 0.04440
13.87500 0.02183
14.12500 0.03986
14.37500 0.04414
14.62500 0.04382
14.87500 0.03911
