0.12500 0.02161
0.37500 0.06180
0.62500 0.12692
0.87500 0.17963
1.12500 0.22749
1.37500 0.24889
1.62500 0.29577
1.87500 0.30687
2.12500 0.31285
2.37500 0.29590
2.62500 0.27203
2.87500 0.24409
3.12500 0.22678
3.37500 0.19833
3.62500 0.18353
3.87500 0.16390
4.12500 0.13927
4.37500 0.11365
4.62500 0.09186
4.87500 0.09349
5.12500 0.08111
5.37500 0.06652
5.62500 0.05362
5.87500 0.06074
6.12500 0.04950
6.37500 0.05018
6.62500 0.04967
6.87500 0.06245
7.12500 0.06928
7.37500 0.06062
7.62500 0.08165
7.87500 0.06929
8.12500 0.06288
8.37500 0.04516
8.62500 0.03752
8.87500 0.02475
9.12500 0.03249
9.37500 0.03227
9.62500 0.03933
9.87500 0.05043
10.12500 0.05365
10.37500 0.03164
10.62500 0.01478
10.87500 0.01471
11.12500 0.01100
11.37500 0.01099
11.62500 0.00774
11.87500 0.01472
12.12500 0.00801
12.37500 0.03321
12.62500 0.03490
12.87500 0.03952
13.12500 0.06043
13.37500 0.03934
13.62500 0.03087
13.87500 0.00220
14.12500 0.02913
14.37500 0.03144
14.62500 0.03399
14.87500 0.02933
