0.125 0.000 0.000 0.002
0.375 0.005 -0.001 0.061
0.625 -0.009 -0.014 0.369
0.875 -0.039 0.007 0.899
1.125 -0.060 -0.038 1.630
1.375 -0.064 0.014 2.356
1.625 -0.094 0.040 3.178
1.875 -0.144 0.017 3.879
2.125 -0.123 0.066 4.516
2.375 -0.147 0.047 5.185
2.625 -0.076 0.011 5.758
2.875 -0.094 0.093 6.342
3.125 -0.144 0.086 7.034
3.375 -0.102 0.052 8.022
3.625 -0.182 0.023 8.709
3.875 -0.122 0.014 9.167
4.125 -0.163 -0.054 9.861
4.375 -0.158 -0.028 10.442
4.625 -0.199 -0.040 11.444
4.875 -0.148 -0.047 13.020
5.125 -0.197 -0.126 14.660
5.375 -0.247 -0.056 15.988
5.625 -0.238 -0.039 17.578
5.875 -0.290 0.043 18.118
6.125 -0.314 0.051 18.290
6.375 -0.367 0.141 18.905
6.625 -0.387 0.181 19.562
6.875 -0.381 0.145 20.867
7.125 -0.406 0.125 22.680
7.375 -0.456 0.157 24.079
7.625 -0.481 0.110 25.670
7.875 -0.530 0.103 26.414
8.125 -0.546 0.127 26.557
8.375 -0.563 0.102 26.579
8.625 -0.570 0.164 26.049
8.875 -0.585 0.080 24.888
9.125 -0.573 0.093 23.904
9.375 -0.522 0.016 23.303
9.625 -0.510 0.038 22.179
9.875 -0.492 0.054 21.495
10.125 -0.474 0.075 21.960
10.375 -0.507 0.042 21.921
10.625 -0.499 0.011 22.092
10.875 -0.507 0.011 21.942
11.125 -0.469 0.019 22.188
11.375 -0.441 -0.011 21.657
11.625 -0.445 -0.028 21.611
11.875 -0.406 0.013 20.965
12.125 -0.381 -0.031 20.683
12.375 -0.387 0.014 20.564
12.625 -0.311 0.009 19.670
12.875 -0.324 0.026 19.774
13.125 -0.335 0.058 19.252
13.375 -0.354 0.018 19.400
13.625 -0.336 0.007 18.811
13.875 -0.314 0.011 18.438
14.125 -0.337 0.009 18.058
14.375 -0.300 0.028 17.769
14.625 -0.350 0.008 17.668
14.875 -0.316 0.026 17.578
