0.12500 0.00709
0.37500 0.01895
0.62500 0.05824
0.87500 0.09417
1.12500 0.12983
1.37500 0.17334
1.62500 0.21219
1.87500 0.24570
2.12500 0.29355
2.37500 0.32356
2.62500 0.35061
2.87500 0.36136
3.12500 0.36960
3.37500 0.36280
3.62500 0.37058
3.87500 0.34401
4.12500 0.32929
4.37500 0.30495
4.62500 0.28223
4.87500 0.26435
5.12500 0.23447
5.37500 0.22330
5.62500 0.20463
5.87500 0.17385
6.12500 0.15470
6.37500 0.11563
6.62500 0.10326
6.87500 0.09854
7.12500 0.08649
7.37500 0.08100
7.62500 0.07237
7.87500 0.06981
8.12500 0.09207
8.37500 0.06819
8.62500 0.08570
8.87500 0.06869
9.12500 0.09370
9.37500 0.08975
9.62500 0.06078
9.87500 0.08498
10.12500 0.06377
10.37500 0.06687
10.62500 0.06309
10.87500 0.05743
11.12500 0.04502
11.37500 0.01825
11.62500 0.02993
11.87500 0.05381
12.12500 0.05329
12.37500 0.07052
12.62500 0.09632
12.87500 0.08361
13.12500 0.10278
13.37500 0.08116
13.62500 0.05954
13.87500 0.04543
14.12500 0.03473
14.37500 0.02463
14.62500 0.00709
14.87500 0.02696
