0.12500 0.02768
0.37500 0.02924
0.62500 0.05750
0.87500 0.09410
1.12500 0.13949
1.37500 0.16495
1.62500 0.19824
1.87500 0.22812
2.12500 0.25425
2.37500 0.28357
2.62500 0.30815
2.87500 0.31708
3.12500 0.35307
3.37500 0.37168
3.62500 0.39508
3.87500 0.41495
4.12500 0.45269
4.37500 0.47708
4.62500 0.48156
4.87500 0.49704
5.12500 0.50377
5.37500 0.48986
5.62500 0.47167
5.87500 0.44578
6.12500 0.42805
6.37500 0.42498
6.62500 0.40400
6.87500 0.39047
7.12500 0.36981
7.37500 0.34157
7.62500 0.35180
7.87500 0.34722
8.12500 0.31495
8.37500 0.27296
8.62500 0.25606
8.87500 0.21226
9.12500 0.19007
9.37500 0.11238
9.62500 0.12294
9.87500 0.09579
10.12500 0.07761
10.37500 0.09124
10.62500 0.06550
10.87500 0.05515
11.12500 0.05223
11.37500 0.03042
11.62500 0.05230
11.87500 0.04267
12.12500 0.03108
12.37500 0.06667
12.62500 0.05815
12.87500 0.08615
13.12500 0.06614
13.37500 0.01106
13.62500 0.04691
13.87500 0.07920
14.12500 0.02651
14.37500 0.09717
14.62500 0.08115
14.87500 0.02787
15.12500 0.02804
15.37500 0.02183
15.62500 0.06274
15.87500 0.06705
16.12500 0.07181
16.37500 0.08275
16.62500 0.05084
16.87500 0.08970
17.12500 0.11823
17.37500 0.10549
17.62500 0.15186
17.87500 0.13039
18.12500 0.15659
18.37500 0.16320
18.62500 0.16982
18.87500 0.19575
19.12500 0.20360
19.37500 0.22323
19.62500 0.14776
19.87500 0.26301
