0.125 0.000 -0.000 0.001
0.375 0.003 -0.002 0.046
0.625 0.005 -0.004 0.256
0.875 -0.007 -0.010 0.731
1.125 -0.019 -0.042 1.354
1.375 -0.017 -0.027 2.125
1.625 -0.024 -0.015 2.897
1.875 -0.060 -0.057 3.636
2.125 -0.044 -0.044 4.443
2.375 -0.024 -0.003 5.084
2.625 -0.002 -0.020 5.867
2.875 -0.067 -0.022 6.716
3.125 -0.020 -0.005 7.267
3.375 -0.013 0.009 8.105
3.625 -0.023 -0.008 8.876
3.875 -0.039 0.043 9.793
4.125 -0.048 0.053 10.860
4.375 -0.047 0.078 12.191
4.625 -0.059 0.066 13.595
4.875 -0.057 0.043 15.015
5.125 -0.043 0.122 16.759
5.375 -0.072 0.042 18.651
5.625 -0.053 0.113 20.851
5.875 -0.079 0.104 23.017
6.125 -0.106 0.106 25.210
6.375 -0.122 0.119 26.015
6.625 -0.062 0.099 26.624
6.875 -0.119 0.090 26.882
7.125 -0.138 0.130 27.273
7.375 -0.083 0.042 26.955
7.625 -0.114 0.139 26.848
7.875 -0.056 0.123 26.192
8.125 -0.043 0.053 26.117
8.375 -0.060 0.125 25.303
8.625 -0.072 0.108 25.597
8.875 -0.059 0.098 25.017
9.125 -0.029 0.080 24.732
9.375 -0.089 0.041 24.944
9.625 -0.077 0.047 24.178
9.875 -0.041 0.076 23.746
10.125 -0.105 0.088 23.447
10.375 -0.069 0.110 23.158
10.625 -0.072 0.074 21.934
10.875 -0.034 0.090 21.418
11.125 -0.006 0.135 21.268
11.375 -0.035 0.103 20.861
11.625 0.070 0.115 20.533
11.875 0.017 0.113 20.195
12.125 0.042 0.115 20.543
12.375 0.044 0.117 20.880
12.625 0.055 0.105 20.404
12.875 0.070 0.170 21.010
13.125 0.126 0.169 20.731
13.375 0.047 0.145 20.505
13.625 0.095 0.179 19.994
13.875 0.038 0.195 19.745
14.125 -0.006 0.199 19.524
14.375 -0.004 0.189 18.198
14.625 0.038 0.194 18.240
14.875 0.037 0.175 17.517
