0.05000 2359.25788
0.15000 3901.22430
0.25000 5567.87002
0.35000 6884.36610
0.45000 7943.10248
0.55000 8594.04593
0.65000 8874.10358
0.75000 9090.12598
0.85000 9223.53116
0.95000 9089.14194
1.05000 9084.89314
1.15000 8805.71068
1.25000 8480.31052
1.35000 8258.85990
1.45000 7975.84637
1.55000 7635.14122
1.65000 7401.67400
1.75000 7110.03155
1.85000 6809.72832
1.95000 6571.27424
2.05000 6312.20068
2.15000 6007.15727
2.25000 5762.98679
2.35000 5539.98475
2.45000 5306.31546
2.55000 5063.54654
2.65000 4939.36842
2.75000 4670.34513
2.85000 4525.02798
2.95000 4344.86353
3.05000 4225.41299
3.15000 4140.07972
3.25000 3947.49792
3.35000 3806.28812
3.45000 3709.31421
3.55000 3621.49815
3.65000 3435.95787
3.75000 3338.28113
3.85000 3213.55659
3.95000 3138.18866
4.05000 3013.99341
4.15000 2909.49844
4.25000 2805.34271
4.35000 2778.97035
4.45000 2645.60540
4.55000 2534.50130
4.65000 2478.93548
4.75000 2368.17545
4.85000 2340.81634
4.95000 2250.13447
5.05000 2133.92187
5.15000 2055.17660
5.25000 2001.58458
5.35000 1925.38180
5.45000 1859.90406
5.55000 1765.38701
5.65000 1716.63235
5.75000 1664.42555
5.85000 1556.52504
5.95000 1525.02176
6.05000 1473.27034
6.15000 1428.51563
6.25000 1379.00923
6.35000 1323.70610
6.45000 1312.49500
6.55000 1300.25685
6.65000 1260.51884
6.75000 1227.88965
6.85000 1202.32384
6.95000 1174.11905
7.05000 1157.04423
7.15000 1124.24762
7.25000 1110.60812
7.35000 1091.54802
7.45000 1076.05279
7.55000 1058.70992
7.65000 1030.72317
7.75000 1006.12042
7.85000 1005.47938
7.95000 967.80241
8.05000 959.47098
8.15000 942.99316
8.25000 918.28573
8.35000 883.87932
8.45000 866.06807
8.55000 848.67855
8.65000 841.46300
8.75000 813.11373
8.85000 788.63927
8.95000 775.76489
9.05000 760.92827
9.15000 725.16904
9.25000 721.74584
9.35000 706.73946
9.45000 677.80726
9.55000 676.79259
9.65000 663.13711
9.75000 637.81933
9.85000 616.67687
9.95000 613.71966
10.05000 606.98726
10.15000 580.67880
10.25000 583.27069
10.35000 561.16020
10.45000 553.76192
10.55000 547.19725
10.65000 532.18503
10.75000 519.99609
10.85000 505.62488
10.95000 501.40285
11.05000 487.09548
11.15000 480.10177
11.25000 463.34489
11.35000 457.25564
11.45000 454.93988
11.55000 442.29494
11.65000 428.94465
11.75000 431.91741
11.85000 417.03041
11.95000 405.74498
12.05000 400.01975
12.15000 391.45231
12.25000 379.33462
12.35000 380.74417
12.45000 376.47072
12.55000 364.89065
12.65000 363.47731
12.75000 353.82360
12.85000 342.73747
12.95000 341.71872
13.05000 336.14527
13.15000 327.71500
13.25000 319.07333
13.35000 308.78773
13.45000 313.30410
13.55000 310.92368
13.65000 306.39940
13.75000 299.52291
13.85000 292.74287
13.95000 284.96493
14.05000 284.15293
14.15000 275.45352
14.25000 273.37415
14.35000 276.67513
14.45000 268.31563
14.55000 269.79859
14.65000 261.63720
14.75000 256.55186
14.85000 250.58504
14.95000 248.20054
15.05000 248.96772
15.15000 242.53157
15.25000 242.78724
15.35000 237.27842
15.45000 231.08100
15.55000 224.20039
15.65000 224.24114
15.75000 213.37237
15.85000 212.77771
15.95000 205.69559
16.05000 207.86737
16.15000 198.79513
16.25000 192.68781
16.35000 192.20451
16.45000 177.84232
16.55000 181.77211
16.65000 170.21343
16.75000 182.76872
16.85000 171.28682
16.95000 163.26309
17.05000 170.25282
17.15000 154.19624
17.25000 153.22708
17.35000 149.91001
17.45000 149.17376
17.55000 149.49077
17.65000 143.17292
17.75000 141.64837
17.85000 140.23524
17.95000 140.05037
18.05000 135.47888
18.15000 132.55818
18.25000 131.19927
18.35000 126.13082
18.45000 125.63496
18.55000 127.70633
18.65000 129.88581
18.75000 126.29241
18.85000 120.49788
18.95000 122.17122
19.05000 126.74700
19.15000 113.01795
19.25000 113.09171
19.35000 111.02218
19.45000 109.14301
19.55000 106.78353
19.65000 107.89693
19.75000 102.98775
19.85000 100.63159
19.95000 98.75265
