0.12500 0.01246
0.37500 0.01786
0.62500 0.04544
0.87500 0.05292
1.12500 0.07679
1.37500 0.10911
1.62500 0.15503
1.87500 0.16881
2.12500 0.19417
2.37500 0.21671
2.62500 0.22031
2.87500 0.23540
3.12500 0.24166
3.37500 0.24744
3.62500 0.25090
3.87500 0.24022
4.12500 0.22704
4.37500 0.22603
4.62500 0.20573
4.87500 0.18757
5.12500 0.16505
5.37500 0.15801
5.62500 0.13687
5.87500 0.11783
6.12500 0.10206
6.37500 0.08818
6.62500 0.06438
6.87500 0.05937
7.12500 0.06157
7.37500 0.06601
7.62500 0.06690
7.87500 0.06030
8.12500 0.05436
8.37500 0.05832
8.62500 0.05810
8.87500 0.06552
9.12500 0.03994
9.37500 0.06286
9.62500 0.07303
9.87500 0.08674
10.12500 0.07590
10.37500 0.07550
10.62500 0.07829
10.87500 0.09452
11.12500 0.07438
11.37500 0.09081
11.62500 0.09391
11.87500 0.07215
12.12500 0.03413
12.37500 0.03454
12.62500 0.04475
12.87500 0.00700
13.12500 0.01672
13.37500 0.01330
13.62500 0.03712
13.87500 0.03120
14.12500 0.04137
14.37500 0.03521
14.62500 0.03920
14.87500 0.02167
