0.120000 -0.475020
0.380000 -0.624570
0.620000 -0.238340
0.880000 -0.520310
1.120000 0.541860
1.380000 0.707660
1.620000 0.568990
1.880000 0.343560
2.120000 -0.114600
2.380000 1.063800
2.620000 -0.259220
2.880000 -0.166950
3.120000 -0.628400
3.380000 -0.967240
3.620000 -2.500920
3.880000 -2.141270
4.120000 -2.256140
4.380000 2.339560
4.620000 1.657620
4.880000 1.626830
5.120000 0.319220
5.380000 0.766580
5.620000 0.331540
5.880000 -0.093530
6.120000 0.286370
6.380000 -1.760110
6.620000 1.957800
6.880000 2.074480
7.120000 1.139730
7.380000 0.974860
7.620000 1.028280
7.880000 0.570500
8.120000 0.507010
8.380000 0.644770
8.620000 -0.494440
8.880000 -0.611790
9.120000 -0.580500
9.380000 -0.541680
9.620000 0.129010
9.880000 0.428650
10.120000 1.624700
10.380000 0.841970
10.620000 -1.011440
10.880000 1.267200
11.120000 -0.975750
11.380000 0.439240
11.620000 -1.615420
11.880000 -1.217160
12.120000 -2.258240
12.380000 -0.704740
12.620000 -2.019350
12.880000 -1.000480
13.120000 -1.159070
13.380000 3.004350
13.620000 2.386170
13.880000 -1.814530
14.120000 -0.955750
14.380000 -1.413570
14.620000 -1.223510
14.880000 -0.791730
