532.34 2.00
658.56 0.00
784.78 2.00
911.00 7.00
1037.23 9.00
1163.45 14.00
1289.67 13.00
1415.89 33.00
1542.12 40.00
1668.34 40.00
1794.56 871.00
1920.78 2641.00
2047.00 3287.00
2173.23 1744.00
2299.45 432.00
2425.67 348.00
2551.89 254.00
2678.12 31.00
2804.34 121.00
2930.56 561.00
3056.78 1082.00
3183.00 2187.00
3309.23 3553.00
3435.45 3066.00
3561.67 3062.00
3687.89 2973.00
3814.12 1866.00
3940.34 291.00
4066.56 838.00
4192.78 696.00
4319.00 568.00
4445.23 983.00
4571.45 2152.00
4697.67 2524.00
4823.89 3587.00
4950.12 4327.00
5076.34 3564.00
5202.56 1673.00
5328.78 2849.00
5455.00 4615.00
5581.23 7118.00
5707.45 8359.00
5833.67 8877.00
5959.89 9882.00
6086.12 10318.00
6212.34 10300.00
6338.56 10410.00
6464.78 9736.00
6591.00 10095.00
6717.23 10019.00
6843.45 9909.00
6969.67 10251.00
7095.89 10388.00
7222.11 10892.00
7348.34 11626.00
7474.56 12456.00
7600.78 12982.00
7727.00 12194.00
7853.23 11228.00
7979.45 9448.00
8105.67 7929.00
8231.89 6616.00
8358.11 5360.00
8484.34 4438.00
8610.56 3138.00
8736.78 2685.00
8863.00 2003.00
8989.23 1250.00
9115.45 822.00
9241.67 231.00
9367.89 162.00
9494.11 735.00
9620.34 1124.00
9746.56 1527.00
9872.78 1781.00
9999.00 2264.00
10125.23 2342.00
10251.45 2518.00
10377.67 2903.00
10503.89 2938.00
10630.11 3204.00
10756.34 3122.00
10882.56 3415.00
11008.78 3461.00
11135.00 3654.00
11261.23 3663.00
11387.45 3775.00
11513.67 3821.00
11639.89 3939.00
11766.11 4022.00
11892.34 4061.00
12018.56 3913.00
12144.78 4025.00
12271.00 4091.00
12397.23 4000.00
12523.45 3980.00
12649.67 3970.00
12775.89 4033.00
12902.11 3938.00
13028.34 3980.00
13154.56 4000.00
13280.78 3922.00
13407.00 3860.00
13533.23 3813.00
13659.45 3841.00
13785.67 3831.00
13911.89 3801.00
14038.11 3772.00
14164.34 3658.00
14290.56 3633.00
14416.78 3612.00
14543.00 3526.00
14669.23 3536.00
14795.45 3438.00
14921.67 3391.00
15047.89 3273.00
15174.11 3345.00
15300.34 3195.00
15426.56 3189.00
15552.78 3146.00
15679.00 3071.00
15805.23 2957.00
15931.45 3003.00
16057.67 2897.00
16183.89 2990.00
16310.11 2842.00
16436.34 2785.00
16562.56 2793.00
16688.78 2643.00
16815.00 2686.00
16941.23 2636.00
17067.45 2519.00
17193.67 2660.00
17319.89 2511.00
17446.11 2526.00
17572.34 2404.00
17698.56 2516.00
17824.78 2389.00
17951.00 2236.00
18077.23 2175.00
18203.45 2026.00
18329.67 1951.00
18455.89 1918.00
18582.11 1739.00
18708.34 1617.00
18834.56 1466.00
18960.78 1409.00
19087.00 1197.00
19213.23 1129.00
19339.45 1052.00
19465.67 964.00
19591.89 874.00
19718.11 737.00
19844.34 723.00
19970.56 605.00
20096.78 473.00
20223.00 390.00
20349.23 313.00
20475.45 251.00
20601.67 212.00
20727.89 174.00
20854.11 140.00
20980.34 89.00
21106.56 66.00
21232.78 57.00
21359.00 47.00
21485.23 42.00
21611.45 34.00
21737.67 31.00
21863.89 22.00
21990.11 10.00
22116.34 10.00
22242.56 16.00
22368.78 15.00
22495.00 19.00
22621.23 10.00
22747.45 9.00
22873.67 8.00
22999.89 10.00
23126.11 4.00
23252.34 8.00
23378.56 5.00
23504.78 7.00
23631.00 6.00
23757.23 3.00
23883.45 4.00
24009.67 1.00
24135.89 1.00
24262.11 2.00
24388.34 2.00
24514.56 2.00
24640.78 0.00
24767.00 3.00
24893.23 3.00
25019.45 0.00
25145.67 0.00
25271.89 0.00
25398.11 0.00
25524.34 0.00
