0.120000 2.655120
0.380000 1.990050
0.620000 1.923590
0.880000 1.928600
1.120000 1.909840
1.380000 1.908480
1.620000 1.888860
1.880000 1.909500
2.120000 1.900240
2.380000 1.888980
2.620000 1.887710
2.880000 1.866370
3.120000 1.882900
3.380000 1.866370
3.620000 1.872690
3.880000 1.856250
4.120000 1.847140
4.380000 1.856530
4.620000 1.854860
4.880000 1.834120
5.120000 1.833290
5.380000 1.810300
5.620000 1.808380
5.880000 1.788810
6.120000 1.769550
6.380000 1.758580
6.620000 1.766140
6.880000 1.836550
7.120000 1.841220
7.380000 1.842680
7.620000 1.929590
7.880000 1.997740
8.120000 1.941690
8.380000 1.931690
8.620000 2.015970
8.880000 1.963470
9.120000 1.892360
9.380000 1.923380
9.620000 1.892880
9.880000 1.796580
10.120000 2.014730
10.380000 2.143130
10.620000 1.979110
10.880000 2.705110
11.120000 2.530550
11.380000 -3.061980
11.620000 -3.072980
11.880000 -3.123440
12.120000 2.534470
12.380000 2.068070
12.620000 1.851970
12.880000 1.710570
13.120000 1.391300
13.380000 1.239330
13.620000 1.160400
13.880000 1.166190
14.120000 1.209450
14.380000 1.073840
14.620000 1.005730
14.880000 0.928590
