0.120000 1.834260
0.380000 2.628240
0.620000 2.493880
0.880000 2.969210
1.120000 2.868970
1.380000 2.810870
1.620000 2.796840
1.880000 2.689780
2.120000 2.668540
2.380000 2.622570
2.620000 2.569730
2.880000 2.585190
3.120000 2.869480
3.380000 -3.136280
3.620000 -2.989390
3.880000 -2.703030
4.120000 -2.670070
4.380000 -2.728080
4.620000 -2.600750
4.880000 -2.379420
5.120000 -2.639010
5.380000 -2.778960
5.620000 -2.756890
5.880000 3.093190
6.120000 2.641410
6.380000 2.571660
6.620000 2.231120
6.880000 2.237790
7.120000 2.223880
7.380000 2.276640
7.620000 2.337790
7.880000 1.876490
8.120000 2.131860
8.380000 1.763790
8.620000 1.576590
8.880000 1.494530
9.120000 1.158310
9.380000 1.373780
9.620000 1.429140
9.880000 1.227440
10.120000 2.829070
10.380000 3.128880
10.620000 3.103680
10.880000 -3.064390
11.120000 2.732710
11.380000 -2.784110
11.620000 2.030430
11.880000 2.660880
12.120000 2.249300
12.380000 1.103320
12.620000 1.948990
12.880000 1.686810
13.120000 0.437880
13.380000 -0.434740
13.620000 0.345240
13.880000 0.973460
14.120000 -0.304990
14.380000 -1.023740
14.620000 -0.393830
14.880000 0.228320
