0.2 -2.35959 16.55436 4.79535 122.16995 120.11144 115.36934
0.6 -1.63903 37.96639 0.79381 116.28777 110.23024 103.34424
1.0 0.10488 55.28073 1.11638 107.83948 98.14166 90.93585
1.4 -0.72948 67.71304 -0.619 102.67795 90.99156 84.2601
1.8 0.49629 83.77239 0.5324 96.26562 84.88172 78.10848
2.2 0.97581 96.23177 2.02529 89.06018 81.72394 73.59139
2.6 -0.60569 109.59633 0.46422 81.75641 78.94647 69.10123
3.0 -0.30132 123.16953 -0.40917 76.47326 75.2921 65.33097
3.4 0.27231 137.28816 1.00827 69.79465 69.78372 62.64471
3.8 0.46837 151.96097 -0.02736 64.54391 64.57242 59.04056
4.2 -0.37208 161.87772 -1.32481 61.19306 59.92873 53.47629
4.6 0.63696 171.7292 -0.00281 57.60532 53.08779 50.28544
5.0 1.00823 176.50836 -0.70146 55.6101 47.58265 47.68379
5.4 0.52163 180.54099 -0.87223 52.76375 45.35442 44.62534
5.8 0.69741 183.26925 -0.03424 51.09657 42.94401 43.01332
6.2 0.32481 187.09439 -0.52225 49.17103 41.37448 39.57633
6.6 -0.4191 190.88351 -0.76993 47.4692 39.80722 37.306
7.0 -0.90809 194.84635 -1.10024 45.79334 37.76193 36.46512
7.4 0.73642 196.8686 -0.17331 44.3319 36.19995 33.86937
7.8 -0.45183 200.13427 -0.78942 42.70514 33.87094 33.47664
8.2 0.24239 201.86028 -1.07891 41.17684 33.25785 31.93659
8.6 0.4537 203.13545 -1.57199 40.25346 31.79933 30.9954
9.0 0.3689 205.41295 -1.13964 38.58447 31.18776 30.02488
9.4 -0.10306 206.0739 -1.38892 37.93149 30.25511 28.16748
9.8 0.20944 208.63712 -0.12023 36.46832 28.72273 27.25932
10.2 1.41378 209.05785 -0.81829 35.30675 28.63051 26.54987
10.6 0.06151 210.54935 -0.68554 33.46942 27.50269 25.89308
11.0 0.31493 211.27377 -0.20244 32.27819 25.78563 24.851
11.4 -0.54775 213.35926 1.30402 32.34787 24.54207 24.27787
11.8 0.66067 213.31814 0.65523 31.50286 23.71845 23.77302
12.2 1.18524 213.90522 0.21953 30.20972 23.36914 22.9845
12.6 1.8261 215.23074 1.2243 29.88026 22.69292 21.9184
13.0 1.41137 215.28155 1.0024 29.03152 20.91061 21.38858
13.4 0.83389 215.08552 1.26983 28.57282 20.56092 21.34555
13.8 -0.03242 215.5782 1.31767 27.81104 19.30673 20.64296
14.2 -0.13139 215.04543 1.56402 26.792 19.02606 19.65319
14.6 0.66118 213.71531 0.75272 27.31443 18.97705 19.44204
15.0 0.90606 214.33205 0.89707 25.5839 18.5091 18.89795
15.4 0.3571 213.54619 0.50464 25.11015 18.41038 18.18102
15.8 -1.02012 213.73444 -0.67939 24.86345 18.28967 17.76808
16.2 -1.10037 214.26697 -0.55669 24.16803 17.53453 17.29707
16.6 -1.16649 213.87957 -0.84413 23.28459 17.47817 17.14173
17.0 -0.72043 213.75924 -1.55659 22.13425 17.34339 16.31822
17.4 -0.1205 213.95886 -0.97691 22.11794 16.67751 15.78392
17.8 -0.1666 215.17849 -1.88116 22.00056 15.16908 15.226
18.2 -0.47673 213.10493 -1.68965 20.78514 15.259 15.21301
18.6 -0.10475 214.00014 -1.53149 21.44683 14.81595 13.99318
19.0 -1.37359 212.75922 -0.90974 20.26713 14.60518 14.37776
19.4 -1.98553 212.4377 -1.77128 19.66209 14.56509 14.63973
19.8 -1.6979 213.44203 -0.49036 19.3783 13.26231 14.23011
