0.120000 -0.388430
0.380000 -0.734570
0.620000 -1.060440
0.880000 -0.795030
1.120000 -0.753440
1.380000 -0.865030
1.620000 -0.825750
1.880000 -0.810150
2.120000 -0.860780
2.380000 -0.873330
2.620000 -0.910090
2.880000 -0.913320
3.120000 -0.902450
3.380000 -0.830480
3.620000 -0.829690
3.880000 -0.718920
4.120000 -0.628950
4.380000 -0.571980
4.620000 -0.475440
4.880000 -0.430290
5.120000 -0.597490
5.380000 -0.799540
5.620000 -0.944550
5.880000 -1.193820
6.120000 -1.452260
6.380000 -1.686390
6.620000 -1.605950
6.880000 -1.633640
7.120000 -1.785880
7.380000 -2.013900
7.620000 -2.345450
7.880000 -1.964540
8.120000 -1.623350
8.380000 -2.142350
8.620000 -1.911400
8.880000 -1.510930
9.120000 -2.220770
9.380000 -2.064220
9.620000 -1.354070
9.880000 -2.564420
10.120000 2.436000
10.380000 3.057680
10.620000 3.110770
10.880000 2.604140
11.120000 2.535940
11.380000 2.040050
11.620000 1.947800
11.880000 1.745930
12.120000 1.488410
12.380000 1.824040
12.620000 1.409720
12.880000 0.354010
13.120000 0.662920
13.380000 0.045330
13.620000 0.276630
13.880000 1.358310
14.120000 -0.189350
14.380000 0.131260
14.620000 -0.365000
14.880000 -3.067230
15.120000 1.961530
15.380000 2.496240
15.620000 1.905400
15.880000 1.163530
16.120000 0.681020
16.380000 0.733070
16.620000 0.755690
16.880000 1.432590
17.120000 1.368490
17.380000 0.260790
17.620000 0.583670
17.880000 0.217630
18.120000 -0.066000
18.380000 -0.070760
18.620000 -0.213340
18.880000 -0.422250
19.120000 0.513480
19.380000 1.353070
19.620000 0.501270
19.880000 -2.708720
