0.1875 2.45441 15.63897 0.05166 126.90623 129.33349 102.47433
0.5625 -1.18383 38.44962 -0.15679 128.22663 121.65156 97.25917
0.9375 2.01357 57.17322 -0.41993 125.29463 111.45838 91.67095
1.3125 -1.5621 70.36845 -0.17118 124.41851 100.96098 88.26409
1.6875 -0.76384 76.16341 0.37367 121.60481 93.20874 83.98149
2.0625 -1.01495 81.34573 -1.71797 117.06549 87.1693 78.96447
2.4375 -0.21915 85.11735 -1.50334 112.6473 83.04889 76.20254
2.8125 -1.01603 87.75814 -0.64617 109.49193 77.74666 72.94027
3.1875 -0.40112 91.1051 -1.75699 102.86639 74.52224 71.23702
3.5625 -2.68804 94.90165 -1.81811 98.01845 70.82895 69.94677
3.9375 -1.63106 97.8202 -0.34514 94.05754 67.73158 68.42136
4.3125 -1.70773 101.78318 0.19823 88.89862 67.08481 66.86073
4.6875 0.6673 107.10547 1.06292 83.90248 66.5147 63.11027
5.0625 -1.54482 116.25418 2.32278 75.91919 65.79355 62.05794
5.4375 0.46967 127.9229 2.75189 69.41467 67.18675 58.33045
5.8125 -3.38726 141.75238 2.79983 64.03872 66.16579 55.49345
6.1875 -0.90268 154.71005 4.1366 57.17683 64.60291 51.03801
6.5625 -1.78674 165.77814 2.78967 51.9179 58.61005 45.91828
6.9375 -1.04031 175.28268 1.39433 47.48913 51.22117 40.8648
7.3125 0.21951 182.15214 -1.23763 43.08569 45.1509 35.88183
7.6875 -0.29552 187.11674 -2.25888 40.89138 39.7843 33.44438
8.0625 0.36044 190.37709 -1.80892 38.97779 34.91167 31.33717
8.4375 0.53249 192.12322 -0.45424 37.14543 32.61642 30.56704
8.8125 1.21331 194.22357 0.41809 35.79206 30.49625 28.73741
9.1875 0.45404 195.77354 0.77061 35.15375 28.80143 27.81425
9.5625 0.94372 198.94394 0.66893 35.25009 28.05343 27.01322
9.9375 0.00945 199.99357 1.35172 33.82614 27.16382 26.10781
10.3125 -0.43606 201.61473 1.64717 32.66798 25.28516 25.38151
10.6875 -1.4305 202.70208 1.41933 32.06412 24.32047 25.34176
11.0625 -0.54641 203.61486 1.60229 30.99438 23.05398 23.48459
11.4375 -1.43908 204.96942 1.75608 29.75779 21.97803 23.25641
11.8125 -1.24028 204.91394 1.50429 28.35121 21.78901 22.31924
12.1875 -1.3347 205.15197 1.14169 28.27457 21.79228 21.3586
12.5625 0.23309 206.29183 -0.03316 27.18529 20.83344 21.43522
12.9375 -0.67044 205.92362 -0.37847 27.44342 20.42346 20.86649
13.3125 0.77389 206.1281 -0.68013 25.76488 19.42741 20.36479
13.6875 1.19279 206.96194 -1.30075 25.73335 19.48491 20.49382
14.0625 1.7724 207.79722 -0.92259 24.87717 18.88776 20.76707
14.4375 -0.22986 207.60047 -2.81662 24.11237 19.45742 19.90858
14.8125 0.12668 208.96631 -1.06101 23.563 19.49727 19.60705
15.1875 0.33657 209.47079 -2.35952 23.60095 18.28471 19.15674
15.5625 -1.2946 209.49254 -1.88299 22.84529 18.39399 19.18058
15.9375 1.22912 210.4282 -1.86917 23.14158 17.02956 19.09847
16.3125 0.67079 210.92516 -1.16058 22.0615 15.9768 19.13317
16.6875 0.36497 210.34965 -1.47105 21.81041 14.83673 18.59932
17.0625 1.51089 210.24468 -0.68728 21.34618 14.03001 17.90626
17.4375 0.31765 208.65606 -1.14105 21.2163 13.64473 16.91165
17.8125 1.94374 208.1765 -1.24077 20.42591 13.29655 17.34517
18.1875 1.63826 207.15897 -0.2933 20.94686 13.15385 16.03667
18.5625 1.62425 205.72927 0.3359 18.90592 13.74154 16.01957
18.9375 1.77705 205.35195 -0.44263 20.27154 13.96821 16.26565
19.3125 2.20575 204.55164 -0.08954 18.72641 13.5018 15.26725
19.6875 0.61709 205.9167 1.36354 18.01776 14.73278 15.37462
20.0625 2.00248 205.96684 1.71952 17.72721 13.6422 14.11277
20.4375 0.82957 206.41761 3.15874 17.48625 13.99112 13.16764
20.8125 0.59012 207.60433 1.05529 16.08615 13.97655 13.20365
21.1875 -0.65476 207.21485 2.12368 15.86587 13.26278 12.91654
21.5625 -1.299 207.6094 2.13716 15.60347 12.16926 12.59292
21.9375 -0.21002 207.64255 -0.08042 14.60769 11.62327 12.1192
22.3125 -0.85606 207.67657 0.11561 14.90801 10.70128 13.02122
22.6875 -1.2994 208.05705 1.04606 14.09051 10.85178 12.64401
23.0625 0.13599 208.31314 -1.70213 13.91052 10.79951 14.21847
23.4375 -0.55789 208.4593 1.28617 12.74569 9.92731 12.73508
23.8125 -0.13462 206.16697 -0.14584 12.4236 9.15201 12.35736
24.1875 1.06538 207.68502 0.66957 12.76093 9.20497 13.8693
24.5625 -0.97021 208.27888 -0.66261 12.60804 9.55713 12.67452
24.9375 0.22264 206.70884 -2.05057 13.39694 10.09897 13.52782
25.3125 0.52106 205.45057 0.34491 10.89908 9.60557 11.76421
25.6875 -0.28761 206.66267 -1.5718 13.46309 9.42256 11.27279
26.0625 -0.15181 205.68498 1.26162 12.82953 8.55604 11.88354
26.4375 -0.72268 205.35168 -0.95874 12.47974 8.98714 10.01211
26.8125 -0.51191 205.80318 -1.15823 11.5273 8.42249 10.48742
27.1875 -1.17444 205.33996 -0.66292 11.32373 7.97547 9.79014
27.5625 1.60497 205.11485 -0.05578 11.1747 8.75382 10.1083
27.9375 -2.80779 204.35248 1.16519 11.2725 7.56732 9.17276
28.3125 -1.10448 204.16905 -1.02766 9.80461 6.90203 9.85178
28.6875 -2.27548 202.8022 -0.32961 10.80208 6.73186 8.3612
29.0625 -1.04169 203.31478 -0.69385 10.08913 8.04824 9.80341
29.4375 -2.09087 203.12607 1.05033 11.25923 8.34274 8.9129
29.8125 -1.23417 202.82717 -2.24547 9.50448 7.65991 9.28235
