0.12500 0.01648
0.37500 0.05385
0.62500 0.12236
0.87500 0.18606
1.12500 0.25296
1.37500 0.30788
1.62500 0.34872
1.87500 0.35849
2.12500 0.38690
2.37500 0.40550
2.62500 0.43845
2.87500 0.44960
3.12500 0.47053
3.37500 0.49203
3.62500 0.50195
3.87500 0.51284
4.12500 0.50767
4.37500 0.51429
4.62500 0.51794
4.87500 0.50462
5.12500 0.48725
5.37500 0.45218
5.62500 0.41329
5.87500 0.36431
6.12500 0.28946
6.37500 0.20235
6.62500 0.16760
6.87500 0.15140
7.12500 0.13151
7.37500 0.10637
7.62500 0.08844
7.87500 0.09650
8.12500 0.09711
8.37500 0.11372
8.62500 0.14741
8.87500 0.16989
9.12500 0.17577
9.37500 0.15672
9.62500 0.14662
9.87500 0.09043
10.12500 0.08798
10.37500 0.09835
10.62500 0.07412
10.87500 0.08105
11.12500 0.07154
11.37500 0.07764
11.62500 0.06326
11.87500 0.05741
12.12500 0.07879
12.37500 0.09162
12.62500 0.09089
12.87500 0.11383
13.12500 0.12105
13.37500 0.11366
13.62500 0.11332
13.87500 0.09624
14.12500 0.09890
14.37500 0.06724
14.62500 0.05712
14.87500 0.06560
