0.05000 4592.81293
0.15000 7450.40079
0.25000 8837.42850
0.35000 10609.70219
0.45000 11830.94063
0.55000 12312.87218
0.65000 12164.53956
0.75000 11978.78001
0.85000 11720.68474
0.95000 11241.91761
1.05000 10593.18767
1.15000 10195.61036
1.25000 9810.90204
1.35000 9252.66658
1.45000 8868.86425
1.55000 8391.72928
1.65000 8182.12271
1.75000 7783.53912
1.85000 7398.57101
1.95000 7067.75499
2.05000 6859.89463
2.15000 6636.66446
2.25000 6302.55966
2.35000 6138.98007
2.45000 6013.49771
2.55000 5622.66017
2.65000 5513.48799
2.75000 5325.62537
2.85000 5156.12691
2.95000 5114.39431
3.05000 4694.90630
3.15000 4761.61942
3.25000 4486.29278
3.35000 4402.83274
3.45000 4158.02991
3.55000 4070.59441
3.65000 3902.43399
3.75000 3909.81011
3.85000 3662.36225
3.95000 3611.76725
4.05000 3522.81762
4.15000 3359.49841
4.25000 3308.27939
4.35000 3242.66864
4.45000 3031.11689
4.55000 2901.47142
4.65000 2895.16517
4.75000 2797.60099
4.85000 2718.28883
4.95000 2602.28537
5.05000 2483.18201
5.15000 2363.12898
5.25000 2372.90326
5.35000 2207.52533
5.45000 2146.86781
5.55000 2019.27833
5.65000 1952.85908
5.75000 1819.22119
5.85000 1817.11455
5.95000 1811.29448
6.05000 1745.17293
6.15000 1667.24521
6.25000 1635.02056
6.35000 1606.67214
6.45000 1550.84513
6.55000 1534.10653
6.65000 1482.36029
6.75000 1422.02129
6.85000 1409.89682
6.95000 1340.43117
7.05000 1327.63598
7.15000 1321.37377
7.25000 1236.26740
7.35000 1227.85432
7.45000 1233.26753
7.55000 1191.89999
7.65000 1101.25694
7.75000 1083.76124
7.85000 1082.51974
7.95000 1029.13876
8.05000 1014.66100
8.15000 1019.52976
8.25000 975.03091
8.35000 940.82037
8.45000 928.10288
8.55000 906.39998
8.65000 842.19230
8.75000 846.77775
8.85000 821.16702
8.95000 812.01871
9.05000 796.37385
9.15000 768.63738
9.25000 738.38337
9.35000 726.98977
9.45000 688.25933
9.55000 692.92793
9.65000 672.14378
9.75000 668.57559
9.85000 661.59088
9.95000 635.21377
10.05000 628.59159
10.15000 601.42346
10.25000 609.79363
10.35000 610.29017
10.45000 587.66938
10.55000 568.46582
10.65000 540.79422
10.75000 566.19208
10.85000 559.55668
10.95000 542.05054
11.05000 541.52012
11.15000 518.66451
11.25000 522.89634
11.35000 507.80316
11.45000 496.54239
11.55000 496.07409
11.65000 459.00542
11.75000 447.49397
11.85000 464.55098
11.95000 446.76320
12.05000 456.94667
12.15000 418.72130
12.25000 414.03332
12.35000 415.96441
12.45000 391.92214
12.55000 386.25610
12.65000 387.07251
12.75000 390.51685
12.85000 368.65230
12.95000 381.60661
13.05000 383.64159
13.15000 368.89226
13.25000 357.05489
13.35000 343.93317
13.45000 353.78627
13.55000 344.47740
13.65000 340.68003
13.75000 333.80531
13.85000 322.32978
13.95000 306.55310
14.05000 316.86932
14.15000 298.80714
14.25000 304.26733
14.35000 313.11242
14.45000 294.08024
14.55000 298.29916
14.65000 289.28075
14.75000 283.38262
14.85000 279.68119
14.95000 253.90512
15.05000 256.35334
15.15000 262.38726
15.25000 252.63162
15.35000 288.69647
15.45000 260.50401
15.55000 258.88482
15.65000 246.03049
15.75000 248.33962
15.85000 233.14108
15.95000 240.54264
16.05000 248.45428
16.15000 243.37767
16.25000 231.65905
16.35000 216.61827
16.45000 214.92985
16.55000 217.87664
16.65000 219.75136
16.75000 208.24716
16.85000 203.93254
16.95000 198.03713
17.05000 209.37032
17.15000 196.69497
17.25000 185.27398
17.35000 191.59452
17.45000 186.28125
17.55000 184.23245
17.65000 179.58975
17.75000 181.74017
17.85000 168.10161
17.95000 175.43001
18.05000 164.24160
18.15000 182.07836
18.25000 159.58939
18.35000 165.02614
18.45000 162.35710
18.55000 153.84118
18.65000 163.51634
18.75000 143.20114
18.85000 131.59128
18.95000 144.02270
19.05000 145.87779
19.15000 130.93306
19.25000 144.26272
19.35000 126.22506
19.45000 136.59662
19.55000 140.61207
19.65000 121.82195
19.75000 128.48977
19.85000 118.72918
19.95000 134.56512
