0.2 -1.91689 15.78787 1.59728 141.74176 140.19186 137.9287
0.6 -1.77 41.6316 1.10249 124.04569 113.45628 109.37186
1.0 0.38974 63.03153 1.40621 108.97322 98.31827 92.29833
1.4 -1.4697 80.40977 1.62317 98.45676 89.67042 81.91588
1.8 -1.27048 100.47244 0.33328 88.67759 85.86406 74.53514
2.2 -0.45326 119.98691 1.19684 79.89039 78.45495 70.19698
2.6 0.04482 135.64835 0.64631 72.5531 70.45818 65.81613
3.0 -0.39008 147.3564 0.26788 67.37224 63.43558 61.37238
3.4 -1.3429 157.11917 -0.2862 63.41774 58.39849 57.2622
3.8 -1.34242 164.61732 -0.85415 60.87722 52.81255 53.46969
4.2 1.55989 170.09174 0.01623 58.21892 49.60828 50.50279
4.6 0.47473 174.12505 -0.54439 55.0867 47.2674 47.83329
5.0 0.55148 180.02693 -1.31078 53.74509 44.82382 45.18577
5.4 2.26914 182.06149 -0.67404 52.25907 42.98677 43.30876
5.8 -0.04993 185.29792 -0.66181 49.83968 40.7884 40.92858
6.2 -0.0418 188.75709 -0.05117 49.00698 38.91949 39.51803
6.6 -0.17025 191.30158 -0.45184 46.72937 38.11748 38.06827
7.0 -0.14798 193.25916 0.082 44.95237 36.38452 36.35183
7.4 0.37811 196.11636 0.05465 43.9112 35.36158 34.2135
7.8 -1.49541 198.37846 0.36646 42.38971 35.08234 32.84493
8.2 -1.50295 200.89188 0.82422 41.07252 33.32548 32.29114
8.6 -2.20755 201.96767 1.21948 39.91629 32.5312 31.05018
9.0 -3.40189 203.48477 1.56982 39.02212 31.68304 30.68011
9.4 -2.79829 206.44766 1.40722 37.25786 29.10899 29.06171
9.8 -1.70225 206.70824 1.27764 36.75113 28.8374 28.9989
10.2 -1.43891 207.89581 1.16249 35.66984 27.46618 27.3302
10.6 -1.94824 208.08639 -0.04309 34.41812 25.90768 26.51868
11.0 -1.4492 208.49196 -0.52596 34.00598 25.203 25.58746
11.4 -0.82058 208.97575 -0.73388 32.68978 24.5073 24.83223
11.8 -0.54629 209.57712 -0.62628 31.80321 23.71557 24.39111
12.2 -1.51474 208.68114 -0.69062 31.26504 23.54393 23.56462
12.6 -2.11879 209.10761 -2.24538 31.0958 22.78287 22.8362
13.0 -2.53746 209.19492 -1.85138 29.41709 23.12254 22.04381
13.4 -1.7595 209.13554 -1.41082 28.07776 23.64286 20.90666
13.8 -0.8927 211.24098 -1.67242 27.43933 22.1138 20.72831
14.2 -0.3694 211.67622 -2.34045 26.80945 21.51744 20.07403
14.6 -0.79692 212.02758 -1.9882 26.87968 21.47193 19.47086
15.0 0.17221 212.36063 -1.40551 26.62875 19.36575 18.21996
15.4 0.12764 212.66254 -0.96247 25.76887 19.59614 17.773
15.8 -0.67165 213.2553 -0.95914 25.18736 19.06375 17.65485
16.2 0.61322 212.00763 -0.77563 24.35466 18.54381 17.26752
16.6 0.79573 211.98335 -0.40445 25.14114 18.4926 16.56927
17.0 1.55903 211.28177 -0.9635 24.32334 18.91424 17.00498
17.4 1.54214 212.51376 -1.67096 23.65349 17.84151 16.06725
17.8 -0.45173 212.10381 -1.14287 23.29342 16.58646 15.1868
18.2 1.88218 212.32178 -2.11979 23.64016 16.60944 15.42539
18.6 0.47109 212.45284 -2.46628 22.32186 15.6477 14.82121
19.0 -0.26298 210.68119 -1.86905 21.42406 15.32324 14.91768
19.4 0.42728 210.88559 -1.6343 19.85657 15.00905 14.18649
19.8 -1.56345 209.40502 -0.56355 19.82281 15.08902 14.15273
