0.2 -1.32701 18.11764 0.17664 70.11818 71.00702 69.41341
0.6 1.27068 39.61851 0.00107 68.0342 69.88905 65.71156
1.0 0.8972 60.62747 1.41705 65.42553 66.78973 62.97268
1.4 -0.44331 79.20395 0.75081 63.29401 62.46633 60.94529
1.8 -0.72261 95.48285 1.25617 59.72855 59.59165 57.62711
2.2 -1.24725 109.96296 0.61639 58.11591 56.90857 55.12047
2.6 -1.5008 121.69748 0.49574 55.46961 53.28765 53.30266
3.0 -0.70452 131.76544 0.27258 53.27795 51.26462 51.08318
3.4 -0.09777 141.20921 -0.04531 51.65435 48.35637 48.9782
3.8 0.14975 149.32878 0.29749 50.40347 47.20668 46.24072
4.2 0.50943 156.69214 -0.37337 48.38054 44.29781 44.74071
4.6 0.39319 163.0332 0.09507 46.60406 42.35787 42.36589
5.0 0.68264 168.77823 -0.06099 44.82947 40.10624 40.46355
5.4 0.58676 174.34464 -0.24796 43.26034 37.68344 38.42902
5.8 0.48179 179.68136 -0.40193 41.17811 36.28338 36.96031
6.2 0.26424 183.77108 0.18869 39.90245 34.36847 35.58058
6.6 -0.02887 187.20417 -0.23067 38.35712 32.48086 34.03882
7.0 -0.71275 191.08279 0.42864 36.98598 30.9974 32.28385
7.4 -1.15942 193.98128 0.6479 35.54029 29.76744 30.91789
7.8 -0.62601 196.49142 0.89396 34.13627 27.76086 29.97175
8.2 -0.72936 199.31514 0.73066 32.99637 26.87781 28.32023
8.6 -0.09348 201.23434 0.65424 32.29001 26.08272 27.79285
9.0 -0.01063 202.54342 0.47624 31.24666 24.73871 26.39289
9.4 0.148 204.31631 0.04382 30.50703 23.90747 25.40821
9.8 0.33837 205.69818 -0.26783 29.2968 23.21465 24.61413
10.2 0.10625 206.76912 -0.88681 28.22549 22.71721 23.59258
10.6 -0.46002 208.3211 -1.54574 27.49561 21.79864 22.77724
11.0 -0.23781 209.03961 -1.83694 26.38212 20.65035 21.60397
11.4 0.28635 210.37203 -1.47558 25.58726 19.81691 21.00995
11.8 0.33773 210.34225 -1.28947 24.91611 19.06558 20.18954
12.2 -0.54862 210.80672 -0.93131 24.36235 18.34433 19.57246
12.6 0.18975 211.40273 -0.47976 23.62195 18.07057 18.75385
13.0 -0.50928 212.35707 -0.67551 22.21383 17.3625 18.0644
13.4 0.57406 213.01655 -0.14018 21.83099 16.81651 17.72575
13.8 0.50001 212.63724 -0.69853 21.02295 15.788 16.93911
14.2 0.42765 212.63189 -0.14647 20.62686 15.09166 16.46459
14.6 -0.27738 212.79051 -0.1445 20.10317 14.98033 15.66013
15.0 0.05505 213.43368 -0.07933 19.28374 14.94023 15.15188
15.4 -0.136 214.13129 0.25763 18.58303 14.60212 14.51497
15.8 0.00339 214.04952 0.00915 18.01649 13.47534 13.7904
16.2 -0.57296 213.31907 -0.05815 17.24826 12.83697 13.68487
16.6 -1.33575 212.97273 -0.81733 17.20232 12.36928 13.27297
17.0 -1.69523 212.54922 -0.90665 16.72386 11.51103 13.2054
17.4 -2.86041 211.67909 -0.85658 16.13393 11.4635 12.63838
17.8 -2.42861 211.9316 -0.73119 15.69523 10.8735 12.31091
18.2 -1.8102 212.46396 -0.83059 14.92362 11.05649 11.64096
18.6 -0.70201 212.70054 -0.11174 14.56689 11.05081 11.27408
19.0 1.14334 212.64191 0.18963 13.72694 10.62122 10.56864
19.4 1.75942 212.32203 -0.26163 13.27897 10.67603 9.87376
19.8 1.79291 212.58604 -0.32139 13.16473 10.63609 10.01117
