0.2 1.25352 19.42391 0.77375 111.06626 109.38761 84.87548
0.6 0.36748 45.82958 0.07757 110.02842 100.78797 81.54396
1.0 -1.03162 65.24858 0.18791 107.65416 91.91237 77.09337
1.4 0.18562 78.77773 0.42044 102.54304 85.32486 72.46341
1.8 0.06765 87.37609 -0.18155 97.95562 79.14522 68.36863
2.2 0.32097 93.1525 -0.81172 92.92199 75.54973 64.14833
2.6 0.34894 101.48351 -1.28249 86.91971 71.10944 60.77416
3.0 -0.22725 107.38953 -0.92023 80.78094 67.19817 56.85656
3.4 0.63279 114.17537 -0.53867 74.23495 64.71998 54.29604
3.8 0.70725 121.8076 -0.25076 67.80282 63.29044 51.11374
4.2 1.43118 132.95893 0.07796 62.1965 62.0937 48.04904
4.6 1.50064 147.77209 0.15329 56.91055 59.56874 44.95541
5.0 1.01195 161.51129 -0.00779 52.2664 54.59986 42.89971
5.4 1.44639 173.71263 -0.74411 49.49193 47.90875 39.24866
5.8 1.18341 180.47972 0.17948 47.51489 41.46529 36.00223
6.2 1.49264 184.26577 -1.01091 45.94442 37.56131 32.91353
6.6 1.54547 184.98929 -0.16071 44.08673 35.04238 30.39413
7.0 0.70633 186.13164 -0.28076 42.93656 33.24712 28.26489
7.4 0.53071 186.5331 -0.088 42.49059 31.86458 26.41849
7.8 0.65376 187.83744 0.32156 41.70382 30.13369 25.14204
8.2 0.19259 188.42433 0.34694 40.99742 29.10063 24.53168
8.6 0.67943 189.85861 0.28915 39.60978 28.03095 23.39246
9.0 -0.0411 190.92641 0.61868 37.97281 27.43569 22.41698
9.4 0.03123 193.08147 0.58446 36.66809 26.93473 21.56857
9.8 -0.41908 194.24837 0.3861 34.4494 26.10832 20.87368
10.2 -0.48567 194.55032 0.13428 33.20835 25.55116 20.20863
10.6 -0.30219 195.67047 0.62365 31.39235 25.62821 19.29206
11.0 -0.46983 196.93354 0.28254 29.95026 26.24904 18.58241
11.4 0.35905 197.74292 0.31113 29.03854 26.07099 17.7
11.8 0.89027 198.32963 0.54557 28.00749 25.24334 17.40646
12.2 1.58774 199.93216 0.86092 27.9357 23.77193 16.93878
12.6 1.5211 201.79242 0.38669 26.97241 21.87751 16.35115
13.0 0.81719 202.73052 0.45781 25.96728 19.6305 15.86177
13.4 0.80906 202.95271 0.35402 24.96955 16.91827 15.45948
13.8 0.77731 202.75249 0.00705 23.50573 15.42975 14.58284
14.2 0.22762 201.39116 0.17064 22.89386 15.21752 14.07939
14.6 0.8224 200.82045 0.01135 21.83006 15.25017 13.72431
15.0 0.00142 200.63659 0.17611 20.48028 15.79317 13.45064
15.4 -0.13447 200.98504 0.61481 19.14812 16.28936 12.63264
15.8 0.05397 202.00101 1.04302 18.23393 17.28342 12.20893
16.2 0.14238 203.36075 1.52483 17.10454 15.79551 11.99194
16.6 0.24752 203.927 1.94705 16.3443 15.41891 11.31599
17.0 0.49348 205.01749 1.67801 15.45483 14.00658 10.9922
17.4 0.32568 205.62292 1.58398 14.87803 12.62622 10.49649
17.8 -0.06399 206.83436 1.84614 14.05729 11.79529 10.05535
18.2 -0.13493 207.79461 1.49825 13.47818 10.17466 9.64497
18.6 0.14127 206.73295 1.46041 13.0042 9.93769 9.48895
19.0 -0.1 206.49729 1.81565 12.08126 8.92122 9.17865
19.4 0.03302 206.03407 1.98508 12.47092 8.57493 8.62038
19.8 0.27408 205.51858 2.06367 12.53647 8.32452 8.37242
