0.26 0.4938 44.80625 0.04588
0.51 1.07497 94.22208 0.04257
0.77 1.25449 109.5324 0.04075
1.02 1.42106 119.85723 0.03808
1.28 1.38141 111.92424 0.03533
1.54 1.48278 117.78474 0.0332
1.79 1.37471 106.62215 0.03157
2.05 1.44215 105.20443 0.02866
2.31 1.36894 99.31519 0.02769
2.56 1.44103 99.49613 0.02561
2.82 1.3607 91.41357 0.024
3.08 1.37472 88.89115 0.02264
3.33 1.39522 86.25337 0.02088
3.59 1.31667 79.02904 0.01978
3.84 1.40291 81.31209 0.01857
4.1 1.40063 78.01629 0.01737
4.36 1.35611 73.55375 0.01629
4.61 1.37433 71.62188 0.01529
4.87 1.38423 68.9223 0.0142
5.12 1.42785 69.73386 0.01344
5.38 1.40079 64.18874 0.01238
5.64 1.41966 64.19597 0.01184
5.89 1.46388 63.43031 0.01107
6.15 1.42868 58.43501 0.01014
6.41 1.51193 60.62474 0.00966
6.66 1.48815 57.15722 0.00896
6.92 1.54062 56.87062 0.00843
7.17 1.49722 54.12487 0.00804
7.43 1.50622 52.10184 0.00746
7.69 1.62681 53.88688 0.00696
7.94 1.52566 48.53592 0.00649
8.2 1.65495 50.81183 0.00607
8.46 1.67279 49.13219 0.00571
8.71 1.5739 45.0502 0.00536
8.97 1.72206 47.04942 0.005
9.22 1.7429 45.18201 0.00462
9.48 1.7088 43.61329 0.00447
9.74 1.87002 44.71868 0.00403
9.99 1.70238 40.30407 0.00387
