0.05000 -5207.53646 -2008.01202 1333.41952 4940.15761 3603.65209 3244.35697
0.15000 -3740.01743 -281.92951 -897.94609 2029.45027 2481.66120 4708.82739
0.25000 -4864.76319 -36.79296 -38.68614 2444.73651 2355.13913 4892.97759
0.35000 -5611.18020 -279.65628 -218.73563 2625.87109 2491.55175 5914.02043
0.45000 -5967.04439 4.63147 185.44668 2543.87020 1738.40250 6400.26784
0.55000 -6174.82654 -75.25333 -531.16480 2370.92516 2023.77024 7079.35031
0.65000 -6425.78384 7.00191 -530.88310 2044.30385 1550.88967 7077.92941
0.75000 -6370.48189 89.08829 -709.13432 2015.43208 1535.25782 7491.34951
0.85000 -6678.11794 36.36934 -66.64994 1950.33979 1467.46874 7226.99311
0.95000 -6877.05146 5.87924 -186.23030 2036.98803 1266.29290 7210.48848
1.05000 -6863.40867 0.11784 -273.13770 1816.68225 1276.33490 7243.69705
1.15000 -7175.63617 36.93816 -312.05309 1700.70942 1250.12398 6861.94158
1.25000 -7318.71927 -54.12635 -66.90462 1830.50978 1187.10384 6848.71542
1.35000 -7389.66136 47.30163 -22.77347 1786.23634 1176.67421 6678.69713
1.45000 -7559.86327 6.58073 -75.65081 1596.64908 1072.88348 6447.78730
1.55000 -7565.69818 12.48364 8.85120 1593.16744 1114.99131 6341.11707
1.65000 -7728.05886 8.23173 248.67218 1447.89742 911.70192 6000.16483
1.75000 -7780.69135 19.90930 181.72701 1396.66839 931.20246 5816.43571
1.85000 -7827.22928 -17.09680 -64.25919 1268.50024 758.40209 5586.64207
1.95000 -7781.80480 25.51255 141.09929 1266.91229 882.46044 5450.33554
2.05000 -7820.81899 22.47421 20.34310 1260.22619 775.20108 5339.25781
2.15000 -7841.02626 26.11443 -60.31245 1235.05351 849.55053 5127.44654
2.25000 -7766.10457 12.28794 128.12688 1188.07801 874.65548 5050.44888
2.35000 -7769.41360 50.65408 134.63297 1074.61219 889.04903 4742.31739
2.45000 -7653.94683 20.08147 220.42318 1125.22253 752.58690 4637.75104
2.55000 -7622.59101 -1.02077 376.17957 982.92589 766.30463 4528.23663
2.65000 -7614.34793 7.45531 21.60310 975.85349 682.58426 4321.94703
2.75000 -7590.46882 -6.45905 190.59856 972.43787 749.95151 4234.58650
2.85000 -7560.47693 8.23384 319.69012 867.11462 666.42244 4200.32012
2.95000 -7532.23720 -9.47998 280.23416 807.75592 655.14537 3982.37194
3.05000 -7504.40962 23.84379 356.04914 857.49599 660.76919 3920.85532
3.15000 -7472.89928 -6.29217 287.69493 875.73794 603.72751 3849.03967
3.25000 -7443.87227 4.37391 252.80918 838.70645 736.34129 3759.70730
3.35000 -7411.25813 9.04523 142.11039 746.49103 499.35072 3648.87994
3.45000 -7394.81630 11.76829 65.98334 748.72626 540.14597 3520.44944
3.55000 -7365.76414 10.63508 84.79749 865.62561 625.94003 3495.48502
3.65000 -7305.48252 -0.79629 168.45746 767.93314 619.36450 3368.13050
3.75000 -7295.83712 20.01175 190.62515 776.83061 553.21623 3252.64293
3.85000 -7246.56829 -11.77334 40.41000 735.73946 572.50777 3156.79054
3.95000 -7157.43596 -2.93497 26.44981 688.19519 541.95131 3123.71146
4.05000 -7161.97401 15.65249 18.27601 753.89161 538.80547 3000.46928
4.15000 -7108.09016 5.99259 -33.26102 745.00191 522.45891 2929.97505
4.25000 -7030.38368 12.74944 -41.54570 700.64260 508.78678 2822.72226
4.35000 -6998.01168 -0.75939 -48.76075 578.94725 603.32142 2693.04338
4.45000 -6944.75882 -6.18898 -158.21493 674.15041 511.38700 2755.19615
4.55000 -6883.57027 18.64313 -125.78779 705.54219 580.83296 2604.77612
4.65000 -6857.03286 -4.01971 -104.06313 537.23080 486.56940 2510.30635
4.75000 -6784.24850 5.97111 -148.92990 513.13559 393.23668 2480.78006
4.85000 -6734.14027 12.92611 -53.70364 706.11295 522.12411 2393.38245
4.95000 -6652.59802 17.61620 -177.75014 521.57798 444.98477 2317.63402
5.05000 -6575.20876 5.86348 -115.04944 475.04598 548.07974 2247.31788
5.15000 -6523.88010 16.94368 -142.24974 414.16756 392.41797 2202.17854
5.25000 -6471.84498 11.12405 -92.12707 550.58762 430.86475 2182.65084
5.35000 -6439.74534 4.82052 -188.52708 554.49692 415.89814 2115.03008
5.45000 -6366.36685 7.19651 -147.26730 488.70228 400.61735 2127.90502
5.55000 -6328.34484 -3.50802 -125.09056 495.97259 454.21564 2010.47316
5.65000 -6274.61901 9.96563 -142.62111 437.81218 433.84549 1991.39427
5.75000 -6237.24863 -4.15096 -197.80670 507.85725 477.06974 1992.19128
5.85000 -6174.29880 -5.40083 -68.49814 414.85131 370.47801 1936.47198
5.95000 -6109.89764 -5.60110 -161.07605 390.23546 348.11754 1903.51657
6.05000 -6085.13094 -2.70538 -167.51044 413.38347 385.98480 1783.96448
6.15000 -6048.42466 4.92198 -110.60018 400.85290 365.05421 1780.98047
6.25000 -6019.85386 11.42748 -78.53387 525.63167 317.07711 1686.33410
6.35000 -5992.67621 0.27334 -92.32450 446.51176 433.62192 1699.33784
6.45000 -5935.68698 4.17177 -126.71448 351.12117 274.12450 1639.26417
6.55000 -5905.46143 15.18528 -78.64841 551.34883 349.32198 1571.53821
6.65000 -5887.58188 3.41097 -122.50044 393.81184 297.44376 1556.06348
6.75000 -5838.09327 12.30427 -105.13245 725.70328 611.24211 1547.15261
6.85000 -5803.69507 -9.13649 -57.97125 436.29700 361.24474 1514.35503
6.95000 -5729.35916 -0.72976 -107.20744 382.09796 456.88729 1480.31630
7.05000 -5694.91873 10.00150 -65.19530 372.40406 348.80380 1449.56194
7.15000 -5654.26308 1.79353 -20.84440 357.44584 450.76399 1388.19839
7.25000 -5590.77077 -1.45768 -42.33689 513.45546 394.49232 1461.12516
7.35000 -5553.64707 15.89712 -25.67045 378.01087 489.68166 1398.58265
7.45000 -5518.95214 7.67559 -63.40747 447.26412 458.47713 1312.98766
7.55000 -5500.46860 -15.22279 -17.16492 440.56963 417.76379 1280.09156
7.65000 -5446.09263 5.03292 -7.42673 311.81359 460.97075 1287.12969
7.75000 -5403.55154 -6.68477 -42.80017 300.55426 260.86205 1202.38310
7.85000 -5348.33971 8.19489 -25.52563 411.46102 324.90353 1285.75835
7.95000 -5316.21949 1.58035 26.41986 294.06192 258.74938 1154.56649
8.05000 -5255.80653 4.35469 41.42110 416.14171 414.68636 1176.03917
8.15000 -5207.09604 3.12183 -27.59781 525.38110 438.54737 1136.99530
8.25000 -5193.34300 0.24243 43.49427 335.98240 255.54551 1082.32500
8.35000 -5149.59506 -11.03295 22.32565 374.30524 326.45039 1117.93646
8.45000 -5110.88782 2.55982 49.23434 256.37400 233.28635 1010.43250
8.55000 -5070.99717 -4.74014 26.99192 246.97962 233.36223 991.92701
8.65000 -5015.02008 3.95597 -12.33446 278.93691 251.22211 1001.09138
8.75000 -4974.80013 -7.44213 16.20526 227.15569 385.19250 978.73184
8.85000 -4938.17516 4.02519 -14.33923 269.21339 194.51082 914.74311
8.95000 -4881.92418 5.86559 58.42110 227.12027 228.92104 933.82419
9.05000 -4860.32759 6.58219 -2.80487 366.20291 354.65708 1078.39978
9.15000 -4816.36512 9.89169 39.64983 329.01206 249.61100 904.04603
9.25000 -4768.89123 -2.87104 20.84871 339.00408 296.06911 901.55147
9.35000 -4728.49143 6.66178 -6.93770 262.62944 236.51743 823.54558
9.45000 -4686.34159 -0.19816 29.68802 213.69799 178.75762 812.46577
9.55000 -4644.92106 0.56615 17.34273 169.04013 147.03978 774.61818
9.65000 -4597.84671 3.34808 19.94028 203.91692 290.23659 770.45064
9.75000 -4561.12032 9.74843 17.37756 203.43561 191.45056 756.27635
9.85000 -4532.22921 -5.71332 28.21049 546.18128 305.82568 733.25640
9.95000 -4492.61093 -7.66754 25.86403 199.33588 206.84861 705.88630
10.05000 -4452.37318 4.09508 19.78380 263.41763 167.61381 712.22661
10.15000 -4407.12339 3.49962 16.44591 203.32109 163.58588 700.66156
10.25000 -4361.49496 2.44435 20.08697 175.52533 172.22439 682.41988
10.35000 -4342.45113 26.59770 46.22853 612.19874 349.72548 711.49279
10.45000 -4288.26068 -2.84670 38.84066 235.67710 215.69360 666.99654
10.55000 -4262.35950 4.94651 77.26102 175.37679 168.39604 648.13041
10.65000 -4224.27390 5.70307 15.44545 204.27038 149.21211 613.14602
10.75000 -4193.45682 13.31228 27.95915 194.79614 234.37330 637.61221
10.85000 -4152.53036 -0.50625 6.27375 299.05126 180.04338 609.32113
10.95000 -4142.92247 -4.80655 8.37030 235.39172 144.46270 588.26483
11.05000 -4096.43543 6.01329 5.95627 201.53600 313.42857 570.91191
11.15000 -4081.71270 0.90375 25.60109 198.39737 152.89380 562.48197
11.25000 -4051.33377 1.15030 24.01824 191.03275 169.66990 551.06844
11.35000 -4009.57715 1.18698 29.24573 219.48360 178.99837 550.60815
11.45000 -3966.41796 -2.78151 48.44685 168.65503 133.40675 538.62193
11.55000 -3925.66886 11.69398 51.78175 540.31023 249.42035 711.01971
11.65000 -3910.76950 -3.15940 35.06997 130.76784 115.97934 498.12895
11.75000 -3871.75424 0.06394 17.45936 116.97223 110.42797 501.77722
11.85000 -3845.24465 -6.20393 24.36631 130.13007 209.06794 461.10293
11.95000 -3803.81177 9.97160 1.20041 357.77453 133.37106 644.06185
12.05000 -3809.09614 24.41202 -5.91400 329.34328 560.72145 484.50147
12.15000 -3760.77306 4.00291 23.46534 164.99364 148.37913 475.43316
12.25000 -3738.49653 -5.87126 27.02177 146.69436 121.85228 456.37086
12.35000 -3714.81274 -15.70960 28.94681 179.44027 361.90582 437.56602
12.45000 -3674.91311 0.98554 37.17317 153.94984 118.06379 423.84095
12.55000 -3652.48806 -2.60543 -0.46502 151.74346 212.11378 449.40350
12.65000 -3625.03519 -0.06826 53.96598 166.06459 210.75441 440.66570
12.75000 -3602.61627 -4.11949 22.69578 164.04461 197.37976 419.53392
12.85000 -3583.50319 -5.70817 12.68986 173.19687 175.51442 437.18363
12.95000 -3570.45024 -14.59879 40.90523 268.23667 472.53376 666.16319
13.05000 -3520.36987 4.68646 12.61752 135.82916 229.43839 394.45428
13.15000 -3488.15399 10.90043 29.30842 311.40736 281.75599 436.76058
13.25000 -3480.24904 -8.48433 34.44309 128.39903 122.85187 345.65706
13.35000 -3455.95415 -1.45503 32.54393 226.88929 158.55450 378.10623
13.45000 -3429.04689 8.85067 29.69677 97.45259 114.45780 350.20241
13.55000 -3395.02605 6.35765 12.77619 306.36345 176.87059 526.13897
13.65000 -3378.77410 -5.10210 24.63561 105.17399 91.85256 335.31307
13.75000 -3343.58523 1.39959 7.64823 123.51751 105.41009 362.74245
13.85000 -3322.12988 6.04024 6.92508 97.17604 109.88448 315.71118
13.95000 -3309.66634 2.30760 30.84029 179.03229 105.24806 336.51478
14.05000 -3279.30551 5.08448 30.38573 116.86502 92.22808 335.44834
14.15000 -3248.31285 -3.29733 -5.40498 179.98087 120.35501 335.21425
14.25000 -3243.85635 -0.60218 21.28908 308.70742 197.40576 362.73200
14.35000 -3216.82455 -1.86181 6.24023 113.69680 145.14663 301.99261
14.45000 -3185.58068 6.63222 21.97727 133.76437 188.91232 450.95034
14.55000 -3173.39910 7.19654 16.41501 88.89276 144.29471 295.28232
14.65000 -3143.35639 4.78735 34.09064 101.90600 93.01302 303.37718
14.75000 -3128.54249 2.73350 5.56419 88.55630 117.20318 269.99463
14.85000 -3110.82229 -1.25297 9.82054 85.25751 87.63897 261.78592
14.95000 -3083.22306 2.23032 35.51302 112.73704 184.03421 283.75628
15.05000 -3059.29842 11.34355 26.72707 79.69950 78.36527 267.29081
15.15000 -3040.85072 6.90825 20.17211 82.17083 207.68341 248.15843
15.25000 -3012.74076 -9.44757 24.07915 76.54638 114.92680 257.57013
15.35000 -2990.24502 7.96667 46.68643 170.70301 140.50527 297.12028
15.45000 -2965.52973 -1.91794 31.73718 155.28643 198.34704 262.78495
15.55000 -2957.67678 2.80230 24.50711 96.51250 75.94473 246.25157
15.65000 -2939.98263 -0.59113 50.22128 90.44346 72.08576 232.38949
15.75000 -2912.94616 -4.11378 20.86440 144.73951 103.72597 335.40500
15.85000 -2899.32425 -6.37304 30.64976 86.17953 72.31924 223.48027
15.95000 -2870.56261 8.32612 18.11088 121.55442 159.21631 241.48564
16.05000 -2859.40119 1.54425 31.43610 105.67718 83.53379 212.78871
16.15000 -2822.39715 -7.44445 5.96601 181.46873 111.89263 251.74953
16.25000 -2813.21525 2.21013 0.09366 106.85709 96.95599 487.12875
16.35000 -2795.57497 -4.67938 20.02679 74.26002 77.22064 194.47792
16.45000 -2788.55408 5.73763 19.83164 86.87072 95.06683 275.04279
16.55000 -2764.19996 0.99055 11.63477 66.53463 65.41713 197.40722
16.65000 -2747.84571 -0.58247 17.82396 85.89339 81.40240 199.47776
16.75000 -2710.74666 30.22000 38.39173 274.77990 466.25294 230.32383
16.85000 -2710.03720 2.87830 40.48845 73.75650 81.71802 203.96188
16.95000 -2700.10304 -8.57207 16.50152 82.81248 65.20936 206.54953
17.05000 -2667.72739 -2.70874 15.73056 67.77684 49.26591 198.34052
17.15000 -2656.20804 2.74224 36.11728 70.41708 196.26719 249.40568
17.25000 -2633.92619 1.19805 26.15720 73.82318 66.22778 187.36696
17.35000 -2631.04623 1.08640 -0.64872 124.67494 86.31562 193.55311
17.45000 -2621.16187 -3.71557 27.29643 173.02850 50.66683 291.29576
17.55000 -2599.53435 2.65889 5.64443 147.56703 100.89437 199.44972
17.65000 -2578.93277 5.59650 28.61308 85.04279 46.66260 148.97792
17.75000 -2555.18120 8.29264 17.07317 85.25598 105.05091 169.50155
17.85000 -2542.82326 4.23811 3.44922 51.54816 58.65075 178.47899
17.95000 -2537.48292 5.05639 -2.54984 185.01931 162.56183 154.19635
18.05000 -2514.55226 0.19413 11.74149 48.12796 63.70904 152.76719
18.15000 -2524.98260 -0.19374 -1.61059 346.61732 69.13466 165.66677
18.25000 -2487.21573 2.42374 36.08094 61.57337 89.53222 154.75418
18.35000 -2467.56698 3.02160 36.18734 48.65219 91.93746 175.40333
18.45000 -2440.43363 5.45650 -4.45236 85.34314 88.27267 150.63117
18.55000 -2430.85397 2.72149 11.41113 63.82096 85.52185 141.13284
18.65000 -2418.57769 -0.84175 27.99584 56.71096 41.63735 133.14624
18.75000 -2404.57889 3.47204 6.64789 41.99145 41.10701 125.38739
18.85000 -2397.20739 0.77103 4.45735 60.49543 51.21840 125.47308
18.95000 -2380.10135 1.18389 39.98421 54.10520 53.10002 129.35331
19.05000 -2361.03902 12.92336 16.80871 72.64383 164.98054 149.55104
19.15000 -2352.42481 0.39517 17.38675 49.40157 47.56748 127.03106
19.25000 -2331.43670 5.47765 19.22261 42.58068 39.83119 123.73542
19.35000 -2326.03268 -8.86468 29.98371 70.85056 96.00324 128.08167
19.45000 -2305.17165 -5.67910 19.50948 85.73382 60.66839 137.96686
19.55000 -2293.97094 0.98329 29.37520 42.24308 75.84099 119.07022
19.65000 -2275.97162 -1.32683 33.99740 48.63218 42.70825 132.18045
19.75000 -2268.95916 -3.47441 15.42660 63.43591 61.59505 127.05502
19.85000 -2258.77056 1.51575 34.84224 65.67922 65.25132 134.38224
19.95000 -2266.27932 -7.20019 25.94038 225.81990 74.51869 116.17876
