0.1875 -0.82601 18.01483 0.25777 121.57066 120.75643 98.67983
0.5625 0.56209 36.3986 1.51235 121.1382 114.22843 92.20423
0.9375 -0.11194 56.38105 1.00848 119.97094 102.71842 86.48798
1.3125 -0.2832 68.59221 1.01052 115.42728 93.6325 81.32995
1.6875 1.09503 75.22798 0.15647 111.33473 86.3232 76.09838
2.0625 -1.59125 78.16201 -1.78135 107.38456 80.08756 71.65098
2.4375 -0.63 82.64288 -0.16157 102.1491 76.11781 68.11587
2.8125 -0.45093 87.44471 -1.62295 98.39277 74.15048 64.66504
3.1875 -0.63602 90.30997 -2.3834 92.82299 71.23208 61.106
3.5625 -0.57601 97.98216 -3.13565 88.12447 69.91037 58.51003
3.9375 -2.37526 104.47994 -3.03361 83.48762 68.37262 55.76185
4.3125 0.84022 115.41085 -3.57693 78.36998 67.47143 52.17369
4.6875 -1.10601 126.03254 -4.87624 71.25928 65.93813 49.32825
5.0625 -2.03432 139.71435 -2.63969 65.75366 64.16793 45.57064
5.4375 -0.36819 151.18938 -2.77608 59.09737 59.83689 42.3965
5.8125 -0.55635 159.80851 -0.13553 52.02586 55.54639 38.53383
6.1875 -0.60088 167.84434 1.60232 47.06302 49.50026 35.77824
6.5625 -0.28096 172.26613 2.10853 43.41781 45.09886 32.39401
6.9375 -0.15981 178.01305 3.34036 39.59237 39.99554 30.29722
7.3125 -0.16624 181.79295 3.07395 37.19344 36.39223 28.7164
7.6875 0.09769 187.28594 2.77091 35.5277 31.14057 27.12081
8.0625 -0.52945 190.6449 2.48219 33.60701 28.63045 25.96217
8.4375 -0.35581 192.91483 2.34381 33.13828 26.30541 25.47906
8.8125 -0.07736 194.90797 2.18558 32.04443 24.22496 24.1017
9.1875 -0.46676 195.2115 2.56381 31.00736 25.08325 23.30174
9.5625 -0.98676 197.83623 1.82353 30.69972 24.30491 22.86538
9.9375 -0.24173 199.21405 1.4119 29.17188 23.80142 22.20972
10.3125 0.15852 200.921 0.42977 27.68873 22.74384 21.21128
10.6875 0.56834 200.87961 1.25506 26.95424 21.97564 20.49201
11.0625 -0.11383 201.44498 0.29383 26.28231 20.52861 19.34909
11.4375 -0.1012 201.58925 -1.26574 25.85482 19.36094 19.21454
11.8125 -0.52329 201.60103 -0.94993 24.98106 18.60548 18.73696
12.1875 -0.75005 201.92368 -0.53412 24.41221 18.29596 17.55221
12.5625 -0.71431 200.95926 -0.34125 24.40693 17.3363 17.20564
12.9375 -1.13734 201.7839 -0.52566 22.83862 17.18208 16.45982
13.3125 -1.49521 201.42419 -0.23173 23.15994 16.64347 16.33329
13.6875 -1.12868 201.94534 -0.75452 21.34888 17.32108 15.54425
14.0625 -0.4286 203.75772 0.31553 20.4484 17.44639 14.9369
14.4375 -0.95843 205.53554 0.64995 20.77374 16.45298 14.52878
14.8125 0.2599 205.90253 0.8515 19.69969 15.71261 15.13979
15.1875 -0.24216 207.31198 0.50755 19.40803 14.82142 14.56741
15.5625 1.48221 207.00204 0.74016 20.07494 12.98464 15.14658
15.9375 0.2495 205.3722 0.14534 18.89868 13.0123 14.38099
16.3125 1.20542 205.13365 -0.82271 18.92811 11.95252 13.98544
16.6875 -0.57922 204.39193 0.29869 18.60864 11.40013 14.1
17.0625 1.15279 203.31783 0.33134 17.98937 11.4244 13.4389
17.4375 -0.41894 201.77537 -0.92247 17.21546 11.37229 14.01868
17.8125 0.33913 202.14808 -0.93484 16.55172 12.4283 12.79381
18.1875 -0.45957 201.83352 -0.80708 15.75092 12.82469 12.47326
18.5625 -0.28048 203.26894 -1.30635 15.16964 12.19996 12.16411
18.9375 -1.03618 204.1017 0.42708 13.94702 11.16869 10.902
19.3125 -0.30852 203.84619 0.08786 13.0681 10.90103 10.90625
19.6875 -0.47206 204.39562 0.34021 12.77899 10.17146 10.07689
20.0625 -0.08765 203.35009 0.01368 12.09388 9.83399 10.2808
20.4375 -1.12042 203.47908 -0.42572 13.48456 10.24418 9.99136
20.8125 -0.88468 204.23196 -0.7361 11.92364 9.19154 8.84273
21.1875 -1.12206 205.74289 -0.26994 11.19215 8.92299 8.3836
21.5625 -2.33532 204.25602 1.42689 11.7139 8.33386 9.46412
21.9375 -0.63957 204.53561 0.79657 12.02583 9.46191 7.78828
22.3125 -0.48517 205.35073 0.06646 11.64577 8.66639 8.39205
22.6875 -0.74931 202.9936 0.18726 12.14287 8.68366 10.53265
23.0625 -1.34796 203.64025 2.58154 10.28108 6.93383 7.95322
23.4375 -0.94921 202.93094 2.24493 11.257 9.23756 8.42904
23.8125 0.52139 203.02655 0.38909 9.74455 6.92525 8.70784
24.1875 2.72333 203.85142 -1.4978 9.68719 8.43536 7.72253
24.5625 2.70289 201.29855 1.72195 10.17361 8.00876 8.0946
24.9375 1.42136 204.71246 0.99379 9.90773 8.01515 9.13835
25.3125 1.09472 203.84205 -1.95472 8.71572 6.12082 6.6058
25.6875 -1.70622 201.63963 0.40302 9.39574 6.40724 8.28466
26.0625 3.33989 202.8558 1.34589 9.48913 9.53956 6.86604
26.4375 1.68424 200.095 1.76553 8.66909 7.82046 4.85259
26.8125 -0.40296 200.53147 0.87861 12.1389 7.85407 7.66289
27.1875 4.01953 202.26958 -1.01565 8.295 7.09758 6.93916
27.5625 -2.61883 202.25481 0.39738 9.00185 8.34472 5.91449
27.9375 1.64067 204.17034 -1.59627 5.4052 4.15783 5.10178
28.3125 -0.96636 201.5288 -0.90888 7.8465 5.1762 6.77855
28.6875 -3.57146 200.13572 -0.67043 5.67929 7.5746 5.85485
29.0625 -4.53193 201.97677 -1.48498 7.56285 7.50799 5.15576
29.4375 -1.04919 205.44647 2.0135 7.69061 6.04632 3.10022
29.8125 0.21668 199.77525 -3.07164 8.54761 8.38016 6.57796
