0.05000 -2214.96333 511.23693 -1724.51339 4692.31410 4779.82689 4451.63294
0.15000 -5299.09022 -266.36467 -2604.13215 4155.02567 4654.88996 6698.86451
0.25000 -6704.51505 209.40100 -1291.33440 3547.94770 4281.22973 8378.97091
0.35000 -7616.55019 -22.00233 -797.79389 3181.79591 3355.87204 8936.99652
0.45000 -8103.85881 85.06273 -676.31060 3339.02048 2996.43251 9372.61370
0.55000 -8445.16706 -31.53224 -186.47320 3268.48182 2742.67692 9367.33403
0.65000 -8374.80315 29.18789 -17.26422 3193.28685 2781.29688 9365.21585
0.75000 -8559.05959 -6.02846 -246.50155 3015.61181 2713.62312 9202.03552
0.85000 -8547.12811 27.64909 -6.33946 2959.78868 2620.01620 9133.79052
0.95000 -8478.82302 53.41188 -136.62497 2855.86037 2646.88732 8899.53416
1.05000 -8479.88761 38.42484 27.34477 2773.88975 2668.30733 8758.33520
1.15000 -8499.37452 12.59942 -14.16790 2633.50755 2710.22447 8449.78319
1.25000 -8569.87369 22.75265 -4.07537 2559.22594 2785.84875 8120.96011
1.35000 -8575.85654 16.25239 232.32060 2522.45276 2707.95682 7966.56244
1.45000 -8581.37928 -16.39501 159.84540 2425.44268 2694.75369 7730.49426
1.55000 -8494.30774 3.70651 -19.68097 2326.89453 2717.94918 7457.76827
1.65000 -8467.02783 -17.46586 153.90695 2266.89487 2721.00105 7189.76846
1.75000 -8395.69984 -47.05521 367.18167 2168.94302 2707.60975 6983.40286
1.85000 -8299.51186 -0.54905 198.71848 2114.17960 2712.75564 6805.93167
1.95000 -8233.46807 3.31522 67.76574 2025.54363 2705.49185 6563.41664
2.05000 -8173.89327 -63.36876 226.13850 1973.93009 2687.69994 6321.39667
2.15000 -8027.99545 -10.58658 99.29174 1836.40477 2705.86594 6221.09930
2.25000 -7973.69828 -24.03687 79.40748 1750.84595 2694.64189 5985.21510
2.35000 -7896.45706 -51.28547 137.09762 1707.45507 2694.47433 5788.63273
2.45000 -7812.23919 -92.66979 90.99300 1612.69118 2682.14630 5700.12099
2.55000 -7732.37976 11.05137 153.11429 1517.05567 2723.67061 5465.68261
2.65000 -7683.56682 -89.11961 192.20394 1457.74836 2703.00052 5413.89266
2.75000 -7634.60897 -80.99471 99.65706 1391.47216 2666.60004 5252.09479
2.85000 -7502.61321 -97.50429 292.99699 1338.58204 2650.35258 5141.63075
2.95000 -7487.08801 -16.61952 92.92681 1211.59898 2583.01798 4997.67474
3.05000 -7389.28227 -50.20199 25.58175 1242.99043 2602.48881 4948.75068
3.15000 -7351.15228 -60.18227 19.85957 1129.75879 2563.23509 4835.47441
3.25000 -7298.92345 -57.25824 71.59069 1086.81478 2532.40973 4692.57604
3.35000 -7233.19167 -54.16857 27.09913 1050.38199 2517.15674 4657.14708
3.45000 -7184.85862 22.01654 48.03324 964.57457 2463.54819 4494.98401
3.55000 -7126.63238 -30.06288 -143.58672 974.16553 2433.95482 4466.97601
3.65000 -7069.89436 -4.39655 58.15858 907.58849 2426.83965 4348.21215
3.75000 -7033.34445 -37.45113 -38.50824 872.51995 2394.40477 4215.63060
3.85000 -6965.57323 -18.56965 -29.82401 843.84182 2320.82623 4121.15399
3.95000 -6905.15196 -8.94732 106.15093 815.57974 2307.42372 4054.71835
4.05000 -6878.73670 -36.06432 2.48453 751.34025 2328.76512 3966.98326
4.15000 -6828.16291 -6.66898 -28.07681 753.42998 2265.21600 3914.86504
4.25000 -6777.72642 -55.00206 -81.54446 682.15279 2193.73901 3819.13059
4.35000 -6745.08323 22.31238 -62.13472 661.30493 2168.60759 3799.20620
4.45000 -6708.18657 -62.87127 -25.37051 672.58886 2155.70853 3658.94783
4.55000 -6651.40014 8.14795 25.82387 687.92569 2123.87039 3654.82027
4.65000 -6640.59990 -8.22291 -37.15209 673.23555 2079.76724 3558.30779
4.75000 -6636.01250 44.56481 -86.70769 594.86083 2026.87819 3507.99032
4.85000 -6597.64534 12.26607 -51.28967 604.58324 1985.94787 3469.45801
4.95000 -6587.30429 52.50958 -60.36906 574.55058 1971.19222 3398.51396
5.05000 -6558.97262 67.15088 -138.17851 571.83822 1899.70942 3298.68199
5.15000 -6552.91269 1.16014 -43.27759 577.47232 1876.42904 3193.03412
5.25000 -6542.97030 72.05429 -50.27750 746.38538 1836.21984 3183.73784
5.35000 -6512.86187 0.32276 -48.04669 604.59352 1782.57569 3134.00365
5.45000 -6466.47322 -5.58163 20.17691 601.72470 1715.84555 3062.89149
5.55000 -6434.86362 -11.14197 18.39886 641.36718 1694.79575 3002.33453
5.65000 -6424.26148 11.08783 -41.35705 613.31447 1668.06367 2881.97776
5.75000 -6379.21208 -9.92653 -60.98217 670.66268 1590.96325 2817.77419
5.85000 -6344.59297 32.97129 -45.77637 649.41129 1560.66138 2790.52932
5.95000 -6322.56010 -14.74107 -123.55406 625.05507 1525.58138 2726.18043
6.05000 -6296.84161 35.27097 -31.21513 636.32230 1477.05506 2642.23104
6.15000 -6282.69301 32.90781 8.32921 728.09296 1433.33961 2622.18814
6.25000 -6252.85324 -15.68056 -21.30142 671.58985 1385.94240 2565.86709
6.35000 -6265.83151 8.47311 -56.05202 715.21251 1351.39336 2467.30288
6.45000 -6246.30636 5.85170 -39.39690 765.44308 1311.24614 2459.72787
6.55000 -6226.16026 -11.86857 -45.95549 774.12995 1286.89309 2355.17274
6.65000 -6200.65158 -27.29134 -20.87412 796.03556 1240.79182 2300.50696
6.75000 -6219.97169 0.14846 -46.96646 848.93786 1188.17565 2261.01720
6.85000 -6191.21158 -19.59354 -87.26851 842.87027 1142.62829 2179.31454
6.95000 -6193.90793 -8.37963 -59.11929 893.38109 1091.66368 2119.57681
7.05000 -6197.62046 -24.34144 -59.13081 921.84981 1060.18923 2031.03383
7.15000 -6168.06333 -31.95448 -5.55887 930.30120 1008.62609 2004.69470
7.25000 -6136.53825 -26.75398 26.84167 996.67226 991.91213 1913.55881
7.35000 -6096.06312 -4.35429 -44.39558 985.55249 911.33172 1856.98877
7.45000 -6070.44353 -12.40657 -47.27843 971.36378 869.68699 1769.59077
7.55000 -5999.45669 -0.88196 -48.25287 963.54944 809.81189 1712.37571
7.65000 -5934.80224 -13.01256 -3.74822 940.06290 764.35590 1669.73830
7.75000 -5877.12426 3.08838 -22.91570 933.45021 725.37611 1586.90611
7.85000 -5787.95350 -3.54726 2.15126 917.67381 684.87970 1516.85546
7.95000 -5732.92671 2.74533 -33.42833 881.49202 642.20886 1478.35812
8.05000 -5675.58846 -2.25913 7.21328 895.39392 622.56122 1425.43884
8.15000 -5580.95841 1.27778 -9.97859 809.26758 578.99837 1353.01710
8.25000 -5528.19947 7.98901 -0.02380 779.21928 569.16317 1339.45437
8.35000 -5451.30418 18.92226 -23.88391 742.45759 533.39473 1277.06528
8.45000 -5384.06426 6.90300 9.06395 709.52241 510.08308 1236.50122
8.55000 -5322.08677 6.17090 0.65479 684.32960 494.86615 1218.12201
8.65000 -5245.73270 12.39596 -27.14674 622.32212 454.34301 1158.74720
8.75000 -5182.60266 11.44028 -23.03583 587.15602 437.71300 1140.92747
8.85000 -5145.86695 13.37213 -43.87468 560.51161 433.60865 1121.97038
8.95000 -5087.23881 19.98481 -17.66086 544.90503 409.71373 1080.59447
9.05000 -5036.84870 17.30768 -10.89593 521.07795 387.70219 1058.24437
9.15000 -5001.18338 13.96013 -16.03688 535.15086 384.90718 1048.70282
9.25000 -4954.34105 11.65358 -21.13232 497.55466 374.71238 1014.18422
9.35000 -4915.61566 20.93891 -27.44574 464.13680 367.28391 982.77162
9.45000 -4861.42845 13.37078 -19.08439 459.45840 333.03571 981.40596
9.55000 -4824.47454 22.99332 -18.63434 439.14423 425.67964 965.68017
9.65000 -4790.83869 12.79436 -25.04192 434.39387 327.50233 917.16229
9.75000 -4733.47318 16.02728 13.66532 401.12077 330.54530 902.70669
9.85000 -4697.37069 13.82393 -10.65961 396.87099 290.79423 882.09590
9.95000 -4660.03947 16.13592 -10.18400 380.85024 289.95097 862.79196
10.05000 -4634.17238 6.87897 7.97919 355.24777 259.34233 857.50134
10.15000 -4591.39223 14.64148 -26.88595 345.36841 257.94265 819.56929
10.25000 -4543.65988 13.85526 9.38474 354.83032 268.40916 813.13435
10.35000 -4506.41849 5.10023 7.70473 352.59296 260.25094 799.60526
10.45000 -4476.33514 12.29477 -30.57211 314.98852 243.90752 784.43984
10.55000 -4444.10586 2.36656 -2.65973 307.87993 228.50422 773.84278
10.65000 -4405.19929 9.31274 16.38912 309.74745 252.29956 732.40281
10.75000 -4384.92194 5.96908 0.19745 293.13588 204.57878 729.76590
10.85000 -4327.21823 6.46821 -15.62546 281.87834 220.46539 716.87765
10.95000 -4305.74497 10.43538 -4.89311 307.14666 216.70056 702.54636
11.05000 -4272.94441 8.11300 -0.37681 270.30735 189.94090 679.86737
11.15000 -4232.69449 6.39112 5.51408 265.36334 239.75449 671.03625
11.25000 -4208.36031 2.78035 -6.77508 259.50174 188.83987 659.73039
11.35000 -4170.84738 11.52183 0.89071 274.21002 217.98228 652.35456
11.45000 -4138.76889 4.25474 -15.70236 248.32335 178.84291 642.66498
11.55000 -4110.97362 3.89555 12.89589 263.82931 185.70063 618.17236
11.65000 -4060.95891 12.54264 9.49196 250.05596 188.43766 607.36889
11.75000 -4033.65024 7.51304 -0.33973 234.39364 155.46690 586.43234
11.85000 -4003.46653 9.20333 -21.03942 309.46508 187.41771 590.84187
11.95000 -3978.08294 1.55512 -9.26036 291.36627 263.46540 569.78866
12.05000 -3936.66845 7.22130 16.52831 218.87248 169.54705 550.43319
12.15000 -3904.37631 10.38194 0.68226 223.13015 166.99902 556.53638
12.25000 -3876.02742 12.51465 3.80002 218.24903 185.92600 538.07466
12.35000 -3846.46120 5.77652 -0.96619 244.44429 144.46589 514.60477
12.45000 -3812.08853 7.70378 -6.96929 202.21919 127.82230 518.22312
12.55000 -3782.85852 6.37189 15.12625 201.99122 142.21989 499.24643
12.65000 -3746.49724 13.71439 6.53317 225.02570 145.94472 502.29195
12.75000 -3724.88458 13.63047 6.82217 191.55095 186.04625 489.72694
12.85000 -3684.56156 4.59739 2.27678 195.68028 174.31776 487.80459
12.95000 -3661.84833 5.22699 -3.06921 207.11452 196.23775 469.89145
13.05000 -3627.83733 9.32478 -6.40835 187.62912 122.44818 457.63770
13.15000 -3602.59468 7.38583 10.53642 195.98393 110.15504 453.74009
13.25000 -3566.76538 7.31225 -17.96707 174.54003 115.34127 422.56466
13.35000 -3532.88571 9.98480 3.74861 212.11218 104.24787 451.70229
13.45000 -3502.78078 10.04371 8.84658 168.58448 133.46126 424.09477
13.55000 -3478.88065 5.45349 -14.67832 172.70920 126.50825 439.37552
13.65000 -3451.60138 5.70299 -15.40429 184.58633 95.69831 419.71346
13.75000 -3430.35420 9.17532 -19.15926 172.08941 134.62333 423.67623
13.85000 -3395.64161 4.57156 -2.56355 170.95874 110.69525 419.42260
13.95000 -3369.86162 6.03721 1.11765 168.80817 98.95655 392.02908
14.05000 -3341.09811 6.48267 -25.77968 166.26746 138.30114 418.50697
14.15000 -3315.75155 5.94858 -5.67278 198.44252 141.57990 397.49092
14.25000 -3292.38657 1.43438 13.98747 165.86694 150.71390 383.97142
14.35000 -3275.98764 10.32562 -19.53718 156.88248 87.65049 377.13029
14.45000 -3251.60089 6.41064 7.98828 145.17356 98.33801 372.40918
14.55000 -3226.35957 5.05940 -0.86118 130.26644 104.99939 348.63311
14.65000 -3202.35945 4.85782 2.44073 120.85679 106.67642 358.91675
14.75000 -3177.93864 6.63808 -3.31081 121.76013 68.40144 342.29926
14.85000 -3158.62446 3.17157 -0.61217 163.04049 145.17742 358.94063
14.95000 -3139.05469 8.66702 0.96363 115.09648 96.88392 354.98985
15.05000 -3119.78365 5.28235 -14.37005 113.92001 78.77274 338.14142
15.15000 -3104.57968 7.97931 -3.66665 131.10157 132.10133 337.98322
15.25000 -3082.83791 4.54642 -1.74958 107.64878 65.37654 332.70956
15.35000 -3064.10875 8.74683 0.28523 120.14888 105.25743 329.39371
15.45000 -3049.65002 4.98276 -14.25168 109.65361 95.55899 313.81435
15.55000 -3024.94934 2.61541 -3.07057 141.52634 103.05133 329.19447
15.65000 -3004.81078 6.35892 1.67890 131.24286 123.49431 324.86028
15.75000 -2988.84788 6.44742 16.68792 97.14014 82.65089 300.50611
15.85000 -2976.24604 6.24598 3.52140 84.12601 67.63992 294.43363
15.95000 -2959.84374 6.29374 -8.25857 109.85051 76.24348 297.64876
16.05000 -2940.89325 5.20128 -2.37439 88.93279 89.02516 292.33445
16.15000 -2923.00376 7.87693 4.54019 86.39767 74.77888 316.17714
16.25000 -2907.27390 7.52550 6.17479 94.65983 82.59969 280.01072
16.35000 -2889.23784 8.14186 11.34217 74.33044 57.93205 275.53444
16.45000 -2868.96220 4.29983 4.48088 85.81069 92.77092 274.59583
16.55000 -2859.99403 4.27096 8.93770 76.88280 67.37426 268.46746
16.65000 -2839.78427 4.72813 6.25684 86.28583 64.32957 263.98072
16.75000 -2826.44079 4.34810 5.23882 78.67261 63.16691 258.65564
16.85000 -2805.67245 5.49915 -6.72923 111.59469 98.52444 293.22524
16.95000 -2789.60346 7.22809 1.72439 98.98563 99.26537 259.92637
17.05000 -2773.16487 7.82250 11.69141 81.23148 80.67242 248.51351
17.15000 -2759.19229 2.45876 4.06142 84.58837 55.92245 244.78704
17.25000 -2744.82875 5.38386 11.64494 98.22220 54.97450 253.07130
17.35000 -2726.74978 1.08963 -1.52337 92.22164 92.75801 257.25016
17.45000 -2713.80276 7.39530 8.09448 93.87294 85.86101 242.28456
17.55000 -2694.29227 6.57429 14.34946 117.91245 103.87061 245.30497
17.65000 -2678.92681 5.20658 18.72152 69.19370 54.95658 225.36284
17.75000 -2660.55418 5.26865 -4.77800 132.86673 65.55773 219.67393
17.85000 -2647.30720 1.25218 5.88333 54.88423 56.84565 221.46710
17.95000 -2632.28483 11.04425 8.26830 124.92265 163.93968 244.23661
18.05000 -2625.07362 0.87078 5.45720 104.97545 113.43099 255.62674
18.15000 -2601.62096 4.87958 5.65619 125.68759 85.42009 222.46446
18.25000 -2591.88920 10.32868 11.66567 126.28310 201.94998 220.66984
18.35000 -2571.43717 1.43766 3.11414 48.95309 39.73495 189.59140
18.45000 -2554.76076 4.47944 6.41931 94.19566 46.98522 209.44514
18.55000 -2542.53749 1.35027 10.18296 61.04855 62.16678 191.06609
18.65000 -2528.44470 3.16867 2.91071 50.34529 44.04069 183.25418
18.75000 -2512.38456 -0.12677 13.48742 70.70394 99.34046 191.00948
18.85000 -2498.65688 1.00047 6.52791 72.51282 58.23265 178.17133
18.95000 -2481.64241 0.31118 12.66419 39.82844 57.51517 166.31210
19.05000 -2459.16914 6.72357 9.62455 174.10656 141.34022 183.82044
19.15000 -2456.85209 0.81113 12.66999 147.04330 101.63850 171.35412
19.25000 -2437.18415 2.70108 7.08642 75.54203 65.14047 169.13673
19.35000 -2427.14187 1.14716 15.00753 54.93054 46.51780 158.04567
19.45000 -2411.76623 -0.73763 -3.15994 47.36970 54.59093 159.76768
19.55000 -2389.83591 9.77006 -1.90684 102.62827 172.55454 177.72855
19.65000 -2381.16866 3.85763 6.00740 60.71357 56.07828 166.60951
19.75000 -2366.15573 -3.62608 -1.00420 46.13995 77.10286 157.43600
19.85000 -2350.64748 1.64148 12.09120 53.96177 60.67534 171.39432
19.95000 -2341.26568 0.05115 4.15272 114.20695 88.86907 165.69856
