0.2 -0.20407 17.59295 0.0618 108.67116 105.13631 88.01946
0.6 0.50172 39.48273 1.01203 106.44525 99.5845 82.70379
1.0 0.30046 60.51769 0.30035 104.97712 91.01688 77.901
1.4 -0.41208 72.74914 0.28655 102.27255 84.7834 72.75227
1.8 -0.96565 80.18466 -0.26389 98.39444 79.61222 68.33663
2.2 -0.44498 86.8653 0.26529 95.11398 74.78235 64.71965
2.6 -0.96479 92.94855 0.5921 91.82714 70.73295 61.67078
3.0 -1.36062 100.1293 0.32149 86.86449 66.51741 58.43047
3.4 -2.23787 105.39945 0.75553 80.72183 63.51662 55.16894
3.8 -1.69639 112.03383 0.67815 74.11611 62.68683 52.84731
4.2 -2.36753 122.78245 0.00833 68.55707 62.49249 49.68838
4.6 -0.96742 134.74905 0.57733 62.73781 60.98038 46.35937
5.0 0.02087 148.36971 -0.17474 57.03059 56.39933 42.71826
5.4 1.37147 161.017 -1.20079 50.76602 49.52542 39.04064
5.8 2.34976 169.73536 -1.51726 45.54067 43.23817 35.4914
6.2 2.0311 174.55064 -1.7218 41.31601 39.25195 31.76432
6.6 2.81314 179.04703 -1.3691 38.23526 35.6856 29.02828
7.0 2.32652 184.07477 -1.37155 36.33123 32.03268 26.55557
7.4 1.99231 187.52515 -1.40296 34.91766 28.70872 24.86901
7.8 1.60692 190.52448 -0.54695 34.46123 25.87984 23.60376
8.2 1.8846 192.88948 -0.40244 33.6031 23.51676 22.30065
8.6 1.44356 193.99783 -0.51869 32.41261 22.32312 21.53253
9.0 0.87822 194.53721 0.06997 30.4298 21.77406 20.03081
9.4 -0.2876 195.49922 0.21654 28.4667 21.36809 19.28244
9.8 -0.9224 196.46974 0.85271 26.84279 21.57733 18.4432
10.2 -0.64573 197.39677 0.88431 25.3815 21.46239 17.91894
10.6 -0.35507 199.29153 1.25513 23.78111 20.193 17.46755
11.0 -0.09793 200.54547 1.02444 22.99311 18.64068 16.72447
11.4 0.31701 200.67462 1.70635 22.19972 17.08803 16.15559
11.8 0.67494 201.29853 1.24779 21.15271 16.15636 15.5757
12.2 0.83454 201.60128 0.81305 20.0664 15.73623 14.84447
12.6 0.07966 202.1931 0.544 19.39269 15.77175 14.37107
13.0 1.10387 204.06822 0.10198 18.23249 15.88102 13.53309
13.4 0.19337 205.34394 -0.62897 17.88282 15.32371 13.0666
13.8 -0.03305 206.37214 -0.71114 17.39728 13.95865 13.02405
14.2 0.12384 206.8666 -0.77983 17.40784 12.5402 12.19732
14.6 0.24307 206.84487 -0.67961 17.22861 11.19198 11.88022
15.0 0.13979 206.21457 -0.52437 16.28069 10.3504 11.61047
15.4 0.34705 204.89425 -0.36202 16.15069 10.54177 11.57567
15.8 0.40018 203.65321 0.07542 15.36552 10.72535 10.75097
16.2 0.60956 203.36063 0.07992 15.57184 10.88947 10.249
16.6 0.17898 203.21188 0.51558 14.67901 11.61507 9.92014
17.0 0.35672 203.57429 0.61637 13.59496 11.67816 9.84259
17.4 0.02567 205.5236 0.77504 12.64732 10.53664 9.65121
17.8 0.61741 205.90228 0.84264 12.55506 9.81459 9.47823
18.2 -0.48596 205.80674 1.12703 11.8226 9.56869 9.39081
18.6 -0.18854 205.79927 1.42983 10.99073 8.26147 9.26677
19.0 -0.7736 205.29052 2.22101 10.37759 7.6874 9.34591
19.4 -0.56247 204.56854 1.76091 11.00727 7.55969 9.00337
19.8 -1.28366 204.39085 1.11268 10.16339 8.23471 8.69128
