0.120000 1.917200
0.380000 -2.288300
0.620000 -2.267940
0.880000 -2.192100
1.120000 -2.153850
1.380000 -2.182210
1.620000 -2.170990
1.880000 -2.116410
2.120000 -2.097130
2.380000 -2.060240
2.620000 -2.145460
2.880000 -2.155400
3.120000 -2.128690
3.380000 -2.247560
3.620000 -2.327510
3.880000 -2.268140
4.120000 -2.405000
4.380000 -2.470450
4.620000 -2.743260
4.880000 -2.559010
5.120000 -2.508270
5.380000 -2.853560
5.620000 -3.100210
5.880000 3.112380
6.120000 -2.621080
6.380000 -2.899400
6.620000 3.137970
6.880000 -2.928610
7.120000 -3.007450
7.380000 -2.928940
7.620000 -2.956980
7.880000 3.119000
8.120000 3.072110
8.380000 2.699680
8.620000 2.454540
8.880000 2.238760
9.120000 2.280400
9.380000 0.933040
9.620000 1.234510
9.880000 1.225450
10.120000 0.105320
10.380000 1.545190
10.620000 1.409900
10.880000 1.454410
11.120000 1.814830
11.380000 1.912380
11.620000 2.679640
11.880000 2.790830
12.120000 1.629200
12.380000 0.137790
12.620000 1.322020
12.880000 -1.562210
13.120000 0.517790
13.380000 0.763370
13.620000 -0.068370
13.880000 -0.340680
14.120000 -0.080250
14.380000 0.065520
14.620000 -0.763070
14.880000 -0.811370
15.120000 -2.109730
15.380000 3.069850
15.620000 -0.025010
15.880000 0.069080
16.120000 1.193980
16.380000 -0.697940
16.620000 2.752550
16.880000 3.138630
17.120000 0.851000
17.380000 0.276000
17.620000 -0.943330
17.880000 -0.940980
18.120000 -0.207630
18.380000 0.771270
18.620000 2.511430
18.880000 0.970840
19.120000 1.796710
19.380000 0.083410
19.620000 1.167050
19.880000 2.225140
