0.12500 0.02624
0.37500 0.03478
0.62500 0.03001
0.87500 0.05062
1.12500 0.05325
1.37500 0.08913
1.62500 0.10712
1.87500 0.12479
2.12500 0.13195
2.37500 0.13800
2.62500 0.14758
2.87500 0.14962
3.12500 0.12357
3.37500 0.14210
3.62500 0.10724
3.87500 0.11309
4.12500 0.09395
4.37500 0.09342
4.62500 0.08415
4.87500 0.08192
5.12500 0.08819
5.37500 0.08201
5.62500 0.08216
5.87500 0.07885
6.12500 0.07891
6.37500 0.07861
6.62500 0.07968
6.87500 0.09645
7.12500 0.10137
7.37500 0.08299
7.62500 0.05459
7.87500 0.06101
8.12500 0.07711
8.37500 0.06409
8.62500 0.05446
8.87500 0.05569
9.12500 0.05449
9.37500 0.06946
9.62500 0.07905
9.87500 0.05024
10.12500 0.04906
10.37500 0.05029
10.62500 0.04778
10.87500 0.02098
11.12500 0.04147
11.37500 0.03828
11.62500 0.03350
11.87500 0.04140
12.12500 0.04172
12.37500 0.03571
12.62500 0.03154
12.87500 0.01269
13.12500 0.04769
13.37500 0.02907
13.62500 0.05753
13.87500 0.04134
14.12500 0.04254
14.37500 0.03403
14.62500 0.03626
14.87500 0.04982
15.12500 0.05150
15.37500 0.03131
15.62500 0.02373
15.87500 0.04158
16.12500 0.02236
16.37500 0.05370
16.62500 0.02397
16.87500 0.05131
17.12500 0.02073
17.37500 0.00770
17.62500 0.07008
17.87500 0.04897
18.12500 0.06670
18.37500 0.01723
18.62500 0.06425
18.87500 0.06388
19.12500 0.02502
19.37500 0.04754
19.62500 0.05629
19.87500 0.08319
