0.1875 0.56289 19.43231 0.68012 127.22496 123.40389 119.80383
0.5625 0.13938 46.92344 1.5483 118.07386 108.55027 101.72465
0.9375 -0.0803 67.33423 -0.16893 111.3669 96.63481 91.29777
1.3125 -0.1357 78.59775 0.17879 103.35528 89.59665 83.72443
1.6875 -0.88579 88.37516 0.82097 96.38176 83.39928 77.51676
2.0625 0.254 97.83767 0.79651 89.37427 78.51524 72.76984
2.4375 0.31155 109.61755 -0.47353 84.0436 74.52986 68.39329
2.8125 -0.32511 120.06866 -0.29674 77.77252 70.81469 64.79749
3.1875 -0.13036 135.28783 -0.43461 71.54014 67.16409 59.96848
3.5625 -0.68974 149.73765 -0.42166 66.61587 61.88771 53.58242
3.9375 -0.47912 161.69298 -0.59341 60.94285 54.59613 49.09748
4.3125 -0.70212 169.32553 -0.56957 55.0572 48.42564 45.422
4.6875 -0.99118 174.64932 -0.323 49.84473 43.91602 42.78182
5.0625 -0.955 179.78142 -0.46969 46.0999 40.53122 40.32057
5.4375 -0.56634 185.02647 -0.58895 44.08356 38.13925 38.57552
5.8125 -0.76745 190.0083 -0.05555 42.64411 35.62523 36.74884
6.1875 -0.36458 193.68141 0.30209 40.72548 33.31739 35.71934
6.5625 0.08192 195.41386 0.21274 39.1842 31.87754 34.34337
6.9375 0.10753 197.0875 0.27822 38.47802 30.98512 32.81635
7.3125 0.4235 199.03991 -0.01514 37.36876 29.85399 31.42208
7.6875 -0.25616 201.23956 -0.56916 36.03954 29.24396 30.41401
8.0625 -0.15226 202.19443 -0.20346 34.70978 28.45399 29.70888
8.4375 -0.07486 204.44299 -0.50693 34.25375 27.12533 28.6849
8.8125 0.71898 205.53184 -0.49006 33.16994 26.81464 28.01325
9.1875 0.58044 207.06566 -0.40384 32.53716 25.57671 26.82103
9.5625 0.46664 208.18797 -0.21778 31.96651 25.05222 26.12837
9.9375 0.86494 209.59256 -0.40773 31.10834 23.99825 25.41
10.3125 0.28445 210.03393 0.53906 30.2445 23.09003 24.65856
10.6875 0.50808 210.74886 0.26088 29.72405 22.0878 24.37373
11.0625 0.36257 211.41275 0.26168 29.26625 21.10007 23.60471
11.4375 0.29923 211.36777 0.32672 28.11232 20.53279 22.78596
11.8125 0.45182 211.5687 0.11081 27.69917 20.61831 22.07537
12.1875 1.01407 211.79783 0.11843 27.31385 19.92665 21.22894
12.5625 0.09144 212.38723 0.65554 26.02807 20.01615 20.75249
12.9375 0.1073 212.9384 0.1932 25.60247 19.86991 20.28775
13.3125 0.25001 213.24062 0.29107 25.20551 19.46764 19.0672
13.6875 0.33954 214.23579 0.59736 24.42381 18.5255 18.64227
14.0625 -0.10865 214.45445 0.97444 23.77652 18.49928 18.12778
14.4375 -0.34125 214.46092 0.45315 23.41377 17.83819 17.77839
14.8125 -0.52025 214.99969 0.49115 22.87775 16.88304 17.19707
15.1875 -0.50002 215.15493 0.18968 22.3997 16.02738 16.63867
15.5625 -0.16072 214.87581 -0.15161 22.09953 15.64626 16.27458
15.9375 -0.66986 214.74224 -0.38953 21.15061 15.15882 15.92797
16.3125 -1.00955 214.51627 -0.42363 20.74593 14.83901 15.05391
16.6875 -0.37919 214.42811 -0.0896 20.15998 14.36823 14.62977
17.0625 -0.2182 213.73498 -0.84312 19.70927 14.54377 14.50529
17.4375 -0.27265 213.67464 -1.04033 19.24631 13.9625 13.73049
17.8125 -0.38737 213.81874 -0.94472 18.69519 13.30464 13.27887
18.1875 -0.27516 213.1415 -1.10088 17.52615 12.87393 13.33072
18.5625 -0.30613 212.96299 -1.32396 17.51384 12.69618 12.59656
18.9375 -0.0871 212.80695 -1.13991 16.54584 12.78529 12.65016
19.3125 0.10535 212.44955 -1.2274 16.53724 12.77201 11.75277
19.6875 -0.3378 212.80339 -1.30673 15.79414 12.07697 11.66017
20.0625 0.37916 212.94252 -1.27271 15.70962 12.05396 11.68616
20.4375 -0.00425 212.81172 -1.18364 15.69959 11.50327 11.77099
20.8125 -0.07419 212.33863 -1.01108 15.3986 10.62669 11.46726
21.1875 0.73361 211.72002 -0.00223 14.4815 10.70473 11.45365
21.5625 0.41308 211.30899 -0.25045 14.50566 10.91235 11.28232
21.9375 0.28138 211.91452 -0.13839 13.51571 10.17688 10.92681
22.3125 -0.37095 211.83561 0.7454 13.28672 10.09131 10.42951
22.6875 0.24653 211.39876 0.07709 13.17079 9.99599 10.33173
23.0625 0.04033 211.33486 0.26762 12.41849 9.48204 9.88671
23.4375 0.07876 211.17033 0.73985 11.85681 8.81986 9.86493
23.8125 0.20821 211.22387 0.35473 12.01264 8.82851 9.20812
24.1875 0.93874 210.61487 -0.12453 11.82098 8.25033 8.91261
24.5625 0.59668 210.10451 0.23768 11.76294 8.52215 8.67928
24.9375 -0.17731 209.99122 0.78774 11.5811 7.96049 8.80639
25.3125 -0.10561 209.22206 0.6086 11.80176 8.15571 8.8281
25.6875 -0.33916 209.40521 0.69951 11.24234 8.00949 9.01475
26.0625 -0.35144 209.42759 1.16145 11.14449 7.61328 8.34581
26.4375 -1.1047 208.82177 0.45503 11.57306 7.18033 8.72115
26.8125 -0.35089 209.18167 0.76661 10.32732 6.58572 8.67496
27.1875 -1.34397 208.26968 0.12339 10.04875 6.42574 7.72181
27.5625 -0.28968 207.81659 -0.16949 10.39363 6.97059 7.96815
27.9375 -1.21796 207.47517 -1.00985 9.93556 6.96827 7.70963
28.3125 -0.77955 207.50958 -1.74343 9.38643 5.7468 6.93802
28.6875 -0.27822 206.26147 -0.87775 9.68944 6.40568 6.58264
29.0625 -1.48988 206.61903 -1.66543 8.6723 6.37742 7.20245
29.4375 -0.51402 206.06016 -1.18634 8.00617 5.89328 6.70988
29.8125 -1.28586 206.11748 -1.81378 9.08549 6.10536 6.59451
