<svg xmlns="http://www.w3.org/2000/svg" width="260" height="260" viewBox="0 0 260 260">
	<circle fill="#FFFFFF" cx="50" cy="50" r="80" transform="translate(80 46)"/>
	<g fill="#00A0E1">
		<path d="M129.879 0C77.562 0 35 42.563 35 94.882c0 31.605 29.071 81.486 41.569 101.465 10.282 16.436 21.32 32.062 31.079 44 15.871 19.414 20.328 19.414 22.232 19.414 1.827 0 6.105 0 21.921-19.42 9.784-12.014 20.831-27.637 31.106-43.988 12.584-20.027 41.854-70.006 41.854-101.471C224.761 42.563 182.198 0 129.879 0zm.001 171.525c-41.389 0-75.062-33.673-75.062-75.062 0-41.389 33.673-75.062 75.062-75.062 41.389 0 75.062 33.673 75.062 75.062 0 41.389-33.673 75.062-75.062 75.062z"/>
		<path d="M184.678 67.66c-.52 0-1.054.075-1.586.222l-6.027 1.659-6.257-15.244c-1.773-4.319-7.014-7.834-11.683-7.834h-58.573c-4.669 0-9.91 3.514-11.683 7.833l-6.25 15.225-5.951-1.639a6.007 6.007 0 0 0-1.586-.222c-2.849 0-4.916 2.176-4.916 5.174v3.555a6.355 6.355 0 0 0 6.347 6.347h.682l-1.01 2.459c-1.647 4.014-2.988 10.807-2.988 15.145v30.288a6.355 6.355 0 0 0 6.347 6.347h8.291a6.355 6.355 0 0 0 6.347-6.347v-7.563h71.316v7.563a6.355 6.355 0 0 0 6.347 6.347h8.288a6.355 6.355 0 0 0 6.347-6.347V100.34c0-4.338-1.341-11.131-2.988-15.145l-1.01-2.459h.767a6.355 6.355 0 0 0 6.347-6.347v-3.555c-.002-2.998-2.069-5.174-4.918-5.174zM87.17 79.288l9.467-23.062c1.06-2.584 4.213-4.697 7.006-4.697h52.392c2.792 0 5.944 2.114 7.005 4.697l9.467 23.062c1.061 2.584-.357 4.697-3.149 4.697H90.32c-2.792 0-4.21-2.113-3.15-4.697zm21.135 29.168a2.547 2.547 0 0 1-2.539 2.539H87.782a2.546 2.546 0 0 1-2.539-2.539v-8.631a2.547 2.547 0 0 1 2.539-2.539h17.984a2.547 2.547 0 0 1 2.539 2.539v8.631zm65.958 0a2.547 2.547 0 0 1-2.539 2.539h-17.982a2.547 2.547 0 0 1-2.539-2.539v-8.631a2.547 2.547 0 0 1 2.539-2.539h17.982a2.547 2.547 0 0 1 2.539 2.539v8.631z"/>
	</g>
</svg>
