<svg xmlns="http://www.w3.org/2000/svg" width="160" height="160" viewBox="0 0 160 160">
	<g transform="translate(-20 -20)">
		<circle fill="#4a4a4a" cx="100" cy="100" r="80"/>
		<g fill="#FDC300">
			<path d="M155.71 75.32c-.532 0-1.079.076-1.624.226l-5.732 1.58-6.06-14.759c-1.815-4.423-7.182-8.022-11.964-8.022h-4.03V42.11c0-2.15-1.75-3.9-3.9-3.9H81.067c-2.15 0-3.9 1.75-3.9 3.9v12.235h-4.115c-4.781 0-10.15 3.598-11.965 8.021l-6.05 14.738-5.657-1.558a6.128 6.128 0 0 0-1.625-.227c-2.917 0-5.034 2.23-5.034 5.3v3.136c0 3.584 2.916 6.5 6.5 6.5h.417l-.865 2.107c-1.687 4.11-3.06 11.067-3.06 15.51v29.442c0 3.584 2.916 6.5 6.5 6.5h7.814c3.584 0 6.5-2.916 6.5-6.5v-7.236h70.33v7.236c0 3.584 2.916 6.5 6.5 6.5h7.812c3.584 0 6.5-2.916 6.5-6.5v-29.443c0-4.442-1.373-11.4-3.06-15.509l-.865-2.107h.5c3.585 0 6.5-2.916 6.5-6.5v-3.137c0-3.07-2.116-5.298-5.033-5.298zm-38.312-31.91c0-.085.07-.155.156-.155h3.005c.086 0 .156.07.156.156v10.814c0 .052-.03.091-.069.12h-3.18c-.038-.029-.068-.068-.068-.12V43.411zm-21.549-.155h3.61a.25.25 0 0 1 .215.145l4.285 10.772 3.928-4.86a.227.227 0 0 0 .012-.25l-3.77-5.677c-.048-.072-.016-.13.07-.13h3.338c.086 0 .193.06.238.132l1.943 3.153c.045.073.119.073.164 0l1.944-3.153a.31.31 0 0 1 .238-.132h3.34c.086 0 .118.058.07.13l-3.773 5.677a.227.227 0 0 0 .012.25l4 4.948c.026.033.033.064.023.085h-3.546a.293.293 0 0 1-.113-.096l-2.195-3.512c-.046-.073-.12-.073-.165 0l-2.19 3.512a.293.293 0 0 1-.114.096h-6.68a.214.214 0 0 1-.1-.111l-.737-2.255a.23.23 0 0 0-.204-.148h-4.093a.235.235 0 0 0-.207.147l-.794 2.257a.22.22 0 0 1-.102.11h-3.213c-.026-.026-.037-.062-.018-.108l4.37-10.837a.25.25 0 0 1 .214-.145zm-10.566 10.97v-8.59a.156.156 0 0 0-.156-.156h-3.611a.156.156 0 0 1-.156-.156V43.41c0-.085.07-.156.156-.156h10.873c.086 0 .156.07.156.156v1.913c0 .086-.07.156-.156.156h-3.632a.156.156 0 0 0-.156.156v8.59c0 .052-.03.091-.069.12h-3.18c-.04-.028-.069-.068-.069-.12zM59.628 86.632l9.207-22.427c1.086-2.646 4.315-4.81 7.175-4.81h51.361c2.86 0 6.089 2.164 7.175 4.81l9.207 22.427c1.086 2.646-.365 4.81-3.225 4.81H62.853c-2.86 0-4.311-2.164-3.225-4.81zm20.798 28.882c0 1.43-1.17 2.6-2.6 2.6H60.253c-1.43 0-2.6-1.17-2.6-2.6v-8.337c0-1.43 1.17-2.6 2.6-2.6h17.573c1.43 0 2.6 1.17 2.6 2.6v8.337zm65.133 0c0 1.43-1.17 2.6-2.6 2.6h-17.573c-1.43 0-2.6-1.17-2.6-2.6v-8.337c0-1.43 1.17-2.6 2.6-2.6h17.573c1.43 0 2.6 1.17 2.6 2.6v8.337z"/>
			<path d="M98.962 49.606c.085 0 .128-.064.094-.143l-1.296-2.99c-.034-.079-.092-.08-.127-.002l-1.372 2.994c-.036.078.005.141.09.141h2.61z"/>
		</g>
	</g>
</svg>
