<?xml version="1.0" standalone="no"?>
<!DOCTYPE svg PUBLIC "-//W3C//DTD SVG 20010904//EN"
 "http://www.w3.org/TR/2001/REC-SVG-20010904/DTD/svg10.dtd">
<svg version="1.0" xmlns="http://www.w3.org/2000/svg"
 width="700.000000pt" height="700.000000pt" viewBox="0 0 700.000000 700.000000"
 preserveAspectRatio="xMidYMid meet">
<metadata>
Created by potrace 1.11, written by Peter Selinger 2001-2013
</metadata>
<g transform="translate(0.000000,700.000000) scale(0.100000,-0.100000)"
fill="#000000" stroke="none">
<path d="M3280 6845 c-119 -25 -211 -64 -305 -128 -153 -103 -282 -284 -324
-452 -7 -27 -15 -59 -18 -70 -3 -11 -7 -72 -8 -136 -4 -193 47 -346 176 -532
30 -42 102 -146 161 -230 59 -83 112 -159 118 -167 84 -121 151 -217 157 -225
5 -5 47 -65 93 -132 47 -67 91 -125 98 -128 8 -3 22 5 33 18 22 26 360 505
519 736 14 20 50 72 81 116 82 117 115 180 149 286 153 467 -150 963 -640
1047 -75 13 -223 12 -290 -3z"/>
<path d="M5531 6657 c-15 -7 -137 -172 -288 -387 -144 -206 -267 -382 -273
-390 -6 -8 -42 -60 -81 -115 -38 -55 -85 -122 -105 -150 -58 -82 -559 -798
-592 -845 -9 -14 -64 -93 -122 -175 -110 -158 -152 -217 -237 -341 -29 -42
-53 -86 -53 -98 0 -24 24 -62 203 -316 63 -91 146 -209 184 -263 168 -240 213
-303 229 -319 17 -17 18 -17 37 -1 10 10 91 121 180 248 88 126 176 253 196
280 87 123 226 322 287 412 37 54 70 100 73 103 3 3 26 34 51 70 53 78 85 125
205 295 50 72 98 141 108 155 9 14 45 66 80 115 35 50 220 313 410 585 190
272 350 500 354 505 5 6 22 30 39 55 54 79 303 435 313 447 30 34 81 125 76
133 -10 16 -1243 13 -1274 -3z"/>
<path d="M997 5362 c-26 -5 -21 -21 27 -92 32 -48 699 -1002 776 -1110 31 -44
298 -425 338 -483 81 -117 211 -302 219 -312 4 -5 26 -37 48 -70 22 -33 43
-62 46 -65 3 -3 46 -63 95 -135 50 -71 117 -168 150 -215 33 -47 63 -93 67
-103 11 -29 -13 -70 -175 -299 -84 -120 -269 -383 -410 -585 -208 -298 -753
-1075 -806 -1150 -7 -10 -36 -52 -65 -93 -87 -126 -99 -139 -141 -160 -23 -10
-65 -21 -95 -24 -61 -6 -98 -26 -111 -62 -15 -40 -12 -181 5 -213 8 -16 27
-33 42 -40 21 -9 185 -11 619 -9 l590 3 41 27 c38 25 121 138 462 629 25 36
74 106 109 155 35 49 180 256 322 459 142 204 266 374 274 380 12 7 21 4 35
-10 10 -11 109 -148 218 -305 109 -157 219 -314 244 -350 25 -36 180 -256 343
-490 164 -234 305 -433 313 -442 8 -9 35 -26 59 -38 44 -20 54 -20 640 -18
l596 3 23 29 c18 23 24 44 27 97 7 144 -18 185 -117 194 -33 3 -78 15 -99 26
-42 22 -96 76 -96 96 0 6 -4 13 -8 15 -5 2 -28 32 -53 67 -95 138 -117 170
-147 212 -17 24 -73 103 -124 176 -81 115 -199 283 -383 548 -161 230 -278
397 -337 481 -38 52 -68 98 -68 103 0 5 -4 11 -8 13 -6 2 -245 340 -395 558
-9 14 -47 68 -84 121 -183 259 -228 324 -360 512 -78 111 -167 238 -198 282
-31 44 -157 224 -280 400 -123 176 -249 356 -280 400 -31 44 -157 224 -280
400 -310 444 -325 464 -348 477 -15 8 -203 11 -632 12 -336 1 -619 0 -628 -2z"/>
</g>
</svg>
