{
    "meta": {
        "name": "copy of AmpliSeq Exome single sample (Germline)_OCA_Bed",
        "tooltip": "Parameters optimized using Ampliseq for 48K NA12878 for generic low stringency for depth > 0",
        "configuration": "germline_low_stringency_530",
        "ts_version": "5.10",
        "compatibility": {
            "chip": [
                "510",
                "520",
                "530"
            ],
            "frequency": [
                "germline"
            ],
            "library": [
                "ampliseq"
            ],
            "stringency": [
                "low"
            ]
        },
        "tmapargs": "tmap mapall ... -J 25 --end-repair 15 --do-repeat-clip --context stage1 map4"
    },
    "freebayes": {
        "allow_snps": 1,
        "allow_indels": 1,
        "use_input_allele_only": 0,
        "gen_min_indel_alt_allele_freq": 0.15,
        "gen_min_coverage": 5,
        "gen_min_alt_allele_freq": 0.1,
        "min_cov_fraction": 0.0,
        "allow_complex": 0,
        "min_mapping_qv": 4,
        "allow_mnps": 1,
        "read_snp_limit": 10,
        "read_max_mismatch_fraction": 1.0,
        "read_mismatch_limit": 0
    },
    "long_indel_assembler": {
        "short_suffix_match": 5,
        "kmer_len": 19,
        "relative_strand_bias": 0.8,
        "min_indel_size": 4,
        "output_mnv": 0,
        "min_var_count": 5,
        "min_var_freq": 0.15,
        "max_hp_length": 8
    },
    "torrent_variant_caller": {
        "tag_sim_max_cov": 20,
        "sse_prob_threshold": 0.2,
        "use_lod_filter": 0,
        "use_fd_param": 0,
        "hotspot_strand_bias": 0.95,
        "snp_min_variant_score": 15.0,
        "realignment_threshold": 0.0,
        "mnp_min_var_coverage": 2,
        "hotspot_min_allele_freq": 0.1,
        "outlier_probability": 0.01,
        "hotspot_strand_bias_pval": 1.0,
        "try_few_restart_freq": 0,
        "indel_min_coverage": 10,
        "min_tag_fam_size": 3,
        "mnp_strand_bias_pval": 0.01,
        "hp_max_length": 8,
        "mnp_min_cov_each_strand": 0,
        "position_bias_pval": 0.05,
        "snp_strand_bias_pval": 0.01,
        "min_detail_level_for_fast_scan": 0,
        "indel_strand_bias": 0.9,
        "snp_min_allele_freq": 0.1,
        "mnp_min_allele_freq": 0.1,
        "hotspot_min_coverage": 6,
        "max_detail_level": 0,
        "snp_min_var_coverage": 2,
        "fd_nonsnp_min_var_cov": 1,
        "snp_min_coverage": 5,
        "do_snp_realignment": 0,
        "position_bias_ref_fraction": 0.05,
        "position_bias": 0.75,
        "tag_custom_gene_ruleset": "",
        "filter_deletion_predictions": 0.2,
        "snp_min_cov_each_strand": 0,
        "min_fam_per_strand_cov": 0,
        "data_quality_stringency": 5.0,
        "indel_min_cov_each_strand": 5,
        "suppress_recalibration": 0,
        "downsample_to_coverage": 400,
        "hotspot_min_cov_each_strand": 3,
        "indel_func_size_offset": 2,
        "error_motifs": "",
        "mnp_strand_bias": 0.98,
        "heavy_tailed": 3.0,
        "hotspots_positions_only": 0,
        "mnp_min_coverage": 5,
        "indel_strand_bias_pval": 1.0,
        "error_motifset_file": "motifset.txt",
        "filter_insertion_predictions": 0.2,
        "filter_by_target": 0,
        "do_mnp_realignment": 0,
        "lod_multiplier": 0.6,
        "indel_min_allele_freq": 0.25,
        "hotspot_min_variant_score": 9.0,
        "filter_unusual_predictions": 0.25,
        "mnp_min_variant_score": 60.0,
        "indel_min_var_coverage": 2,
        "snp_strand_bias": 0.98,
        "indel_min_variant_score": 20.0,
        "tag_trim_method": "sloppy-trim",
        "hotspot_min_var_coverage": 2,
        "indel_as_hpindel": 1,
        "prediction_precision": 1.0,
        "use_position_bias": 1
    }
}
