{
  "workflows_tank": "https://gitlab.repository.oncopmnet.gr/pipelines/",
  "workflows": {
    "somatic-illumina": {
      "repository": "somatic",
      "ref": "master",
      "cwl": "GATK-subworkflow-mutect2.cwl",
      "yml": "GATK-subworkflow-mutect2.yml",
      "workflow_version": "v1.0",
      "specification_language": "CWL"
    },
    "somatic-torrent": {
      "repository": "somatic-torrent",
      "ref": "master",
      "cwl": "workflows/torrent-somatic-pipeline.cwl",
      "yml": "torrent_pipeline-inputs.yml",
      "workflow_version": "v1.0",
      "specification_language": "CWL"
    },
    "somatic-torrent-hotspots": {
      "repository": "somatic-torrent",
      "ref": "master",
      "cwl": "workflows/torrent-somatic-pipeline-hotspots.cwl",
      "yml": "torrent_pipeline-hotspots-inputs.yml",
      "workflow_version": "v1.0",
      "specification_language": "CWL"
    },
    "somatic-illumina-solid": {
      "repository": "somatic-illumina-solid",
      "ref": "master",
      "cwl": "GATK-subworkflow-mutect2.cwl",
      "yml": "GATK-subworkflow-mutect2.yml",
      "workflow_version": "v1.0",
      "specification_language": "CWL"
    },
    "somatic-torrent-solid": {
      "repository": "somatic-torrent-solid",
      "ref": "master",
      "cwl": "workflows/torrent-pipeline.cwl",
      "yml": "torrent_pipeline-inputs.yml",
      "workflow_version": "v1.0",
      "specification_language": "CWL"
    },
    "somatic-illumina-hematologic": {
      "repository": "somatic-illumina-hematologic",
      "ref": "master",
      "cwl": "GATK-subworkflow-mutect2.cwl",
      "yml": "GATK-subworkflow-mutect2.yml",
      "workflow_version": "v1.0",
      "specification_language": "CWL"
    },
    "somatic-torrent-hematologic": {
      "repository": "somatic-torrent-hematologic",
      "ref": "master",
      "cwl": "workflows/torrent-pipeline.cwl",
      "yml": "torrent_pipeline-inputs.yml",
      "workflow_version": "v1.0",
      "specification_language": "CWL"
    },
    "hereditary-cancer": {
      "repository": "hereditary-cancer",
      "ref": "master",
      "cwl": "workflows/GATK/GATK-Sub-Workflow_haplotype_complete.cwl",
      "yml": "Germline_complete.yml",
      "workflow_version": "v1.0",
      "specification_language": "CWL"
    }
  },
  "outputs_bucket" : "workflow-outputs",
  "inputs_bucket" : "workflow-inputs",
  "upload_vcf_bucket" : "uploaded-vcf",
  "downloaded_status_filename" : "downloaded_status",
  "workflow_id_filename" : "workflow_id"
}



