<?xml version="1.0" encoding="utf-8"?>
<!-- Generator: Adobe Illustrator 19.0.0, SVG Export Plug-In . SVG Version: 6.00 Build 0)  -->
<svg version="1.1" id="Layer_1" xmlns="http://www.w3.org/2000/svg" xmlns:xlink="http://www.w3.org/1999/xlink" x="0px" y="0px"
	 viewBox="0 0 63.3 62" style="enable-background:new 0 0 63.3 62;" xml:space="preserve">
<style type="text/css">
	.st0{fill:#0F4658;}
</style>
<path id="XMLID_106_" class="st0" d="M58.9,31.7c-0.1,11.4-7.2,21.9-18,25.8c-10.9,4-23.2,0.6-30.6-8.3c-7.4-8.9-8.3-21.8-2.4-31.7
	c5.9-9.8,17.7-15.1,29-12.8C48,7,56.7,16.1,58.5,27.4C58.8,28.8,58.9,30.2,58.9,31.7c0,1.5,2.3,1.5,2.3,0C61.1,19.3,53.3,8,41.6,3.7
	C29.9-0.6,16.3,3.1,8.4,12.8c-7.9,9.6-9,23.6-2.5,34.3C12.3,57.8,25,63.3,37.3,60.9c12-2.4,21.7-12.4,23.5-24.6
	c0.2-1.5,0.4-3.1,0.4-4.6C61.2,30.2,58.9,30.2,58.9,31.7"/>
<path id="XMLID_105_" class="st0" d="M30.2,8.6v19.3v4.6c0,0.7-0.2,1.7,0.3,2.3c0.6,0.7,1.3,1.3,2,1.9c1.4,1.4,2.8,2.7,4.2,4.1
	c2.4,2.3,4.8,4.6,7.2,6.9c1.1,1,2.7-0.6,1.6-1.6c-4.5-4.3-8.9-8.6-13.4-12.9c0.1,0.3,0.2,0.5,0.3,0.8V11.7V8.6
	C32.6,7.1,30.2,7.1,30.2,8.6"/>
</svg>
