{
    "__schema": {
        "types": [
            {
                "kind": "OBJECT",
                "name": "Query",
                "possibleTypes": null
            },
            {
                "kind": "INTERFACE",
                "name": "CustomNode",
                "possibleTypes": [
                    {
                        "name": "Post"
                    },
                    {
                        "name": "User"
                    },
                    {
                        "name": "Comment"
                    },
                    {
                        "name": "MyUser"
                    },
                    {
                        "name": "Clik"
                    },
                    {
                        "name": "Topic"
                    },
                    {
                        "name": "Account"
                    }
                ]
            },
            {
                "kind": "SCALAR",
                "name": "ID",
                "possibleTypes": null
            },
            {
                "kind": "OBJECT",
                "name": "HomeFeed",
                "possibleTypes": null
            },
            {
                "kind": "OBJECT",
                "name": "ContentConnection",
                "possibleTypes": null
            },
            {
                "kind": "OBJECT",
                "name": "PageInfo",
                "possibleTypes": null
            },
            {
                "kind": "SCALAR",
                "name": "Boolean",
                "possibleTypes": null
            },
            {
                "kind": "SCALAR",
                "name": "String",
                "possibleTypes": null
            },
            {
                "kind": "OBJECT",
                "name": "ContentEdge",
                "possibleTypes": null
            },
            {
                "kind": "OBJECT",
                "name": "Post",
                "possibleTypes": null
            },
            {
                "kind": "INTERFACE",
                "name": "Content",
                "possibleTypes": [
                    {
                        "name": "Post"
                    },
                    {
                        "name": "Comment"
                    }
                ]
            },
            {
                "kind": "OBJECT",
                "name": "User",
                "possibleTypes": null
            },
            {
                "kind": "SCALAR",
                "name": "WeclikdDateTime",
                "possibleTypes": null
            },
            {
                "kind": "SCALAR",
                "name": "Int",
                "possibleTypes": null
            },
            {
                "kind": "OBJECT",
                "name": "CommentConnection",
                "possibleTypes": null
            },
            {
                "kind": "OBJECT",
                "name": "CommentEdge",
                "possibleTypes": null
            },
            {
                "kind": "OBJECT",
                "name": "Comment",
                "possibleTypes": null
            },
            {
                "kind": "OBJECT",
                "name": "MyUser",
                "possibleTypes": null
            },
            {
                "kind": "SCALAR",
                "name": "JSONString",
                "possibleTypes": null
            },
            {
                "kind": "OBJECT",
                "name": "ClikFollowSettings",
                "possibleTypes": null
            },
            {
                "kind": "OBJECT",
                "name": "FollowSettings",
                "possibleTypes": null
            },
            {
                "kind": "OBJECT",
                "name": "Clik",
                "possibleTypes": null
            },
            {
                "kind": "INTERFACE",
                "name": "ClikFields",
                "possibleTypes": [
                    {
                        "name": "Clik"
                    }
                ]
            },
            {
                "kind": "OBJECT",
                "name": "ClikMember",
                "possibleTypes": null
            },
            {
                "kind": "ENUM",
                "name": "ClikMemberType",
                "possibleTypes": null
            },
            {
                "kind": "OBJECT",
                "name": "UserFollowSettings",
                "possibleTypes": null
            },
            {
                "kind": "OBJECT",
                "name": "TopicFollowSettings",
                "possibleTypes": null
            },
            {
                "kind": "OBJECT",
                "name": "Topic",
                "possibleTypes": null
            },
            {
                "kind": "OBJECT",
                "name": "ClikConnection",
                "possibleTypes": null
            },
            {
                "kind": "OBJECT",
                "name": "ClikEdge",
                "possibleTypes": null
            },
            {
                "kind": "OBJECT",
                "name": "UserConnection",
                "possibleTypes": null
            },
            {
                "kind": "OBJECT",
                "name": "UserEdge",
                "possibleTypes": null
            },
            {
                "kind": "OBJECT",
                "name": "TopicConnection",
                "possibleTypes": null
            },
            {
                "kind": "OBJECT",
                "name": "TopicEdge",
                "possibleTypes": null
            },
            {
                "kind": "OBJECT",
                "name": "Mutation",
                "possibleTypes": null
            },
            {
                "kind": "OBJECT",
                "name": "Account",
                "possibleTypes": null
            },
            {
                "kind": "OBJECT",
                "name": "AccountSettings",
                "possibleTypes": null
            },
            {
                "kind": "ENUM",
                "name": "SubscriptionType",
                "possibleTypes": null
            },
            {
                "kind": "INPUT_OBJECT",
                "name": "AccountInput",
                "possibleTypes": null
            },
            {
                "kind": "OBJECT",
                "name": "NewUserOutput",
                "possibleTypes": null
            },
            {
                "kind": "INPUT_OBJECT",
                "name": "UserInput",
                "possibleTypes": null
            },
            {
                "kind": "OBJECT",
                "name": "FollowOutput",
                "possibleTypes": null
            },
            {
                "kind": "INPUT_OBJECT",
                "name": "FollowUserInput",
                "possibleTypes": null
            },
            {
                "kind": "OBJECT",
                "name": "UnfollowOutput",
                "possibleTypes": null
            },
            {
                "kind": "INPUT_OBJECT",
                "name": "FollowClikInput",
                "possibleTypes": null
            },
            {
                "kind": "OBJECT",
                "name": "CreateClikOutput",
                "possibleTypes": null
            },
            {
                "kind": "ENUM",
                "name": "CreateClikStatus",
                "possibleTypes": null
            },
            {
                "kind": "INPUT_OBJECT",
                "name": "CreateClikInput",
                "possibleTypes": null
            },
            {
                "kind": "OBJECT",
                "name": "JoinClikOutput",
                "possibleTypes": null
            },
            {
                "kind": "ENUM",
                "name": "JoinClikStatus",
                "possibleTypes": null
            },
            {
                "kind": "INPUT_OBJECT",
                "name": "JoinClikInput",
                "possibleTypes": null
            },
            {
                "kind": "INPUT_OBJECT",
                "name": "FollowTopicInput",
                "possibleTypes": null
            },
            {
                "kind": "INPUT_OBJECT",
                "name": "PostInput",
                "possibleTypes": null
            },
            {
                "kind": "INPUT_OBJECT",
                "name": "CommentInput",
                "possibleTypes": null
            },
            {
                "kind": "OBJECT",
                "name": "LikeContent",
                "possibleTypes": null
            },
            {
                "kind": "INPUT_OBJECT",
                "name": "LikeInput",
                "possibleTypes": null
            },
            {
                "kind": "ENUM",
                "name": "LikeType",
                "possibleTypes": null
            },
            {
                "kind": "OBJECT",
                "name": "ReportContent",
                "possibleTypes": null
            },
            {
                "kind": "INPUT_OBJECT",
                "name": "ReportInput",
                "possibleTypes": null
            },
            {
                "kind": "ENUM",
                "name": "ReportType",
                "possibleTypes": null
            },
            {
                "kind": "OBJECT",
                "name": "__Schema",
                "possibleTypes": null
            },
            {
                "kind": "OBJECT",
                "name": "__Type",
                "possibleTypes": null
            },
            {
                "kind": "ENUM",
                "name": "__TypeKind",
                "possibleTypes": null
            },
            {
                "kind": "OBJECT",
                "name": "__Field",
                "possibleTypes": null
            },
            {
                "kind": "OBJECT",
                "name": "__InputValue",
                "possibleTypes": null
            },
            {
                "kind": "OBJECT",
                "name": "__EnumValue",
                "possibleTypes": null
            },
            {
                "kind": "OBJECT",
                "name": "__Directive",
                "possibleTypes": null
            },
            {
                "kind": "ENUM",
                "name": "__DirectiveLocation",
                "possibleTypes": null
            }
        ]
    }
}