{
  "project_info": {
    "project_number": "746359675799",
    "firebase_url": "https://graphite-tesla-246507.firebaseio.com",
    "project_id": "graphite-tesla-246507",
    "storage_bucket": "graphite-tesla-246507.appspot.com"
  },
  "client": [
    {
      "client_info": {
        "mobilesdk_app_id": "1:746359675799:android:c9c396d6547f071f3e02d2",
        "android_client_info": {
          "package_name": "com.weclikd.weclikd"
        }
      },
      "oauth_client": [
        {
          "client_id": "746359675799-mmk74gi07ujf5sh5gt1368vr9uhigtq6.apps.googleusercontent.com",
          "client_type": 3
        }
      ],
      "api_key": [
        {
          "current_key": "AIzaSyCdXyh-EKjn8SXhEY3wvgrp4BbW9wLmlps"
        }
      ],
      "services": {
        "appinvite_service": {
          "other_platform_oauth_client": [
            {
              "client_id": "746359675799-mmk74gi07ujf5sh5gt1368vr9uhigtq6.apps.googleusercontent.com",
              "client_type": 3
            },
            {
              "client_id": "746359675799-8j0epr1ibcsacin57jkvf5bfm7501nrf.apps.googleusercontent.com",
              "client_type": 2,
              "ios_info": {
                "bundle_id": "com.weclikd.weclikd",
                "app_store_id": "1483423861"
              }
            }
          ]
        }
      }
    }
  ],
  "configuration_version": "1"
}