<?xml version="1.0" encoding="utf-8"?>
<!-- Generator: Adobe Illustrator 19.0.0, SVG Export Plug-In . SVG Version: 6.00 Build 0)  -->
<svg version="1.1" id="Layer_1" xmlns="http://www.w3.org/2000/svg" xmlns:xlink="http://www.w3.org/1999/xlink" x="0px" y="0px"
	 viewBox="-375 376.4 100 100" style="enable-background:new -375 376.4 100 100;" xml:space="preserve">
<style type="text/css">
	.st0{fill:none;}
	.st1{fill:#1CA620;}
	.st2{fill:#484641;}
</style>
<g>
	<title>background</title>
	<rect id="canvas_background" x="-376" y="375.4" class="st0" width="582" height="402"/>
</g>
<g>
	<title>Layer 1</title>
	<path id="svg_1" class="st1" d="M-300.2,430.8c0-1-0.8-1.8-1.8-1.8c-0.5,0-0.8,0.2-1.1,0.5c-4.5,4-12.1,7.6-21.3,7.6l0,0
		c-9.2,0-16.7-3.7-21.3-7.6c-0.3-0.3-0.8-0.5-1.3-0.5c-1.1,0-1.8,1-1.8,1.9c0,0.8,0.5,1.4,1,2.1c2.7,4,10.8,10.7,23.3,10.7l0,0
		c12.4,0,20.6-6.7,23.3-10.7C-300.8,432.5-300.2,431.6-300.2,430.8z"/>
	<path id="svg_2" class="st2" d="M-294.2,453.9c-2.7-1.5-5.2-4-6.3-7.5c-0.3-0.7,0-1.2,0.5-1.6c7.7-5.9,12.5-14.5,12.5-24.2
		c0-17.9-16.8-32.6-37.7-32.6s-37.7,14.5-37.7,32.6c0,17.9,16.8,32.6,37.7,32.6c2.7,0,5.4-0.3,7.9-0.7c0.7-0.1,1.1,0,1.6,0.3
		c5.1,3.2,12.8,5.8,19.5,5.8c2.2,0,3-1.3,3-2.7C-293.1,454.9-293.5,454.2-294.2,453.9z M-304.3,450.7c0.1,0.1,0.1,0.3,0.1,0.4
		c0,0.3-0.3,0.4-0.4,0.4c-1.9,0-7.7-3.1-10.8-5.6c-0.4-0.4-0.9-0.5-1.9-0.3c-2.6,0.5-5.2,0.8-7.9,0.8c-17.4,0-31.3-11.6-31.3-25.8
		s14-25.8,31.3-25.8c17.4,0,31.3,11.6,31.3,25.8c0,8.5-5,16.1-12.6,20.9c-0.5,0.3-1.1,0.9-1.1,1.6
		C-307.5,444.5-306.2,448.3-304.3,450.7z"/>
	<ellipse id="svg_3" class="st1" cx="-338" cy="413.4" rx="3.6" ry="3.8"/>
	<ellipse id="svg_4" class="st1" cx="-312" cy="413.5" rx="3.6" ry="3.8"/>
	<ellipse id="svg_5" class="st1" cx="-324.9" cy="413.4" rx="3.6" ry="3.8"/>
</g>
</svg>
