<svg width="281" height="208" viewBox="0 0 281 208" fill="none" xmlns="http://www.w3.org/2000/svg">
<path d="M253.744 204.114C283.595 181.415 296.89 118.474 248.419 87.6104C216.33 67.1812 196.372 78.8353 160.272 65.3206C116.201 48.8263 109.633 -1.00845 56.0263 23.5129C27.6266 36.4996 7.93911 73.1025 4.47575 114.703C1.08136 155.442 15.5201 183.395 45.026 202.523C114.316 205.471 183.744 204.937 253.744 204.114Z" fill="#E4F6FD"/>
<path d="M131.106 25.0814C126.597 43.1848 143.341 61.106 160.981 68.5359C178.621 75.9722 198.849 75.0859 217.747 71.5406C225.901 70.0131 234.283 67.8634 240.618 62.6649C246.953 57.4664 250.625 48.4399 247.153 41.1482C244.089 34.7177 236.631 31.4239 229.52 29.733C222.409 28.0421 214.857 27.3506 208.522 23.7928C202.515 20.4172 198.254 14.8291 193.03 10.4038C183.377 2.23837 169.818 -1.80978 157.268 0.773735C144.712 3.35725 134.939 9.69347 131.106 25.0814Z" fill="#E4F6FD"/>
<path d="M234.915 113.367C228.36 113.367 223.045 108.053 223.045 101.498C223.045 94.9499 228.36 89.6358 234.915 89.6358C241.463 89.6358 246.777 94.9499 246.777 101.498C246.777 108.053 241.463 113.367 234.915 113.367ZM266.168 108.349V94.6538H260.974C260.351 92.2589 259.4 90.001 258.182 87.9216L261.854 84.2437L252.169 74.5584L248.491 78.2306C246.411 77.0124 244.154 76.062 241.759 75.4378V70.245H228.063V75.4378C225.669 76.062 223.411 77.0124 221.331 78.2306L217.654 74.5584L207.968 84.2437L211.64 87.9216C210.422 90.001 209.477 92.2589 208.848 94.6538H203.655V108.349H208.848C209.477 110.744 210.422 113.002 211.64 115.081L207.968 118.759L217.654 128.444L221.331 124.772C223.411 125.99 225.669 126.935 228.063 127.565V132.758H241.759V127.565C244.154 126.935 246.411 125.99 248.491 124.772L252.169 128.444L261.854 118.759L258.182 115.081C259.4 113.002 260.351 110.744 260.974 108.349H266.168Z" fill="#A9CAED"/>
<path d="M210.237 151.1C206.986 152.347 203.34 150.722 202.092 147.472C200.847 144.225 202.471 140.578 205.722 139.331C208.969 138.085 212.616 139.71 213.862 142.957C215.109 146.207 213.484 149.854 210.237 151.1ZM224.782 142.665L222.176 135.873L219.6 136.861C218.836 135.792 217.934 134.854 216.935 134.054L218.056 131.532L211.41 128.571L210.285 131.092C209.021 130.883 207.721 130.841 206.415 130.988L205.427 128.412L198.635 131.018L199.623 133.593C198.554 134.358 197.615 135.259 196.815 136.259L194.293 135.138L191.333 141.783L193.854 142.909C193.645 144.172 193.606 145.471 193.749 146.779L191.174 147.767L193.779 154.559L196.355 153.571C197.123 154.639 198.021 155.578 199.021 156.378L197.899 158.9L204.545 161.861L205.67 159.34C206.933 159.549 208.233 159.588 209.54 159.444L210.528 162.02L217.32 159.414L216.333 156.839C217.4 156.071 218.34 155.173 219.14 154.173L221.662 155.294L224.622 148.649L222.102 147.523C222.31 146.26 222.352 144.96 222.206 143.653L224.782 142.665Z" stroke="#A9CAED" stroke-width="1.33333" stroke-miterlimit="10"/>
<path d="M192.7 124.538C190.504 125.381 188.04 124.282 187.197 122.086C186.355 119.892 187.453 117.428 189.65 116.585C191.844 115.744 194.308 116.841 195.149 119.036C195.992 121.232 194.894 123.696 192.7 124.538V124.538ZM202.528 118.838L200.767 114.249L199.027 114.917C198.51 114.195 197.901 113.561 197.226 113.02L197.984 111.315L193.493 109.315L192.732 111.018C191.879 110.878 191.001 110.849 190.118 110.948L189.45 109.208L184.861 110.968L185.529 112.709C184.806 113.225 184.172 113.835 183.632 114.51L181.927 113.752L179.927 118.243L181.63 119.003C181.489 119.856 181.463 120.735 181.56 121.618L179.82 122.285L181.58 126.875L183.32 126.207C183.839 126.929 184.446 127.564 185.121 128.104L184.364 129.808L188.855 131.809L189.615 130.106C190.468 130.246 191.346 130.273 192.229 130.176L192.897 131.916L197.486 130.155L196.819 128.415C197.54 127.896 198.175 127.29 198.716 126.614L200.42 127.372L202.42 122.881L200.717 122.121C200.858 121.268 200.886 120.389 200.788 119.506L202.528 118.838Z" stroke="#A9CAED" stroke-width="1.33333" stroke-miterlimit="10"/>
<path d="M200.93 38.4857C200.93 45.3675 197.714 51.502 192.709 55.4659C189.025 58.3901 184.365 60.125 179.29 60.125C174.228 60.125 169.569 58.3901 165.871 55.4659C160.861 51.502 157.651 45.3675 157.651 38.4857C157.651 26.5349 167.34 16.8458 179.29 16.8458C191.241 16.8458 200.93 26.5349 200.93 38.4857Z" fill="#4497D8"/>
<path d="M200.93 38.4857C200.93 45.3675 197.714 51.502 192.709 55.4659C189.025 58.3901 184.365 60.125 179.29 60.125C174.228 60.125 169.569 58.3901 165.871 55.4659C160.861 51.502 157.651 45.3675 157.651 38.4857C157.651 26.5349 167.34 16.8458 179.29 16.8458C191.241 16.8458 200.93 26.5349 200.93 38.4857V38.4857Z" stroke="#4497D8" stroke-width="1.33333" stroke-miterlimit="10"/>
<path d="M179.29 24.2846C183.202 24.2846 186.374 27.4558 186.374 31.3676C186.374 35.2793 183.202 38.4512 179.29 38.4512C175.378 38.4512 172.207 35.2793 172.207 31.3676C172.207 27.4558 175.378 24.2846 179.29 24.2846Z" fill="white"/>
<path d="M192.709 52.7374C189.025 55.6616 184.365 57.3965 179.29 57.3965C174.228 57.3965 169.569 55.6616 165.871 52.7374C167.255 46.6482 168.529 41.3913 169.854 40.0587C171.726 38.1873 176.697 37.0955 179.284 37.0955C181.87 37.0955 187.075 38.4212 188.037 39.3829C189.999 41.3391 191.689 46.7393 192.709 52.7374Z" fill="white"/>
<path d="M148.191 91.8331V81.147C148.191 78.2304 150.554 75.8669 153.471 75.8669H187.138C190.055 75.8669 192.418 78.2304 192.418 81.147V91.8331C192.418 94.7498 190.055 97.1133 187.138 97.1133H153.477C150.56 97.1196 148.191 94.7498 148.191 91.8331Z" fill="#4497D8"/>
<path d="M162.409 91.2706L146.116 107.143L172.523 93.7976" fill="#4497D8"/>
<path d="M152.276 80.8803V80.8237C152.276 80.39 152.628 80.038 153.062 80.038H169.707C170.141 80.038 170.493 80.39 170.493 80.8237V80.8803C170.493 81.314 170.141 81.666 169.707 81.666H153.062C152.628 81.666 152.276 81.314 152.276 80.8803Z" fill="white"/>
<path d="M171.241 80.8803V80.8237C171.241 80.39 171.593 80.038 172.026 80.038H186.553C186.987 80.038 187.339 80.39 187.339 80.8237V80.8803C187.339 81.314 186.987 81.666 186.553 81.666H172.026C171.593 81.666 171.241 81.314 171.241 80.8803Z" fill="white"/>
<path d="M164.898 84.4604V84.4038C164.898 83.9701 165.25 83.618 165.684 83.618H186.553C186.987 83.618 187.339 83.9701 187.339 84.4038V84.4604C187.339 84.8941 186.987 85.2461 186.553 85.2461H165.684C165.25 85.2461 164.898 84.8941 164.898 84.4604Z" fill="white"/>
<path d="M152.276 84.4604V84.4038C152.276 83.9701 152.628 83.618 153.062 83.618H162.384C162.818 83.618 163.17 83.9701 163.17 84.4038V84.4604C163.17 84.8941 162.818 85.2461 162.384 85.2461H153.062C152.628 85.2461 152.276 84.8941 152.276 84.4604Z" fill="white"/>
<path d="M167.796 88.0346V87.978C167.796 87.5443 168.148 87.1923 168.582 87.1923H186.553C186.987 87.1923 187.339 87.5443 187.339 87.978V88.0346C187.339 88.4683 186.987 88.8203 186.553 88.8203H168.582C168.148 88.8203 167.796 88.4683 167.796 88.0346Z" fill="white"/>
<path d="M152.276 88.0346V87.978C152.276 87.5443 152.628 87.1923 153.062 87.1923H165.477C165.911 87.1923 166.263 87.5443 166.263 87.978V88.0346C166.263 88.4683 165.911 88.8203 165.477 88.8203H153.062C152.628 88.8203 152.276 88.4683 152.276 88.0346Z" fill="white"/>
<path d="M152.276 91.6127V91.5561C152.276 91.1224 152.628 90.7704 153.062 90.7704H157.67C158.103 90.7704 158.455 91.1224 158.455 91.5561V91.6127C158.455 92.0464 158.103 92.3984 157.67 92.3984H153.062C152.628 92.3984 152.276 92.0464 152.276 91.6127Z" fill="white"/>
<path d="M160.083 91.6127V91.5561C160.083 91.1224 160.435 90.7704 160.869 90.7704H186.553C186.987 90.7704 187.339 91.1224 187.339 91.5561V91.6127C187.339 92.0464 186.987 92.3984 186.553 92.3984H160.869C160.435 92.3984 160.083 92.0464 160.083 91.6127Z" fill="white"/>
<path d="M38.8193 48.4572C49.5694 44.3777 61.5913 49.7848 65.6708 60.5344C69.7504 71.2846 64.3432 83.3058 53.5937 87.3859C42.8438 91.4655 30.8219 86.0583 26.7422 75.3088C22.6622 64.5586 28.0694 52.5368 38.8193 48.4572Z" fill="#4497D8"/>
<path d="M45.8487 80.3228C44.6428 82.8346 41.6288 83.8932 39.1171 82.6875C36.6055 81.4813 35.5469 78.4678 36.7528 75.956C37.9587 73.4441 40.9724 72.3856 43.4844 73.5912C45.9961 74.7975 47.0547 77.8109 45.8487 80.3228Z" fill="white"/>
<path d="M38.6513 79.9506L38.4077 76.7511L41.0569 74.9408L43.9496 76.3293L44.1932 79.5289L41.5441 81.3398L38.6513 79.9506Z" fill="#4497D8"/>
<path d="M55.6607 59.8855C54.4545 62.3974 51.441 63.4559 48.9291 62.2496C46.4173 61.044 45.3588 58.0299 46.5644 55.5187C47.7706 53.0068 50.7847 51.9483 53.296 53.1539C55.8078 54.3602 56.8664 57.3737 55.6607 59.8855Z" fill="white"/>
<path d="M48.6104 59.2091L48.7838 55.1409L51.8495 52.4612L54.7423 53.8504L54.5688 57.9186L51.5025 60.5977L48.6104 59.2091Z" fill="#4497D8"/>
<path d="M44.7945 75.8105L40.9351 73.9574L43.787 67.378C43.968 66.9606 44.1652 66.5507 44.3779 66.1484L47.7283 59.8085L51.5878 61.6616L48.8371 68.1405C48.6246 68.6421 48.3889 69.133 48.1306 69.612L44.7945 75.8105Z" fill="white"/>
<path d="M60.668 79.1224C61.4122 78.7779 73.3567 79.3223 73.3567 79.3223L64.7469 71.4171L60.668 79.1224Z" fill="#4497D8"/>
<path d="M94.4826 4.13243C105.783 4.06517 114.999 13.1709 115.067 24.4718C115.135 35.7726 106.029 44.989 94.7277 45.0563C83.4269 45.1242 74.2111 36.0184 74.1432 24.7176C74.0753 13.4167 83.1817 4.20032 94.4826 4.13243Z" fill="#4497D8"/>
<path d="M95.2884 24.3398H93.9219V7.15539H95.2884V24.3398Z" fill="white"/>
<path d="M93.8265 24.3434L94.6047 25.4673L80.2828 35.3809L79.5046 34.2569L93.8265 24.3434Z" fill="white"/>
<path d="M96.4882 24.5927C96.4882 25.633 95.6453 26.4766 94.6049 26.4766C93.5646 26.4766 92.7217 25.633 92.7217 24.5927C92.7217 23.553 93.5646 22.7094 94.6049 22.7094C95.6453 22.7094 96.4882 23.553 96.4882 24.5927Z" fill="white"/>
<path d="M150.158 163.152C148.945 144.445 157.129 125.085 170.914 114.009C171.342 132.81 163.239 151.838 150.158 163.152Z" fill="#A9CAED"/>
<path d="M168.664 119.044C162.856 129.868 157.833 141.196 153.659 152.881C148.587 167.069 144.595 182.142 135.908 194.035" stroke="#6E86C5" stroke-width="1.33333" stroke-miterlimit="10" stroke-linecap="round"/>
<path d="M145.808 174.918C152.786 159.31 166.634 147.518 181.902 144.18C175.402 160.907 160.781 173.667 145.808 174.918Z" fill="#A9CAED"/>
<path d="M178.155 147.618C167.727 156.796 157.122 165.715 146.342 174.371" stroke="#6E86C5" stroke-width="1.33333" stroke-miterlimit="10" stroke-linecap="round"/>
<path d="M141.69 188.515C151.012 174.592 168.211 167.325 182.442 171.298C171.976 185.045 154.74 192.33 141.69 188.515Z" fill="#A9CAED"/>
<path d="M179.029 172.305C166.809 179.949 153.628 185.594 140.038 188.988" stroke="#6E86C5" stroke-width="1.33333" stroke-miterlimit="10" stroke-linecap="round"/>
<path d="M146.726 170.184C149.705 154.507 145.236 137.032 135.286 125.472C131.206 140.879 135.097 158.932 146.726 170.184Z" fill="#A9CAED"/>
<path d="M136.31 129.472C138.271 144.056 141.76 157.715 147.166 171.066" stroke="#6E86C5" stroke-width="1.33333" stroke-miterlimit="10" stroke-linecap="round"/>
<path d="M141.609 183.535C140.339 167.418 132.08 152.282 119.998 143.928C120.696 152.464 122.965 160.692 126.567 168.172C130.709 176.765 136.794 182.215 141.609 183.535Z" fill="#A9CAED"/>
<path d="M121.79 147.192C126.542 160.632 133.381 173.09 141.911 183.877" stroke="#6E86C5" stroke-width="1.33333" stroke-miterlimit="10" stroke-linecap="round"/>
<path d="M234.911 179.672C241.505 162.518 256.673 148.601 273.4 144.364C266.07 161.286 251.11 174.926 234.911 179.672Z" fill="#A9CAED"/>
<path d="M269.345 147.929C259.778 155.201 250.689 163.241 242.215 171.947C231.919 182.52 222.207 194.312 209.654 201.365" stroke="#6E86C5" stroke-width="1.33333" stroke-miterlimit="10" stroke-linecap="round"/>
<path d="M226.242 188.376C238.808 177.32 255.881 172.467 270.74 175.723C258.143 187.974 239.99 193.374 226.242 188.376Z" fill="#A9CAED"/>
<path d="M266.02 177.266C253.04 181.188 240.009 184.803 226.934 188.115" stroke="#6E86C5" stroke-width="1.33333" stroke-miterlimit="10" stroke-linecap="round"/>
<path d="M217.028 198.811C230.976 190.212 249.155 190.759 260.105 200.106C245.22 208.077 226.997 207.53 217.028 198.811Z" fill="#A9CAED"/>
<path d="M256.679 199.606C242.75 201.429 228.776 201.076 215.381 198.556" stroke="#6E86C5" stroke-width="1.33333" stroke-miterlimit="10" stroke-linecap="round"/>
<path d="M228.996 184.535C238.054 171.787 241.266 154.394 237.212 140.037C227.286 152.094 223.326 169.763 228.996 184.535Z" fill="#A9CAED"/>
<path d="M236.476 144.011C232.227 157.802 229.719 171.392 229.028 185.498" stroke="#6E86C5" stroke-width="1.33333" stroke-miterlimit="10" stroke-linecap="round"/>
<path d="M219.001 194.342C224.483 179.469 223.389 162.61 216.135 150.24C213.256 158.129 211.886 166.382 212.005 174.516C212.137 183.857 215.28 191.199 219.001 194.342Z" fill="#A9CAED"/>
<path d="M216.374 153.874C215.066 167.785 216.003 181.676 219.121 194.764" stroke="#6E86C5" stroke-width="1.33333" stroke-miterlimit="10" stroke-linecap="round"/>
<path d="M48.0287 149.676C41.3066 129.115 22.5476 112.502 0.724854 107.787C9.89934 125.575 26.5406 139.731 48.0287 149.676Z" fill="#A9CAED"/>
<path d="M49.1671 152.869C34.4426 144.542 15.9935 142.707 -0.000244141 147.97C14.8338 155.38 32.4108 157.444 49.1671 152.869Z" fill="#A9CAED"/>
<path d="M53.2397 157.326C37.3255 155.121 20.6605 159.043 7.73633 168.035C22.3913 173.362 39.974 169.908 53.2397 157.326Z" fill="#A9CAED"/>
<path d="M58.2016 167.066C42.4422 167 26.9472 174.49 17.6841 186.651C24.6978 188.057 32.1456 187.217 38.58 184.303C45.0148 181.389 50.4058 176.416 58.2016 167.066Z" fill="#A9CAED"/>
<path d="M69.3122 183.364C53.7728 180.7 37.2158 185.516 26.0107 195.959C32.6986 198.499 40.1872 198.905 47.0299 197.101C53.8728 195.297 60.0336 191.289 69.3122 183.364Z" fill="#A9CAED"/>
<path d="M52.5355 150.654C42.2743 136.823 39.4891 118.186 45.319 102.33C49.7709 109.869 53.6116 117.839 55.405 126.311C57.1978 134.784 56.8495 143.816 52.5355 150.654Z" fill="#A9CAED"/>
<path d="M58.8044 163.996C56.3743 149.302 61.3986 133.728 72.0111 123.085C73.2325 138.288 68.5809 153.775 58.8044 163.996Z" fill="#A9CAED"/>
<path d="M5.50195 111.474C36.7332 131.456 61.1575 161.24 74.0506 195.08" stroke="#6E86C5" stroke-width="1.33333" stroke-miterlimit="10" stroke-linecap="round"/>
<path d="M46.2893 109.62C50.0879 125.045 52.3992 140.793 53.1812 156.588" stroke="#6E86C5" stroke-width="1.33333" stroke-miterlimit="10" stroke-linecap="round"/>
<path d="M69.678 129.053C68.4341 141.498 64.5877 153.661 58.4438 164.617" stroke="#6E86C5" stroke-width="1.33333" stroke-miterlimit="10" stroke-linecap="round"/>
<path d="M6.57397 148.327C20.8921 151.05 35.445 152.526 50.0006 152.742" stroke="#6E86C5" stroke-width="1.33333" stroke-miterlimit="10" stroke-linecap="round"/>
<path d="M15.2021 166.812C28.4046 165.854 41.3931 162.655 53.3991 157.402" stroke="#6E86C5" stroke-width="1.33333" stroke-miterlimit="10" stroke-linecap="round"/>
<path d="M23.1118 184.434C35.294 178.357 47.4771 172.273 59.6598 166.196" stroke="#6E86C5" stroke-width="1.33333" stroke-miterlimit="10" stroke-linecap="round"/>
<path d="M31.0347 195.164C46.9399 192.095 51.6657 188.433 69.3191 183.365" stroke="#6E86C5" stroke-width="1.33333" stroke-miterlimit="10" stroke-linecap="round"/>
<path d="M131.727 166.029C131.727 166.029 133.104 178.645 134.644 179.657C137.397 181.474 169.267 185.673 169.267 185.673L168.223 193.964C168.223 193.964 124.574 197.886 122.72 195.705C119.501 191.921 113.844 173.667 113.844 173.667L131.727 166.029Z" fill="#E1534D"/>
<path d="M110.683 133.554L114.209 125.087C114.209 125.087 123.776 129.581 126.932 135.132C130.307 141.066 134.437 172.615 134.437 172.615C134.437 172.615 117.547 176.506 114.442 174.853C111.336 173.199 110.683 133.554 110.683 133.554Z" fill="#F0A71C"/>
<path d="M83.8226 94.2521C81.3523 93.3469 78.7373 92.5549 76.091 92.756C73.4446 92.9572 70.7416 94.3589 69.8428 96.6847C69.2016 98.3316 69.497 100.274 68.485 101.757C67.517 103.178 65.5935 103.769 63.7957 103.888C61.9916 104.014 60.175 103.775 58.3835 104.008C52.8519 104.743 48.9044 110.753 50.721 115.675C51.4439 117.636 52.9274 119.509 52.5879 121.552C52.2296 123.739 49.9353 125.179 48.9924 127.209C47.7415 129.912 49.2375 133.187 51.7079 135.029C54.1782 136.864 57.3904 137.562 60.5082 138.027C64.8015 138.668 69.233 138.97 73.476 138.065C77.719 137.16 81.7734 134.922 83.9672 131.427C84.9415 129.881 85.5324 128.133 86.6639 126.681C89.0022 123.683 93.1447 122.52 96.4071 120.395C99.9712 118.063 102.586 113.525 100.487 109.973C98.4626 106.56 93.195 105.799 91.0829 102.436C90.2091 101.047 90.0017 99.394 89.436 97.8791C88.8577 96.3579 87.4748 95.591 83.8226 94.2521Z" fill="#16233A"/>
<path d="M98.2177 136.121C98.84 136.837 99.5755 137.623 100.594 137.692C101.669 137.768 102.568 137.007 103.259 136.271C106.829 132.494 109.187 127.855 110.142 123.071C109.256 122.568 108.401 122.084 107.628 121.632C106.911 121.204 106.371 120.607 106.063 119.909C105.849 119.394 105.773 118.853 105.83 118.287C106.333 113.56 106.779 110.927 108.439 106.13C100.556 104.352 93.1198 102.24 88.8454 98.6691C88.3237 100.869 87.7077 105.175 86.3939 109.443C84.9921 113.963 82.8046 118.432 79.0959 120.356C86.375 124.655 92.8684 129.998 98.2177 136.121Z" fill="#F7906C"/>
<path d="M105.829 118.294C105.773 118.86 105.848 119.407 106.062 119.916C101.398 125.573 90.9695 118.181 86.3933 109.45C87.7071 105.182 88.3231 100.876 88.8448 98.6758C93.113 102.246 100.555 104.365 108.438 106.137C106.779 110.933 106.332 113.561 105.829 118.294Z" fill="#E1534D"/>
<path d="M118.816 186.689C117.786 193.515 125.153 200.863 125.335 204.509C109.689 204.509 76.9145 205.465 60.2254 203.196C59.4648 198.984 67.7056 189.511 67.7056 180.158C67.7056 178.919 67.6553 177.562 67.5548 176.103C67.2907 171.929 66.6747 166.964 65.9896 161.872C64.1289 148.213 61.6523 133.604 63.4815 130.574C67.0645 124.672 75.4436 120.661 79.5986 118.939C81.0255 118.348 81.9558 118.028 82.0249 117.99C87.236 126.878 97.8403 134.459 101.844 134.12C102.957 134.032 106.257 132.881 108.438 121.9C109.287 122.384 110.136 122.83 110.978 123.264C115.12 125.42 119.005 127.199 120.124 129.971C123.078 137.269 125.976 155.668 125.335 162.212C124.687 168.812 122.035 173.853 120.174 180.478C119.74 182.031 119.344 183.678 119.024 185.451C118.942 185.846 118.879 186.261 118.816 186.689Z" fill="#FBC326"/>
<path d="M125.335 204.509C109.689 204.509 76.9145 205.465 60.2254 203.196C59.4648 198.984 67.7056 189.511 67.7056 180.158C67.7056 178.919 67.6553 177.562 67.5548 176.103C67.2907 171.929 66.6747 166.964 65.9896 161.872C68.9502 164.996 73.2687 151.796 75.1796 155.661C85.5199 176.531 93.6727 182.018 107.841 182.018C112.065 182.018 115.963 181.434 120.174 180.478C119.74 182.031 119.344 183.678 119.024 185.45C118.948 185.853 118.879 186.268 118.816 186.695C117.786 193.509 125.153 200.857 125.335 204.509Z" fill="#FAB31F"/>
<path d="M110.978 123.26C110.305 128.144 108.313 134.726 102.517 136.461C94.6848 138.805 83.3513 124.172 79.5986 118.935C81.0255 118.345 81.9559 118.024 82.025 117.986C87.236 126.875 97.8404 134.455 101.844 134.116C102.957 134.028 106.257 132.878 108.438 121.896C109.287 122.374 110.136 122.82 110.978 123.26Z" fill="#F8E354"/>
<path d="M114.196 197.159L114.14 202.609L211.572 203.188L211.773 197.008L114.196 197.159Z" fill="#345A73"/>
<path d="M253.8 148.537L251.632 146.337L180.663 145.871L145.06 197.359L146.921 198.855L253.8 148.537Z" fill="#345A73"/>
<path d="M182.034 147.777L146.921 198.856L213.992 199.189L253.8 148.538L182.034 147.777Z" fill="#1A2C4C"/>
<path d="M198.981 172.572C203.293 172.572 206.788 174.32 206.788 176.475C206.788 178.631 203.293 180.379 198.981 180.379C194.669 180.379 191.174 178.631 191.174 176.475C191.174 174.32 194.669 172.572 198.981 172.572Z" fill="#40718F"/>
<path d="M115.637 97.3528C116.743 91.4177 120.813 87.1973 124.727 87.9271C128.642 88.6563 130.919 94.059 129.813 99.9942C128.707 105.929 124.637 110.15 120.723 109.42C116.808 108.691 114.531 103.288 115.637 97.3528Z" fill="#73C9F1"/>
<path d="M129.823 81.3653C129.094 86.5323 126.787 92.2273 123.424 98.5195C122.242 93.3651 121.488 87.0855 120.444 80.8058C119.382 74.5136 118.031 68.2214 115.686 63.0795C115.158 61.9418 114.586 60.8543 113.964 59.8486C115.353 59.7166 116.761 59.8486 118.1 60.2194C120.193 60.7789 122.154 61.8601 123.757 63.3058C126.422 65.6756 128.208 68.9066 129.27 72.3135C130.144 75.1422 130.301 78.1469 129.823 81.3653Z" fill="#1A2C4C"/>
<path d="M125.876 86.7076C125.838 87.7259 125.769 88.7631 125.675 89.794C124.241 106.515 117.22 117.986 106.477 117.986C91.3094 117.986 81.4783 100.977 81.4783 84.3126C81.4783 67.875 91.5483 55.9757 103.334 57.3523C110.129 58.1318 115.095 60.3884 118.622 63.6948C120.954 65.8949 122.638 68.5539 123.789 71.5774C125.103 74.9655 125.737 78.7999 125.869 82.9297C125.869 82.9423 125.882 82.9549 125.882 82.9675C125.932 84.1869 125.92 85.4315 125.876 86.7076Z" fill="#F7906C"/>
<path d="M125.875 86.707C125.423 85.0915 124.75 83.5138 123.832 82.0994C114.888 86.7762 104.227 88.5802 94.1189 86.8705C92.1954 88.4734 90.3159 90.0511 88.4238 91.6289C88.4615 84.0229 88.5684 78.8748 91.5354 75.1912C94.32 71.734 98.9653 70.4328 103.365 69.8671C108.319 69.2196 113.354 69.2448 118.295 69.9613C120.187 70.2254 122.148 70.6339 123.795 71.5894C125.108 74.9775 125.743 78.8119 125.875 82.9418C125.875 82.9543 125.888 82.9669 125.888 82.9795C125.932 84.1864 125.919 85.431 125.875 86.707Z" fill="#E1534D"/>
<path d="M128.063 76.4108C125.982 78.1709 123.374 79.6292 120.445 80.811C112.109 84.1739 101.279 85.2865 92.8368 84.8779C88.6881 93.9925 87.0097 97.2612 85.9474 105.213C81.893 101.41 78.5929 94.4451 77.6123 88.9701C76.6443 83.5139 76.7386 77.7874 78.2597 72.4255C80.6547 63.971 86.6955 59.4451 90.8819 57.2451C91.9253 56.673 92.8682 56.277 93.5974 55.9879C98.9467 53.9198 104.975 54.1084 110.463 55.7867C113.455 56.717 115.975 58.2885 118.094 60.2246C122.374 64.0904 125.021 69.3266 126.73 73.249C127.271 74.4496 127.705 75.5371 128.063 76.4108Z" fill="#1A2C4C"/>
<path d="M129.823 81.3672C129.477 79.538 128.962 77.7654 128.233 76.0556C127.824 75.0876 127.321 74.151 126.737 73.2458C124.832 70.2537 122.06 67.7896 118.71 66.7021C117.754 65.3632 116.749 64.1563 115.692 63.0877C111.89 59.2219 107.427 57.0092 102.699 56.2361C98.7645 55.6012 94.6724 55.9595 90.8945 57.2418C91.938 56.6698 92.8809 56.2738 93.6101 55.9846C98.9594 53.9166 104.988 54.1052 110.475 55.7835C113.467 56.7138 115.988 58.2853 118.106 60.2214C120.199 60.7808 122.161 61.862 123.764 63.3077C126.429 65.6775 128.214 68.9085 129.276 72.3155C130.144 75.1441 130.301 78.1488 129.823 81.3672Z" fill="#2A5070"/>
<path d="M97.6704 91.6191C100.474 90.0162 103.384 89.2933 107.464 90.7831" stroke="#1A2C4C" stroke-width="2.66667" stroke-miterlimit="10" stroke-linecap="round"/>
<path d="M116.868 91.5059C119.269 89.7144 122.827 89.5321 124.681 91.5059" stroke="#1A2C4C" stroke-width="2.66667" stroke-miterlimit="10" stroke-linecap="round"/>
<path d="M113.97 100.645C114.215 101.915 114.083 104.725 113.479 105.988" stroke="#CD3249" stroke-width="2.66667" stroke-miterlimit="10" stroke-linecap="round"/>
<path d="M104.497 97.8522C105.136 97.8522 105.654 98.6688 105.654 99.6751C105.654 100.682 105.136 101.498 104.497 101.498C103.858 101.498 103.34 100.682 103.34 99.6751C103.34 98.6688 103.858 97.8522 104.497 97.8522Z" fill="#25293B"/>
<path d="M119.615 97.0026C120.254 97.0026 120.771 97.8191 120.771 98.8255C120.771 99.8325 120.254 100.648 119.615 100.648C118.976 100.648 118.458 99.8325 118.458 98.8255C118.458 97.8191 118.976 97.0026 119.615 97.0026Z" fill="#25293B"/>
<path d="M112.537 108.472C112.537 108.472 112.31 108.912 111.877 109.509C111.198 110.42 110.041 111.677 108.463 112.168H108.457C107.791 112.381 107.068 112.457 106.263 112.312C103.9 111.891 103.278 109.71 103.164 108.032C103.139 107.705 103.139 107.403 103.146 107.126C103.158 106.448 103.234 105.995 103.234 105.995C106.999 108.069 112.537 108.472 112.537 108.472Z" fill="#CD3249"/>
<path d="M112.537 108.471C112.537 108.471 112.31 108.911 111.877 109.508C109.953 109.483 106.018 108.496 103.146 107.125C103.158 106.447 103.234 105.994 103.234 105.994C106.999 108.068 112.537 108.471 112.537 108.471Z" fill="white"/>
<path d="M108.457 112.158C107.791 112.372 107.068 112.447 106.264 112.302C103.9 111.881 103.278 109.7 103.165 108.022C104.309 108.16 105.415 108.6 106.333 109.298C107.294 110.033 108.03 111.033 108.457 112.158Z" fill="#EA509C"/>
<path d="M85.9848 88.7305C85.9848 88.7305 85.8528 80.8919 89.1152 73.1037C93.2074 63.3291 101.549 59.1489 109.639 58.8661C119.388 58.5204 125.492 65.064 125.492 65.064C125.492 65.064 122.317 59.4632 116.057 57.854C111.946 56.798 105.741 56.6283 100.763 58.6523C95.6337 60.733 89.2409 66.5098 86.9277 72.6134C84.6208 78.717 83.4956 88.2213 83.4956 88.2213L85.9848 88.7305Z" fill="#537EC8"/>
<path d="M83.4416 86.2374C87.6161 85.803 91.5328 90.5791 92.1909 96.9052C92.8485 103.231 89.9972 108.71 85.8227 109.145C81.6482 109.578 77.7308 104.802 77.0733 98.4767C76.4158 92.1512 79.2665 86.6711 83.4416 86.2374Z" fill="#73C9F1"/>
<path d="M81.3215 89.9415C84.0169 89.5367 86.7789 93.0518 87.4911 97.7926C88.204 102.534 86.5967 106.705 83.9019 107.111C81.2065 107.516 78.4444 104.001 77.7323 99.2591C77.0194 94.5183 78.6267 90.3463 81.3215 89.9415Z" fill="#537EC8"/>
<path d="M109.702 113.177C111.938 113.177 113.75 114.306 113.75 115.698C113.75 117.09 111.938 118.219 109.702 118.219C107.466 118.219 105.654 117.09 105.654 115.698C105.654 114.306 107.466 113.177 109.702 113.177Z" fill="#4D92CF"/>
<path d="M89.3669 107.268C89.3669 107.268 95.3134 114.912 105.654 115.697" stroke="#4D92CF" stroke-width="2.66667" stroke-miterlimit="10" stroke-linecap="round"/>
<path d="M114.139 182.606L113.75 192.657C113.75 192.657 77.3983 203.551 71.3952 200.106C68.466 198.421 65.7316 189.156 63.6887 180.11C61.5515 170.606 60.1812 161.353 60.1812 161.353L81.4904 157.179C81.4904 157.179 81.503 170.172 82.2259 177.684C82.4836 180.481 82.8545 182.518 83.351 182.851C85.2305 184.089 114.139 182.606 114.139 182.606Z" fill="#F7906C"/>
<path d="M82.2259 177.673C78.3537 178.93 70.8798 180.872 63.6887 180.105C61.5515 170.601 60.1812 161.348 60.1812 161.348L81.4904 157.174C81.4904 157.168 81.503 170.161 82.2259 177.673Z" fill="#E1534D"/>
<path d="M113.103 182.708C118.508 181.551 127.661 178.773 131.457 177.818C134.154 177.139 141.175 180.772 143.03 184.198C143.841 185.694 144.608 194.167 141.798 193.294C140.39 192.854 140.622 189.22 140.182 187.737C139.824 186.53 138.68 185.361 136.939 184.355C138.102 187.253 138.058 189.78 137.932 192.91C137.907 193.602 137.863 194.324 137.53 194.922C137.19 195.519 136.461 195.946 135.832 195.682C135.191 195.418 134.971 194.62 134.827 193.922C134.33 191.508 133.827 189.095 133.626 186.366C133.676 189.051 133.62 191.741 133.45 194.419C133.324 196.468 132.306 197.593 131.055 197.235C130.496 197.078 130.269 196.562 130.031 195.883C129.653 197.197 128.711 198.649 127.491 198.096C126.749 197.763 126.29 195.085 126.422 192.332C124.084 193.784 121.444 194.4 118.402 194.538C115.674 194.664 112.883 194.155 111.242 192.3C111.405 189.403 112.361 185.116 113.103 182.708Z" fill="#F7906C"/>
<path d="M130.087 195.469C130.269 193.294 130.081 191.087 129.527 188.988" stroke="#CD3249" stroke-width="1.33333" stroke-miterlimit="10" stroke-linecap="round"/>
<path d="M79.0955 136.097C77.5492 131.741 71.8856 122.828 71.8856 122.828C71.8856 122.828 63.2424 126.423 60.1749 132.527C54.9827 142.861 57.6228 172.531 57.6228 172.531C64.6191 175.46 78.6618 175.504 84.6397 174.662C84.6397 174.662 82.1945 144.803 79.0955 136.097Z" fill="#FBC326"/>
<path d="M80.1956 137.918C82.5528 149.202 83.8162 159.724 84.2185 170.033" stroke="#F0A71C" stroke-width="1.33333" stroke-miterlimit="10" stroke-linecap="round"/>
<path d="M17.3494 201.395H265.19V207.611H17.3494V201.395Z" fill="#1A2C4C"/>
</svg>
