<svg width="71" height="92" viewBox="0 0 71 92" fill="none" xmlns="http://www.w3.org/2000/svg">
<path d="M11.5579 48.0215L21.0464 90.1617H55.9307L65.2797 48.0215H11.5579Z" fill="#00B9F5" stroke="white" stroke-width="3" stroke-miterlimit="10" stroke-linejoin="round"/>
<path d="M31.9301 48.0189C31.9301 48.0189 25.2323 37.414 30.2556 14.1113C30.2556 14.1113 39.4651 25.972 39.8837 48.0189H31.9301Z" fill="#00B9F5" stroke="white" stroke-width="3" stroke-miterlimit="10" stroke-linejoin="round"/>
<path d="M37.9302 32.3907C37.9302 32.3907 37.9302 20.1114 48.8141 1.83203C48.8141 1.83203 57.884 18.9951 47.0001 48.0188H39.8837C39.8837 48.0188 40.1628 39.9257 37.9302 32.3907Z" fill="#00B9F5" stroke="white" stroke-width="3" stroke-miterlimit="10" stroke-linejoin="round"/>
<path d="M51.7442 29.3202C51.7442 29.3202 61.6513 20.5294 63.8839 13.2734C63.8839 13.2734 67.9305 30.4365 57.7443 48.0182H46.8604C46.9999 48.0182 51.186 36.4366 51.7442 29.3202Z" fill="#00B9F5" stroke="white" stroke-width="3" stroke-miterlimit="10" stroke-linejoin="round"/>
<path d="M62.3492 37.9736C62.3492 37.9736 66.9539 31.9735 69.047 30.5781C69.047 30.5781 70.861 39.648 63.4655 48.0203H57.884C57.884 48.0203 61.0934 42.4388 62.3492 37.9736Z" fill="#00B9F5" stroke="white" stroke-width="3" stroke-miterlimit="10" stroke-linejoin="round"/>
<path d="M34.0232 20.9509C34.0232 20.9509 35.1395 9.22978 36.6744 7.13672C36.6744 7.13672 39.186 10.4856 40.5814 19.5555C40.5814 19.5555 38.7674 25.137 37.9302 31.1371C37.9302 30.9976 35 22.9044 34.0232 20.9509Z" fill="#00B9F5" stroke="white" stroke-width="3" stroke-miterlimit="10" stroke-linejoin="round"/>
<path d="M28.3021 30.9972C28.3021 30.9972 22.5811 14.3922 15.8833 7.83398C15.8833 7.83398 13.0926 36.16 23.6974 48.0207H31.7906C31.9301 48.0207 27.8835 39.0903 28.3021 30.9972Z" fill="#00B9F5" stroke="white" stroke-width="3" stroke-miterlimit="10" stroke-linejoin="round"/>
<path d="M17.2786 48.0172C17.2786 48.0172 8.06913 36.1565 8.90635 26.668C8.90635 26.668 15.046 31.8308 17.5576 35.1797C17.5576 35.1797 19.5112 43.1334 23.6973 48.0172H17.2786Z" fill="#00B9F5" stroke="white" stroke-width="3" stroke-miterlimit="10" stroke-linejoin="round"/>
<path d="M12.2552 39.228C12.2552 39.228 4.99926 35.6 1.92944 34.9023C1.92944 34.9023 6.81323 45.0885 14.6273 48.0188H17.4181C17.2785 48.0188 13.3715 41.8792 12.2552 39.228Z" fill="#00B9F5" stroke="white" stroke-width="3" stroke-miterlimit="10" stroke-linejoin="round"/>
</svg>
