<svg width="98" height="71" viewBox="0 0 98 71" fill="none" xmlns="http://www.w3.org/2000/svg">
<path d="M0.715588 16.2111L0 69.455L78.9873 70.5165L79.7029 17.2727L0.715588 16.2111Z" fill="#4C8BF5"/>
<path d="M79.7414 17.2958C79.5357 17.5584 79.304 17.7995 79.0496 18.0152L76.9745 19.9659L69.241 27.0491L43.3015 50.4154L43.0663 50.6229L42.8035 50.4292L40.8666 48.866L12.3955 25.9147L3.80428 18.8868L1.49396 16.95C1.20873 16.741 0.94875 16.4996 0.719238 16.2306C1.02359 16.4078 1.31487 16.6066 1.59081 16.8255L3.98414 18.6516L12.7136 25.4858L41.3232 48.2711L43.26 49.8205H42.7619L68.826 26.6894L76.7255 19.7722L78.8975 17.9322C79.1551 17.6904 79.438 17.4771 79.7414 17.2958Z" fill="#263238"/>
<path d="M0.027169 69.4793C-0.111175 69.3409 6.10046 62.1747 13.9307 53.459C21.761 44.7434 28.2078 37.7985 28.36 37.923C28.5122 38.0475 22.2867 45.2275 14.5256 53.9432C6.7645 62.6589 0.179348 69.5761 0.027169 69.4793Z" fill="#263238"/>
<path d="M79.022 70.5444C78.6322 70.2193 78.2837 69.8476 77.9844 69.4376C77.3618 68.6906 76.4626 67.5977 75.3835 66.2419C73.2115 63.475 70.2371 59.7812 66.9999 55.5894C63.7626 51.3976 60.8712 47.5793 58.7822 44.7847C57.8277 43.4013 57.0253 42.3637 56.3474 41.4506C56.0282 41.0458 55.7502 40.6101 55.5173 40.1502C55.5173 40.1502 55.9185 40.4961 56.5411 41.2431L59.1419 44.4112C61.3139 47.1781 64.2884 50.8995 67.5394 55.1052C70.7905 59.3109 73.6958 63.1292 75.7709 65.9237C76.8085 67.3072 77.6386 68.4692 78.2058 69.2578C78.5284 69.6524 78.8024 70.0844 79.022 70.5444Z" fill="#263238"/>
<g opacity="0.3">
<path d="M67.4895 0.0719746L61.8674 19.9798L91.4008 28.3202L97.0229 8.41237L67.4895 0.0719746Z" fill="#4C8BF5"/>
<path d="M97.0348 8.42486C96.9312 8.50273 96.82 8.56987 96.7029 8.62526L95.7281 9.14859L92.1139 11.029L80.0306 17.189L79.9215 17.2433L79.8423 17.1442L79.2727 16.3628L70.8966 4.88758L68.3794 1.38653L67.7072 0.427441C67.6211 0.320339 67.5478 0.203605 67.4888 0.0795898C67.5852 0.176696 67.6745 0.28058 67.756 0.390451L68.4705 1.31636L71.0591 4.75864L79.5038 16.1855L80.0748 16.9617L79.8879 16.9116L91.9943 10.8523L95.6541 9.05087L96.6542 8.57881C96.7751 8.51399 96.9028 8.46238 97.0348 8.42486Z" fill="#263238"/>
<path d="M61.8751 19.9916C61.8371 19.9258 64.8886 17.8613 68.7033 15.378C72.5179 12.8948 75.6354 10.9369 75.68 10.9989C75.7246 11.0609 72.6665 13.1293 68.8778 15.6195C65.0891 18.1097 61.9225 20.0433 61.8751 19.9916Z" fill="#263238"/>
<path d="M91.411 28.3341C91.2975 28.1729 91.2041 27.9984 91.133 27.8145C90.9745 27.4716 90.7469 26.971 90.4783 26.3538C89.9415 25.0971 89.1967 23.412 88.4034 21.5135C87.6101 19.615 86.909 17.8914 86.4061 16.6327C86.187 16.0176 85.9903 15.5476 85.8277 15.1368C85.7486 14.9528 85.6881 14.7613 85.647 14.5653C85.647 14.5653 85.7627 14.7355 85.9212 15.0784L86.5787 16.5287C87.1155 17.7854 87.8575 19.4809 88.6546 21.386C89.4517 23.2911 90.158 25.016 90.6557 26.2733C90.9059 26.8968 91.1006 27.4163 91.2341 27.7693C91.3155 27.9498 91.3749 28.1394 91.411 28.3341Z" fill="#263238"/>
</g>
</svg>
