<svg width="420" height="293" viewBox="0 0 420 293" fill="none" xmlns="http://www.w3.org/2000/svg">
<path d="M419.43 285.977C419.43 286.116 325.532 286.217 209.729 286.217C93.9261 286.217 0 286.116 0 285.977C0 285.838 93.8799 285.736 209.729 285.736C325.578 285.736 419.43 285.829 419.43 285.977Z" fill="#263238"/>
<path d="M239.006 245.387C238.932 245.489 226.055 235.943 210.33 224.056C194.605 212.17 181.867 202.439 181.951 202.337C182.034 202.235 194.901 211.781 210.626 223.668C226.351 235.554 239.089 245.276 239.006 245.387Z" fill="#263238"/>
<path d="M176.114 246.488C176.03 246.386 188.851 236.415 204.789 224.223C220.727 212.031 233.64 202.235 233.714 202.337C233.788 202.439 220.977 212.41 205.039 224.602C189.101 236.794 176.197 246.599 176.114 246.488Z" fill="#263238"/>
<path d="M185.577 191.394L183.301 203.687H186.677L190.155 191.394H185.577Z" fill="#263238"/>
<path d="M179.721 200.098C176.733 215.074 165.171 270.973 162.248 285.089C162.161 285.475 162.162 285.876 162.249 286.262C162.336 286.648 162.508 287.01 162.753 287.322C162.997 287.633 163.307 287.887 163.662 288.064C164.016 288.241 164.405 288.337 164.801 288.345C165.378 288.336 165.936 288.138 166.389 287.78C166.842 287.422 167.165 286.925 167.307 286.365L189.869 202.272C190.059 201.595 190.092 200.883 189.965 200.191C189.839 199.498 189.556 198.844 189.139 198.278C188.721 197.711 188.18 197.248 187.556 196.922C186.933 196.596 186.243 196.417 185.539 196.398H184.078C183.037 196.419 182.035 196.799 181.241 197.473C180.447 198.147 179.91 199.074 179.721 200.098Z" fill="#455A64"/>
<path d="M230.31 191.394L232.586 203.687H229.209L225.722 191.394H230.31Z" fill="#263238"/>
<path d="M254.111 175.567C247.544 163.375 239.736 126.19 236.295 114.312C236.203 113.979 236.101 113.665 235.999 113.387C234.697 109.585 232.233 106.289 228.954 103.965C225.675 101.641 221.749 100.407 217.73 100.437H197.953C193.935 100.407 190.008 101.641 186.73 103.965C183.451 106.289 180.986 109.585 179.684 113.387C179.583 113.702 179.481 114.016 179.388 114.312C175.947 126.19 168.131 163.338 161.573 175.567C161.573 175.567 152.822 180.719 155.319 185.64C157.734 190.386 180.202 193.753 207.86 192.865C235.528 193.79 257.996 190.386 260.401 185.64C262.862 180.719 254.111 175.567 254.111 175.567Z" fill="#E0E0E0"/>
<path d="M254.111 175.567C254.873 175.997 255.599 176.485 256.285 177.029C257.132 177.674 257.921 178.392 258.644 179.175C259.687 180.22 260.432 181.527 260.799 182.958C260.963 183.832 260.856 184.736 260.494 185.548C260.018 186.413 259.288 187.11 258.403 187.546C257.482 188.064 256.516 188.497 255.517 188.841C254.49 189.211 253.399 189.535 252.252 189.831C247.033 191.076 241.726 191.914 236.378 192.338C230.431 192.883 223.854 193.17 216.759 193.189C214.983 193.189 213.179 193.189 211.348 193.189C209.516 193.189 207.647 193.059 205.797 193.189C202.005 193.29 198.083 193.309 194.059 193.189C185.571 193.108 177.099 192.406 168.714 191.089C166.531 190.7 164.329 190.238 162.137 189.618C161.037 189.312 159.956 188.941 158.899 188.508C157.802 188.081 156.781 187.482 155.874 186.732C155.417 186.318 155.081 185.787 154.903 185.196C154.841 185.056 154.792 184.911 154.755 184.762L154.7 184.299L154.644 183.846C154.644 183.698 154.644 183.541 154.69 183.393C154.851 182.188 155.33 181.048 156.078 180.09C157.573 178.214 159.393 176.622 161.452 175.391L161.369 175.474C163.614 170.765 165.47 165.88 166.919 160.868C168.482 155.79 169.916 150.592 171.285 145.31C172.728 139.76 174.06 134.293 175.42 128.891C176.092 126.19 176.761 123.51 177.427 120.852C178.112 118.188 178.741 115.552 179.592 112.971C180.498 110.443 181.926 108.133 183.783 106.193C185.639 104.252 187.883 102.723 190.368 101.704C192.776 100.718 195.351 100.203 197.953 100.187H216.407C217.596 100.157 218.785 100.2 219.969 100.317C222.295 100.581 224.558 101.248 226.657 102.287C228.677 103.317 230.508 104.684 232.068 106.33C233.575 107.92 234.79 109.765 235.657 111.778L236.23 113.276C236.388 113.776 236.545 114.285 236.674 114.784C236.952 115.792 237.239 116.791 237.488 117.781C238.515 121.74 239.44 125.551 240.328 129.187C243.862 143.746 246.933 155.476 249.495 163.412C250.753 167.408 251.928 170.442 252.77 172.477C253.186 173.495 253.584 174.235 253.815 174.753L254.167 175.539C254.167 175.539 253.602 174.531 252.687 172.514C251.771 170.498 250.596 167.464 249.319 163.468C246.692 155.513 243.575 143.783 240.005 129.242C239.079 125.607 238.154 121.796 237.128 117.846C236.878 116.856 236.591 115.866 236.314 114.858C236.175 114.359 236.018 113.859 235.86 113.369L235.305 111.898C234.446 109.93 233.25 108.128 231.772 106.57C230.246 104.961 228.452 103.627 226.472 102.629C224.418 101.612 222.201 100.964 219.922 100.715C218.755 100.597 217.581 100.554 216.407 100.585H205.418C200.497 100.733 195.243 99.9562 190.488 102.074C188.064 103.068 185.875 104.561 184.064 106.456C182.254 108.351 180.863 110.605 179.98 113.073C179.148 115.607 178.519 118.262 177.825 120.908L175.836 128.955C174.504 134.358 173.144 139.843 171.701 145.374C170.323 150.656 168.926 155.864 167.317 160.952C165.871 165.994 164.014 170.91 161.767 175.65V175.696L161.702 175.743C159.696 176.939 157.923 178.487 156.466 180.312C155.772 181.202 155.323 182.257 155.162 183.374C155.162 183.513 155.162 183.652 155.116 183.79L155.171 184.197V184.604C155.171 184.734 155.264 184.854 155.31 184.984C155.461 185.505 155.756 185.973 156.161 186.334C157.027 187.048 158.001 187.619 159.047 188.027C160.087 188.459 161.153 188.826 162.238 189.128C164.389 189.727 166.569 190.214 168.769 190.589C177.127 191.912 185.57 192.623 194.031 192.717C198.052 192.797 201.962 192.797 205.76 192.717C207.666 192.615 209.535 192.717 211.366 192.717C213.198 192.717 215.011 192.782 216.777 192.772C223.863 192.772 230.431 192.513 236.378 191.986C241.703 191.603 246.991 190.814 252.196 189.627C253.337 189.337 254.419 189.014 255.443 188.656C256.433 188.326 257.39 187.905 258.301 187.398C259.153 186.99 259.858 186.327 260.318 185.502C260.677 184.725 260.79 183.856 260.642 183.013C260.277 181.62 259.556 180.345 258.551 179.313C257.84 178.528 257.063 177.804 256.229 177.149C255.554 176.621 255.018 176.224 254.657 175.992L254.111 175.567Z" fill="#263238"/>
<path d="M235.879 200.098C238.858 215.074 250.43 270.973 253.353 285.089C253.437 285.475 253.435 285.875 253.347 286.261C253.259 286.646 253.087 287.007 252.843 287.318C252.599 287.63 252.29 287.883 251.936 288.06C251.583 288.238 251.195 288.335 250.799 288.345C250.222 288.336 249.664 288.138 249.211 287.78C248.758 287.422 248.435 286.925 248.293 286.365L225.732 202.272C225.541 201.595 225.508 200.883 225.635 200.191C225.761 199.498 226.044 198.844 226.461 198.278C226.879 197.711 227.42 197.248 228.044 196.922C228.667 196.596 229.357 196.417 230.061 196.398H231.485C232.532 196.413 233.542 196.789 234.343 197.463C235.144 198.138 235.687 199.069 235.879 200.098Z" fill="#455A64"/>
<path d="M250.041 182.283C250.041 182.283 249.976 182.283 249.837 182.338L249.218 182.449L246.822 182.819C244.741 183.143 241.716 183.531 237.979 183.957C230.495 184.808 220.107 185.64 208.619 185.807C197.13 185.973 186.714 185.511 179.212 184.882C175.457 184.577 172.423 184.29 170.332 184.04L167.927 183.744L167.298 183.661L167.095 183.615H167.307H167.936L170.351 183.809C172.451 184.003 175.485 184.244 179.231 184.503C186.742 185.021 197.13 185.428 208.609 185.261C220.089 185.095 230.458 184.336 237.942 183.522C241.642 183.143 244.704 182.801 246.794 182.542L249.199 182.264L249.828 182.199L250.041 182.283Z" fill="#263238"/>
<g opacity="0.3">
<path opacity="0.3" d="M244.204 178.018C243.492 176.233 240.615 175.798 238.256 175.678C216.147 174.606 193.986 175.46 172.025 178.231C171.398 178.265 170.785 178.435 170.231 178.731C169.74 179.054 169.518 179.702 169.953 180.072L169.851 181.182C191.682 185.983 214.872 184.984 237.378 182.616C239.075 182.534 240.744 182.152 242.308 181.487C243.677 180.747 244.704 179.313 244.204 178.018Z" fill="black"/>
</g>
<path d="M178.75 129.501C178.75 129.501 166.789 140.241 164.292 152.34C160.592 170.109 170.166 183.994 170.166 183.994C188.601 184.974 204.9 185.992 236.351 183.994L236.878 137.836L178.75 129.501Z" fill="#263238"/>
<path d="M208.184 105.673C208.045 105.164 203.79 90.2527 203.79 90.2527L221.365 80.4476L226.314 100.012L208.184 105.673Z" fill="#F9BD33"/>
<path d="M254.472 69.3196C252.686 65.3051 249.754 62.7613 245.129 61.1425L231.124 57.1464H198.508C198.508 57.1464 183.477 57.7107 178.093 65.3698L181.053 110.131C181.053 110.131 181.876 118.012 173.329 135.273C173.329 135.273 179.804 143.598 190.285 143.598C200.765 143.598 236.536 139.057 236.536 139.057L240.115 119.483C240.115 119.483 249.023 99.6694 250.725 95.8676C252.956 90.8258 254.619 85.5516 255.684 80.1423C256.358 76.4943 255.936 72.7283 254.472 69.3196Z" fill="#F9BD33"/>
<path d="M211.829 118.558C211.748 118.393 211.686 118.219 211.644 118.04C211.526 117.664 211.369 117.155 211.172 116.514L209.451 110.723C207.999 105.719 205.955 98.6982 203.54 90.3083L203.494 90.1418L203.642 90.0585L221.217 80.2348L221.495 80.0868L221.569 80.3921C221.708 80.9194 221.846 81.4929 221.994 82.0664C223.595 88.3935 225.121 94.4431 226.509 99.9562H226.083L235.971 78.4496L238.848 72.2982C239.172 71.6137 239.44 71.0679 239.625 70.6702C239.713 70.4795 239.812 70.2941 239.921 70.1152C239.862 70.3147 239.788 70.5095 239.699 70.6979L238.978 72.363C238.321 73.8337 237.396 75.9335 236.203 78.5606L226.481 100.141L226.213 100.724L226.055 100.104C224.649 94.5541 223.114 88.5415 221.513 82.2236C221.365 81.6501 221.217 81.0766 221.088 80.5494L221.43 80.6974L203.892 90.447L203.994 90.188C206.343 98.5132 208.332 105.636 209.747 110.649L211.338 116.477C211.514 117.124 211.644 117.642 211.745 118.022C211.787 118.198 211.815 118.377 211.829 118.558Z" fill="#263238"/>
<path d="M179.795 63.4365C177.738 65.1838 176.092 67.3628 174.973 69.8185C173.854 72.2742 173.289 74.9463 173.32 77.6448C173.542 86.7007 183.625 132.97 190.553 136.846C197.824 140.925 201.367 139.843 205.492 139.843C209.618 139.843 240.078 137.216 240.078 137.216L239.967 117.652L206.278 118.743L194.327 76.0537L179.795 63.4365Z" fill="#F9BD33"/>
<path d="M175.753 93.2035C175.753 93.2035 175.808 93.3608 175.892 93.6845L176.252 95.0998C176.576 96.3671 177.039 98.1986 177.631 100.548C178.842 105.284 180.554 112.148 182.968 120.538C183.585 122.641 184.263 124.821 185.003 127.078C185.749 129.425 186.84 131.647 188.241 133.673C189.775 135.816 191.89 137.476 194.336 138.455C196.962 139.416 199.763 139.804 202.551 139.593C208.323 139.371 214.372 138.927 220.653 138.483L240.079 136.985L239.857 137.234V136.726C239.857 130.195 239.783 123.775 239.755 117.661L239.995 117.892L206.278 118.937H206.121L206.075 118.78C202.523 105.923 199.6 95.2478 197.5 87.7737C196.483 84.0736 195.65 81.1321 195.132 79.1155L194.531 76.8308C194.392 76.3127 194.346 76.0445 194.346 76.0445C194.346 76.0445 194.438 76.3035 194.586 76.8123L195.252 79.0785L197.722 87.7089L206.463 118.678L206.269 118.53L239.986 117.411H240.227V117.652C240.227 123.803 240.301 130.186 240.338 136.726V137.447H240.116L220.69 138.936C214.419 139.371 208.36 139.806 202.578 140.019C199.729 140.222 196.868 139.816 194.188 138.825C191.675 137.81 189.503 136.1 187.926 133.895C186.511 131.832 185.413 129.568 184.67 127.179C183.902 124.913 183.246 122.721 182.654 120.612C180.276 112.194 178.611 105.321 177.464 100.576C176.9 98.2171 176.465 96.3763 176.169 95.0998C176.03 94.4893 175.929 94.0176 175.855 93.6753C175.813 93.5198 175.779 93.3624 175.753 93.2035Z" fill="#263238"/>
<g opacity="0.3">
<path opacity="0.3" d="M193.254 138.428C191.241 137.528 189.545 136.042 188.389 134.163C184.633 128.613 182.561 120.464 181.257 114.636L180.794 114.044C181.253 119.769 182.374 125.422 184.133 130.889C185.142 133.747 186.409 136.661 188.759 138.566C190.991 140.232 193.717 141.101 196.501 141.036C199.264 140.959 202.01 140.575 204.687 139.889C202.393 139.852 196.852 140.028 193.254 138.428Z" fill="black"/>
</g>
<g opacity="0.3">
<path opacity="0.3" d="M196.14 82.5659L208.526 116.246L237.692 117.735L206.251 118.743L196.14 82.5659Z" fill="black"/>
</g>
<path d="M268.153 220.8L271.252 243.278C271.252 243.278 295.154 247.69 296.135 251.788L252.733 259.364L246.47 224.51L268.153 220.8Z" fill="#F9BD33"/>
<path d="M257.497 243.75C257.109 243.959 256.809 244.299 256.649 244.709C256.49 245.119 256.482 245.573 256.627 245.988C256.807 246.397 257.136 246.72 257.548 246.893C257.959 247.065 258.421 247.072 258.838 246.913C259.268 246.712 259.603 246.352 259.776 245.91C259.948 245.467 259.943 244.975 259.763 244.536C259.527 244.137 259.146 243.845 258.699 243.721C258.252 243.597 257.775 243.65 257.367 243.87" fill="#E0E0E0"/>
<path d="M252.862 260.289L252.252 256.913L294.035 249.892C294.035 249.892 296.116 250.401 296.134 251.797L252.862 260.289Z" fill="#E0E0E0"/>
<path d="M271.955 242.945C271.955 243.158 270.937 243.445 270.012 244.305C269.087 245.165 268.689 246.155 268.477 246.109C268.264 246.062 268.375 244.777 269.513 243.75C270.65 242.723 271.955 242.742 271.955 242.945Z" fill="#263238"/>
<path d="M276.792 244.037C276.876 244.231 276.024 244.758 275.46 245.776C274.896 246.793 274.85 247.783 274.646 247.811C274.443 247.838 274.082 246.664 274.813 245.406C275.543 244.148 276.755 243.833 276.792 244.037Z" fill="#263238"/>
<path d="M280.326 249.032C280.15 249.115 279.669 248.107 280.012 246.849C280.354 245.591 281.26 244.999 281.381 245.119C281.501 245.239 280.992 246.044 280.733 247.043C280.474 248.042 280.539 248.976 280.326 249.032Z" fill="#263238"/>
<path d="M270.641 237.904C270.586 238.107 269.559 237.987 268.375 238.274C267.191 238.561 266.321 239.106 266.183 238.949C266.044 238.792 266.812 237.867 268.208 237.543C269.605 237.219 270.715 237.728 270.641 237.904Z" fill="#263238"/>
<path d="M239.699 243.102L242.937 266.607L262.029 286.597C262.317 286.906 262.538 287.272 262.678 287.671C262.819 288.07 262.876 288.493 262.845 288.915C262.815 289.337 262.698 289.747 262.502 290.122C262.306 290.497 262.035 290.827 261.705 291.092C261.324 291.405 260.872 291.622 260.389 291.723C259.906 291.824 259.406 291.808 258.93 291.675C252.798 289.954 224.446 279.465 224.446 279.465C223.345 274.701 219.46 252.427 219.46 252.427L239.699 243.102Z" fill="#F9BD33"/>
<path d="M223.752 276.579L261.678 291.12C260.891 291.795 259.828 292.563 258.838 292.276L225.047 280.149C224.888 280.091 224.746 279.995 224.634 279.869C224.521 279.743 224.44 279.592 224.399 279.428L223.752 276.579Z" fill="#E0E0E0"/>
<path d="M230.329 271.186C230.786 271.246 231.205 271.474 231.503 271.827C231.801 272.179 231.956 272.63 231.938 273.091C231.88 273.539 231.659 273.95 231.318 274.247C230.978 274.543 230.54 274.705 230.088 274.701C229.606 274.628 229.168 274.381 228.858 274.005C228.547 273.63 228.386 273.153 228.405 272.666C228.501 272.191 228.78 271.773 229.181 271.501C229.582 271.23 230.074 271.126 230.551 271.214" fill="white"/>
<path d="M245.462 278.78C245.656 278.78 245.897 277.115 247.414 275.829C248.931 274.544 250.605 274.479 250.596 274.294C250.587 274.109 250.171 274.081 249.467 274.174C248.542 274.305 247.676 274.707 246.979 275.33C246.272 275.941 245.758 276.745 245.499 277.642C245.314 278.327 245.388 278.771 245.462 278.78Z" fill="#263238"/>
<path d="M250.337 282.638C250.531 282.684 250.92 281.361 252.085 280.233C253.251 279.104 254.546 278.697 254.5 278.512C254.453 278.327 252.918 278.457 251.614 279.761C250.309 281.065 250.161 282.638 250.337 282.638Z" fill="#263238"/>
<path d="M239.718 275.108C239.894 275.219 240.994 273.406 243.094 272C245.194 270.594 247.266 270.15 247.22 269.983C247.173 269.817 244.963 269.909 242.724 271.454C240.486 272.999 239.579 275.052 239.718 275.108Z" fill="#263238"/>
<path d="M237.969 46.5087C237.424 43.8817 237.969 41.1714 238.432 38.5166C238.894 35.8618 239.126 33.0312 238.006 30.5892C236.6 27.5182 233.381 25.7514 231.328 23.0411C229.274 20.3308 228.627 16.862 227.813 13.5689C226.999 10.2759 225.879 6.82554 223.262 4.624C219.95 1.89521 212.532 2.48722 209.46 5.49352C211.958 24.5674 210.533 44.5107 217.564 62.419C226.951 61.3184 235.85 57.6432 243.279 51.7998C240.569 51.6888 238.515 49.145 237.969 46.5087Z" fill="#263238"/>
<path d="M201.653 63.8251L189.406 19.304C189.198 18.2951 189.375 17.2449 189.903 16.3599C190.43 15.475 191.269 14.8192 192.255 14.5217L212.689 5.04029C219.423 3.0145 225.593 10.5904 227.332 17.4263C229.256 25.0021 231.319 34.317 231.494 40.2094C231.837 52.0496 223.308 55.1762 223.308 55.1762L224.945 67.6824L221.365 80.2163L210.413 86.2289L201.653 63.8251Z" fill="#FFBE9D"/>
<path d="M224.464 26.6949C224.539 27.0782 224.462 27.4755 224.25 27.8034C224.038 28.1312 223.707 28.3639 223.327 28.4525C223.141 28.5024 222.948 28.5149 222.758 28.4892C222.568 28.4635 222.384 28.4001 222.219 28.3028C222.054 28.2055 221.909 28.0761 221.795 27.9223C221.68 27.7686 221.597 27.5934 221.551 27.4072C221.473 27.0237 221.549 26.6252 221.762 26.2968C221.974 25.9684 222.307 25.7361 222.688 25.6497C222.874 25.5997 223.067 25.5872 223.257 25.6129C223.447 25.6386 223.63 25.702 223.796 25.7993C223.961 25.8966 224.106 26.026 224.22 26.1798C224.335 26.3336 224.418 26.5087 224.464 26.6949Z" fill="#263238"/>
<path d="M225.926 22.1438C225.778 22.3658 224.511 21.7553 222.92 22.0513C221.329 22.3473 220.32 23.3741 220.145 23.2076C219.969 23.0411 220.144 22.7543 220.598 22.2825C221.193 21.6755 221.962 21.2682 222.799 21.117C223.626 20.9609 224.481 21.071 225.241 21.4315C225.769 21.7183 226 22.0328 225.926 22.1438Z" fill="#263238"/>
<path d="M209.978 29.5995C210.056 29.983 209.98 30.3815 209.767 30.7099C209.555 31.0383 209.222 31.2705 208.841 31.357C208.655 31.4069 208.462 31.4194 208.272 31.3937C208.082 31.368 207.898 31.3047 207.733 31.2073C207.568 31.11 207.423 30.9807 207.309 30.8269C207.194 30.6731 207.111 30.498 207.065 30.3117C206.99 29.9285 207.066 29.5311 207.279 29.2033C207.491 28.8755 207.822 28.6428 208.202 28.5542C208.388 28.5042 208.581 28.4918 208.771 28.5175C208.961 28.5432 209.144 28.6065 209.31 28.7039C209.475 28.8012 209.62 28.9305 209.734 29.0843C209.849 29.2381 209.932 29.4132 209.978 29.5995Z" fill="#263238"/>
<path d="M211.459 25.9642C211.311 26.1862 210.034 25.5757 208.452 25.8717C206.87 26.1677 205.853 27.1945 205.677 27.028C205.501 26.8615 205.677 26.584 206.13 26.103C206.723 25.5145 207.482 25.1208 208.304 24.9744C209.131 24.8184 209.986 24.9285 210.746 25.289C211.301 25.5387 211.533 25.8995 211.459 25.9642Z" fill="#263238"/>
<path d="M218.683 36.6388C219.474 36.2289 220.313 35.9182 221.18 35.7138C221.569 35.5936 221.939 35.4455 221.957 35.1495C221.91 34.7258 221.736 34.3262 221.458 34.0025L219.682 31.1442C217.184 27.0649 215.297 23.6793 215.464 23.5868C215.63 23.4943 217.786 26.7134 220.274 30.7835L222.004 33.6418C222.35 34.0841 222.53 34.6342 222.512 35.1958C222.48 35.3501 222.414 35.4952 222.318 35.6201C222.222 35.7451 222.098 35.8467 221.957 35.9173C221.747 36.0216 221.523 36.0963 221.291 36.1393C220.445 36.4101 219.569 36.5779 218.683 36.6388Z" fill="#263238"/>
<path d="M223.336 55.2039C217.951 56.3015 212.368 55.8885 207.204 54.0106C207.204 54.0106 212.624 61.4755 223.919 58.2194L223.336 55.2039Z" fill="#EB996E"/>
<path d="M210.173 19.2948C210.099 19.7573 208.471 19.8498 206.658 20.4325C204.845 21.0153 203.429 21.7923 203.106 21.4593C202.958 21.2928 203.105 20.8396 203.67 20.303C204.38 19.6319 205.239 19.1375 206.177 18.86C207.106 18.5641 208.092 18.4944 209.053 18.6565C209.793 18.8045 210.2 19.082 210.173 19.2948Z" fill="#E0E0E0"/>
<path d="M224.649 17.3615C224.446 17.7777 223.28 17.6112 221.958 17.8332C220.635 18.0552 219.58 18.5363 219.247 18.2125C219.109 18.046 219.247 17.6575 219.636 17.2227C220.21 16.688 220.93 16.3371 221.705 16.2151C222.48 16.0931 223.273 16.2056 223.983 16.5382C224.52 16.8157 224.779 17.158 224.649 17.3615Z" fill="#263238"/>
<path d="M215.214 4.36503C212.439 -0.361799 208.064 -0.121294 203.383 0.0914592C198.703 0.304213 192.2 3.41227 188.823 6.66832C186.187 9.20287 183.273 12.3387 181.608 15.5947C179.943 18.8508 179.61 22.0698 178.833 25.4924C177.677 30.8205 178.685 36.3521 179.268 41.7819C180.009 48.6071 180.071 55.4891 179.453 62.3265C179.231 64.7686 179.064 67.6824 182.413 68.5334C183.033 68.6842 183.672 68.7434 184.309 68.7091C189.286 68.5611 194.253 69.4862 199.72 68.9866L203.059 68.4501C207.287 67.7656 208.989 64.5373 208.258 60.8835C206.056 49.8666 198.083 32.4763 196.936 29.0722C196.936 29.0722 191.256 4.82754 215.214 4.36503Z" fill="#263238"/>
<path d="M213.679 4.71652C213.065 5.4171 212.6 6.23507 212.312 7.12077C212.024 8.00647 211.92 8.94142 212.004 9.86886C212.05 11.7189 212.457 13.5689 212.402 15.419C212.334 17.2838 211.817 19.1048 210.896 20.7278C209.975 22.3508 208.677 23.7281 207.111 24.7431C206.112 25.3721 204.669 25.7976 203.855 24.9466C204.1 26.2179 203.955 27.5338 203.438 28.721C202.922 29.9081 202.057 30.911 200.96 31.5975C199.359 32.5225 197.417 32.763 195.687 33.4475C193.957 34.132 192.255 35.6768 192.459 37.5361L189.684 24.8356L191.478 12.9492L201.515 4.62402L213.679 4.71652Z" fill="#263238"/>
<path d="M197.445 28.9982C197.776 28.6774 198.085 28.3344 198.37 27.9714C199.056 26.9157 199.478 25.7099 199.6 24.4564C199.762 22.6082 199.731 20.7481 199.507 18.9063C199.23 16.6234 199.131 14.3224 199.211 12.0242C199.298 9.7025 200.007 7.44681 201.265 5.49355C202.319 3.89082 203.954 2.75991 205.825 2.33924C207.075 2.03433 208.389 2.13144 209.581 2.61675C209.765 2.69199 209.942 2.78493 210.108 2.89425C210.241 2.95937 210.365 3.04011 210.478 3.13476L210.756 3.35676C210.37 3.10498 209.965 2.88531 209.544 2.7C208.362 2.24741 207.068 2.17624 205.844 2.4965C204.036 2.91647 202.456 4.00763 201.422 5.54905C200.193 7.49182 199.504 9.72671 199.424 12.0242C199.348 14.3096 199.441 16.5975 199.702 18.8693C199.919 20.7369 199.935 22.6225 199.748 24.4934C199.612 25.7654 199.161 26.9833 198.434 28.0362C198.158 28.4076 197.824 28.7324 197.445 28.9982Z" fill="#455A64"/>
<path d="M187.565 28.989C188.134 28.8245 188.681 28.5916 189.193 28.2952C190.524 27.3623 191.573 26.0826 192.228 24.5951C192.719 23.5964 193.112 22.5524 193.402 21.4778C193.692 20.2327 193.801 18.9523 193.726 17.676C193.671 16.3255 193.504 14.901 193.421 13.4302C193.379 12.6753 193.379 11.9188 193.421 11.1639C193.474 10.3859 193.601 9.61467 193.8 8.86061C194.615 5.96444 196.487 3.47914 199.045 1.89524C201.138 0.638263 203.579 0.0839892 206.01 0.313467C207.632 0.45225 209.208 0.92798 210.635 1.71024C211.16 1.99434 211.656 2.32893 212.115 2.70926C212.115 2.70926 212.115 2.70926 212.014 2.65376L211.727 2.46875C211.578 2.35857 211.424 2.25666 211.264 2.1635C211.07 2.0525 210.857 1.91374 210.598 1.79349C209.162 1.04316 207.589 0.593092 205.973 0.47072C203.577 0.265331 201.178 0.832625 199.128 2.0895C196.622 3.65014 194.791 6.09192 193.994 8.93462C193.795 9.67612 193.668 10.4351 193.615 11.2009C193.569 11.9464 193.569 12.694 193.615 13.4394C193.689 14.9102 193.856 16.3255 193.902 17.6853C193.977 18.9814 193.858 20.2814 193.55 21.5426C193.253 22.6276 192.85 23.6809 192.348 24.6876C191.666 26.1883 190.581 27.4696 189.212 28.3877C188.828 28.6113 188.418 28.7853 187.991 28.9057L187.649 28.989H187.565Z" fill="#455A64"/>
<path d="M203.883 24.9743C203.886 25.0081 203.886 25.0423 203.883 25.0761C203.889 25.1839 203.889 25.292 203.883 25.3998C203.893 25.5785 203.893 25.7577 203.883 25.9363C203.883 26.1398 203.883 26.3896 203.883 26.6579C203.825 27.3258 203.676 27.9825 203.439 28.6096C203.121 29.447 202.633 30.2092 202.005 30.8482C200.244 32.451 197.99 33.4068 195.613 33.5585C194.211 33.7116 192.797 33.7116 191.395 33.5585C189.863 33.4247 188.357 33.0823 186.918 32.541L186.631 32.43L186.927 32.3375C188.579 31.8316 190.14 31.0667 191.552 30.0712L191.635 30.0157L191.728 30.2099C188.383 31.3143 184.761 31.2458 181.46 30.0157L181.238 29.9324L181.442 29.8307C183.462 28.8469 185.293 27.5162 186.853 25.8993C188.077 24.6128 188.919 23.0116 189.286 21.2743C189.492 20.1427 189.492 18.9833 189.286 17.8517L189.073 16.9267C189.073 16.8342 189.073 16.7602 189.073 16.6954C189.075 16.6677 189.075 16.6399 189.073 16.6122C189.073 16.6122 189.073 16.6122 189.073 16.6954C189.073 16.7787 189.073 16.8249 189.138 16.9174L189.378 17.8425C189.622 18.9833 189.653 20.1591 189.471 21.3113C189.108 23.0718 188.266 24.6979 187.038 26.0103C185.464 27.6614 183.61 29.0206 181.562 30.0249V29.8307C184.835 31.0442 188.424 31.1061 191.737 30.0064L192.459 29.7659L191.839 30.2099L191.756 30.2562C190.347 31.2639 188.785 32.0385 187.131 32.5502V32.3745C188.55 32.9087 190.033 33.2509 191.543 33.392C192.933 33.5355 194.334 33.5355 195.724 33.392C198.061 33.2526 200.283 32.3304 202.033 30.7742C202.655 30.1487 203.143 29.4027 203.466 28.5819C203.704 27.966 203.862 27.3227 203.938 26.6671C203.938 26.3989 203.938 26.1583 203.984 25.9456C204.031 25.7328 203.984 25.5663 203.984 25.4276V25.1038C203.873 24.9743 203.873 24.9743 203.883 24.9743Z" fill="#455A64"/>
<path d="M185.78 63.8251C185.715 63.8251 185.373 57.1557 185.003 48.923C184.633 40.6904 184.393 34.021 184.448 34.0118C184.504 34.0025 184.855 40.6812 185.225 48.9138C185.595 57.1464 185.836 63.8251 185.78 63.8251Z" fill="#455A64"/>
<path d="M192.57 64.3616L192.486 64.0933C192.437 63.8898 192.372 63.6308 192.292 63.3163C192.126 62.6318 191.904 61.642 191.635 60.421C191.108 57.9697 190.451 54.5749 189.85 50.8008C189.249 47.0268 188.851 43.5857 188.601 41.0882C188.481 39.8486 188.389 38.8311 188.342 38.1374C188.342 37.8044 188.324 37.5361 188.287 37.3326C188.275 37.2374 188.275 37.1411 188.287 37.0458C188.299 37.1379 188.299 37.2312 188.287 37.3233C188.287 37.5361 188.342 37.7951 188.379 38.1281C188.463 38.8496 188.574 39.8486 188.712 41.0697C188.999 43.558 189.434 46.9898 190.026 50.7638C190.618 54.5379 191.256 57.9327 191.746 60.384C191.987 61.5958 192.19 62.5763 192.329 63.2978C192.394 63.6215 192.449 63.8806 192.486 64.0841C192.529 64.1716 192.557 64.2653 192.57 64.3616Z" fill="#455A64"/>
<path d="M220.477 39.2196C220.218 39.0206 219.923 38.873 219.608 38.7849H219.654C219.249 38.5719 218.788 38.4878 218.333 38.544C217.878 38.6002 217.452 38.794 217.11 39.0994C216.728 39.5025 216.48 40.015 216.402 40.5654C216.324 41.1159 216.42 41.6769 216.676 42.1704C216.985 42.6245 217.46 42.9398 217.998 43.0492C218.532 43.1648 219.084 43.1648 219.617 43.0492C220.132 42.9884 220.613 42.761 220.986 42.4017C221.248 42.0725 221.395 41.6661 221.403 41.2454C221.41 40.86 221.331 40.4779 221.171 40.1272C221.011 39.7766 220.774 39.4664 220.477 39.2196Z" fill="#EB996E"/>
<path d="M221.615 41.6246C221.615 41.6246 221.615 41.5044 221.615 41.3286C221.595 41.2134 221.549 41.1041 221.482 41.0082C221.415 40.9124 221.328 40.8323 221.227 40.7736C220.878 40.6778 220.513 40.6526 220.154 40.6996C219.671 40.6897 219.19 40.7584 218.729 40.9031C217.869 41.1413 217.038 41.4732 216.25 41.8929C215.603 42.1796 215.168 42.2721 215.149 42.2166C215.131 42.1611 215.501 41.9484 216.074 41.5876C216.842 41.066 217.693 40.6782 218.59 40.4406C218.852 40.3679 219.118 40.3092 219.386 40.2649C219.638 40.2465 219.892 40.2465 220.144 40.2649C220.59 40.2556 221.031 40.3641 221.421 40.5794C221.552 40.6742 221.657 40.8018 221.723 40.9495C221.79 41.0973 221.816 41.2599 221.8 41.4211C221.754 41.6246 221.634 41.6801 221.615 41.6246Z" fill="#263238"/>
<path d="M239.986 120.464C239.986 120.464 251.318 118.799 254.111 119.89C256.905 120.982 271.02 127.799 272.611 130.75C274.202 133.701 277.884 138.973 278.346 141.61C278.809 144.246 279.272 152.164 279.272 152.164C278.335 152.132 277.445 151.745 276.782 151.083C276.12 150.42 275.733 149.53 275.701 148.594L274.619 152.164C274.619 152.164 271.668 152.941 271.205 150.925C271.205 150.925 269.494 153.098 268.717 148.15C268.324 146.009 268.065 143.847 267.94 141.674L265.618 138.261L266.858 142.821L266.238 149.741C266.238 149.741 263.759 149.741 263.602 147.576C263.421 145.955 263.055 144.359 262.51 142.821L259.411 137.956C259.411 137.956 251.558 133.867 249.81 131.897C249.011 131.129 248.348 130.231 247.849 129.242L240.116 131.823L239.986 120.464Z" fill="#FFBE9D"/>
<path d="M273.361 152.331C272.856 152.351 272.354 152.236 271.908 151.998C271.722 151.885 271.559 151.736 271.431 151.559C271.302 151.383 271.21 151.183 271.159 150.971C271.041 151.124 270.885 151.243 270.706 151.318C270.528 151.392 270.334 151.419 270.142 151.396C269.476 151.221 268.976 150.12 268.671 148.131C268.284 145.99 268.024 143.828 267.894 141.656L265.646 138.363L266.858 142.794L266.238 149.741C266.238 149.741 263.731 149.741 263.574 147.548C263.397 145.93 263.034 144.338 262.492 142.803L259.393 137.947C259.143 137.817 251.512 133.812 249.791 131.888C249.002 131.118 248.342 130.224 247.839 129.242L240.088 131.823L239.986 120.51C240.106 120.51 251.364 118.864 254.12 119.937C255.536 120.482 259.809 122.48 263.824 124.663C267.367 126.587 271.76 129.214 272.602 130.805C273.092 131.73 273.795 132.887 274.535 134.117C276.173 136.809 278.023 139.861 278.346 141.674C278.809 144.283 279.271 152.146 279.271 152.229C278.705 152.205 278.152 152.053 277.653 151.785C277.105 151.475 276.641 151.037 276.299 150.509C275.958 149.981 275.749 149.377 275.692 148.751L274.637 152.229C274.218 152.318 273.789 152.352 273.361 152.331ZM271.187 150.869V150.915C271.23 151.129 271.317 151.332 271.442 151.511C271.568 151.689 271.73 151.839 271.918 151.951C272.753 152.31 273.684 152.378 274.563 152.146L275.673 148.446V148.557C275.722 149.193 275.924 149.808 276.262 150.35C276.6 150.891 277.065 151.342 277.616 151.665C278.102 151.922 278.639 152.071 279.188 152.099C279.188 151.609 278.707 144.116 278.263 141.582C277.939 139.778 276.089 136.726 274.461 134.043C273.712 132.813 273.009 131.647 272.519 130.722C272.029 129.797 270.169 128.086 263.768 124.608C259.754 122.425 255.443 120.427 254.074 119.872C251.373 118.817 240.523 120.371 239.977 120.445L240.079 131.684L247.812 129.113C248.307 130.102 248.967 131 249.763 131.767C251.493 133.701 259.282 137.771 259.356 137.808L262.455 142.683C263.006 144.219 263.373 145.815 263.546 147.437C263.694 149.463 265.905 149.583 266.146 149.593L266.756 142.692L265.48 138.011L267.894 141.545C268.02 143.717 268.28 145.88 268.671 148.02C269.05 150.481 269.661 151.128 270.105 151.248H270.28C270.608 151.21 270.907 151.044 271.113 150.786L271.187 150.869Z" fill="#EB996E"/>
<path d="M247.747 119.53H244.519V130.583H247.747V119.53Z" fill="#263238"/>
<path d="M249.93 117.346H242.326V119.52H249.93V117.346Z" fill="#455A64"/>
<path d="M212.319 56.1751C212.319 56.1751 208.619 57.9604 208.619 60.8742C208.619 63.788 208.008 87.5147 208.008 87.5147L221.375 79.9943L219.192 64.269L233.659 55.4074C233.659 55.4074 236.434 50.477 236.157 48.9323C235.879 47.3875 233.03 44.3719 231.633 44.5292C231.186 44.5914 230.757 44.7461 230.373 44.9834C229.989 45.2207 229.659 45.5354 229.404 45.9074L225.047 46.8325C225.047 46.8325 225.362 49.6075 227.221 49.478L228.47 49.3208L228.312 50.4123L226.139 51.9663L212.319 56.1751Z" fill="#FFBE9D"/>
<path d="M212.319 56.1751L212.55 56.0826L213.244 55.8514L215.945 54.9819L226.12 51.8276H226.074L228.247 50.2643L228.173 50.3753L228.331 49.293L228.516 49.478L227.313 49.6353C226.85 49.6858 226.385 49.553 226.018 49.2653C225.372 48.6127 224.973 47.756 224.89 46.8417V46.6845L225.065 46.6382L229.413 45.7132L229.283 45.8057C229.658 45.2489 230.18 44.8069 230.791 44.5292C231.107 44.3831 231.451 44.3073 231.799 44.3072C232.156 44.3343 232.502 44.4452 232.808 44.6309C233.977 45.3469 234.972 46.3137 235.722 47.4615C235.92 47.7517 236.087 48.0617 236.221 48.3865C236.384 48.7356 236.439 49.1254 236.378 49.5058C236.255 50.2177 236.05 50.913 235.768 51.5778C235.195 52.9224 234.543 54.232 233.816 55.4999V55.5461H233.77L219.312 64.417L219.423 64.1765C219.497 64.676 219.571 65.2126 219.645 65.7491C220.32 70.6331 220.968 75.3785 221.597 79.9111V80.0776L221.458 80.1516L208.082 87.6534L207.758 87.8292V87.4592C208.017 77.6448 208.239 69.4214 208.397 63.6215C208.397 62.9 208.397 62.2155 208.461 61.5772C208.437 60.9544 208.502 60.3313 208.656 59.7272C208.996 58.8145 209.57 58.0074 210.321 57.3869C210.91 56.8498 211.585 56.4152 212.319 56.1011L212.189 56.1844L211.801 56.4249C211.304 56.7369 210.837 57.0929 210.404 57.4887C209.695 58.1067 209.156 58.8966 208.841 59.7827C208.704 60.3612 208.652 60.9561 208.683 61.5495C208.683 62.1877 208.683 62.8723 208.683 63.5938C208.572 69.3936 208.415 77.6263 208.221 87.4407L207.906 87.2557L221.254 79.7168L221.143 79.9481C220.514 75.4247 219.848 70.6979 219.173 65.7861C219.099 65.2496 219.025 64.713 218.96 64.2135V64.0563L219.099 63.9823C224.159 60.8835 229.043 57.8864 233.566 55.1299L233.483 55.2039C234.175 53.9588 234.793 52.6738 235.333 51.3558C235.603 50.7271 235.799 50.069 235.916 49.3948C235.944 48.7559 235.741 48.1282 235.342 47.628C234.629 46.5331 233.681 45.6105 232.567 44.9269C232.321 44.7718 232.043 44.6767 231.753 44.6494C231.463 44.6494 231.175 44.7126 230.911 44.8344C230.378 45.0775 229.921 45.4612 229.589 45.9445V46.0185H229.505L225.149 46.9435L225.297 46.74C225.329 47.5879 225.66 48.3972 226.231 49.0248C226.524 49.2559 226.895 49.3652 227.267 49.33L228.469 49.182H228.691V49.404L228.479 50.44V50.514H228.414C227.655 51.0598 226.915 51.5871 226.231 52.0588L216.056 55.0744L213.327 55.8606L212.615 56.0549C212.52 56.1049 212.421 56.1452 212.319 56.1751Z" fill="#EB996E"/>
<path d="M230.273 53.3909C230.227 53.3354 230.671 52.9284 231.319 52.2346C231.693 51.8435 232.005 51.3974 232.244 50.9118C232.508 50.3334 232.607 49.6931 232.53 49.0618C232.476 48.3969 232.352 47.7396 232.16 47.1008C232.079 46.8681 231.923 46.6683 231.718 46.5315C231.513 46.3947 231.269 46.3283 231.023 46.3422C230.637 46.3491 230.252 46.3087 229.876 46.222C229.598 46.1295 229.487 46 229.506 45.9815C229.524 45.963 229.663 45.9815 229.913 46.037C230.285 46.0661 230.659 46.0661 231.032 46.037C231.325 46.0197 231.618 46.077 231.883 46.2035C232.195 46.3651 232.439 46.6346 232.567 46.962C232.8 47.6383 232.949 48.3403 233.011 49.0525C233.104 49.7858 232.975 50.53 232.641 51.1893C232.366 51.7074 232 52.1712 231.559 52.5584C231.19 52.9184 230.753 53.2014 230.273 53.3909Z" fill="#EB996E"/>
<path d="M230.551 160.776C224.936 153.376 213.031 152.728 206.917 159.768C204.815 162.168 203.68 165.264 203.735 168.454C203.735 183.078 211.625 222.558 213.355 234.13C215.205 246.525 220.348 267.745 220.348 267.745L245.592 264.156C245.592 264.156 236.12 189.923 234.954 181.228C233.789 172.533 231.976 165.059 231.976 165.059L230.551 160.776Z" fill="#263238"/>
<path d="M188.703 147.419C189.471 146.901 224.779 133.765 230.949 132.489C237.118 131.212 242.853 130.491 249.754 136.901C258.209 144.736 273.61 238.459 273.61 238.459C273.61 238.459 247.562 242.871 247.571 242.362C247.58 241.854 229.755 165.586 229.755 165.586L198.471 185.594L181.025 159.694L188.703 147.419Z" fill="#263238"/>
<path d="M237.313 195.538C237.313 195.538 237.313 195.464 237.257 195.307C237.202 195.15 237.183 194.891 237.128 194.604C237.026 193.956 236.878 193.05 236.693 191.903C236.332 189.516 235.824 186.131 235.204 181.959C234.584 177.787 233.742 172.773 232.382 167.344C231.728 164.499 230.626 161.776 229.117 159.277C227.468 156.621 225.029 154.548 222.143 153.348C219.208 152.266 215.984 152.266 213.05 153.348C210.302 154.303 207.883 156.019 206.075 158.297C204.577 160.481 203.739 163.05 203.661 165.697C203.545 168.002 203.545 170.311 203.661 172.616C203.92 176.844 204.521 180.238 204.687 182.606C204.798 183.79 204.836 184.715 204.863 185.381V186.094C204.877 186.173 204.877 186.255 204.863 186.334C204.858 186.254 204.858 186.174 204.863 186.094C204.863 185.909 204.863 185.668 204.808 185.381C204.752 184.762 204.688 183.846 204.549 182.662C204.327 180.303 203.624 176.927 203.365 172.672C203.221 170.353 203.199 168.028 203.3 165.706C203.366 162.993 204.221 160.357 205.761 158.121C207.606 155.756 210.095 153.973 212.929 152.987C215.969 151.854 219.316 151.854 222.355 152.987C225.338 154.221 227.856 156.364 229.552 159.111C231.083 161.652 232.195 164.422 232.845 167.316C234 172.16 234.911 177.06 235.574 181.996C236.138 186.177 236.591 189.572 236.915 191.968C237.063 193.115 237.174 194.021 237.257 194.678C237.257 194.965 237.322 195.196 237.341 195.381C237.337 195.434 237.328 195.487 237.313 195.538Z" fill="#455A64"/>
<path d="M215.529 137.549C215.401 137.637 215.26 137.705 215.112 137.752L213.901 138.261C212.837 138.687 211.301 139.288 209.386 140.009C205.566 141.471 200.266 143.404 194.41 145.559C188.555 147.715 183.31 149.694 179.481 151.211L174.994 153.061L173.773 153.542C173.637 153.613 173.49 153.66 173.339 153.681C173.461 153.59 173.595 153.515 173.736 153.459L174.92 152.886C175.956 152.405 177.473 151.729 179.351 150.934C183.116 149.334 188.389 147.289 194.244 145.143C200.099 142.997 205.418 141.11 209.266 139.741L213.836 138.132L215.085 137.706C215.225 137.634 215.374 137.581 215.529 137.549Z" fill="#455A64"/>
</svg>
