{
  "users": [
    {
      "id": 1,
      "gender": "Female",
      "firstName": "ABC",
      "lastName": "Shah",
      "profile": "https://th.bing.com/th/id/OIP.1biX6X7g6bRO9HJTtBIm0AAAAA?pid=ImgDet&rs=1",
      "designation": "Software Developer",
      "location": "Pune, India",
      "email": "hetvi@example.com",
      "phone": "0438-418-744",
      "status": "Employee",
      "experience": "4 Years",
      "duration": "1 Year",
      "company": "Gateway Group",
      "skills": [
        {
          "id": "Azure",
          "text": "Azure"
        },
        {
          "id": "React",
          "text": "React"
        },
        {
          "id": "Node.js",
          "text": "Node.js"
        },
        {
          "id": "Javascript",
          "text": "Javascript"
        },
        {
          "id": "aa",
          "text": "aa"
        },
        {
          "id": "aas",
          "text": "aas"
        }
      ],
      "company_logo": "https://th.bing.com/th/id/OIP.JxRw5QsXDLE4EWaMHploYQHaHa?pid=ImgDet&rs=1"
    },
    {
      "id": 2,
      "gender": "Male",
      "firstName": "Joseph",
      "lastName": "Nolan",
      "profile": "https://th.bing.com/th/id/OIP.Wy9X0ATUa0yTk7xT_N3JjQAAAA?pid=ImgDet&rs=1",
      "designation": "Software Developer",
      "location": "Portland, USA",
      "email": "joseph@example.com",
      "phone": "0438-418-744",
      "status": "Employee",
      "experience": "4 Years",
      "duration": "1 Year",
      "company": "Gateway Group",
      "skills": [
        {
          "id": "Angular",
          "text": "Angular"
        },
        {
          "id": "React",
          "text": "React"
        },
        {
          "id": "NodeJS",
          "text": "NodeJS"
        },
        {
          "id": "Azure",
          "text": "Azure"
        }
      ],
      "company_logo": "https://th.bing.com/th/id/OIP.JxRw5QsXDLE4EWaMHploYQHaHa?pid=ImgDet&rs=1"
    },
    {
      "id": 3,
      "gender": "Female",
      "firstName": "Alice",
      "lastName": "Nolan",
      "profile": "https://th.bing.com/th/id/OIP.1biX6X7g6bRO9HJTtBIm0AAAAA?pid=ImgDet&rs=1",
      "designation": "Software Developer",
      "location": "Ontario, Canada",
      "email": "hetvi@example.com",
      "phone": "0438-418-744",
      "status": "Employee",
      "experience": "4 Years",
      "duration": "1 Year",
      "company": "MIchelin",
      "skills": [
        {
          "id": "React",
          "text": "React"
        },
        {
          "id": "NodeJS",
          "text": "NodeJS"
        },
        {
          "id": "CSS",
          "text": "CSS"
        },
        {
          "id": "Azure",
          "text": "Azure"
        },
        {
          "id": "Angular",
          "text": "Angular"
        }
      ],
      "company_logo": "https://th.bing.com/th/id/OIP.JxRw5QsXDLE4EWaMHploYQHaHa?pid=ImgDet&rs=1"
    },
    {
      "id": 4,
      "gender": "Male",
      "firstName": "John",
      "lastName": "Doe",
      "profile": "https://th.bing.com/th/id/OIP.Wy9X0ATUa0yTk7xT_N3JjQAAAA?pid=ImgDet&rs=1",
      "designation": "Software Developer",
      "location": "Portland, USA",
      "email": "joseph@example.com",
      "phone": "0438-418-744",
      "status": "Employee",
      "experience": "4 Years",
      "duration": "1 Year",
      "company": "Michelin",
      "skills": [
        {
          "id": "Angular",
          "text": "Angular"
        },
        {
          "id": ".Net",
          "text": ".Net"
        }
      ],
      "company_logo": "https://th.bing.com/th/id/OIP.JxRw5QsXDLE4EWaMHploYQHaHa?pid=ImgDet&rs=1"
    },
    {
      "id": 5,
      "gender": "Female",
      "firstName": "Jane",
      "lastName": "Doe",
      "profile": "https://th.bing.com/th/id/OIP.1biX6X7g6bRO9HJTtBIm0AAAAA?pid=ImgDet&rs=1",
      "designation": "Software Developer",
      "location": "Portland, USA",
      "email": "joseph@example.com",
      "phone": "0438-418-744",
      "status": "Employee",
      "experience": "4 Years",
      "duration": "1 Year",
      "company": "Gateway Group",
      "skills": [
        {
          "id": "HTML",
          "text": "HTML"
        },
        {
          "id": "JavaScript",
          "text": "JavaScript"
        },
        {
          "id": "NodeJS",
          "text": "NodeJS"
        },
        {
          "id": "Azure",
          "text": "Azure"
        }
      ],
      "company_logo": "https://th.bing.com/th/id/OIP.JxRw5QsXDLE4EWaMHploYQHaHa?pid=ImgDet&rs=1"
    },
    {
      "id": 6,
      "gender": "Male",
      "firstName": "Alexander",
      "lastName": "Nolan",
      "profile": "https://th.bing.com/th/id/OIP.Wy9X0ATUa0yTk7xT_N3JjQAAAA?pid=ImgDet&rs=1",
      "designation": "Software Developer",
      "location": "Portland, USA",
      "email": "joseph@example.com",
      "phone": "0438-418-744",
      "status": "Employee",
      "experience": "4 Years",
      "duration": "1 Year",
      "company": "Michelin",
      "skills": [
        {
          "id": "HTML",
          "text": "HTML"
        },
        {
          "id": "JavaScript",
          "text": "JavaScript"
        }
      ],
      "company_logo": "https://th.bing.com/th/id/OIP.JxRw5QsXDLE4EWaMHploYQHaHa?pid=ImgDet&rs=1"
    }
  ],
  "company": [
    {
      "id": 1,
      "companyName": "Gateway Group of companies",
      "foundation": "23rd feb, 1997",
      "companyEmail": "gatewayCorp@email.com",
      "regName": "Gateway Technolabs",
      "managerName": "Kat Christian",
      "strength": "900",
      "location": "Ahmedabad, India",
      "contact": 9000298367,
      "skills": [
        {
          "id": "JavaScript",
          "text": "JavaScript"
        },
        {
          "id": "Azure",
          "text": "Azure"
        },
        {
          "id": ".Net",
          "text": ".Net"
        },
        {
          "id": "AngularJs",
          "text": "AngularJs"
        },
        {
          "id": "React",
          "text": "React"
        },
        {
          "id": "Node",
          "text": "Node"
        },
        {
          "id": "HTML",
          "text": "HTML"
        }
      ]
    }
  ]
}