[
  {
    "job_status": "success",
    "job_name": "PIPELINE_RUN_STATUS - PIPELINE_RUN_STATUS"
  },
  {
    "job_status": "success",
    "job_name": "MUT_TRIGGER - MUT"
  },
  {
    "job_status": "success",
    "job_name": "UDB_TRIGGER - UDB"
  },
  {
    "job_status": "success",
    "job_name": "DR_TRIGGER - DR"
  },
  {
    "job_status": "success",
    "job_name": "AQ_TRIGGER - AQ"
  },
  {
    "job_status": "success",
    "job_name": "MSS_TRIGGER - MSS"
  },
  {
    "job_status": "success",
    "job_name": "FPL_TRIGGER - FPL"
  },
  {
    "job_status": "success",
    "job_name": "PRCF_TRIGGER - PRCF"
  },
  {
    "job_status": "success",
    "job_name": "RMQC_TRIGGER - RMQC"
  },
  {
    "job_status": "success",
    "job_name": "DA_TRIGGER - DA"
  },
  {
    "job_status": "success",
    "job_name": "DAS_TRIGGER - DAS"
  },
  {
    "job_status": "success",
    "job_name": "DRPS_TRIGGER - DRPS"
  },
  {
    "job_status": "success",
    "job_name": "EDC_TRIGGER - EDC"
  },
  {
    "job_status": "success",
    "job_name": "SM_TRIGGER - SM"
  },
  {
    "job_status": "success",
    "job_name": "DMD_TRIGGER - DMD"
  },
  {
    "job_status": "success",
    "job_name": "AIML_TRIGGER - AIML"
  },
  {
    "job_status": "success",
    "job_name": "AM_TRIGGER - AM"
  },
  {
    "job_status": "success",
    "job_name": "DHD_TRIGGER - DHD"
  },
  {
    "job_status": "success",
    "job_name": "DPS_TRIGGER - DPS"
  },
  {
    "job_status": "success",
    "job_name": "SRVC_TRIGGER - SRVC"
  },
  {
    "job_status": "success",
    "job_name": "SO_TRIGGER - SO"
  },
  {
    "job_status": "success",
    "job_name": "EU_TRIGGER - EU"
  },
  {
    "job_status": "success",
    "job_name": "PRE_ORACLE_TRIGGER - PRE_ORACLE_TRIGGER"
  },
  {
    "job_status": "success",
    "job_name": "PRE_SQL_TRIGGER - PRE_SQL_TRIGGER"
  }
]
