EESchema Schematic File Version 2
LIBS:power
LIBS:device
LIBS:switches
LIBS:relays
LIBS:motors
LIBS:transistors
LIBS:conn
LIBS:linear
LIBS:regul
LIBS:74xx
LIBS:cmos4000
LIBS:adc-dac
LIBS:memory
LIBS:xilinx
LIBS:microcontrollers
LIBS:dsp
LIBS:microchip
LIBS:analog_switches
LIBS:motorola
LIBS:texas
LIBS:intel
LIBS:audio
LIBS:interface
LIBS:digital-audio
LIBS:philips
LIBS:display
LIBS:cypress
LIBS:siliconi
LIBS:opto
LIBS:atmel
LIBS:contrib
LIBS:valves
LIBS:4xxx
LIBS:4xxx_IEEE
LIBS:74xGxx
LIBS:74xx_IEEE
LIBS:Amplifier_Audio
LIBS:Amplifier_Buffer
LIBS:Amplifier_Current
LIBS:Amplifier_Difference
LIBS:Amplifier_Instrumentation
LIBS:Amplifier_Operational
LIBS:Amplifier_Video
LIBS:Analog
LIBS:Analog_ADC
LIBS:Analog_DAC
LIBS:Analog_Switch
LIBS:Battery_Management
LIBS:Comparator
LIBS:Connector_Generic
LIBS:Connector_Generic_Shielded
LIBS:Connector_Specialized
LIBS:Converter_ACDC
LIBS:Converter_DCDC
LIBS:CPLD_Altera
LIBS:CPLD_Xilinx
LIBS:CPU
LIBS:CPU_NXP_6800
LIBS:CPU_NXP_68000
LIBS:CPU_PowerPC
LIBS:Diode
LIBS:Diode_Bridge
LIBS:Diode_Laser
LIBS:Display_Character
LIBS:Display_Graphic
LIBS:Driver_Display
LIBS:Driver_FET
LIBS:Driver_LED
LIBS:Driver_Motor
LIBS:Driver_Relay
LIBS:DSP_Freescale
LIBS:DSP_Microchip_DSPIC33
LIBS:DSP_Motorola
LIBS:DSP_Texas
LIBS:Filter
LIBS:FPGA_Actel
LIBS:FPGA_Xilinx
LIBS:FPGA_Xilinx_Artix7
LIBS:FPGA_Xilinx_Kintex7
LIBS:FPGA_Xilinx_Spartan6
LIBS:FPGA_Xilinx_Virtex5
LIBS:FPGA_Xilinx_Virtex6
LIBS:FPGA_Xilinx_Virtex7
LIBS:GPU
LIBS:Graphic
LIBS:Interface_CAN_LIN
LIBS:Interface_CurrentLoop
LIBS:Interface_Ethernet
LIBS:Interface_Expansion
LIBS:Interface_HID
LIBS:Interface_LineDriver
LIBS:Interface_Optical
LIBS:Interface_Telecom
LIBS:Interface_UART
LIBS:Interface_USB
LIBS:Isolator
LIBS:Isolator_Analog
LIBS:Jumper
LIBS:LED
LIBS:Logic_LevelTranslator
LIBS:Logic_Programmable
LIBS:MCU_AnalogDevices
LIBS:MCU_Atmel_8051
LIBS:MCU_Atmel_ATMEGA
LIBS:MCU_Atmel_ATTINY
LIBS:MCU_Atmel_AVR
LIBS:MCU_Cypress
LIBS:MCU_Espressif
LIBS:MCU_Infineon
LIBS:MCU_Intel
LIBS:MCU_Microchip_PIC10
LIBS:MCU_Microchip_PIC12
LIBS:MCU_Microchip_PIC16
LIBS:MCU_Microchip_PIC18
LIBS:MCU_Microchip_PIC24
LIBS:MCU_Microchip_PIC32
LIBS:MCU_Microchip_SAME
LIBS:MCU_Microchip_SAML
LIBS:MCU_Module
LIBS:MCU_Nordic
LIBS:MCU_NXP_ColdFire
LIBS:MCU_NXP_HC11
LIBS:MCU_NXP_HC12
LIBS:MCU_NXP_HCS12
LIBS:MCU_NXP_Kinetis
LIBS:MCU_NXP_LPC
LIBS:MCU_NXP_MAC7100
LIBS:MCU_NXP_MCore
LIBS:MCU_NXP_S08
LIBS:MCU_Parallax
LIBS:MCU_SiFive
LIBS:MCU_SiliconLabs
LIBS:MCU_ST_STM8
LIBS:MCU_ST_STM32
LIBS:MCU_Texas
LIBS:MCU_Texas_MSP430
LIBS:Mechanical
LIBS:Memory_Controller
LIBS:Memory_EEPROM
LIBS:Memory_EPROM
LIBS:Memory_Flash
LIBS:Memory_NVRAM
LIBS:Memory_RAM
LIBS:Memory_ROM
LIBS:Memory_UniqueID
LIBS:Motor
LIBS:Oscillator
LIBS:Potentiometer_Digital
LIBS:Power_Management
LIBS:Power_Protection
LIBS:Power_Supervisor
LIBS:pspice
LIBS:Reference_Current
LIBS:Reference_Voltage
LIBS:Regulator_Controller
LIBS:Regulator_Current
LIBS:Regulator_Linear
LIBS:Regulator_SwitchedCapacitor
LIBS:Regulator_Switching
LIBS:Relay
LIBS:Relay_SolidState
LIBS:RF
LIBS:RF_AM_FM
LIBS:RF_Bluetooth
LIBS:RF_GPS
LIBS:RF_Mixer
LIBS:RF_Module
LIBS:RF_RFID
LIBS:RF_Switch
LIBS:RF_WiFi
LIBS:RF_ZigBee
LIBS:Sensor
LIBS:Sensor_Audio
LIBS:Sensor_Current
LIBS:Sensor_Gas
LIBS:Sensor_Humidity
LIBS:Sensor_Magnetic
LIBS:Sensor_Motion
LIBS:Sensor_Optical
LIBS:Sensor_Pressure
LIBS:Sensor_Proximity
LIBS:Sensor_Temperature
LIBS:Sensor_Touch
LIBS:Sensor_Voltage
LIBS:Switch
LIBS:Timer
LIBS:Timer_PLL
LIBS:Timer_RTC
LIBS:Transformer
LIBS:Transistor_Array
LIBS:Transistor_BJT
LIBS:Transistor_FET
LIBS:Transistor_IGBT
LIBS:Triac_Thyristor
LIBS:Valve
LIBS:Video
LIBS:RELAY_OUT_PLC-cache
EELAYER 25 0
EELAYER END
$Descr A4 11693 8268
encoding utf-8
Sheet 1 1
Title ""
Date "14 sep 2016"
Rev ""
Comp ""
Comment1 ""
Comment2 ""
Comment3 ""
Comment4 ""
$EndDescr
$Comp
L R R2
U 1 1 5AAA244F
P 2050 2900
F 0 "R2" V 2130 2900 50  0000 C CNN
F 1 "R" V 2050 2900 50  0000 C CNN
F 2 "AutomataFootprint:R_0805_AUTOMAT" V 1980 2900 50  0001 C CNN
F 3 "" H 2050 2900 50  0001 C CNN
	1    2050 2900
	1    0    0    -1  
$EndComp
$Comp
L R R3
U 1 1 5AAA24A5
P 2050 3600
F 0 "R3" V 2130 3600 50  0000 C CNN
F 1 "R" V 2050 3600 50  0000 C CNN
F 2 "AutomataFootprint:R_0805_AUTOMAT" V 1980 3600 50  0001 C CNN
F 3 "" H 2050 3600 50  0001 C CNN
	1    2050 3600
	1    0    0    -1  
$EndComp
$Comp
L R R1
U 1 1 5AAA24CD
P 650 3200
F 0 "R1" V 730 3200 50  0000 C CNN
F 1 "R" V 650 3200 50  0000 C CNN
F 2 "AutomataFootprint:R_0805_AUTOMAT" V 580 3200 50  0001 C CNN
F 3 "" H 650 3200 50  0001 C CNN
	1    650  3200
	1    0    0    -1  
$EndComp
$Comp
L R R12
U 1 1 5AAA24FB
P 9600 5900
F 0 "R12" V 9680 5900 50  0000 C CNN
F 1 "R" V 9600 5900 50  0000 C CNN
F 2 "AutomataFootprint:R_0805_AUTOMAT" V 9530 5900 50  0001 C CNN
F 3 "" H 9600 5900 50  0001 C CNN
	1    9600 5900
	1    0    0    -1  
$EndComp
$Comp
L R R7
U 1 1 5AAA2521
P 5500 5400
F 0 "R7" V 5580 5400 50  0000 C CNN
F 1 "R" V 5500 5400 50  0000 C CNN
F 2 "AutomataFootprint:R_0805_AUTOMAT" V 5430 5400 50  0001 C CNN
F 3 "" H 5500 5400 50  0001 C CNN
	1    5500 5400
	1    0    0    -1  
$EndComp
$Comp
L R R4
U 1 1 5AAA2550
P 3950 3150
F 0 "R4" V 4030 3150 50  0000 C CNN
F 1 "R" V 3950 3150 50  0000 C CNN
F 2 "AutomataFootprint:R_0805_AUTOMAT" V 3880 3150 50  0001 C CNN
F 3 "" H 3950 3150 50  0001 C CNN
	1    3950 3150
	1    0    0    -1  
$EndComp
$Comp
L R R11
U 1 1 5AAA2582
P 9600 4850
F 0 "R11" V 9680 4850 50  0000 C CNN
F 1 "R" V 9600 4850 50  0000 C CNN
F 2 "AutomataFootprint:R_0805_AUTOMAT" V 9530 4850 50  0001 C CNN
F 3 "" H 9600 4850 50  0001 C CNN
	1    9600 4850
	1    0    0    -1  
$EndComp
$Comp
L R R8
U 1 1 5AAA25B5
P 6900 4900
F 0 "R8" V 6980 4900 50  0000 C CNN
F 1 "R" V 6900 4900 50  0000 C CNN
F 2 "AutomataFootprint:R_0805_AUTOMAT" V 6830 4900 50  0001 C CNN
F 3 "" H 6900 4900 50  0001 C CNN
	1    6900 4900
	1    0    0    -1  
$EndComp
$Comp
L R R6
U 1 1 5AAA25EB
P 5050 3750
F 0 "R6" V 5130 3750 50  0000 C CNN
F 1 "R" V 5050 3750 50  0000 C CNN
F 2 "AutomataFootprint:R_0805_AUTOMAT" V 4980 3750 50  0001 C CNN
F 3 "" H 5050 3750 50  0001 C CNN
	1    5050 3750
	1    0    0    -1  
$EndComp
$Comp
L R R10
U 1 1 5AAA262E
P 8450 5400
F 0 "R10" V 8530 5400 50  0000 C CNN
F 1 "R" V 8450 5400 50  0000 C CNN
F 2 "AutomataFootprint:R_0805_AUTOMAT" V 8380 5400 50  0001 C CNN
F 3 "" H 8450 5400 50  0001 C CNN
	1    8450 5400
	1    0    0    -1  
$EndComp
$Comp
L R R9
U 1 1 5AAA26B4
P 6900 5900
F 0 "R9" V 6980 5900 50  0000 C CNN
F 1 "R" V 6900 5900 50  0000 C CNN
F 2 "AutomataFootprint:R_0805_AUTOMAT" V 6830 5900 50  0001 C CNN
F 3 "" H 6900 5900 50  0001 C CNN
	1    6900 5900
	1    0    0    -1  
$EndComp
$Comp
L R R5
U 1 1 5AAA2704
P 5050 2800
F 0 "R5" V 5130 2800 50  0000 C CNN
F 1 "R" V 5050 2800 50  0000 C CNN
F 2 "AutomataFootprint:R_0805_AUTOMAT" V 4980 2800 50  0001 C CNN
F 3 "" H 5050 2800 50  0001 C CNN
	1    5050 2800
	1    0    0    -1  
$EndComp
$Comp
L BD140 Q1
U 1 1 5AAA2780
P 2500 3250
F 0 "Q1" H 2500 3100 40  0000 R CNN
F 1 "BD140" H 2500 3400 40  0000 R CNN
F 2 "AutomataFootprint:PINHEAD1-3_BD140_AUTOMATA_PIN1" H 2380 3350 29  0001 C CNN
F 3 "" H 2500 3250 60  0000 C CNN
	1    2500 3250
	1    0    0    -1  
$EndComp
$Comp
L BD140 Q4
U 1 1 5AAA27D6
P 10050 5350
F 0 "Q4" H 10050 5200 40  0000 R CNN
F 1 "BD140" H 10050 5500 40  0000 R CNN
F 2 "AutomataFootprint:PINHEAD1-3_BD140_AUTOMATA_PIN1" H 9930 5450 29  0001 C CNN
F 3 "" H 10050 5350 60  0000 C CNN
	1    10050 5350
	1    0    0    -1  
$EndComp
$Comp
L BD140 Q3
U 1 1 5AAA2838
P 7250 5400
F 0 "Q3" H 7250 5250 40  0000 R CNN
F 1 "BD140" H 7250 5550 40  0000 R CNN
F 2 "AutomataFootprint:PINHEAD1-3_BD140_AUTOMATA_PIN1" H 7130 5500 29  0001 C CNN
F 3 "" H 7250 5400 60  0000 C CNN
	1    7250 5400
	1    0    0    -1  
$EndComp
$Comp
L BD140 Q2
U 1 1 5AAA28A7
P 5500 3250
F 0 "Q2" H 5500 3100 40  0000 R CNN
F 1 "BD140" H 5500 3400 40  0000 R CNN
F 2 "AutomataFootprint:PINHEAD1-3_BD140_AUTOMATA_PIN1" H 5380 3350 29  0001 C CNN
F 3 "" H 5500 3250 60  0000 C CNN
	1    5500 3250
	1    0    0    -1  
$EndComp
$Comp
L D D3
U 1 1 5AAA290D
P 2600 2800
F 0 "D3" H 2600 2900 50  0000 C CNN
F 1 "D" H 2600 2700 50  0000 C CNN
F 2 "AutomataFootprint:SOD-123_AUTOMATA" H 2600 2800 50  0001 C CNN
F 3 "" H 2600 2800 50  0001 C CNN
	1    2600 2800
	0    -1   -1   0   
$EndComp
$Comp
L D D8
U 1 1 5AAA29B5
P 5600 3750
F 0 "D8" H 5600 3850 50  0000 C CNN
F 1 "D" H 5600 3650 50  0000 C CNN
F 2 "AutomataFootprint:SOD-123_AUTOMATA" H 5600 3750 50  0001 C CNN
F 3 "" H 5600 3750 50  0001 C CNN
	1    5600 3750
	0    1    1    0   
$EndComp
$Comp
L D D10
U 1 1 5AAA2A07
P 7350 5900
F 0 "D10" H 7350 6000 50  0000 C CNN
F 1 "D" H 7350 5800 50  0000 C CNN
F 2 "AutomataFootprint:SOD-123_AUTOMATA" H 7350 5900 50  0001 C CNN
F 3 "" H 7350 5900 50  0001 C CNN
	1    7350 5900
	0    1    1    0   
$EndComp
$Comp
L D D13
U 1 1 5AAA2A56
P 10150 5900
F 0 "D13" H 10150 6000 50  0000 C CNN
F 1 "D" H 10150 5800 50  0000 C CNN
F 2 "AutomataFootprint:SOD-123_AUTOMATA" H 10150 5900 50  0001 C CNN
F 3 "" H 10150 5900 50  0001 C CNN
	1    10150 5900
	0    1    1    0   
$EndComp
$Comp
L D D4
U 1 1 5AAA2AAC
P 2600 3750
F 0 "D4" H 2600 3850 50  0000 C CNN
F 1 "D" H 2600 3650 50  0000 C CNN
F 2 "AutomataFootprint:SOD-123_AUTOMATA" H 2600 3750 50  0001 C CNN
F 3 "" H 2600 3750 50  0001 C CNN
	1    2600 3750
	0    1    1    0   
$EndComp
$Comp
L D D7
U 1 1 5AAA2B05
P 5600 2750
F 0 "D7" H 5600 2850 50  0000 C CNN
F 1 "D" H 5600 2650 50  0000 C CNN
F 2 "AutomataFootprint:SOD-123_AUTOMATA" H 5600 2750 50  0001 C CNN
F 3 "" H 5600 2750 50  0001 C CNN
	1    5600 2750
	0    -1   -1   0   
$EndComp
$Comp
L D D9
U 1 1 5AAA2B63
P 7350 4900
F 0 "D9" H 7350 5000 50  0000 C CNN
F 1 "D" H 7350 4800 50  0000 C CNN
F 2 "AutomataFootprint:SOD-123_AUTOMATA" H 7350 4900 50  0001 C CNN
F 3 "" H 7350 4900 50  0001 C CNN
	1    7350 4900
	0    -1   -1   0   
$EndComp
$Comp
L D D12
U 1 1 5AAA2BC6
P 10150 4850
F 0 "D12" H 10150 4950 50  0000 C CNN
F 1 "D" H 10150 4750 50  0000 C CNN
F 2 "AutomataFootprint:SOD-123_AUTOMATA" H 10150 4850 50  0001 C CNN
F 3 "" H 10150 4850 50  0001 C CNN
	1    10150 4850
	0    -1   -1   0   
$EndComp
$Comp
L LTV-817 U1
U 1 1 5AAA2CC0
P 1300 3700
F 0 "U1" H 1100 3900 50  0000 L CNN
F 1 "LTV-817" H 1300 3900 50  0000 L CNN
F 2 "AutomataFootprint1:LTV817_SMD_1_Automata" H 1100 3500 50  0001 L CIN
F 3 "" H 1300 3600 50  0001 L CNN
	1    1300 3700
	1    0    0    -1  
$EndComp
$Comp
L LTV-817 U3
U 1 1 5AAA2E10
P 6000 5950
F 0 "U3" H 5800 6150 50  0000 L CNN
F 1 "LTV-817" H 6000 6150 50  0000 L CNN
F 2 "AutomataFootprint1:LTV817_SMD_1_Automata" H 5800 5750 50  0001 L CIN
F 3 "" H 6000 5850 50  0001 L CNN
	1    6000 5950
	1    0    0    -1  
$EndComp
$Comp
L LTV-817 U2
U 1 1 5AAA2E7F
P 4400 3750
F 0 "U2" H 4200 3950 50  0000 L CNN
F 1 "LTV-817" H 4400 3950 50  0000 L CNN
F 2 "AutomataFootprint1:LTV817_SMD_1_Automata" H 4200 3550 50  0001 L CIN
F 3 "" H 4400 3650 50  0001 L CNN
	1    4400 3750
	1    0    0    -1  
$EndComp
$Comp
L LTV-817 U4
U 1 1 5AAA6BBD
P 8950 5950
F 0 "U4" H 8750 6150 50  0000 L CNN
F 1 "LTV-817" H 8950 6150 50  0000 L CNN
F 2 "AutomataFootprint1:LTV817_SMD_1_Automata" H 8750 5750 50  0001 L CIN
F 3 "" H 8950 5850 50  0001 L CNN
	1    8950 5950
	1    0    0    -1  
$EndComp
$Comp
L D D1
U 1 1 5AAA81DB
P 650 3750
F 0 "D1" H 650 3850 50  0000 C CNN
F 1 "D" H 650 3650 50  0000 C CNN
F 2 "AutomataFootprint:SOD-123_AUTOMATA" H 650 3750 50  0001 C CNN
F 3 "" H 650 3750 50  0001 C CNN
	1    650  3750
	0    1    1    0   
$EndComp
Text Label 1600 3250 0    60   ~ 0
TLP1_4
Text Label 1850 1800 2    60   ~ 0
TLP1_4
Text Label 2300 2300 0    60   ~ 0
24V_OUT1
Text Label 2850 3900 0    60   ~ 0
GND_OUT1
Text Label 550  3900 0    60   ~ 0
GND
Text Label 650  2550 0    60   ~ 0
OUT1
Text Label 3700 3950 0    60   ~ 0
GND
Text Label 5250 6150 0    60   ~ 0
GND
Text Label 8250 6150 0    60   ~ 0
GND
Text Label 3950 2550 0    60   ~ 0
OUT2
Text Label 5500 4700 0    60   ~ 0
OUT3
Text Label 8450 4750 0    60   ~ 0
OUT4
Text Label 5350 2300 0    60   ~ 0
24V_OUT1
Text Label 7150 4450 0    60   ~ 0
24V_OUT1
Text Label 9900 4400 0    60   ~ 0
24V_OUT1
Text Label 5900 4000 0    60   ~ 0
GND_OUT1
Text Label 7650 6150 0    60   ~ 0
GND_OUT1
Text Label 10500 6200 0    60   ~ 0
GND_OUT1
$Comp
L D D5
U 1 1 5AAABD7B
P 3950 3800
F 0 "D5" H 3950 3900 50  0000 C CNN
F 1 "D" H 3950 3700 50  0000 C CNN
F 2 "AutomataFootprint:SOD-123_AUTOMATA" H 3950 3800 50  0001 C CNN
F 3 "" H 3950 3800 50  0001 C CNN
	1    3950 3800
	0    1    1    0   
$EndComp
$Comp
L D D6
U 1 1 5AAABE86
P 5500 6000
F 0 "D6" H 5500 6100 50  0000 C CNN
F 1 "D" H 5500 5900 50  0000 C CNN
F 2 "AutomataFootprint:SOD-123_AUTOMATA" H 5500 6000 50  0001 C CNN
F 3 "" H 5500 6000 50  0001 C CNN
	1    5500 6000
	0    1    1    0   
$EndComp
$Comp
L D D11
U 1 1 5AAABF70
P 8450 6000
F 0 "D11" H 8450 6100 50  0000 C CNN
F 1 "D" H 8450 5900 50  0000 C CNN
F 2 "AutomataFootprint:SOD-123_AUTOMATA" H 8450 6000 50  0001 C CNN
F 3 "" H 8450 6000 50  0001 C CNN
	1    8450 6000
	0    1    1    0   
$EndComp
Text Label 3250 1800 2    60   ~ 0
TLP2_4
Text Label 4800 1800 2    60   ~ 0
TLP3_4
Text Label 6300 1800 2    60   ~ 0
TLP4_4
Text Label 9250 5350 2    60   ~ 0
TLP4_4
Text Label 6300 5400 2    60   ~ 0
TLP3_4
Text Label 4750 3250 2    60   ~ 0
TLP2_4
Text Label 7650 5650 0    60   ~ 0
SSR3+
Text Label 10500 5650 0    60   ~ 0
SSR4+
Text Label 5900 3500 0    60   ~ 0
SSR2+
$Comp
L Fuse F1
U 1 1 5AAB235E
P 2150 1450
F 0 "F1" V 2230 1450 50  0000 C CNN
F 1 "Fuse" V 2075 1450 50  0000 C CNN
F 2 "Fuse_Holders_and_Fuses:Fuse_SMD1206_Wave" V 2080 1450 50  0001 C CNN
F 3 "" H 2150 1450 50  0001 C CNN
	1    2150 1450
	0    1    1    0   
$EndComp
$Comp
L Fuse F2
U 1 1 5AAB2867
P 3600 1450
F 0 "F2" V 3680 1450 50  0000 C CNN
F 1 "Fuse" V 3525 1450 50  0000 C CNN
F 2 "Fuse_Holders_and_Fuses:Fuse_SMD1206_Wave" V 3530 1450 50  0001 C CNN
F 3 "" H 3600 1450 50  0001 C CNN
	1    3600 1450
	0    1    1    0   
$EndComp
$Comp
L Fuse F3
U 1 1 5AAB29B3
P 5150 1450
F 0 "F3" V 5230 1450 50  0000 C CNN
F 1 "Fuse" V 5075 1450 50  0000 C CNN
F 2 "Fuse_Holders_and_Fuses:Fuse_SMD1206_Wave" V 5080 1450 50  0001 C CNN
F 3 "" H 5150 1450 50  0001 C CNN
	1    5150 1450
	0    1    1    0   
$EndComp
$Comp
L Fuse F4
U 1 1 5AAB2A9E
P 6650 1450
F 0 "F4" V 6730 1450 50  0000 C CNN
F 1 "Fuse" V 6575 1450 50  0000 C CNN
F 2 "Fuse_Holders_and_Fuses:Fuse_SMD1206_Wave" V 6580 1450 50  0001 C CNN
F 3 "" H 6650 1450 50  0001 C CNN
	1    6650 1450
	0    1    1    0   
$EndComp
Text Label 2950 3500 0    60   ~ 0
SSR1+
Text Label 1300 5450 0    60   ~ 0
OUT1
Text Label 1300 5650 0    60   ~ 0
OUT2
Text Label 1300 5850 0    60   ~ 0
OUT3
Text Label 1300 6050 0    60   ~ 0
OUT4
Text Label 1300 5950 0    60   ~ 0
GND
Text Label 1300 6150 0    60   ~ 0
GND
Text Label 2500 5450 0    60   ~ 0
SSR1+
Text Label 2500 5550 0    60   ~ 0
SSR2+
Text Label 2500 5650 0    60   ~ 0
SSR3+
Text Label 2500 5750 0    60   ~ 0
SSR4+
Text Label 2500 6150 0    60   ~ 0
GND_OUT1
Text Notes 1950 1050 0    60   ~ 0
IT USE WHEN TLP291 IS USE
$Comp
L Conn_02x08_Top_Bottom J1
U 1 1 5AAB67D4
P 1800 5750
F 0 "J1" H 1850 6150 50  0000 C CNN
F 1 "Conn_02x08_Top_Bottom" H 1850 5250 50  0000 C CNN
F 2 "automata:io_module_smd" H 1800 5750 50  0001 C CNN
F 3 "" H 1800 5750 50  0001 C CNN
	1    1800 5750
	1    0    0    -1  
$EndComp
Wire Wire Line
	2600 2650 2600 2500
Wire Wire Line
	2600 2500 2050 2500
Wire Wire Line
	2050 2500 2050 2750
Wire Wire Line
	2600 2950 2600 3050
Wire Wire Line
	2050 3050 2050 3450
Wire Wire Line
	1600 3250 2300 3250
Connection ~ 2050 3250
Wire Wire Line
	2600 3450 2600 3600
Wire Wire Line
	2050 3750 2050 3900
Wire Wire Line
	1600 3800 1600 3900
Connection ~ 2050 3900
Wire Wire Line
	1600 3600 1600 3250
Wire Wire Line
	650  3350 650  3600
Wire Wire Line
	650  3600 1000 3600
Wire Wire Line
	650  3050 650  2550
Connection ~ 2600 3900
Wire Wire Line
	2300 2300 2300 2500
Connection ~ 2300 2500
Wire Wire Line
	5050 2650 5050 2500
Wire Wire Line
	5050 2500 5600 2500
Wire Wire Line
	5600 2500 5600 2600
Wire Wire Line
	5050 2950 5050 3600
Wire Wire Line
	4750 3250 5300 3250
Connection ~ 5050 3250
Wire Wire Line
	5600 2900 5600 3050
Wire Wire Line
	5600 3450 5600 3600
Wire Wire Line
	5050 3900 5050 4000
Wire Wire Line
	5600 4000 5600 3900
Connection ~ 5050 4000
Wire Wire Line
	4750 3650 4750 3250
Wire Wire Line
	4750 3650 4700 3650
Wire Wire Line
	5350 2300 5350 2500
Connection ~ 5350 2500
Wire Wire Line
	3950 3300 3950 3650
Wire Wire Line
	3950 3650 4100 3650
Wire Wire Line
	3950 3000 3950 2550
Wire Wire Line
	4700 3850 4750 3850
Wire Wire Line
	4750 3850 4750 4000
Connection ~ 4750 4000
Wire Wire Line
	4750 4000 5900 4000
Wire Wire Line
	6900 4750 6900 4650
Wire Wire Line
	6900 4650 7350 4650
Wire Wire Line
	7350 4650 7350 4750
Wire Wire Line
	7350 5050 7350 5200
Wire Wire Line
	6900 5050 6900 5750
Wire Wire Line
	6300 5400 7050 5400
Connection ~ 6900 5400
Wire Wire Line
	7350 5600 7350 5750
Wire Wire Line
	6900 6050 6900 6150
Wire Wire Line
	6300 6150 7650 6150
Wire Wire Line
	7350 6150 7350 6050
Wire Wire Line
	6300 6050 6300 6150
Connection ~ 6900 6150
Wire Wire Line
	6300 5850 6300 5400
Wire Wire Line
	5500 5550 5500 5850
Wire Wire Line
	5500 5850 5700 5850
Wire Wire Line
	5500 4700 5500 5250
Wire Wire Line
	5600 3500 5900 3500
Connection ~ 5600 3500
Connection ~ 5600 4000
Wire Wire Line
	7350 5650 7650 5650
Connection ~ 7350 5650
Connection ~ 7350 6150
Wire Wire Line
	7150 4650 7150 4450
Connection ~ 7150 4650
Wire Wire Line
	9600 5000 9600 5750
Wire Wire Line
	9250 5350 9850 5350
Wire Wire Line
	10150 5000 10150 5150
Wire Wire Line
	10150 5550 10150 5750
Connection ~ 9600 5350
Wire Wire Line
	9600 6050 9600 6200
Wire Wire Line
	9250 6200 10500 6200
Wire Wire Line
	10150 6200 10150 6050
Wire Wire Line
	9250 6050 9250 6200
Connection ~ 9600 6200
Wire Wire Line
	9250 5850 9250 5350
Wire Wire Line
	8450 5850 8650 5850
Wire Wire Line
	9600 4700 9600 4600
Wire Wire Line
	9600 4600 10150 4600
Wire Wire Line
	10150 4600 10150 4700
Wire Wire Line
	9900 4400 9900 4600
Connection ~ 9900 4600
Wire Wire Line
	8450 5550 8450 5850
Wire Wire Line
	8450 4750 8450 5250
Wire Wire Line
	10150 5650 10500 5650
Connection ~ 10150 5650
Connection ~ 10150 6200
Wire Wire Line
	1000 3900 1000 3800
Connection ~ 2600 3500
Wire Wire Line
	2050 1600 2050 1800
Wire Wire Line
	2050 1800 1850 1800
Wire Wire Line
	2250 1600 2250 1800
Wire Wire Line
	2250 1800 2450 1800
Wire Wire Line
	1600 3900 2850 3900
Wire Wire Line
	4100 3950 4100 3850
Wire Wire Line
	3700 3950 4100 3950
Wire Wire Line
	5700 6150 5700 6050
Wire Wire Line
	8650 6050 8650 6150
Wire Wire Line
	8650 6150 8250 6150
Wire Wire Line
	2600 3500 2950 3500
Wire Wire Line
	3500 1600 3500 1800
Wire Wire Line
	3500 1800 3250 1800
Wire Wire Line
	3700 1600 3700 1800
Wire Wire Line
	3700 1800 3950 1800
Wire Wire Line
	5050 1600 5050 1800
Wire Wire Line
	5050 1800 4800 1800
Wire Wire Line
	5250 1600 5250 1800
Wire Wire Line
	5250 1800 5450 1800
Wire Wire Line
	6550 1600 6550 1800
Wire Wire Line
	6550 1800 6300 1800
Wire Wire Line
	6750 1600 6750 1800
Wire Wire Line
	6750 1800 7000 1800
Wire Wire Line
	1300 5450 1600 5450
Wire Wire Line
	1300 5550 1600 5550
Wire Wire Line
	1300 5650 1600 5650
Wire Wire Line
	1300 5750 1600 5750
Wire Wire Line
	1300 5850 1600 5850
Wire Wire Line
	1300 5950 1600 5950
Wire Wire Line
	1300 6150 1600 6150
Wire Wire Line
	1300 6050 1600 6050
Wire Wire Line
	2500 5450 2100 5450
Wire Wire Line
	2500 5550 2100 5550
Wire Wire Line
	2500 5650 2100 5650
Wire Wire Line
	2500 5750 2100 5750
Wire Wire Line
	2500 5850 2100 5850
Wire Wire Line
	2500 5950 2100 5950
Wire Wire Line
	2500 6050 2100 6050
Wire Wire Line
	2500 6150 2100 6150
Wire Wire Line
	550  3900 1000 3900
Connection ~ 650  3900
Connection ~ 3950 3950
Wire Wire Line
	5250 6150 5700 6150
Connection ~ 5500 6150
Connection ~ 8450 6150
Text Label 2500 5950 0    60   ~ 0
24V_OUT1
Text Label 2450 1800 0    60   ~ 0
SSR1+
Wire Wire Line
	2300 1450 2300 1600
Wire Wire Line
	2300 1600 2250 1600
Wire Wire Line
	2000 1450 2000 1600
Wire Wire Line
	2000 1600 2050 1600
Text Label 3950 1800 0    60   ~ 0
SSR2+
Wire Wire Line
	3450 1450 3450 1600
Wire Wire Line
	3450 1600 3500 1600
Wire Wire Line
	3700 1600 3750 1600
Wire Wire Line
	3750 1600 3750 1450
Wire Wire Line
	5000 1450 5000 1600
Wire Wire Line
	5000 1600 5050 1600
Wire Wire Line
	5300 1450 5300 1600
Wire Wire Line
	5300 1600 5250 1600
Text Label 5450 1800 0    60   ~ 0
SSR3+
Wire Wire Line
	6500 1450 6500 1600
Wire Wire Line
	6500 1600 6550 1600
Wire Wire Line
	6800 1450 6800 1600
Wire Wire Line
	6800 1600 6750 1600
Text Label 7000 1800 0    60   ~ 0
SSR4+
NoConn ~ 1300 5550
NoConn ~ 1300 5750
Wire Wire Line
	2500 6050 2500 6150
Wire Wire Line
	2500 5850 2500 5950
$EndSCHEMATC
