EESchema Schematic File Version 2
LIBS:power
LIBS:device
LIBS:transistors
LIBS:conn
LIBS:linear
LIBS:regul
LIBS:74xx
LIBS:cmos4000
LIBS:adc-dac
LIBS:memory
LIBS:xilinx
LIBS:microcontrollers
LIBS:dsp
LIBS:analog_switches
LIBS:motorola
LIBS:texas
LIBS:intel
LIBS:audio
LIBS:interface
LIBS:digital-audio
LIBS:philips
LIBS:display
LIBS:cypress
LIBS:siliconi
LIBS:opto
LIBS:atmel
LIBS:contrib
LIBS:valves
LIBS:4xxx
LIBS:4xxx_IEEE
LIBS:74xGxx
LIBS:74xx_IEEE
LIBS:Amplifier_Audio
LIBS:Amplifier_Buffer
LIBS:Amplifier_Current
LIBS:Amplifier_Difference
LIBS:Amplifier_Instrumentation
LIBS:Amplifier_Operational
LIBS:Amplifier_Video
LIBS:Analog
LIBS:Analog_ADC
LIBS:Analog_DAC
LIBS:Analog_Switch
LIBS:Audio
LIBS:Battery_Management
LIBS:Comparator
LIBS:Connector_Generic
LIBS:Connector_Generic_Shielded
LIBS:Connector_Specialized
LIBS:Converter_ACDC
LIBS:Converter_DCDC
LIBS:CPLD_Altera
LIBS:CPLD_Xilinx
LIBS:CPU
LIBS:CPU_NXP_6800
LIBS:CPU_NXP_68000
LIBS:CPU_PowerPC
LIBS:Device
LIBS:Diode
LIBS:Diode_Bridge
LIBS:Diode_Laser
LIBS:Display_Character
LIBS:Display_Graphic
LIBS:Driver_Display
LIBS:Driver_FET
LIBS:Driver_LED
LIBS:Driver_Motor
LIBS:Driver_Relay
LIBS:DSP_Freescale
LIBS:DSP_Microchip_DSPIC33
LIBS:DSP_Motorola
LIBS:DSP_Texas
LIBS:Filter
LIBS:FPGA_Actel
LIBS:FPGA_Xilinx
LIBS:FPGA_Xilinx_Artix7
LIBS:FPGA_Xilinx_Kintex7
LIBS:FPGA_Xilinx_Spartan6
LIBS:FPGA_Xilinx_Virtex5
LIBS:FPGA_Xilinx_Virtex6
LIBS:FPGA_Xilinx_Virtex7
LIBS:GPU
LIBS:Graphic
LIBS:Interface
LIBS:Interface_CAN_LIN
LIBS:Interface_CurrentLoop
LIBS:Interface_Ethernet
LIBS:Interface_Expansion
LIBS:Interface_HID
LIBS:Interface_LineDriver
LIBS:Interface_Optical
LIBS:Interface_Telecom
LIBS:Interface_UART
LIBS:Interface_USB
LIBS:Isolator
LIBS:Isolator_Analog
LIBS:Jumper
LIBS:LED
LIBS:Logic_LevelTranslator
LIBS:Logic_Programmable
LIBS:MCU_AnalogDevices
LIBS:MCU_Atmel_8051
LIBS:MCU_Atmel_ATMEGA
LIBS:MCU_Atmel_ATTINY
LIBS:MCU_Atmel_AVR
LIBS:MCU_Cypress
LIBS:MCU_Espressif
LIBS:MCU_Infineon
LIBS:MCU_Intel
LIBS:MCU_Microchip_PIC10
LIBS:MCU_Microchip_PIC12
LIBS:MCU_Microchip_PIC16
LIBS:MCU_Microchip_PIC18
LIBS:MCU_Microchip_PIC24
LIBS:MCU_Microchip_PIC32
LIBS:MCU_Microchip_SAME
LIBS:MCU_Microchip_SAML
LIBS:MCU_Module
LIBS:MCU_Nordic
LIBS:MCU_NXP_ColdFire
LIBS:MCU_NXP_HC11
LIBS:MCU_NXP_HC12
LIBS:MCU_NXP_HCS12
LIBS:MCU_NXP_Kinetis
LIBS:MCU_NXP_LPC
LIBS:MCU_NXP_MAC7100
LIBS:MCU_NXP_MCore
LIBS:MCU_NXP_S08
LIBS:MCU_Parallax
LIBS:MCU_SiFive
LIBS:MCU_SiliconLabs
LIBS:MCU_ST_STM8
LIBS:MCU_ST_STM32
LIBS:MCU_Texas
LIBS:MCU_Texas_MSP430
LIBS:Mechanical
LIBS:Memory_Controller
LIBS:Memory_EEPROM
LIBS:Memory_EPROM
LIBS:Memory_Flash
LIBS:Memory_NVRAM
LIBS:Memory_RAM
LIBS:Memory_ROM
LIBS:Memory_UniqueID
LIBS:Motor
LIBS:Oscillator
LIBS:Potentiometer_Digital
LIBS:Power_Management
LIBS:Power_Protection
LIBS:Power_Supervisor
LIBS:pspice
LIBS:Reference_Current
LIBS:Reference_Voltage
LIBS:Regulator_Controller
LIBS:Regulator_Current
LIBS:Regulator_Linear
LIBS:Regulator_SwitchedCapacitor
LIBS:Regulator_Switching
LIBS:Relay
LIBS:Relay_SolidState
LIBS:RF
LIBS:RF_AM_FM
LIBS:RF_Bluetooth
LIBS:RF_GPS
LIBS:RF_Mixer
LIBS:RF_Module
LIBS:RF_RFID
LIBS:RF_Switch
LIBS:RF_WiFi
LIBS:RF_ZigBee
LIBS:Sensor
LIBS:Sensor_Audio
LIBS:Sensor_Current
LIBS:Sensor_Gas
LIBS:Sensor_Humidity
LIBS:Sensor_Magnetic
LIBS:Sensor_Motion
LIBS:Sensor_Optical
LIBS:Sensor_Pressure
LIBS:Sensor_Proximity
LIBS:Sensor_Temperature
LIBS:Sensor_Touch
LIBS:Sensor_Voltage
LIBS:Switch
LIBS:Timer
LIBS:Timer_PLL
LIBS:Timer_RTC
LIBS:Transformer
LIBS:Transistor_Array
LIBS:Transistor_BJT
LIBS:Transistor_FET
LIBS:Transistor_IGBT
LIBS:Triac_Thyristor
LIBS:Valve
LIBS:Video
LIBS:input_ module-cache
EELAYER 25 0
EELAYER END
$Descr A4 11693 8268
encoding utf-8
Sheet 2 2
Title "ISOLATED INPUT CIRCUIT"
Date "6 apr 2017"
Rev ""
Comp ""
Comment1 ""
Comment2 ""
Comment3 ""
Comment4 ""
$EndDescr
$Comp
L R R2
U 1 1 55D3E2A4
P 1700 1250
F 0 "R2" V 1780 1250 40  0000 C CNN
F 1 "1K" V 1707 1251 40  0000 C CNN
F 2 "AutomataFootprint:R_0805_AUTOMAT" V 1630 1250 30  0000 C CNN
F 3 "~" H 1700 1250 30  0000 C CNN
	1    1700 1250
	0    1    1    0   
$EndComp
$Comp
L R R6
U 1 1 55D3E532
P 2500 1250
F 0 "R6" V 2580 1250 40  0000 C CNN
F 1 "1K" V 2507 1251 40  0000 C CNN
F 2 "AutomataFootprint:R_0805_AUTOMAT" V 2430 1250 30  0000 C CNN
F 3 "~" H 2500 1250 30  0000 C CNN
	1    2500 1250
	0    1    1    0   
$EndComp
$Comp
L R R10
U 1 1 55D3FD49
P 2800 1550
F 0 "R10" V 2880 1550 40  0000 C CNN
F 1 "10K" V 2807 1551 40  0000 C CNN
F 2 "AutomataFootprint:R_0805_AUTOMAT" V 2730 1550 30  0000 C CNN
F 3 "~" H 2800 1550 30  0000 C CNN
	1    2800 1550
	1    0    0    -1  
$EndComp
$Comp
L C C2
U 1 1 55D53E77
P 2200 1500
F 0 "C2" H 2200 1600 40  0000 L CNN
F 1 "15n" H 2206 1415 40  0000 L CNN
F 2 "AutomataFootprint:C_0805_AUTOMATA" H 2238 1350 30  0000 C CNN
F 3 "~" H 2200 1500 60  0000 C CNN
	1    2200 1500
	1    0    0    -1  
$EndComp
$Comp
L R R3
U 1 1 55C31E9B
P 1700 2500
F 0 "R3" V 1780 2500 40  0000 C CNN
F 1 "1K" V 1707 2501 40  0000 C CNN
F 2 "AutomataFootprint:R_0805_AUTOMAT" V 1630 2500 30  0000 C CNN
F 3 "~" H 1700 2500 30  0000 C CNN
	1    1700 2500
	0    1    1    0   
$EndComp
$Comp
L R R7
U 1 1 55C31EA1
P 2500 2500
F 0 "R7" V 2580 2500 40  0000 C CNN
F 1 "1K" V 2507 2501 40  0000 C CNN
F 2 "AutomataFootprint:R_0805_AUTOMAT" V 2430 2500 30  0000 C CNN
F 3 "~" H 2500 2500 30  0000 C CNN
	1    2500 2500
	0    1    1    0   
$EndComp
$Comp
L R R11
U 1 1 55C31EA7
P 2800 2800
F 0 "R11" V 2880 2800 40  0000 C CNN
F 1 "10K" V 2807 2801 40  0000 C CNN
F 2 "AutomataFootprint:R_0805_AUTOMAT" V 2730 2800 30  0000 C CNN
F 3 "~" H 2800 2800 30  0000 C CNN
	1    2800 2800
	1    0    0    -1  
$EndComp
$Comp
L C C3
U 1 1 55C31EB3
P 2200 2750
F 0 "C3" H 2200 2850 40  0000 L CNN
F 1 "15n" H 2206 2665 40  0000 L CNN
F 2 "AutomataFootprint:C_0805_AUTOMATA" H 2238 2600 30  0000 C CNN
F 3 "~" H 2200 2750 60  0000 C CNN
	1    2200 2750
	1    0    0    -1  
$EndComp
$Comp
L R R4
U 1 1 55C4CB9F
P 1700 3800
F 0 "R4" V 1780 3800 40  0000 C CNN
F 1 "1K" V 1707 3801 40  0000 C CNN
F 2 "AutomataFootprint:R_0805_AUTOMAT" V 1630 3800 30  0000 C CNN
F 3 "~" H 1700 3800 30  0000 C CNN
	1    1700 3800
	0    1    1    0   
$EndComp
$Comp
L R R8
U 1 1 55C4CBA5
P 2500 3800
F 0 "R8" V 2580 3800 40  0000 C CNN
F 1 "1K" V 2507 3801 40  0000 C CNN
F 2 "AutomataFootprint:R_0805_AUTOMAT" V 2430 3800 30  0000 C CNN
F 3 "~" H 2500 3800 30  0000 C CNN
	1    2500 3800
	0    1    1    0   
$EndComp
$Comp
L R R12
U 1 1 55C4CBAB
P 2800 4100
F 0 "R12" V 2880 4100 40  0000 C CNN
F 1 "10K" V 2807 4101 40  0000 C CNN
F 2 "AutomataFootprint:R_0805_AUTOMAT" V 2730 4100 30  0000 C CNN
F 3 "~" H 2800 4100 30  0000 C CNN
	1    2800 4100
	1    0    0    -1  
$EndComp
$Comp
L C C4
U 1 1 55C4CBB7
P 2200 4050
F 0 "C4" H 2200 4150 40  0000 L CNN
F 1 "15n" H 2206 3965 40  0000 L CNN
F 2 "AutomataFootprint:C_0805_AUTOMATA" H 2238 3900 30  0000 C CNN
F 3 "~" H 2200 4050 60  0000 C CNN
	1    2200 4050
	1    0    0    -1  
$EndComp
$Comp
L R R1
U 1 1 55C4CBDA
P 1650 5150
F 0 "R1" V 1730 5150 40  0000 C CNN
F 1 "1K" V 1657 5151 40  0000 C CNN
F 2 "AutomataFootprint:R_0805_AUTOMAT" V 1580 5150 30  0000 C CNN
F 3 "~" H 1650 5150 30  0000 C CNN
	1    1650 5150
	0    1    1    0   
$EndComp
$Comp
L R R5
U 1 1 55C4CBE0
P 2450 5150
F 0 "R5" V 2530 5150 40  0000 C CNN
F 1 "1K" V 2457 5151 40  0000 C CNN
F 2 "AutomataFootprint:R_0805_AUTOMAT" V 2380 5150 30  0000 C CNN
F 3 "~" H 2450 5150 30  0000 C CNN
	1    2450 5150
	0    1    1    0   
$EndComp
$Comp
L R R9
U 1 1 55C4CBE6
P 2750 5450
F 0 "R9" V 2830 5450 40  0000 C CNN
F 1 "10K" V 2757 5451 40  0000 C CNN
F 2 "AutomataFootprint:R_0805_AUTOMAT" V 2680 5450 30  0000 C CNN
F 3 "~" H 2750 5450 30  0000 C CNN
	1    2750 5450
	1    0    0    -1  
$EndComp
$Comp
L C C1
U 1 1 55C4CBF2
P 2150 5400
F 0 "C1" H 2150 5500 40  0000 L CNN
F 1 "15n" H 2156 5315 40  0000 L CNN
F 2 "AutomataFootprint:C_0805_AUTOMATA" H 2188 5250 30  0000 C CNN
F 3 "~" H 2150 5400 60  0000 C CNN
	1    2150 5400
	1    0    0    -1  
$EndComp
$Comp
L TLP291 IC1
U 1 1 55C8FCCE
P 3450 1500
F 0 "IC1" H 3237 1678 40  0000 C CNN
F 1 "LV817" H 3599 1316 40  0000 C CNN
F 2 "AutomataFootprint1:LTV817_SMD_1_Automata" H 3286 1326 29  0001 C CNN
F 3 "" H 3450 1500 60  0000 C CNN
	1    3450 1500
	1    0    0    -1  
$EndComp
$Comp
L TLP291 IC2
U 1 1 55C8FCDB
P 3450 2750
F 0 "IC2" H 3237 2928 40  0000 C CNN
F 1 "LV817" H 3599 2566 40  0000 C CNN
F 2 "AutomataFootprint:LTV817_SMD_1_Automata" H 3286 2576 29  0001 C CNN
F 3 "" H 3450 2750 60  0000 C CNN
	1    3450 2750
	1    0    0    -1  
$EndComp
$Comp
L TLP291 IC4
U 1 1 55C8FCE1
P 3500 4050
F 0 "IC4" H 3287 4228 40  0000 C CNN
F 1 "LV817" H 3649 3866 40  0000 C CNN
F 2 "AutomataFootprint:LTV817_SMD_1_Automata" H 3336 3876 29  0001 C CNN
F 3 "" H 3500 4050 60  0000 C CNN
	1    3500 4050
	1    0    0    -1  
$EndComp
$Comp
L TLP291 IC3
U 1 1 55C8FCE7
P 3450 5400
F 0 "IC3" H 3237 5578 40  0000 C CNN
F 1 "LV817" H 3599 5216 40  0000 C CNN
F 2 "AutomataFootprint:LTV817_SMD_1_Automata" H 3286 5226 29  0001 C CNN
F 3 "" H 3450 5400 60  0000 C CNN
	1    3450 5400
	1    0    0    -1  
$EndComp
$Comp
L R R14
U 1 1 57D2620F
P 6750 1150
F 0 "R14" V 6830 1150 40  0000 C CNN
F 1 "1K" V 6757 1151 40  0000 C CNN
F 2 "AutomataFootprint:R_0805_AUTOMAT" V 6680 1150 30  0000 C CNN
F 3 "~" H 6750 1150 30  0000 C CNN
	1    6750 1150
	0    1    1    0   
$EndComp
$Comp
L R R18
U 1 1 57D26215
P 7550 1150
F 0 "R18" V 7630 1150 40  0000 C CNN
F 1 "1K" V 7557 1151 40  0000 C CNN
F 2 "AutomataFootprint:R_0805_AUTOMAT" V 7480 1150 30  0000 C CNN
F 3 "~" H 7550 1150 30  0000 C CNN
	1    7550 1150
	0    1    1    0   
$EndComp
$Comp
L R R22
U 1 1 57D2621B
P 7850 1450
F 0 "R22" V 7930 1450 40  0000 C CNN
F 1 "10K" V 7857 1451 40  0000 C CNN
F 2 "AutomataFootprint:R_0805_AUTOMAT" V 7780 1450 30  0000 C CNN
F 3 "~" H 7850 1450 30  0000 C CNN
	1    7850 1450
	1    0    0    -1  
$EndComp
$Comp
L C C10
U 1 1 57D26227
P 7250 1400
F 0 "C10" H 7250 1500 40  0000 L CNN
F 1 "15n" H 7256 1315 40  0000 L CNN
F 2 "AutomataFootprint:C_0805_AUTOMATA" H 7288 1250 30  0000 C CNN
F 3 "~" H 7250 1400 60  0000 C CNN
	1    7250 1400
	1    0    0    -1  
$EndComp
$Comp
L R R15
U 1 1 57D26244
P 6750 2400
F 0 "R15" V 6830 2400 40  0000 C CNN
F 1 "1K" V 6757 2401 40  0000 C CNN
F 2 "AutomataFootprint:R_0805_AUTOMAT" V 6680 2400 30  0000 C CNN
F 3 "~" H 6750 2400 30  0000 C CNN
	1    6750 2400
	0    1    1    0   
$EndComp
$Comp
L R R19
U 1 1 57D2624A
P 7550 2400
F 0 "R19" V 7630 2400 40  0000 C CNN
F 1 "1K" V 7557 2401 40  0000 C CNN
F 2 "AutomataFootprint:R_0805_AUTOMAT" V 7480 2400 30  0000 C CNN
F 3 "~" H 7550 2400 30  0000 C CNN
	1    7550 2400
	0    1    1    0   
$EndComp
$Comp
L R R23
U 1 1 57D26250
P 7850 2700
F 0 "R23" V 7930 2700 40  0000 C CNN
F 1 "10K" V 7857 2701 40  0000 C CNN
F 2 "AutomataFootprint:R_0805_AUTOMAT" V 7780 2700 30  0000 C CNN
F 3 "~" H 7850 2700 30  0000 C CNN
	1    7850 2700
	1    0    0    -1  
$EndComp
$Comp
L C C11
U 1 1 57D2625C
P 7250 2650
F 0 "C11" H 7250 2750 40  0000 L CNN
F 1 "15n" H 7256 2565 40  0000 L CNN
F 2 "AutomataFootprint:C_0805_AUTOMATA" H 7288 2500 30  0000 C CNN
F 3 "~" H 7250 2650 60  0000 C CNN
	1    7250 2650
	1    0    0    -1  
$EndComp
$Comp
L R R16
U 1 1 57D262B1
P 6750 3700
F 0 "R16" V 6830 3700 40  0000 C CNN
F 1 "1K" V 6757 3701 40  0000 C CNN
F 2 "AutomataFootprint:R_0805_AUTOMAT" V 6680 3700 30  0000 C CNN
F 3 "~" H 6750 3700 30  0000 C CNN
	1    6750 3700
	0    1    1    0   
$EndComp
$Comp
L R R20
U 1 1 57D262B7
P 7550 3700
F 0 "R20" V 7630 3700 40  0000 C CNN
F 1 "1K" V 7557 3701 40  0000 C CNN
F 2 "AutomataFootprint:R_0805_AUTOMAT" V 7480 3700 30  0000 C CNN
F 3 "~" H 7550 3700 30  0000 C CNN
	1    7550 3700
	0    1    1    0   
$EndComp
$Comp
L R R24
U 1 1 57D262BD
P 7850 4000
F 0 "R24" V 7930 4000 40  0000 C CNN
F 1 "10K" V 7857 4001 40  0000 C CNN
F 2 "AutomataFootprint:R_0805_AUTOMAT" V 7780 4000 30  0000 C CNN
F 3 "~" H 7850 4000 30  0000 C CNN
	1    7850 4000
	1    0    0    -1  
$EndComp
$Comp
L C C12
U 1 1 57D262C9
P 7250 3950
F 0 "C12" H 7250 4050 40  0000 L CNN
F 1 "15n" H 7256 3865 40  0000 L CNN
F 2 "AutomataFootprint:C_0805_AUTOMATA" H 7288 3800 30  0000 C CNN
F 3 "~" H 7250 3950 60  0000 C CNN
	1    7250 3950
	1    0    0    -1  
$EndComp
$Comp
L R R13
U 1 1 57D262E6
P 6700 5050
F 0 "R13" V 6780 5050 40  0000 C CNN
F 1 "1K" V 6707 5051 40  0000 C CNN
F 2 "AutomataFootprint:R_0805_AUTOMAT" V 6630 5050 30  0000 C CNN
F 3 "~" H 6700 5050 30  0000 C CNN
	1    6700 5050
	0    1    1    0   
$EndComp
$Comp
L R R17
U 1 1 57D262EC
P 7500 5050
F 0 "R17" V 7580 5050 40  0000 C CNN
F 1 "1K" V 7507 5051 40  0000 C CNN
F 2 "AutomataFootprint:R_0805_AUTOMAT" V 7430 5050 30  0000 C CNN
F 3 "~" H 7500 5050 30  0000 C CNN
	1    7500 5050
	0    1    1    0   
$EndComp
$Comp
L R R21
U 1 1 57D262F2
P 7800 5350
F 0 "R21" V 7880 5350 40  0000 C CNN
F 1 "10K" V 7807 5351 40  0000 C CNN
F 2 "AutomataFootprint:R_0805_AUTOMAT" V 7730 5350 30  0000 C CNN
F 3 "~" H 7800 5350 30  0000 C CNN
	1    7800 5350
	1    0    0    -1  
$EndComp
$Comp
L C C9
U 1 1 57D262FE
P 7200 5300
F 0 "C9" H 7200 5400 40  0000 L CNN
F 1 "15n" H 7206 5215 40  0000 L CNN
F 2 "AutomataFootprint:C_0805_AUTOMATA" H 7238 5150 30  0000 C CNN
F 3 "~" H 7200 5300 60  0000 C CNN
	1    7200 5300
	1    0    0    -1  
$EndComp
$Comp
L TLP291 IC5
U 1 1 57D26391
P 8500 1400
F 0 "IC5" H 8287 1578 40  0000 C CNN
F 1 "LV817" H 8649 1216 40  0000 C CNN
F 2 "AutomataFootprint:LTV817_SMD_1_Automata" H 8336 1226 29  0001 C CNN
F 3 "" H 8500 1400 60  0000 C CNN
	1    8500 1400
	1    0    0    -1  
$EndComp
$Comp
L TLP291 IC6
U 1 1 57D26397
P 8500 2650
F 0 "IC6" H 8287 2828 40  0000 C CNN
F 1 "LV817" H 8649 2466 40  0000 C CNN
F 2 "AutomataFootprint:LTV817_SMD_1_Automata" H 8336 2476 29  0001 C CNN
F 3 "" H 8500 2650 60  0000 C CNN
	1    8500 2650
	1    0    0    -1  
$EndComp
$Comp
L TLP291 IC8
U 1 1 57D2639D
P 8550 3950
F 0 "IC8" H 8337 4128 40  0000 C CNN
F 1 "LV817" H 8699 3766 40  0000 C CNN
F 2 "AutomataFootprint:LTV817_SMD_1_Automata" H 8386 3776 29  0001 C CNN
F 3 "" H 8550 3950 60  0000 C CNN
	1    8550 3950
	1    0    0    -1  
$EndComp
$Comp
L TLP291 IC7
U 1 1 57D263A3
P 8500 5300
F 0 "IC7" H 8287 5478 40  0000 C CNN
F 1 "LV817" H 8649 5116 40  0000 C CNN
F 2 "AutomataFootprint:LTV817_SMD_1_Automata" H 8336 5126 29  0001 C CNN
F 3 "" H 8500 5300 60  0000 C CNN
	1    8500 5300
	1    0    0    -1  
$EndComp
Wire Wire Line
	2650 1250 2950 1250
Wire Wire Line
	1350 1250 1550 1250
Wire Wire Line
	650  1250 1050 1250
Wire Wire Line
	3750 1400 4550 1400
Wire Wire Line
	4050 1850 4550 1850
Wire Wire Line
	1850 1250 2350 1250
Wire Wire Line
	2000 1250 2000 1400
Connection ~ 2000 1250
Wire Wire Line
	2200 1250 2200 1350
Connection ~ 2200 1250
Wire Wire Line
	2800 1250 2800 1400
Wire Wire Line
	2950 1250 2950 1400
Connection ~ 2800 1250
Wire Wire Line
	2950 1850 2950 1600
Wire Wire Line
	650  1850 2950 1850
Wire Wire Line
	2800 1700 2800 1850
Connection ~ 2800 1850
Wire Wire Line
	2200 1650 2200 1850
Connection ~ 2200 1850
Wire Wire Line
	2000 1700 2000 1850
Connection ~ 2000 1850
Wire Wire Line
	4050 1600 4050 1850
Wire Wire Line
	2650 2500 2950 2500
Wire Wire Line
	1350 2500 1550 2500
Wire Wire Line
	600  2500 1050 2500
Wire Wire Line
	3750 2650 4550 2650
Wire Wire Line
	4050 3100 4550 3100
Wire Wire Line
	1850 2500 2350 2500
Wire Wire Line
	2000 2500 2000 2600
Connection ~ 2000 2500
Wire Wire Line
	2200 2500 2200 2600
Connection ~ 2200 2500
Wire Wire Line
	2800 2500 2800 2650
Wire Wire Line
	2950 2500 2950 2650
Connection ~ 2800 2500
Wire Wire Line
	2950 3100 2950 2850
Wire Wire Line
	650  3100 2950 3100
Wire Wire Line
	2800 2950 2800 3100
Connection ~ 2800 3100
Wire Wire Line
	2200 2900 2200 3100
Connection ~ 2200 3100
Wire Wire Line
	2000 2900 2000 3100
Connection ~ 2000 3100
Wire Wire Line
	4050 2850 4050 3100
Wire Wire Line
	2650 3800 2950 3800
Wire Wire Line
	1350 3800 1550 3800
Wire Wire Line
	700  3800 1050 3800
Wire Wire Line
	3800 3950 4600 3950
Wire Wire Line
	1850 3800 2350 3800
Wire Wire Line
	2000 3800 2000 3900
Connection ~ 2000 3800
Wire Wire Line
	2200 3800 2200 3900
Connection ~ 2200 3800
Wire Wire Line
	2800 3800 2800 3950
Wire Wire Line
	2950 3800 2950 3950
Connection ~ 2800 3800
Wire Wire Line
	2950 4400 2950 4150
Wire Wire Line
	700  4400 2950 4400
Wire Wire Line
	2800 4250 2800 4400
Connection ~ 2800 4400
Wire Wire Line
	2200 4200 2200 4400
Connection ~ 2200 4400
Wire Wire Line
	2000 4200 2000 4400
Connection ~ 2000 4400
Wire Wire Line
	4050 4150 4050 4400
Wire Wire Line
	2600 5150 2900 5150
Wire Wire Line
	650  5150 1000 5150
Wire Wire Line
	3750 5300 4500 5300
Wire Wire Line
	4000 5750 4450 5750
Wire Wire Line
	1800 5150 2300 5150
Wire Wire Line
	1950 5150 1950 5250
Connection ~ 1950 5150
Wire Wire Line
	2150 5150 2150 5250
Connection ~ 2150 5150
Wire Wire Line
	2750 5150 2750 5300
Wire Wire Line
	2900 5150 2900 5300
Connection ~ 2750 5150
Wire Wire Line
	2900 5750 2900 5500
Wire Wire Line
	650  5750 2900 5750
Wire Wire Line
	2750 5600 2750 5750
Connection ~ 2750 5750
Wire Wire Line
	2150 5550 2150 5750
Connection ~ 2150 5750
Wire Wire Line
	1950 5550 1950 5750
Connection ~ 1950 5750
Wire Wire Line
	4000 5500 4000 5750
Wire Wire Line
	2950 1400 3150 1400
Wire Wire Line
	2950 1600 3150 1600
Wire Wire Line
	3750 1600 4050 1600
Wire Wire Line
	2950 2650 3150 2650
Wire Wire Line
	3750 2850 4050 2850
Wire Wire Line
	2950 2850 3150 2850
Wire Wire Line
	2950 3950 3200 3950
Wire Wire Line
	2950 4150 3200 4150
Wire Wire Line
	3800 4150 4050 4150
Wire Wire Line
	2900 5300 3150 5300
Wire Wire Line
	2900 5500 3150 5500
Wire Wire Line
	3750 5500 4000 5500
Wire Wire Line
	7700 1150 8000 1150
Wire Wire Line
	6400 1150 6600 1150
Wire Wire Line
	5700 1150 6100 1150
Wire Wire Line
	8800 1300 9600 1300
Wire Wire Line
	9100 1750 9600 1750
Wire Wire Line
	6900 1150 7400 1150
Wire Wire Line
	7050 1150 7050 1250
Connection ~ 7050 1150
Wire Wire Line
	7250 1150 7250 1250
Connection ~ 7250 1150
Wire Wire Line
	7850 1150 7850 1300
Wire Wire Line
	8000 1150 8000 1300
Connection ~ 7850 1150
Wire Wire Line
	8000 1750 8000 1500
Wire Wire Line
	5700 1750 8000 1750
Wire Wire Line
	7850 1600 7850 1750
Connection ~ 7850 1750
Wire Wire Line
	7250 1550 7250 1750
Connection ~ 7250 1750
Wire Wire Line
	7050 1550 7050 1750
Connection ~ 7050 1750
Wire Wire Line
	9100 1500 9100 1750
Wire Wire Line
	7700 2400 8000 2400
Wire Wire Line
	6400 2400 6600 2400
Wire Wire Line
	5700 2400 6100 2400
Wire Wire Line
	8800 2550 9600 2550
Wire Wire Line
	9100 3000 9600 3000
Wire Wire Line
	6900 2400 7400 2400
Wire Wire Line
	7050 2400 7050 2500
Connection ~ 7050 2400
Wire Wire Line
	7250 2400 7250 2500
Connection ~ 7250 2400
Wire Wire Line
	7850 2400 7850 2550
Wire Wire Line
	8000 2400 8000 2550
Connection ~ 7850 2400
Wire Wire Line
	8000 3000 8000 2750
Wire Wire Line
	5700 3000 8000 3000
Wire Wire Line
	7850 2850 7850 3000
Connection ~ 7850 3000
Wire Wire Line
	7250 2800 7250 3000
Connection ~ 7250 3000
Wire Wire Line
	7050 2800 7050 3000
Connection ~ 7050 3000
Wire Wire Line
	9100 2750 9100 3000
Wire Wire Line
	7700 3700 8000 3700
Wire Wire Line
	6400 3700 6600 3700
Wire Wire Line
	5700 3700 6100 3700
Wire Wire Line
	8850 3850 9600 3850
Wire Wire Line
	9100 4300 9600 4300
Wire Wire Line
	6900 3700 7400 3700
Wire Wire Line
	7050 3700 7050 3800
Connection ~ 7050 3700
Wire Wire Line
	7250 3700 7250 3800
Connection ~ 7250 3700
Wire Wire Line
	7850 3700 7850 3850
Wire Wire Line
	8000 3700 8000 3850
Connection ~ 7850 3700
Wire Wire Line
	8000 4300 8000 4050
Wire Wire Line
	5700 4300 8000 4300
Wire Wire Line
	7850 4150 7850 4300
Connection ~ 7850 4300
Wire Wire Line
	7250 4100 7250 4300
Connection ~ 7250 4300
Wire Wire Line
	7050 4100 7050 4300
Connection ~ 7050 4300
Wire Wire Line
	9100 4050 9100 4300
Wire Wire Line
	7650 5050 7950 5050
Wire Wire Line
	6350 5050 6550 5050
Wire Wire Line
	5700 5050 6050 5050
Wire Wire Line
	8800 5200 9550 5200
Wire Wire Line
	9050 5650 9550 5650
Wire Wire Line
	6850 5050 7350 5050
Wire Wire Line
	7000 5050 7000 5150
Connection ~ 7000 5050
Wire Wire Line
	7200 5050 7200 5150
Connection ~ 7200 5050
Wire Wire Line
	7800 5050 7800 5200
Wire Wire Line
	7950 5050 7950 5200
Connection ~ 7800 5050
Wire Wire Line
	7950 5650 7950 5400
Wire Wire Line
	5700 5650 7950 5650
Wire Wire Line
	7800 5500 7800 5650
Connection ~ 7800 5650
Wire Wire Line
	7200 5450 7200 5650
Connection ~ 7200 5650
Wire Wire Line
	7000 5450 7000 5650
Connection ~ 7000 5650
Wire Wire Line
	9050 5400 9050 5650
Wire Wire Line
	8000 1300 8200 1300
Wire Wire Line
	8000 1500 8200 1500
Wire Wire Line
	8800 1500 9100 1500
Wire Wire Line
	8000 2550 8200 2550
Wire Wire Line
	8800 2750 9100 2750
Wire Wire Line
	8000 2750 8200 2750
Wire Wire Line
	8000 3850 8250 3850
Wire Wire Line
	8000 4050 8250 4050
Wire Wire Line
	8850 4050 9100 4050
Wire Wire Line
	7950 5200 8200 5200
Wire Wire Line
	7950 5400 8200 5400
Wire Wire Line
	8800 5400 9050 5400
Wire Wire Line
	4050 4400 4550 4400
$Comp
L C C5
U 1 1 582C737E
P 4250 1650
F 0 "C5" H 4250 1750 40  0000 L CNN
F 1 "15n" H 4256 1565 40  0000 L CNN
F 2 "AutomataFootprint:C_0805_AUTOMATA" H 4288 1500 30  0000 C CNN
F 3 "~" H 4250 1650 60  0000 C CNN
	1    4250 1650
	1    0    0    -1  
$EndComp
$Comp
L C C6
U 1 1 582C738B
P 4250 2900
F 0 "C6" H 4250 3000 40  0000 L CNN
F 1 "15n" H 4256 2815 40  0000 L CNN
F 2 "AutomataFootprint:C_0805_AUTOMATA" H 4288 2750 30  0000 C CNN
F 3 "~" H 4250 2900 60  0000 C CNN
	1    4250 2900
	1    0    0    -1  
$EndComp
$Comp
L C C7
U 1 1 582C7391
P 4250 4200
F 0 "C7" H 4250 4300 40  0000 L CNN
F 1 "15n" H 4256 4115 40  0000 L CNN
F 2 "AutomataFootprint:C_0805_AUTOMATA" H 4288 4050 30  0000 C CNN
F 3 "~" H 4250 4200 60  0000 C CNN
	1    4250 4200
	1    0    0    -1  
$EndComp
$Comp
L C C8
U 1 1 582C7397
P 4250 5550
F 0 "C8" H 4250 5650 40  0000 L CNN
F 1 "15n" H 4256 5465 40  0000 L CNN
F 2 "AutomataFootprint:C_0805_AUTOMATA" H 4288 5400 30  0000 C CNN
F 3 "~" H 4250 5550 60  0000 C CNN
	1    4250 5550
	1    0    0    -1  
$EndComp
$Comp
L C C14
U 1 1 582C739D
P 9300 1550
F 0 "C14" H 9300 1650 40  0000 L CNN
F 1 "15n" H 9306 1465 40  0000 L CNN
F 2 "AutomataFootprint:C_0805_AUTOMATA" H 9338 1400 30  0000 C CNN
F 3 "~" H 9300 1550 60  0000 C CNN
	1    9300 1550
	1    0    0    -1  
$EndComp
$Comp
L C C15
U 1 1 582C73A3
P 9300 2800
F 0 "C15" H 9300 2900 40  0000 L CNN
F 1 "15n" H 9306 2715 40  0000 L CNN
F 2 "AutomataFootprint:C_0805_AUTOMATA" H 9338 2650 30  0000 C CNN
F 3 "~" H 9300 2800 60  0000 C CNN
	1    9300 2800
	1    0    0    -1  
$EndComp
$Comp
L C C16
U 1 1 582C73A9
P 9300 4100
F 0 "C16" H 9300 4200 40  0000 L CNN
F 1 "15n" H 9306 4015 40  0000 L CNN
F 2 "AutomataFootprint:C_0805_AUTOMATA" H 9338 3950 30  0000 C CNN
F 3 "~" H 9300 4100 60  0000 C CNN
	1    9300 4100
	1    0    0    -1  
$EndComp
$Comp
L C C13
U 1 1 582C73AF
P 9250 5450
F 0 "C13" H 9250 5550 40  0000 L CNN
F 1 "15n" H 9256 5365 40  0000 L CNN
F 2 "AutomataFootprint:C_0805_AUTOMATA" H 9288 5300 30  0000 C CNN
F 3 "~" H 9250 5450 60  0000 C CNN
	1    9250 5450
	1    0    0    -1  
$EndComp
Wire Wire Line
	4250 1400 4250 1500
Connection ~ 4250 1400
Wire Wire Line
	4250 2650 4250 2750
Connection ~ 4250 2650
Wire Wire Line
	4250 3950 4250 4050
Connection ~ 4250 3950
Connection ~ 4250 3100
Connection ~ 4250 4400
Connection ~ 4250 1850
Connection ~ 4250 5750
Wire Wire Line
	4250 5300 4250 5400
Connection ~ 4250 5300
Connection ~ 9300 1750
Wire Wire Line
	9300 1300 9300 1400
Connection ~ 9300 1300
Connection ~ 9300 3000
Wire Wire Line
	9300 2550 9300 2650
Connection ~ 9300 2550
Wire Wire Line
	9300 3850 9300 3950
Connection ~ 9300 3850
Connection ~ 9300 4300
Connection ~ 9250 5650
Wire Wire Line
	9250 5200 9250 5300
Connection ~ 9250 5200
$Comp
L D_Zener D2
U 1 1 5AACED92
P 1200 1250
F 0 "D2" H 1200 1350 50  0000 C CNN
F 1 "D_Zener" H 1200 1150 50  0000 C CNN
F 2 "AutomataFootprint1:SOD123" H 1200 1250 50  0001 C CNN
F 3 "" H 1200 1250 50  0001 C CNN
	1    1200 1250
	1    0    0    -1  
$EndComp
$Comp
L D_Zener D6
U 1 1 5AACEFF9
P 2000 1550
F 0 "D6" H 2000 1650 50  0000 C CNN
F 1 "D_Zener" H 2000 1450 50  0000 C CNN
F 2 "AutomataFootprint1:SOD123" H 2000 1550 50  0001 C CNN
F 3 "" H 2000 1550 50  0001 C CNN
	1    2000 1550
	0    1    1    0   
$EndComp
Wire Wire Line
	4250 1800 4250 1850
$Comp
L D_Zener D3
U 1 1 5AAD1AA3
P 1200 2500
F 0 "D3" H 1200 2600 50  0000 C CNN
F 1 "D_Zener" H 1200 2400 50  0000 C CNN
F 2 "AutomataFootprint1:SOD123" H 1200 2500 50  0001 C CNN
F 3 "" H 1200 2500 50  0001 C CNN
	1    1200 2500
	1    0    0    -1  
$EndComp
$Comp
L D_Zener D4
U 1 1 5AAD1BFF
P 1200 3800
F 0 "D4" H 1200 3900 50  0000 C CNN
F 1 "D_Zener" H 1200 3700 50  0000 C CNN
F 2 "AutomataFootprint1:SOD123" H 1200 3800 50  0001 C CNN
F 3 "" H 1200 3800 50  0001 C CNN
	1    1200 3800
	1    0    0    -1  
$EndComp
$Comp
L D_Zener D1
U 1 1 5AAD1D60
P 1150 5150
F 0 "D1" H 1150 5250 50  0000 C CNN
F 1 "D_Zener" H 1150 5050 50  0000 C CNN
F 2 "AutomataFootprint1:SOD123" H 1150 5150 50  0001 C CNN
F 3 "" H 1150 5150 50  0001 C CNN
	1    1150 5150
	1    0    0    -1  
$EndComp
$Comp
L D_Zener D10
U 1 1 5AAD1E60
P 6250 1150
F 0 "D10" H 6250 1250 50  0000 C CNN
F 1 "D_Zener" H 6250 1050 50  0000 C CNN
F 2 "AutomataFootprint1:SOD123" H 6250 1150 50  0001 C CNN
F 3 "" H 6250 1150 50  0001 C CNN
	1    6250 1150
	1    0    0    -1  
$EndComp
$Comp
L D_Zener D11
U 1 1 5AAD20EC
P 6250 2400
F 0 "D11" H 6250 2500 50  0000 C CNN
F 1 "D_Zener" H 6250 2300 50  0000 C CNN
F 2 "AutomataFootprint1:SOD123" H 6250 2400 50  0001 C CNN
F 3 "" H 6250 2400 50  0001 C CNN
	1    6250 2400
	1    0    0    -1  
$EndComp
$Comp
L D_Zener D12
U 1 1 5AAD2272
P 6250 3700
F 0 "D12" H 6250 3800 50  0000 C CNN
F 1 "D_Zener" H 6250 3600 50  0000 C CNN
F 2 "AutomataFootprint1:SOD123" H 6250 3700 50  0001 C CNN
F 3 "" H 6250 3700 50  0001 C CNN
	1    6250 3700
	1    0    0    -1  
$EndComp
$Comp
L D_Zener D9
U 1 1 5AAD23F7
P 6200 5050
F 0 "D9" H 6200 5150 50  0000 C CNN
F 1 "D_Zener" H 6200 4950 50  0000 C CNN
F 2 "AutomataFootprint1:SOD123" H 6200 5050 50  0001 C CNN
F 3 "" H 6200 5050 50  0001 C CNN
	1    6200 5050
	1    0    0    -1  
$EndComp
$Comp
L D_Zener D14
U 1 1 5AAD2537
P 7050 1400
F 0 "D14" H 7050 1500 50  0000 C CNN
F 1 "D_Zener" H 7050 1300 50  0000 C CNN
F 2 "AutomataFootprint1:SOD123" H 7050 1400 50  0001 C CNN
F 3 "" H 7050 1400 50  0001 C CNN
	1    7050 1400
	0    1    1    0   
$EndComp
$Comp
L D_Zener D15
U 1 1 5AAD275C
P 7050 2650
F 0 "D15" H 7050 2750 50  0000 C CNN
F 1 "D_Zener" H 7050 2550 50  0000 C CNN
F 2 "AutomataFootprint1:SOD123" H 7050 2650 50  0001 C CNN
F 3 "" H 7050 2650 50  0001 C CNN
	1    7050 2650
	0    1    1    0   
$EndComp
$Comp
L D_Zener D7
U 1 1 5AAD285E
P 2000 2750
F 0 "D7" H 2000 2850 50  0000 C CNN
F 1 "D_Zener" H 2000 2650 50  0000 C CNN
F 2 "AutomataFootprint1:SOD123" H 2000 2750 50  0001 C CNN
F 3 "" H 2000 2750 50  0001 C CNN
	1    2000 2750
	0    1    1    0   
$EndComp
$Comp
L D_Zener D8
U 1 1 5AAD29C9
P 2000 4050
F 0 "D8" H 2000 4150 50  0000 C CNN
F 1 "D_Zener" H 2000 3950 50  0000 C CNN
F 2 "AutomataFootprint1:SOD123" H 2000 4050 50  0001 C CNN
F 3 "" H 2000 4050 50  0001 C CNN
	1    2000 4050
	0    1    1    0   
$EndComp
$Comp
L D_Zener D16
U 1 1 5AAD2ADF
P 7050 3950
F 0 "D16" H 7050 4050 50  0000 C CNN
F 1 "D_Zener" H 7050 3850 50  0000 C CNN
F 2 "AutomataFootprint1:SOD123" H 7050 3950 50  0001 C CNN
F 3 "" H 7050 3950 50  0001 C CNN
	1    7050 3950
	0    1    1    0   
$EndComp
$Comp
L D_Zener D13
U 1 1 5AAD2C36
P 7000 5300
F 0 "D13" H 7000 5400 50  0000 C CNN
F 1 "D_Zener" H 7000 5200 50  0000 C CNN
F 2 "AutomataFootprint1:SOD123" H 7000 5300 50  0001 C CNN
F 3 "" H 7000 5300 50  0001 C CNN
	1    7000 5300
	0    1    1    0   
$EndComp
$Comp
L D_Zener D5
U 1 1 5AAD2D58
P 1950 5400
F 0 "D5" H 1950 5500 50  0000 C CNN
F 1 "D_Zener" H 1950 5300 50  0000 C CNN
F 2 "AutomataFootprint1:SOD123" H 1950 5400 50  0001 C CNN
F 3 "" H 1950 5400 50  0001 C CNN
	1    1950 5400
	0    1    1    0   
$EndComp
Wire Wire Line
	4250 4350 4250 4400
Wire Wire Line
	1300 5150 1500 5150
Wire Wire Line
	4250 5700 4250 5750
Wire Wire Line
	9250 5600 9250 5650
Wire Wire Line
	9300 1700 9300 1750
Wire Wire Line
	9300 2950 9300 3000
Wire Wire Line
	9300 4250 9300 4300
$Comp
L Conn_02x10_Odd_Even J1
U 1 1 5AACEFC0
P 4300 7100
F 0 "J1" H 4350 7600 50  0000 C CNN
F 1 "Conn_02x10_Odd_Even" H 4350 6500 50  0000 C CNN
F 2 "Input module:io_module_smd_12x2_automata_2.5" H 4300 7100 50  0001 C CNN
F 3 "" H 4300 7100 50  0001 C CNN
	1    4300 7100
	1    0    0    1   
$EndComp
Wire Wire Line
	3750 6600 4100 6600
Wire Wire Line
	3750 6700 4100 6700
Wire Wire Line
	3750 6800 4100 6800
Wire Wire Line
	3750 6900 4100 6900
Wire Wire Line
	3750 7000 4100 7000
Wire Wire Line
	3750 7100 4100 7100
Wire Wire Line
	3750 7200 4100 7200
Wire Wire Line
	3750 7300 4100 7300
Wire Wire Line
	3750 7400 4100 7400
Wire Wire Line
	3750 7500 4100 7500
Wire Wire Line
	4600 6600 5000 6600
Wire Wire Line
	5000 6700 4600 6700
Wire Wire Line
	5000 6800 4600 6800
Wire Wire Line
	5000 6900 4600 6900
Wire Wire Line
	5000 7000 4600 7000
Wire Wire Line
	5000 7100 4600 7100
Wire Wire Line
	5000 7200 4600 7200
Wire Wire Line
	5000 7300 4600 7300
Wire Wire Line
	5000 7400 4600 7400
Wire Wire Line
	5000 7500 4600 7500
Text Label 3750 6600 0    60   ~ 0
EXT_IP1
Text Label 3750 6700 0    60   ~ 0
EXT_IP2
Text Label 3750 6800 0    60   ~ 0
EXT_IP3
Text Label 3750 6900 0    60   ~ 0
EXT_IP4
Text Label 3750 7000 0    60   ~ 0
EXT_IP5
Text Label 3750 7100 0    60   ~ 0
EXT_IP6
Text Label 3750 7200 0    60   ~ 0
EXT_IP7
Text Label 3750 7300 0    60   ~ 0
EXT_IP8
Text Label 3750 7400 0    60   ~ 0
GND
Text Label 5000 7400 0    60   ~ 0
24_VCC
Text Label 5000 6600 0    60   ~ 0
I1
Text Label 5000 6700 0    60   ~ 0
I2
Text Label 5000 6800 0    60   ~ 0
I3
Text Label 5000 6900 0    60   ~ 0
I4
Text Label 5000 7000 0    60   ~ 0
I5
Text Label 5000 7100 0    60   ~ 0
I6
Text Label 5000 7200 0    60   ~ 0
I7
Text Label 5000 7300 0    60   ~ 0
I8
Text Label 5000 7500 0    60   ~ 0
24_GND
Text Label 3750 7500 0    60   ~ 0
GND
Text Label 650  1250 0    60   ~ 0
EXT_IP1
Text Label 650  1850 0    60   ~ 0
GND
Text Label 600  2500 0    60   ~ 0
EXT_IP2
Text Label 650  3100 0    60   ~ 0
GND
Text Label 700  4400 0    60   ~ 0
GND
Text Label 700  3800 0    60   ~ 0
EXT_IP3
Text Label 650  5150 0    60   ~ 0
EXT_IP4
Text Label 650  5750 0    60   ~ 0
GND
Text Label 5700 1750 0    60   ~ 0
GND
Text Label 5700 3000 0    60   ~ 0
GND
Text Label 5700 5650 0    60   ~ 0
GND
Text Label 5700 4300 0    60   ~ 0
GND
Text Label 5700 1150 0    60   ~ 0
EXT_IP5
Text Label 5700 2400 0    60   ~ 0
EXT_IP6
Text Label 5700 3700 0    60   ~ 0
EXT_IP7
Text Label 5700 5050 0    60   ~ 0
EXT_IP8
Text Label 4550 1850 0    60   ~ 0
24_GND
Text Label 4550 3100 0    60   ~ 0
24_GND
Text Label 4450 5750 0    60   ~ 0
24_GND
Text Label 4550 4400 0    60   ~ 0
24_GND
Text Label 9600 1750 0    60   ~ 0
24_GND
Text Label 9600 3000 0    60   ~ 0
24_GND
Text Label 9600 4300 0    60   ~ 0
24_GND
Text Label 9550 5650 0    60   ~ 0
24_GND
Text Label 4550 1400 0    60   ~ 0
I1
Text Label 4550 2650 0    60   ~ 0
I2
Text Label 4600 3950 0    60   ~ 0
I3
Text Label 4500 5300 0    60   ~ 0
I4
Text Label 9600 1300 0    60   ~ 0
I5
Text Label 9600 2550 0    60   ~ 0
I6
Text Label 9600 3850 0    60   ~ 0
I7
Text Label 9550 5200 0    60   ~ 0
I8
Wire Wire Line
	4250 3050 4250 3100
$EndSCHEMATC
