EESchema Schematic File Version 2  date 9/9/2016 1:23:12 PM
LIBS:power
LIBS:device
LIBS:transistors
LIBS:conn
LIBS:linear
LIBS:regul
LIBS:74xx
LIBS:cmos4000
LIBS:adc-dac
LIBS:memory
LIBS:xilinx
LIBS:special
LIBS:microcontrollers
LIBS:dsp
LIBS:microchip
LIBS:analog_switches
LIBS:motorola
LIBS:texas
LIBS:intel
LIBS:audio
LIBS:interface
LIBS:digital-audio
LIBS:philips
LIBS:display
LIBS:cypress
LIBS:siliconi
LIBS:opto
LIBS:atmel
LIBS:contrib
LIBS:valves
EELAYER 27 0
EELAYER END
$Descr A4 11693 8268
encoding utf-8
Sheet 2 2
Title "ISOLATED INPUT CIRCUIT"
Date "9 sep 2016"
Rev ""
Comp ""
Comment1 ""
Comment2 ""
Comment3 ""
Comment4 ""
$EndDescr
$Comp
L ZENER D4
U 1 1 55D3BAC8
P 1200 1250
AR Path="/55C2DD79/55C4C2D1/55D3BAC8" Ref="D4"  Part="1" 
AR Path="/55C2DD79/55C50F63/55D3BAC8" Ref="D16"  Part="1" 
AR Path="/55C2DD79/55C519D4/55D3BAC8" Ref="D28"  Part="1" 
AR Path="/57D26038/55D3BAC8" Ref="D4"  Part="1" 
F 0 "D4" H 1200 1350 50  0000 C CNN
F 1 "6.8V_Z" H 1200 1150 40  0000 C CNN
F 2 "~" H 1200 1250 60  0000 C CNN
F 3 "~" H 1200 1250 60  0000 C CNN
	1    1200 1250
	-1   0    0    1   
$EndComp
$Comp
L R R28
U 1 1 55D3E2A4
P 1700 1250
AR Path="/55C2DD79/55C4C2D1/55D3E2A4" Ref="R28"  Part="1" 
AR Path="/55C2DD79/55C50F63/55D3E2A4" Ref="R48"  Part="1" 
AR Path="/55C2DD79/55C519D4/55D3E2A4" Ref="R68"  Part="1" 
AR Path="/57D26038/55D3E2A4" Ref="R28"  Part="1" 
F 0 "R28" V 1780 1250 40  0000 C CNN
F 1 "1K" V 1707 1251 40  0000 C CNN
F 2 "~" V 1630 1250 30  0000 C CNN
F 3 "~" H 1700 1250 30  0000 C CNN
	1    1700 1250
	0    1    1    0   
$EndComp
$Comp
L R R32
U 1 1 55D3E532
P 2500 1250
AR Path="/55C2DD79/55C4C2D1/55D3E532" Ref="R32"  Part="1" 
AR Path="/55C2DD79/55C50F63/55D3E532" Ref="R52"  Part="1" 
AR Path="/55C2DD79/55C519D4/55D3E532" Ref="R72"  Part="1" 
AR Path="/57D26038/55D3E532" Ref="R32"  Part="1" 
F 0 "R32" V 2580 1250 40  0000 C CNN
F 1 "1K" V 2507 1251 40  0000 C CNN
F 2 "~" V 2430 1250 30  0000 C CNN
F 3 "~" H 2500 1250 30  0000 C CNN
	1    2500 1250
	0    1    1    0   
$EndComp
$Comp
L R R36
U 1 1 55D3FD49
P 2800 1550
AR Path="/55C2DD79/55C4C2D1/55D3FD49" Ref="R36"  Part="1" 
AR Path="/55C2DD79/55C50F63/55D3FD49" Ref="R56"  Part="1" 
AR Path="/55C2DD79/55C519D4/55D3FD49" Ref="R76"  Part="1" 
AR Path="/57D26038/55D3FD49" Ref="R36"  Part="1" 
F 0 "R36" V 2880 1550 40  0000 C CNN
F 1 "10K" V 2807 1551 40  0000 C CNN
F 2 "~" V 2730 1550 30  0000 C CNN
F 3 "~" H 2800 1550 30  0000 C CNN
	1    2800 1550
	1    0    0    -1  
$EndComp
$Comp
L ZENER D8
U 1 1 55D4571E
P 2000 1500
AR Path="/55C2DD79/55C4C2D1/55D4571E" Ref="D8"  Part="1" 
AR Path="/55C2DD79/55C50F63/55D4571E" Ref="D20"  Part="1" 
AR Path="/55C2DD79/55C519D4/55D4571E" Ref="D32"  Part="1" 
AR Path="/57D26038/55D4571E" Ref="D8"  Part="1" 
F 0 "D8" H 2000 1600 50  0000 C CNN
F 1 "10V_Z" H 2000 1400 40  0000 C CNN
F 2 "~" H 2000 1500 60  0000 C CNN
F 3 "~" H 2000 1500 60  0000 C CNN
	1    2000 1500
	0    -1   -1   0   
$EndComp
$Comp
L C C2
U 1 1 55D53E77
P 2200 1500
AR Path="/55C2DD79/55C4C2D1/55D53E77" Ref="C2"  Part="1" 
AR Path="/55C2DD79/55C50F63/55D53E77" Ref="C10"  Part="1" 
AR Path="/55C2DD79/55C519D4/55D53E77" Ref="C18"  Part="1" 
AR Path="/57D26038/55D53E77" Ref="C2"  Part="1" 
F 0 "C2" H 2200 1600 40  0000 L CNN
F 1 "15n" H 2206 1415 40  0000 L CNN
F 2 "~" H 2238 1350 30  0000 C CNN
F 3 "~" H 2200 1500 60  0000 C CNN
	1    2200 1500
	1    0    0    -1  
$EndComp
Text Label 900  1250 2    60   ~ 0
IN0
$Comp
L R R40
U 1 1 55D6B09F
P 4400 1250
AR Path="/55C2DD79/55C4C2D1/55D6B09F" Ref="R40"  Part="1" 
AR Path="/55C2DD79/55C50F63/55D6B09F" Ref="R60"  Part="1" 
AR Path="/55C2DD79/55C519D4/55D6B09F" Ref="R80"  Part="1" 
AR Path="/57D26038/55D6B09F" Ref="R40"  Part="1" 
F 0 "R40" V 4480 1250 40  0000 C CNN
F 1 "4.7K" V 4407 1251 40  0000 C CNN
F 2 "~" V 4330 1250 30  0000 C CNN
F 3 "~" H 4400 1250 30  0000 C CNN
	1    4400 1250
	0    -1   -1   0   
$EndComp
$Comp
L C C6
U 1 1 55D6D72D
P 4350 1600
AR Path="/55C2DD79/55C4C2D1/55D6D72D" Ref="C6"  Part="1" 
AR Path="/55C2DD79/55C50F63/55D6D72D" Ref="C14"  Part="1" 
AR Path="/55C2DD79/55C519D4/55D6D72D" Ref="C22"  Part="1" 
AR Path="/57D26038/55D6D72D" Ref="C6"  Part="1" 
F 0 "C6" H 4350 1700 40  0000 L CNN
F 1 "10n" H 4356 1515 40  0000 L CNN
F 2 "~" H 4388 1450 30  0000 C CNN
F 3 "~" H 4350 1600 60  0000 C CNN
	1    4350 1600
	1    0    0    -1  
$EndComp
Text Label 4650 1150 2    60   ~ 0
5V
Text Label 4400 1400 0    60   ~ 0
DIN0_B
$Comp
L ZENER D5
U 1 1 55C31E95
P 1200 2500
AR Path="/55C2DD79/55C4C2D1/55C31E95" Ref="D5"  Part="1" 
AR Path="/55C2DD79/55C50F63/55C31E95" Ref="D17"  Part="1" 
AR Path="/55C2DD79/55C519D4/55C31E95" Ref="D29"  Part="1" 
AR Path="/57D26038/55C31E95" Ref="D5"  Part="1" 
F 0 "D5" H 1200 2600 50  0000 C CNN
F 1 "6.8V_Z" H 1200 2400 40  0000 C CNN
F 2 "~" H 1200 2500 60  0000 C CNN
F 3 "~" H 1200 2500 60  0000 C CNN
	1    1200 2500
	-1   0    0    1   
$EndComp
$Comp
L R R29
U 1 1 55C31E9B
P 1700 2500
AR Path="/55C2DD79/55C4C2D1/55C31E9B" Ref="R29"  Part="1" 
AR Path="/55C2DD79/55C50F63/55C31E9B" Ref="R49"  Part="1" 
AR Path="/55C2DD79/55C519D4/55C31E9B" Ref="R69"  Part="1" 
AR Path="/57D26038/55C31E9B" Ref="R29"  Part="1" 
F 0 "R29" V 1780 2500 40  0000 C CNN
F 1 "1K" V 1707 2501 40  0000 C CNN
F 2 "~" V 1630 2500 30  0000 C CNN
F 3 "~" H 1700 2500 30  0000 C CNN
	1    1700 2500
	0    1    1    0   
$EndComp
$Comp
L R R33
U 1 1 55C31EA1
P 2500 2500
AR Path="/55C2DD79/55C4C2D1/55C31EA1" Ref="R33"  Part="1" 
AR Path="/55C2DD79/55C50F63/55C31EA1" Ref="R53"  Part="1" 
AR Path="/55C2DD79/55C519D4/55C31EA1" Ref="R73"  Part="1" 
AR Path="/57D26038/55C31EA1" Ref="R33"  Part="1" 
F 0 "R33" V 2580 2500 40  0000 C CNN
F 1 "1K" V 2507 2501 40  0000 C CNN
F 2 "~" V 2430 2500 30  0000 C CNN
F 3 "~" H 2500 2500 30  0000 C CNN
	1    2500 2500
	0    1    1    0   
$EndComp
$Comp
L R R37
U 1 1 55C31EA7
P 2800 2800
AR Path="/55C2DD79/55C4C2D1/55C31EA7" Ref="R37"  Part="1" 
AR Path="/55C2DD79/55C50F63/55C31EA7" Ref="R57"  Part="1" 
AR Path="/55C2DD79/55C519D4/55C31EA7" Ref="R77"  Part="1" 
AR Path="/57D26038/55C31EA7" Ref="R37"  Part="1" 
F 0 "R37" V 2880 2800 40  0000 C CNN
F 1 "10K" V 2807 2801 40  0000 C CNN
F 2 "~" V 2730 2800 30  0000 C CNN
F 3 "~" H 2800 2800 30  0000 C CNN
	1    2800 2800
	1    0    0    -1  
$EndComp
$Comp
L ZENER D9
U 1 1 55C31EAD
P 2000 2750
AR Path="/55C2DD79/55C4C2D1/55C31EAD" Ref="D9"  Part="1" 
AR Path="/55C2DD79/55C50F63/55C31EAD" Ref="D21"  Part="1" 
AR Path="/55C2DD79/55C519D4/55C31EAD" Ref="D33"  Part="1" 
AR Path="/57D26038/55C31EAD" Ref="D9"  Part="1" 
F 0 "D9" H 2000 2850 50  0000 C CNN
F 1 "10V_Z" H 2000 2650 40  0000 C CNN
F 2 "~" H 2000 2750 60  0000 C CNN
F 3 "~" H 2000 2750 60  0000 C CNN
	1    2000 2750
	0    -1   -1   0   
$EndComp
$Comp
L C C3
U 1 1 55C31EB3
P 2200 2750
AR Path="/55C2DD79/55C4C2D1/55C31EB3" Ref="C3"  Part="1" 
AR Path="/55C2DD79/55C50F63/55C31EB3" Ref="C11"  Part="1" 
AR Path="/55C2DD79/55C519D4/55C31EB3" Ref="C19"  Part="1" 
AR Path="/57D26038/55C31EB3" Ref="C3"  Part="1" 
F 0 "C3" H 2200 2850 40  0000 L CNN
F 1 "15n" H 2206 2665 40  0000 L CNN
F 2 "~" H 2238 2600 30  0000 C CNN
F 3 "~" H 2200 2750 60  0000 C CNN
	1    2200 2750
	1    0    0    -1  
$EndComp
Text Label 900  2500 2    60   ~ 0
IN1
$Comp
L R R41
U 1 1 55C31EBA
P 4400 2500
AR Path="/55C2DD79/55C4C2D1/55C31EBA" Ref="R41"  Part="1" 
AR Path="/55C2DD79/55C50F63/55C31EBA" Ref="R61"  Part="1" 
AR Path="/55C2DD79/55C519D4/55C31EBA" Ref="R81"  Part="1" 
AR Path="/57D26038/55C31EBA" Ref="R41"  Part="1" 
F 0 "R41" V 4480 2500 40  0000 C CNN
F 1 "4.7K" V 4407 2501 40  0000 C CNN
F 2 "~" V 4330 2500 30  0000 C CNN
F 3 "~" H 4400 2500 30  0000 C CNN
	1    4400 2500
	0    -1   -1   0   
$EndComp
$Comp
L C C7
U 1 1 55C31EC0
P 4350 2850
AR Path="/55C2DD79/55C4C2D1/55C31EC0" Ref="C7"  Part="1" 
AR Path="/55C2DD79/55C50F63/55C31EC0" Ref="C15"  Part="1" 
AR Path="/55C2DD79/55C519D4/55C31EC0" Ref="C23"  Part="1" 
AR Path="/57D26038/55C31EC0" Ref="C7"  Part="1" 
F 0 "C7" H 4350 2950 40  0000 L CNN
F 1 "10n" H 4356 2765 40  0000 L CNN
F 2 "~" H 4388 2700 30  0000 C CNN
F 3 "~" H 4350 2850 60  0000 C CNN
	1    4350 2850
	1    0    0    -1  
$EndComp
Text Label 4650 2400 2    60   ~ 0
5V
Text Label 4400 2650 0    60   ~ 0
DIN1_B
Text Label 3400 6650 0    60   ~ 0
IN0
Text Label 3400 6750 0    60   ~ 0
IN1
Text Label 3400 6850 0    60   ~ 0
IN2
Text Label 3400 6950 0    60   ~ 0
IN3
Text Label 1850 6650 2    60   ~ 0
DIN0_B
$Comp
L ZENER D6
U 1 1 55C4CB99
P 1200 3800
AR Path="/55C2DD79/55C4C2D1/55C4CB99" Ref="D6"  Part="1" 
AR Path="/55C2DD79/55C50F63/55C4CB99" Ref="D18"  Part="1" 
AR Path="/55C2DD79/55C519D4/55C4CB99" Ref="D30"  Part="1" 
AR Path="/57D26038/55C4CB99" Ref="D6"  Part="1" 
F 0 "D6" H 1200 3900 50  0000 C CNN
F 1 "6.8V_Z" H 1200 3700 40  0000 C CNN
F 2 "~" H 1200 3800 60  0000 C CNN
F 3 "~" H 1200 3800 60  0000 C CNN
	1    1200 3800
	-1   0    0    1   
$EndComp
$Comp
L R R30
U 1 1 55C4CB9F
P 1700 3800
AR Path="/55C2DD79/55C4C2D1/55C4CB9F" Ref="R30"  Part="1" 
AR Path="/55C2DD79/55C50F63/55C4CB9F" Ref="R50"  Part="1" 
AR Path="/55C2DD79/55C519D4/55C4CB9F" Ref="R70"  Part="1" 
AR Path="/57D26038/55C4CB9F" Ref="R30"  Part="1" 
F 0 "R30" V 1780 3800 40  0000 C CNN
F 1 "1K" V 1707 3801 40  0000 C CNN
F 2 "~" V 1630 3800 30  0000 C CNN
F 3 "~" H 1700 3800 30  0000 C CNN
	1    1700 3800
	0    1    1    0   
$EndComp
$Comp
L R R34
U 1 1 55C4CBA5
P 2500 3800
AR Path="/55C2DD79/55C4C2D1/55C4CBA5" Ref="R34"  Part="1" 
AR Path="/55C2DD79/55C50F63/55C4CBA5" Ref="R54"  Part="1" 
AR Path="/55C2DD79/55C519D4/55C4CBA5" Ref="R74"  Part="1" 
AR Path="/57D26038/55C4CBA5" Ref="R34"  Part="1" 
F 0 "R34" V 2580 3800 40  0000 C CNN
F 1 "1K" V 2507 3801 40  0000 C CNN
F 2 "~" V 2430 3800 30  0000 C CNN
F 3 "~" H 2500 3800 30  0000 C CNN
	1    2500 3800
	0    1    1    0   
$EndComp
$Comp
L R R38
U 1 1 55C4CBAB
P 2800 4100
AR Path="/55C2DD79/55C4C2D1/55C4CBAB" Ref="R38"  Part="1" 
AR Path="/55C2DD79/55C50F63/55C4CBAB" Ref="R58"  Part="1" 
AR Path="/55C2DD79/55C519D4/55C4CBAB" Ref="R78"  Part="1" 
AR Path="/57D26038/55C4CBAB" Ref="R38"  Part="1" 
F 0 "R38" V 2880 4100 40  0000 C CNN
F 1 "10K" V 2807 4101 40  0000 C CNN
F 2 "~" V 2730 4100 30  0000 C CNN
F 3 "~" H 2800 4100 30  0000 C CNN
	1    2800 4100
	1    0    0    -1  
$EndComp
$Comp
L ZENER D10
U 1 1 55C4CBB1
P 2000 4050
AR Path="/55C2DD79/55C4C2D1/55C4CBB1" Ref="D10"  Part="1" 
AR Path="/55C2DD79/55C50F63/55C4CBB1" Ref="D22"  Part="1" 
AR Path="/55C2DD79/55C519D4/55C4CBB1" Ref="D34"  Part="1" 
AR Path="/57D26038/55C4CBB1" Ref="D10"  Part="1" 
F 0 "D10" H 2000 4150 50  0000 C CNN
F 1 "10V_Z" H 2000 3950 40  0000 C CNN
F 2 "~" H 2000 4050 60  0000 C CNN
F 3 "~" H 2000 4050 60  0000 C CNN
	1    2000 4050
	0    -1   -1   0   
$EndComp
$Comp
L C C4
U 1 1 55C4CBB7
P 2200 4050
AR Path="/55C2DD79/55C4C2D1/55C4CBB7" Ref="C4"  Part="1" 
AR Path="/55C2DD79/55C50F63/55C4CBB7" Ref="C12"  Part="1" 
AR Path="/55C2DD79/55C519D4/55C4CBB7" Ref="C20"  Part="1" 
AR Path="/57D26038/55C4CBB7" Ref="C4"  Part="1" 
F 0 "C4" H 2200 4150 40  0000 L CNN
F 1 "15n" H 2206 3965 40  0000 L CNN
F 2 "~" H 2238 3900 30  0000 C CNN
F 3 "~" H 2200 4050 60  0000 C CNN
	1    2200 4050
	1    0    0    -1  
$EndComp
Text Label 900  3800 2    60   ~ 0
IN2
$Comp
L R R42
U 1 1 55C4CBBE
P 4400 3800
AR Path="/55C2DD79/55C4C2D1/55C4CBBE" Ref="R42"  Part="1" 
AR Path="/55C2DD79/55C50F63/55C4CBBE" Ref="R62"  Part="1" 
AR Path="/55C2DD79/55C519D4/55C4CBBE" Ref="R82"  Part="1" 
AR Path="/57D26038/55C4CBBE" Ref="R42"  Part="1" 
F 0 "R42" V 4480 3800 40  0000 C CNN
F 1 "4.7K" V 4407 3801 40  0000 C CNN
F 2 "~" V 4330 3800 30  0000 C CNN
F 3 "~" H 4400 3800 30  0000 C CNN
	1    4400 3800
	0    -1   -1   0   
$EndComp
$Comp
L C C8
U 1 1 55C4CBC4
P 4350 4150
AR Path="/55C2DD79/55C4C2D1/55C4CBC4" Ref="C8"  Part="1" 
AR Path="/55C2DD79/55C50F63/55C4CBC4" Ref="C16"  Part="1" 
AR Path="/55C2DD79/55C519D4/55C4CBC4" Ref="C24"  Part="1" 
AR Path="/57D26038/55C4CBC4" Ref="C8"  Part="1" 
F 0 "C8" H 4350 4250 40  0000 L CNN
F 1 "10n" H 4356 4065 40  0000 L CNN
F 2 "~" H 4388 4000 30  0000 C CNN
F 3 "~" H 4350 4150 60  0000 C CNN
	1    4350 4150
	1    0    0    -1  
$EndComp
Text Label 4650 3700 2    60   ~ 0
5V
Text Label 4400 3950 0    60   ~ 0
DIN2_B
$Comp
L ZENER D3
U 1 1 55C4CBD4
P 1150 5150
AR Path="/55C2DD79/55C4C2D1/55C4CBD4" Ref="D3"  Part="1" 
AR Path="/55C2DD79/55C50F63/55C4CBD4" Ref="D15"  Part="1" 
AR Path="/55C2DD79/55C519D4/55C4CBD4" Ref="D27"  Part="1" 
AR Path="/57D26038/55C4CBD4" Ref="D3"  Part="1" 
F 0 "D3" H 1150 5250 50  0000 C CNN
F 1 "6.8V_Z" H 1150 5050 40  0000 C CNN
F 2 "~" H 1150 5150 60  0000 C CNN
F 3 "~" H 1150 5150 60  0000 C CNN
	1    1150 5150
	-1   0    0    1   
$EndComp
$Comp
L R R27
U 1 1 55C4CBDA
P 1650 5150
AR Path="/55C2DD79/55C4C2D1/55C4CBDA" Ref="R27"  Part="1" 
AR Path="/55C2DD79/55C50F63/55C4CBDA" Ref="R47"  Part="1" 
AR Path="/55C2DD79/55C519D4/55C4CBDA" Ref="R67"  Part="1" 
AR Path="/57D26038/55C4CBDA" Ref="R27"  Part="1" 
F 0 "R27" V 1730 5150 40  0000 C CNN
F 1 "1K" V 1657 5151 40  0000 C CNN
F 2 "~" V 1580 5150 30  0000 C CNN
F 3 "~" H 1650 5150 30  0000 C CNN
	1    1650 5150
	0    1    1    0   
$EndComp
$Comp
L R R31
U 1 1 55C4CBE0
P 2450 5150
AR Path="/55C2DD79/55C4C2D1/55C4CBE0" Ref="R31"  Part="1" 
AR Path="/55C2DD79/55C50F63/55C4CBE0" Ref="R51"  Part="1" 
AR Path="/55C2DD79/55C519D4/55C4CBE0" Ref="R71"  Part="1" 
AR Path="/57D26038/55C4CBE0" Ref="R31"  Part="1" 
F 0 "R31" V 2530 5150 40  0000 C CNN
F 1 "1K" V 2457 5151 40  0000 C CNN
F 2 "~" V 2380 5150 30  0000 C CNN
F 3 "~" H 2450 5150 30  0000 C CNN
	1    2450 5150
	0    1    1    0   
$EndComp
$Comp
L R R35
U 1 1 55C4CBE6
P 2750 5450
AR Path="/55C2DD79/55C4C2D1/55C4CBE6" Ref="R35"  Part="1" 
AR Path="/55C2DD79/55C50F63/55C4CBE6" Ref="R55"  Part="1" 
AR Path="/55C2DD79/55C519D4/55C4CBE6" Ref="R75"  Part="1" 
AR Path="/57D26038/55C4CBE6" Ref="R35"  Part="1" 
F 0 "R35" V 2830 5450 40  0000 C CNN
F 1 "10K" V 2757 5451 40  0000 C CNN
F 2 "~" V 2680 5450 30  0000 C CNN
F 3 "~" H 2750 5450 30  0000 C CNN
	1    2750 5450
	1    0    0    -1  
$EndComp
$Comp
L ZENER D7
U 1 1 55C4CBEC
P 1950 5400
AR Path="/55C2DD79/55C4C2D1/55C4CBEC" Ref="D7"  Part="1" 
AR Path="/55C2DD79/55C50F63/55C4CBEC" Ref="D19"  Part="1" 
AR Path="/55C2DD79/55C519D4/55C4CBEC" Ref="D31"  Part="1" 
AR Path="/57D26038/55C4CBEC" Ref="D7"  Part="1" 
F 0 "D7" H 1950 5500 50  0000 C CNN
F 1 "10V_Z" H 1950 5300 40  0000 C CNN
F 2 "~" H 1950 5400 60  0000 C CNN
F 3 "~" H 1950 5400 60  0000 C CNN
	1    1950 5400
	0    -1   -1   0   
$EndComp
$Comp
L C C1
U 1 1 55C4CBF2
P 2150 5400
AR Path="/55C2DD79/55C4C2D1/55C4CBF2" Ref="C1"  Part="1" 
AR Path="/55C2DD79/55C50F63/55C4CBF2" Ref="C9"  Part="1" 
AR Path="/55C2DD79/55C519D4/55C4CBF2" Ref="C17"  Part="1" 
AR Path="/57D26038/55C4CBF2" Ref="C1"  Part="1" 
F 0 "C1" H 2150 5500 40  0000 L CNN
F 1 "15n" H 2156 5315 40  0000 L CNN
F 2 "~" H 2188 5250 30  0000 C CNN
F 3 "~" H 2150 5400 60  0000 C CNN
	1    2150 5400
	1    0    0    -1  
$EndComp
Text Label 850  5150 2    60   ~ 0
IN3
$Comp
L R R39
U 1 1 55C4CBF9
P 4350 5150
AR Path="/55C2DD79/55C4C2D1/55C4CBF9" Ref="R39"  Part="1" 
AR Path="/55C2DD79/55C50F63/55C4CBF9" Ref="R59"  Part="1" 
AR Path="/55C2DD79/55C519D4/55C4CBF9" Ref="R79"  Part="1" 
AR Path="/57D26038/55C4CBF9" Ref="R39"  Part="1" 
F 0 "R39" V 4430 5150 40  0000 C CNN
F 1 "4.7K" V 4357 5151 40  0000 C CNN
F 2 "~" V 4280 5150 30  0000 C CNN
F 3 "~" H 4350 5150 30  0000 C CNN
	1    4350 5150
	0    -1   -1   0   
$EndComp
$Comp
L C C5
U 1 1 55C4CBFF
P 4300 5500
AR Path="/55C2DD79/55C4C2D1/55C4CBFF" Ref="C5"  Part="1" 
AR Path="/55C2DD79/55C50F63/55C4CBFF" Ref="C13"  Part="1" 
AR Path="/55C2DD79/55C519D4/55C4CBFF" Ref="C21"  Part="1" 
AR Path="/57D26038/55C4CBFF" Ref="C5"  Part="1" 
F 0 "C5" H 4300 5600 40  0000 L CNN
F 1 "10n" H 4306 5415 40  0000 L CNN
F 2 "~" H 4338 5350 30  0000 C CNN
F 3 "~" H 4300 5500 60  0000 C CNN
	1    4300 5500
	1    0    0    -1  
$EndComp
Text Label 4600 5050 2    60   ~ 0
5V
Text Label 4350 5300 0    60   ~ 0
DIN3_B
$Comp
L TLP291 IC1
U 1 1 55C8FCCE
P 3450 1500
AR Path="/55C2DD79/55C4C2D1/55C8FCCE" Ref="IC1"  Part="1" 
AR Path="/55C2DD79/55C50F63/55C8FCCE" Ref="IC5"  Part="1" 
AR Path="/55C2DD79/55C519D4/55C8FCCE" Ref="IC9"  Part="1" 
AR Path="/57D26038/55C8FCCE" Ref="IC1"  Part="1" 
F 0 "IC1" H 3237 1678 40  0000 C CNN
F 1 "LV817" H 3599 1316 40  0000 C CNN
F 2 "" H 3286 1326 29  0000 C CNN
F 3 "" H 3450 1500 60  0000 C CNN
	1    3450 1500
	1    0    0    -1  
$EndComp
$Comp
L TLP291 IC2
U 1 1 55C8FCDB
P 3450 2750
AR Path="/55C2DD79/55C4C2D1/55C8FCDB" Ref="IC2"  Part="1" 
AR Path="/55C2DD79/55C50F63/55C8FCDB" Ref="IC6"  Part="1" 
AR Path="/55C2DD79/55C519D4/55C8FCDB" Ref="IC10"  Part="1" 
AR Path="/57D26038/55C8FCDB" Ref="IC2"  Part="1" 
F 0 "IC2" H 3237 2928 40  0000 C CNN
F 1 "LV817" H 3599 2566 40  0000 C CNN
F 2 "" H 3286 2576 29  0000 C CNN
F 3 "" H 3450 2750 60  0000 C CNN
	1    3450 2750
	1    0    0    -1  
$EndComp
$Comp
L TLP291 IC4
U 1 1 55C8FCE1
P 3500 4050
AR Path="/55C2DD79/55C4C2D1/55C8FCE1" Ref="IC4"  Part="1" 
AR Path="/55C2DD79/55C50F63/55C8FCE1" Ref="IC8"  Part="1" 
AR Path="/55C2DD79/55C519D4/55C8FCE1" Ref="IC12"  Part="1" 
AR Path="/57D26038/55C8FCE1" Ref="IC4"  Part="1" 
F 0 "IC4" H 3287 4228 40  0000 C CNN
F 1 "LV817" H 3649 3866 40  0000 C CNN
F 2 "" H 3336 3876 29  0000 C CNN
F 3 "" H 3500 4050 60  0000 C CNN
	1    3500 4050
	1    0    0    -1  
$EndComp
$Comp
L TLP291 IC7
U 1 1 55C8FCE7
P 3450 5400
AR Path="/55C2DD79/55C50F63/55C8FCE7" Ref="IC7"  Part="1" 
AR Path="/55C2DD79/55C519D4/55C8FCE7" Ref="IC11"  Part="1" 
AR Path="/55C2DD79/55C4C2D1/55C8FCE7" Ref="IC3"  Part="1" 
AR Path="/57D26038/55C8FCE7" Ref="IC3"  Part="1" 
F 0 "IC3" H 3237 5578 40  0000 C CNN
F 1 "LV817" H 3599 5216 40  0000 C CNN
F 2 "" H 3286 5226 29  0000 C CNN
F 3 "" H 3450 5400 60  0000 C CNN
	1    3450 5400
	1    0    0    -1  
$EndComp
$Comp
L ZENER D?
U 1 1 57D26209
P 6250 1150
F 0 "D?" H 6250 1250 50  0000 C CNN
F 1 "6.8V_Z" H 6250 1050 40  0000 C CNN
F 2 "~" H 6250 1150 60  0000 C CNN
F 3 "~" H 6250 1150 60  0000 C CNN
	1    6250 1150
	-1   0    0    1   
$EndComp
$Comp
L R R?
U 1 1 57D2620F
P 6750 1150
F 0 "R?" V 6830 1150 40  0000 C CNN
F 1 "1K" V 6757 1151 40  0000 C CNN
F 2 "~" V 6680 1150 30  0000 C CNN
F 3 "~" H 6750 1150 30  0000 C CNN
	1    6750 1150
	0    1    1    0   
$EndComp
$Comp
L R R?
U 1 1 57D26215
P 7550 1150
F 0 "R?" V 7630 1150 40  0000 C CNN
F 1 "1K" V 7557 1151 40  0000 C CNN
F 2 "~" V 7480 1150 30  0000 C CNN
F 3 "~" H 7550 1150 30  0000 C CNN
	1    7550 1150
	0    1    1    0   
$EndComp
$Comp
L R R?
U 1 1 57D2621B
P 7850 1450
F 0 "R?" V 7930 1450 40  0000 C CNN
F 1 "10K" V 7857 1451 40  0000 C CNN
F 2 "~" V 7780 1450 30  0000 C CNN
F 3 "~" H 7850 1450 30  0000 C CNN
	1    7850 1450
	1    0    0    -1  
$EndComp
$Comp
L ZENER D?
U 1 1 57D26221
P 7050 1400
F 0 "D?" H 7050 1500 50  0000 C CNN
F 1 "10V_Z" H 7050 1300 40  0000 C CNN
F 2 "~" H 7050 1400 60  0000 C CNN
F 3 "~" H 7050 1400 60  0000 C CNN
	1    7050 1400
	0    -1   -1   0   
$EndComp
$Comp
L C C?
U 1 1 57D26227
P 7250 1400
F 0 "C?" H 7250 1500 40  0000 L CNN
F 1 "15n" H 7256 1315 40  0000 L CNN
F 2 "~" H 7288 1250 30  0000 C CNN
F 3 "~" H 7250 1400 60  0000 C CNN
	1    7250 1400
	1    0    0    -1  
$EndComp
Text Label 5950 1150 2    60   ~ 0
IN4
$Comp
L R R?
U 1 1 57D2622E
P 9450 1150
F 0 "R?" V 9530 1150 40  0000 C CNN
F 1 "4.7K" V 9457 1151 40  0000 C CNN
F 2 "~" V 9380 1150 30  0000 C CNN
F 3 "~" H 9450 1150 30  0000 C CNN
	1    9450 1150
	0    -1   -1   0   
$EndComp
$Comp
L C C?
U 1 1 57D26234
P 9400 1500
F 0 "C?" H 9400 1600 40  0000 L CNN
F 1 "10n" H 9406 1415 40  0000 L CNN
F 2 "~" H 9438 1350 30  0000 C CNN
F 3 "~" H 9400 1500 60  0000 C CNN
	1    9400 1500
	1    0    0    -1  
$EndComp
Text Label 9700 1050 2    60   ~ 0
5V
Text Label 9450 1300 0    60   ~ 0
DIN4_B
$Comp
L ZENER D?
U 1 1 57D2623E
P 6250 2400
F 0 "D?" H 6250 2500 50  0000 C CNN
F 1 "6.8V_Z" H 6250 2300 40  0000 C CNN
F 2 "~" H 6250 2400 60  0000 C CNN
F 3 "~" H 6250 2400 60  0000 C CNN
	1    6250 2400
	-1   0    0    1   
$EndComp
$Comp
L R R?
U 1 1 57D26244
P 6750 2400
F 0 "R?" V 6830 2400 40  0000 C CNN
F 1 "1K" V 6757 2401 40  0000 C CNN
F 2 "~" V 6680 2400 30  0000 C CNN
F 3 "~" H 6750 2400 30  0000 C CNN
	1    6750 2400
	0    1    1    0   
$EndComp
$Comp
L R R?
U 1 1 57D2624A
P 7550 2400
F 0 "R?" V 7630 2400 40  0000 C CNN
F 1 "1K" V 7557 2401 40  0000 C CNN
F 2 "~" V 7480 2400 30  0000 C CNN
F 3 "~" H 7550 2400 30  0000 C CNN
	1    7550 2400
	0    1    1    0   
$EndComp
$Comp
L R R?
U 1 1 57D26250
P 7850 2700
F 0 "R?" V 7930 2700 40  0000 C CNN
F 1 "10K" V 7857 2701 40  0000 C CNN
F 2 "~" V 7780 2700 30  0000 C CNN
F 3 "~" H 7850 2700 30  0000 C CNN
	1    7850 2700
	1    0    0    -1  
$EndComp
$Comp
L ZENER D?
U 1 1 57D26256
P 7050 2650
F 0 "D?" H 7050 2750 50  0000 C CNN
F 1 "10V_Z" H 7050 2550 40  0000 C CNN
F 2 "~" H 7050 2650 60  0000 C CNN
F 3 "~" H 7050 2650 60  0000 C CNN
	1    7050 2650
	0    -1   -1   0   
$EndComp
$Comp
L C C?
U 1 1 57D2625C
P 7250 2650
F 0 "C?" H 7250 2750 40  0000 L CNN
F 1 "15n" H 7256 2565 40  0000 L CNN
F 2 "~" H 7288 2500 30  0000 C CNN
F 3 "~" H 7250 2650 60  0000 C CNN
	1    7250 2650
	1    0    0    -1  
$EndComp
Text Label 5950 2400 2    60   ~ 0
IN5
$Comp
L R R?
U 1 1 57D26263
P 9450 2400
F 0 "R?" V 9530 2400 40  0000 C CNN
F 1 "4.7K" V 9457 2401 40  0000 C CNN
F 2 "~" V 9380 2400 30  0000 C CNN
F 3 "~" H 9450 2400 30  0000 C CNN
	1    9450 2400
	0    -1   -1   0   
$EndComp
$Comp
L C C?
U 1 1 57D26269
P 9400 2750
F 0 "C?" H 9400 2850 40  0000 L CNN
F 1 "10n" H 9406 2665 40  0000 L CNN
F 2 "~" H 9438 2600 30  0000 C CNN
F 3 "~" H 9400 2750 60  0000 C CNN
	1    9400 2750
	1    0    0    -1  
$EndComp
Text Label 9700 2300 2    60   ~ 0
5V
Text Label 9450 2550 0    60   ~ 0
DIN5_B
$Comp
L ZENER D?
U 1 1 57D262AB
P 6250 3700
F 0 "D?" H 6250 3800 50  0000 C CNN
F 1 "6.8V_Z" H 6250 3600 40  0000 C CNN
F 2 "~" H 6250 3700 60  0000 C CNN
F 3 "~" H 6250 3700 60  0000 C CNN
	1    6250 3700
	-1   0    0    1   
$EndComp
$Comp
L R R?
U 1 1 57D262B1
P 6750 3700
F 0 "R?" V 6830 3700 40  0000 C CNN
F 1 "1K" V 6757 3701 40  0000 C CNN
F 2 "~" V 6680 3700 30  0000 C CNN
F 3 "~" H 6750 3700 30  0000 C CNN
	1    6750 3700
	0    1    1    0   
$EndComp
$Comp
L R R?
U 1 1 57D262B7
P 7550 3700
F 0 "R?" V 7630 3700 40  0000 C CNN
F 1 "1K" V 7557 3701 40  0000 C CNN
F 2 "~" V 7480 3700 30  0000 C CNN
F 3 "~" H 7550 3700 30  0000 C CNN
	1    7550 3700
	0    1    1    0   
$EndComp
$Comp
L R R?
U 1 1 57D262BD
P 7850 4000
F 0 "R?" V 7930 4000 40  0000 C CNN
F 1 "10K" V 7857 4001 40  0000 C CNN
F 2 "~" V 7780 4000 30  0000 C CNN
F 3 "~" H 7850 4000 30  0000 C CNN
	1    7850 4000
	1    0    0    -1  
$EndComp
$Comp
L ZENER D?
U 1 1 57D262C3
P 7050 3950
F 0 "D?" H 7050 4050 50  0000 C CNN
F 1 "10V_Z" H 7050 3850 40  0000 C CNN
F 2 "~" H 7050 3950 60  0000 C CNN
F 3 "~" H 7050 3950 60  0000 C CNN
	1    7050 3950
	0    -1   -1   0   
$EndComp
$Comp
L C C?
U 1 1 57D262C9
P 7250 3950
F 0 "C?" H 7250 4050 40  0000 L CNN
F 1 "15n" H 7256 3865 40  0000 L CNN
F 2 "~" H 7288 3800 30  0000 C CNN
F 3 "~" H 7250 3950 60  0000 C CNN
	1    7250 3950
	1    0    0    -1  
$EndComp
Text Label 5950 3700 2    60   ~ 0
IN6
$Comp
L R R?
U 1 1 57D262D0
P 9450 3700
F 0 "R?" V 9530 3700 40  0000 C CNN
F 1 "4.7K" V 9457 3701 40  0000 C CNN
F 2 "~" V 9380 3700 30  0000 C CNN
F 3 "~" H 9450 3700 30  0000 C CNN
	1    9450 3700
	0    -1   -1   0   
$EndComp
$Comp
L C C?
U 1 1 57D262D6
P 9400 4050
F 0 "C?" H 9400 4150 40  0000 L CNN
F 1 "10n" H 9406 3965 40  0000 L CNN
F 2 "~" H 9438 3900 30  0000 C CNN
F 3 "~" H 9400 4050 60  0000 C CNN
	1    9400 4050
	1    0    0    -1  
$EndComp
Text Label 9700 3600 2    60   ~ 0
5V
Text Label 9450 3850 0    60   ~ 0
DIN6_B
$Comp
L ZENER D?
U 1 1 57D262E0
P 6200 5050
F 0 "D?" H 6200 5150 50  0000 C CNN
F 1 "6.8V_Z" H 6200 4950 40  0000 C CNN
F 2 "~" H 6200 5050 60  0000 C CNN
F 3 "~" H 6200 5050 60  0000 C CNN
	1    6200 5050
	-1   0    0    1   
$EndComp
$Comp
L R R?
U 1 1 57D262E6
P 6700 5050
F 0 "R?" V 6780 5050 40  0000 C CNN
F 1 "1K" V 6707 5051 40  0000 C CNN
F 2 "~" V 6630 5050 30  0000 C CNN
F 3 "~" H 6700 5050 30  0000 C CNN
	1    6700 5050
	0    1    1    0   
$EndComp
$Comp
L R R?
U 1 1 57D262EC
P 7500 5050
F 0 "R?" V 7580 5050 40  0000 C CNN
F 1 "1K" V 7507 5051 40  0000 C CNN
F 2 "~" V 7430 5050 30  0000 C CNN
F 3 "~" H 7500 5050 30  0000 C CNN
	1    7500 5050
	0    1    1    0   
$EndComp
$Comp
L R R?
U 1 1 57D262F2
P 7800 5350
F 0 "R?" V 7880 5350 40  0000 C CNN
F 1 "10K" V 7807 5351 40  0000 C CNN
F 2 "~" V 7730 5350 30  0000 C CNN
F 3 "~" H 7800 5350 30  0000 C CNN
	1    7800 5350
	1    0    0    -1  
$EndComp
$Comp
L ZENER D?
U 1 1 57D262F8
P 7000 5300
F 0 "D?" H 7000 5400 50  0000 C CNN
F 1 "10V_Z" H 7000 5200 40  0000 C CNN
F 2 "~" H 7000 5300 60  0000 C CNN
F 3 "~" H 7000 5300 60  0000 C CNN
	1    7000 5300
	0    -1   -1   0   
$EndComp
$Comp
L C C?
U 1 1 57D262FE
P 7200 5300
F 0 "C?" H 7200 5400 40  0000 L CNN
F 1 "15n" H 7206 5215 40  0000 L CNN
F 2 "~" H 7238 5150 30  0000 C CNN
F 3 "~" H 7200 5300 60  0000 C CNN
	1    7200 5300
	1    0    0    -1  
$EndComp
Text Label 5900 5050 2    60   ~ 0
IN7
$Comp
L R R?
U 1 1 57D26305
P 9400 5050
F 0 "R?" V 9480 5050 40  0000 C CNN
F 1 "4.7K" V 9407 5051 40  0000 C CNN
F 2 "~" V 9330 5050 30  0000 C CNN
F 3 "~" H 9400 5050 30  0000 C CNN
	1    9400 5050
	0    -1   -1   0   
$EndComp
$Comp
L C C?
U 1 1 57D2630B
P 9350 5400
F 0 "C?" H 9350 5500 40  0000 L CNN
F 1 "10n" H 9356 5315 40  0000 L CNN
F 2 "~" H 9388 5250 30  0000 C CNN
F 3 "~" H 9350 5400 60  0000 C CNN
	1    9350 5400
	1    0    0    -1  
$EndComp
Text Label 9650 4950 2    60   ~ 0
5V
Text Label 9400 5200 0    60   ~ 0
DIN7_B
$Comp
L TLP291 IC?
U 1 1 57D26391
P 8500 1400
F 0 "IC?" H 8287 1578 40  0000 C CNN
F 1 "LV817" H 8649 1216 40  0000 C CNN
F 2 "" H 8336 1226 29  0000 C CNN
F 3 "" H 8500 1400 60  0000 C CNN
	1    8500 1400
	1    0    0    -1  
$EndComp
$Comp
L TLP291 IC?
U 1 1 57D26397
P 8500 2650
F 0 "IC?" H 8287 2828 40  0000 C CNN
F 1 "LV817" H 8649 2466 40  0000 C CNN
F 2 "" H 8336 2476 29  0000 C CNN
F 3 "" H 8500 2650 60  0000 C CNN
	1    8500 2650
	1    0    0    -1  
$EndComp
$Comp
L TLP291 IC?
U 1 1 57D2639D
P 8550 3950
F 0 "IC?" H 8337 4128 40  0000 C CNN
F 1 "LV817" H 8699 3766 40  0000 C CNN
F 2 "" H 8386 3776 29  0000 C CNN
F 3 "" H 8550 3950 60  0000 C CNN
	1    8550 3950
	1    0    0    -1  
$EndComp
$Comp
L TLP291 IC?
U 1 1 57D263A3
P 8500 5300
F 0 "IC?" H 8287 5478 40  0000 C CNN
F 1 "LV817" H 8649 5116 40  0000 C CNN
F 2 "" H 8336 5126 29  0000 C CNN
F 3 "" H 8500 5300 60  0000 C CNN
	1    8500 5300
	1    0    0    -1  
$EndComp
Wire Wire Line
	2650 1250 2700 1250
Wire Wire Line
	1450 1250 1400 1250
Wire Wire Line
	1000 1250 900  1250
Wire Wire Line
	3800 1400 4400 1400
Wire Wire Line
	4350 1850 4350 1800
Wire Wire Line
	4050 1850 4550 1850
Wire Wire Line
	4650 1250 4650 1150
Wire Wire Line
	1950 1250 2250 1250
Wire Wire Line
	2000 1300 2000 1250
Connection ~ 2000 1250
Wire Wire Line
	2200 1250 2200 1300
Connection ~ 2200 1250
Wire Wire Line
	2750 1250 2950 1250
Wire Wire Line
	2800 1250 2800 1300
Wire Wire Line
	2950 1250 2950 1400
Connection ~ 2800 1250
Wire Wire Line
	2950 1850 2950 1600
Wire Wire Line
	900  1850 2950 1850
Wire Wire Line
	2800 1800 2800 1850
Connection ~ 2800 1850
Wire Wire Line
	2200 1700 2200 1850
Connection ~ 2200 1850
Wire Wire Line
	2000 1700 2000 1850
Connection ~ 2000 1850
Wire Wire Line
	4050 1600 4050 1850
Connection ~ 4150 1400
Connection ~ 4350 1400
Wire Wire Line
	2650 2500 2700 2500
Wire Wire Line
	1450 2500 1400 2500
Wire Wire Line
	1000 2500 900  2500
Wire Wire Line
	3800 2650 4400 2650
Wire Wire Line
	4350 3100 4350 3050
Wire Wire Line
	4050 3100 4550 3100
Wire Wire Line
	4650 2500 4650 2400
Wire Wire Line
	1950 2500 2250 2500
Wire Wire Line
	2000 2550 2000 2500
Connection ~ 2000 2500
Wire Wire Line
	2200 2500 2200 2550
Connection ~ 2200 2500
Wire Wire Line
	2750 2500 2950 2500
Wire Wire Line
	2800 2500 2800 2550
Wire Wire Line
	2950 2500 2950 2650
Connection ~ 2800 2500
Wire Wire Line
	2950 3100 2950 2850
Wire Wire Line
	900  3100 2950 3100
Wire Wire Line
	2800 3050 2800 3100
Connection ~ 2800 3100
Wire Wire Line
	2200 2950 2200 3100
Connection ~ 2200 3100
Wire Wire Line
	2000 2950 2000 3100
Connection ~ 2000 3100
Wire Wire Line
	4050 2850 4050 3100
Connection ~ 4150 2650
Connection ~ 4350 2650
Wire Wire Line
	2650 3800 2700 3800
Wire Wire Line
	1450 3800 1400 3800
Wire Wire Line
	1000 3800 900  3800
Wire Wire Line
	3850 3950 4400 3950
Wire Wire Line
	4350 4400 4350 4350
Wire Wire Line
	4050 4400 4550 4400
Wire Wire Line
	4650 3800 4650 3700
Wire Wire Line
	1950 3800 2250 3800
Wire Wire Line
	2000 3850 2000 3800
Connection ~ 2000 3800
Wire Wire Line
	2200 3800 2200 3850
Connection ~ 2200 3800
Wire Wire Line
	2750 3800 2950 3800
Wire Wire Line
	2800 3800 2800 3850
Wire Wire Line
	2950 3800 2950 3950
Connection ~ 2800 3800
Wire Wire Line
	2950 4400 2950 4150
Wire Wire Line
	900  4400 2950 4400
Wire Wire Line
	2800 4350 2800 4400
Connection ~ 2800 4400
Wire Wire Line
	2200 4250 2200 4400
Connection ~ 2200 4400
Wire Wire Line
	2000 4250 2000 4400
Connection ~ 2000 4400
Wire Wire Line
	4050 4150 4050 4400
Connection ~ 4150 3950
Connection ~ 4350 3950
Wire Wire Line
	2600 5150 2650 5150
Wire Wire Line
	1400 5150 1350 5150
Wire Wire Line
	950  5150 850  5150
Wire Wire Line
	3800 5300 4350 5300
Wire Wire Line
	4300 5750 4300 5700
Wire Wire Line
	4000 5750 4450 5750
Wire Wire Line
	4600 5150 4600 5050
Wire Wire Line
	1900 5150 2200 5150
Wire Wire Line
	1950 5200 1950 5150
Connection ~ 1950 5150
Wire Wire Line
	2150 5150 2150 5200
Connection ~ 2150 5150
Wire Wire Line
	2700 5150 2900 5150
Wire Wire Line
	2750 5150 2750 5200
Wire Wire Line
	2900 5150 2900 5300
Connection ~ 2750 5150
Wire Wire Line
	2900 5750 2900 5500
Wire Wire Line
	850  5750 2900 5750
Wire Wire Line
	2750 5700 2750 5750
Connection ~ 2750 5750
Wire Wire Line
	2150 5600 2150 5750
Connection ~ 2150 5750
Wire Wire Line
	1950 5600 1950 5750
Connection ~ 1950 5750
Wire Wire Line
	4000 5500 4000 5750
Connection ~ 4100 5300
Connection ~ 4300 5300
Connection ~ 4150 1250
Connection ~ 4100 5150
Connection ~ 4150 3800
Connection ~ 4150 2500
Connection ~ 4350 1850
Connection ~ 4350 3100
Connection ~ 4350 4400
Connection ~ 4300 5750
Wire Wire Line
	2950 1400 3100 1400
Wire Wire Line
	2950 1600 3100 1600
Wire Wire Line
	3800 1600 4050 1600
Wire Wire Line
	2950 2650 3100 2650
Wire Wire Line
	3800 2850 4050 2850
Wire Wire Line
	2950 2850 3100 2850
Wire Wire Line
	2950 3950 3150 3950
Wire Wire Line
	2950 4150 3150 4150
Wire Wire Line
	3850 4150 4050 4150
Wire Wire Line
	2900 5300 3100 5300
Wire Wire Line
	2900 5500 3100 5500
Wire Wire Line
	3800 5500 4000 5500
Wire Wire Line
	7700 1150 7750 1150
Wire Wire Line
	6500 1150 6450 1150
Wire Wire Line
	6050 1150 5950 1150
Wire Wire Line
	8850 1300 9450 1300
Wire Wire Line
	9400 1750 9400 1700
Wire Wire Line
	9100 1750 9600 1750
Wire Wire Line
	9700 1150 9700 1050
Wire Wire Line
	7000 1150 7300 1150
Wire Wire Line
	7050 1200 7050 1150
Connection ~ 7050 1150
Wire Wire Line
	7250 1150 7250 1200
Connection ~ 7250 1150
Wire Wire Line
	7800 1150 8000 1150
Wire Wire Line
	7850 1150 7850 1200
Wire Wire Line
	8000 1150 8000 1300
Connection ~ 7850 1150
Wire Wire Line
	8000 1750 8000 1500
Wire Wire Line
	5950 1750 8000 1750
Wire Wire Line
	7850 1700 7850 1750
Connection ~ 7850 1750
Wire Wire Line
	7250 1600 7250 1750
Connection ~ 7250 1750
Wire Wire Line
	7050 1600 7050 1750
Connection ~ 7050 1750
Wire Wire Line
	9100 1500 9100 1750
Connection ~ 9200 1300
Connection ~ 9400 1300
Wire Wire Line
	7700 2400 7750 2400
Wire Wire Line
	6500 2400 6450 2400
Wire Wire Line
	6050 2400 5950 2400
Wire Wire Line
	8850 2550 9450 2550
Wire Wire Line
	9400 3000 9400 2950
Wire Wire Line
	9100 3000 9600 3000
Wire Wire Line
	9700 2400 9700 2300
Wire Wire Line
	7000 2400 7300 2400
Wire Wire Line
	7050 2450 7050 2400
Connection ~ 7050 2400
Wire Wire Line
	7250 2400 7250 2450
Connection ~ 7250 2400
Wire Wire Line
	7800 2400 8000 2400
Wire Wire Line
	7850 2400 7850 2450
Wire Wire Line
	8000 2400 8000 2550
Connection ~ 7850 2400
Wire Wire Line
	8000 3000 8000 2750
Wire Wire Line
	5950 3000 8000 3000
Wire Wire Line
	7850 2950 7850 3000
Connection ~ 7850 3000
Wire Wire Line
	7250 2850 7250 3000
Connection ~ 7250 3000
Wire Wire Line
	7050 2850 7050 3000
Connection ~ 7050 3000
Wire Wire Line
	9100 2750 9100 3000
Connection ~ 9200 2550
Connection ~ 9400 2550
Wire Wire Line
	7700 3700 7750 3700
Wire Wire Line
	6500 3700 6450 3700
Wire Wire Line
	6050 3700 5950 3700
Wire Wire Line
	8900 3850 9450 3850
Wire Wire Line
	9400 4300 9400 4250
Wire Wire Line
	9100 4300 9600 4300
Wire Wire Line
	9700 3700 9700 3600
Wire Wire Line
	7000 3700 7300 3700
Wire Wire Line
	7050 3750 7050 3700
Connection ~ 7050 3700
Wire Wire Line
	7250 3700 7250 3750
Connection ~ 7250 3700
Wire Wire Line
	7800 3700 8000 3700
Wire Wire Line
	7850 3700 7850 3750
Wire Wire Line
	8000 3700 8000 3850
Connection ~ 7850 3700
Wire Wire Line
	8000 4300 8000 4050
Wire Wire Line
	5950 4300 8000 4300
Wire Wire Line
	7850 4250 7850 4300
Connection ~ 7850 4300
Wire Wire Line
	7250 4150 7250 4300
Connection ~ 7250 4300
Wire Wire Line
	7050 4150 7050 4300
Connection ~ 7050 4300
Wire Wire Line
	9100 4050 9100 4300
Connection ~ 9200 3850
Connection ~ 9400 3850
Wire Wire Line
	7650 5050 7700 5050
Wire Wire Line
	6450 5050 6400 5050
Wire Wire Line
	6000 5050 5900 5050
Wire Wire Line
	8850 5200 9400 5200
Wire Wire Line
	9350 5650 9350 5600
Wire Wire Line
	9050 5650 9500 5650
Wire Wire Line
	9650 5050 9650 4950
Wire Wire Line
	6950 5050 7250 5050
Wire Wire Line
	7000 5100 7000 5050
Connection ~ 7000 5050
Wire Wire Line
	7200 5050 7200 5100
Connection ~ 7200 5050
Wire Wire Line
	7750 5050 7950 5050
Wire Wire Line
	7800 5050 7800 5100
Wire Wire Line
	7950 5050 7950 5200
Connection ~ 7800 5050
Wire Wire Line
	7950 5650 7950 5400
Wire Wire Line
	5900 5650 7950 5650
Wire Wire Line
	7800 5600 7800 5650
Connection ~ 7800 5650
Wire Wire Line
	7200 5500 7200 5650
Connection ~ 7200 5650
Wire Wire Line
	7000 5500 7000 5650
Connection ~ 7000 5650
Wire Wire Line
	9050 5400 9050 5650
Connection ~ 9150 5200
Connection ~ 9350 5200
Connection ~ 9200 1150
Connection ~ 9150 5050
Connection ~ 9200 3700
Connection ~ 9200 2400
Connection ~ 9400 1750
Connection ~ 9400 3000
Connection ~ 9400 4300
Connection ~ 9350 5650
Wire Wire Line
	8000 1300 8150 1300
Wire Wire Line
	8000 1500 8150 1500
Wire Wire Line
	8850 1500 9100 1500
Wire Wire Line
	8000 2550 8150 2550
Wire Wire Line
	8850 2750 9100 2750
Wire Wire Line
	8000 2750 8150 2750
Wire Wire Line
	8000 3850 8200 3850
Wire Wire Line
	8000 4050 8200 4050
Wire Wire Line
	8900 4050 9100 4050
Wire Wire Line
	7950 5200 8150 5200
Wire Wire Line
	7950 5400 8150 5400
Wire Wire Line
	8850 5400 9050 5400
Wire Wire Line
	4150 1400 4150 1250
Wire Wire Line
	4150 2500 4150 2650
Wire Wire Line
	4150 3950 4150 3800
Wire Wire Line
	4100 5300 4100 5150
Wire Wire Line
	9200 1300 9200 1150
Wire Wire Line
	9200 2550 9200 2400
Wire Wire Line
	9200 3850 9200 3700
Wire Wire Line
	9150 5200 9150 5050
Text Label 900  1850 2    60   ~ 0
IN_GND
Text Label 900  3100 2    60   ~ 0
IN_GND
Text Label 900  4400 2    60   ~ 0
IN_GND
Text Label 850  5750 2    60   ~ 0
IN_GND
Text Label 5950 1750 2    60   ~ 0
IN_GND
Text Label 5950 3000 2    60   ~ 0
IN_GND
Text Label 5950 4300 2    60   ~ 0
IN_GND
Text Label 5900 5650 2    60   ~ 0
IN_GND
Text Label 4550 1850 0    60   ~ 0
GndPwr
Text Label 4550 3100 0    60   ~ 0
GndPwr
Text Label 4550 4400 0    60   ~ 0
GndPwr
Text Label 4450 5750 0    60   ~ 0
GndPwr
Text Label 9600 1750 0    60   ~ 0
GndPwr
Text Label 9600 3000 0    60   ~ 0
GndPwr
Text Label 9600 4300 0    60   ~ 0
GndPwr
Text Label 9500 5650 0    60   ~ 0
GndPwr
$Comp
L CONN_10X2 P?
U 1 1 57D2758C
P 2600 6900
F 0 "P?" H 2600 7450 60  0000 C CNN
F 1 "CONN_10X2" V 2600 6800 50  0000 C CNN
F 2 "" H 2600 6900 60  0000 C CNN
F 3 "" H 2600 6900 60  0000 C CNN
	1    2600 6900
	1    0    0    -1  
$EndComp
Wire Wire Line
	2200 6450 1850 6450
Wire Wire Line
	1150 6550 2200 6550
Wire Wire Line
	2200 6650 1850 6650
Wire Wire Line
	2200 6750 1850 6750
Wire Wire Line
	2200 6850 1850 6850
Wire Wire Line
	2200 6950 1850 6950
Wire Wire Line
	2200 7050 1850 7050
Wire Wire Line
	2200 7150 1850 7150
Wire Wire Line
	2200 7250 1850 7250
Wire Wire Line
	2200 7350 1850 7350
Wire Wire Line
	3000 6450 3400 6450
Wire Wire Line
	3000 6550 3400 6550
Wire Wire Line
	3000 6650 3400 6650
Wire Wire Line
	3000 6750 3400 6750
Wire Wire Line
	3000 6850 3400 6850
Wire Wire Line
	3000 6950 3400 6950
Wire Wire Line
	3000 7050 3400 7050
Wire Wire Line
	3000 7150 3400 7150
Wire Wire Line
	3000 7250 3400 7250
Wire Wire Line
	3000 7350 3400 7350
Text Label 1850 6450 2    60   ~ 0
5V
$Comp
L GNDPWR #PWR?
U 1 1 57D27A1A
P 1150 6650
F 0 "#PWR?" H 1150 6700 40  0001 C CNN
F 1 "GNDPWR" H 1150 6570 40  0000 C CNN
F 2 "" H 1150 6650 60  0000 C CNN
F 3 "" H 1150 6650 60  0000 C CNN
	1    1150 6650
	1    0    0    -1  
$EndComp
Wire Wire Line
	1150 6550 1150 6650
Text Label 3400 6450 0    60   ~ 0
24v_IN
Text Label 3400 6550 0    60   ~ 0
IN_GND
Text Label 3400 7050 0    60   ~ 0
IN4
Text Label 3400 7150 0    60   ~ 0
IN5
Text Label 3400 7250 0    60   ~ 0
IN6
Text Label 3400 7350 0    60   ~ 0
IN7
Text Label 1850 6750 2    60   ~ 0
DIN1_B
Text Label 1850 6850 2    60   ~ 0
DIN2_B
Text Label 1850 6950 2    60   ~ 0
DIN3_B
Text Label 1850 7050 2    60   ~ 0
DIN4_B
Text Label 1850 7150 2    60   ~ 0
DIN5_B
Text Label 1850 7250 2    60   ~ 0
DIN6_B
Text Label 1850 7350 2    60   ~ 0
DIN7_B
$EndSCHEMATC
