EESchema Schematic File Version 2
LIBS:power
LIBS:device
LIBS:switches
LIBS:relays
LIBS:motors
LIBS:transistors
LIBS:conn
LIBS:linear
LIBS:regul
LIBS:74xx
LIBS:cmos4000
LIBS:adc-dac
LIBS:memory
LIBS:xilinx
LIBS:microcontrollers
LIBS:dsp
LIBS:microchip
LIBS:analog_switches
LIBS:motorola
LIBS:texas
LIBS:intel
LIBS:audio
LIBS:interface
LIBS:digital-audio
LIBS:philips
LIBS:display
LIBS:cypress
LIBS:siliconi
LIBS:opto
LIBS:atmel
LIBS:contrib
LIBS:valves
LIBS:AUTOPLCV1.4-cache
EELAYER 25 0
EELAYER END
$Descr A2 23386 16535
encoding utf-8
Sheet 8 10
Title ""
Date "13 jun 2016"
Rev ""
Comp ""
Comment1 ""
Comment2 ""
Comment3 ""
Comment4 ""
$EndDescr
Text Label 19550 2700 2    60   ~ 0
TX1+
$Comp
L R R211
U 1 1 5284220D
P 21400 3350
F 0 "R211" V 21480 3350 40  0000 C CNN
F 1 "620" V 21407 3351 40  0000 C CNN
F 2 "AutomataFootprint:R_0805_AUTOMAT" V 21330 3350 30  0001 C CNN
F 3 "~" H 21400 3350 30  0000 C CNN
	1    21400 3350
	1    0    0    -1  
$EndComp
Text Label 21400 2650 2    60   ~ 0
TX1-
$Comp
L R R210
U 1 1 5284221F
P 20050 3400
F 0 "R210" V 20130 3400 40  0000 C CNN
F 1 "620" V 20057 3401 40  0000 C CNN
F 2 "AutomataFootprint:R_0805_AUTOMAT" V 19980 3400 30  0001 C CNN
F 3 "~" H 20050 3400 30  0000 C CNN
	1    20050 3400
	1    0    0    -1  
$EndComp
Text Label 16000 3450 0    60   ~ 0
TX1+
Text Label 16000 3350 0    60   ~ 0
TX1-
$Comp
L SN75LBC184 U21
U 1 1 5284A734
P 15550 3500
F 0 "U21" H 15550 3350 60  0000 C CNN
F 1 "SN75LBC184" H 15550 3850 60  0000 C CNN
F 2 "AutomataFootprint:ISO7221_AUTOMATA" H 15500 3500 60  0001 C CNN
F 3 "~" H 15500 3500 60  0000 C CNN
	1    15550 3500
	1    0    0    -1  
$EndComp
$Comp
L LED D77
U 1 1 5284B0D7
P 4050 2600
F 0 "D77" H 4050 2700 50  0000 C CNN
F 1 "LED" H 4050 2500 50  0000 C CNN
F 2 "AutomataFootprint:LED_1206" H 4050 2600 60  0001 C CNN
F 3 "~" H 4050 2600 60  0000 C CNN
	1    4050 2600
	0    1    1    0   
$EndComp
$Comp
L LED D79
U 1 1 5284B28F
P 4750 2600
F 0 "D79" H 4750 2700 50  0000 C CNN
F 1 "LED" H 4750 2500 50  0000 C CNN
F 2 "AutomataFootprint:LED_1206" H 4750 2600 60  0001 C CNN
F 3 "~" H 4750 2600 60  0000 C CNN
	1    4750 2600
	0    1    1    0   
$EndComp
$Comp
L R R197
U 1 1 5284F4D9
P 4050 3100
F 0 "R197" V 4130 3100 40  0000 C CNN
F 1 "390" V 4057 3101 40  0000 C CNN
F 2 "AutomataFootprint:R_0805_AUTOMAT" V 3980 3100 30  0001 C CNN
F 3 "~" H 4050 3100 30  0000 C CNN
	1    4050 3100
	1    0    0    -1  
$EndComp
$Comp
L R R199
U 1 1 5284F4E5
P 4750 3100
F 0 "R199" V 4830 3100 40  0000 C CNN
F 1 "390" V 4757 3101 40  0000 C CNN
F 2 "AutomataFootprint:R_0805_AUTOMAT" V 4680 3100 30  0001 C CNN
F 3 "~" H 4750 3100 30  0000 C CNN
	1    4750 3100
	1    0    0    -1  
$EndComp
Text HLabel 1000 1950 0    60   Input ~ 0
5V_VCC
Text HLabel 1000 2050 0    60   Input ~ 0
GND
Text Label 1150 2050 0    60   ~ 0
S_GND
Text Label 1150 1950 0    60   ~ 0
5V
Text Label 1800 3900 0    60   ~ 0
TX1+
Text Label 1800 4050 0    60   ~ 0
TX1-
Text HLabel 1300 3900 0    60   Input ~ 0
RS485_TX1+
Text Label 19950 3850 2    60   ~ 0
iso_5V
Text Label 21300 3900 2    60   ~ 0
iso_gnd
Text Label 16150 3250 0    60   ~ 0
iso_5V
Text Label 16000 3550 0    60   ~ 0
iso_gnd
$Comp
L CP1 C9
U 1 1 57576857
P 11300 11100
F 0 "C9" H 11350 11200 50  0000 L CNN
F 1 "10uF" H 11350 11000 50  0000 L CNN
F 2 "AutomataFootprint:C1V5_AUTOMATA" H 11300 11100 60  0001 C CNN
F 3 "~" H 11300 11100 60  0000 C CNN
	1    11300 11100
	1    0    0    -1  
$EndComp
$Comp
L CP1 C10
U 1 1 57576873
P 11350 11600
F 0 "C10" H 11400 11700 50  0000 L CNN
F 1 "10uF" H 11400 11500 50  0000 L CNN
F 2 "AutomataFootprint:C1V5_AUTOMATA" H 11350 11600 60  0001 C CNN
F 3 "~" H 11350 11600 60  0000 C CNN
	1    11350 11600
	1    0    0    -1  
$EndComp
$Comp
L CP1 C19
U 1 1 57576D50
P 13750 10900
F 0 "C19" H 13800 11000 50  0000 L CNN
F 1 "10uF" H 13800 10800 50  0000 L CNN
F 2 "AutomataFootprint:C1V5" H 13750 10900 60  0001 C CNN
F 3 "~" H 13750 10900 60  0000 C CNN
	1    13750 10900
	0    -1   -1   0   
$EndComp
Text Label 13500 10750 2    60   ~ 0
iso_5V
Text Label 14100 10900 0    60   ~ 0
iso_gnd
$Comp
L CP1 C20
U 1 1 57576F3F
P 13750 11300
F 0 "C20" H 13800 11400 50  0000 L CNN
F 1 "10uF" H 13800 11200 50  0000 L CNN
F 2 "AutomataFootprint:C1V5_AUTOMATA" H 13750 11300 60  0001 C CNN
F 3 "~" H 13750 11300 60  0000 C CNN
	1    13750 11300
	0    -1   -1   0   
$EndComp
Text Label 14100 11300 0    60   ~ 0
iso_5V
$Comp
L CP1 C72
U 1 1 57577568
P 13800 11800
F 0 "C72" H 13850 11900 50  0000 L CNN
F 1 "10uF" H 13850 11700 50  0000 L CNN
F 2 "AutomataFootprint:C1V5_AUTOMATA" H 13800 11800 60  0001 C CNN
F 3 "~" H 13800 11800 60  0000 C CNN
	1    13800 11800
	0    1    1    0   
$EndComp
Text Label 14150 11800 0    60   ~ 0
iso_gnd
Text Label 14300 11450 0    60   ~ 0
iso_gnd
Text Label 13850 12000 0    60   ~ 0
232_TX
Text Label 13850 12200 0    60   ~ 0
232_RX
Text HLabel 14300 12000 2    60   Input ~ 0
TX232
Text HLabel 14300 12200 2    60   Input ~ 0
RX232
Text HLabel 1050 3050 0    60   Input ~ 0
RX1
Text HLabel 1050 3200 0    60   Input ~ 0
TX1
$Comp
L MAX202-RESCUE-PACMAC_LPC_1769 U4
U 1 1 59D5F2C3
P 12650 11600
F 0 "U4" H 12650 12450 70  0000 C CNN
F 1 "MAX202" H 12650 10750 70  0000 C CNN
F 2 "AutomataFootprint1:DIP-16__300_ELL" H 12650 11600 60  0001 C CNN
F 3 "" H 12650 11600 60  0000 C CNN
	1    12650 11600
	1    0    0    -1  
$EndComp
Text Notes 10700 10450 0    394  ~ 0
RS232/202
Text Label 7750 3500 2    60   ~ 0
S_GND
Text Label 7750 3200 2    60   ~ 0
5V
Text Notes 7950 1350 0    394  ~ 0
RS485 HALF DUPLEX MODE WITH DTR SIGNAL\n
$Comp
L C C61
U 1 1 5A2490D9
P 16000 2900
F 0 "C61" H 16025 3000 50  0000 L CNN
F 1 "0.1uF" H 16025 2800 50  0000 L CNN
F 2 "AutomataFootprint:C_0805_AUTOMATA" H 16038 2750 50  0001 C CNN
F 3 "" H 16000 2900 50  0001 C CNN
	1    16000 2900
	1    0    0    -1  
$EndComp
Text Label 16000 2650 0    60   ~ 0
iso_gnd
NoConn ~ 13450 12100
NoConn ~ 13450 12300
NoConn ~ 11850 12300
NoConn ~ 11850 12100
Text HLabel 1000 2350 0    60   Input ~ 0
ENABLE1
Text Label 1200 2350 0    60   ~ 0
ENABLE1
Text Label 6250 6250 0    60   ~ 0
S_GND
$Comp
L JUMPER3 JP8
U 1 1 575AAD69
P 6200 6600
F 0 "JP8" H 6250 6500 40  0000 L CNN
F 1 "UART3" H 6200 6700 40  0000 C CNN
F 2 "AutomataFootprint:Pin_Header_Straight_1x03_Pitch2.54mm_Automata" H 6200 6600 60  0001 C CNN
F 3 "~" H 6200 6600 60  0000 C CNN
	1    6200 6600
	0    -1   1    0   
$EndComp
Text HLabel 1200 4950 0    60   Input ~ 0
TX_3
Text HLabel 1200 5100 0    60   Input ~ 0
RX_3
Wire Wire Line
	11350 11750 11350 11800
Wire Wire Line
	11350 11400 11350 11450
Wire Wire Line
	11300 11300 11300 11250
Wire Wire Line
	11300 10950 11300 10900
Wire Wire Line
	4750 2400 4750 2450
Wire Wire Line
	4050 2400 4050 2450
Wire Wire Line
	6200 6900 6200 6850
Wire Wire Line
	6450 6900 6200 6900
Wire Wire Line
	6450 6650 6450 6900
Wire Wire Line
	7000 6650 6450 6650
Wire Wire Line
	6350 6550 7000 6550
Wire Wire Line
	6350 6600 6350 6550
Wire Wire Line
	6300 6600 6350 6600
Wire Wire Line
	6200 6250 6200 6350
Wire Wire Line
	6250 6250 6200 6250
Wire Wire Line
	13450 12200 14300 12200
Wire Wire Line
	13450 12000 14300 12000
Wire Wire Line
	13950 11800 14150 11800
Wire Wire Line
	13450 11800 13650 11800
Wire Wire Line
	13450 11300 13600 11300
Wire Wire Line
	13900 11300 14100 11300
Wire Wire Line
	13900 10900 14100 10900
Connection ~ 13500 10900
Wire Wire Line
	13500 10900 13500 10750
Wire Wire Line
	13450 10900 13600 10900
Wire Wire Line
	11350 11800 11850 11800
Wire Wire Line
	11350 11400 11850 11400
Wire Wire Line
	11300 11300 11850 11300
Wire Wire Line
	11300 10900 11850 10900
Connection ~ 4750 3400
Wire Wire Line
	4750 3250 4750 3400
Wire Wire Line
	4050 3250 4050 3400
Wire Wire Line
	4050 3400 5000 3400
Wire Wire Line
	21400 3900 21300 3900
Wire Wire Line
	20050 3850 19950 3850
Wire Wire Line
	4650 2400 4750 2400
Wire Wire Line
	3950 2400 4050 2400
Wire Wire Line
	1300 3900 1800 3900
Wire Wire Line
	1000 2050 1150 2050
Wire Wire Line
	1000 1950 1150 1950
Connection ~ 14850 3550
Wire Wire Line
	14850 3550 14850 3850
Wire Wire Line
	15100 3550 15150 3550
Wire Wire Line
	15100 3550 15100 3750
Wire Wire Line
	4650 2350 4650 2400
Wire Wire Line
	4750 2750 4750 2950
Wire Wire Line
	3950 2350 3950 2400
Wire Wire Line
	4050 2750 4050 2950
Wire Wire Line
	15050 3450 15150 3450
Wire Wire Line
	15050 3550 15050 3450
Wire Wire Line
	14650 3550 15050 3550
Wire Wire Line
	14950 3350 15150 3350
Wire Wire Line
	14950 3450 14950 3350
Wire Wire Line
	14650 3450 14950 3450
Wire Wire Line
	14650 3550 14650 3450
Wire Wire Line
	15150 3250 14700 3250
Wire Wire Line
	15950 3550 16000 3550
Wire Wire Line
	15950 3450 16000 3450
Wire Wire Line
	15950 3350 16000 3350
Wire Wire Line
	15950 3250 16150 3250
Wire Wire Line
	20050 3550 20050 3850
Wire Wire Line
	20050 2700 20050 3250
Wire Wire Line
	21400 3500 21400 3900
Wire Wire Line
	21400 2650 21400 3200
Wire Wire Line
	19550 2700 20050 2700
Connection ~ 16000 3250
Wire Wire Line
	16000 3250 16000 3050
Wire Wire Line
	16000 2650 16000 2750
Wire Wire Line
	1200 2350 1000 2350
Wire Wire Line
	13450 11500 14300 11500
Wire Wire Line
	14300 11500 14300 11450
Wire Wire Line
	7000 6650 7000 6700
Wire Wire Line
	7000 6550 7000 6500
Wire Wire Line
	1050 3200 1250 3200
Text Label 1250 3200 0    60   ~ 0
TX1
Text Label 1250 3050 0    60   ~ 0
RX1
Wire Wire Line
	1250 3050 1050 3050
Text Label 6550 3300 2    60   ~ 0
TX1
Text Label 6550 3400 2    60   ~ 0
RX1
Text Label 3950 2350 2    60   ~ 0
RX1
Text Label 4650 2350 2    60   ~ 0
TX1
$Comp
L ISO7221 U23
U 1 1 5A9E1741
P 7600 2600
F 0 "U23" H 8450 2350 60  0000 C CNN
F 1 "ISO7221" H 8450 2200 60  0000 C CNN
F 2 "AutomataFootprint:ISO7221_AUTOMATA" H 7600 2600 60  0001 C CNN
F 3 "" H 7600 2600 60  0000 C CNN
	1    7600 2600
	1    0    0    -1  
$EndComp
Text Label 9300 3200 0    60   ~ 0
iso_5V
Wire Wire Line
	9300 3200 9150 3200
Text Label 9350 3500 0    60   ~ 0
iso_gnd
Wire Wire Line
	9350 3500 9150 3500
Wire Wire Line
	7750 3200 7950 3200
Wire Wire Line
	7750 3500 7950 3500
Text Label 7750 3300 2    60   ~ 0
RX1
Text Label 7750 3400 2    60   ~ 0
TX1
Wire Wire Line
	7750 3300 7950 3300
Wire Wire Line
	7750 3400 7950 3400
Text Label 9300 3300 0    60   ~ 0
ISO_RX1
Wire Wire Line
	9150 3300 9300 3300
Text Label 9300 3400 0    60   ~ 0
ISO_TX1
Wire Wire Line
	9150 3400 9300 3400
Text Label 15100 3750 0    60   ~ 0
ISO_TX1
Text Label 14700 3250 0    60   ~ 0
ISO_RX1
$Comp
L ROE-0505S U28
U 1 1 5A9E8546
P 8550 7800
F 0 "U28" H 8550 7550 60  0000 C CNN
F 1 "ROE-0505S" H 8500 8050 60  0000 C CNN
F 2 "AutomataFootprint:ROE-0505S" H 8600 7800 60  0001 C CNN
F 3 "" H 8600 7800 60  0000 C CNN
	1    8550 7800
	1    0    0    -1  
$EndComp
Text Label 9200 7650 0    60   ~ 0
S_GND
Wire Wire Line
	9200 7650 8950 7650
Text Label 9200 7750 0    60   ~ 0
5V
Wire Wire Line
	8950 7750 9200 7750
Wire Wire Line
	8950 7850 9200 7850
Wire Wire Line
	8950 7950 9200 7950
Text Label 9200 7850 0    60   ~ 0
iso_gnd
Text Label 9200 7950 0    60   ~ 0
iso_5V
$Comp
L JUMPER JP3
U 1 1 5A9EA1A9
P 11500 7700
F 0 "JP3" H 11500 7850 60  0000 C CNN
F 1 "JUMPER" H 11500 7620 40  0000 C CNN
F 2 "AutomataFootprint:Automata_Pin_Header_Straight_2x01_Pitch2.54mm" H 11500 7700 60  0001 C CNN
F 3 "" H 11500 7700 60  0001 C CNN
	1    11500 7700
	1    0    0    -1  
$EndComp
$Comp
L JUMPER JP4
U 1 1 5A9EA2A4
P 11500 8000
F 0 "JP4" H 11500 8150 60  0000 C CNN
F 1 "JUMPER" H 11500 7920 40  0000 C CNN
F 2 "AutomataFootprint:Automata_Pin_Header_Straight_2x01_Pitch2.54mm" H 11500 8000 60  0001 C CNN
F 3 "" H 11500 8000 60  0001 C CNN
	1    11500 8000
	1    0    0    -1  
$EndComp
Text Label 11100 7700 2    60   ~ 0
5V
Wire Wire Line
	11100 7700 11200 7700
Text Label 11900 7700 0    60   ~ 0
iso_5V
Wire Wire Line
	11900 7700 11800 7700
Text Label 11100 8000 2    60   ~ 0
S_GND
Wire Wire Line
	11900 8000 11800 8000
Wire Wire Line
	11100 8000 11200 8000
Text Label 5000 3400 0    60   ~ 0
S_GND
Text Label 11900 8000 0    60   ~ 0
iso_gnd
Text Label 20400 4550 2    60   ~ 0
TX2+
$Comp
L R R86
U 1 1 5AA04599
P 21300 5250
F 0 "R86" V 21380 5250 40  0000 C CNN
F 1 "620" V 21307 5251 40  0000 C CNN
F 2 "AutomataFootprint:R_0805_AUTOMAT" V 21230 5250 30  0001 C CNN
F 3 "~" H 21300 5250 30  0000 C CNN
	1    21300 5250
	1    0    0    -1  
$EndComp
Text Label 21300 4550 2    60   ~ 0
TX2-
$Comp
L R R85
U 1 1 5AA045A1
P 20900 5250
F 0 "R85" V 20980 5250 40  0000 C CNN
F 1 "620" V 20907 5251 40  0000 C CNN
F 2 "AutomataFootprint:R_0805_AUTOMAT" V 20830 5250 30  0001 C CNN
F 3 "~" H 20900 5250 30  0000 C CNN
	1    20900 5250
	1    0    0    -1  
$EndComp
Text Label 16100 5650 0    60   ~ 0
TX2+
Text Label 16100 5550 0    60   ~ 0
TX2-
$Comp
L SN75LBC184 U29
U 1 1 5AA045AA
P 15650 5700
F 0 "U29" H 15650 5550 60  0000 C CNN
F 1 "SN75LBC184" H 15650 6050 60  0000 C CNN
F 2 "AutomataFootprint:ISO7221_AUTOMATA" H 15600 5700 60  0001 C CNN
F 3 "~" H 15600 5700 60  0000 C CNN
	1    15650 5700
	1    0    0    -1  
$EndComp
$Comp
L LED D42
U 1 1 5AA045B1
P 4050 4150
F 0 "D42" H 4050 4250 50  0000 C CNN
F 1 "LED" H 4050 4050 50  0000 C CNN
F 2 "AutomataFootprint:LED_1206" H 4050 4150 60  0001 C CNN
F 3 "~" H 4050 4150 60  0000 C CNN
	1    4050 4150
	0    1    1    0   
$EndComp
$Comp
L LED D45
U 1 1 5AA045B8
P 4750 4150
F 0 "D45" H 4750 4250 50  0000 C CNN
F 1 "LED" H 4750 4050 50  0000 C CNN
F 2 "AutomataFootprint:LED_1206" H 4750 4150 60  0001 C CNN
F 3 "~" H 4750 4150 60  0000 C CNN
	1    4750 4150
	0    1    1    0   
$EndComp
$Comp
L R R81
U 1 1 5AA045BF
P 4050 4650
F 0 "R81" V 4130 4650 40  0000 C CNN
F 1 "390" V 4057 4651 40  0000 C CNN
F 2 "AutomataFootprint:R_0805_AUTOMAT" V 3980 4650 30  0001 C CNN
F 3 "~" H 4050 4650 30  0000 C CNN
	1    4050 4650
	1    0    0    -1  
$EndComp
$Comp
L R R82
U 1 1 5AA045C6
P 4750 4650
F 0 "R82" V 4830 4650 40  0000 C CNN
F 1 "390" V 4757 4651 40  0000 C CNN
F 2 "AutomataFootprint:R_0805_AUTOMAT" V 4680 4650 30  0001 C CNN
F 3 "~" H 4750 4650 30  0000 C CNN
	1    4750 4650
	1    0    0    -1  
$EndComp
Text Label 20800 5700 2    60   ~ 0
iso_5V
Text Label 21200 5800 2    60   ~ 0
iso_gnd
Text Label 16250 5450 0    60   ~ 0
iso_5V
Text Label 16100 5750 0    60   ~ 0
iso_gnd
$Comp
L C C29
U 1 1 5AA045D8
P 16100 5100
F 0 "C29" H 16125 5200 50  0000 L CNN
F 1 "0.1uF" H 16125 5000 50  0000 L CNN
F 2 "AutomataFootprint:AutomataFootprint_C_0805_AUTOMATA" H 16138 4950 50  0001 C CNN
F 3 "" H 16100 5100 50  0001 C CNN
	1    16100 5100
	1    0    0    -1  
$EndComp
Text Label 16100 4850 0    60   ~ 0
iso_gnd
Text HLabel 1000 2500 0    60   Input ~ 0
ENABLE2
Text Label 1200 2500 0    60   ~ 0
ENABLE2
Wire Wire Line
	4750 3950 4750 4000
Wire Wire Line
	4050 3950 4050 4000
Connection ~ 4750 4950
Wire Wire Line
	4750 4800 4750 4950
Wire Wire Line
	4050 4800 4050 4950
Wire Wire Line
	4050 4950 5000 4950
Wire Wire Line
	21300 5800 21200 5800
Wire Wire Line
	20900 5700 20800 5700
Wire Wire Line
	4650 3950 4750 3950
Wire Wire Line
	3950 3950 4050 3950
Connection ~ 14950 5750
Wire Wire Line
	14950 5750 14950 6050
Wire Wire Line
	15200 5750 15250 5750
Wire Wire Line
	15200 5750 15200 5950
Wire Wire Line
	4650 3900 4650 3950
Wire Wire Line
	4750 4300 4750 4500
Wire Wire Line
	3950 3900 3950 3950
Wire Wire Line
	4050 4300 4050 4500
Wire Wire Line
	15150 5650 15250 5650
Wire Wire Line
	15150 5750 15150 5650
Wire Wire Line
	14750 5750 15150 5750
Wire Wire Line
	15050 5550 15250 5550
Wire Wire Line
	15050 5650 15050 5550
Wire Wire Line
	14750 5650 15050 5650
Wire Wire Line
	14750 5750 14750 5650
Wire Wire Line
	16050 5750 16100 5750
Wire Wire Line
	16050 5650 16100 5650
Wire Wire Line
	16050 5550 16100 5550
Wire Wire Line
	16050 5450 16250 5450
Wire Wire Line
	20900 5400 20900 5700
Wire Wire Line
	20900 4550 20900 5100
Wire Wire Line
	21300 5400 21300 5800
Wire Wire Line
	21300 4550 21300 5100
Wire Wire Line
	20400 4550 20900 4550
Connection ~ 16100 5450
Wire Wire Line
	16100 5450 16100 5250
Wire Wire Line
	16100 4850 16100 4950
Wire Wire Line
	1200 2500 1000 2500
Text Label 6600 4100 2    60   ~ 0
TX2
Text Label 6600 4200 2    60   ~ 0
RX2
Text Label 3950 3900 2    59   ~ 0
RX2
Text Label 4650 3900 2    59   ~ 0
TX2
Text Label 1850 4300 0    60   ~ 0
TX2+
Text Label 1800 4450 0    60   ~ 0
TX2-
Text HLabel 1350 4300 0    60   Input ~ 0
RS485_TX2+
Text HLabel 1350 4450 0    60   Input ~ 0
RS485_TX2-
Wire Wire Line
	1800 4450 1350 4450
Wire Wire Line
	1350 4300 1850 4300
Text HLabel 1050 3350 0    60   Input ~ 0
RX_2
Text HLabel 1050 3500 0    60   Input ~ 0
TX_2
Wire Wire Line
	1050 3500 1250 3500
Text Label 1250 3500 0    60   ~ 0
TX2
Text Label 1250 3350 0    60   ~ 0
RX2
Wire Wire Line
	1250 3350 1050 3350
Text Label 7750 4350 2    60   ~ 0
S_GND
Text Label 7750 4050 2    60   ~ 0
5V
$Comp
L ISO7221 U24
U 1 1 5AA04634
P 7600 3450
F 0 "U24" H 8450 3200 60  0000 C CNN
F 1 "ISO7221" H 8450 3050 60  0000 C CNN
F 2 "AutomataFootprint:ISO7221_AUTOMATA" H 7600 3450 60  0001 C CNN
F 3 "" H 7600 3450 60  0000 C CNN
	1    7600 3450
	1    0    0    -1  
$EndComp
Text Label 9300 4050 0    60   ~ 0
iso_5V
Wire Wire Line
	9300 4050 9150 4050
Text Label 9350 4350 0    60   ~ 0
iso_gnd
Wire Wire Line
	9350 4350 9150 4350
Wire Wire Line
	7750 4050 7950 4050
Wire Wire Line
	7750 4350 7950 4350
Text Label 7750 4150 2    60   ~ 0
RX2
Text Label 7750 4250 2    60   ~ 0
TX2
Wire Wire Line
	7750 4150 7950 4150
Wire Wire Line
	7750 4250 7950 4250
Text Label 9300 4150 0    60   ~ 0
ISO_RX2
Wire Wire Line
	9150 4150 9300 4150
Text Label 9300 4250 0    60   ~ 0
ISO_TX2
Wire Wire Line
	9150 4250 9300 4250
Text Label 14950 5450 2    60   ~ 0
ISO_RX2
Wire Wire Line
	14950 5450 15250 5450
Text Label 5000 4950 0    60   ~ 0
S_GND
Text Label 15200 5950 0    60   ~ 0
ISO_TX2
Text HLabel 1300 4650 0    60   Input ~ 0
ISO_5V
Text HLabel 1300 4750 0    60   Input ~ 0
ISO_GND
Wire Wire Line
	1300 4650 1450 4650
Wire Wire Line
	1300 4750 1450 4750
Text Label 1450 4750 0    60   ~ 0
iso_gnd
Text Label 1450 4650 0    60   ~ 0
iso_5V
$Comp
L JUMPER JP7
U 1 1 5AA65C3D
P 11550 3150
F 0 "JP7" H 11550 3300 60  0000 C CNN
F 1 "JUMPER" H 11550 3070 40  0000 C CNN
F 2 "AutomataFootprint:SMD_JUMPER_0805_AUTOMAT" H 11550 3150 60  0001 C CNN
F 3 "" H 11550 3150 60  0001 C CNN
	1    11550 3150
	1    0    0    -1  
$EndComp
Text Label 11950 3150 0    60   ~ 0
ISO_RX1
Wire Wire Line
	11950 3150 11850 3150
Wire Wire Line
	11150 3150 11250 3150
Text Label 11150 3150 2    60   ~ 0
RX1
$Comp
L JUMPER JP9
U 1 1 5AA66C22
P 11550 3550
F 0 "JP9" H 11550 3700 60  0000 C CNN
F 1 "JUMPER" H 11550 3470 40  0000 C CNN
F 2 "AutomataFootprint:SMD_JUMPER_0805_AUTOMAT" H 11550 3550 60  0001 C CNN
F 3 "" H 11550 3550 60  0001 C CNN
	1    11550 3550
	1    0    0    -1  
$EndComp
Wire Wire Line
	11950 3550 11850 3550
Wire Wire Line
	11150 3550 11250 3550
Text Label 14850 3850 2    60   ~ 0
ISO_ENABLE1
Text Label 14950 6050 2    60   ~ 0
ISO_ENABLE2
Text Label 11950 3550 0    60   ~ 0
ISO_TX1
Text Label 11150 3550 2    60   ~ 0
TX1
$Comp
L JUMPER JP10
U 1 1 5AA6B414
P 11550 3950
F 0 "JP10" H 11550 4100 60  0000 C CNN
F 1 "JUMPER" H 11550 3870 40  0000 C CNN
F 2 "AutomataFootprint:SMD_JUMPER_0805_AUTOMAT" H 11550 3950 60  0001 C CNN
F 3 "" H 11550 3950 60  0001 C CNN
	1    11550 3950
	1    0    0    -1  
$EndComp
Text Label 11950 3950 0    60   ~ 0
ISO_RX2
Wire Wire Line
	11950 3950 11850 3950
Wire Wire Line
	11150 3950 11250 3950
Text Label 11150 3950 2    60   ~ 0
RX2
$Comp
L JUMPER JP11
U 1 1 5AA6B41E
P 11550 4350
F 0 "JP11" H 11550 4500 60  0000 C CNN
F 1 "JUMPER" H 11550 4270 40  0000 C CNN
F 2 "AutomataFootprint:SMD_JUMPER_0805_AUTOMAT" H 11550 4350 60  0001 C CNN
F 3 "" H 11550 4350 60  0001 C CNN
	1    11550 4350
	1    0    0    -1  
$EndComp
Wire Wire Line
	11950 4350 11850 4350
Wire Wire Line
	11150 4350 11250 4350
Text Label 11950 4350 0    60   ~ 0
ISO_TX2
Text Label 11150 4350 2    60   ~ 0
TX2
$Comp
L JUMPER JP5
U 1 1 5AA6C615
P 11550 4900
F 0 "JP5" H 11550 5050 60  0000 C CNN
F 1 "JUMPER" H 11550 4820 40  0000 C CNN
F 2 "AutomataFootprint:SMD_JUMPER_0805_AUTOMAT" H 11550 4900 60  0001 C CNN
F 3 "" H 11550 4900 60  0001 C CNN
	1    11550 4900
	1    0    0    -1  
$EndComp
Wire Wire Line
	11950 4900 11850 4900
Wire Wire Line
	11150 4900 11250 4900
$Comp
L JUMPER JP6
U 1 1 5AA6C61F
P 11550 5300
F 0 "JP6" H 11550 5450 60  0000 C CNN
F 1 "JUMPER" H 11550 5220 40  0000 C CNN
F 2 "AutomataFootprint:SMD_JUMPER_0805_AUTOMAT" H 11550 5300 60  0001 C CNN
F 3 "" H 11550 5300 60  0001 C CNN
	1    11550 5300
	1    0    0    -1  
$EndComp
Wire Wire Line
	11950 5300 11850 5300
Wire Wire Line
	11150 5300 11250 5300
Text Label 11150 4900 2    60   ~ 0
ENABLE1
Text Label 11150 5300 2    60   ~ 0
ENABLE2
Text Label 11950 4900 0    60   ~ 0
ISO_ENABLE1
Text Label 11950 5300 0    60   ~ 0
ISO_ENABLE2
Text Label 6550 3500 2    60   ~ 0
ENABLE1
Text Label 6600 4300 2    60   ~ 0
ENABLE2
Text Label 6600 4400 2    60   ~ 0
S_GND
Wire Wire Line
	1800 4050 1350 4050
Text HLabel 1350 4050 0    60   Input ~ 0
RS485_TX1-
Text Label 7150 6450 2    60   ~ 0
5V
Wire Wire Line
	7150 6450 7250 6450
Text Label 7200 6900 2    60   ~ 0
S_GND
Wire Wire Line
	7200 6900 7250 6900
Wire Wire Line
	7250 6900 7250 6750
Text Label 8600 6450 0    60   ~ 0
iso_5V
Wire Wire Line
	8600 6450 8450 6450
Text Label 8600 6750 0    60   ~ 0
iso_gnd
Wire Wire Line
	8600 6750 8450 6750
Wire Wire Line
	8450 6550 8600 6550
Wire Wire Line
	8450 6650 8600 6650
Text Label 8600 6650 0    79   ~ 0
ISO_TX_3
Text Label 8600 6550 0    79   ~ 0
ISO_RX_3
Text Label 11550 12200 2    79   ~ 0
ISO_RX_3
Wire Wire Line
	11550 12200 11850 12200
Text Label 11550 12000 2    79   ~ 0
ISO_TX_3
Wire Wire Line
	11550 12000 11850 12000
$Comp
L JUMPER JP14
U 1 1 5ADC3523
P 11650 6150
F 0 "JP14" H 11650 6300 60  0000 C CNN
F 1 "JUMPER" H 11650 6070 40  0000 C CNN
F 2 "AutomataFootprint:SMD_JUMPER_0805_AUTOMAT" H 11650 6150 60  0001 C CNN
F 3 "" H 11650 6150 60  0001 C CNN
	1    11650 6150
	1    0    0    -1  
$EndComp
Wire Wire Line
	11950 6150 12200 6150
Wire Wire Line
	11250 6150 11350 6150
$Comp
L JUMPER JP15
U 1 1 5ADC352B
P 11650 6550
F 0 "JP15" H 11650 6700 60  0000 C CNN
F 1 "JUMPER" H 11650 6470 40  0000 C CNN
F 2 "AutomataFootprint:SMD_JUMPER_0805_AUTOMAT" H 11650 6550 60  0001 C CNN
F 3 "" H 11650 6550 60  0001 C CNN
	1    11650 6550
	1    0    0    -1  
$EndComp
Wire Wire Line
	11950 6550 12200 6550
Wire Wire Line
	11250 6550 11350 6550
Text Label 11250 6150 2    79   ~ 0
TX_3
Text Label 11250 6550 2    79   ~ 0
RX_3
Text Label 1500 4950 0    79   ~ 0
TX_3
Wire Wire Line
	1500 4950 1200 4950
Text Label 1500 5100 0    79   ~ 0
RX_3
Wire Wire Line
	1500 5100 1200 5100
Text Label 12200 6150 0    79   ~ 0
ISO_TX_3
Text Label 12200 6550 0    79   ~ 0
ISO_RX_3
Wire Wire Line
	7000 6500 7250 6500
Wire Wire Line
	7250 6500 7250 6550
Wire Wire Line
	7000 6700 7250 6700
Wire Wire Line
	7250 6700 7250 6650
Text Label 7650 5150 2    60   ~ 0
ENABLE1
$Comp
L R R126
U 1 1 5AEB9472
P 7900 5050
F 0 "R126" V 7980 5050 50  0000 C CNN
F 1 "330E" V 7900 5050 50  0000 C CNN
F 2 "AutomataFootprint:R_0805_AUTOMAT" V 7830 5050 50  0001 C CNN
F 3 "" H 7900 5050 50  0001 C CNN
	1    7900 5050
	0    1    1    0   
$EndComp
Wire Wire Line
	7500 5050 7750 5050
Wire Wire Line
	8050 5050 8200 5050
Wire Wire Line
	7650 5150 8200 5150
Text Label 7650 5250 2    60   ~ 0
ENABLE2
$Comp
L R R127
U 1 1 5AEC0171
P 7900 5350
F 0 "R127" V 7980 5350 50  0000 C CNN
F 1 "330E" V 7900 5350 50  0000 C CNN
F 2 "AutomataFootprint:R_0805_AUTOMAT" V 7830 5350 50  0001 C CNN
F 3 "" H 7900 5350 50  0001 C CNN
	1    7900 5350
	0    1    1    0   
$EndComp
Wire Wire Line
	7500 5350 7750 5350
Wire Wire Line
	8050 5350 8200 5350
Text Label 8900 5250 0    60   ~ 0
ISO_ENABLE2
$Comp
L ISO7221 U25
U 1 1 5A920D3E
P 6900 5850
F 0 "U25" H 7750 5600 60  0000 C CNN
F 1 "ISO7221" H 7750 5450 60  0000 C CNN
F 2 "AutomataFootprint:ISO7221_AUTOMATA" H 6900 5850 60  0001 C CNN
F 3 "" H 6900 5850 60  0000 C CNN
	1    6900 5850
	1    0    0    -1  
$EndComp
Text Label 6850 6550 2    79   ~ 0
RX_3
Text Label 6450 6900 0    79   ~ 0
TX_3
Text Label 8900 5150 0    60   ~ 0
ISO_ENABLE1
$Comp
L R R128
U 1 1 5A94726F
P 9650 5000
F 0 "R128" V 9730 5000 50  0000 C CNN
F 1 "1k" V 9650 5000 50  0000 C CNN
F 2 "AutomataFootprint:AutomataFootprint_R_0805_AUTOMATA" V 9580 5000 50  0001 C CNN
F 3 "" H 9650 5000 50  0001 C CNN
	1    9650 5000
	1    0    0    -1  
$EndComp
$Comp
L R R129
U 1 1 5A948E45
P 9650 5400
F 0 "R129" V 9730 5400 50  0000 C CNN
F 1 "1k" V 9650 5400 50  0000 C CNN
F 2 "AutomataFootprint:AutomataFootprint_R_0805_AUTOMATA" V 9580 5400 50  0001 C CNN
F 3 "" H 9650 5400 50  0001 C CNN
	1    9650 5400
	-1   0    0    1   
$EndComp
$Comp
L C C37
U 1 1 5A94A360
P 7400 3050
F 0 "C37" H 7425 3150 50  0000 L CNN
F 1 "100nF" H 7425 2950 50  0000 L CNN
F 2 "AutomataFootprint:AutomataFootprint_C_0805_AUTOMATA" H 7438 2900 50  0001 C CNN
F 3 "" H 7400 3050 50  0001 C CNN
	1    7400 3050
	1    0    0    -1  
$EndComp
Text Label 7400 2850 2    60   ~ 0
5V
Wire Wire Line
	7400 2850 7400 2900
Wire Wire Line
	7400 3200 7400 3250
Text Label 7400 3250 2    60   ~ 0
S_GND
$Comp
L C C38
U 1 1 5A94B4C6
P 7400 3900
F 0 "C38" H 7425 4000 50  0000 L CNN
F 1 "100nF" H 7425 3800 50  0000 L CNN
F 2 "AutomataFootprint:AutomataFootprint_C_0805_AUTOMATA" H 7438 3750 50  0001 C CNN
F 3 "" H 7400 3900 50  0001 C CNN
	1    7400 3900
	1    0    0    -1  
$EndComp
Text Label 7400 3700 2    60   ~ 0
5V
Wire Wire Line
	7400 3700 7400 3750
Wire Wire Line
	7400 4050 7400 4100
Text Label 7400 4100 2    60   ~ 0
S_GND
$Comp
L C C36
U 1 1 5A94BC80
P 6950 6050
F 0 "C36" H 6975 6150 50  0000 L CNN
F 1 "100nF" H 6975 5950 50  0000 L CNN
F 2 "AutomataFootprint:AutomataFootprint_C_0805_AUTOMATA" H 6988 5900 50  0001 C CNN
F 3 "" H 6950 6050 50  0001 C CNN
	1    6950 6050
	1    0    0    -1  
$EndComp
Text Label 6950 5850 2    60   ~ 0
5V
Wire Wire Line
	6950 5850 6950 5900
Wire Wire Line
	6950 6200 6950 6250
Text Label 6950 6250 2    60   ~ 0
S_GND
$Comp
L C C51
U 1 1 5A94C22C
P 9950 3300
F 0 "C51" H 9975 3400 50  0000 L CNN
F 1 "100nF" H 9975 3200 50  0000 L CNN
F 2 "AutomataFootprint:C_0805_AUTOMATA" H 9988 3150 50  0001 C CNN
F 3 "" H 9950 3300 50  0001 C CNN
	1    9950 3300
	1    0    0    -1  
$EndComp
Text Label 9950 3150 0    60   ~ 0
iso_5V
Wire Wire Line
	9950 3450 9950 3550
Text Label 9950 3550 0    60   ~ 0
iso_gnd
$Comp
L C C46
U 1 1 5A94DAD7
P 9850 4100
F 0 "C46" H 9875 4200 50  0000 L CNN
F 1 "100nF" H 9875 4000 50  0000 L CNN
F 2 "AutomataFootprint:C_0805_AUTOMATA" H 9888 3950 50  0001 C CNN
F 3 "" H 9850 4100 50  0001 C CNN
	1    9850 4100
	1    0    0    -1  
$EndComp
Text Label 9850 3950 0    60   ~ 0
iso_5V
Wire Wire Line
	9850 4250 9850 4350
Text Label 9850 4350 0    60   ~ 0
iso_gnd
$Comp
L C C39
U 1 1 5A94E49C
P 9500 6550
F 0 "C39" H 9525 6650 50  0000 L CNN
F 1 "100nF" H 9525 6450 50  0000 L CNN
F 2 "AutomataFootprint:AutomataFootprint_C_0805_AUTOMATA" H 9538 6400 50  0001 C CNN
F 3 "" H 9500 6550 50  0001 C CNN
	1    9500 6550
	1    0    0    -1  
$EndComp
Text Label 9500 6400 0    60   ~ 0
iso_5V
Wire Wire Line
	9500 6700 9500 6800
Text Label 9500 6800 0    60   ~ 0
iso_gnd
$Comp
L C C47
U 1 1 5A950B2E
P 9850 7550
F 0 "C47" H 9875 7650 50  0000 L CNN
F 1 "100nF" H 9875 7450 50  0000 L CNN
F 2 "AutomataFootprint:C_0805_AUTOMATA" H 9888 7400 50  0001 C CNN
F 3 "" H 9850 7550 50  0001 C CNN
	1    9850 7550
	1    0    0    -1  
$EndComp
$Comp
L C C45
U 1 1 5A9511A6
P 9700 8150
F 0 "C45" H 9725 8250 50  0000 L CNN
F 1 "100nF" H 9725 8050 50  0000 L CNN
F 2 "AutomataFootprint:C_0805_AUTOMATA" H 9738 8000 50  0001 C CNN
F 3 "" H 9700 8150 50  0001 C CNN
	1    9700 8150
	1    0    0    -1  
$EndComp
Text Label 9850 7800 0    60   ~ 0
S_GND
Wire Wire Line
	9850 7700 9850 7800
Text Label 9850 7350 0    60   ~ 0
5V
Wire Wire Line
	9850 7350 9850 7400
Text Label 9700 8400 0    60   ~ 0
iso_gnd
Wire Wire Line
	9700 8400 9700 8300
Text Label 9700 7950 0    60   ~ 0
iso_5V
Wire Wire Line
	9700 7950 9700 8000
$Comp
L Conn_01x04 J17
U 1 1 5A94CCD9
P 6750 3400
F 0 "J17" H 6750 3600 50  0000 C CNN
F 1 "UART1" H 6750 3100 50  0000 C CNN
F 2 "AutomataFootprint:Pin_Header_Straight_1x04_Pitch2.54mm_Automata" H 6750 3400 50  0001 C CNN
F 3 "" H 6750 3400 50  0001 C CNN
	1    6750 3400
	1    0    0    -1  
$EndComp
$Comp
L Conn_01x04 J18
U 1 1 5A94D082
P 6800 4200
F 0 "J18" H 6800 4400 50  0000 C CNN
F 1 "UART2" H 6800 3900 50  0000 C CNN
F 2 "AutomataFootprint:Pin_Header_Straight_1x04_Pitch2.54mm_Automata" H 6800 4200 50  0001 C CNN
F 3 "" H 6800 4200 50  0001 C CNN
	1    6800 4200
	1    0    0    -1  
$EndComp
Text Label 6550 3600 2    60   ~ 0
S_GND
$Comp
L HCPL2631 OPT3
U 1 1 5AC38D32
P 8450 5250
F 0 "OPT3" H 8400 5550 60  0000 C CNN
F 1 "HCPL2631" H 8500 5050 60  0000 C CNN
F 2 "AutomataFootprint:hpcl2631_SMD_AUTOMATA" H 8450 5250 60  0001 C CNN
F 3 "" H 8450 5250 60  0000 C CNN
	1    8450 5250
	1    0    0    -1  
$EndComp
Text Label 8900 5050 0    60   ~ 0
iso_5V
Wire Wire Line
	8900 5050 8750 5050
Text Label 8900 5350 0    60   ~ 0
iso_gnd
Wire Wire Line
	8900 5350 8750 5350
Wire Wire Line
	9650 4800 9650 4850
Wire Wire Line
	7650 5250 8200 5250
Wire Wire Line
	8750 5250 9650 5250
Wire Wire Line
	9650 5600 9650 5550
$Comp
L C C52
U 1 1 5AA1563F
P 10150 5200
F 0 "C52" H 10175 5300 50  0000 L CNN
F 1 "100nF" H 10175 5100 50  0000 L CNN
F 2 "AutomataFootprint:C_0805_AUTOMATA" H 10188 5050 50  0001 C CNN
F 3 "" H 10150 5200 50  0001 C CNN
	1    10150 5200
	1    0    0    -1  
$EndComp
Text Label 10150 5050 0    60   ~ 0
iso_5V
Text Label 10150 5350 0    60   ~ 0
iso_gnd
Wire Wire Line
	8750 5150 9650 5150
Text Label 9650 4800 0    60   ~ 0
iso_5V
Text Label 9650 5600 0    60   ~ 0
iso_5V
Text Label 7500 5050 0    60   ~ 0
5V
Text Label 7500 5350 0    60   ~ 0
5V
$EndSCHEMATC
