EESchema Schematic File Version 2
LIBS:power
LIBS:device
LIBS:switches
LIBS:relays
LIBS:motors
LIBS:transistors
LIBS:conn
LIBS:linear
LIBS:regul
LIBS:74xx
LIBS:cmos4000
LIBS:adc-dac
LIBS:memory
LIBS:xilinx
LIBS:microcontrollers
LIBS:dsp
LIBS:microchip
LIBS:analog_switches
LIBS:motorola
LIBS:texas
LIBS:intel
LIBS:audio
LIBS:interface
LIBS:digital-audio
LIBS:philips
LIBS:display
LIBS:cypress
LIBS:siliconi
LIBS:opto
LIBS:atmel
LIBS:contrib
LIBS:valves
LIBS:AUTOPLCV1.4-cache
EELAYER 25 0
EELAYER END
$Descr A2 23386 16535
encoding utf-8
Sheet 1 10
Title ""
Date ""
Rev ""
Comp ""
Comment1 ""
Comment2 ""
Comment3 ""
Comment4 ""
$EndDescr
$Sheet
S 1550 800  4000 8200
U 5A71994F
F0 "LPC1769" 60
F1 "LPC1769.sch" 60
F2 "Processor_VCC" I L 1550 950 60 
F3 "Processor_GND" I L 1550 1050 60 
F4 "P0.17_CTS1_MISO0_MISO_61" I L 1550 6600 60 
F5 "P0.18_DCD1_MOSI0_MOSI_60" I L 1550 5100 60 
F6 "P0.27_I2C0_SDA_25" I L 1550 2500 60 
F7 "P0.28_I2C0SCL_24" I L 1550 2600 60 
F8 "P0.2_AD7_UART0tx_98" I L 1550 1500 60 
F9 "P0.3_AD6_UART0rx_99" I L 1550 1600 60 
F10 "P0.15_TXD1_SCK0_SCK_62" I L 1550 6700 60 
F11 "P0.16_UART1rx_slaveSEL_63" I L 1550 6800 60 
F12 "P0.29_USB_D+_29" I L 1550 1950 60 
F13 "P0.30_USB_D-_30" I L 1550 2050 60 
F14 "P1.18_USBupLED_32" I L 1550 1850 60 
F15 "P1.19_USB_PPWR_33" I L 1550 5800 60 
F16 "P1.22_USB_PWRD_36" I L 1550 5600 60 
F17 "P1.27_USBOVRCR_43" I L 1550 5300 60 
F18 "P0.19_SDA1_59" I L 1550 5000 60 
F19 "P0.20_SCL1_58" I L 1550 4900 60 
F20 "P0.23_AD0_9" I L 1550 7850 60 
F21 "P0.24_AD1_8" I L 1550 7950 60 
F22 "P0.25_AD2_7" I L 1550 7500 60 
F23 "P0.26_AD3_6_AOUT" I R 5550 2850 60 
F24 "P1.30_AD4_Vbus_21" I L 1550 2150 60 
F25 "P1.31_AD5_SCK1_20" I R 5550 3100 60 
F26 "P4.28_RXmCLK_TXD3_82" I R 5550 1300 60 
F27 "P4.29_TXmCLK_RXD3_85" I R 5550 1400 60 
F28 "P3.25_PWM1.2_27" I L 1550 5900 60 
F29 "P3.26_PWM1.3_STCLK_26" I L 1550 3050 60 
F30 "P0.1_RXD3_SCL1_47" I L 1550 3800 60 
F31 "P0.0_TXD3_SDA1_46" I L 1550 3700 60 
F32 "P0.4_I2SRXclk_81" I R 5550 1200 60 
F33 "P0.5_I2SRXws_80" I R 5550 1100 60 
F34 "P0.6_SSEL1_79" I L 1550 6500 60 
F35 "P0.7_SCK1_78" I L 1550 6400 60 
F36 "P0.8_MISO1_77" I L 1550 6300 60 
F37 "P0.9_MOSI1_76" I L 1550 6200 60 
F38 "P0.10_TXD2_SDA2_48" I L 1550 2850 60 
F39 "P0.11_RXD2_SCL2_49" I L 1550 2950 60 
F40 "P0.21_57" I L 1550 4800 60 
F41 "P0.22_56" I L 1550 4700 60 
F42 "P1.0_ENTHtxd0_95" I R 5550 2400 60 
F43 "P1.1_ENTHtxd1_94" I R 5550 2300 60 
F44 "P1.4_ENTHtx_en_93" I R 5550 2200 60 
F45 "P1.8_ENTH_CRS_92" I R 5550 2100 60 
F46 "P1.17_ENTH_MDIO_86" I R 5550 1500 60 
F47 "P1.16_ENTH_MDC_87" I R 5550 1600 60 
F48 "P1.15_ENTHrefCLK_88" I R 5550 1700 60 
F49 "P1.14_ENTH_rxER_89" I R 5550 1800 60 
F50 "P1.10_ENTHrxd1_90" I R 5550 1900 60 
F51 "P1.9_ENTHrxd0_91" I R 5550 2000 60 
F52 "P1.20_PWM1.2_QEI(A)_SCK0_34" I L 1550 4000 60 
F53 "P1.21_PWM1.3_SSEL0_35" I L 1550 5700 60 
F54 "P1.23_MISO0_QEI(B)_PWM1.4_37" I L 1550 4100 60 
F55 "P1.24_MOSI0_PWM1.5_QEI(IDX)_38" I L 1550 4200 60 
F56 "P1.25_MAT1.1_39" I L 1550 5500 60 
F57 "P1.26_PWM1.6_40" I L 1550 5400 60 
F58 "P1.28_PCAP1.0_44" I L 1550 5200 60 
F59 "P1.29_PCAP1.1_45" I L 1550 4600 60 
F60 "P2.0_PWM1.1_TXD1_75" I L 1550 3250 60 
F61 "P2.1_PWM1.2_RXD1_74" I L 1550 3350 60 
F62 "P2.2_PWM1.3_73" I R 5550 1000 60 
F63 "P2.3_PWM1.4_70" I R 5550 900 60 
F64 "P2.4_PWM1.5_69" I R 5550 2950 60 
F65 "P2.5_PWM1.6_68" I L 1550 3450 60 
F66 "P2.6_67" I L 1550 7100 60 
F67 "P2.7_RTS1_66" I L 1550 7000 60 
F68 "P2.8_TXD2_65" I L 1550 6900 60 
F69 "P2.9_RXD2_USBconnect_64" I L 1550 2250 60 
F70 "P2.10_EINT0_NMI_53" I L 1550 1300 60 
F71 "P2.11_EINT1_52" I R 5550 2600 60 
F72 "P2.12_EINT2_51" I L 1550 4500 60 
F73 "P2.13_EINT3_50" I L 1550 4400 60 
F74 "TDO_SWO_1" I R 5550 6350 60 
F75 "TDI_2" I R 5550 7450 60 
F76 "TMS_SWDIO_3" I R 5550 8800 60 
F77 "TRST_4" I R 5550 8100 60 
F78 "TCK_SWDCLK_5" I R 5550 6700 60 
F79 "RTCK_100" I R 5550 8500 60 
F80 "RSTOUT_14" I L 1550 8400 60 
F81 "RESET_17" I L 1550 1400 60 
F82 "V_BAT_19" I L 1550 8900 60 
F83 "ADC_VREFp_12" I L 1550 8700 60 
F84 "ADC_VREFn_15" I R 5550 8700 60 
F85 "ADC_VDD_A_10" I R 5550 7100 60 
F86 "ADC_VSS_A_11" I R 5550 7250 60 
$EndSheet
$Sheet
S 10400 850  950  1050
U 5A73FC7C
F0 "Serial_Programing" 60
F1 "Serial_Programing.sch" 60
F2 "RX0" I L 10400 1850 60 
F3 "TX0" I L 10400 1750 60 
F4 "SERIAL_GND" I L 10400 1050 60 
F5 "5_volt" I L 10400 950 60 
F6 "ISP" I L 10400 1250 60 
F7 "RESET" I L 10400 1350 60 
F8 "BOOTLOADER" I L 10400 1450 60 
$EndSheet
Text Label 7450 1100 2    59   ~ 0
3.3V
Text Label 7450 1000 2    59   ~ 0
5V
Text Label 7450 900  2    59   ~ 0
24V
Text Label 7450 1850 2    59   ~ 0
GND
Text Label 10200 1050 2    59   ~ 0
GND
Text Label 10200 950  2    59   ~ 0
5V
Text Label 1350 950  2    59   ~ 0
3.3V
Text Label 1350 1050 2    59   ~ 0
GND
Text Label 1350 1300 2    59   ~ 0
ISP
Text Label 1350 1400 2    59   ~ 0
RESET
Text Label 10200 1250 2    59   ~ 0
ISP
Text Label 10200 1350 2    59   ~ 0
RESET
Text Label 10200 1450 2    59   ~ 0
BOOTLOADER
Text Label 10200 1850 2    59   ~ 0
RX0
Text Label 10200 1750 2    59   ~ 0
TX0
Text Label 1350 1500 2    59   ~ 0
TX0
Text Label 1350 1600 2    59   ~ 0
RX0
$Sheet
S 14400 750  950  1100
U 5A785E25
F0 "BROWN_OUT" 59
F1 "BROWN_OUT.sch" 59
F2 "24V" I L 14400 800 60 
F3 "GND" I L 14400 900 60 
F4 "BROWN_OUT" I L 14400 1100 60 
$EndSheet
Text Label 14250 900  2    59   ~ 0
GND
Text Label 14250 1100 2    59   ~ 0
BROUN_OUT
$Sheet
S 16350 700  850  1050
U 5A78B52B
F0 "Memory" 59
F1 "Memory.sch" 59
F2 "SCL" I L 16350 750 60 
F3 "SDA" I L 16350 850 60 
F4 "MEMORY_GND" I L 16350 1150 60 
F5 "MEMORY_VCC" I L 16350 1050 60 
$EndSheet
Text Label 16200 1050 2    59   ~ 0
3.3V
Text Label 16200 1150 2    59   ~ 0
GND
Text Label 16200 750  2    59   ~ 0
SCL
Text Label 16200 850  2    59   ~ 0
SDA
$Sheet
S 12400 650  1150 1350
U 5A818238
F0 "USB" 59
F1 "USB.sch" 59
F2 "5v_VCC" I L 12400 1750 60 
F3 "USB_DP" I L 12400 1000 60 
F4 "USB_DM" I L 12400 1100 60 
F5 "USB_UP_LED" I L 12400 1200 60 
F6 "USB_CONNECT" I L 12400 1300 60 
F7 "USB_3V3" I L 12400 1650 60 
F8 "USB_VBUS" I L 12400 1400 60 
F9 "GND" I L 12400 1850 60 
F10 "USB_5V" I L 12400 900 60 
F11 "DN" I R 13550 1550 60 
F12 "DP" I R 13550 1650 60 
$EndSheet
$Comp
L BATTERY BT1
U 1 1 5A83202E
P 2300 10050
F 0 "BT1" H 2300 10250 50  0000 C CNN
F 1 "BATTERY" H 2300 9860 50  0000 C CNN
F 2 "AutomataFootprint:VERT_BAT_holder" H 2300 10050 60  0001 C CNN
F 3 "" H 2300 10050 60  0000 C CNN
	1    2300 10050
	1    0    0    -1  
$EndComp
Text Label 1250 8900 2    59   ~ 0
VBAT
Text Label 1700 10050 2    59   ~ 0
VBAT
Text Label 2900 10050 0    59   ~ 0
GND
Text Label 1350 1850 2    59   ~ 0
USB_UP
Text Label 1350 1950 2    59   ~ 0
USB_D+
Text Label 1350 2050 2    59   ~ 0
USB_D-
Text Label 1350 2150 2    59   ~ 0
USB_VBUS
Text Label 1350 2250 2    59   ~ 0
USB_CONN
Text Notes 650  950  0    59   ~ 0
POWER
Text Notes 900  1750 1    59   ~ 0
PROGRAMMING
Text Notes 550  2050 0    59   ~ 0
USB
Text Label 12250 1200 2    59   ~ 0
USB_UP
Text Label 12250 1000 2    59   ~ 0
USB_D+
Text Label 12250 1100 2    59   ~ 0
USB_D-
Text Label 12250 1400 2    59   ~ 0
USB_VBUS
Text Label 12250 1300 2    59   ~ 0
USB_CONN
Text Label 12250 1650 2    59   ~ 0
3.3V
Text Label 12250 1750 2    59   ~ 0
5V
Text Label 12250 1850 2    59   ~ 0
GND
Text Label 18950 2800 2    59   ~ 0
5V
Text Label 18950 2900 2    59   ~ 0
GND
$Sheet
S 11750 4500 1850 2650
U 5A895490
F0 "ISOLATED_INPUT_IOBOARD" 59
F1 "ISOLATED_INPUT_IOBOARD.sch" 59
F2 "EXT_IP1" I R 13600 4550 60 
F3 "EXT_IP2" I R 13600 4650 60 
F4 "GND2" I R 13600 5350 60 
F5 "EXT_IP5" I R 13600 4950 60 
F6 "EXT_IP4" I R 13600 4850 60 
F7 "EXT_IP3" I R 13600 4750 60 
F8 "EXT_IP9" I R 13600 5450 60 
F9 "EXT_IP12" I R 13600 5750 60 
F10 "EXT_IP11" I R 13600 5650 60 
F11 "EXT_IP10" I R 13600 5550 60 
F12 "EXT_IP13" I R 13600 5850 60 
F13 "EXT_IP16" I R 13600 6150 60 
F14 "EXT_IP15" I R 13600 6050 60 
F15 "EXT_IP14" I R 13600 5950 60 
F16 "245_V" I L 11750 6800 60 
F17 "245_GND" I L 11750 6900 60 
F18 "ISO_IN1" I L 11750 4550 60 
F19 "ISO_IN8" I L 11750 5250 60 
F20 "ISO_IN7" I L 11750 5150 60 
F21 "ISO_IN6" I L 11750 5050 60 
F22 "ISO_IN5" I L 11750 4950 60 
F23 "ISO_IN4" I L 11750 4850 60 
F24 "ISO_IN3" I L 11750 4750 60 
F25 "ISO_IN2" I L 11750 4650 60 
F26 "ISO_IN9" I L 11750 5350 60 
F27 "ISO_IN13" I L 11750 5750 60 
F28 "ISO_IN12" I L 11750 5650 60 
F29 "ISO_IN11" I L 11750 5550 60 
F30 "ISO_IN10" I L 11750 5450 60 
F31 "A+" I R 13600 6600 60 
F32 "A-" I R 13600 6700 60 
F33 "B-" I R 13600 6800 60 
F34 "B+" I R 13600 6900 60 
F35 "I+" I R 13600 7000 60 
F36 "I-" I R 13600 7100 60 
F37 "PHASEA" I L 11750 6450 60 
F38 "PHASEB" I L 11750 6550 60 
F39 "INDEX" I L 11750 6650 60 
F40 "GND3" I R 13600 6250 60 
F41 "EXT_IP6" I R 13600 5050 60 
F42 "EXT_IP7" I R 13600 5150 60 
F43 "EXT_IP8" I R 13600 5250 60 
F44 "ISO_IN14" I L 11750 5850 60 
F45 "ISO_IN15" I L 11750 5950 60 
F46 "ISO_IN16" I L 11750 6050 60 
F47 "R/S_LED" I L 11750 6200 60 
$EndSheet
Text Label 13800 4550 0    60   ~ 0
EXT_IP1
Text Label 13800 4650 0    60   ~ 0
EXT_IP2
Text Label 13800 4750 0    60   ~ 0
EXT_IP3
Text Label 13800 4850 0    60   ~ 0
EXT_IP4
Text Label 13800 4950 0    60   ~ 0
EXT_IP5
Text Label 13800 5050 0    60   ~ 0
EXT_IP6
Text Label 13800 5150 0    60   ~ 0
EXT_IP7
Text Label 13800 5250 0    60   ~ 0
EXT_IP8
Text Label 13800 5350 0    60   ~ 0
GND2
Text Label 13800 5450 0    60   ~ 0
EXT_IP9
Text Label 13800 5550 0    60   ~ 0
EXT_IP10
Text Label 13800 5650 0    60   ~ 0
EXT_IP11
Text Label 13800 5750 0    60   ~ 0
EXT_IP12
Text Label 13800 5850 0    60   ~ 0
EXT_IP13
Text Label 13800 5950 0    60   ~ 0
EXT_IP14
Text Label 13800 6050 0    60   ~ 0
EXT_IP15
Text Label 13800 6150 0    60   ~ 0
EXT_IP16
Text Label 13800 6250 0    60   ~ 0
GND3
Text Label 11500 4550 2    60   ~ 0
ISO_IN1
Text Label 11500 4650 2    60   ~ 0
ISO_IN2
Text Label 11500 4750 2    60   ~ 0
ISO_IN3
Text Label 11500 4850 2    60   ~ 0
ISO_IN4
Text Label 11500 4950 2    60   ~ 0
ISO_IN5
Text Label 11500 5050 2    60   ~ 0
ISO_IN6
Text Label 11500 5150 2    60   ~ 0
ISO_IN7
Text Label 11500 5250 2    60   ~ 0
ISO_IN8
Text Label 11500 5350 2    60   ~ 0
ISO_IN9
Text Label 11500 5450 2    60   ~ 0
ISO_IN10
Text Label 11500 5550 2    60   ~ 0
ISO_IN11
Text Label 11500 5650 2    60   ~ 0
ISO_IN12
Text Label 11500 5750 2    60   ~ 0
ISO_IN13
Text Label 11500 5850 2    60   ~ 0
ISO_IN14
Text Label 11500 5950 2    60   ~ 0
ISO_IN15
Text Label 11500 6050 2    60   ~ 0
ISO_IN16
Text Label 11500 6450 2    60   ~ 0
PHASE_A
Text Label 11500 6550 2    60   ~ 0
PHASE_B
Text Label 11500 6650 2    60   ~ 0
INDEX
Text Label 11500 6800 2    59   ~ 0
5V
Text Label 11500 6900 2    59   ~ 0
GND
Text Label 19000 750  2    60   ~ 0
RX1
Text Label 19000 850  2    60   ~ 0
TX1
Text Label 19000 950  2    60   ~ 0
ENL1
Text Label 19000 1350 2    60   ~ 0
ENL2
Text Label 18950 1850 2    60   ~ 0
RX2
Text Label 18950 1950 2    60   ~ 0
TX2
$Sheet
S 19200 700  1250 2250
U 5A7DE2FF
F0 "RS485 & 232" 59
F1 "RS485 & 232.sch" 59
F2 "5V_VCC" I L 19200 2800 60 
F3 "GND" I L 19200 2900 60 
F4 "RS485_TX1+" I R 20450 750 60 
F5 "RS485_TX1-" I R 20450 850 60 
F6 "TX232" I R 20450 1900 60 
F7 "RX232" I R 20450 2000 60 
F8 "RX1" I L 19200 750 60 
F9 "TX1" I L 19200 850 60 
F10 "ENABLE1" I L 19200 950 60 
F11 "TX_3" I L 19200 1950 60 
F12 "RX_3" I L 19200 1850 60 
F13 "ENABLE2" I L 19200 1350 60 
F14 "RS485_TX2+" I R 20450 1300 60 
F15 "RS485_TX2-" I R 20450 1400 60 
F16 "ISO_5V" I R 20450 2800 60 
F17 "ISO_GND" I R 20450 2900 60 
F18 "RX_2" I L 19200 1150 60 
F19 "TX_2" I L 19200 1250 60 
$EndSheet
Text Label 19000 1150 2    60   ~ 0
RX3
Text Label 19000 1250 2    60   ~ 0
TX3
Text Label 20650 750  0    60   ~ 0
RS485_TX1+
Text Label 20650 850  0    60   ~ 0
RS485_TX1-
Text Label 20650 1300 0    60   ~ 0
RS485_TX2+
Text Label 20650 1400 0    60   ~ 0
RS485_TX2-
Text Label 20650 1900 0    60   ~ 0
RS232_TX
Text Label 20650 2000 0    60   ~ 0
RS232_RX
Text Label 20650 2800 0    60   ~ 0
ISO_5V
Text Label 20650 2900 0    60   ~ 0
ISO_GND
$Sheet
S 17000 4550 1950 2850
U 5AA081D6
F0 "4OUTPUT_GROUP" 60
F1 "4OUTPUT_GROUP.sch" 60
F2 "5V" I L 17000 7200 60 
F3 "SOUT1" I L 17000 4650 60 
F4 "SSR1+" I R 18950 4600 60 
F5 "SOUT2" I L 17000 4750 60 
F6 "SOUT3" I L 17000 4850 60 
F7 "SOUT4" I L 17000 4950 60 
F8 "GND" I L 17000 7300 60 
F9 "SOUT5" I L 17000 5050 60 
F10 "SOUT6" I L 17000 5150 60 
F11 "SOUT7" I L 17000 5250 60 
F12 "SOUT8" I L 17000 5350 60 
F13 "SSR2+" I R 18950 4700 60 
F14 "OUTGND_1" I R 18950 5100 60 
F15 "OUT24V_1" I R 18950 5000 60 
F16 "SSR3+" I R 18950 4800 60 
F17 "SSR4+" I R 18950 4900 60 
F18 "SSR5+" I R 18950 5250 60 
F19 "SSR6+" I R 18950 5350 60 
F20 "SSR7+" I R 18950 5450 60 
F21 "SSR8+" I R 18950 5550 60 
F22 "SSR9+" I R 18950 5900 60 
F23 "SSR10+" I R 18950 6000 60 
F24 "SSR11+" I R 18950 6100 60 
F25 "SSR12+" I R 18950 6200 60 
F26 "SOUT9" I L 17000 5450 60 
F27 "SOUT10" I L 17000 5550 60 
F28 "SOUT11" I L 17000 5650 60 
F29 "SOUT12" I L 17000 5750 60 
F30 "PULSE1+" I R 18950 6550 60 
F31 "PULSE1-" I R 18950 6650 60 
F32 "PULSE2+" I R 18950 6950 60 
F33 "PULSE2-" I R 18950 7050 60 
F34 "OUTGND_2" I R 18950 5750 60 
F35 "OUT24V_2" I R 18950 5650 60 
F36 "OUTGND_3" I R 18950 6400 60 
F37 "OUT24V_3" I R 18950 6300 60 
F38 "MOUT1P" I L 17000 6100 60 
F39 "MOUT1D" I L 17000 6200 60 
F40 "MOUT2P" I L 17000 6300 60 
F41 "MOUT2D" I L 17000 6400 60 
F42 "DIR1-" I R 18950 6850 60 
F43 "DIR1+" I R 18950 6750 60 
F44 "DIR2+" I R 18950 7150 60 
F45 "DIR2-" I R 18950 7250 60 
F46 "ERROR_LED" I L 17000 6650 60 
F47 "HEART_BEAT" I L 17000 6750 60 
$EndSheet
Text Label 16700 4650 2    60   ~ 0
SOUT1
Text Label 16700 4750 2    60   ~ 0
SOUT2
Text Label 16700 4850 2    60   ~ 0
SOUT3
Text Label 16700 4950 2    60   ~ 0
SOUT4
Text Label 16700 5050 2    60   ~ 0
SOUT5
Text Label 16700 5150 2    60   ~ 0
SOUT6
Text Label 16700 5250 2    60   ~ 0
SOUT7
Text Label 16700 5350 2    60   ~ 0
SOUT8
Text Label 16700 5450 2    60   ~ 0
SOUT9
Text Label 16700 5550 2    60   ~ 0
SOUT10
Text Label 16700 5650 2    60   ~ 0
SOUT11
Text Label 16700 5750 2    60   ~ 0
SOUT12
Text Label 16700 6100 2    60   ~ 0
PULSE1
Text Label 16750 7200 2    59   ~ 0
5V
Text Label 16750 7300 2    59   ~ 0
GND
Text Label 16700 6200 2    60   ~ 0
DIR1
Text Label 16700 6300 2    60   ~ 0
PULSE2
Text Label 16700 6400 2    60   ~ 0
DIR2
Text Label 19250 4600 0    60   ~ 0
SSR1+
Text Label 19250 4700 0    60   ~ 0
SSR2+
Text Label 19250 4800 0    60   ~ 0
SSR3+
Text Label 19250 4900 0    60   ~ 0
SSR4+
Text Label 19250 5000 0    60   ~ 0
OUT24V_1
Text Label 19250 5100 0    60   ~ 0
OUTGND_1
Text Label 19250 5250 0    60   ~ 0
SSR5+
Text Label 19250 5350 0    60   ~ 0
SSR6+
Text Label 19250 5450 0    60   ~ 0
SSR7+
Text Label 19250 5550 0    60   ~ 0
SSR8+
Text Label 19250 5650 0    60   ~ 0
OUT24V_2
Text Label 19250 5750 0    60   ~ 0
OUTGND_2
Text Label 19250 5900 0    60   ~ 0
SSR9+
Text Label 19250 6000 0    60   ~ 0
SSR10+
Text Label 19250 6100 0    60   ~ 0
SSR11+
Text Label 19250 6200 0    60   ~ 0
SSR12+
Text Label 19250 6300 0    60   ~ 0
OUT24V_3
Text Label 19250 6400 0    60   ~ 0
OUTGND_3
Text Label 19250 6550 0    60   ~ 0
PULSE1+
Text Label 19250 6650 0    60   ~ 0
PULSE1-
Text Label 19250 6750 0    60   ~ 0
DIR1+
Text Label 19250 6850 0    60   ~ 0
DIR1-
Text Label 19250 6950 0    60   ~ 0
PULSE2+
Text Label 19250 7050 0    60   ~ 0
PULSE2-
Text Label 19250 7150 0    60   ~ 0
DIR2+
Text Label 19250 7250 0    60   ~ 0
DIR2-
Text Label 13800 6600 0    60   ~ 0
A+
Text Label 13800 6700 0    60   ~ 0
A-
Text Label 13800 6800 0    60   ~ 0
B+
Text Label 13800 6900 0    60   ~ 0
B-
Text Label 13800 7000 0    60   ~ 0
I+
Text Label 13800 7100 0    60   ~ 0
I-
$Comp
L Conn_01x06 J8
U 1 1 5ABD8ACD
P 20300 4800
F 0 "J8" V 20400 5000 50  0000 C CNN
F 1 "OUTPUT_SET1" V 20400 4700 50  0000 C CNN
F 2 "AutomataFootprint:PHX_6PIN_5.08_8_SPACING" H 20300 4800 50  0001 C CNN
F 3 "" H 20300 4800 50  0001 C CNN
	1    20300 4800
	1    0    0    -1  
$EndComp
$Comp
L Conn_01x06 J9
U 1 1 5ABE2471
P 20300 5450
F 0 "J9" V 20400 5650 50  0000 C CNN
F 1 "OUTPUT_SET2" V 20400 5350 50  0000 C CNN
F 2 "AutomataFootprint:PHX_6PIN_5.08_8_SPACING" H 20300 5450 50  0001 C CNN
F 3 "" H 20300 5450 50  0001 C CNN
	1    20300 5450
	1    0    0    -1  
$EndComp
$Comp
L Conn_01x06 J10
U 1 1 5ABE98FB
P 20300 6100
F 0 "J10" V 20400 6300 50  0000 C CNN
F 1 "OUTPUT_SET3" V 20400 6000 50  0000 C CNN
F 2 "AutomataFootprint:PHX_6PIN_5.08_8_SPACING" H 20300 6100 50  0001 C CNN
F 3 "" H 20300 6100 50  0001 C CNN
	1    20300 6100
	1    0    0    -1  
$EndComp
$Comp
L Conn_01x08 J11
U 1 1 5ABEFD67
P 20300 6850
F 0 "J11" H 20300 7250 50  0000 C CNN
F 1 "HIGH_SPEED_OUT" H 20300 6350 50  0000 C CNN
F 2 "AutomataFootprint:PHX_16PIN_5.08_8_SPACING" H 20300 6850 50  0001 C CNN
F 3 "" H 20300 6850 50  0001 C CNN
	1    20300 6850
	1    0    0    -1  
$EndComp
$Comp
L Conn_01x09 J5
U 1 1 5ABFDE29
P 14650 4950
F 0 "J5" V 14750 5300 50  0000 C CNN
F 1 "EXTERNAL_INPUT" V 14750 4900 50  0000 C CNN
F 2 "AutomataFootprint:PHX-3.81-9x1_AUTOMATA" H 14650 4950 50  0001 C CNN
F 3 "" H 14650 4950 50  0001 C CNN
	1    14650 4950
	1    0    0    -1  
$EndComp
$Comp
L Conn_01x09 J6
U 1 1 5AC05FB6
P 14850 5850
F 0 "J6" V 14950 6200 50  0000 C CNN
F 1 "EXTERNAL_INPUT" V 14950 5800 50  0000 C CNN
F 2 "AutomataFootprint:PHX-3.81-9x1_AUTOMATA" H 14850 5850 50  0001 C CNN
F 3 "" H 14850 5850 50  0001 C CNN
	1    14850 5850
	1    0    0    -1  
$EndComp
$Comp
L Conn_01x08 J4
U 1 1 5AC0E7E0
P 14500 6700
F 0 "J4" H 14500 7100 50  0000 C CNN
F 1 "QEI" V 14650 6650 50  0000 C CNN
F 2 "AutomataFootprint:PHX-3.81-8x1_AUTOMATA" H 14500 6700 50  0001 C CNN
F 3 "" H 14500 6700 50  0001 C CNN
	1    14500 6700
	1    0    0    -1  
$EndComp
Text Label 14200 6400 2    59   ~ 0
5V
Text Label 14200 6500 2    59   ~ 0
GND
Text Label 9250 850  0    79   ~ 0
EXT_24V
Text Label 14250 800  2    79   ~ 0
EXT_24V
$Comp
L Conn_01x03 J3
U 1 1 5AC65D2F
P 21450 1400
F 0 "J3" H 21450 1600 50  0000 C CNN
F 1 "Conn_01x03" H 21450 1200 50  0000 C CNN
F 2 "AutomataFootprint:PHX-3.81-3x1_AUTOMATA" H 21450 1400 50  0001 C CNN
F 3 "" H 21450 1400 50  0001 C CNN
	1    21450 1400
	1    0    0    -1  
$EndComp
Text Label 21050 1600 2    60   ~ 0
ISO_GND
Wire Notes Line
	800  1750 800  2300
Wire Wire Line
	18950 7250 20100 7250
Wire Wire Line
	18950 7150 20100 7150
Wire Wire Line
	18950 7050 20100 7050
Wire Wire Line
	18950 6950 20100 6950
Wire Wire Line
	18950 6850 20100 6850
Wire Wire Line
	18950 6750 20100 6750
Wire Wire Line
	18950 6650 20100 6650
Wire Wire Line
	18950 6550 20100 6550
Wire Wire Line
	18950 6400 20100 6400
Wire Wire Line
	18950 6300 20100 6300
Wire Wire Line
	18950 6200 20100 6200
Wire Wire Line
	18950 6100 20100 6100
Wire Wire Line
	18950 6000 20100 6000
Wire Wire Line
	18950 5900 20100 5900
Wire Wire Line
	18950 5750 20100 5750
Wire Wire Line
	18950 5650 20100 5650
Wire Wire Line
	18950 5550 20100 5550
Wire Wire Line
	18950 5450 20100 5450
Wire Wire Line
	18950 5350 20100 5350
Wire Wire Line
	18950 5250 20100 5250
Wire Wire Line
	18950 5100 20100 5100
Wire Wire Line
	18950 5000 20100 5000
Wire Wire Line
	18950 4900 20100 4900
Wire Wire Line
	18950 4800 20100 4800
Wire Wire Line
	18950 4700 20100 4700
Wire Wire Line
	18950 4600 20100 4600
Wire Wire Line
	16750 7300 17000 7300
Wire Wire Line
	16750 7200 17000 7200
Wire Wire Line
	16700 6400 17000 6400
Wire Wire Line
	16700 6300 17000 6300
Wire Wire Line
	16700 6200 17000 6200
Wire Wire Line
	16700 6100 17000 6100
Wire Wire Line
	16700 5750 17000 5750
Wire Wire Line
	16700 5650 17000 5650
Wire Wire Line
	16700 5550 17000 5550
Wire Wire Line
	16700 5450 17000 5450
Wire Wire Line
	16700 5350 17000 5350
Wire Wire Line
	16700 5250 17000 5250
Wire Wire Line
	16700 5150 17000 5150
Wire Wire Line
	16700 5050 17000 5050
Wire Wire Line
	16700 4950 17000 4950
Wire Wire Line
	16700 4850 17000 4850
Wire Wire Line
	16700 4750 17000 4750
Wire Wire Line
	16700 4650 17000 4650
Wire Wire Line
	20650 2900 20450 2900
Wire Wire Line
	20650 2800 20450 2800
Wire Wire Line
	20650 2000 20450 2000
Wire Wire Line
	20650 1900 20450 1900
Wire Wire Line
	20450 1400 21250 1400
Wire Wire Line
	20450 1300 21250 1300
Wire Wire Line
	20650 850  20450 850 
Wire Wire Line
	20650 750  20450 750 
Wire Wire Line
	19000 950  19200 950 
Wire Wire Line
	19000 850  19200 850 
Wire Wire Line
	19000 750  19200 750 
Wire Wire Line
	19000 1350 19200 1350
Wire Wire Line
	19000 1250 19200 1250
Wire Wire Line
	19000 1150 19200 1150
Wire Wire Line
	18950 1950 19200 1950
Wire Wire Line
	18950 1850 19200 1850
Wire Wire Line
	11500 6900 11750 6900
Wire Wire Line
	11500 6800 11750 6800
Wire Wire Line
	11500 6650 11750 6650
Wire Wire Line
	11500 6550 11750 6550
Wire Wire Line
	11500 6450 11750 6450
Wire Wire Line
	11500 6050 11750 6050
Wire Wire Line
	11500 5950 11750 5950
Wire Wire Line
	11500 5850 11750 5850
Wire Wire Line
	11500 5750 11750 5750
Wire Wire Line
	11500 5650 11750 5650
Wire Wire Line
	11500 5550 11750 5550
Wire Wire Line
	11500 5450 11750 5450
Wire Wire Line
	11500 5350 11750 5350
Wire Wire Line
	11500 5250 11750 5250
Wire Wire Line
	11500 5150 11750 5150
Wire Wire Line
	11500 5050 11750 5050
Wire Wire Line
	11500 4950 11750 4950
Wire Wire Line
	11500 4850 11750 4850
Wire Wire Line
	11500 4750 11750 4750
Wire Wire Line
	11500 4650 11750 4650
Wire Wire Line
	11500 4550 11750 4550
Wire Wire Line
	13600 7100 14300 7100
Wire Wire Line
	13600 7000 14300 7000
Wire Wire Line
	13600 6900 14300 6900
Wire Wire Line
	13600 6800 14300 6800
Wire Wire Line
	13600 6700 14300 6700
Wire Wire Line
	13600 6600 14300 6600
Wire Wire Line
	13600 6250 14650 6250
Wire Wire Line
	13600 6150 14650 6150
Wire Wire Line
	13600 6050 14650 6050
Wire Wire Line
	13600 5950 14650 5950
Wire Wire Line
	13600 5850 14650 5850
Wire Wire Line
	13600 5750 14650 5750
Wire Wire Line
	13600 5650 14650 5650
Wire Wire Line
	13600 5550 14650 5550
Wire Wire Line
	13600 5350 14450 5350
Wire Wire Line
	13600 5450 14650 5450
Wire Wire Line
	13600 5250 14450 5250
Wire Wire Line
	13600 5150 14450 5150
Wire Wire Line
	13600 5050 14450 5050
Wire Wire Line
	13600 4950 14450 4950
Wire Wire Line
	13600 4850 14450 4850
Wire Wire Line
	13600 4750 14450 4750
Wire Wire Line
	13600 4650 14450 4650
Wire Wire Line
	13600 4550 14450 4550
Wire Wire Line
	12250 1850 12400 1850
Wire Notes Line
	800  2300 1550 2300
Wire Notes Line
	800  1750 1550 1750
Wire Wire Line
	1350 1850 1550 1850
Wire Wire Line
	1350 1950 1550 1950
Wire Wire Line
	1350 2050 1550 2050
Wire Wire Line
	1350 2150 1550 2150
Wire Wire Line
	1350 2250 1550 2250
Wire Notes Line
	1000 1700 1550 1700
Wire Wire Line
	1350 1600 1550 1600
Wire Wire Line
	1350 1500 1550 1500
Wire Wire Line
	2900 10050 2600 10050
Wire Wire Line
	1700 10050 2000 10050
Wire Wire Line
	1250 8900 1550 8900
Wire Wire Line
	12250 1750 12400 1750
Wire Wire Line
	12250 1650 12400 1650
Wire Wire Line
	12250 1400 12400 1400
Wire Wire Line
	12250 1300 12400 1300
Wire Wire Line
	12250 1200 12400 1200
Wire Wire Line
	12250 1100 12400 1100
Wire Wire Line
	12250 1000 12400 1000
Wire Wire Line
	18950 2900 19200 2900
Wire Wire Line
	18950 2800 19200 2800
Wire Wire Line
	10200 1850 10400 1850
Wire Wire Line
	10200 1750 10400 1750
Wire Wire Line
	16200 1150 16350 1150
Wire Wire Line
	16200 1050 16350 1050
Wire Wire Line
	14250 1100 14400 1100
Wire Wire Line
	16200 850  16350 850 
Wire Wire Line
	16200 750  16350 750 
Wire Wire Line
	14250 900  14400 900 
Wire Wire Line
	14250 800  14400 800 
Wire Notes Line
	1000 1100 1550 1100
Wire Notes Line
	1000 800  1000 1100
Wire Notes Line
	1550 800  1000 800 
Wire Notes Line
	1000 1150 1000 1700
Wire Notes Line
	1000 1150 1550 1150
Wire Wire Line
	1350 1400 1550 1400
Wire Wire Line
	1550 1300 1350 1300
Wire Wire Line
	1350 1050 1550 1050
Wire Wire Line
	1350 950  1550 950 
Wire Wire Line
	10200 1450 10400 1450
Wire Wire Line
	10200 1350 10400 1350
Wire Wire Line
	10200 1250 10400 1250
Wire Wire Line
	10200 1050 10400 1050
Wire Wire Line
	10200 950  10400 950 
Wire Wire Line
	7450 1850 7700 1850
Wire Wire Line
	7450 1100 7700 1100
Wire Wire Line
	7450 1000 7700 1000
Wire Wire Line
	7450 900  7700 900 
Wire Wire Line
	14300 6400 14200 6400
Wire Wire Line
	14300 6500 14200 6500
Wire Wire Line
	9000 850  9250 850 
Wire Wire Line
	21250 1500 21050 1500
Wire Wire Line
	21050 1500 21050 1600
$Comp
L Conn_02x08_Odd_Even J2
U 1 1 5AC7EEF3
P 14400 8700
F 0 "J2" H 14450 9100 50  0000 C CNN
F 1 "USB/COMM" H 14450 8200 50  0000 C CNN
F 2 "Connectors_Multicomp:Multicomp_MC9A12-1634_2x08x2.54mm_Straight" H 14400 8700 50  0001 C CNN
F 3 "" H 14400 8700 50  0001 C CNN
	1    14400 8700
	1    0    0    -1  
$EndComp
Text Label 13800 8400 2    60   ~ 0
RS485_TX1+
Wire Wire Line
	13800 8400 14200 8400
Text Label 13800 8500 2    60   ~ 0
RS485_TX1-
Wire Wire Line
	13800 8500 14200 8500
Text Label 15000 9100 0    60   ~ 0
ISO_GND
Wire Wire Line
	13800 9100 14200 9100
Text Label 13800 8600 2    60   ~ 0
RS232_TX
Wire Wire Line
	13800 8600 14200 8600
Text Label 13800 8700 2    60   ~ 0
RS232_RX
Wire Wire Line
	13800 8700 14200 8700
Text Label 15150 8700 0    59   ~ 0
GND
Wire Wire Line
	12250 900  12400 900 
Text Label 12250 900  2    79   ~ 0
USB_5V
Text Label 15150 8400 0    79   ~ 0
USB_5V
Wire Wire Line
	15150 8400 14700 8400
Wire Wire Line
	14700 8500 15150 8500
Wire Wire Line
	14700 8600 15150 8600
Wire Wire Line
	14700 8700 15150 8700
Text Label 13750 9000 2    60   ~ 0
ISO_5V
Wire Wire Line
	13750 9000 14200 9000
Wire Wire Line
	15000 9000 14700 9000
Wire Wire Line
	15000 9100 14700 9100
$Comp
L Conn_02x08_Odd_Even J7
U 1 1 5ACD72A3
P 17200 8750
F 0 "J7" H 17250 9150 50  0000 C CNN
F 1 "SPI" H 17250 8250 50  0000 C CNN
F 2 "Connectors_Multicomp:Multicomp_MC9A12-1634_2x08x2.54mm_Straight" H 17200 8750 50  0001 C CNN
F 3 "" H 17200 8750 50  0001 C CNN
	1    17200 8750
	1    0    0    -1  
$EndComp
Wire Wire Line
	16600 8450 17000 8450
Wire Wire Line
	16600 8550 17000 8550
Wire Wire Line
	16600 9150 17000 9150
Wire Wire Line
	16600 8650 17000 8650
Wire Wire Line
	16600 8750 17000 8750
Wire Wire Line
	17950 8450 17500 8450
Wire Wire Line
	17500 8550 17950 8550
Wire Wire Line
	17500 8650 17950 8650
Wire Wire Line
	17500 8750 17950 8750
Wire Wire Line
	17500 9050 17950 9050
Wire Wire Line
	17500 9150 17950 9150
Wire Wire Line
	16600 8850 17000 8850
Wire Wire Line
	17500 8850 17950 8850
Wire Wire Line
	17500 8950 17950 8950
Wire Wire Line
	16600 9050 17000 9050
Wire Wire Line
	17000 8950 16600 8950
Text Label 16600 8450 2    79   ~ 0
MISO
Text Label 17950 8450 0    79   ~ 0
MOSI
Text Label 16600 8550 2    79   ~ 0
SCK
Text Label 17950 8550 0    79   ~ 0
CH1
Text Label 17950 8650 0    79   ~ 0
CH3
Text Label 16600 8750 2    79   ~ 0
CH4
Text Label 16600 8650 2    79   ~ 0
CH2
Text Label 17950 8750 0    79   ~ 0
CH5
Text Label 16600 8850 2    79   ~ 0
CH6
Text Label 17950 8850 0    79   ~ 0
CH7
Text Label 16600 8950 2    59   ~ 0
5V
Text Label 16600 9050 2    59   ~ 0
5V
Text Label 16600 9150 2    59   ~ 0
5V
Text Label 17950 8950 0    59   ~ 0
GND
Text Label 17950 9150 0    59   ~ 0
GND
Text Label 17950 9050 0    59   ~ 0
GND
$Comp
L LED D73
U 1 1 5AD5C001
P 16200 11350
F 0 "D73" H 16200 11450 50  0000 C CNN
F 1 "RUN" H 16200 11250 50  0000 C CNN
F 2 "AutomataFootprint:LED_1206" H 16200 11350 50  0001 C CNN
F 3 "" H 16200 11350 50  0001 C CNN
	1    16200 11350
	1    0    0    -1  
$EndComp
Wire Wire Line
	15500 11350 16050 11350
$Comp
L BC817 Q15
U 1 1 5AD93DF1
P 15400 11650
F 0 "Q15" H 15600 11725 50  0000 L CNN
F 1 "BC817" H 15600 11650 50  0000 L CNN
F 2 "TO_SOT_Packages_SMD:SOT-23" H 15600 11575 50  0001 L CIN
F 3 "" H 15400 11650 50  0001 L CNN
	1    15400 11650
	1    0    0    -1  
$EndComp
Wire Wire Line
	15500 11450 15500 11350
$Comp
L R R125
U 1 1 5AD9AD92
P 14850 11650
F 0 "R125" V 14930 11650 50  0000 C CNN
F 1 "330" V 14850 11650 50  0000 C CNN
F 2 "AutomataFootprint:R_0805_AUTOMAT" V 14780 11650 50  0001 C CNN
F 3 "" H 14850 11650 50  0001 C CNN
	1    14850 11650
	0    1    1    0   
$EndComp
Text Label 15500 12450 0    59   ~ 0
GND
Wire Wire Line
	15000 11650 15200 11650
Text Label 14600 11650 2    79   ~ 0
R/S_LED
Wire Wire Line
	14600 11650 14700 11650
Wire Wire Line
	16550 11350 16350 11350
Wire Wire Line
	15500 12450 15500 11850
Text Label 16900 11350 0    59   ~ 0
5V
$Comp
L LED D72
U 1 1 5ADD97D1
P 16150 13000
F 0 "D72" H 16150 13100 50  0000 C CNN
F 1 "ERR" H 16150 12900 50  0000 C CNN
F 2 "AutomataFootprint:LED_1206" H 16150 13000 50  0001 C CNN
F 3 "" H 16150 13000 50  0001 C CNN
	1    16150 13000
	1    0    0    -1  
$EndComp
Wire Wire Line
	15450 13000 16000 13000
$Comp
L BC817 Q14
U 1 1 5ADD97D8
P 15350 13300
F 0 "Q14" H 15550 13375 50  0000 L CNN
F 1 "BC817" H 15550 13300 50  0000 L CNN
F 2 "TO_SOT_Packages_SMD:SOT-23" H 15550 13225 50  0001 L CIN
F 3 "" H 15350 13300 50  0001 L CNN
	1    15350 13300
	1    0    0    -1  
$EndComp
Wire Wire Line
	15450 13100 15450 13000
$Comp
L R R124
U 1 1 5ADD97DF
P 14800 13300
F 0 "R124" V 14880 13300 50  0000 C CNN
F 1 "330" V 14800 13300 50  0000 C CNN
F 2 "AutomataFootprint:R_0805_AUTOMAT" V 14730 13300 50  0001 C CNN
F 3 "" H 14800 13300 50  0001 C CNN
	1    14800 13300
	0    1    1    0   
$EndComp
Text Label 15450 14100 0    59   ~ 0
GND
Wire Wire Line
	14950 13300 15150 13300
Text Label 14550 13300 2    79   ~ 0
ERROR_LED
Wire Wire Line
	14550 13300 14650 13300
Wire Wire Line
	16500 13000 16300 13000
Wire Wire Line
	15450 14100 15450 13500
Text Label 16900 13000 0    59   ~ 0
5V
Text Label 15550 11350 2    79   ~ 0
R/S_SIGNAL
Text Label 15450 13000 2    79   ~ 0
ERROR_SIGNAL
Wire Wire Line
	13800 8800 14200 8800
Wire Wire Line
	14700 8800 15150 8800
Wire Wire Line
	13800 8900 14200 8900
Text Notes 7950 2300 0    157  ~ 0
POWER
Text Notes 11750 2300 2    157  ~ 0
PROGRAMMING
Text Notes 12500 2300 0    157  ~ 0
USB
Text Notes 14200 2300 0    157  ~ 0
BROWN_OUT
Text Notes 16100 2250 0    157  ~ 0
MEMORY
Text Notes 19250 3400 0    157  ~ 0
RS485 & 232
Text Notes 11600 7550 0    157  ~ 0
INPUTS/ENCODER
Text Notes 17550 7750 0    157  ~ 0
OUTPUTS
Wire Notes Line
	10000 10750 17550 10750
Wire Notes Line
	17550 10750 17550 14900
Wire Notes Line
	17550 14900 10000 14900
Text Notes 12700 15200 0    157  ~ 0
RUN/STOP/ERROR INDICATORS
$Comp
L MH1 P1
U 1 1 5A8C8077
P 2300 11250
F 0 "P1" H 2380 11250 40  0000 L CNN
F 1 "MH1" H 2300 11305 30  0001 C CNN
F 2 "AutomataFootprint:MH_imark" H 2300 11250 60  0001 C CNN
F 3 "" H 2300 11250 60  0000 C CNN
	1    2300 11250
	1    0    0    -1  
$EndComp
NoConn ~ 2150 11250
$Comp
L MH1 P2
U 1 1 5A8CB289
P 2300 11350
F 0 "P2" H 2380 11350 40  0000 L CNN
F 1 "MH1" H 2300 11405 30  0001 C CNN
F 2 "AutomataFootprint:MH_imark" H 2300 11350 60  0001 C CNN
F 3 "" H 2300 11350 60  0000 C CNN
	1    2300 11350
	1    0    0    -1  
$EndComp
NoConn ~ 2150 11350
$Comp
L MH1 P3
U 1 1 5A8CBAB1
P 2300 11450
F 0 "P3" H 2380 11450 40  0000 L CNN
F 1 "MH1" H 2300 11505 30  0001 C CNN
F 2 "AutomataFootprint:MH_imark" H 2300 11450 60  0001 C CNN
F 3 "" H 2300 11450 60  0000 C CNN
	1    2300 11450
	1    0    0    -1  
$EndComp
NoConn ~ 2150 11450
$Comp
L MH1 P4
U 1 1 5A8CC6AE
P 2300 11550
F 0 "P4" H 2380 11550 40  0000 L CNN
F 1 "MH1" H 2300 11605 30  0001 C CNN
F 2 "AutomataFootprint:MH_imark" H 2300 11550 60  0001 C CNN
F 3 "" H 2300 11550 60  0000 C CNN
	1    2300 11550
	1    0    0    -1  
$EndComp
NoConn ~ 2150 11550
$Comp
L MH1 P5
U 1 1 5A8D48DE
P 2300 11700
F 0 "P5" H 2380 11700 40  0000 L CNN
F 1 "MH1" H 2300 11755 30  0001 C CNN
F 2 "AutomataFootprint:MH_imark_ntph" H 2300 11700 60  0001 C CNN
F 3 "" H 2300 11700 60  0000 C CNN
	1    2300 11700
	1    0    0    -1  
$EndComp
NoConn ~ 2150 11700
$Comp
L MH1 P6
U 1 1 5A8D48E5
P 2300 11800
F 0 "P6" H 2380 11800 40  0000 L CNN
F 1 "MH1" H 2300 11855 30  0001 C CNN
F 2 "AutomataFootprint:MH_imark_ntph" H 2300 11800 60  0001 C CNN
F 3 "" H 2300 11800 60  0000 C CNN
	1    2300 11800
	1    0    0    -1  
$EndComp
NoConn ~ 2150 11800
Wire Wire Line
	1350 2500 1550 2500
Wire Wire Line
	1350 2600 1550 2600
Text Label 1350 2600 2    59   ~ 0
SCL
Text Label 1350 2500 2    59   ~ 0
SDA
Wire Notes Line
	1550 2350 800  2350
Wire Notes Line
	800  2350 800  2650
Wire Notes Line
	800  2650 1550 2650
Text Notes 800  2500 0    60   ~ 0
EEPROM
Wire Wire Line
	1350 2850 1550 2850
Wire Wire Line
	1350 2950 1550 2950
Text Label 1350 2850 2    60   ~ 0
TX2
Text Label 1350 2950 2    60   ~ 0
RX2
Text Label 1350 3050 2    60   ~ 0
ENL2
Wire Wire Line
	1350 3050 1550 3050
Text Label 1350 3350 2    60   ~ 0
RX1
Text Label 1350 3250 2    60   ~ 0
TX1
Text Label 1350 3450 2    60   ~ 0
ENL1
Wire Wire Line
	1350 3450 1550 3450
Wire Wire Line
	1350 3350 1550 3350
Wire Wire Line
	1350 3250 1550 3250
Wire Notes Line
	1550 2700 800  2700
Wire Notes Line
	800  2700 800  3100
Wire Notes Line
	800  3100 1550 3100
Wire Notes Line
	1550 3150 800  3150
Wire Notes Line
	800  3150 800  3500
Wire Notes Line
	800  3500 1550 3500
Text Notes 500  3750 0    60   ~ 0
UART3
Text Notes 500  3300 0    60   ~ 0
UART1
Wire Wire Line
	1350 3700 1550 3700
Wire Wire Line
	1350 3800 1550 3800
Text Label 1350 3800 2    60   ~ 0
RX3
Text Label 1350 3700 2    60   ~ 0
TX3
Wire Notes Line
	1550 3550 800  3550
Wire Notes Line
	800  3550 800  3850
Wire Notes Line
	800  3850 1550 3850
Text Notes 500  2950 0    60   ~ 0
RS232
Wire Wire Line
	1400 4000 1550 4000
Wire Wire Line
	1400 4100 1550 4100
Wire Wire Line
	1400 4200 1550 4200
Text Label 1400 4000 2    60   ~ 0
PHASE_A
Text Label 1400 4100 2    60   ~ 0
PHASE_B
Text Label 1400 4200 2    60   ~ 0
INDEX
Text Label 1300 4400 2    60   ~ 0
ISO_IN1
Text Label 1300 4500 2    60   ~ 0
ISO_IN2
Text Label 1300 4600 2    60   ~ 0
ISO_IN3
Text Label 1300 4700 2    60   ~ 0
ISO_IN4
Text Label 1300 4800 2    60   ~ 0
ISO_IN5
Text Label 1300 4900 2    60   ~ 0
ISO_IN6
Text Label 1300 5000 2    60   ~ 0
ISO_IN7
Text Label 1300 5100 2    60   ~ 0
ISO_IN8
Text Label 1300 5200 2    60   ~ 0
ISO_IN9
Text Label 1300 5300 2    60   ~ 0
ISO_IN10
Text Label 1300 5400 2    60   ~ 0
ISO_IN11
Text Label 1300 5500 2    60   ~ 0
ISO_IN12
Text Label 1300 5600 2    60   ~ 0
ISO_IN13
Text Label 1300 5700 2    60   ~ 0
ISO_IN14
Text Label 1300 5800 2    60   ~ 0
ISO_IN15
Text Label 1300 5900 2    60   ~ 0
ISO_IN16
Wire Wire Line
	1300 5900 1550 5900
Wire Wire Line
	1300 5800 1550 5800
Wire Wire Line
	1300 5700 1550 5700
Wire Wire Line
	1300 5600 1550 5600
Wire Wire Line
	1300 5500 1550 5500
Wire Wire Line
	1300 5400 1550 5400
Wire Wire Line
	1300 5300 1550 5300
Wire Wire Line
	1300 5200 1550 5200
Wire Wire Line
	1300 5100 1550 5100
Wire Wire Line
	1300 5000 1550 5000
Wire Wire Line
	1300 4900 1550 4900
Wire Wire Line
	1300 4800 1550 4800
Wire Wire Line
	1300 4700 1550 4700
Wire Wire Line
	1300 4600 1550 4600
Wire Wire Line
	1300 4500 1550 4500
Wire Wire Line
	1300 4400 1550 4400
Wire Notes Line
	1550 3900 800  3900
Wire Notes Line
	800  3900 800  4250
Wire Notes Line
	800  4250 1550 4250
Wire Notes Line
	1550 4300 800  4300
Wire Notes Line
	800  4300 800  5950
Wire Notes Line
	800  5950 1550 5950
Text Notes 600  4100 0    60   ~ 0
QEI
Text Notes 500  4750 0    60   ~ 0
INPUT
Text Label 1350 6300 2    79   ~ 0
MISO
Wire Wire Line
	1350 6300 1550 6300
Wire Wire Line
	1550 6200 1350 6200
Text Label 1350 6200 2    79   ~ 0
MOSI
Text Label 1350 6400 2    79   ~ 0
SCK
Wire Wire Line
	1350 6400 1550 6400
Wire Wire Line
	1350 6500 1550 6500
Wire Wire Line
	1350 6600 1550 6600
Wire Wire Line
	1350 6700 1550 6700
Wire Wire Line
	1350 6800 1550 6800
Wire Wire Line
	1350 6900 1550 6900
Wire Wire Line
	1350 7000 1550 7000
Wire Wire Line
	1350 7100 1550 7100
Text Label 1350 6500 2    79   ~ 0
CH1
Text Label 1350 6600 2    79   ~ 0
CH2
Text Label 1350 6700 2    79   ~ 0
CH3
Text Label 1350 6800 2    79   ~ 0
CH4
Text Label 1350 6900 2    79   ~ 0
CH5
Text Label 1350 7000 2    79   ~ 0
CH6
Text Label 1350 7100 2    79   ~ 0
CH7
Wire Notes Line
	1550 6000 800  6000
Wire Notes Line
	800  6000 800  7200
Wire Notes Line
	800  7200 1550 7200
Text Notes 800  6750 1    60   ~ 0
IO_EXTENDER
Text Label 5850 900  0    60   ~ 0
SOUT1
Text Label 5850 1000 0    60   ~ 0
SOUT2
Text Label 5850 1100 0    60   ~ 0
SOUT3
Text Label 5850 1200 0    60   ~ 0
SOUT4
Text Label 5850 1300 0    60   ~ 0
SOUT5
Text Label 5850 1400 0    60   ~ 0
SOUT6
Text Label 5850 1500 0    60   ~ 0
SOUT7
Text Label 5850 1600 0    60   ~ 0
SOUT8
Text Label 5850 1700 0    60   ~ 0
SOUT9
Text Label 5850 1800 0    60   ~ 0
SOUT10
Text Label 5850 1900 0    60   ~ 0
SOUT11
Text Label 5850 2000 0    60   ~ 0
SOUT12
Wire Wire Line
	5850 2000 5550 2000
Wire Wire Line
	5850 1900 5550 1900
Wire Wire Line
	5850 1800 5550 1800
Wire Wire Line
	5850 1700 5550 1700
Wire Wire Line
	5850 1600 5550 1600
Wire Wire Line
	5850 1500 5550 1500
Wire Wire Line
	5850 1400 5550 1400
Wire Wire Line
	5850 1300 5550 1300
Wire Wire Line
	5850 1200 5550 1200
Wire Wire Line
	5850 1100 5550 1100
Wire Wire Line
	5850 1000 5550 1000
Wire Wire Line
	5850 900  5550 900 
Text Label 5850 2100 0    60   ~ 0
PULSE1
Text Label 5850 2200 0    60   ~ 0
DIR1
Text Label 5850 2300 0    60   ~ 0
PULSE2
Text Label 5850 2400 0    60   ~ 0
DIR2
Wire Wire Line
	5850 2400 5550 2400
Wire Wire Line
	5850 2300 5550 2300
Wire Wire Line
	5850 2200 5550 2200
Wire Wire Line
	5850 2100 5550 2100
Wire Notes Line
	5650 800  6300 800 
Wire Notes Line
	6300 800  6300 2450
Wire Notes Line
	6300 2450 5600 2450
Text Notes 5750 750  0    60   ~ 0
OUTPUTS
Text Label 5750 2850 0    60   ~ 0
RUN/STOP
Wire Wire Line
	5550 2850 5750 2850
Text Label 5750 2600 0    59   ~ 0
BROUN_OUT
Wire Wire Line
	5750 2600 5550 2600
Text Label 5750 3100 0    79   ~ 0
ERROR_LED
Wire Wire Line
	5750 3100 5550 3100
Text Label 5750 2950 0    79   ~ 0
R/S_LED
Wire Wire Line
	5750 2950 5550 2950
Wire Wire Line
	750  7850 1550 7850
Wire Wire Line
	750  7950 1550 7950
$Comp
L R R84
U 1 1 5AB4339E
P 16700 11350
F 0 "R84" V 16780 11350 50  0000 C CNN
F 1 "1k" V 16700 11350 50  0000 C CNN
F 2 "AutomataFootprint:AutomataFootprint_R_0805_AUTOMATA" V 16630 11350 50  0001 C CNN
F 3 "" H 16700 11350 50  0001 C CNN
	1    16700 11350
	0    1    1    0   
$EndComp
Wire Wire Line
	16850 11350 16900 11350
$Comp
L R R83
U 1 1 5AB47245
P 16650 13000
F 0 "R83" V 16730 13000 50  0000 C CNN
F 1 "1k" V 16650 13000 50  0000 C CNN
F 2 "AutomataFootprint:AutomataFootprint_R_0805_AUTOMATA" V 16580 13000 50  0001 C CNN
F 3 "" H 16650 13000 50  0001 C CNN
	1    16650 13000
	0    1    1    0   
$EndComp
Wire Wire Line
	16800 13000 16900 13000
$Comp
L LED D5
U 1 1 5AB52F7E
P 12750 12900
F 0 "D5" H 12750 13000 50  0000 C CNN
F 1 "HBT" H 12750 12800 50  0000 C CNN
F 2 "AutomataFootprint:LED_1206" H 12750 12900 50  0001 C CNN
F 3 "" H 12750 12900 50  0001 C CNN
	1    12750 12900
	1    0    0    -1  
$EndComp
Wire Wire Line
	12050 12900 12600 12900
$Comp
L BC817 Q16
U 1 1 5AB52F85
P 11950 13200
F 0 "Q16" H 12150 13275 50  0000 L CNN
F 1 "BC817" H 12150 13200 50  0000 L CNN
F 2 "TO_SOT_Packages_SMD:SOT-23" H 12150 13125 50  0001 L CIN
F 3 "" H 11950 13200 50  0001 L CNN
	1    11950 13200
	1    0    0    -1  
$EndComp
Wire Wire Line
	12050 13000 12050 12900
$Comp
L R R130
U 1 1 5AB52F8C
P 11400 13200
F 0 "R130" V 11480 13200 50  0000 C CNN
F 1 "330" V 11400 13200 50  0000 C CNN
F 2 "AutomataFootprint:R_0805_AUTOMAT" V 11330 13200 50  0001 C CNN
F 3 "" H 11400 13200 50  0001 C CNN
	1    11400 13200
	0    1    1    0   
$EndComp
Text Label 12050 14000 0    59   ~ 0
GND
Wire Wire Line
	11550 13200 11750 13200
Wire Wire Line
	11150 13200 11250 13200
Wire Wire Line
	13100 12900 12900 12900
Wire Wire Line
	12050 14000 12050 13400
Text Label 13500 12900 0    59   ~ 0
5V
$Comp
L R R131
U 1 1 5AB52F9A
P 13250 12900
F 0 "R131" V 13330 12900 50  0000 C CNN
F 1 "1k" V 13250 12900 50  0000 C CNN
F 2 "AutomataFootprint:AutomataFootprint_R_0805_AUTOMATA" V 13180 12900 50  0001 C CNN
F 3 "" H 13250 12900 50  0001 C CNN
	1    13250 12900
	0    1    1    0   
$EndComp
Wire Wire Line
	13400 12900 13500 12900
Wire Notes Line
	10000 14900 10000 10750
$Comp
L Conn_01x02 J19
U 1 1 5AB62530
P 550 7950
F 0 "J19" H 550 8050 50  0000 C CNN
F 1 "extra" H 550 7750 50  0000 C CNN
F 2 "AutomataFootprint:Automata_Pin_Header_Straight_2x01_Pitch2.54mm" H 550 7950 50  0001 C CNN
F 3 "" H 550 7950 50  0001 C CNN
	1    550  7950
	-1   0    0    1   
$EndComp
Wire Wire Line
	1300 7500 1550 7500
Text Label 1300 7500 2    60   ~ 0
HEARTBIT
Text Label 11150 13200 2    60   ~ 0
HEARTBIT
Text Label 12050 12900 2    60   ~ 0
HEARTBIT_LED
Wire Wire Line
	15150 8900 14700 8900
$Sheet
S 7700 750  1300 1200
U 5AA91E7B
F0 "LM2575" 60
F1 "LM2575.sch" 60
F2 "3.3V" I L 7700 1100 60 
F3 "+5v" I L 7700 1000 60 
F4 "+12V" I L 7700 900 60 
F5 "GND_SUPPLY" I L 7700 1850 60 
F6 "EXT_24V" I R 9000 850 60 
$EndSheet
Text Label 1350 7850 2    59   ~ 0
BOOTLOADER
Text Label 13800 8800 2    60   ~ 0
RUN/STOP
Text Label 13800 8900 2    59   ~ 0
5V
Text Label 11450 6200 2    61   ~ 0
R/S_SIGNAL
Text Label 16750 6650 2    60   ~ 0
ERROR_SIGNAL
Wire Wire Line
	16750 6650 17000 6650
Wire Wire Line
	16750 6750 17000 6750
Wire Wire Line
	11750 6200 11450 6200
Text Label 16750 6750 2    60   ~ 0
HEARTBIT_LED
Text Label 15150 8900 0    59   ~ 0
GND
Text Label 13800 9100 2    60   ~ 0
ISO_5V
Text Label 15000 9000 0    60   ~ 0
ISO_GND
Wire Wire Line
	13750 1550 13550 1550
Wire Wire Line
	13750 1650 13550 1650
Text Label 13750 1550 0    60   ~ 0
DN
Text Label 13750 1650 0    60   ~ 0
DP
Text Label 15150 8500 0    60   ~ 0
DN
Text Label 15150 8600 0    60   ~ 0
DP
Wire Notes Line
	18600 650  18750 650 
Wire Notes Line
	18600 650  18600 1000
Wire Notes Line
	18600 1000 18750 1000
Wire Notes Line
	18750 1050 18600 1050
Wire Notes Line
	18600 1050 18600 1350
Wire Notes Line
	18600 1350 18750 1350
Wire Notes Line
	18750 1750 18650 1750
Wire Notes Line
	18650 1750 18650 2000
Wire Notes Line
	18650 2000 18750 2000
Text Notes 17800 900  0    60   ~ 0
UART1_RS485_1
Text Notes 17800 1250 0    60   ~ 0
UART3_RS485_2
Text Notes 17950 1900 0    60   ~ 0
UART2_RS232
Text Label 15150 8800 0    59   ~ 0
GND
$EndSCHEMATC
