EESchema Schematic File Version 2
LIBS:power
LIBS:device
LIBS:switches
LIBS:relays
LIBS:motors
LIBS:transistors
LIBS:conn
LIBS:linear
LIBS:regul
LIBS:74xx
LIBS:cmos4000
LIBS:adc-dac
LIBS:memory
LIBS:xilinx
LIBS:microcontrollers
LIBS:dsp
LIBS:microchip
LIBS:analog_switches
LIBS:motorola
LIBS:texas
LIBS:intel
LIBS:audio
LIBS:interface
LIBS:digital-audio
LIBS:philips
LIBS:display
LIBS:cypress
LIBS:siliconi
LIBS:opto
LIBS:atmel
LIBS:contrib
LIBS:valves
LIBS:AUTOPLCV1.4-cache
EELAYER 25 0
EELAYER END
$Descr A2 23386 16535
encoding utf-8
Sheet 9 10
Title "ISOLATED OUTPUT CIRCUIT"
Date "12 sep 2016"
Rev ""
Comp ""
Comment1 ""
Comment2 ""
Comment3 ""
Comment4 ""
$EndDescr
Text HLabel 1200 1100 0    60   Input ~ 0
5V
Text HLabel 2300 4000 0    60   Input ~ 0
SOUT1
Text Notes 2000 -1500 0    394  ~ 0
SSR OUTPUT\n
Text HLabel 2300 4100 0    60   Input ~ 0
SOUT2
Text HLabel 2300 4200 0    60   Input ~ 0
SOUT3
Text HLabel 2300 4300 0    60   Input ~ 0
SOUT4
$Comp
L AM26LS31 U13
U 1 1 5A1735A5
P 17850 3350
F 0 "U13" H 17550 3800 60  0000 C CNN
F 1 "26LS31-1" V 17800 3350 60  0000 C CNN
F 2 "AutomataFootprint:AM26LS31_AUTOMATA" H 17850 3350 60  0001 C CNN
F 3 "~" H 17850 3350 60  0000 C CNN
	1    17850 3350
	1    0    0    -1  
$EndComp
Text Label 17400 3700 2    60   ~ 0
GND
$Comp
L R R58
U 1 1 5A1735B8
P 17200 3300
F 0 "R58" V 17150 3550 40  0000 C CNN
F 1 "10k" V 17207 3301 40  0000 C CNN
F 2 "AutomataFootprint:R_0805_AUTOMAT" V 17130 3300 30  0001 C CNN
F 3 "~" H 17200 3300 30  0000 C CNN
	1    17200 3300
	0    -1   -1   0   
$EndComp
Text Label 18350 3400 0    60   ~ 0
GND
$Comp
L C C1
U 1 1 5A1735CD
P 19000 3100
F 0 "C1" H 19025 3200 50  0000 L CNN
F 1 "100nF" H 19025 3000 50  0000 L CNN
F 2 "AutomataFootprint:AutomataFootprint_C_0805_AUTOMATA" H 19038 2950 50  0001 C CNN
F 3 "" H 19000 3100 50  0001 C CNN
	1    19000 3100
	1    0    0    -1  
$EndComp
Text Label 19000 3250 2    60   ~ 0
GND
Text Label 1450 1100 0    60   ~ 0
5V
Text Label 19000 2950 0    60   ~ 0
5V
Text Label 18300 3000 0    60   ~ 0
5V
Text Label 16600 3250 1    60   ~ 0
5V
Text HLabel 1250 1250 0    60   Input ~ 0
GND
Text Label 1400 1250 0    60   ~ 0
GND
Text HLabel 2300 4400 0    60   Input ~ 0
SOUT5
Text HLabel 2300 4500 0    60   Input ~ 0
SOUT6
Text HLabel 2300 4600 0    60   Input ~ 0
SOUT7
Text HLabel 2300 4700 0    60   Input ~ 0
SOUT8
$Comp
L 74HC245_VCC_GND U33
U 1 1 5AA120E8
P 4850 4500
F 0 "U33" H 4950 5075 60  0000 L BNN
F 1 "74HC245_VCC_GND" H 4900 3925 60  0000 L TNN
F 2 "AutomataFootprint:SOIC-20-ULN" H 4850 4500 60  0001 C CNN
F 3 "" H 4850 4500 60  0000 C CNN
	1    4850 4500
	1    0    0    -1  
$EndComp
Text Label 3750 5000 2    60   ~ 0
GND
Text Label 1750 4900 2    60   ~ 0
5V
$Comp
L R R88
U 1 1 5AA20E46
P 2050 4900
F 0 "R88" V 2130 4900 50  0000 C CNN
F 1 "10k" V 2050 4900 50  0000 C CNN
F 2 "AutomataFootprint:R_0805_AUTOMAT" V 1980 4900 50  0001 C CNN
F 3 "" H 2050 4900 50  0001 C CNN
	1    2050 4900
	0    1    1    0   
$EndComp
Text Label 5850 4000 0    60   ~ 0
OUT1
Text Label 5850 4100 0    60   ~ 0
OUT2
Text Label 5850 4200 0    60   ~ 0
OUT3
Text Label 5850 4300 0    60   ~ 0
OUT4
Text Label 5850 4400 0    60   ~ 0
OUT5
Text Label 5850 4500 0    60   ~ 0
OUT6
Text Label 5850 4600 0    60   ~ 0
OUT7
Text Label 5850 4700 0    60   ~ 0
OUT8
Text Label 5850 4850 0    60   ~ 0
5V
Text Label 1400 1400 0    60   ~ 0
OUT24V_1
Text Label 1400 1500 0    60   ~ 0
OUTGND_1
Text HLabel 1250 1500 0    60   Input ~ 0
OUTGND_1
Text HLabel 1250 1400 0    60   Input ~ 0
OUT24V_1
Text HLabel 2200 7000 0    60   Input ~ 0
SOUT9
Text HLabel 2200 7100 0    60   Input ~ 0
SOUT10
Text HLabel 2200 7200 0    60   Input ~ 0
SOUT11
Text HLabel 2200 7300 0    60   Input ~ 0
SOUT12
Text HLabel 2200 7400 0    60   Input ~ 0
MOUT1P
Text HLabel 2200 7500 0    60   Input ~ 0
MOUT1D
Text HLabel 2200 7600 0    60   Input ~ 0
MOUT2P
Text HLabel 2200 7700 0    60   Input ~ 0
MOUT2D
$Comp
L 74HC245_VCC_GND U30
U 1 1 5AA40ACE
P 5000 7500
F 0 "U30" H 5100 8075 60  0000 L BNN
F 1 "74HC245_VCC_GND" H 5050 6925 60  0000 L TNN
F 2 "AutomataFootprint:SOIC-20-ULN" H 5000 7500 60  0001 C CNN
F 3 "" H 5000 7500 60  0000 C CNN
	1    5000 7500
	1    0    0    -1  
$EndComp
Text Label 3900 8000 2    60   ~ 0
GND
Text Label 1350 7900 2    60   ~ 0
5V
$Comp
L R R87
U 1 1 5AA40AE3
P 1650 7900
F 0 "R87" V 1730 7900 50  0000 C CNN
F 1 "10k" V 1650 7900 50  0000 C CNN
F 2 "AutomataFootprint:R_0805_AUTOMAT" V 1580 7900 50  0001 C CNN
F 3 "" H 1650 7900 50  0001 C CNN
	1    1650 7900
	0    1    1    0   
$EndComp
Text Label 6000 7000 0    60   ~ 0
OUT9
Text Label 6000 7100 0    60   ~ 0
OUT10
Text Label 6000 7200 0    60   ~ 0
OUT11
Text Label 6000 7300 0    60   ~ 0
OUT12
Text Label 6000 7850 0    60   ~ 0
5V
Text HLabel 17350 3100 0    60   Input ~ 0
PULSE1+
Text HLabel 17350 3200 0    60   Input ~ 0
PULSE1-
Text HLabel 18300 3200 2    60   Input ~ 0
PULSE2+
Text HLabel 18300 3300 2    60   Input ~ 0
PULSE2-
Text Label 1400 1650 0    60   ~ 0
OUT24V_2
Text Label 1400 1750 0    60   ~ 0
OUTGND_2
Text HLabel 1250 1750 0    60   Input ~ 0
OUTGND_2
Text HLabel 1250 1650 0    60   Input ~ 0
OUT24V_2
Text Label 1400 1900 0    60   ~ 0
OUT24V_3
Text Label 1400 2000 0    60   ~ 0
OUTGND_3
Text HLabel 1250 2000 0    60   Input ~ 0
OUTGND_3
Text HLabel 1250 1900 0    60   Input ~ 0
OUT24V_3
Text Label 6000 7400 0    60   ~ 0
PULSE1
Text Label 6000 7500 0    60   ~ 0
DIR1
Text Label 6000 7600 0    60   ~ 0
PULSE2
Text Label 6000 7700 0    60   ~ 0
DIR2
Text Label 17350 3000 2    60   ~ 0
PULSE1
Text Label 17200 3600 2    60   ~ 0
DIR1
Text HLabel 17200 3400 0    60   Input ~ 0
DIR1-
Text HLabel 17200 3500 0    60   Input ~ 0
DIR1+
Text Label 18300 3100 0    60   ~ 0
PULSE2
Text Label 18300 3700 0    60   ~ 0
DIR2
Text HLabel 18300 3600 2    60   Input ~ 0
DIR2+
Text HLabel 18300 3500 2    60   Input ~ 0
DIR2-
$Comp
L R_PACK4 RP4
U 1 1 5AB525B3
P 2900 3500
F 0 "RP4" H 2900 3950 40  0000 C CNN
F 1 "R_PACK4" H 2900 3450 40  0000 C CNN
F 2 "AutomataFootprint:R_Array_Concave_4x0603_AUTOMATA" H 2900 3500 60  0001 C CNN
F 3 "" H 2900 3500 60  0000 C CNN
	1    2900 3500
	0    -1   1    0   
$EndComp
$Comp
L R_PACK4 RP6
U 1 1 5AB52AD0
P 3300 3500
F 0 "RP6" H 3300 3950 40  0000 C CNN
F 1 "R_PACK4" H 3300 3450 40  0000 C CNN
F 2 "AutomataFootprint:R_Array_Concave_4x0603_AUTOMATA" H 3300 3500 60  0001 C CNN
F 3 "" H 3300 3500 60  0000 C CNN
	1    3300 3500
	0    -1   1    0   
$EndComp
$Comp
L Conn_01x03 J14
U 1 1 5AB55BA2
P 3400 2900
F 0 "J14" H 3400 3100 50  0000 C CNN
F 1 "PULL_UP/DPWN" H 3400 2700 50  0000 C CNN
F 2 "AutomataFootprint:smd_j3_0805_AUTOMATA" H 3400 2900 50  0001 C CNN
F 3 "" H 3400 2900 50  0001 C CNN
	1    3400 2900
	0    -1   -1   0   
$EndComp
Text Label 3100 3050 2    60   ~ 0
5V
Text Label 3750 3050 0    60   ~ 0
GND
$Comp
L R_PACK4 RP3
U 1 1 5AB588A9
P 3200 6500
F 0 "RP3" H 3200 6950 40  0000 C CNN
F 1 "R_PACK4" H 3200 6450 40  0000 C CNN
F 2 "AutomataFootprint:R_Array_Concave_4x0603_AUTOMATA" H 3200 6500 60  0001 C CNN
F 3 "" H 3200 6500 60  0000 C CNN
	1    3200 6500
	0    -1   1    0   
$EndComp
$Comp
L R_PACK4 RP5
U 1 1 5AB588AF
P 3600 6500
F 0 "RP5" H 3600 6950 40  0000 C CNN
F 1 "R_PACK4" H 3600 6450 40  0000 C CNN
F 2 "AutomataFootprint:R_Array_Concave_4x0603_AUTOMATA" H 3600 6500 60  0001 C CNN
F 3 "" H 3600 6500 60  0000 C CNN
	1    3600 6500
	0    -1   1    0   
$EndComp
$Comp
L Conn_01x03 J13
U 1 1 5AB588BE
P 3700 5900
F 0 "J13" H 3700 6100 50  0000 C CNN
F 1 "PULL_UP/DPWN" H 3700 5700 50  0000 C CNN
F 2 "AutomataFootprint:smd_j3_0805_AUTOMATA" H 3700 5900 50  0001 C CNN
F 3 "" H 3700 5900 50  0001 C CNN
	1    3700 5900
	0    -1   -1   0   
$EndComp
Text Label 3400 6050 2    60   ~ 0
5V
Text Label 4050 6050 0    60   ~ 0
GND
Text Label 13450 2600 2    60   ~ 0
OUT1
Text Label 13450 2700 2    60   ~ 0
OUT3
Text Label 13450 2800 2    60   ~ 0
OUT5
Text Label 13450 2900 2    60   ~ 0
OUT7
$Comp
L Conn_02x10_Odd_Even J15
U 1 1 5AD0D034
P 13950 3000
F 0 "J15" H 14000 3500 50  0000 C CNN
F 1 "LED_OUT" H 14000 2400 50  0000 C CNN
F 2 "Connectors_Multicomp:Multicomp_MC9A12-2034_2x10x2.54mm_Straight" H 13950 3000 50  0001 C CNN
F 3 "" H 13950 3000 50  0001 C CNN
	1    13950 3000
	1    0    0    -1  
$EndComp
Text Label 13450 3000 2    60   ~ 0
OUT9
Text Label 13450 3100 2    60   ~ 0
OUT11
Text Label 14550 2600 0    60   ~ 0
OUT2
Text Label 14550 2700 0    60   ~ 0
OUT4
Text Label 14550 2800 0    60   ~ 0
OUT6
Text Label 14550 2900 0    60   ~ 0
OUT8
Text Label 14550 3000 0    60   ~ 0
OUT10
Text Label 14550 3100 0    60   ~ 0
OUT12
Text Label 13450 3200 2    60   ~ 0
PULSE1
Text Label 14550 3200 0    60   ~ 0
DIR1
Text Label 13450 3300 2    60   ~ 0
PULSE2
Text Label 14550 3300 0    60   ~ 0
DIR2
Text Label 13450 3500 2    60   ~ 0
5V
Text Label 14550 3500 0    60   ~ 0
GND
$Comp
L C C53
U 1 1 5AAF5F71
P 6150 5100
F 0 "C53" H 6175 5200 50  0000 L CNN
F 1 "100nF" H 6175 5000 50  0000 L CNN
F 2 "AutomataFootprint:AutomataFootprint_C_0805_AUTOMATA" H 6188 4950 50  0001 C CNN
F 3 "" H 6150 5100 50  0001 C CNN
	1    6150 5100
	1    0    0    -1  
$EndComp
Text Label 6150 4950 0    60   ~ 0
5V
Text Label 6150 5250 2    60   ~ 0
GND
$Comp
L C C54
U 1 1 5AAF7544
P 6150 8200
F 0 "C54" H 6175 8300 50  0000 L CNN
F 1 "100nF" H 6175 8100 50  0000 L CNN
F 2 "AutomataFootprint:AutomataFootprint_C_0805_AUTOMATA" H 6188 8050 50  0001 C CNN
F 3 "" H 6150 8200 50  0001 C CNN
	1    6150 8200
	1    0    0    -1  
$EndComp
Text Label 6150 8050 0    60   ~ 0
5V
Text Label 6150 8350 2    60   ~ 0
GND
Text HLabel 14550 3400 2    60   Input ~ 0
ERROR_LED
Text Label 11450 8200 2    60   ~ 0
OUT1
Text Label 11450 8400 2    60   ~ 0
OUT2
Text Label 11450 8600 2    60   ~ 0
OUT3
Text Label 11450 8800 2    60   ~ 0
OUT4
Text Label 11450 8700 2    60   ~ 0
GND
Text Label 11450 8900 2    60   ~ 0
GND
Text HLabel 12450 8200 2    60   Input ~ 0
SSR1+
Text HLabel 12450 8300 2    60   Input ~ 0
SSR2+
Text HLabel 12450 8400 2    60   Input ~ 0
SSR3+
Text HLabel 12450 8500 2    60   Input ~ 0
SSR4+
Text Label 12850 8600 0    60   ~ 0
OUT24V_1
Text Label 12450 8800 0    60   ~ 0
OUTGND_1
Wire Wire Line
	18300 3300 18150 3300
Wire Wire Line
	18300 3200 18150 3200
Wire Wire Line
	18300 3100 18150 3100
Wire Wire Line
	18300 3700 18150 3700
Wire Wire Line
	18300 3600 18150 3600
Wire Wire Line
	18300 3500 18150 3500
Wire Wire Line
	1400 2000 1250 2000
Wire Wire Line
	1400 1900 1250 1900
Wire Wire Line
	1400 1750 1250 1750
Wire Wire Line
	1400 1650 1250 1650
Wire Wire Line
	17200 3400 17550 3400
Wire Wire Line
	17200 3500 17550 3500
Wire Wire Line
	17200 3600 17550 3600
Wire Wire Line
	18150 3400 18350 3400
Wire Wire Line
	16600 3250 16600 3300
Wire Wire Line
	17350 3200 17550 3200
Wire Wire Line
	17350 3100 17550 3100
Wire Wire Line
	5700 7850 6000 7850
Wire Wire Line
	6000 7700 5700 7700
Wire Wire Line
	5700 7600 6000 7600
Wire Wire Line
	5700 7500 6000 7500
Wire Wire Line
	5700 7400 6000 7400
Wire Wire Line
	5700 7300 6000 7300
Wire Wire Line
	5700 7200 6000 7200
Wire Wire Line
	5700 7100 6000 7100
Wire Wire Line
	5700 7000 6000 7000
Wire Wire Line
	1350 7900 1500 7900
Wire Wire Line
	3900 8000 4300 8000
Wire Wire Line
	3900 7800 3900 8000
Wire Wire Line
	1800 7900 4300 7900
Wire Wire Line
	3900 7800 4300 7800
Wire Wire Line
	2200 7700 4300 7700
Wire Wire Line
	2200 7600 4300 7600
Wire Wire Line
	2200 7400 4300 7400
Wire Wire Line
	2200 7300 4300 7300
Wire Wire Line
	2200 7100 4300 7100
Wire Wire Line
	2200 7200 4300 7200
Wire Wire Line
	2200 7000 4300 7000
Wire Wire Line
	1400 1500 1250 1500
Wire Wire Line
	1400 1400 1250 1400
Wire Wire Line
	5550 4850 5850 4850
Wire Wire Line
	5850 4700 5550 4700
Wire Wire Line
	5550 4600 5850 4600
Wire Wire Line
	5550 4500 5850 4500
Wire Wire Line
	5550 4400 5850 4400
Wire Wire Line
	5550 4300 5850 4300
Wire Wire Line
	5550 4200 5850 4200
Wire Wire Line
	5550 4100 5850 4100
Wire Wire Line
	5550 4000 5850 4000
Wire Wire Line
	1750 4900 1900 4900
Wire Wire Line
	3750 5000 4150 5000
Wire Wire Line
	3750 4800 3750 5000
Wire Wire Line
	2200 4900 4150 4900
Wire Wire Line
	3750 4800 4150 4800
Wire Wire Line
	2300 4700 4150 4700
Wire Wire Line
	2300 4600 4150 4600
Wire Wire Line
	2300 4500 4150 4500
Wire Wire Line
	2300 4400 4150 4400
Wire Wire Line
	2300 4300 4150 4300
Wire Wire Line
	2300 4100 4150 4100
Wire Wire Line
	2300 4200 4150 4200
Wire Wire Line
	2300 4000 4150 4000
Wire Wire Line
	1250 1250 1400 1250
Wire Wire Line
	17350 3300 17550 3300
Wire Wire Line
	16600 3300 17050 3300
Wire Wire Line
	17350 3000 17550 3000
Wire Wire Line
	18300 3000 18150 3000
Wire Wire Line
	17400 3700 17550 3700
Wire Wire Line
	1200 1100 1450 1100
Wire Wire Line
	3400 3300 2550 3300
Connection ~ 2650 3300
Connection ~ 2750 3300
Connection ~ 2850 3300
Connection ~ 2950 3300
Connection ~ 3050 3300
Connection ~ 3150 3300
Wire Wire Line
	3400 3100 3400 3300
Connection ~ 3250 3300
Wire Wire Line
	3300 3100 3300 3150
Wire Wire Line
	3300 3150 3100 3150
Wire Wire Line
	3100 3150 3100 3050
Wire Wire Line
	3500 3100 3500 3150
Wire Wire Line
	3500 3150 3750 3150
Wire Wire Line
	3750 3150 3750 3050
Wire Wire Line
	3700 6300 2850 6300
Connection ~ 2950 6300
Connection ~ 3050 6300
Connection ~ 3150 6300
Connection ~ 3250 6300
Connection ~ 3350 6300
Connection ~ 3450 6300
Wire Wire Line
	3700 6100 3700 6300
Connection ~ 3550 6300
Wire Wire Line
	3600 6100 3600 6150
Wire Wire Line
	3600 6150 3400 6150
Wire Wire Line
	3400 6150 3400 6050
Wire Wire Line
	3800 6100 3800 6150
Wire Wire Line
	3800 6150 4050 6150
Wire Wire Line
	4050 6150 4050 6050
Wire Wire Line
	13450 2600 13750 2600
Wire Wire Line
	13450 2700 13750 2700
Wire Wire Line
	13450 2800 13750 2800
Wire Wire Line
	13450 2900 13750 2900
Wire Wire Line
	13450 3000 13750 3000
Wire Wire Line
	13450 3100 13750 3100
Wire Wire Line
	13450 3200 13750 3200
Wire Wire Line
	13450 3300 13750 3300
Wire Wire Line
	14550 2600 14250 2600
Wire Wire Line
	14550 2700 14250 2700
Wire Wire Line
	14550 2800 14250 2800
Wire Wire Line
	14550 2900 14250 2900
Wire Wire Line
	14550 3000 14250 3000
Wire Wire Line
	14550 3100 14250 3100
Wire Wire Line
	14550 3200 14250 3200
Wire Wire Line
	14550 3300 14250 3300
Wire Wire Line
	13450 3400 13750 3400
Wire Wire Line
	14550 3400 14250 3400
Wire Wire Line
	13450 3500 13750 3500
Wire Wire Line
	14550 3500 14250 3500
Wire Notes Line
	16150 2000 16150 4450
Wire Notes Line
	16150 4450 19650 4450
Wire Notes Line
	19650 4450 19650 2000
Wire Notes Line
	19650 2000 16150 2000
Wire Notes Line
	1100 2400 8050 2400
Wire Notes Line
	8050 2400 8050 9200
Wire Notes Line
	8050 9200 1100 9200
Wire Notes Line
	1100 9200 1100 2400
Wire Wire Line
	2850 3700 2850 4000
Connection ~ 2850 4000
Wire Wire Line
	2750 3700 2750 4100
Connection ~ 2750 4100
Wire Wire Line
	2650 3700 2650 4200
Connection ~ 2650 4200
Wire Wire Line
	2550 3700 2550 4300
Connection ~ 2550 4300
Wire Wire Line
	3250 3700 3250 4400
Connection ~ 3250 4400
Wire Wire Line
	3150 3700 3150 4500
Connection ~ 3150 4500
Wire Wire Line
	3050 3700 3050 4600
Connection ~ 3050 4600
Wire Wire Line
	2950 3700 2950 4700
Connection ~ 2950 4700
Wire Wire Line
	2200 7500 4300 7500
Wire Wire Line
	2850 6700 2850 7300
Connection ~ 2850 7300
Wire Wire Line
	2950 6700 2950 7200
Connection ~ 2950 7200
Wire Wire Line
	3050 6700 3050 7100
Connection ~ 3050 7100
Wire Wire Line
	3150 6700 3150 7000
Connection ~ 3150 7000
Wire Wire Line
	3550 6700 3550 7400
Connection ~ 3550 7400
Wire Wire Line
	3450 6700 3450 7500
Connection ~ 3450 7500
Wire Wire Line
	3350 6700 3350 7600
Connection ~ 3350 7600
Wire Wire Line
	3250 6700 3250 7700
Connection ~ 3250 7700
Wire Wire Line
	11450 8200 11650 8200
Wire Wire Line
	11450 8400 11650 8400
Wire Wire Line
	11450 8600 11650 8600
Wire Wire Line
	11450 8800 11650 8800
Wire Wire Line
	11450 8300 11650 8300
Wire Wire Line
	11450 8500 11650 8500
Wire Wire Line
	11450 8700 11650 8700
Wire Wire Line
	11450 8900 11650 8900
Wire Wire Line
	12150 8200 12450 8200
Wire Wire Line
	12450 8300 12150 8300
Wire Wire Line
	12450 8400 12150 8400
Wire Wire Line
	12450 8500 12150 8500
Wire Wire Line
	12150 8600 12450 8600
Wire Wire Line
	12450 8800 12150 8800
Text Label 14250 8900 2    60   ~ 0
GND
Text Label 14250 9100 2    60   ~ 0
GND
Wire Wire Line
	14250 8400 14450 8400
Wire Wire Line
	14250 8600 14450 8600
Wire Wire Line
	14250 8800 14450 8800
Wire Wire Line
	14250 9000 14450 9000
Wire Wire Line
	14250 8500 14450 8500
Wire Wire Line
	14250 8700 14450 8700
Wire Wire Line
	14250 8900 14450 8900
Wire Wire Line
	14250 9100 14450 9100
Wire Wire Line
	14950 8400 15250 8400
Wire Wire Line
	15250 8500 14950 8500
Wire Wire Line
	15250 8600 14950 8600
Wire Wire Line
	15250 8700 14950 8700
Wire Wire Line
	14950 8800 15350 8800
Wire Wire Line
	15250 9000 14950 9000
Text Label 14250 8400 2    60   ~ 0
OUT5
Text Label 14250 8800 2    60   ~ 0
OUT7
Text Label 14250 9000 2    60   ~ 0
OUT8
Text HLabel 15250 8400 2    60   Input ~ 0
SSR5+
Text HLabel 15250 8500 2    60   Input ~ 0
SSR6+
Text HLabel 15250 8600 2    60   Input ~ 0
SSR7+
Text HLabel 15250 8700 2    60   Input ~ 0
SSR8+
Text Label 15650 8800 0    60   ~ 0
OUT24V_2
Text Label 15250 9000 0    60   ~ 0
OUTGND_2
Text Label 16800 8750 2    60   ~ 0
GND
Text Label 16800 8950 2    60   ~ 0
GND
Wire Wire Line
	16800 8250 17000 8250
Wire Wire Line
	16800 8450 17000 8450
Wire Wire Line
	16800 8650 17000 8650
Wire Wire Line
	16800 8850 17000 8850
Wire Wire Line
	16800 8350 17000 8350
Wire Wire Line
	16800 8550 17000 8550
Wire Wire Line
	16800 8750 17000 8750
Wire Wire Line
	16800 8950 17000 8950
Wire Wire Line
	17500 8250 17800 8250
Wire Wire Line
	17800 8350 17500 8350
Wire Wire Line
	17800 8450 17500 8450
Wire Wire Line
	17800 8550 17500 8550
Wire Wire Line
	17500 8650 17800 8650
Wire Wire Line
	17800 8850 17500 8850
Text Label 16800 8250 2    60   ~ 0
OUT9
Text Label 16800 8450 2    60   ~ 0
OUT10
Text Label 16800 8650 2    60   ~ 0
OUT11
Text Label 16800 8850 2    60   ~ 0
OUT12
Text HLabel 17800 8250 2    60   Input ~ 0
SSR9+
Text HLabel 17800 8350 2    60   Input ~ 0
SSR10+
Text HLabel 17800 8450 2    60   Input ~ 0
SSR11+
Text HLabel 17800 8550 2    60   Input ~ 0
SSR12+
Text Label 17800 8850 0    60   ~ 0
OUTGND_3
Text Label 11450 8300 2    60   ~ 0
5V
Text Label 11450 8500 2    60   ~ 0
5V
Text Label 14250 8600 2    60   ~ 0
OUT6
Text Label 14250 8500 2    60   ~ 0
5V
Text Label 14250 8700 2    60   ~ 0
5V
Text Label 16800 8350 2    60   ~ 0
5V
Text Label 16800 8550 2    60   ~ 0
5V
$Comp
L Conn_02x08_Top_Bottom J1
U 1 1 5AAA7C56
P 11850 8500
F 0 "J1" H 11900 8900 50  0000 C CNN
F 1 "SSR_SET1" H 11900 8000 50  0000 C CNN
F 2 "AutomataFootprint:bb02_hp16_io_automata" H 11850 8500 50  0001 C CNN
F 3 "" H 11850 8500 50  0001 C CNN
	1    11850 8500
	1    0    0    -1  
$EndComp
Wire Wire Line
	12150 8700 12200 8700
Wire Wire Line
	12200 8700 12200 8600
Connection ~ 12200 8600
Wire Wire Line
	12150 8900 12200 8900
Wire Wire Line
	12200 8900 12200 8800
Connection ~ 12200 8800
$Comp
L Conn_02x08_Top_Bottom J20
U 1 1 5AAA8C73
P 14650 8700
F 0 "J20" H 14700 9100 50  0000 C CNN
F 1 "SSR_SET2" H 14700 8200 50  0000 C CNN
F 2 "AutomataFootprint:bb02_hp16_io_automata" H 14650 8700 50  0001 C CNN
F 3 "" H 14650 8700 50  0001 C CNN
	1    14650 8700
	1    0    0    -1  
$EndComp
Wire Wire Line
	14950 8900 15050 8900
Wire Wire Line
	15050 8900 15050 8800
Connection ~ 15050 8800
Wire Wire Line
	14950 9100 15050 9100
Wire Wire Line
	15050 9100 15050 9000
Connection ~ 15050 9000
$Comp
L Conn_02x08_Top_Bottom J21
U 1 1 5AAA9BED
P 17200 8550
F 0 "J21" H 17250 8950 50  0000 C CNN
F 1 "SSR_SET3" H 17250 8050 50  0000 C CNN
F 2 "AutomataFootprint:bb02_hp16_io_automata" H 17200 8550 50  0001 C CNN
F 3 "" H 17200 8550 50  0001 C CNN
	1    17200 8550
	1    0    0    -1  
$EndComp
Wire Wire Line
	17500 8750 17550 8750
Wire Wire Line
	17550 8750 17550 8650
Connection ~ 17550 8650
Wire Wire Line
	17500 8950 17550 8950
Wire Wire Line
	17550 8950 17550 8850
Connection ~ 17550 8850
Text HLabel 13450 3400 0    60   Input ~ 0
HEART_BEAT
$Comp
L D D8
U 1 1 5AB67395
P 12600 8600
F 0 "D8" H 12450 8550 50  0000 C CNN
F 1 "D" H 12600 8500 50  0000 C CNN
F 2 "AutomataFootprint:D_SMC_Standard_Automata" H 12600 8600 50  0001 C CNN
F 3 "" H 12600 8600 50  0001 C CNN
	1    12600 8600
	1    0    0    -1  
$EndComp
Wire Wire Line
	12850 8600 12750 8600
$Comp
L D D9
U 1 1 5AB67E8E
P 15500 8800
F 0 "D9" H 15300 8750 50  0000 C CNN
F 1 "D" H 15500 8700 50  0000 C CNN
F 2 "AutomataFootprint:D_SMC_Standard_Automata" H 15500 8800 50  0001 C CNN
F 3 "" H 15500 8800 50  0001 C CNN
	1    15500 8800
	1    0    0    -1  
$EndComp
$Comp
L D D10
U 1 1 5AB6837D
P 17950 8650
F 0 "D10" H 17750 8600 50  0000 C CNN
F 1 "D" H 17950 8550 50  0000 C CNN
F 2 "AutomataFootprint:D_SMC_Standard_Automata" H 17950 8650 50  0001 C CNN
F 3 "" H 17950 8650 50  0001 C CNN
	1    17950 8650
	1    0    0    -1  
$EndComp
Text Label 18100 8650 0    60   ~ 0
OUT24V_3
Text Label 12200 8600 0    60   ~ 0
OUT1_24V
Text Label 15150 8800 0    60   ~ 0
OUT2_24V
Text Label 17550 8650 0    60   ~ 0
OUT3_24V
$EndSCHEMATC
