EESchema Schematic File Version 2
LIBS:power
LIBS:device
LIBS:switches
LIBS:relays
LIBS:motors
LIBS:transistors
LIBS:conn
LIBS:linear
LIBS:regul
LIBS:74xx
LIBS:cmos4000
LIBS:adc-dac
LIBS:memory
LIBS:xilinx
LIBS:microcontrollers
LIBS:dsp
LIBS:microchip
LIBS:analog_switches
LIBS:motorola
LIBS:texas
LIBS:intel
LIBS:audio
LIBS:interface
LIBS:digital-audio
LIBS:philips
LIBS:display
LIBS:cypress
LIBS:siliconi
LIBS:opto
LIBS:atmel
LIBS:contrib
LIBS:valves
LIBS:AUTOPLCV1.4-cache
EELAYER 25 0
EELAYER END
$Descr A1 33110 23386
encoding utf-8
Sheet 7 10
Title "RDM_lpc2148"
Date "29 jul 2017"
Rev "0.3"
Comp "AUTOMATA SYSTEMS"
Comment1 ""
Comment2 ""
Comment3 ""
Comment4 ""
$EndDescr
Text HLabel 8100 9800 0    60   Input ~ 0
EXT_IP1
Text Label 6200 9750 0    60   ~ 0
245_VCC
$Comp
L HCPL2631 OPT1
U 1 1 596F2528
P 5600 4750
F 0 "OPT1" H 5550 5050 60  0000 C CNN
F 1 "HCPL2631" H 5650 4550 60  0000 C CNN
F 2 "AutomataFootprint:hpcl2631_SMD_AUTOMATA" H 5600 4750 60  0001 C CNN
F 3 "~" H 5600 4750 60  0000 C CNN
	1    5600 4750
	1    0    0    -1  
$EndComp
$Comp
L HCPL2631 OPT2
U 1 1 596F2535
P 5600 6800
F 0 "OPT2" H 5550 7100 60  0000 C CNN
F 1 "HCPL2631" H 5650 6600 60  0000 C CNN
F 2 "AutomataFootprint:hpcl2631_SMD_AUTOMATA" H 5600 6800 60  0001 C CNN
F 3 "~" H 5600 6800 60  0000 C CNN
	1    5600 6800
	1    0    0    -1  
$EndComp
$Comp
L C C34
U 1 1 596F7070
P 6250 5100
F 0 "C34" H 6250 5200 40  0000 L CNN
F 1 "100nF" H 6256 5015 40  0000 L CNN
F 2 "AutomataFootprint:C_0805_AUTOMATA" H 6288 4950 30  0001 C CNN
F 3 "~" H 6250 5100 60  0000 C CNN
	1    6250 5100
	1    0    0    -1  
$EndComp
Text Label 6250 4400 0    60   ~ 0
245_VCC
Text Label 6250 5400 0    60   ~ 0
245_GND
$Comp
L C C33
U 1 1 596F73D5
P 6200 7100
F 0 "C33" H 6200 7200 40  0000 L CNN
F 1 "100nF" H 6206 7015 40  0000 L CNN
F 2 "AutomataFootprint:C_0805_AUTOMATA" H 6238 6950 30  0001 C CNN
F 3 "~" H 6200 7100 60  0000 C CNN
	1    6200 7100
	1    0    0    -1  
$EndComp
Text Label 6200 7450 0    60   ~ 0
245_GND
Text Label 6200 6400 0    60   ~ 0
245_VCC
Text HLabel 8100 9900 0    60   Input ~ 0
EXT_IP2
Text HLabel 8050 10600 0    60   Input ~ 0
GND2
Text HLabel 8100 10200 0    60   Input ~ 0
EXT_IP5
Text HLabel 8100 10100 0    60   Input ~ 0
EXT_IP4
Text HLabel 8100 10000 0    60   Input ~ 0
EXT_IP3
Text HLabel 4000 9850 0    60   Input ~ 0
EXT_IP9
Text HLabel 4000 10150 0    60   Input ~ 0
EXT_IP12
Text HLabel 4000 10050 0    60   Input ~ 0
EXT_IP11
Text HLabel 4000 9950 0    60   Input ~ 0
EXT_IP10
Text Label 8950 9550 0    60   ~ 0
245_VCC
Text HLabel 4000 10250 0    60   Input ~ 0
EXT_IP13
Text HLabel 4000 10550 0    60   Input ~ 0
EXT_IP16
Text HLabel 4000 10450 0    60   Input ~ 0
EXT_IP15
Text HLabel 4000 10350 0    60   Input ~ 0
EXT_IP14
Text Notes 8900 1650 0    394  ~ 0
IOBOARD INPUT\n
Text HLabel 1500 2550 0    60   Input ~ 0
245_V
Text HLabel 1550 2700 0    60   Input ~ 0
245_GND
Text Label 1700 2550 0    60   ~ 0
245_VCC
Text Label 1700 2700 0    60   ~ 0
245_GND
Text HLabel 29350 6400 2    60   Input ~ 0
ISO_IN1
Text HLabel 29350 7100 2    60   Input ~ 0
ISO_IN8
Text HLabel 29350 7000 2    60   Input ~ 0
ISO_IN7
Text HLabel 29350 6900 2    60   Input ~ 0
ISO_IN6
Text HLabel 29350 6800 2    60   Input ~ 0
ISO_IN5
Text HLabel 29350 6700 2    60   Input ~ 0
ISO_IN4
Text HLabel 29350 6600 2    60   Input ~ 0
ISO_IN3
Text HLabel 29350 6500 2    60   Input ~ 0
ISO_IN2
Text Notes 28100 5500 0    60   ~ 0
NOTE: OPTOS ARE DIP6 PACKAGE
Text Label 26950 6400 0    60   ~ 0
I1
Text Label 26950 6500 0    60   ~ 0
I2
Text Label 26950 6600 0    60   ~ 0
I3
Text Label 26950 6700 0    60   ~ 0
I4
Text Label 26950 6800 0    60   ~ 0
I5
Text Label 26950 6900 0    60   ~ 0
I6
Text Label 26950 7100 0    60   ~ 0
I8
$Comp
L 74HC245_VCC_GND U26
U 1 1 5A8855E3
P 27600 4700
F 0 "U26" H 27700 5275 60  0000 L BNN
F 1 "Inputs_Buffer" H 27650 4125 60  0000 L TNN
F 2 "AutomataFootprint:SOIC-20-ULN" H 27600 4700 60  0001 C CNN
F 3 "~" H 27600 4700 60  0000 C CNN
	1    27600 4700
	1    0    0    -1  
$EndComp
$Comp
L R R105
U 1 1 5A8855EA
P 26350 5100
F 0 "R105" V 26430 5100 40  0000 C CNN
F 1 "10K" V 26357 5101 40  0000 C CNN
F 2 "AutomataFootprint:R_0805_AUTOMAT" V 26280 5100 30  0001 C CNN
F 3 "~" H 26350 5100 30  0000 C CNN
	1    26350 5100
	0    -1   -1   0   
$EndComp
Text Label 26700 5300 0    60   ~ 0
245_GND
Text Label 25950 5100 2    60   ~ 0
245_VCC
Text Label 28400 5050 0    60   ~ 0
245_VCC
Text Label 27950 3900 2    60   ~ 0
245_VCC
$Comp
L C C32
U 1 1 5A8855FC
P 26200 4500
F 0 "C32" H 26200 4600 40  0000 L CNN
F 1 "100nF" H 26206 4415 40  0000 L CNN
F 2 "AutomataFootprint:C_0805_AUTOMATA" H 26238 4350 30  0001 C CNN
F 3 "~" H 26200 4500 60  0000 C CNN
	1    26200 4500
	1    0    0    -1  
$EndComp
Text Label 26200 4300 0    60   ~ 0
245_VCC
Text Label 26200 4700 0    60   ~ 0
245_GND
Text HLabel 29200 4200 2    60   Input ~ 0
ISO_IN9
Text HLabel 29200 4600 2    60   Input ~ 0
ISO_IN13
Text HLabel 29200 4500 2    60   Input ~ 0
ISO_IN12
Text HLabel 29200 4400 2    60   Input ~ 0
ISO_IN11
Text HLabel 29200 4300 2    60   Input ~ 0
ISO_IN10
Text Notes 28250 7700 0    60   ~ 0
NOTE: OPTOS ARE DIP6 PACKAGE
Text Label 26800 4200 0    60   ~ 0
I9
Text Label 26800 4300 0    60   ~ 0
I10
Text Label 26800 4400 0    60   ~ 0
I11
Text Label 26800 4500 0    60   ~ 0
I12
Text Label 26800 4600 0    60   ~ 0
I13
$Comp
L 74HC245_VCC_GND U27
U 1 1 5A885641
P 27750 6900
F 0 "U27" H 27850 7475 60  0000 L BNN
F 1 "Inputs_Buffer" H 27800 6325 60  0000 L TNN
F 2 "AutomataFootprint:SOIC-20-ULN" H 27750 6900 60  0001 C CNN
F 3 "~" H 27750 6900 60  0000 C CNN
	1    27750 6900
	1    0    0    -1  
$EndComp
$Comp
L R R106
U 1 1 5A885648
P 26500 7300
F 0 "R106" V 26580 7300 40  0000 C CNN
F 1 "10K" V 26507 7301 40  0000 C CNN
F 2 "AutomataFootprint:R_0805_AUTOMAT" V 26430 7300 30  0001 C CNN
F 3 "~" H 26500 7300 30  0000 C CNN
	1    26500 7300
	0    -1   -1   0   
$EndComp
Text Label 26850 7500 0    60   ~ 0
245_GND
Text Label 26100 7300 2    60   ~ 0
245_VCC
Text Label 28550 7250 0    60   ~ 0
245_VCC
Text Label 28100 6100 2    60   ~ 0
245_VCC
$Comp
L C C8
U 1 1 5A88565A
P 26250 6550
F 0 "C8" H 26250 6650 40  0000 L CNN
F 1 "100nF" H 26256 6465 40  0000 L CNN
F 2 "AutomataFootprint:C_0805_AUTOMATA" H 26288 6400 30  0001 C CNN
F 3 "~" H 26250 6550 60  0000 C CNN
	1    26250 6550
	1    0    0    -1  
$EndComp
Text Label 26250 6350 0    60   ~ 0
245_VCC
Text Label 26250 6750 0    60   ~ 0
245_GND
$Comp
L R_PACK4 RP10
U 1 1 5A7B6BBF
P 5850 9800
F 0 "RP10" H 5850 10250 40  0000 C CNN
F 1 "R_PACK4" H 5850 10300 40  0000 C CNN
F 2 "AutomataFootprint:R_Array_Concave_4x0603_AUTOMATA" H 5850 9800 60  0001 C CNN
F 3 "" H 5850 9800 60  0000 C CNN
	1    5850 9800
	1    0    0    1   
$EndComp
$Comp
L R_PACK4 RP11
U 1 1 5A7B8684
P 28750 3850
F 0 "RP11" H 28750 4300 40  0000 C CNN
F 1 "R_PACK4" H 28750 3800 40  0000 C CNN
F 2 "AutomataFootprint:R_Array_Concave_4x0603_AUTOMATA" H 28750 3850 60  0001 C CNN
F 3 "" H 28750 3850 60  0000 C CNN
	1    28750 3850
	0    -1   -1   0   
$EndComp
$Comp
L R_PACK4 RP13
U 1 1 5A7B8721
P 29150 3850
F 0 "RP13" H 29150 4300 40  0000 C CNN
F 1 "R_PACK4" H 29150 3800 40  0000 C CNN
F 2 "AutomataFootprint:R_Array_Concave_4x0603_AUTOMATA" H 29150 3850 60  0001 C CNN
F 3 "" H 29150 3850 60  0000 C CNN
	1    29150 3850
	0    -1   -1   0   
$EndComp
$Comp
L R_PACK4 RP12
U 1 1 5A7BB6CE
P 28900 6050
F 0 "RP12" H 28900 6500 40  0000 C CNN
F 1 "R_PACK4" H 28900 6600 40  0000 C CNN
F 2 "AutomataFootprint:R_Array_Concave_4x0603_AUTOMATA" H 28900 6050 60  0001 C CNN
F 3 "" H 28900 6050 60  0000 C CNN
	1    28900 6050
	0    -1   -1   0   
$EndComp
$Comp
L R_PACK4 RP15
U 1 1 5A7BDC09
P 9200 9750
F 0 "RP15" H 9200 10200 40  0000 C CNN
F 1 "R_PACK4" H 9200 9700 40  0000 C CNN
F 2 "AutomataFootprint:R_Array_Concave_4x0603_AUTOMATA" H 9200 9750 60  0001 C CNN
F 3 "" H 9200 9750 60  0000 C CNN
	1    9200 9750
	1    0    0    1   
$EndComp
$Comp
L R_PACK4 RP16
U 1 1 5A7BDCBA
P 9200 10150
F 0 "RP16" H 9200 10600 40  0000 C CNN
F 1 "R_PACK4" H 9200 10100 40  0000 C CNN
F 2 "AutomataFootprint:R_Array_Concave_4x0603_AUTOMATA" H 9200 10150 60  0001 C CNN
F 3 "" H 9200 10150 60  0000 C CNN
	1    9200 10150
	1    0    0    1   
$EndComp
$Comp
L R R45
U 1 1 59FF3B38
P 4600 3750
F 0 "R45" V 4680 3750 50  0000 C CNN
F 1 "100E" V 4600 3750 50  0000 C CNN
F 2 "AutomataFootprint:R_0805_AUTOMAT" V 4530 3750 50  0001 C CNN
F 3 "" H 4600 3750 50  0001 C CNN
	1    4600 3750
	0    1    1    0   
$EndComp
$Comp
L R R47
U 1 1 59FF3C40
P 4600 4650
F 0 "R47" V 4680 4650 50  0000 C CNN
F 1 "100E" V 4600 4650 50  0000 C CNN
F 2 "AutomataFootprint:R_0805_AUTOMAT" V 4530 4650 50  0001 C CNN
F 3 "" H 4600 4650 50  0001 C CNN
	1    4600 4650
	0    -1   -1   0   
$EndComp
$Comp
L DIODE D69
U 1 1 59FF462C
P 5000 4050
F 0 "D69" H 5000 4150 40  0000 C CNN
F 1 "DIODE" H 5000 3950 40  0000 C CNN
F 2 "AutomataFootprint:SOD-123_AUTOMATA" H 5000 4050 60  0001 C CNN
F 3 "" H 5000 4050 60  0000 C CNN
	1    5000 4050
	0    -1   -1   0   
$EndComp
$Comp
L R R52
U 1 1 59FF4897
P 5000 4450
F 0 "R52" V 5080 4450 50  0000 C CNN
F 1 "100E" V 5000 4450 50  0000 C CNN
F 2 "AutomataFootprint:R_0805_AUTOMAT" V 4930 4450 50  0001 C CNN
F 3 "" H 5000 4450 50  0001 C CNN
	1    5000 4450
	1    0    0    -1  
$EndComp
Text HLabel 2000 6300 0    60   Input ~ 0
A+
Text HLabel 2000 6400 0    60   Input ~ 0
A-
$Comp
L R R49
U 1 1 59FF65F4
P 4600 5650
F 0 "R49" V 4680 5650 50  0000 C CNN
F 1 "100E" V 4600 5650 50  0000 C CNN
F 2 "AutomataFootprint:R_0805_AUTOMAT" V 4530 5650 50  0001 C CNN
F 3 "" H 4600 5650 50  0001 C CNN
	1    4600 5650
	0    1    -1   0   
$EndComp
$Comp
L R R48
U 1 1 59FF65FA
P 4600 4750
F 0 "R48" V 4680 4750 50  0000 C CNN
F 1 "100E" V 4600 4750 50  0000 C CNN
F 2 "AutomataFootprint:R_0805_AUTOMAT" V 4530 4750 50  0001 C CNN
F 3 "" H 4600 4750 50  0001 C CNN
	1    4600 4750
	0    -1   1    0   
$EndComp
$Comp
L DIODE D70
U 1 1 59FF6603
P 5000 5350
F 0 "D70" H 5000 5450 40  0000 C CNN
F 1 "DIODE" H 5000 5250 40  0000 C CNN
F 2 "AutomataFootprint:SOD-123_AUTOMATA" H 5000 5350 60  0001 C CNN
F 3 "" H 5000 5350 60  0000 C CNN
	1    5000 5350
	0    -1   1    0   
$EndComp
$Comp
L R R53
U 1 1 59FF6609
P 5000 4950
F 0 "R53" V 5080 4950 50  0000 C CNN
F 1 "100E" V 5000 4950 50  0000 C CNN
F 2 "AutomataFootprint:R_0805_AUTOMAT" V 4930 4950 50  0001 C CNN
F 3 "" H 5000 4950 50  0001 C CNN
	1    5000 4950
	1    0    0    1   
$EndComp
Text HLabel 2000 6500 0    60   Input ~ 0
B-
Text HLabel 2000 6600 0    60   Input ~ 0
B+
$Comp
L R R50
U 1 1 59FFC165
P 4600 5800
F 0 "R50" V 4680 5800 50  0000 C CNN
F 1 "100E" V 4600 5800 50  0000 C CNN
F 2 "AutomataFootprint:R_0805_AUTOMAT" V 4530 5800 50  0001 C CNN
F 3 "" H 4600 5800 50  0001 C CNN
	1    4600 5800
	0    1    1    0   
$EndComp
$Comp
L R R51
U 1 1 59FFC16B
P 4600 6700
F 0 "R51" V 4680 6700 50  0000 C CNN
F 1 "100E" V 4600 6700 50  0000 C CNN
F 2 "AutomataFootprint:R_0805_AUTOMAT" V 4530 6700 50  0001 C CNN
F 3 "" H 4600 6700 50  0001 C CNN
	1    4600 6700
	0    -1   -1   0   
$EndComp
$Comp
L DIODE D71
U 1 1 59FFC174
P 5000 6100
F 0 "D71" H 5000 6200 40  0000 C CNN
F 1 "DIODE" H 5000 6000 40  0000 C CNN
F 2 "AutomataFootprint:SOD-123_AUTOMATA" H 5000 6100 60  0001 C CNN
F 3 "" H 5000 6100 60  0000 C CNN
	1    5000 6100
	0    -1   -1   0   
$EndComp
$Comp
L R R54
U 1 1 59FFC17A
P 5000 6500
F 0 "R54" V 5080 6500 50  0000 C CNN
F 1 "100E" V 5000 6500 50  0000 C CNN
F 2 "AutomataFootprint:R_0805_AUTOMAT" V 4930 6500 50  0001 C CNN
F 3 "" H 5000 6500 50  0001 C CNN
	1    5000 6500
	1    0    0    -1  
$EndComp
Text HLabel 2000 6700 0    60   Input ~ 0
I+
Text HLabel 2000 6800 0    60   Input ~ 0
I-
Text HLabel 6000 3600 2    60   Input ~ 0
PHASEA
Text HLabel 6150 3800 2    60   Input ~ 0
PHASEB
Text HLabel 6400 4000 2    60   Input ~ 0
INDEX
Text HLabel 4000 10650 0    60   Input ~ 0
GND3
Text HLabel 8100 10300 0    60   Input ~ 0
EXT_IP6
Text HLabel 8100 10400 0    60   Input ~ 0
EXT_IP7
Text HLabel 8100 10500 0    60   Input ~ 0
EXT_IP8
$Comp
L R_PACK4 RP1
U 1 1 5A8ED133
P 5850 10200
F 0 "RP1" H 6100 10600 40  0000 C CNN
F 1 "R_PACK4" H 5850 10150 40  0000 C CNN
F 2 "AutomataFootprint:R_Array_Concave_4x0603_AUTOMATA" H 5850 10200 60  0001 C CNN
F 3 "" H 5850 10200 60  0000 C CNN
	1    5850 10200
	1    0    0    1   
$EndComp
Text Label 26950 7000 0    60   ~ 0
I7
Text Label 26800 4700 0    60   ~ 0
I14
Text Label 26800 4800 0    60   ~ 0
I15
Text Label 26800 4900 0    60   ~ 0
I16
$Comp
L R_PACK4 RP2
U 1 1 5A909F67
P 29300 6050
F 0 "RP2" H 29300 6500 40  0000 C CNN
F 1 "R_PACK4" H 29300 6600 40  0000 C CNN
F 2 "AutomataFootprint:R_Array_Concave_4x0603_AUTOMATA" H 29300 6050 60  0001 C CNN
F 3 "" H 29300 6050 60  0000 C CNN
	1    29300 6050
	0    -1   -1   0   
$EndComp
Text HLabel 29200 4700 2    60   Input ~ 0
ISO_IN14
Text HLabel 29200 4800 2    60   Input ~ 0
ISO_IN15
Text HLabel 29200 4900 2    60   Input ~ 0
ISO_IN16
$Comp
L Conn_02x10_Odd_Even J12
U 1 1 5ACF51DB
P 23050 4850
F 0 "J12" H 23100 5350 50  0000 C CNN
F 1 "LED_IN" H 23100 4250 50  0000 C CNN
F 2 "Connectors_Multicomp:Multicomp_MC9A12-2034_2x10x2.54mm_Straight" H 23050 4850 50  0001 C CNN
F 3 "" H 23050 4850 50  0001 C CNN
	1    23050 4850
	1    0    0    -1  
$EndComp
Text Label 22500 4450 2    60   ~ 0
I1
Text Label 22500 4550 2    60   ~ 0
I3
Text Label 22500 4650 2    60   ~ 0
I5
Text Label 22500 4750 2    60   ~ 0
I7
Text Label 22500 4850 2    60   ~ 0
I9
Text Label 22500 4950 2    60   ~ 0
I11
Text Label 22500 5050 2    60   ~ 0
I13
Text Label 22500 5150 2    60   ~ 0
I15
Text Label 23700 4450 0    60   ~ 0
I2
Text Label 23700 4550 0    60   ~ 0
I4
Text Label 23700 4650 0    60   ~ 0
I6
Text Label 23700 4750 0    60   ~ 0
I8
Text Label 23700 4850 0    60   ~ 0
I10
Text Label 23700 4950 0    60   ~ 0
I12
Text Label 23700 5050 0    60   ~ 0
I14
Text Label 23700 5150 0    60   ~ 0
I16
Text Label 22500 5350 2    60   ~ 0
245_VCC
Text Label 23700 5350 0    60   ~ 0
245_GND
Text Label 5500 9850 0    60   ~ 0
I9
Text Label 5500 9950 0    60   ~ 0
I10
Text Label 5500 10050 0    60   ~ 0
I11
Text Label 5500 10150 0    60   ~ 0
I12
Text Label 5500 10250 0    60   ~ 0
I13
Text Label 5500 10350 0    60   ~ 0
I14
Text Label 5500 10450 0    60   ~ 0
I15
Text Label 5500 10550 0    60   ~ 0
I16
Text Label 8900 9800 0    60   ~ 0
I1
Text Label 8900 9900 0    60   ~ 0
I2
Text Label 8900 10000 0    60   ~ 0
I3
Text Label 8900 10100 0    60   ~ 0
I4
Text Label 8900 10400 0    60   ~ 0
I7
Text Label 8900 10300 0    60   ~ 0
I6
Text Label 8900 10200 0    60   ~ 0
I5
Text Label 8900 10500 0    60   ~ 0
I8
Text Label 22500 5250 2    60   ~ 0
245_VCC
$Comp
L Conn_02x10_Odd_Even J22
U 1 1 5AAD1EFE
P 5000 10350
F 0 "J22" H 5050 10850 50  0000 C CNN
F 1 "Conn_02x10_Odd_Even" H 5050 9750 50  0000 C CNN
F 2 "AutomataFootprint11:bb02-hp20_automata" H 5000 10350 50  0001 C CNN
F 3 "" H 5000 10350 50  0001 C CNN
	1    5000 10350
	1    0    0    1   
$EndComp
Text HLabel 4000 10750 0    60   Input ~ 0
GND3
Wire Wire Line
	5350 3750 5350 4550
Wire Wire Line
	5350 5800 5350 6600
Wire Wire Line
	6250 4400 6250 4950
Wire Wire Line
	6250 4550 5900 4550
Wire Wire Line
	5900 4850 5900 5300
Wire Wire Line
	5900 5300 6250 5300
Connection ~ 6250 4550
Wire Wire Line
	6250 5250 6250 5400
Wire Wire Line
	5900 6600 6200 6600
Wire Wire Line
	6200 6400 6200 6950
Wire Wire Line
	5900 6900 5900 7300
Wire Wire Line
	5900 7300 6200 7300
Connection ~ 6200 6600
Wire Wire Line
	6200 7250 6200 7450
Connection ~ 6250 5300
Connection ~ 6200 7300
Wire Wire Line
	8950 9700 9400 9700
Wire Wire Line
	8950 9700 8950 9550
Wire Notes Line
	1400 3200 1400 19300
Wire Wire Line
	1500 2550 1700 2550
Wire Wire Line
	1550 2700 1700 2700
Wire Wire Line
	28300 4200 29200 4200
Wire Wire Line
	28300 4300 29200 4300
Wire Wire Line
	28300 4400 29200 4400
Wire Wire Line
	28300 4500 29200 4500
Wire Wire Line
	28300 4600 29200 4600
Wire Wire Line
	28300 4800 29200 4800
Wire Wire Line
	28300 4900 29200 4900
Wire Wire Line
	27050 6400 26950 6400
Wire Wire Line
	27050 6500 26950 6500
Wire Wire Line
	27050 6600 26950 6600
Wire Wire Line
	27050 6700 26950 6700
Wire Wire Line
	26900 4600 26800 4600
Wire Wire Line
	26900 4200 26800 4200
Wire Wire Line
	26900 4300 26800 4300
Wire Wire Line
	26900 4400 26800 4400
Wire Wire Line
	26500 5100 26900 5100
Wire Wire Line
	26700 5200 26900 5200
Wire Wire Line
	26700 5000 26900 5000
Wire Wire Line
	28300 5050 28400 5050
Wire Wire Line
	26700 5000 26700 5300
Connection ~ 26700 5200
Wire Wire Line
	25950 5100 26200 5100
Wire Wire Line
	27950 3900 27950 4050
Wire Wire Line
	27950 4050 28300 4050
Wire Wire Line
	26200 4700 26200 4650
Wire Wire Line
	26200 4350 26200 4300
Wire Wire Line
	28450 6400 29350 6400
Wire Wire Line
	28450 6500 29350 6500
Wire Wire Line
	28450 6600 29350 6600
Wire Wire Line
	28450 6700 29350 6700
Wire Wire Line
	28450 6800 29350 6800
Wire Wire Line
	26900 4500 26800 4500
Wire Wire Line
	26900 4700 26800 4700
Wire Wire Line
	26900 4800 26800 4800
Wire Wire Line
	26900 4900 26800 4900
Wire Wire Line
	26650 7300 27050 7300
Wire Wire Line
	26850 7400 27050 7400
Wire Wire Line
	26850 7200 27050 7200
Wire Wire Line
	28450 7250 28550 7250
Wire Wire Line
	26850 7200 26850 7500
Connection ~ 26850 7400
Wire Wire Line
	26100 7300 26350 7300
Wire Wire Line
	28100 6100 28100 6250
Wire Wire Line
	28100 6250 28450 6250
Wire Wire Line
	26250 6750 26250 6700
Wire Wire Line
	26250 6400 26250 6350
Wire Notes Line
	25250 5150 25250 3450
Wire Notes Line
	25250 3450 30000 3450
Wire Notes Line
	30000 3450 30000 7900
Wire Notes Line
	30000 7900 25250 7900
Wire Notes Line
	25250 7900 25250 5100
Wire Wire Line
	28300 4050 28300 3650
Wire Wire Line
	28300 3650 29100 3650
Connection ~ 29000 3650
Connection ~ 28900 3650
Connection ~ 28800 3650
Connection ~ 28700 3650
Connection ~ 28600 3650
Connection ~ 28500 3650
Connection ~ 28400 3650
Wire Wire Line
	28450 6250 28450 5850
Connection ~ 28950 5850
Connection ~ 28850 5850
Connection ~ 28750 5850
Connection ~ 28650 5850
Connection ~ 28550 5850
Wire Wire Line
	9400 9700 9400 10500
Connection ~ 9400 10400
Connection ~ 9400 10300
Connection ~ 9400 10200
Connection ~ 9400 10100
Connection ~ 9400 10000
Connection ~ 9400 9900
Connection ~ 9400 9800
Wire Wire Line
	5350 3750 4750 3750
Wire Wire Line
	4750 4650 5350 4650
Wire Wire Line
	4450 3750 2200 3750
Wire Wire Line
	2200 3750 2200 6300
Wire Wire Line
	2200 6300 2000 6300
Wire Wire Line
	4450 4650 2300 4650
Wire Wire Line
	2300 4650 2300 6400
Wire Wire Line
	2300 6400 2000 6400
Wire Wire Line
	5000 3850 5000 3750
Connection ~ 5000 3750
Wire Wire Line
	5000 4250 5000 4300
Wire Wire Line
	5000 4600 5000 4650
Connection ~ 5000 4650
Wire Wire Line
	5350 5650 4750 5650
Wire Wire Line
	4750 4750 5350 4750
Wire Wire Line
	5000 5550 5000 5650
Connection ~ 5000 5650
Wire Wire Line
	5000 5150 5000 5100
Wire Wire Line
	5000 4800 5000 4750
Connection ~ 5000 4750
Wire Wire Line
	5350 5650 5350 4850
Wire Wire Line
	4450 4750 2400 4750
Wire Wire Line
	2400 4750 2400 6500
Wire Wire Line
	2400 6500 2000 6500
Wire Wire Line
	4450 5650 2450 5650
Wire Wire Line
	2450 6600 2000 6600
Wire Wire Line
	2450 5650 2450 6600
Wire Wire Line
	5350 5800 4750 5800
Wire Wire Line
	5350 6700 4750 6700
Wire Wire Line
	5000 5900 5000 5800
Connection ~ 5000 5800
Wire Wire Line
	5000 6300 5000 6350
Wire Wire Line
	5000 6650 5000 6700
Connection ~ 5000 6700
Wire Wire Line
	4450 5800 2600 5800
Wire Wire Line
	2600 5800 2600 6700
Wire Wire Line
	2600 6700 2000 6700
Wire Wire Line
	4450 6700 2750 6700
Wire Wire Line
	2750 6700 2750 6800
Wire Wire Line
	2750 6800 2000 6800
Wire Wire Line
	28450 5850 29250 5850
Wire Wire Line
	26950 6800 27050 6800
Wire Notes Line
	1400 3200 20650 3200
Wire Wire Line
	4000 10650 4800 10650
Wire Wire Line
	6050 9850 6200 9850
Connection ~ 6200 9850
Wire Wire Line
	6200 9950 6050 9950
Connection ~ 6200 9950
Wire Wire Line
	6200 10050 6050 10050
Connection ~ 6200 10050
Wire Wire Line
	6200 10150 6050 10150
Connection ~ 6200 10150
Wire Wire Line
	6200 10250 6050 10250
Connection ~ 6200 10250
Wire Wire Line
	6200 10350 6050 10350
Wire Wire Line
	6200 10450 6050 10450
Connection ~ 6200 10350
Wire Wire Line
	6200 10550 6050 10550
Connection ~ 6200 10450
Wire Wire Line
	5900 4650 6000 4650
Wire Wire Line
	6000 4650 6000 3600
Wire Wire Line
	5900 4750 6050 4750
Wire Wire Line
	6050 4750 6050 3800
Wire Wire Line
	6050 3800 6150 3800
Wire Wire Line
	5900 6700 5900 5550
Wire Wire Line
	5900 5550 6100 5550
Wire Wire Line
	6100 5550 6100 4000
Wire Wire Line
	6100 4000 6400 4000
Wire Wire Line
	6200 9750 6200 10550
Wire Wire Line
	26950 6900 27050 6900
Wire Wire Line
	26950 7000 27050 7000
Wire Wire Line
	26950 7100 27050 7100
Wire Wire Line
	29350 6900 28450 6900
Connection ~ 29050 5850
Connection ~ 29150 5850
Wire Wire Line
	29350 7000 28450 7000
Wire Wire Line
	29350 7100 28450 7100
Wire Notes Line
	1400 19300 20650 19300
Wire Wire Line
	22500 4450 22850 4450
Wire Wire Line
	22500 4550 22850 4550
Wire Wire Line
	22500 4650 22850 4650
Wire Wire Line
	22500 4750 22850 4750
Wire Wire Line
	22500 4850 22850 4850
Wire Wire Line
	22500 4950 22850 4950
Wire Wire Line
	22500 5050 22850 5050
Wire Wire Line
	22500 5150 22850 5150
Wire Wire Line
	23700 4450 23350 4450
Wire Wire Line
	23700 4550 23350 4550
Wire Wire Line
	23700 4650 23350 4650
Wire Wire Line
	23700 4750 23350 4750
Wire Wire Line
	23700 4850 23350 4850
Wire Wire Line
	23700 4950 23350 4950
Wire Wire Line
	23700 5050 23350 5050
Wire Wire Line
	23700 5150 23350 5150
Wire Wire Line
	22500 5250 22850 5250
Wire Wire Line
	23700 5250 23350 5250
Wire Wire Line
	22500 5350 22850 5350
Wire Wire Line
	23700 5350 23350 5350
Wire Wire Line
	28700 4050 28700 4500
Connection ~ 28700 4500
Wire Wire Line
	28600 4050 28600 4400
Connection ~ 28600 4400
Wire Wire Line
	28500 4050 28500 4300
Connection ~ 28500 4300
Wire Wire Line
	28400 4050 28400 4200
Connection ~ 28400 4200
Wire Wire Line
	28300 4700 29200 4700
Wire Wire Line
	28800 4050 28800 4600
Connection ~ 28800 4600
Wire Wire Line
	28900 4050 28900 4700
Connection ~ 28900 4700
Wire Wire Line
	29000 4050 29000 4800
Connection ~ 29000 4800
Wire Wire Line
	29100 4050 29100 4900
Connection ~ 29100 4900
Wire Wire Line
	4000 10750 4800 10750
Wire Wire Line
	4000 9850 4800 9850
Wire Wire Line
	4800 9950 4000 9950
Wire Wire Line
	4000 10050 4800 10050
Wire Wire Line
	4800 10150 4000 10150
Wire Wire Line
	4000 10250 4800 10250
Wire Wire Line
	4800 10350 4000 10350
Wire Wire Line
	4000 10450 4800 10450
Wire Wire Line
	4800 10550 4000 10550
Wire Wire Line
	5300 9850 5650 9850
Wire Wire Line
	5650 9950 5300 9950
Wire Wire Line
	5300 10050 5650 10050
Wire Wire Line
	5650 10150 5300 10150
Wire Wire Line
	5300 10250 5650 10250
Wire Wire Line
	5650 10350 5300 10350
Wire Wire Line
	5300 10450 5650 10450
Wire Wire Line
	5650 10550 5300 10550
$Comp
L Conn_02x10_Odd_Even J23
U 1 1 5AAD94C4
P 8500 10300
F 0 "J23" H 8550 10800 50  0000 C CNN
F 1 "Conn_02x10_Odd_Even" H 8550 9700 50  0000 C CNN
F 2 "AutomataFootprint11:bb02-hp20_automata" H 8500 10300 50  0001 C CNN
F 3 "" H 8500 10300 50  0001 C CNN
	1    8500 10300
	1    0    0    1   
$EndComp
Wire Wire Line
	5300 10650 5550 10650
Wire Wire Line
	5300 10750 5550 10750
Text Label 5550 10650 0    60   ~ 0
245_VCC
Text Label 5550 10750 0    60   ~ 0
245_GND
Wire Wire Line
	8050 10600 8300 10600
Text HLabel 8050 10700 0    60   Input ~ 0
GND2
Wire Wire Line
	8050 10700 8300 10700
Wire Wire Line
	8100 9800 8300 9800
Wire Wire Line
	8100 9900 8300 9900
Wire Wire Line
	8100 10000 8300 10000
Wire Wire Line
	8100 10100 8300 10100
Wire Wire Line
	8100 10200 8300 10200
Wire Wire Line
	8100 10300 8300 10300
Wire Wire Line
	8100 10400 8300 10400
Wire Wire Line
	8100 10500 8300 10500
Wire Wire Line
	8800 9800 9000 9800
Wire Wire Line
	8800 9900 9000 9900
Wire Wire Line
	8800 10000 9000 10000
Wire Wire Line
	8800 10100 9000 10100
Wire Wire Line
	8800 10200 9000 10200
Wire Wire Line
	8800 10300 9000 10300
Wire Wire Line
	8800 10400 9000 10400
Wire Wire Line
	8800 10500 9000 10500
Wire Wire Line
	8800 10600 9000 10600
Wire Wire Line
	8800 10700 9000 10700
Text Label 9000 10600 0    60   ~ 0
245_VCC
Text Label 9000 10700 0    60   ~ 0
245_GND
Text HLabel 23700 5250 2    60   Input ~ 0
R/S_LED
Wire Wire Line
	28550 6250 28550 6400
Connection ~ 28550 6400
Wire Wire Line
	28650 6250 28650 6500
Connection ~ 28650 6500
Wire Wire Line
	28750 6250 28750 6600
Connection ~ 28750 6600
Wire Wire Line
	28850 6250 28850 6700
Connection ~ 28850 6700
Wire Wire Line
	28950 6250 28950 6800
Connection ~ 28950 6800
Wire Wire Line
	29050 6250 29050 6900
Connection ~ 29050 6900
Wire Wire Line
	29150 6250 29150 7000
Connection ~ 29150 7000
Wire Wire Line
	29250 6250 29250 7100
Connection ~ 29250 7100
NoConn ~ 5350 6800
NoConn ~ 5350 6900
NoConn ~ 5900 6800
$Comp
L CP1 C11
U 1 1 5AEA0C71
P 5650 11450
F 0 "C11" H 5675 11550 50  0000 L CNN
F 1 "CP1" H 5675 11350 50  0000 L CNN
F 2 "AutomataFootprint:CP_Radial_D5.0mm_P2.50mm" H 5650 11450 50  0001 C CNN
F 3 "" H 5650 11450 50  0001 C CNN
	1    5650 11450
	1    0    0    -1  
$EndComp
Wire Wire Line
	5650 11300 5650 11100
Wire Wire Line
	5650 11600 5650 11850
Text Label 5650 11100 0    60   ~ 0
245_VCC
Text Label 5650 11850 0    60   ~ 0
245_GND
$EndSCHEMATC
