EESchema Schematic File Version 2
LIBS:power
LIBS:device
LIBS:switches
LIBS:relays
LIBS:motors
LIBS:transistors
LIBS:conn
LIBS:linear
LIBS:regul
LIBS:74xx
LIBS:cmos4000
LIBS:adc-dac
LIBS:memory
LIBS:xilinx
LIBS:microcontrollers
LIBS:dsp
LIBS:microchip
LIBS:analog_switches
LIBS:motorola
LIBS:texas
LIBS:intel
LIBS:audio
LIBS:interface
LIBS:digital-audio
LIBS:philips
LIBS:display
LIBS:cypress
LIBS:siliconi
LIBS:opto
LIBS:atmel
LIBS:contrib
LIBS:valves
LIBS:AUTOPLCV1.4-cache
EELAYER 25 0
EELAYER END
$Descr A3 16535 11693
encoding utf-8
Sheet 10 10
Title "RDM_lpc2148"
Date "15 oct 2016"
Rev "0.5"
Comp "AUTOMATA SYSTEMS"
Comment1 ""
Comment2 ""
Comment3 ""
Comment4 ""
$EndDescr
Text HLabel 11900 6350 1    60   Input ~ 0
3.3V
Text HLabel 10450 6550 0    60   Input ~ 0
+5v
Text Notes 6300 3900 0    60   ~ 0
5.08MM PITCH \nScrew Terminal
Text Notes 7550 6810 2    60   ~ 0
Power On Led\n
Text HLabel 6350 6600 0    60   Input ~ 0
+5v
Text Notes 7600 6410 2    60   ~ 0
Power On Led\n
Text HLabel 6400 6200 0    60   Input ~ 0
+12V
Text Notes 7500 7260 2    60   ~ 0
Power On Led\n
Text HLabel 6350 7050 0    60   Input ~ 0
3.3V
Text HLabel 7700 6200 2    60   Input ~ 0
GND_SUPPLY
Text HLabel 7650 6600 2    60   Input ~ 0
GND_SUPPLY
Text HLabel 7650 7050 2    60   Input ~ 0
GND_SUPPLY
Text HLabel 11700 7050 2    60   Input ~ 0
GND_SUPPLY
Wire Wire Line
	6850 6600 7150 6600
Wire Wire Line
	7450 6600 7650 6600
Wire Wire Line
	6350 6600 6550 6600
Wire Wire Line
	6900 6200 7300 6200
Wire Wire Line
	7600 6200 7700 6200
Wire Wire Line
	6400 6200 6600 6200
Wire Wire Line
	6850 7050 7150 7050
Wire Wire Line
	7450 7050 7650 7050
Wire Wire Line
	6350 7050 6550 7050
Wire Wire Line
	11700 7100 11700 6950
Wire Wire Line
	10650 6550 10450 6550
Wire Wire Line
	11050 7100 11700 7100
Connection ~ 11700 7050
Wire Wire Line
	11900 6550 11900 6350
$Comp
L LM2575 U3
U 1 1 57AC840B
P 9250 3750
F 0 "U3" H 9000 4050 60  0000 C CNN
F 1 "LM2575" H 9400 3600 60  0000 C CNN
F 2 "AutomataFootprint:AUTOMATA_LM2575" H 9250 3750 60  0001 C CNN
F 3 "~" H 9250 3750 60  0000 C CNN
	1    9250 3750
	1    0    0    -1  
$EndComp
$Comp
L INDUCTOR L1
U 1 1 57AC841A
P 10450 3750
F 0 "L1" V 10400 3750 40  0000 C CNN
F 1 "330uH/1.5A/52kHz" V 10550 3750 40  0000 C CNN
F 2 "AutomataFootprint:L_Radial_D10.0mm_P5.00mm_Neosid_SD12k_style3_AUTOMATA" V 10600 3750 60  0001 C CNN
F 3 "~" H 10450 3750 60  0000 C CNN
	1    10450 3750
	0    -1   -1   0   
$EndComp
$Comp
L ZENER D2
U 1 1 57AC8433
P 9900 4100
F 0 "D2" H 9900 4200 50  0000 C CNN
F 1 "SS14" H 9900 3900 40  0000 C CNN
F 2 "AutomataFootprint:AUTOMATA_SS14_DIOD" H 9900 4000 60  0001 C CNN
F 3 "~" H 9900 4100 60  0000 C CNN
	1    9900 4100
	0    -1   -1   0   
$EndComp
Wire Wire Line
	9750 3750 10150 3750
Wire Wire Line
	9750 3550 10850 3550
Wire Wire Line
	10850 3550 10850 3750
Wire Wire Line
	10750 3750 12100 3750
Connection ~ 10850 3750
Connection ~ 9900 3750
Wire Wire Line
	9900 3900 9900 3750
Wire Wire Line
	9000 4300 9000 4150
Wire Wire Line
	9100 4300 9100 4150
Connection ~ 9100 4300
Wire Wire Line
	9200 4300 9200 4150
Connection ~ 9200 4300
Connection ~ 9000 4300
Text HLabel 6300 3600 0    60   Input ~ 0
+12V
Text HLabel 7000 4300 0    60   Input ~ 0
GND_SUPPLY
Text HLabel 12100 3750 2    60   Input ~ 0
+5v
Text Notes 10200 3950 0    60   ~ 0
330uH Toroid
Wire Wire Line
	6300 3600 8650 3600
Wire Wire Line
	7650 3600 7650 3850
Connection ~ 7650 3600
Wire Wire Line
	7650 4150 7650 4300
Connection ~ 7650 4300
Connection ~ 9900 4300
Wire Wire Line
	11450 3800 11450 3750
Connection ~ 11450 3750
Wire Wire Line
	11450 4100 11450 4300
Wire Wire Line
	11450 4300 7000 4300
$Comp
L LED D74
U 1 1 5A214A0E
P 6750 6200
F 0 "D74" H 6750 6300 50  0000 C CNN
F 1 "12V" H 6750 6100 50  0000 C CNN
F 2 "AutomataFootprint:LED_1206" H 6750 6200 50  0001 C CNN
F 3 "" H 6750 6200 50  0001 C CNN
	1    6750 6200
	-1   0    0    1   
$EndComp
$Comp
L LED D3
U 1 1 5A214F24
P 6700 6600
F 0 "D3" H 6700 6700 50  0000 C CNN
F 1 "5V" H 6700 6500 50  0000 C CNN
F 2 "AutomataFootprint:LED_1206" H 6700 6600 50  0001 C CNN
F 3 "" H 6700 6600 50  0001 C CNN
	1    6700 6600
	-1   0    0    1   
$EndComp
$Comp
L LED D4
U 1 1 5A215081
P 6700 7050
F 0 "D4" H 6700 7150 50  0000 C CNN
F 1 "3.3V" H 6700 6950 50  0000 C CNN
F 2 "AutomataFootprint:LED_1206" H 6700 7050 50  0001 C CNN
F 3 "" H 6700 7050 50  0001 C CNN
	1    6700 7050
	-1   0    0    1   
$EndComp
Text Label 10500 6550 0    39   ~ 0
LM1117p3
$Comp
L CP1 C5
U 1 1 5A74A4BC
P 7650 4000
F 0 "C5" H 7675 4100 50  0000 L CNN
F 1 "100uF/50" H 7675 3900 50  0000 L CNN
F 2 "AutomataFootprint:CP_Radial_D10.0mm_P5.00mm" H 7650 4000 50  0001 C CNN
F 3 "" H 7650 4000 50  0001 C CNN
	1    7650 4000
	1    0    0    -1  
$EndComp
$Comp
L CP1 C6
U 1 1 5A74AD1F
P 11450 3950
F 0 "C6" H 11475 4050 50  0000 L CNN
F 1 "300uF/50" H 11475 3850 50  0000 L CNN
F 2 "AutomataFootprint:CP_Radial_D10.0mm_P5.00mm" H 11450 3950 50  0001 C CNN
F 3 "" H 11450 3950 50  0001 C CNN
	1    11450 3950
	1    0    0    -1  
$EndComp
$Comp
L LM1117 U1
U 1 1 5A74B12C
P 11050 6700
F 0 "U1" H 11050 7000 60  0000 C CNN
F 1 "LM1117" H 11100 6450 60  0000 L CNN
F 2 "AutomataFootprint:SOT223_LM1117" H 11050 6700 60  0001 C CNN
F 3 "" H 11050 6700 60  0000 C CNN
	1    11050 6700
	1    0    0    -1  
$EndComp
Wire Wire Line
	11450 6550 11900 6550
Wire Wire Line
	11450 6550 11450 6650
$Comp
L CP1 C7
U 1 1 5A74B452
P 11700 6800
F 0 "C7" H 11725 6900 50  0000 L CNN
F 1 "100uF" H 11725 6700 50  0000 L CNN
F 2 "AutomataFootprint:CP_Radial_D10.0mm_P5.00mm" H 11700 6800 50  0001 C CNN
F 3 "" H 11700 6800 50  0001 C CNN
	1    11700 6800
	1    0    0    -1  
$EndComp
Wire Wire Line
	11050 7100 11050 7050
Wire Wire Line
	11700 6650 11700 6550
Connection ~ 11700 6550
$Comp
L R R7
U 1 1 5A74BB29
P 7450 6200
F 0 "R7" V 7530 6200 50  0000 C CNN
F 1 "2k" V 7450 6200 50  0000 C CNN
F 2 "AutomataFootprint:R_0805_AUTOMAT" V 7380 6200 50  0001 C CNN
F 3 "" H 7450 6200 50  0001 C CNN
	1    7450 6200
	0    1    1    0   
$EndComp
$Comp
L R R5
U 1 1 5A74BD7F
P 7300 6600
F 0 "R5" V 7380 6600 50  0000 C CNN
F 1 "1k" V 7300 6600 50  0000 C CNN
F 2 "AutomataFootprint:R_0805_AUTOMAT" V 7230 6600 50  0001 C CNN
F 3 "" H 7300 6600 50  0001 C CNN
	1    7300 6600
	0    1    1    0   
$EndComp
$Comp
L R R6
U 1 1 5A74BFD1
P 7300 7050
F 0 "R6" V 7380 7050 50  0000 C CNN
F 1 "560E" V 7300 7050 50  0000 C CNN
F 2 "AutomataFootprint:R_0805_AUTOMAT" V 7230 7050 50  0001 C CNN
F 3 "" H 7300 7050 50  0001 C CNN
	1    7300 7050
	0    1    1    0   
$EndComp
Wire Notes Line
	5550 5950 8750 5950
Wire Notes Line
	8750 5950 8750 7700
Wire Notes Line
	8750 7700 5550 7700
Wire Notes Line
	5550 7700 5550 5950
Wire Notes Line
	5650 3200 12400 3200
Wire Notes Line
	12400 3200 12400 5050
Wire Notes Line
	12400 5050 5650 5050
Wire Notes Line
	5650 5050 5650 3200
Wire Notes Line
	9850 5900 12450 5900
Wire Notes Line
	12450 5900 12450 7700
Wire Notes Line
	12450 7700 9850 7700
Wire Notes Line
	9850 7700 9850 5900
Text Notes 8650 3150 0    197  ~ 0
LM2575
Text Notes 6700 5900 0    197  ~ 0
INDICATORS
Text Notes 11050 5800 0    197  ~ 0
LM1117
$Comp
L Conn_01x02 J16
U 1 1 5AC38F91
P 3550 3800
F 0 "J16" H 3550 3900 50  0000 C CNN
F 1 "POWER" V 3650 3800 50  0000 C CNN
F 2 "AutomataFootprint:PHX_2PIN_5.08_2.8_SPACING" H 3550 3800 50  0001 C CNN
F 3 "" H 3550 3800 50  0001 C CNN
	1    3550 3800
	-1   0    0    1   
$EndComp
Wire Wire Line
	3750 3700 4250 3700
Wire Wire Line
	4250 3700 4250 3550
Wire Wire Line
	3750 3800 4250 3800
Wire Wire Line
	4250 3800 4250 3950
Wire Wire Line
	4250 3950 4550 3950
Wire Wire Line
	3900 3800 3900 4150
Wire Wire Line
	3900 4150 3750 4150
Connection ~ 3900 3800
Text HLabel 3750 4150 0    79   Input ~ 0
EXT_24V
$Comp
L D D68
U 1 1 5AC544F4
P 4700 3950
F 0 "D68" H 4700 4050 50  0000 C CNN
F 1 "D" H 4700 3850 50  0000 C CNN
F 2 "AutomataFootprint:D_SMC_Standard_Automata" H 4700 3950 50  0001 C CNN
F 3 "" H 4700 3950 50  0001 C CNN
	1    4700 3950
	-1   0    0    1   
$EndComp
Wire Wire Line
	4850 3950 4950 3950
Text HLabel 4950 3950 2    60   Input ~ 0
+12V
Text HLabel 4250 3550 2    60   Input ~ 0
GND_SUPPLY
$EndSCHEMATC
