names,emails_1,emails_2,emails_3,emails_4,images_1,images_2,images_3,images_4,images_5,images_6,usernames_1,usernames_2,usernames_3,usernames_4,usernames_5,phones_1,phones_2,phones_3,phones_4,phones_5,phones_6,phones_7,phones_8,phones_9,phones_10,gender,languages_1,languages_2,addresses_1,addresses_2,addresses_3,addresses_4,addresses_5,addresses_6,addresses_7,addresses_8,jobs_1,jobs_2,jobs_3,jobs_4,jobs_5,jobs_6,jobs_7,jobs_8,jobs_9,jobs_10,jobs_11,jobs_12,jobs_13,jobs_14,jobs_15,jobs_16,jobs_17,jobs_18,jobs_19,educations_1,educations_2,educations_3,educations_4,educations_5,educations_6,educations_7,relationships_1,relationships_2,relationships_3,relationships_4,relationships_5,relationships_6,relationships_7,relationships_8,relationships_9,relationships_10,relationships_11,relationships_12,relationships_13,relationships_14,relationships_15,relationships_16,relationships_17,user_ids_1,user_ids_2,user_ids_3,user_ids_4,user_ids_5,user_ids_6,user_ids_7,user_ids_8,user_ids_9,social_urls_1,social_urls_2,social_urls_3,social_urls_4,social_urls_5,social_urls_6,social_urls_7,social_urls_8,social_urls_9,social_urls_10,social_urls_11,social_urls_12,social_urls_13,social_urls_14,social_urls_15,UniqueId,age
Tvm Puthoore,,,,,,,,,,,,,,,,+91 85477 22208,,,,,,,,,,,,,India,,,,,,,,,,,,,,,,,,,,,,,,,,,,,,,,,,,,,,,,,,,,,,,,,,,,,,,,,,,,,,,,,,,,,,,,,,,1832379167,
Johnson,johnsonbiz.js@gmail.com,johnsonsoftwarecom@gmail.com,,,,,,,,,johnsonbiz23,,,,,+91 99621 22832,,,,,,,,,,,en,,"Chennai, India",,,,,,,,,,,,,,,,,,,,,,,,,,,,,,,,,,,,,,,,,,,,,,,,,,,277960992@twitter,,,,,,,,,https://twitter.com/johnsonbiz23,http://www.jsconsultancyservices.org,,,,,,,,,,,,,,1832323077,
Rahul Mit,,,,,,,,,,,,,,,,+91 98266 66986,,,,,,,,,,male,,,India,,,,,,,,,,,,,,,,,,,,,,,,,,,,,,,,,,,,,,,,,,,,,,,,,,,,,,,,,,,,,,,,,,,,,,,,,,,1832316283,
Sanket Kadlag,,,,,http://graph.facebook.com/100001609746723/picture?type=large,,,,,,sanket.kadlag09,,,,,+91 96234 55515,+91 89282 19009,,,,,,,,,male,en_US,,India,,,,,,,,,,,,,,,,,,,,,,,,,,,,,,,,,,,,,,,,,,,,,,,,,,,100001609746723@facebook,,,,,,,,,http://www.facebook.com/people/_/100001609746723,http://www.facebook.com/sanket.kadlag09,,,,,,,,,,,,,,1832317863,26 years old
ಸ ಖ,,,,,http://graph.facebook.com/1801419124/picture?type=large,,,,,,sudhindra.panchamukhi,,,,,+91 91647 51905,+91 90368 03683,,,,,,,,,male,en_US,,India,,,,,,,,,,,,,,,,,,,,,,,,,,,,,,,,,,,,,,,,,,,,,,,,,,,1801419124@facebook,,,,,,,,,http://www.facebook.com/people/_/1801419124,http://www.facebook.com/sudhindra.panchamukhi,,,,,,,,,,,,,,1832320549,
Prashanthanna,,,,,,,,,,,,,,,,+91 94813 44665,,,,,,,,,,,,,India,,,,,,,,,,,,,,,,,,,,,,,,,,,,,,,,,,,,,,,,,,,,,,,,,,,,,,,,,,,,,,,,,,,,,,,,,,,1832298587,
Giriraj Mulay,,,,,http://graph.facebook.com/100001410327752/picture?type=large,,,,,,giriraj.mulay,,,,,+91 97679 80325,+91 84467 58261,,,,,,,,,male,en_US,,India,,,,,,,,,,,,,,,,,,,,,,,,,,,,,,,,,,,,,,,,,,,,,,,,,,,100001410327752@facebook,,,,,,,,,http://www.facebook.com/people/_/100001410327752,http://www.facebook.com/giriraj.mulay,,,,,,,,,,,,,,1832313755,
Hiten Soni,aryahiten@gmail.com,purchase@arfin.co.in,purchase@arfin.co.am,,http://pbs.twimg.com/profile_images/561853016953729025/yUtc7EeI.jpeg,http://graph.facebook.com/1461104710/picture?type=large,https://img.fullcontact.com/static/cc0f802bed5541a630f1c5e4eade095b_7f2f88c82dec88faff13db8c1f6cb43c11d442c4d3feb52f562df1ab60caf963,https://img.fullcontact.com/static/d6c50f38c052caf6b971f89709c8a26e_0cc73be374850929fcad8933326194b9a23a77cccac3f10f23e8d93acc84ef57,,,arya_hiten,hiten.astikyam.soni,,,,+91 98988 64812,+91 78749 49694,+91 2764 232 620,+91 2764 232 621,,,,,,,male,en_GB,,"Ahmedabad, India","Mumbai, India",,,,,,,Factory Manager at SCOTTISH CHEMICAL INDUSTRIES (since 2016),Sr Purchase Executive at ARFIN INDIA LIMITED (2014-2016),Student at Indus institute of technology and engineering,,,,,,,,,,,,,,,,,"Bachelor of Engineering (BEng), Metallurgy and Materials engineering from Indus institute of technology and engineering (2010-2014)","SSC, SSC from New era public school (2002-2008)",,,,,,Arjun Patel,Vaishali Agrawal,Jeet Chan,Aditya Mittal,Shivangi Bhalodiya,Chirag Vaghela,,,,,,,,,,,,96113419@twitter,86/40/2b@linkedin,304653347@linkedin,1461104710@facebook,114938480765379605699@google,#02b04086@linkedin,,,,https://www.linkedin.com/in/hiten-kaloliya-02b04086,http://twitter.com/arya_hiten,http://www.facebook.com/people/_/1461104710,https://plus.google.com/114938480765379605699/about,http://klout.com/arya_hiten,http://www.facebook.com/hiten.astikyam.soni,,,,,,,,,,1832313123,26 years old
Rahul Wipro,getrahul12@gmail.com,jrahul09@gmail.com,rahul.jain1@wipro.com,rahul.jain@softageindia.com,http://graph.facebook.com/580875859/picture?type=large,https://img.fullcontact.com/static/52ad186f23d4d1ddaae113fc9b6d8288_fac1ee8344f2e0cd2599cfad3c62dc2b6ad5dcf8e763c0cd0f3ee53933459180,http://pbs.twimg.com/profile_images/671722508303728640/Ovc0B--x.jpg,http://lh4.googleusercontent.com/-OMCwz-RrKGg/AAAAAAAAAAI/AAAAAAAAAAA/rO6ocCR0OAI/photo.jpg,http://0.gravatar.com/avatar/34bbdbc8ee1462e30c999cc0417e4363?size=400&d=404,https://img.fullcontact.com/static/11ec56929fe99c3997e2208bcdedb5e8_75a2f23466e1d507feb0ab49659de2ea1c3cad51a0a053e326cd878b07c08c9f,rahuljain-oracle,rahul.jain.10485546,getrahul12,,,+91 97119 81558,+91 98115 42235,+91 99866 68967,+44 7405 797599,,,,,,,male,en_US,,"Delhi, India","Hyderabad, India","Noida, India","Gurgaon, India","Bangalore, India",United Kingdom,,,"Senior Member Technical Staff, Demo and Innovation Lab Engineering at Oracle (since 2018)",Principal Consultant-Oracle Fusion Middleware at Wipro (2013-2018),Senior Consultant - Oracle Fusion Middleware at Capgemini (2010-2013),OAF Consultant (Contractor) at Oracle (2009-2010),Software Developer at Satyam Computer Services Ltd (2008-2009),softage information technology,,,,,,,,,,,,,,"Bachelors, Technology (Electronics & Telecom) from UP Technical University (2003-2007)",,,,,,,Sushant Garg,,,,,,,,,,,,,,,,,782947928@twitter,580875859@facebook,56343152@gravatar,48289490@linkedin,14/209/382@linkedin,114782017660687799922@google,#38220914@linkedin,,,https://www.linkedin.com/in/rahuljain-oracle,http://www.facebook.com/people/_/580875859,http://en.gravatar.com/56343152,http://www.twitter.com/getrahul12,https://plus.google.com/114782017660687799922/about,https://www.linkedin.com/in/rahul-jain-38220914,http://en.gravatar.com/34bbdbc8ee1462e30c999cc0417e4363,http://www.facebook.com/rahul.jain.10485546,,,,,,,,1832314703,
Prince,,,,,,,,,,,,,,,,+91 87890 75012,,,,,,,,,,,,,India,,,,,,,,,,,,,,,,,,,,,,,,,,,,,,,,,,,,,,,,,,,,,,,,,,,,,,,,,,,,,,,,,,,,,,,,,,,1832311385,
,bsingh9780@gmail.com,,,,,,,,,,,,,,,+91 94142 09780,,,,,,,,,,male,,,India,,,,,,,,,,,,,,,,,,,,,,,,,,,,,,,,,,,,,,,,,,,,,,,,,,,,,,,,,,,,,,,,,,,,,,,,,,,1725961901,
Raghuram Mohan,raghuramrao.m@gmail.com,rmohan@deloitte.com,,,http://graph.facebook.com/1507104882/picture?type=large,,,,,,raghu2788,raghucpa,,,,+91 91761 16950,+91 80087 24343,,,,,,,,,male,en_GB,en_US,"Eluru, India","Hyderabad, India","Mumbai, India",,,,,,MBA Summer Intern at Marsh India (2015-2015),Senior Analyst-External Audit at Deloitte Touche Tohmatsu (2009-2014),Analyst-External Audit at Deloitte Touche Tohmatsu (since 2009),,,,,,,,,,,,,,,,,"Master of Business Administration (MBA), Finance, 7.5 from Sri Sri University (2014-2016)","B.com, Accounting & Finance from Ramakrishna Mission Vivekananda College (2006-2009)",B.com from University of Madras (2006-2009),,,,,,,,,,,,,,,,,,,,,,60231957@linkedin,464821939@twitter,18/208/559@linkedin,1507104882@facebook,#55920818@linkedin,,,,,https://www.linkedin.com/in/raghuram-mohan-55920818,http://facebook.com/people/_/1507104882,http://klout.com/raghucpa,http://www.twitter.com/raghucpa,http://www.facebook.com/raghu2788,,,,,,,,,,,1832309173,30 years old
Suspected Spam/Telemarketing,,,,,,,,,,,,,,,,+91 95898 80000,,,,,,,,,,male,,,India,,,,,,,,,,,,,,,,,,,,,,,,,,,,,,,,,,,,,,,,,,,,,,,,,,,,,,,,,,,,,,,,,,,,,,,,,,,1832093029,
Saurabh Ped,pednekarsaurabh4@gmail.com,pednekarsaurabh37@yahoo.com,,,http://graph.facebook.com/1271916149/picture?type=large,http://lh4.googleusercontent.com/--yBnNNWMVYs/AAAAAAAAAAI/AAAAAAAAAAA/v1KVFxbpQkU/photo.jpg,http://socialprofiles.zenfs.com/images/a47b7e146e34af08f99691981b0fffde_192.png,,,,saurabh.pednekar,,,,,+91 99305 28622,+91 80800 01754,+91 99873 64778,+91 99695 03209,,,,,,,male,en_US,,"Mumbai, India",,,,,,,,,,,,,,,,,,,,,,,,,,,,,,,,,,Monica Poddar,,,,,,,,,,,,,,,,,1271916149@facebook,100080537163113608544@google,,,,,,,,http://www.facebook.com/people/_/1271916149,https://plus.google.com/100080537163113608544/about,http://www.facebook.com/saurabh.pednekar,,,,,,,,,,,,,1832309963,
Prasads Shende,prasadshende@gmail.com,shendeprasad@gmail.com,prasad.shende@wadhwagroup.com,prasad.shinde@thewadhwagroup.com,http://graph.facebook.com/609147100/picture?type=large,,,,,,shende.prasad,,,,,+91 98333 22544,+91 22 6730 8401,+91 22 6730 8400,,,,,,,,male,en_US,,"Thane, India",,,,,,,,sales manager at charms group,,,,,,,,,,,,,,,,,,,,,,,,,,Sudhanwa Shingarey,Vipul Jamdade,Nirmal Shende,,,,,,,,,,,,,,,64/bb4/a65@linkedin,609147100@facebook,229908461@linkedin,100005396677730506426@google,#a65bb464@linkedin,,,,,http://www.facebook.com/people/_/609147100,https://www.linkedin.com/in/prasad-shende-a65bb464,https://plus.google.com/100005396677730506426/about,http://www.facebook.com/shende.prasad,,,,,,,,,,,,1832306487,
Ashutosh Agrawal,ashutoshagrawal@gmail.com,,,,http://graph.facebook.com/753945351/picture?type=large,,,,,,asagrawal,,,,,+91 98226 82497,,,,,,,,,,male,en_US,,"Pune, India",,,,,,,,IT Specialist at IBM India Pvt. Ltd (since 2011),Business Analyst at Tech Mahindra (2005-2011),Software Engineer at Cellnext Solutions Limited (2003-2005),Associate Software Engineer at Escosoft Technologies Limited (2000-2003),,,,,,,,,,,,,,,,,,,,,,,Mukesh Kane,,,,,,,,,,,,,,,,,753945351@facebook,49414322@linkedin,14/670/302@linkedin,107853653972024258727@google,#30267014@linkedin,,,,,http://www.linkedin.com/in/asagrawal,https://plus.google.com/107853653972024258727/about,http://www.facebook.com/people/_/753945351,https://www.linkedin.com/in/asagrawal,,,,,,,,,,,,1827658917,
Sumant Sogikar,sumant1122@gmail.com,,,,https://img.fullcontact.com/static/7cb5b393403b991b41dad5a783861181_d1518e64384acee0969c40024f7ee706c5a29eb3f13719caf5ec2f39f968ce03,,,,,,sumant1122,sumant-sogikar,,,,+91 96862 11278,,,,,,,,,,male,,,"Bangalore, India",,,,,,,,,,,,,,,,,,,,,,,,,,,,,,,,,,,,,,,,,,,,,,,,,,,85668570@foursquare,557461083@twitter,,,,,,,,http://www.twitter.com/sumant1122,http://klout.com/sumant1122,https://angel.co/sumant-sogikar,https://foursquare.com/user/85668570,https://instagram.com/sumant1122,https://github.com/sumant1122,https://medium.com/@sumant1122,http://coffee-holicwriter.blogspot.in,,,,,,,,1832306329,
Amit Choudhary,fitams@gmail.com,fitams@yahoo.com,,,,,,,,,fitams,,,,,,,,,,,,,,,male,en_US,,India,"Macao, Macau",,,,,,,Spa therapist at The Venetian,,,,,,,,,,,,,,,,,,,,,,,,,,Mohit Jhamb,,,,,,,,,,,,,,,,,672597549@facebook,65928833@linkedin,28089133@friendster,1a/b5/315@linkedin,#3150b51a@linkedin,,,,,http://www.facebook.com/people/_/672597549,http://www.linkedin.com/in/amit-choudhary-3150b51a,http://www.wayn.com/profiles/11246970,http://www.hi5.com/friend/p321534575--Profile--html,http://www.facebook.com/fitams,,,,,,,,,,,1832301747,37 years old
Sushil,,,,,,,,,,,,,,,,+91 99221 19773,,,,,,,,,,,,,India,,,,,,,,,,,,,,,,,,,,,,,,,,,,,,,,,,,,,,,,,,,,,,,,,,,,,,,,,,,,,,,,,,,,,,,,,,,1830966963,
Satyabrata 3Pathy,chillsata@live.com,,,,,,,,,,s3pathy,chillsat,,,,+91 97308 87772,+91 96113 60467,+91 99168 93584,+91 82977 14604,,,,,,,male,en_US,,"Bangalore, India","Pune, India",,,,,,,Business Associate at Tech Mahindra (since 2018),Senior Executive Talent Acquisition at Atidan Technologies Pvt. Ltd. (2016-2018),Junior Consultant at Systems Plus Solutions (2016-2016),Senior Recruitment Executive at Atidan Technologies Pvt. Ltd. (2016-2016),Technical Recruiter on Payroll of SA Technologies at Allscripts (2015-2015),Technical Recruiter on Payroll of Scaleneworks at HCL Technologies (2014-2015),Technical Recruiter on Payroll of Scaleneworks at Accenture (2014-2014),Research Associate(IT Recruiter) at IndiHire Consultants Pvt. Ltd. (2013-2013),Connecting to the Security Experts to make the world professionally secured.,,,,,,,,,,,"Bachelor of Technology (B.Tech.), I.T., A(70.8%) from C.V.Raman College Of Engineering,Bhubaneswar(B.P.U.T.) (2006-2010)","Bachelor of Technology (B.Tech.), IT, A(70.8%) from CVRaman College Of Engineering,Bhubaneswar(BPUT) (2006-2010)","Intermediate, Science from College of Basic Science and Humanities (2003-2005)",,,,,,,,,,,,,,,,,,,,,,67/19a/5b2@linkedin,64144066@foursquare,236346326@linkedin,100000296776598@facebook,#5b219a67@linkedin,,,,,http://www.linkedin.com/in/s3pathy,http://www.facebook.com/people/_/100000296776598,https://www.flickr.com/people/150978534@N03,https://foursquare.com/user/64144066,https://www.linkedin.com/in/s3pathy,http://www.facebook.com/Chillsat,,,,,,,,,,1832302695,
Anju Nagpal,nagpal.anju@yahoo.com,,,,,,,,,,,,,,,+91 97112 02584,,,,,,,,,,female,,,India,,,,,,,,,,,,,,,,,,,,,,,,,,,,,,,,,,,,,,,,,,,,,,,,,,,110403596729006385514@google,,,,,,,,,https://plus.google.com/110403596729006385514/about,,,,,,,,,,,,,,,1832296849,
Mobile Repair Ali Bidar,,,,,,,,,,,,,,,,+91 91417 70477,,,,,,,,,,male,,,India,,,,,,,,,,,,,,,,,,,,,,,,,,,,,,,,,,,,,,,,,,,,,,,,,,,,,,,,,,,,,,,,,,,,,,,,,,,1832298903,
Kiran Zarapkar,zarapkar.kiran@gmail.com,,,,,,,,,,ashkir100,,,,,,,,,,,,,,,male,,,India,,,,,,,,,,,,,,,,,,,,,,,,,,,,,,,,,,,,,,,,,,,,,,,,,,,164997477@twitter,,,,,,,,,https://twitter.com/ashkir100,,,,,,,,,,,,,,,1832287211,
Chandan Varanasi,singhchandan836@gmail.com,,,,http://graph.facebook.com/100000202151402/picture?type=large,https://img.fullcontact.com/static/4d8bc367a1a8c1646ee653b2b0c57cde_e6cdcc80564fd46e7beac67f22d9d020231f31d9737363275045a85e93fac5f3,,,,,chandan.singh.58118774,singhchandan836,,,,,,,,,,,,,,male,en_US,,"Varanasi, India",,,,,,,,,,,,,,,,,,,,,,,,,,,,,,,,,,,,,,,,,,,,,,,,,,,485474932@twitter,100000202151402@facebook,,,,,,,,http://www.facebook.com/people/_/100000202151402,http://www.twitter.com/singhchandan836,http://klout.com/singhchandan836,http://www.facebook.com/chandan.singh.58118774,,,,,,,,,,,,1832292425,
,satsmaurya76@gmail.com,,,,,,,,,,satishmaurya1976,,,,,,,,,,,,,,,male,,,India,,,,,,,,,,,,,,,,,,,,,,,,,,,,,,,,,,,,,,,,,,,,,,,,,,,38321701@gravatar,,,,,,,,,http://en.gravatar.com/f59fee697e2ba0c4cff9ce36467f1e3f,http://en.gravatar.com/38321701,,,,,,,,,,,,,,1832290687,
Devendra Pawaskar,p_deva@rediffmail.com,,,,http://graph.facebook.com/100003216339864/picture?type=large,,,,,,devendra.pawaskar.3,p_deva,,,,+91 98202 26965,,,,,,,,,,male,en_US,,"Mumbai, India",,,,,,,,CSA at Orange Business Services (since 2005),Sr. Executive Networks at AFL PVT LTD (2001-2005),Helpdesk Manager at Melstar (1997-2001),,,,,,,,,,,,,,,,,"Diploma In Industrial Electronics, Diploma In Industrial Electronics from Maharashtra Technical Board (1988-1992)","Master of Business Administration (MBA), Operations Management from ICFAI Distance Learning",HSC from Parle College,"SSC, SSC from Parle Tilak Vidyalaya",,,,,,,,,,,,,,,,,,,,,7/81/7a@linkedin,21069598@linkedin,103793640989843625319@google,100003216339864@facebook,#07a0817@linkedin,,,,,https://www.linkedin.com/in/devendra-pawaskar-07a0817,http://facebook.com/people/_/100003216339864,http://en.netlog.com/p_deva,https://plus.google.com/103793640989843625319/about,http://www.facebook.com/devendra.pawaskar.3,,,,,,,,,,,1832289897,47 years old
Pawan Arora,pawan20.1990@gmail.com,,,,,,,,,,,,,,,,,,,,,,,,,male,,,"Alwar, India","Chandigarh, India",,,,,,,Senior UI Developer at NVISH Solutions (since 2016),Senior UI Developer at SAP(Client side & Payroll is from A1 technology) (2016-2016),HTML5 Developer at Mobile programming LLC (since 2014),HTML5 Developer at A1 technology/Mobile Programming LLC (2014-2016),UI Developer at Prajwal Techno Solutions (2012-2014),,,,,,,,,,,,,,,"Bachelor of Technology (BTech), IT from Little birds Sen Sec school (2008-2012)",,,,,,,,,,,,,,,,,,,,,,,,b2/5a9/14@linkedin,401588944@linkedin,#0145a9b2@linkedin,,,,,,,https://www.linkedin.com/in/pawan-arora-0145a9b2,,,,,,,,,,,,,,,1832295585,
Ashish Choubey,choubeyashish83@yahoo.com,,,,,,,,,,ashish.choubey.948,,,,,,,,,,,,,,,male,en_US,,"Mumbai, India",,,,,,,,PERSONAL BANKER at HDFC Bank (since 2013),Relationship Manager at ICICI Securities (2012-2013),,,,,,,,,,,,,,,,,,"Master of Business Administration (MBA), Finance and Financial Management Services, A from Alard School of management sciences (2010-2012)",,,,,,,,,,,,,,,,,,,,,,,,56415159@linkedin,16/a87/7b3@linkedin,1373246368@facebook,#7b3a8716@linkedin,,,,,,http://www.linkedin.com/in/ashish-choubey-7b3a8716,http://www.facebook.com/people/_/1373246368,http://www.facebook.com/ashish.choubey.948,,,,,,,,,,,,,1832288159,
Anvesh Shrivastava,anveshnluo@gmail.com,,,,https://img.fullcontact.com/static/c818ee5118143ced221d9da225b8a0e5_53182afbbf68a6a9198f37e70a503e93a1bb808e7d679081a41bd052f72b12a8,,,,,,,,,,,,,,,,,,,,,male,,,India,,,,,,,,,,,,,,,,,,,,,,,,,,,,,,,,,,,,,,,,,,,,,,,,,,,118227835583197739716@google,,,,,,,,,https://plus.google.com/118227835583197739716/about,,,,,,,,,,,,,,,1832292267,
Krishna Chaudhari,krishna2916@gmail.com,,,,http://graph.facebook.com/666152101/picture?type=large,http://lh4.googleusercontent.com/-cLofwPtNhUg/AAAAAAAAAAI/AAAAAAAAAZk/wFQSqK3hdeY/photo.jpg,https://img.fullcontact.com/static/fca03589306676fd48e5a1e969d05ec3_53627edb07dcd41c32aa61496619f53ad46b56567de880c20dd9f24bbae867a5,,,,krishna.chaudhari.583,krishna2916,,,,,,,,,,,,,,male,en_GB,,India,,,,,,,,,,,,,,,,,,,,,,,,,,,,,,,,,,Meghana Satish,Vinuth Ravindra,Kushal Ravikmar,,,,,,,,,,,,,,,666152101@facebook,118145669488717901488@google,,,,,,,,http://facebook.com/people/_/666152101,https://plus.google.com/118145669488717901488/about,http://klout.com/user/id/379428287044148541,http://www.facebook.com/krishna.chaudhari.583,http://picasaweb.google.com/krishna2916,,,,,,,,,,,1832280733,
Rishikesh Nanivadekar,dr_anita_n@yahoo.com,rishi17rich@yahoo.co.in,,,http://graph.facebook.com/806783303/picture?type=large,,,,,,rishikesh.nanivadekar,,,,,+91 94220 07476,+91 94223 01783,+91 20 2542 1375,,,,,,,,male,en_US,,India,,,,,,,,,,,,,,,,,,,,,,,,,,,,,,,,,,,,,,,,,,,,,,,,,,,806783303@facebook,443962208@linkedin,104/822/6a8@linkedin,#6a8822104@linkedin,,,,,,http://www.facebook.com/people/_/806783303,https://www.linkedin.com/in/rishikesh-nanivadekar-6a8822104,http://www.facebook.com/rishikesh.nanivadekar,,,,,,,,,,,,,1832279311,
Ashish Agnihotri,ashish.agnihotri12@gmail.com,,,,http://graph.facebook.com/100001501511653/picture?type=large,,,,,,ashish.agnihotri2,,,,,+91 97803 42077,+91 84374 15444,,,,,,,,,male,en_US,,India,,,,,,,,,,,,,,,,,,,,,,,,,,,,,,,,,,Sunny Gupta,,,,,,,,,,,,,,,,,105283983683440053442@google,100001501511653@facebook,,,,,,,,http://www.facebook.com/people/_/100001501511653,https://plus.google.com/105283983683440053442/about,http://www.facebook.com/ashish.agnihotri2,,,,,,,,,,,,,1459650057,31 years old
Rajeev Naresh,rajeev.naresh@imageincarnate.com,rajeev.naresh@gmail.com,,,http://graph.facebook.com/583047072/picture?type=large,https://img.fullcontact.com/static/5bc52a57aae8432f68f1a7af4b977d66_c9d15f411fa28c7349029fb30b1ff4bed30647f51f0200df0ca5590205cb379c,https://img.fullcontact.com/static/043176dfd1aaa3f61c9637dd3f624f6a_ad8ade5fdd4f75fe13352f8aa499a7022d858d7c8f924df96ae9a0dea8952d0f,,,,rajeev.naresh,,,,,+91 98998 90988,,,,,,,,,,male,en_US,,"Delhi, India","Gurgaon, India",,,,,,,Sr. Manager - Key Accounts at Image Incarnate Brand Mechanics Pvt. Ltd. (since 2015),Manager - Business Development at Image Incarnate Brand Mechanics Pvt. Ltd. (2011-2015),Business Partner at Eventopromo (2010-2011),Area Manager - North India at Mindspace Events & Exhibitions (2009-2010),Project Head at Services International (2006-2009),,,,,,,,,,,,,,,"PGDBA, Marketing from Symbiosis institute of Management Studies (2004-2006)",,,,,,,Rupika Wadehra,,,,,,,,,,,,,,,,,73730200@linkedin,583047072@facebook,20/837/b34@linkedin,140738827@twitter,106069318353677387130@google,#b3483720@linkedin,,,,https://www.linkedin.com/in/rajeev-naresh-b3483720,http://www.facebook.com/people/_/583047072,http://www.twitter.com/rajeevnaresh,https://plus.google.com/106069318353677387130/about,http://www.facebook.com/rajeev.naresh,http://www.imageincarnate.com,http://www.mindspaceevents.org,http://www.servintonline.com,,,,,,,,1832284367,
Krishna Kumar,babul8486@gmail.com,,,,https://img.fullcontact.com/static/1327b75f6246625330e5e85e6ac07c7d_058a97e746f9e2f306527a1791ae79ae9292b30cbd9f411aa5d9f308c829d3b4,http://lh4.googleusercontent.com/-axIKNO61FgM/AAAAAAAAAAI/AAAAAAAAAJ4/H6XeIGpyeGc/photo.jpg,,,,,babul8486,,,,,,,,,,,,,,,,,,India,,,,,,,,,,,,,,,,,,,,,,,,,,,,,,,,,,,,,,,,,,,,,,,,,,,372726405@twitter,103995969036548547608@google,,,,,,,,http://www.twitter.com/babul8486,https://plus.google.com/103995969036548547608/about,http://klout.com/babul8486,,,,,,,,,,,,,1778355807,
Mateen Amjad,mateen_amjad@hotmail.co.uk,,,,http://graph.facebook.com/100003115444702/picture?type=large,,,,,,m.personified,maateenamjad,mrulx,,,+92 332 4444094,+92 344 4567888,+92 321 9899299,+92 343 4477766,,,,,,,male,en_GB,,"Lahore, Pakistan",,,,,,,,JP Unit Lahore at EFU General Insurance Ltd (since 2010),Surveyor at Ali Murtaza & Co. Pvt Ltd (2009-2010),Surveyor at Masud Associates Pvt Ltd (2008-2009),ѕтυ∂єηт,,,,,,,,,,,,,,,,Bachelor of Arts from University of the Punjab,Bachelors from COMSATS Institute of Information Technology (2009-2009),,,,,,Sheikh Shah Rukh,Sarmad Hassan,Muhammed Adil,Paris Hilton,Summan Simoon,,,,,,,,,,,,,88255501@linkedin,72258868@twitter,25/681/951@linkedin,116147065661121679187@google,100003115444702@facebook,#95168125@linkedin,,,,https://www.linkedin.com/in/mateen-amjad-95168125,http://www.facebook.com/people/_/100003115444702,https://plus.google.com/116147065661121679187/about,http://en.gravatar.com/3544a3e9ca8d67643a638de03bf16f33,http://klout.com/maateenamjad,https://twitter.com/mrulx,http://www.facebook.com/m.personified,,,,,,,,,1832278679,30 years old
Shyam,shyam_v_34@hotmail.com,,,,,,,,,,Shyam_V,,,,,,,,,,,,,,,male,,,"Bangalore, India",,,,,,,,,,,,,,,,,,,,,,,,,,,,,,,,,,,,,,,,,,,,,,,,,,,263574859@twitter,,,,,,,,,https://twitter.com/Shyam_V,,,,,,,,,,,,,,,1832272991,
Ajit Shahane,ajitshahane123@gmail.com,,,,,,,,,,,,,,,+91 97663 73845,,,,,,,,,,male,,,India,,,,,,,,,,,,,,,,,,,,,,,,,,,,,,,,,,,,,,,,,,,,,,,,,,,111460754275312644845@google,,,,,,,,,https://plus.google.com/111460754275312644845/about,,,,,,,,,,,,,,,1832276941,
Asif Khan,khanasif3117@gmail.com,,,,,,,,,,asifkhan36,,,,,,,,,,,,,,,male,,,India,,,,,,,,,,,,,,,,,,,,,,,,,,,,,,,,,,,,,,,,,,,,,,,,,,,133067747@gravatar,,,,,,,,,http://en.gravatar.com/133067747,http://en.gravatar.com/0b3dded631c80be15af499c1c024e372,,,,,,,,,,,,,,1832275835,
Manoj Singh,msd72792@gmail.com,manoj.sminnovative@gmail.com,,,,,,,,,msd72792,,,,,+91 85100 63943,,,,,,,,,,male,,,"Delhi, India","Gurgaon, Haryana, India","Madhubani, India","House No146, Gali No 3, Mamura Mandi, Noida, Noida, India",,,,,Digital Marketing Executive at Plum Innovations Pvt Ltd (since 2015),SEO ANALYST at Istrat software pvt ltd (2014-2015),DELHI at AD TECHNOSYS PVT LTD (2012-2013),SENIOR SEO ANALYST at AD TECHNOSYS PVT LTD (since 2012),SEO ANALYST at AD TECHNOSYS PVT LTD (2012-2014),,,,,,,,,,,,,,,"B.Tech, IT from wbut (2008-2012)","PATNA, 10+2 from BIHAR (2004-2008)",,,,,,,,,,,,,,,,,,,,,,,54/50b/301@linkedin,192366577@linkedin,#30150b54@linkedin,,,,,,,http://www.linkedin.com/in/manoj-kumar-singh-30150b54,http://pinterest.com/msd72792/,,,,,,,,,,,,,,1832270779,
Ronyth Dey,ronythde@gmail.com,,,,http://graph.facebook.com/661431150/picture?type=large,,,,,,ronyth,,,,,+91 88796 17426,+91 99206 07526,,,,,,,,,male,en_US,,India,,,,,,,,,,,,,,,,,,,,,,,,,,,,,,,,,,Manini Thakur,Thacker Dd,,,,,,,,,,,,,,,,661431150@facebook,103835058380610713443@google,,,,,,,,http://www.facebook.com/people/_/661431150,https://plus.google.com/103835058380610713443/about,http://www.facebook.com/ronyth,,,,,,,,,,,,,1832157019,
Krishna Gopal,krishna.gopal.gtfs@gmail.com,,,,,,,,,,,,,,,,,,,,,,,,,,,,India,,,,,,,,,,,,,,,,,,,,,,,,,,,,,,,,,,,,,,,,,,,,,,,,,,,,,,,,,,,,http://en.gravatar.com/45c4d09b9d0a259c2a7f2a67c0043a2a,,,,,,,,,,,,,,,1832259877,
Abhishek Sharma,p14abhisheks@iima.ac.in,dceabhishek2014@gmail.com,abhishek23sharma@gmail.com,p14abhisheks@iimahd.ernet.in,http://graph.facebook.com/746691638/picture?type=large,https://lh6.googleusercontent.com/-uOwHH9dG0ds/AAAAAAAAAAI/AAAAAAAAANM/K8wJunZFy3g/photo.jpg?sz=1080,https://img.fullcontact.com/static/6ae9223491b6467f025aaaf64747776a_59b31022045bae5bf45696689a2461accbae42edfbcfaeea821286655ec2574d,,,,abhishek23sharma,abhi23sharma,,,,+91 98717 99564,+91 82386 29388,+91 99587 69680,+91 79 6632 6960,+91 86910 45315,+91 82859 20389,,,,,male,en_US,,"Ahmedabad, India","Delhi, India","Gurgaon, India","Gurgaon, Haryana, India","Indore, India","Manesar, India","Mumbai, India","New Delhi, India",Sales & Operations Manager at Aditya Birla Fashion & Retail Ltd || IIM Ahmedabad || ESCP Paris || DCE,Sales and Operations Manager at Aditya Birla Fashion and Retail Ltd - Pantaloons (since 2017),Leadership Associate - Sales Operations at Pantaloons (2016-2017),Leadership Associate - Chairman's Cell at Aditya Birla Group Leadership Programs (2016-2017),Leadership Associate - Central Logistics at Hindalco Industries Limited (2016-2016),Intern at Uber (2016-2016),Digital Marketing Intern at Aditya Birla Group Leadership Programs (2015-2015),Member at General Management & Leadership Cell (since 2015),"Coordinator at Pronites Cell, CHAOS 2016 (since 2015)",Member at Sports Committee of IIM-A (2014-2015),"Core Team Member at Speakers & Pronites Cell, CHAOS 2015 (2014-2015)",Summer Trainee at Maruti Suzuki India Limited (2013-2013),Corporate Team Head at Engifest 2014 - DTU (2013-2014),Winter Intern at Lumax Industries Limited (2012-2013),Project Trainee at Honda Motorcycle & Scooter India Pvt. Ltd. (2012-2012),Treasurer & Membership Head at SAEINDIA-DTU Collegiate Club (2012-2013),"Member - Suspension Dept, Corporate Affairs & Logistics at Baja SAE Delhi Technological University (2010-2012)",Football Team Captain at N.C. Jindal Public School (2007-2010),House Sports Captain at N.C. Jindal Public School (2006-2009),"Masters in Management (MIM), Business Administration and Management, General from ESCP Europe (2015-2015)","PGP, Management from Indian Institute of Management, Ahmedabad (2014-2016)","B.Tech, Mechanical Engineering, Rank 4 from Delhi Technological University (Formerly Delhi College of Engineering) (2010-2014)","High School, Science with Computers from N.C. Jindal Public School, New Delhi (1997-2010)",IIM Ahmedabad,,,,,,,,,,,,,,,,,,,,974043383@instagram,746691638@facebook,35/3a6/86b@linkedin,24107594@gravatar,230690905@twitter,123390803@linkedin,107653043794707384703@google,#86b3a635@linkedin,,https://www.linkedin.com/in/abhishek23sharma,http://www.facebook.com/people/_/746691638,https://www.instagram.com/abhi23sharma,http://en.gravatar.com/24107594,https://plus.google.com/107653043794707384703/about,http://klout.com/abhi23sharma,https://twitter.com/abhi23sharma,http://www.linkedin.com/in/abhishek23sharma,http://en.gravatar.com/ca5a858e47d58e2a82106db0dedb7d91,http://www.facebook.com/abhishek23sharma,http://gravatar.com/abhishek23sharma,http://abhishek23sharma.wordpress.com/,,,,1832236177,26 years old
Ashwani Chaturvedi,ashwani.chaturvedi@yahoo.in,a.shekhar.chaturvedi@accenture.com,,,http://graph.facebook.com/100001514073962/picture?type=large,https://img.fullcontact.com/static/1c1d56e3ea7323c321c78657d1de32f3_532e1c205e2c3fb65fa6ac6fa8381108eb1164a6151997af8b2f4a825a814c41,,,,,ashwani.chaturvedi.7,ashwanichaturvedi,,,,+91 96640 70308,,,,,,,,,,male,en_US,,"Mumbai, India",,,,,,,,accenture,,,,,,,,,,,,,,,,,,,,,,,,,,,,,,,,,,,,,,,,,,,59645953@gravatar,100001514073962@facebook,,,,,,,,http://www.facebook.com/people/_/100001514073962,http://en.gravatar.com/a337e78b9c9822f5aafd83ce359b239d,http://www.facebook.com/ashwani.chaturvedi.7,http://en.gravatar.com/59645953,,,,,,,,,,,,1832255453,26 years old
Yogesh Patel,yogeshpatel.0105@gmail.com,,,,http://lh4.googleusercontent.com/-mdhXoa1TJ-Y/AAAAAAAAAAI/AAAAAAAAABI/cUewx55tVAQ/photo.jpg,,,,,,,,,,,,,,,,,,,,,male,,,India,,,,,,,,,,,,,,,,,,,,,,,,,,,,,,,,,,,,,,,,,,,,,,,,,,,108321336292569234166@google,,,,,,,,,https://plus.google.com/108321336292569234166/about,,,,,,,,,,,,,,,1832252293,
Abhishek Jha,bhardwaj.abhishek.it@gmail.com,,,,https://img.fullcontact.com/static/5260bf1c88231188391fb187572be476_fff57fce89205a589c0163676ed63220fcc633dc2bf7482d3a1bda1cb1944c09,,,,,,bhardwaj.abhishek.piet,,,,,+91 96506 13404,,,,,,,,,,male,en_US,,India,,,,,,,,,,,,,,,,,,,,,,,,,,,,,,,,,,,,,,,,,,,,,,,,,,,1175667016@facebook,116261456301021830337@google,,,,,,,,http://www.facebook.com/people/_/1175667016,https://plus.google.com/116261456301021830337/about,http://www.facebook.com/bhardwaj.abhishek.piet,,,,,,,,,,,,,1832256717,
Harish Hemat,,,,,http://graph.facebook.com/100001231764606/picture?type=large,,,,,,harish.tambekar.7,,,,,+91 89516 45322,+91 80516 45322,+91 99306 71750,+91 91753 50885,,,,,,,male,en_US,,India,,,,,,,,,,,,,,,,,,,,,,,,,,,,,,,,,,,,,,,,,,,,,,,,,,,100001231764606@facebook,,,,,,,,,http://facebook.com/people/_/100001231764606,http://www.facebook.com/harish.tambekar.7,,,,,,,,,,,,,,1832243129,
Nitin Kandwal,nitinkandwal74@ajnara.com,,,,http://graph.facebook.com/100001681956592/picture?type=large,,,,,,nkandwal,,,,,+91 95820 06085,+91 98994 85121,,,,,,,,,male,en_US,,India,,,,,,,,,,,,,,,,,,,,,,,,,,,,,,,,,,,,,,,,,,,,,,,,,,,100001681956592@facebook,,,,,,,,,http://facebook.com/people/_/100001681956592,http://www.facebook.com/nkandwal,,,,,,,,,,,,,,1786944055,
Rajesh Naik,rajeshnaik248@gmail.com,,,,http://graph.facebook.com/562669793/picture?type=large,,,,,,rajesh.naik.90260,,,,,+91 98206 86027,+91 91670 32901,+91 22 4239 9399,,,,,,,,male,en_US,,India,,,,,,,,,,,,,,,,,,,,,,,,,,,,,,,,,,,,,,,,,,,,,,,,,,,562669793@facebook,109796568528910916621@google,,,,,,,,http://www.facebook.com/people/_/562669793,https://plus.google.com/109796568528910916621/about,http://www.facebook.com/rajesh.naik.90260,,,,,,,,,,,,,1832239337,33 years old
Pavan Tohare,pavan.tohare@sap.com,pvntohare@gmail.com,,,https://img.fullcontact.com/static/c5d4be421779dcbf75c3a85369011cc8_e94654dfef2a88e8c0b64e55a994f57be3ae713e6fa027b2cb0d4bf4db05c0ac,,,,,,pavan.tohare,,,,,+91 77093 65475,,,,,,,,,,male,en_US,,"Akola, India","Pune, India",,,,,,,Senior Software Engineer at Druva Data Solutions (since 2017),Software Developer at SAP Labs India,"Developer Associate at Sybase, An SAP Company (2014-2017)",Developer Associate at SAP Labs India (since 2014),"Student at Indian Institute of Technology, Bombay",,,,,,,,,,,,,,,"Master’s Degree, Computer Science and Engineering, 8.16 from Indian Institute of Technology, Bombay (2012-2014)","M.Tech from Indian Institute of Technology, Bombay (2012-2014)","Bachelor of Technology (B.Tech.), Computer Science and Engineering from SGGSIE&T, nanded (2008-2012)","High School from R.L.T. College of Science, akola (2006-2008)",,,,Vinayak Rao,,,,,,,,,,,,,,,,,5a/9aa/497@linkedin,211483699@linkedin,108268461008607103428@google,100000822268488@facebook,#4979aa5a@linkedin,,,,,https://www.linkedin.com/in/pavan-tohare-4979aa5a,http://www.facebook.com/people/_/100000822268488,https://plus.google.com/108268461008607103428/about,http://www.facebook.com/pavan.tohare,,,,,,,,,,,,1832242813,
Amod Pune,,,,,http://graph.facebook.com/1160285121/picture?type=large,,,,,,amod.lovelekar,,,,,+91 77091 62651,+91 98273 99282,+91 97131 58680,,,,,,,,male,en_US,,India,,,,,,,,,,,,,,,,,,,,,,,,,,,,,,,,,,,,,,,,,,,,,,,,,,,1160285121@facebook,,,,,,,,,http://facebook.com/people/_/1160285121,http://www.facebook.com/amod.lovelekar,,,,,,,,,,,,,,1832239179,
Ujjwal Verma,ujjwal.blackfire.verma@gmail.com,,,,http://graph.facebook.com/1026721351/picture?type=large,http://lh4.googleusercontent.com/-Q4zS0GOgeac/AAAAAAAAAAI/AAAAAAAAAEI/VSBAXLyHX8c/photo.jpg,https://img.fullcontact.com/static/5d3e0e5472b4bc3fb7a6b3bc5eece9f3_cb3e54f77e400e50433cabc9aa6278d9c61b1389b6db962b3502dd9532e3b1b0,,,,saintz.blackfire,SaiNTz_blackF,,,,,,,,,,,,,,male,en_US,,India,,,,,,,,,,,,,,,,,,,,,,,,,,,,,,,,,,Shahbaz Alam,,,,,,,,,,,,,,,,,294608387@twitter,109370050314762339460@google,1026721351@facebook,,,,,,,http://facebook.com/people/_/1026721351,https://plus.google.com/109370050314762339460/about,http://klout.com/SaiNTz_blackF,https://twitter.com/saintz_blackf,http://www.facebook.com/SaiNTz.blackFIRE,,,,,,,,,,,1832233807,
Himanshu Wadhwa,himanshu.w46@gmail.com,,,,http://graph.facebook.com/1838246965/picture?type=large,,,,,,himanshu.w46,,,,,+91 98990 37107,,,,,,,,,,male,en_US,,India,,,,,,,,,,,,,,,,,,,,,,,,,,,,,,,,,,,,,,,,,,,,,,,,,,,1838246965@facebook,108280551435644872231@google,,,,,,,,http://www.facebook.com/people/_/1838246965,https://plus.google.com/108280551435644872231/about,http://www.facebook.com/Himanshu.w46,,,,,,,,,,,,,1832239495,30 years old
Salauddin Shaikh,salauddin2912@hotmail.com,,,,https://img.fullcontact.com/static/3c7b4f90cb69d400ffcc73cca5a31b1a_4b5889021c6a51735c731d7fb56f1d08c24bddb60d0d3e1f6b9c3135733ecabb,http://0.gravatar.com/avatar/94c4df120a64292cbc618bb7c8b693a5?size=400&d=404,,,,,salauddin005,,,,,,,,,,,,,,,male,,,India,,,,,,,,,,,,,,,,,,,,,,,,,,,,,,,,,,,,,,,,,,,,,,,,,,,125926738@gravatar,,,,,,,,,http://en.gravatar.com/125926738,http://en.gravatar.com/94c4df120a64292cbc618bb7c8b693a5,,,,,,,,,,,,,,1832235229,
Sonal Bhave,bhave99@gmail.com,,,,http://lh4.googleusercontent.com/-RZ3C3HJ9ySk/AAAAAAAAAAI/AAAAAAAAAEY/lxJP9SznKrs/photo.jpg,,,,,,,,,,,,,,,,,,,,,male,,,India,,,,,,,,,,,,,,,,,,,,,,,,,,,,,,,,,,Govind Rajan,,,,,,,,,,,,,,,,,104163846516266416196@google,,,,,,,,,https://plus.google.com/104163846516266416196/about,,,,,,,,,,,,,,,1832237599,
Mohit Trivedi,,,,,http://graph.facebook.com/100000432663474/picture?type=large,,,,,,,,,,,+91 98338 52981,,,,,,,,,,male,en_US,,India,,,,,,,,,,,,,,,,,,,,,,,,,,,,,,,,,,Nisha D Silva,Nisha D'silva,Sohham Sikhwal,Namrata Nain,,,,,,,,,,,,,,100000432663474@facebook,,,,,,,,,http://www.facebook.com/people/_/100000432663474,,,,,,,,,,,,,,,1832241075,
Dinesh Dhande,,,,,http://graph.facebook.com/100005787825692/picture?type=large,,,,,,,,,,,+91 86240 46253,,,,,,,,,,male,,,India,,,,,,,,,,,,,,,,,,,,,,,,,,,,,,,,,,,,,,,,,,,,,,,,,,,100005787825692@facebook,,,,,,,,,http://www.facebook.com/people/_/100005787825692,,,,,,,,,,,,,,,1832233649,
Pulkit Monga,pulkitkool19@gmail.com,pulkitmonga@hotmail.com,pulkit.monga12@bimtech.ac.in,,http://graph.facebook.com/1012468710/picture?type=large,https://img.fullcontact.com/static/fb0253e21160a997e5d78493a9061e37_90e533996aa5dd93e886fcc77db7a252ddb5c51e11d9a2280dd1491932452216,,,,,pulkit.monga,pulkitkool19,pulkit27,,,+91 99906 35312,+91 99301 40353,,,,,,,,,male,en_GB,,"Delhi, India","Mumbai, India",,,,,,,Student at Delhi University,birla institute of management technology,,,,,,,,,,,,,,,,,,Delhi University (2007-2010),,,,,,,Manan Sachdeva,Janet Ong,Ankit Oberoi,,,,,,,,,,,,,,,80892158@linkedin,23/110/712@linkedin,115757434377990298333@google,1012468710@facebook,#71211023@linkedin,,,,,https://www.linkedin.com/in/pulkit-monga-71211023,http://www.facebook.com/people/_/1012468710,https://plus.google.com/115757434377990298333/about,http://pinterest.com/pulkit27/,http://www.facebook.com/pulkit.monga,http://picasaweb.google.com/pulkitkool19,,,,,,,,,,1832079283,28 years old
Sachin Yadav,natacoachingfaridabad@gmail.com,,,,http://graph.facebook.com/100000093376857/picture?type=large,,,,,,sachin.yadav.10888,,,,,+91 99997 67808,+91 96364 98988,+91 77470 00069,+91 93129 03938,,,,,,,male,en_US,,"B-7 Canal Colony Sector 16, Faridabad, India",,,,,,,,,,,,,,,,,,,,,,,,,,,"Bachelor of Architecture (B.Arch.), architecture, 1st grade from aayojan school of architecture (2009-2014)",,,,,,,,,,,,,,,,,,,,,,,,7a/113/a96@linkedin,280958802@linkedin,100000093376857@facebook,#a961137a@linkedin,,,,,,https://www.linkedin.com/in/sachin-yadav-a961137a,http://www.facebook.com/people/_/100000093376857,http://en.gravatar.com/973610dc138a3dda842cd6d6b0968615,http://www.facebook.com/sachin.yadav.10888,,,,,,,,,,,,1832226065,
Harshit Db,harshit.db@gmail.com,harshit_desire@yahoo.co.in,,,http://graph.facebook.com/584025797/picture?type=large,http://2.gravatar.com/avatar/de336fde52f276b9094c054a3f51ccb1?size=400&d=404,,,,,h.saaransh,unveilfinance,,,,+91 98081 69658,+91 97181 50500,+91 79066 17221,+91 99164 75644,+64 22 198 6996,+91 99113 72176,+91 84180 01549,,,,male,en_US,,"Chennai, India","Delhi, India","Mumbai, India","New Delhi, India","4/20 Reid Road New Lynn, Auckland, New Zealand",,,,Financial Analyst at Unified Credit Solutions Pvt Ltd (2016-2017),Certified Financial Planner at Independent Financial Adviser (2014-2015),Assistant Financial Planner at Bajaj Capital Ltd (2013-2014),Senior Financial Planning Executive at Bajaj Capital Ltd (2012-2013),Manager sales development at Deutsche Asset Management (2011-2012),Management Trainee at Shriram Transport Finance Co. Ltd. (2008-2009),,,,,,,,,,,,,,"Post Graduate Diploma in Business Administration, Finance and Financial Management Services from Auckland Institute of Studies (2014-2015)","POST GRADUATE DIPLOMA IN ADVANCED FINANCIAL PLANNING AND WEALTH MANAGEMENT, Financial Planning, Retirement Planning, Investment Planning, Mutual fund, Derivatives, commodities. from The Indian Institute of Financial lanning (2010-2011)","Certified Financial Planner, Financial Planning and Services from Financial Planning Standard Board, India (2010-2011)","Engineer’s Degree, Industrial Biotechnology from Bharath University (2004-2008)",IIFP,,,,,,,,,,,,,,,,,,,,72760210@linkedin,584025797@facebook,20/44a/72a@linkedin,110439281716618824559@google,105309833@gravatar,#72a44a20@linkedin,,,,https://www.linkedin.com/in/harshit-pandey-72a44a20,http://facebook.com/people/_/584025797,http://en.gravatar.com/de336fde52f276b9094c054a3f51ccb1,https://plus.google.com/110439281716618824559/about,http://en.gravatar.com/105309833,http://www.facebook.com/h.saaransh,,,,,,,,,,1657448677,
Adil Khan,adilhusainkhan@gmail.com,,,,http://graph.facebook.com/743219920/picture?type=large,,,,,,adilhusainkhan,,,,,+91 78003 33130,,,,,,,,,,male,en_US,,India,,,,,,,,,,,,,,,,,,,,,,,,,,,,,,,,,,,,,,,,,,,,,,,,,,,743219920@facebook,110463399555942594227@google,,,,,,,,http://www.facebook.com/people/_/743219920,https://plus.google.com/110463399555942594227/about,http://www.facebook.com/adilhusainkhan,,,,,,,,,,,,,1832218797,
Karan Shaw,shawkaran64@gmail.com,,,,http://graph.facebook.com/100003881379567/picture?type=large,,,,,,karan.shaw.169,,,,,+91 97488 76795,+91 90889 74873,+91 90386 96459,,,,,,,,male,en_GB,,India,,,,,,,,,,,,,,,,,,,,,,,,,,,,,,,,,,,,,,,,,,,,,,,,,,,100003881379567@facebook,,,,,,,,,http://www.facebook.com/people/_/100003881379567,http://www.facebook.com/karan.shaw.169,,,,,,,,,,,,,,1832121153,
Ritesh Pandey,ritesh.pandey94@gmail.com,,,,http://graph.facebook.com/100001623391279/picture?type=large,http://lh4.googleusercontent.com/-1gkvgfHPluU/AAAAAAAAAAI/AAAAAAAAADA/CaWWYOD6xWk/photo.jpg,,,,,ritesh.pandey.965,,,,,,,,,,,,,,,male,en_US,,India,,,,,,,,,,,,,,,,,,,,,,,,,,,,,,,,,,,,,,,,,,,,,,,,,,,106215425565274059696@google,100001623391279@facebook,,,,,,,,http://www.facebook.com/people/_/100001623391279,https://plus.google.com/106215425565274059696/about,http://www.facebook.com/ritesh.pandey.965,,,,,,,,,,,,,1832219903,
Chetan Aher,,,,,http://graph.facebook.com/100001735187584/picture?type=large,,,,,,chetan.aher,,,,,+91 99608 89929,,,,,,,,,,male,en_US,,India,,,,,,,,,,,,,,,,,,,,,,,,,,,,,,,,,,,,,,,,,,,,,,,,,,,100001735187584@facebook,,,,,,,,,http://facebook.com/people/_/100001735187584,http://www.facebook.com/chetan.aher,,,,,,,,,,,,,,1832182457,
,sanjeevgosavi@yahoo.com,sanjeevgosavi@hotmail.com,sanjeev.gosavi@accenture.com,,,,,,,,,,,,,+91 98217 53775,+91 22 2580 3301,,,,,,,,,male,,,India,,,,,,,,accenture,,,,,,,,,,,,,,,,,,,,,,,,,,,,,,,,,,,,,,,,,,,,,,,,,,,,,,,,,,,,,,,,,,,1832215321,
Drawin Kumar,cooldrawin@gmail.com,cooldrawin@hotmail.com,,,http://lh4.googleusercontent.com/-XtY205hFSJs/AAAAAAAAAAI/AAAAAAAAAAA/ZYOy7oM8REI/photo.jpg,http://2.gravatar.com/avatar/cad8549b240a6cd4e9bfe7fbf1404548?size=400&d=404,https://img.fullcontact.com/static/cca1d66af66321c2f099c95a8e5a2686_1f2253f410b105d5781f1ff31aa76a355e19e96e902b60fedf6c34dbc058406c,,,,cooldrawin,drawin,,,,+91 89045 59529,+91 70704 49811,,,,,,,,,male,,,"Flat No 202, Sai Milana Immadihalli Main Road, Whitefield, Bangalore, India","Jamshedpur, Jamshedpur, India",,,,,,,Student at KIIT University,Ita Patthar Pvt Ltd,Student is stuck,,,,,,,,,,,,,,,,,,,,,,,,Apurwa Raj,,,,,,,,,,,,,,,,,52751615@linkedin,32886048@twitter,28612348@gravatar,18640359@gravatar,15/7bb/67b@linkedin,10661295480@bebo,101963847050702961371@google,#67b7bb15@linkedin,,http://www.twitter.com/cooldrawin,https://plus.google.com/101963847050702961371/about,http://en.gravatar.com/28612348,https://www.linkedin.com/in/drawin-kumar-67b7bb15,http://klout.com/cooldrawin,http://www.facebook.com/cooldrawin,http://en.gravatar.com/18640359,https://www.linkedin.com/in/drawin,http://en.gravatar.com/826fc1e51aaa0cd989622eaab7e48137,http://drawin.tk/,http://gravatar.com/cooldrawin,,,,,1832215163,
Sahil Pahuja,,,,,,,,,,,isahilpahuja,,,,,+91 95553 55999,+91 89712 69732,,,,,,,,,male,en_US,,India,,,,,,,,,,,,,,,,,,,,,,,,,,,,,,,,,,,,,,,,,,,,,,,,,,,100001231787927@facebook,,,,,,,,,http://www.facebook.com/people/_/100001231787927,http://www.facebook.com/isahilpahuja,,,,,,,,,,,,,,1832205367,
Harsh Joshi,harsh.joshi@gmail.com,harsh.joshi@tcs.com,,,,,,,,,,,,,,,,,,,,,,,,male,,,"Calgary, Alberta",India,,,,,,,TCS at TCS,,,,,,,,,,,,,,,,,,,,,,,,,,,,,,,,,,,,,,,,,,,519884732@facebook,37814993@linkedin,31174828@hi5,10/7b7/815@linkedin,#8157b710@linkedin,,,,,http://www.hi5.com/friend/p31174828--profile--html,http://www.linkedin.com/in/harsh-joshi-8157b710,http://www.facebook.com/people/_/519884732,,,,,,,,,,,,,1832211529,33 years old
Kalu Ram,roshniint@gmail.com,,,,http://graph.facebook.com/100008694372388/picture?type=large,,,,,,,,,,,+91 99256 27484,+91 98251 48333,+91 97858 17170,+91 92614 22254,+91 98251 46996,+91 261 300 3034,,,,,,,,India,,,,,,,,,,,,,,,,,,,,,,,,,,,,,,,,,,,,,,,,,,,,,,,,,,,100008694372388@facebook,,,,,,,,,http://www.facebook.com/people/_/100008694372388,,,,,,,,,,,,,,,1832212003,36 years old
Bhuvnesh Sharma,bhuvneshsharma823@gmail.com,,,,https://img.fullcontact.com/static/2bb2e5c1002afa694c9b9036a42701cf_4820ff08141b3c02c8bca2d426823d1cef235b1d86ba4ae90fcada1bfc772f9e,,,,,,bhuvnesh96802,,,,,,,,,,,,,,,male,,,India,,,,,,,,,,,,,,,,,,,,,,,,,,,,,,,,,,,,,,,,,,,,,,,,,,,1961048816@twitter,,,,,,,,,http://klout.com/bhuvnesh96802,https://twitter.com/bhuvnesh96802,,,,,,,,,,,,,,1832060481,
Vishal Jakkali,vishaljakkali@gmail.com,jakkalivishal@gmail.com,,,http://graph.facebook.com/1169241126/picture?type=large,,,,,,vishal.jakkali,,,,,+91 99862 88321,+91 91641 88321,,,,,,,,,male,en_US,,India,,,,,,,,,,,,,,,,,,,,,,,,,,,,,,,,,,Bharat Puranik,,,,,,,,,,,,,,,,,1384875764@instagram,1169241126@facebook,,,,,,,,http://www.facebook.com/people/_/1169241126,https://www.instagram.com/vishaljakkali,http://www.facebook.com/vishal.jakkali,,,,,,,,,,,,,1832208527,
Siddhant Nikalje,,,,,,,,,,,,,,,,+91 98705 82733,,,,,,,,,,male,,,"Thane, India",,,,,,,,,,,,,,,,,,,,,,,,,,,zee instituteof creative arts (2012-2016),,,,,,,,,,,,,,,,,,,,,,,,455205105@linkedin,108/544/a69@linkedin,#a69544108@linkedin,,,,,,,https://www.linkedin.com/in/siddhant-nikalje-a69544108,,,,,,,,,,,,,,,1830992085,
Jitesh Lassi,jiteshlasi0@gmail.com,,,,http://graph.facebook.com/100001231779534/picture?type=large,,,,,,jitesh.lassi,,,,,+91 95793 19219,+91 73856 65654,,,,,,,,,male,en_US,,"Nashik, India","Pune, India",,,,,,,Project Officer at Amdocs (since 2016),Business Associate at Tech Mahindra (2014-2016),Management Intern at Bosch (2013-2013),Student at University of Pune,,,,,,,,,,,,,,,,"MMS, Operations Management and Supervision from VESIMSR (2012-2014)","Bachelor of Engineering (B.E.), Electronics and Telecommunication from University of Pune (2008-2012)","Bachelor's degree, Electrical, Electronics and Communications Engineering from MET'S IOE,Nashik (2008-2012)","SSC, Maths from St.Philomena's (1996-2006)",,,,,,,,,,,,,,,,,,,,,47/400/124@linkedin,165224620@linkedin,100001231779534@facebook,#12440047@linkedin,,,,,,https://www.linkedin.com/in/jitesh-lassi-12440047,http://www.facebook.com/people/_/100001231779534,http://www.facebook.com/jitesh.lassi,,,,,,,,,,,,,1832206315,
Tanzeem Sayyed,sayyedtanzeem@gmail.com,,,,https://lh3.googleusercontent.com/-ZC_yhnJmOlQ/AAAAAAAAAAI/AAAAAAAAAZg/MF7c97_B0Bg/s100/photo.jpg?sz=1440,,,,,,tanzeem.sayyed.5,,,,,+91 89831 15787,+91 75587 01899,,,,,,,,,male,en_US,,"Pune, India",,,,,,,,Software Engineer at Capgemini India Pvt Ltd (since 2015),Data Operator at HOV AR Management Service PVT.LTD (2008-2009),,,,,,,,,,,,,,,,,,"Master of Computer Applications (MCA), Information Technology from University of Pune (2012-2015)","Master of Computer Applications (M.C.A.), Information Technology, persuing from University of Pune (2011-2015)","Bachelor of computer application, commerce from University of Pune (2009-2012)","10th, subjects from moledina high school (1996-2008)",,,,Narayan Thirupat,,,,,,,,,,,,,,,,,46/805/a72@linkedin,163243958@linkedin,105468203999067261819@google,100001904708477@facebook,#a7280546@linkedin,,,,,https://www.linkedin.com/in/tanzeem-sayyed-a7280546,http://facebook.com/people/_/100001904708477,https://plus.google.com/105468203999067261819/about,https://www.facebook.com/tanzeem.sayyed.5,,,,,,,,,,,,1831863613,
Hossain Mokhtar,hossainmokhtar1979@hotmail.com,,,,,,,,,,,,,,,+91 70285 55000,,,,,,,,,,,,,India,,,,,,,,,,,,,,,,,,,,,,,,,,,,,,,,,,,,,,,,,,,,,,,,,,,441581654@linkedin,103/a74/b32@linkedin,#b32a74103@linkedin,,,,,,,https://www.linkedin.com/in/hossain-mokhtar-b32a74103,,,,,,,,,,,,,,,1832199047,
,santoshki1312@gmail.com,,,,http://0.gravatar.com/avatar/8c20bf67a41514252d533d5a5e68060a?size=400&d=404,,,,,,,,,,,,,,,,,,,,,,,,India,,,,,,,,,,,,,,,,,,,,,,,,,,,,,,,,,,,,,,,,,,,,,,,,,,,,,,,,,,,,http://en.gravatar.com/8c20bf67a41514252d533d5a5e68060a,,,,,,,,,,,,,,,1832196993,
Ankur Khurana,ankur4823@gmail.com,ankur4823@rediffmail.com,,,http://graph.facebook.com/643829809/picture?type=large,https://lh6.googleusercontent.com/-zKfcuDnhvYE/AAAAAAAAAAI/AAAAAAAAAQQ/I7yosIVexmA/s100/photo.jpg?sz=720,,,,,indianparantha,ankur4823,,,,+91 99630 07630,+91 98840 35254,+91 98888 11261,,,,,,,,male,en_US,,"Chennai, India","Jalandhar, India","Mumbai, India",,,,,,SAP FICO Consultant at Tata Consultancy Services (since 2015),SAP FICO Consultant at TVS Infotech (2013-2015),SAP Trainee at Reliance Global Services Pvt Ltd (2012-2012),Asisstant Manager- Branch Banking at HDFC Bank (2011-2012),Investment Advisor : Client Relationship Management at Angel Broking (2009-2011),,,,,,,,,,,,,,,"Master of Business Administration (MBA), Finance and Marketing from LOVELY PROFESSIONAL UNIVERSITY (2007-2009)","Master of Business Administration (M.B.A.), Finance and Marketing from LOVELY PROFESSIONAL UNIVERSITY (2007-2009)","Bachelor of Commerce (B.Com.), Professional from D.A.V College, Jalandhar (2004-2007)",,,,,,,,,,,,,,,,,,,,,,643829809@facebook,53070097@gravatar,47/996/647@linkedin,166666519@linkedin,141516028@twitter,100485859277634640634@google,#64799647@linkedin,,,https://www.linkedin.com/in/ankur-khurana-64799647,http://www.facebook.com/people/_/643829809,http://en.gravatar.com/8cd0743b1f59e1a049f4275ff26a4148,https://plus.google.com/100485859277634640634/about,http://klout.com/indianparantha,https://twitter.com/indianparantha,http://en.gravatar.com/53070097,,,,,,,,,1832026195,33 years old
'Niyam Turakhia,niyamturakhia@gmail.com,turakhiadiamonds@gmail.com,,,http://graph.facebook.com/528135006/picture?type=large,,,,,,niyamturakhia,,,,,+91 98194 48090,+91 86920 83939,+91 98339 30187,+91 98334 50006,+91 98212 33887,+91 22 2627 7668,+91 22 2627 7667,+91 22 2414 5300,+91 22 3392 7668,+91 22 3392 7667,male,en_GB,,India,,,,,,,,,,,,,,,,,,,,,,,,,,,,,,,,,,Ashish Pai,Rhean Miranda,Russell Pacheco,,,,,,,,,,,,,,,528135006@facebook,104068434574536367210@google,,,,,,,,http://www.facebook.com/people/_/528135006,https://plus.google.com/104068434574536367210/about,http://www.facebook.com/niyamturakhia,,,,,,,,,,,,,1832194781,
Numan Attari,,,,,http://graph.facebook.com/100001937398065/picture?type=large,,,,,,numan9576,aatifhusain2011,,,,+91 95763 35552,+91 97081 22568,,,,,,,,,male,en_US,,India,,,,,,,,,,,,,,,,,,,,,,,,,,,,,,,,,,,,,,,,,,,,,,,,,,,100001937398065@facebook,,,,,,,,,http://www.facebook.com/people/_/100001937398065,http://www.facebook.com/numan9576,http://www.facebook.com/aatifhusain2011,,,,,,,,,,,,,1832194465,
Ashwin Palankar,,,,,http://graph.facebook.com/100004077289722/picture?type=large,,,,,,,,,,,+91 95942 86208,,,,,,,,,,male,,,India,,,,,,,,,,,,,,,,,,,,,,,,,,,,,,,,,,,,,,,,,,,,,,,,,,,100004077289722@facebook,,,,,,,,,http://www.facebook.com/people/_/100004077289722,,,,,,,,,,,,,,,1832193991,
Sagar Roy,,,,,http://graph.facebook.com/100000793794533/picture?type=large,,,,,,bansi.tiwari,,,,,+91 90526 00576,+91 97011 36327,,,,,,,,,male,en_US,,India,,,,,,,,,,,,,,,,,,,,,,,,,,,,,,,,,,,,,,,,,,,,,,,,,,,100000793794533@facebook,,,,,,,,,http://facebook.com/people/_/100000793794533,http://www.facebook.com/bansi.tiwari,,,,,,,,,,,,,,1832189093,
,singhania.ashish5902@gmail.com,,,,,,,,,,singhaniaashish5902,,,,,,,,,,,,,,,male,,,India,,,,,,,,,,,,,,,,,,,,,,,,,,,,,,,,,,,,,,,,,,,,,,,,,,,92898741@gravatar,,,,,,,,,http://en.gravatar.com/95a6a0cf62bb0a306fbf5baf1bf7e51f,http://en.gravatar.com/92898741,,,,,,,,,,,,,,1832182299,
Gaurav Chauhan,,,,,,,,,,,gaurav11lpu,,,,,+91 98723 22599,,,,,,,,,,male,en_US,,India,,,,,,,,,,,,,,,,,,,,,,,,,,,,,,,,,,,,,,,,,,,,,,,,,,,100002384779534@facebook,,,,,,,,,http://www.facebook.com/people/_/100002384779534,http://pinterest.com/gaurav11lpu/,http://www.facebook.com/gaurav11lpu,,,,,,,,,,,,,1832190041,
Paresh,paresh.shettigar@gmail.com,,,,,,,,,,pareshshettigar,,,,,,,,,,,,,,,male,,,India,,,,,,,,,,,,,,,,,,,,,,,,,,,,,,,,,,,,,,,,,,,,,,,,,,,420847538@twitter,,,,,,,,,http://www.twitter.com/PareshShettigar,,,,,,,,,,,,,,,1832187671,
Vinod Kumar,vinodkumarv26@gmail.com,,,,https://img.fullcontact.com/static/03d2052559c57bd992f5fbfb602de6c5_50abfc2cc985a672bdc70c500b5a132ac0f7e7b4b52e511f86b1616a297252cc,,,,,,vinodkumar_v26,,,,,,,,,,,,,,,male,,,"Pune, India",,,,,,,,,,,,,,,,,,,,,,,,,,,,,,,,,,,,,,,,,,,,,,,,,,,461040754@twitter,108556934205497420045@google,,,,,,,,https://plus.google.com/108556934205497420045/about,http://klout.com/vinodkumar_v26,https://twitter.com/vinodkumar_v26,,,,,,,,,,,,,1832183089,
Saurin Thakore,saurin.thakore@gmail.com,,,,,,,,,,saurin.thakore,,,,,+91 98791 13288,+91 97122 55255,,,,,,,,,male,en_US,,"Ahmedabad, India",,,,,,,,AGM at L & T modular fabrication facilities,Sr. Manager IT at Pipvav Shipyard Limited,,,,,,,,,,,,,,,,,,,,,,,,,,,,,,,,,,,,,,,,,,43414259@linkedin,12/657/bab@linkedin,117715215807090995251@google,100000179130376@facebook,#bab65712@linkedin,,,,,https://www.linkedin.com/in/saurin-thakore-bab65712,http://www.facebook.com/people/_/100000179130376,https://plus.google.com/117715215807090995251/about,http://www.facebook.com/saurin.thakore,,,,,,,,,,,,1832174083,
Rajat Arora,,,,,,,,,,,rajat.arora.545849,,,,,+91 99280 02538,+91 91675 65264,+91 96105 65639,+91 90116 43217,,,,,,,male,en_US,,India,,,,,,,,,,,,,,,,,,,,,,,,,,,,,,,,,,,,,,,,,,,,,,,,,,,100001273959252@facebook,,,,,,,,,http://www.facebook.com/people/_/100001273959252,http://www.facebook.com/rajat.arora.545849,,,,,,,,,,,,,,1832172503,29 years old
Deependra Kumar,kdeependra23@gmail.com,k.deependra@ymail.com,,,http://graph.facebook.com/100001016265515/picture?type=large,https://img.fullcontact.com/static/05ad0c764b4edd212efea9608bb8a75f_564bea955459bc1d92fc80e8237c0194e9b651e7838859483b5644eb73e27ca4,https://img.fullcontact.com/static/9b78e9e162b441b129d90575c4495860_76220788977ef79da7b7e5123ae85568605c2f091c23d68eebe6ffdcbfc5a755,,,,deependrak1,,,,,+91 94566 25439,+91 80099 02220,,,,,,,,,male,en_US,,"Delhi, India","Noida, India",,,,,,,Senior Analyst at HCL Comnet Limited (since 2011),ANALSYT at HCL Comnet Limited (since 2011),,,,,,,,,,,,,,,,,,"PGDBA (MBA),, Operations Management from Symbiosis Pune (2013-2015)","btech, computer science from Uttar Pradesh Technical University (2007-2011)",,,,,,,,,,,,,,,,,,,,,,,98150554@linkedin,28/a54/10a@linkedin,108247380459458729006@google,100001016265515@facebook,#10aa5428@linkedin,,,,,https://www.linkedin.com/in/deependra-kumar-10aa5428,http://www.facebook.com/people/_/100001016265515,https://plus.google.com/108247380459458729006/about,http://www.facebook.com/deependrak1,,,,,,,,,,,,1832179613,
Polishetty Karthik,karthik_poly@yahoo.com,,,,http://graph.facebook.com/100003624452415/picture?type=large,http://pbs.twimg.com/profile_images/2073978396/431001_111406158990199_100003624452415_58092_960338654_n.jpg,,,,,karthik.polishetty,karthik1187,,,,+91 70220 23801,+91 98908 54072,,,,,,,,,male,en_US,,"Bangalore, India","Bengaluru, India","Hyderabad, India","Mumbai, India",,,,,On site Google at Accenture in India,Senior Manager Paid Media at iProspect Communicate 2,QA at Accenture in India (since 2016),Senior Manager at iProspect Comms (2016-2016),Manager Paid Media at iProspect Communicate 2 (2012-2016),Senior Search Associate at iProspect Communicate 2 (since 2012),Technical Associate at Webmark Technologies (2010-2012),,,,,,,,,,,,,Avanthi Deegre College from Pragathi High School (2002-2003),,,,,,,,,,,,,,,,,,,,,,,,63/436/879@linkedin,283636123@twitter,225017949@linkedin,100003624452415@facebook,#87943663@linkedin,,,,,https://www.linkedin.com/in/polishetty-karthik-87943663,http://facebook.com/people/_/100003624452415,http://klout.com/karthik1187,https://twitter.com/karthik1187,http://www.facebook.com/karthik.polishetty,,,,,,,,,,,1832182141,
Ashish Dayal,dayalashish@gmail.com,,,,http://graph.facebook.com/100000717098239/picture?type=large,,,,,,ashishdayal1,,,,,+91 96571 89192,,,,,,,,,,male,en_US,,"Pune, India","Houston, Texas",,,,,,,Sr. Technical Professional - Software Development at Halliburton (since 2012),Technical Professional - Software Development at Halliburton (2009-2012),Senior Software Engineer at Patni Computer Systems (2008-2010),Software Engineer at Patni Computer Systems (2006-2008),,,,,,,,,,,,,,,,chambers memorial english school,"Bachelor of Technology, Computer Science & Engineering from Uttar Pradesh Technical University (2001-2005)",,,,,,Arvind Singh,,,,,,,,,,,,,,,,,52936738@linkedin,15/88a/82a@linkedin,109484601649212093425@google,100000717098239@facebook,#82a88a15@linkedin,,,,,http://www.linkedin.com/in/ashishdayal1,https://plus.google.com/109484601649212093425/about,http://www.facebook.com/people/_/100000717098239,https://www.linkedin.com/in/ashishdayal1,,,,,,,,,,,,1831611129,
Rohit Kumar,rohitiitkgp96@gmail.com,,,,https://img.fullcontact.com/static/5bc9c1647650dad990940c38e11ced7f_614ac79ae13789acc6c31b0d038d83df0f872915f8f3e5578be47917e9c97d3b,http://0.gravatar.com/avatar/f887f69424a335f870b74b20c1be0d20?size=400&d=404,,,,,techierohit,,,,,,,,,,,,,,,male,,,India,,,,,,,,,,,,,,,,,,,,,,,,,,,,,,,,,,,,,,,,,,,,,,,,,,,102964732@gravatar,,,,,,,,,http://en.gravatar.com/102964732,http://en.gravatar.com/f887f69424a335f870b74b20c1be0d20,http://techierohit.wordpress.com,,,,,,,,,,,,,1832172819,
Madhav Garg,,,,,http://graph.facebook.com/100002081551462/picture?type=large,,,,,,madhav.garg.969,,,,,+91 88378 35125,+91 98141 02205,+91 70095 74315,+91 96976 46171,+91 172 465 5241,,,,,,male,en_US,,India,,,,,,,,,,,,,,,,,,,,,,,,,,,,,,,,,,,,,,,,,,,,,,,,,,,100002081551462@facebook,,,,,,,,,http://www.facebook.com/people/_/100002081551462,http://www.facebook.com/madhav.garg.969,,,,,,,,,,,,,,1832166025,
Sinchan Roy,sinchanroy4890@gmail.com,,,,https://img.fullcontact.com/static/9265331d9b8b43eed7f9f1e7927fa3c4_6143511a88ca73f11f1211acfeb661a0b577a81016cd60642dcd3e55ea66ac56,https://img.fullcontact.com/static/674e0ab1048ae45c34d5b248e864f9c1_d9a4f661a3df30f80a025cfb5dcda2e53013d6b6f8cc1cba6348601a5e27a984,http://1.gravatar.com/avatar/05cc161c6e471b98ccc4c5d3e5996380?size=400&d=404,,,,sinchanroy4890,sinchanroy12,sinchan.roy.54,,,,,,,,,,,,,male,,,"Bangalore, India","Bengaluru, India","Hyderabad, India",,,,,,BigData Engineer at MapR Data Technologies (since 2018),Technical Analyst at Oracle India Pvt Ltd (2015-2018),Unix / Linux System Administrator at Cognizant Technology Solutions (2013-2015),,,,,,,,,,,,,,,,,"Bachelor of Technology (BTech), Computer Engineering from Ghanashyam Hemlata Institute of Technology and Management (2008-2012)","AISSCE, English, Physics, Chemistry, Maths, C++, Web Technologies from TATA DAV Public School, Ghatotand (2006-2008)","AISSE from TATA DAV Public School, Ghatotand (2004-2006)",,,,,,,,,,,,,,,,,,,,,,76/467/27b@linkedin,269870783@linkedin,1927764542@twitter,108781001@gravatar,#27b46776@linkedin,,,,,https://www.linkedin.com/in/sinchan-roy-27b46776,http://en.gravatar.com/108781001,http://klout.com/sinchanroy12,http://www.facebook.com/sinchan.roy.54,https://twitter.com/sinchanroy12,http://en.gravatar.com/05cc161c6e471b98ccc4c5d3e5996380,http://blogger.com/profile/13443750738377986929,,,,,,,,,1832168237,
Yuvraj Lugare,,,,,,,,,,,,,,,,+91 77759 27799,,,,,,,,,,male,,,"Kolhapur, India",,,,,,,,,,,,,,,,,,,,,,,,,,,Dy.patil (2011-2014),,,,,,,,,,,,,,,,,,,,,,,,a8/813/a17@linkedin,384223987@linkedin,#a17813a8@linkedin,,,,,,,https://www.linkedin.com/in/yuvraj-lugare-a17813a8,,,,,,,,,,,,,,,1831389139,
Manpreet Singh,,,,,http://graph.facebook.com/100003685073240/picture?type=large,,,,,,,,,,,+91 99109 77663,,,,,,,,,,male,en_US,,India,,,,,,,,,,,,,,,,,,,,,,,,,,,,,,,,,,,,,,,,,,,,,,,,,,,100003685073240@facebook,,,,,,,,,http://facebook.com/people/_/100003685073240,,,,,,,,,,,,,,,1832166341,
Sudhanshu Narkhede,sudhanshu.narkhede@gmail.com,ssnarkhede7@gmail.com,,,http://graph.facebook.com/100000522151952/picture?type=large,,,,,,sudhanshu.narkhede,sudhanshu-narkhede,,,,+91 72190 22255,+91 77449 58825,+91 97663 54040,+91 96768 99447,,,,,,,male,en_US,,"Kuppam, India","Nagpur, India",,,,,,,Process Control Engineer at Sapa (2014-2015),GET at Sapa Profiler AB (2013-2013),GET at Sapa Profiles India,,,,,,,,,,,,,,,,,"Master's degree, Metallurgical Engineering from Indian Institute of Technology, Bombay (2015-2017)",UCSD (2013-2015),"Bachelor's Degree, Metallurgical & Materials Engineering from VNIT (2009-2013)",,,,,,,,,,,,,,,,,,,,,,73/ba4/249@linkedin,262732377@linkedin,100939836643920495595@google,100000522151952@facebook,#249ba473@linkedin,,,,,https://www.linkedin.com/in/sudhanshu-narkhede-249ba473,http://www.facebook.com/people/_/100000522151952,https://plus.google.com/100939836643920495595/about,https://angel.co/sudhanshu-narkhede,http://www.facebook.com/sudhanshu.narkhede,,,,,,,,,,,1832160969,27 years old
Bharath Kumar,sbharath09@gmail.com,,,,http://graph.facebook.com/100000165605427/picture?type=large,,,,,,bharath.kumar.583234,sbharath09,,,,,,,,,,,,,,male,en_US,,"Vellore, India","Villupuram, India",,,,,,,Information Technology and Services,,,,,,,,,,,,,,,,,,,"B.Tech, I.T. from Anna University (2006-2010)",,,,,,,,,,,,,,,,,,,,,,,,846636439@twitter,59922664@linkedin,18/99/574@linkedin,100000165605427@facebook,#57409918@linkedin,,,,,http://www.linkedin.com/in/bharath-kumar-57409918,http://www.facebook.com/people/_/100000165605427,https://twitter.com/sbharath09,http://www.facebook.com/bharath.kumar.583234,,,,,,,,,,,,1832160495,
Jagannath Kar,jagannath07.kar@gmail.com,,,,http://graph.facebook.com/1530846209/picture?type=large,http://lh4.googleusercontent.com/-2SvIp4DpEhM/AAAAAAAAAAI/AAAAAAAAAAA/gtchSm3mIgY/photo.jpg,,,,,jagannath.p.kar,jitubapani,,,,,,,,,,,,,,male,en_US,,"Bangalore, India",,,,,,,,,,,,,,,,,,,,,,,,,,,,,,,,,,Sidhartha Sekhar Sahoo,,,,,,,,,,,,,,,,,200339654@twitter,1530846209@facebook,102008247795994113495@google,,,,,,,http://www.facebook.com/people/_/1530846209,http://www.twitter.com/Jitubapani,https://plus.google.com/102008247795994113495/about,http://www.facebook.com/jagannath.p.kar,,,,,,,,,,,,1832157493,
Divyang Anajwala,,,,,,,,,,,divyesh.anajwala,,,,,+91 89054 75660,,,,,,,,,,male,,,India,,,,,,,,,,,,,,,,,,,,,,,,,,,,,,,,,,,,,,,,,,,,,,,,,,,1812055173@instagram,,,,,,,,,https://www.instagram.com/divyesh.anajwala/,,,,,,,,,,,,,,,1832156861,
Jacob Soni,,,,,http://graph.facebook.com/100001839532381/picture?type=large,,,,,,sjlsoni,,,,,+91 98063 76366,+91 75870 59940,,,,,,,,,male,en_US,,India,,,,,,,,,,,,,,,,,,,,,,,,,,,,,,,,,,,,,,,,,,,,,,,,,,,100001839532381@facebook,,,,,,,,,http://www.facebook.com/people/_/100001839532381,http://www.facebook.com/sjlsoni,,,,,,,,,,,,,,1832157809,26 years old
Nitish Kumar,kumarnitish729@gmail.com,,,,http://graph.facebook.com/100001226076646/picture?type=large,http://lh4.googleusercontent.com/-RgVFPPVwa3s/AAAAAAAAAAI/AAAAAAAAACQ/V76gIXapIWo/photo.jpg,,,,,,,,,,+91 91165 50869,+1 985-265-5448,,,,,,,,,male,en_GB,,India,"Louisiana, United States",,,,,,,,,,,,,,,,,,,,,,,,,,,,,,,,,,,,,,,,,,,,,,,,,,49/605/9b3@linkedin,171704151@linkedin,107667077303502773854@google,100001226076646@facebook,#9b360549@linkedin,,,,,http://www.facebook.com/people/_/100001226076646,https://plus.google.com/107667077303502773854/about,http://www.linkedin.com/pub/49/605/9b3,https://whitepages.plus/n/Nitish_Kumar/_/e71dd1ffda6f3614eea36c682de62394,,,,,,,,,,,,1832148645,
Manoj Gutthe,,,,,,,,,,,,,,,,+91 99608 14022,,,,,,,,,,male,,,"Aurangabad, India","Pune, India",,,,,,,SENIOR SALES OFFICER at HDB Financial Services Ltd. (since 2017),sales associate at Home Credit Philippines,Senior Sales Associate at Home Credit India (2016-2017),Customer Sales Associate at Compass BPO Pvt Ltd ( Now Aditya Birla Minacs world Wide Ltd) (2012-2015),,,,,,,,,,,,,,,,"Master of Science (M.Sc.), Zoology/Animal Biology, APPEAR from Dr. Babasaheb Ambedkar Marathwada University, Aurangabad (2016-2017)","Bachelor of Science (B.Sc.), SCIENCE , A from S. B. E. S collage of science Aurangabad, maharashtra (2013-2015)",,,,,,,,,,,,,,,,,,,,,,,483865905@linkedin,116/66/ba9@linkedin,#ba9066116@linkedin,,,,,,,https://www.linkedin.com/in/manoj-gutthe-ba9066116,,,,,,,,,,,,,,,1832088763,
Mahesh Pawar,,,,,http://graph.facebook.com/1504003683/picture?type=large,,,,,,mahesh.pawar1,,,,,+91 89785 75640,+91 91773 81810,,,,,,,,,male,en_US,,India,,,,,,,,,,,,,,,,,,,,,,,,,,,,,,,,,,,,,,,,,,,,,,,,,,,1504003683@facebook,,,,,,,,,http://www.facebook.com/people/_/1504003683,http://www.facebook.com/mahesh.pawar1,,,,,,,,,,,,,,1832083075,
Rohit Wipro,rohitgulati8@gmail.com,rohit.gulati2@wipro.com,,,http://graph.facebook.com/100000434284746/picture?type=large,http://lh4.googleusercontent.com/-UYUZrekc8UY/AAAAAAAAAAI/AAAAAAAAAD0/miIVUkNE8gI/photo.jpg,,,,,rohit.gulati.1485,rohitgulati22,,,,+91 99012 22275,+91 91584 57071,+91 90361 29110,+91 20 6673 7448,,,,,,,male,en_US,,"Pune, India","Bangalore, India","London, England",,,,,,IT Analyst at Tata Consultancy Services (since 2014),Associate at Cognizant Technology Solutions (2013-2014),Project Engineer at Wipro Technologies (2010-2013),ETL TEST ENGINEER at Wipro Technologies (2010-2013),PROJETCT ENGINEER at Wipro Technologies,,,,,,,,,,,,,,,"Bachelor of Technology (B.Tech.), Electronics and communications from MDU,Rohtak (2006-2010)",,,,,,,Manish Kumar,,,,,,,,,,,,,,,,,35/59a/b04@linkedin,2223722881@twitter,123874996@linkedin,112348330514496503073@google,100000434284746@facebook,#b0459a35@linkedin,,,,https://www.linkedin.com/in/rohit-gulati-b0459a35,http://www.facebook.com/people/_/100000434284746,https://plus.google.com/112348330514496503073/about,https://twitter.com/rohitgulati22,http://www.facebook.com/rohit.gulati.1485,,,,,,,,,,,1832133161,
Harish Sanil,saneel4you@gmail.com,,,,,,,,,,,,,,,,,,,,,,,,,male,,,India,,,,,,,,,,,,,,,,,,,,,,,,,,,,,,,,,,,,,,,,,,,,,,,,,,,102405024731999643334@google,,,,,,,,,https://plus.google.com/102405024731999643334/about,,,,,,,,,,,,,,,1832135057,
Gobbur,rhgobbur@gmail.com,,,,,,,,,,rhgobbur,,,,,+91 94495 75922,,,,,,,,,,male,,,India,,,,,,,,,,,,,,,,,,,,,,,,,,,,,,,,,,,,,,,,,,,,,,,,,,,2239105836@twitter,,,,,,,,,http://klout.com/rhgobbur,https://twitter.com/rhgobbur,,,,,,,,,,,,,,1832135373,
,shaluraj71@gmail.com,,,,,,,,,,,,,,,,,,,,,,,,,,,,India,,,,,,,,,,,,,,,,,,,,,,,,,,,,,,,,,,,,,,,,,,,,,,,,,,,,,,,,,,,,http://en.gravatar.com/29c559ff7347adf06d9fcb7592013c5b,,,,,,,,,,,,,,,1832136479,
Sumit Kumar,sumitcallitsam@gmail.com,,,,http://pbs.twimg.com/profile_images/752140720991903746/3t8FpBZ2.jpg,,,,,,sumitlovingboy,,,,,,,,,,,,,,,male,en,,"Roorkee, India","Of, Turkey",,,,,,,,,,,,,,,,,,,,,,,,,,,,,,,,,,,,,,,,,,,,,,,,,,80084836@twitter,,,,,,,,,http://klout.com/sumitlovingboy,https://twitter.com/sumitlovingboy,,,,,,,,,,,,,,1832132529,
Satish Kumar,satishkumaar@gmail.com,,,,http://graph.facebook.com/1550027385/picture?type=large,,,,,,,,,,,,,,,,,,,,,male,en_US,,India,,,,,,,,,,,,,,,,,,,,,,,,,,,,,,,,,,Phani Baabu Ghati,,,,,,,,,,,,,,,,,1550027385@facebook,107154492001224859871@google,,,,,,,,https://plus.google.com/107154492001224859871/about,http://www.facebook.com/people/_/1550027385,,,,,,,,,,,,,,1832133477,
Moin Wholesale,moin44_44@yahoo.com,,,,,,,,,,44moin,,,,,+91 98416 15151,+91 97735 93210,,,,,,,,,,,,India,,,,,,,,,,,,,,,,,,,,,,,,,,,,,,,,,,,,,,,,,,,,,,,,,,,995519462@twitter,,,,,,,,,https://twitter.com/44moin,,,,,,,,,,,,,,,1832132371,
,ishfaqdass27@gmail.com,,,,,,,,,,,,,,,,,,,,,,,,,male,,,India,,,,,,,,,,,,,,,,,,,,,,,,,,,,,,,,,,,,,,,,,,,,,,,,,,,,,,,,,,,,http://en.gravatar.com/87ead9507d74df47435030c46f1566d3,,,,,,,,,,,,,,,1832131107,
Manju F,,,,,http://graph.facebook.com/100002436871620/picture?type=large,,,,,,naresh.naidu.921,,,,,+91 90609 99319,+91 99168 03727,,,,,,,,,male,en_US,,India,,,,,,,,,,,,,,,,,,,,,,,,,,,,,,,,,,,,,,,,,,,,,,,,,,,100002436871620@facebook,,,,,,,,,http://facebook.com/people/_/100002436871620,http://www.facebook.com/naresh.naidu.921,,,,,,,,,,,,,,1832128895,
Darpan Sharma,darpanlucky88@gmail.com,,,,http://lh4.googleusercontent.com/-5qsjT2yYQYQ/AAAAAAAAAAI/AAAAAAAAASM/FCjSWExULbU/photo.jpg,http://graph.facebook.com/100000061297411/picture?type=large,,,,,darpanlucky88,darpan.sharma.587,,,,+91 99531 95828,,,,,,,,,,male,en_US,,"Delhi, India",,,,,,,,,,,,,,,,,,,,,,,,,,,,,,,,,,,,,,,,,,,,,,,,,,,109622446254232587775@google,100000061297411@facebook,,,,,,,,https://plus.google.com/109622446254232587775/about,http://www.facebook.com/people/_/100000061297411,http://klout.com/user/id/553098346550546488,http://www.facebook.com/darpan.sharma.587,,,,,,,,,,,,1832108513,30 years old
Ankur Aggarwal,ankurcods@gmail.com,,,,http://graph.facebook.com/1612131154/picture?type=large,,,,,,ankur.aggarwal.9634,,,,,,,,,,,,,,,male,en_US,,India,United States,,,,,,,,,,,,,,,,,,,,,,,,,,,,,,,,,,,,,,,,,,,,,,,,,,1612131154@facebook,108388835740293646813@google,,,,,,,,http://www.facebook.com/people/_/1612131154,https://plus.google.com/108388835740293646813/about,http://www.facebook.com/ankur.aggarwal.9634,,,,,,,,,,,,,1822427695,
Shrikanth Ramanathan,shri2403@gmail.com,,,,,,,,,,,,,,,,,,,,,,,,,male,,,"Mumbai, India",,,,,,,,Student at dy patil,,,,,,,,,,,,,,,,,,,mba from dy patil (2011-2013),udayachal higgh school (1995-2005),,,,,,,,,,,,,,,,,,,,,,,45/56/677@linkedin,158372155@linkedin,#67705645@linkedin,,,,,,,http://www.linkedin.com/in/shrikanth-ramanathan-67705645,,,,,,,,,,,,,,,1832124945,
Rajat Grover,rajatgrover25@gmail.com,,,,,,,,,,,,,,,,,,,,,,,,,male,,,"Firozpur, India",,,,,,,,"STUDENT at SHAHEED BHAGAT SINGH STATE TECHNICAL CAMPUS,FEROZEPUR(PUNJAB) (since 2009)",,,,,,,,,,,,,,,,,,,"SHAHEED BHAGAT SINGH STATE TECHNICAL CAMPUS,FEROZEPUR(PUNJAB)","B.tech, MECHANICAL from PUNJAB TECHNICAL UNIVERSITY (2009-2013)","NON MEDICAL, NO from DC MODEL SR. SEC. SCHOOL,FEROZEPUR (2007-2009)",,,,,Rajat Kagra,,,,,,,,,,,,,,,,,58/838/53b@linkedin,205114367@linkedin,100726939808336879521@google,#53b83858@linkedin,,,,,,http://www.linkedin.com/in/rajat-grover-53b83858,https://plus.google.com/100726939808336879521/about,,,,,,,,,,,,,,1832117835,
Ashish Kumar,,,,,,,,,,,,,,,,+91 99582 60224,,,,,,,,,,male,en_US,,India,,,,,,,,,,,,,,,,,,,,,,,,,,,,,,,,,,,,,,,,,,,,,,,,,,,100003147545611@facebook,,,,,,,,,http://facebook.com/people/_/100003147545611,,,,,,,,,,,,,,,1832121627,
Zachariah Thomas,rensu.thomas@gmail.com,zachariahthomas45@yahoo.in,legendkiller_zach@yahoo.co.in,,http://graph.facebook.com/797167987/picture?type=large,http://lh4.googleusercontent.com/-sijair4-n90/AAAAAAAAAAI/AAAAAAAAAHA/3qACjzm_lPE/photo.jpg,,,,,zachariaht3,,,,,+91 84510 47147,+91 96645 95447,,,,,,,,,male,en_US,,"Mumbai, India","Bhandup, India",United States,,,,,,Former Senior Project Engineer at Master Integrators,Senior Project Engineer at Master Integrators (2013-2018),Project Engineer at Master Integrators (since 2013),Project Engineer at Master Consultancy (since 2013),Instrumentation Engineer at Master Consultancy (since 2013),,,,,,,,,,,,,,,University of Mumbai,"Bachelor of Engineering (B.E.), Instrumentation from Mumbai University (2009-2013)","H.S.C, Science, A from Vani Vidyalay (2007-2009)",,,,,Swapnil Raut,,,,,,,,,,,,,,,,,797167987@facebook,75/54/7bb@linkedin,265864319@linkedin,111574816482449264405@google,#7bb05475@linkedin,,,,,https://www.linkedin.com/in/zachariah-thomas-7bb05475,http://www.facebook.com/people/_/797167987,https://plus.google.com/111574816482449264405/about,http://www.facebook.com/zachariaht3,,,,,,,,,,,,1832117045,
Malkeet Singh,malkeetsingh2555@gmail.com,,,,,,,,,,malkeetsingh2555,,,,,+91 87458 55856,,,,,,,,,,,,,"J-3, 47-b, Third Floor, Khirki Extn, Malviya Nagar, Delhi, India",,,,,,,,,,,,,,,,,,,,,,,,,,,,,,,,,,,,,,,,,,,,,,,,,,,61711262@gravatar,,,,,,,,,http://en.gravatar.com/61711262,http://en.gravatar.com/1ce14db9488875c2b70c36f14f3e6857,,,,,,,,,,,,,,1832114833,
Vivek Jain,vivekjainrox@gmail.com,viveksuryajain@gmail.com,,,http://graph.facebook.com/1148925725/picture?type=large,http://pbs.twimg.com/profile_images/745876059917271040/xw-xlFan.jpg,,,,,vivekjainrox,vivekjain215,viveksuryajain,,,+91 93201 61162,+91 87671 12920,,,,,,,,,male,en_US,,"Mumbai, India",,,,,,,,,,,,,,,,,,,,,,,,,,,,,,,,,,Pankaj Bhomia,Vikas Agrawal,Aditi Bhargava,Gaurav Bansal,Abhinav Sharma,,,,,,,,,,,,,94943482@twitter,123021156@gravatar,1148925725@facebook,101355298@gravatar,101173127593927730310@google,,,,,https://plus.google.com/101173127593927730310/about,http://facebook.com/people/_/1148925725,http://en.gravatar.com/4de0de460f1bdea4236b0ce7b68fb392,http://klout.com/vivekjain215,https://twitter.com/vivekjain215,http://en.gravatar.com/4742c9a065d02e5452d6b38292c33d22,http://en.gravatar.com/123021156,http://en.gravatar.com/101355298,http://www.facebook.com/vivekjainrox,http://vfsstudio.blogspot.com,http://picasaweb.google.com/vivekjainrox,,,,,1832113569,26 years old
Shubham Agarwal,shubham.monu90@gmail.com,,,,,,,,,,,,,,,,,,,,,,,,,male,,,India,,,,,,,,,,,,,,,,,,,,,,,,,,,,,,,,,,,,,,,,,,,,,,,,,,,55/8a/125@linkedin,194272301@linkedin,102529890467587651569@google,#12508a55@linkedin,,,,,,https://www.linkedin.com/in/shubham-agarwal-12508a55,https://plus.google.com/102529890467587651569/about,,,,,,,,,,,,,,1832102983,
Bhargab Pathak,pathakbhargab@yahoo.com,,,,,,,,,,bhargabpathak,,,,,,,,,,,,,,,,,,"Guwahati, India",,,,,,,,Branch Manager at Mobile Handset Brand. Currently Looking for a change. (since 2016),Circle Head at Digital Network Appliance - F Secure (since 2015),Sr. Sales Manager at Gionee (2013-2016),Manager Distribution at Samsung Mobile (2013-2016),Business Manager at www.familybudget.co.in (2013-2014),Circle Retail Manager - Branded Retail at Idea Cellular Ltd (2009-2013),Deputy Manager at TATA TELESERVICES LTD. (2008-2009),Asst. Sales Manager at Champagne Indage Ltd (2006-2008),Territory Sales Manager at Essar Oil (2005-2008),Area Sales Manager at Champagne Indage Ltd (2005-2009),Sr. Territory Sales Executive at United Spirits Limited - A Diageo Group Company (2002-2005),Business Head at www.familybudget.co.in,Circle Head at Digital Network Appliances - F Secure,,,,,,,"PGDBM, MARKETING from Center for Management Development (2000-2002)","Bachelor of Arts (B.A.), Economics from Cotton College (1997-2000)",,,,,,,,,,,,,,,,,,,,,,,65939028@linkedin,1a/bb/1b0@linkedin,#1b00bb1a@linkedin,,,,,,,https://www.linkedin.com/in/bhargabpathak,https://www.linkedin.com/in/bhargab-pathak-1b00bb1a,,,,,,,,,,,,,,1832109145,
Mintu Choudhary,mintu_choudhary01@yahoo.in,,,,,,,,,,mintuchoudhary01,,,,,,,,,,,,,,,male,,,India,,,,,,,,,,,,,,,,,,,,,,,,,,,,,,,,,,,,,,,,,,,,,,,,,,,89606538@gravatar,,,,,,,,,http://en.gravatar.com/89606538,http://en.gravatar.com/4842d8ea6295f381026c7b6c19d3e64b,,,,,,,,,,,,,,1832107565,
Riddhi Botadra,riddhi_botadra@yahoo.com,,,,,,,,,,riddhi_178,BotadraRiddhi,,,,,,,,,,,,,,,,,"Rajkot, India",,,,,,,,Journalist at Aaj Kaal (2015-2015),,,,,,,,,,,,,,,,,,,"BJMC, Journalism from Arjun lal hirani college (2012-2013)",,,,,,,,,,,,,,,,,,,,,,,,964746676@instagram,821914801@twitter,449140470@linkedin,106/4bb/306@linkedin,#3064bb106@linkedin,,,,,https://www.linkedin.com/in/riddhi-botadra-3064bb106,https://www.instagram.com/riddhi_178/,http://en.gravatar.com/62af5c34e1e2cffa023722333648744b,http://klout.com/BotadraRiddhi,https://twitter.com/BotadraRiddhi,,,,,,,,,,,1832319127,
Sonali Checker,checkersonali@gmail.com,sonali.checker@db.com,,,,,,,,,,,,,,+91 83086 69904,+91 20 7129 5378,,,,,,,,,female,,,"Pune, India",,,,,,,,Sr. Analyst - Training & Development at Deutsche Bank (since 2014),Associate Manager - Human Resources at Tata Technologies (since 2012),Sr. Executive Learning and Development at Tata Technologies (since 2012),HR Executive at Nihilent Technologies (2011-2012),Training Executive at Cybage (2007-2011),,,,,,,,,,,,,,,Maharashtra Institute of Technology,,,,,,,Kaushik Kukade,,,,,,,,,,,,,,,,,33/42b/726@linkedin,117510222@linkedin,101642554745498984619@google,#72642b33@linkedin,,,,,,https://www.linkedin.com/in/sonali-checker-72642b33,https://plus.google.com/101642554745498984619/about,,,,,,,,,,,,,,1832320075,
Jyoti Jaiswal,,,,,http://graph.facebook.com/100003524076335/picture?type=large,,,,,,jyoti.jaiswal.12979,,,,,+91 83498 01214,,,,,,,,,,female,en_US,,India,,,,,,,,,,,,,,,,,,,,,,,,,,,,,,,,,,,,,,,,,,,,,,,,,,,100003524076335@facebook,,,,,,,,,http://facebook.com/people/_/100003524076335,http://www.facebook.com/jyoti.jaiswal.12979,,,,,,,,,,,,,,1832313913,26 years old
Savita Nasik,savitasharma579@gmail.com,,,,,,,,,,savita.sharma.7712,,,,,+91 90960 80861,+91 70288 63466,+91 81495 51620,+91 98221 03307,+91 95014 62153,+91 98786 57778,+91 77190 56571,,,,female,en_US,,India,,,,,,,,,,,,,,,,,,,,,,,,,,,,,,,,,,,,,,,,,,,,,,,,,,,100002288407480@facebook,,,,,,,,,http://www.facebook.com/people/_/100002288407480,http://www.facebook.com/savita.sharma.7712,,,,,,,,,,,,,,1832287685,
Amruta Rp,,,,,http://graph.facebook.com/100000898063618/picture?type=large,,,,,,amruta.padre,,,,,+91 80878 71925,,,,,,,,,,female,en_US,,India,,,,,,,,,,,,,,,,,,,,,,,,,,,,,,,,,,,,,,,,,,,,,,,,,,,100000898063618@facebook,,,,,,,,,http://facebook.com/people/_/100000898063618,http://www.facebook.com/amruta.padre,,,,,,,,,,,,,,1824588819,
Niharika Ghoshal,ghoshalniharika02@gmail.com,nihari_12@rediffmail.com,,,http://graph.facebook.com/1119805533/picture?type=large,https://img.fullcontact.com/static/3e656d1d2ec828c6ed3e9f3596f40079_7aa294ebe571d4063f39ed6a1477da45006d085bed15f76a4e24657256876f10,https://img.fullcontact.com/static/5b23a764ef8d9cea1a0d97df44b29405_8bc412bd2e6de1839b50f3154351da55507f28617468522940c909a39367fb79,https://img.fullcontact.com/static/1cf6676af175e851e3977f12b4ed32a8_ecef263780df91ce0d09088ff3c8eba9426c7c0fe849dfb4a03b4a65e4157f50,https://img.fullcontact.com/static/7db2426ef0ee8d6f487a14b6da860146_1c8740ad1e461ec07a6b1ebd6d73201d394ae5c9c0636bb79176919173f424b5,,niharika.ghoshal,niharika-ghoshal,nihari_12,ghoshalniharika02,nihari12,+91 81004 19499,+91 83778 12971,,,,,,,,,female,en_US,,"South Delhi, Delhi, India","Gurgaon, India","Guwahati, India","Mumbai, India",,,,,Senior Strategist at Havas Media (since 2016),Blogger at ED (Economy Decoded): A Generalist Online Youth Media Blogging About Things We Need to Know (since 2016),Strategist at Havas Media Group (2015-2016),Digital Media Strategist- Consultant at Havas Media Group (2015-2016),Digital Media Creative Strategist at Havas Media (since 2015),Copywriter at Havas Media (since 2015),Content Lead at LimeTray (2015-2015),Creative Strategist at Sparrow Interactive Pvt. Ltd. (2014-2015),Copywriter at Sparrow Interactive Pvt. Ltd. (2014-2015),Intern-Brand Strategy & Copywriting at The Brand Bee (2014-2014),Summer Intern at JWT (2014-2014),Digital Marketing Intern at Indian Private Equity and Venture Capital Association (2013-2014),Intern at Indian Private Equity and Venture Capital Association (2013-2013),Intern at IVCA (2013-2014),Creative Assistant at Neev Productions (2013-2014),Marketing Intern at News Live (2012-2012),Freelance Photographer at Bennett Coleman and Co. Ltd. (Times Group) (2011-2011),,,"Master's degree, Integrated Marketing Communications from The Delhi School Of Communication (2013-2015)","Master's degree, Journalism and mass communication from Delhi School of Communication (2013-2015)","Bachelor of Arts (B.A.), Communication, Journalism, and Related Programs from University of Calcutta (2010-2013)","Bachelor of Arts (BA), Communication, Journalism, and Related Programs from University of Calcutta (2010-2013)","Bachelor of Arts (B.A.), Communication, Journalism, and Related Programs from Shri Shikshayatan College (2010-2013)",Faculty Higher Secondary School (2008-2010),"Holy Child School, Guwahati (1997-2008)",Yashi Sikaria,Beauty Barman,Nikita Bhayani,Adit Baruah,Gurcharan Kaur,Amit Bansal,Tekhe Mero,Ankit Bhavsar,Shilpa Giri,,,,,,,,,86/857/14b@linkedin,77664250@gravatar,306677003@linkedin,131441457@twitter,115950547690739543852@google,1119805533@facebook,#14b85786@linkedin,,,https://www.linkedin.com/in/niharika-ghoshal-14b85786,http://www.facebook.com/people/_/1119805533,https://angel.co/niharika-ghoshal,http://pinterest.com/nihari_12/,https://plus.google.com/115950547690739543852/about,http://en.gravatar.com/d5d2bbb002dd9603428e591711a66961,https://twitter.com/niharikaghoshal,http://www.facebook.com/niharika.ghoshal,http://en.gravatar.com/77664250,https://www.linkedin.com/profile/public-profile-settings?trk=prof-edit-edit-public_profile,,,,,,1283745971,26 years old
Princy MacWan,princymacwan74@gmail.com,,,,,,,,,,,,,,,,,,,,,,,,,,,,India,,,,,,,,,,,,,,,,,,,,,,,,,,,,,,,,,,,,,,,,,,,,,,,,,,,111555630026621034265@google,,,,,,,,,https://plus.google.com/111555630026621034265/about,,,,,,,,,,,,,,,1832259719,
Tehreen Sayed,tehreensayed@gmail.com,,,,http://2.gravatar.com/avatar/3874bc189ca57d92c8216a28ffd37ed3?size=400&d=404,https://img.fullcontact.com/static/ed13f268d4288c34f733005ad5e8fb03_e6feba0430cfd79dc60ed145534775a6b4804df0abe96471bd8cb2cfc4559290,,,,,tehreensayed,,,,,+91 97699 39655,+91 97571 47812,,,,,,,,,female,,,"Mumbai, India",,,,,,,,,,,,,,,,,,,,,,,,,,,,,,,,,,,,,,,,,,,,,,,,,,,136006755@gravatar,114809881226741378719@google,,,,,,,,http://en.gravatar.com/3874bc189ca57d92c8216a28ffd37ed3,https://plus.google.com/114809881226741378719/about,http://en.gravatar.com/136006755,http://optimisticthinkingnet.wordpress.com,,,,,,,,,,,,1832248817,
Krupa Varvedia,krupavarvedia@gmail.com,,,,http://graph.facebook.com/100001419733425/picture?type=large,,,,,,krupa.varvedia,,,,,+91 90226 90797,,,,,,,,,,female,en_US,,India,,,,,,,,,,,,,,,,,,,,,,,,,,,,,,,,,,,,,,,,,,,,,,,,,,,100001419733425@facebook,,,,,,,,,http://www.facebook.com/people/_/100001419733425,http://en.gravatar.com/6291a2497d7efc0c583ad3d78142efa9,http://www.facebook.com/krupa.varvedia,,,,,,,,,,,,,1832229541,26 years old
Rajni Gangwar,rajni.gangwar@gmail.com,,,,,,,,,,,,,,,,,,,,,,,,,female,,,"Delhi, India",,,,,,,,Sr. Recruitment Analyst at Vrinda Consultants Urgently looking for Marine Pilot & ASD Tug Master in UAE,Sr. Recruitment Analyst at Vrinda Consulting Ltd. (since 2015),Sr. Recruitment Analyst at Vrinda Consultants Urgently looking for Consultant Doctors with a leading Hospital in UAE (since 2015),Talent Acquisition Executive at DS Construction Limited (since 2012),Talent Acquisition Executive at DSC Limited (2012-2014),Associate at GlobalHunt (2011-2012),Associate at Global Hunt India Pvt. Limited (2011-2012),Recruitment executive at Balkan Consulting (2010-2011),,,,,,,,,,,,"MBA, HR,Markering ,finance from Uttar Pradesh Technical University (2008-2010)","MBA, HR from Institute of Professional Excellence & Management, GZB (2008-2010)",,,,,,,,,,,,,,,,,,,,,,,84281908@linkedin,24/286/304@linkedin,108080056698753116361@google,#30428624@linkedin,,,,,,https://www.linkedin.com/in/rajni-gangwar-30428624,https://plus.google.com/108080056698753116361/about,,,,,,,,,,,,,,1832244235,
Bhano Rangoonwala,sweetbhano0108@gmail.com,,,,,,,,,,,,,,,,,,,,,,,,,female,,,"Mumbai, India",,,,,,,,,,,,,,,,,,,,,,,,,,,,,,,,,,,,,,,,,,,,,,,,,,,108103137431185880815@google,,,,,,,,,https://plus.google.com/108103137431185880815/about,,,,,,,,,,,,,,,1832245341,
Neeru Bhadauria,bhadauria.neeru@gmail.com,,,,https://img.fullcontact.com/static/4d4954161cfb0a340ce16a56cfc7a612_858525a5ab48b0d75af5d7a3b54cb71a1766f671c0a7559d5205f81606646ffe,,,,,,neerubhadauria,,,,,,,,,,,,,,,female,,,"Ghaziabad, India","Noida, India",,,,,,,Human Resources at Triumfo Techno group (since 2015),Executive-Resource at Unified Recruitment Solutions (2014-2015),Associate Recruiter at Amigo Consultant (2012-2014),Branch Coordinator at TATA AIA Life Insurance Co (2009-2010),,,,,,,,,,,,,,,,B.com and M.com from Rohilkand University.MBA(HR and Finance) from MTU University. from 10th and 12th from CBSE Board.,,,,,,,,,,,,,,,,,,,,,,,,62/564/727@linkedin,222339343@linkedin,117631714397874080583@google,#72756462@linkedin,,,,,,http://www.linkedin.com/in/neerubhadauria,https://plus.google.com/117631714397874080583/about,https://www.linkedin.com/in/neerubhadauria,,,,,,,,,,,,,1832223063,
Sneha S,snehaewis104@gmail.com,,,,,,,,,,,,,,,+91 97401 65458,,,,,,,,,,female,,,India,,,,,,,,,,,,,,,,,,,,,,,,,,,,,,,,,,,,,,,,,,,,,,,,,,,107164155610342981022@google,,,,,,,,,https://plus.google.com/107164155610342981022/about,,,,,,,,,,,,,,,1832222115,
Rashna Chhoi,rashnachhoi@yahoo.com,rashna.chhoi@in.fcm.travel,,,http://graph.facebook.com/100000749633476/picture?type=large,,,,,,rashna.chhoi,,,,,+91 96196 10839,,,,,,,,,,female,en_US,,India,,,,,,,,fcm travel solutions india,,,,,,,,,,,,,,,,,,,,,,,,,,,,,,,,,,,,,,,,,,,100000749633476@facebook,,,,,,,,,http://www.facebook.com/people/_/100000749633476,http://www.facebook.com/rashna.chhoi,,,,,,,,,,,,,,1832176453,
Snigdha,snigdha1092@gmail.com,,,,https://img.fullcontact.com/static/d3217d6bdb6c74f2e32add0257770cbb_8b7c3c76f5114d05b8e747bf51c77546572a4765ff7f20caf05229bfceae95ef,,,,,,snigdha1092,,,,,,,,,,,,,,,female,,,"Delhi, India",,,,,,,,,,,,,,,,,,,,,,,,,,,,,,,,,,,,,,,,,,,,,,,,,,,536065556@twitter,,,,,,,,,https://twitter.com/snigdha1092,,,,,,,,,,,,,,,1832210107,
Rajesh Khanduja,rajesh.khanduja@rediffmail.com,,,,http://graph.facebook.com/100000398465613/picture?type=large,,,,,,rajesh.khanduja.3,,,,,+91 88007 04967,,,,,,,,,,male,en_US,,India,,,,,,,,,,,,,,,,,,,,,,,,,,,,,,,,,,,,,,,,,,,,,,,,,,,100000398465613@facebook,,,,,,,,,http://www.facebook.com/people/_/100000398465613,http://www.facebook.com/rajesh.khanduja.3,,,,,,,,,,,,,,1832207421,
Pushpendra Handa,pushpendrahanda@acclimited.com,pushpendra.handa@acclimited.com,,,,,,,,,,,,,,+91 90044 76392,,,,,,,,,,male,,,"Mumbai, India",,,,,,,,Head- Health services at ACC Limited,,,,,,,,,,,,,,,,,,,,,,,,,,,,,,,,,,,,,,,,,,,73172902@linkedin,20/609/51a@linkedin,#51a60920@linkedin,,,,,,,https://www.linkedin.com/in/pushpendra-handa-51a60920,,,,,,,,,,,,,,,1832178665,
Geetanjali Sharma,,,,,http://graph.facebook.com/100000409318548/picture?type=large,,,,,,ssa13312000,gitanjali.sharma.98,,,,+91 98997 17598,+91 94253 01321,+91 99532 41478,+91 99884 51084,,,,,,,female,en_US,,India,,,,,,,,,,,,,,,,,,,,,,,,,,,,,,,,,,,,,,,,,,,,,,,,,,,100000409318548@facebook,,,,,,,,,http://pinterest.com/ssa13312000/,http://www.facebook.com/people/_/100000409318548,http://www.facebook.com/gitanjali.sharma.98,,,,,,,,,,,,,1832164919,
Raagaleena Sripada,raagaleena@bigbasket.com,raagaleena@gmail.com,,,http://1.gravatar.com/avatar/cda65bd7488849772b0016223124a6bb?size=420&d=404,http://graph.facebook.com/847830555/picture?type=large,http://pbs.twimg.com/profile_images/612673468228698112/ubL-_fBV.jpg,http://1.gravatar.com/avatar/cda65bd7488849772b0016223124a6bb?size=400&d=404,,,raagaleena,,,,,+91 98672 27736,+91 98197 79892,+91 99023 45290,+1 213-446-8313,,,,,,,female,en,,"Mumbai, India","Bangalore, India","Los Angeles, California",,,,,,Senior Marketing Manager at bigbasket.com (since 2015),Senior Manager Marketing at BigBasket.com (since 2015),Regional Multi Channel Marketing Manager - Asia Pacific at Merck (2014-2015),Manager at Nielsen Online (2011-2014),"Asst. Manager, Marketing at TATA Chemicals Ltd (2009-2011)",Part time Social Media and Online Marketing Research Assistant at Starkart (2009-2009),Brand Research Intern at Hall & Partners (2008-2008),"Global Communication Research Assistant at University of Southern California, Annenberg School for Communications (2008-2008)",Volunteer as a Marketing and Administration Coordinator at Aatma Mumbai (2007-2007),Account Management Intern at Ogilvy & Mather (2006-2006),Regional MCM Manager at Asia Pacific,,,,,,,,,Executive General Management Program from Indian Institute of Management Bangalore (2017-2018),"Master of Arts, Global Communications Management from University of Southern California (2007-2009)","Master of Science, Global Media and Communications from The London School of Economics and Political Science (LSE) (2007-2009)","Bachelors in Mass Media, Mass Media from University of Mumbai (2004-2007)",,,,Tanvi Kapoor,,,,,,,,,,,,,,,,,847830555@facebook,4267619@gravatar,4/779/26@linkedin,16492982@twitter,13846494@linkedin,105643188310487915319@google,#0267794@linkedin,,,https://www.linkedin.com/in/raagaleena-sripada-0267794,https://plus.google.com/105643188310487915319/about,http://en.gravatar.com/4267619,http://www.facebook.com/people/_/847830555,http://klout.com/Raagaleena,https://instagram.com/raagaleena,https://twitter.com/Raagaleena,https://whitepages.plus/n/Raagaleena_Sripada/_/9fa7a75a7df17a3f7c701920d619ea6e,http://en.gravatar.com/cda65bd7488849772b0016223124a6bb,http://www.facebook.com/raagaleena,http://gravatar.com/raagaleena,,,,,1832162549,
Vinita Ramrakhyani,,,,,,,,,,,,,,,,+91 93201 47404,,,,,,,,,,female,,,"Mumbai, India",,,,,,,,Senior Instrumentation Engineer at Toyo Engineering India Private Limited,,,,,,,,,,,,,,,,,,,,,,,,,,,,,,,,,,,,,,,,,,,494158315@linkedin,119/5ab/2b7@linkedin,#2b75ab119@linkedin,,,,,,,https://www.linkedin.com/in/vinita-ramrakhyani-2b75ab119,,,,,,,,,,,,,,,1832126209,
Joyce Govindrajan,,,,,http://graph.facebook.com/100001266195001/picture?type=large,,,,,,,,,,,+91 99109 83421,+91 90221 97526,,,,,,,,,,,,India,,,,,,,,,,,,,,,,,,,,,,,,,,,,,,,,,,,,,,,,,,,,,,,,,,,100001266195001@facebook,,,,,,,,,http://www.facebook.com/people/_/100001266195001,,,,,,,,,,,,,,,1832143589,
Rukshana Ji,sharif_bom@yahoo.com,,,,,,,,,,AnsariBom,,,,,+91 90966 59226,+91 87658 89155,+91 99792 71298,,,,,,,,male,,,India,,,,,,,,,,,,,,,,,,,,,,,,,,,,,,,,,,,,,,,,,,,,,,,,,,,540097830@twitter,,,,,,,,,http://klout.com/AnsariBom,https://twitter.com/ansaribom,,,,,,,,,,,,,,1832134741,
Namrata Kakati,namratakakati@ymail.com,,,,,,,,,,,,,,,+91 98997 17589,,,,,,,,,,female,,,"Delhi, India","Gurgaon, India","Mumbai, India","Noida, India",,,,,Assistant Manager at Intelenet Global Services (since 2018),Procurement Analyst at Accenture (2013-2018),Associate- Accounts payable at Accenture (since 2013),Customer Service Executive at arvato Customer Services (since 2012),Customer Service Executive at GE Capital (2011-2012),P.R.Executive at H. S. Communication (2010-2010),P.R. Executive at Fourth Estate,,,,,,,,,,,,,"BSc; BSc, MCAJ; 3RD from International School of Business & Media (2007-2010)",HSLC from Kendriya Vidyalaya,"Master of Business Administration - MBA, Human Resources Management/Personnel Administration, General from SCDL","BSc, MCAJ from st",,,,,,,,,,,,,,,,,,,,,2a/71a/559@linkedin,103304085@linkedin,#55971a2a@linkedin,,,,,,,https://www.linkedin.com/in/namrata-kakati-55971a2a,,,,,,,,,,,,,,,1832127789,
Neetesh Rathod,neetesh.rathod@gmail.com,nrathod@yahoo.com,neetesh_rathod@yahoo.com,,http://graph.facebook.com/625456986/picture?type=large,http://lh4.googleusercontent.com/-2LnEYKUQ9do/AAAAAAAAAAI/AAAAAAAAC-c/SvS_9St5Ldo/photo.jpg,https://img.fullcontact.com/static/2e76f3125a674d866057eb81b595f18d_11b3530e5b66c68e1b14e4b204b6f44cc6c4d57991112b6b22fff90e36b3ac4c,http://0.gravatar.com/avatar/bdb47d3f54a697d994ff8a5ccdcea95a?size=400&d=404,https://img.fullcontact.com/static/7c1ac619734c34d38aa6e164e89fb79b_467cbd3aae47afe004b1658fe478c7045fbb75ad029c0bd93a4f50322ffb4292,,cluless,neetesh.rathod,,,,+1 312-608-1651,,,,,,,,,,male,en_US,,"3021-UNIT 208 S Michigan Avenue, Chicago, Illinois","Stamford, Connecticut","Ellicott City, Maryland","3021-208 S Michigan Avenue, Chicago, Illinois","3021-208 S Michigan Avneue, Chicago, Illinois","Pune, India","Mumbai, India",,Market Risk Business Analyst at The Royal Bank of Scotland (since 2015),Intern at Fusionary Trading,Senior Options Trader at Nolita Capital LLC (2010-2015),Assistant Trader at Fusionary Trading (2009-2009),Intern at fusionary Tradeing (2009-2009),Junior Trader at Nolita Capital LLC (2008-2009),Sr. Business Analyst/Options Trader at Nolita Capital LLC (2008-2015),Trader at Nolita Capital (since 2008),Business System Analyst at Infosys Technologies Ltd (2005-2007),Software Engineer at Infosys Technologies Ltd (2005-2007),Assistant Trader at Nolita Capital,,,,,,,,,"Master’s Degree, Finance, Financial Engineering, 3.51 from IIT Stuart School of Business (2007-2009)","Master's Degree, Finance, 3.51 from IIT Stuart School of Business (2007-2009)","Master's degree, from Illinois Institute of Technology (2007-2009)","Bachelor's Degree, Computer Engineering, First Class from Ramrao Adik Institute of Technology (2001-2005)","Bachelor's Degree, Computer Science, First Class from University of Mumbai (2001-2005)",Bachelors from University of Mumbai (2001-2005),,Varun Prakash Rathi,Premdeep Singh Dandiwal,Shivam Singh,Tajinder Singh,Chandresh P Mansukhani,Rohan S Patil,Bharat H Jain,Greenidge Rodrigues,Van Pezzello,Chirag Dadlani,Anand Iyer,Sagar Doshi,Krishnan Venkitachalam,Punit Mittal,Apurva Modi,Darshana Pancholi,Ankit G,625456986@facebook,5/8b4/668@linkedin,33056002@friendster,30330660@twitter,29007260@foursquare,17156528@linkedin,131591787@gravatar,117683836653848066924@google,#6688b45@linkedin,https://www.linkedin.com/in/neetesh-rathod-6688b45,http://www.twitter.com/cluless,http://www.facebook.com/people/_/625456986,https://plus.google.com/117683836653848066924/about,http://en.gravatar.com/131591787,https://foursquare.com/user/29007260,http://klout.com/cluless,https://www.beenverified.com/seg/?bvid=N_MTUyOTE5MDQwMDM1&piplstart=&fn=Neetesh&ln=Rathod&state=MD&age=&city=Ellicott City&utm_source=pipl&utm_medium=channel_partner&utm_campaign=2016_Search_Possible_Matching_Results_Sponsored_Results&utm_content=,http://www.fb.esnips.com/user/happylifesancheti,http://tracking.instantcheckmate.com/?a=60&c=148&city=Ellicott+City&cmp=SB_MultiR&fname=Neetesh&lname=Rathod&mdm=api&oc=5&s1=Mshortcut_results&s1=SB_MultiR&s2=3&s4=results&s5=09292017-00&src=pipl&state=MD,https://whitepages.plus/n/Neetesh_Rathod/Chicago_IL/4d49c46796ff71bf36818a3201fff02a,http://en.gravatar.com/bdb47d3f54a697d994ff8a5ccdcea95a,http://www.facebook.com/neetesh.rathod,http://tracking.instantcheckmate.com/?a=60&c=148&city=Chicago&cmp=SB_MultiR&fname=Neetesh&lname=Rathod&mdm=api&oc=5&s1=Mshortcut_results&s1=SB_MultiR&s2=3&s4=results&s5=09292017-00&src=pipl&state=IL,http://picasaweb.google.com/neetesh.rathod,1832102351,35 years old
Jija Dahifale,jijad2007@gmail.com,,,,https://img.fullcontact.com/static/23ee88a93b7d843b5ca1e8733e9a97a4_a2c6415ad8fb8661451cf88518248796cab9967b54f705ce5535ebefc2e51301,,,,,,,,,,,,,,,,,,,,,female,,,India,,,,,,,,,,,,,,,,,,,,,,,,,,,B.Sc.I.T from University of Mumbai (2006-2009),,,,,,,Sneha Parkar,,,,,,,,,,,,,,,,,97182516@linkedin,96579298@linkedin,28/667/a70@linkedin,28/416/96a@linkedin,105021039083888079741@google,#a7066728@linkedin,#96a41628@linkedin,,,https://www.linkedin.com/in/jija-dahifale-96a41628,https://plus.google.com/105021039083888079741/about,https://www.linkedin.com/in/jija-dahifale-a7066728,,,,,,,,,,,,,1832099981,
Rashmi More,rashmipmore@gmail.com,,,,http://graph.facebook.com/100001482015200/picture?type=large,https://lh3.googleusercontent.com/-zrQa1HNo3mk/AAAAAAAAAAI/AAAAAAAACos/Mm98jnMt374/photo.jpg?sz=1080,,,,,rashmimore524,,,,,+91 97664 94449,,,,,,,,,,female,en_GB,,India,,,,,,,,,,,,,,,,,,,,,,,,,,,,,,,,,,Deepak Mahindrakar,,,,,,,,,,,,,,,,,112359808643084361871@google,100001482015200@facebook,,,,,,,,http://pinterest.com/rashmimore524/,http://www.facebook.com/people/_/100001482015200,https://plus.google.com/112359808643084361871/about,http://www.facebook.com/rashmi.more.524,,,,,,,,,,,,1832091923,48 years old
Richa Bhatt,richabhatt1993@gmail.com,,,,,,,,,,,,,,,,,,,,,,,,,female,,,India,,,,,,,,,,,,,,,,,,,,,,,,,,,,,,,,,,,,,,,,,,,,,,,,,,,102897427538555141896@google,,,,,,,,,https://plus.google.com/102897427538555141896/about,,,,,,,,,,,,,,,1832092397,
,sunflowerrenu@gmail.com,,,,,,,,,,renugadevig1,renugaanandavalli,,,,,,,,,,,,,,,,,India,,,,,,,,,,,,,,,,,,,,,,,,,,,,,,,,,,,,,,,,,,,,,,,,,,,46477339@gravatar,1136587386@twitter,,,,,,,,http://en.gravatar.com/e46beffc10a5fc47a3aa2f111a50e717,https://twitter.com/renugadevig1,http://en.gravatar.com/46477339,,,,,,,,,,,,,1832075965,
Tushar Godse,,,,,http://graph.facebook.com/850309296/picture?type=large,,,,,,,,,,,+91 97656 03335,,,,,,,,,,male,en_US,,India,,,,,,,,,,,,,,,,,,,,,,,,,,,,,,,,,,,,,,,,,,,,,,,,,,,850309296@facebook,,,,,,,,,http://www.facebook.com/people/_/850309296,,,,,,,,,,,,,,,1832064747,32 years old
,dg351006@gmail.com,,,,http://1.gravatar.com/avatar/7bdff7679bdba89afd060e8863608b2e?size=400&d=404,,,,,,,,,,,,,,,,,,,,,female,,,India,,,,,,,,,,,,,,,,,,,,,,,,,,,,,,,,,,,,,,,,,,,,,,,,,,,,,,,,,,,,http://en.gravatar.com/7bdff7679bdba89afd060e8863608b2e,,,,,,,,,,,,,,,1832057321,
Mohit Mishra,mohit.mishra@gmail.com,alka.mm.shukla@gmail.com,mohit.mishra@negp.gov.in,,http://graph.facebook.com/100000251334202/picture?type=large,https://lh4.googleusercontent.com/-5oEJxTMYcnc/AAAAAAAAAAI/AAAAAAAAGrQ/kP2itl1wkS8/s100/photo.jpg?sz=1080,https://img.fullcontact.com/static/fccb526e029b6594a6605f4544f970cb_03a5101a9f91ba63ed061990f32470a20205358d45253dec8360c8be6c0aa139,,,,mohit.mishra.562329,,,,,+91 97119 29060,+91 86065 09315,,,,,,,,,male,en_US,,"Flat No. 20014, Ats Paradiso, Sector Chi-4,, Greater Noida, India","Gurgaon, India","Kolkata, India",,,,,,Principal Consultant at PwC,nisg,,,,,,,,,,,,,,,,,,,,,,,,,Ravindra Kushwaha,,,,,,,,,,,,,,,,,4894039@linkedin,112044871705084231595@google,100000251334202@facebook,1/780/247@linkedin,#2477801@linkedin,,,,,https://www.linkedin.com/in/mohit-mishra-2477801,http://www.facebook.com/people/_/100000251334202,https://plus.google.com/112044871705084231595/about,http://www.amazon.com/wishlist/131P7NSYICV72,http://www.facebook.com/mohit.mishra.562329,,,,,,,,,,,1799530967,
Jyoti,jyotichougule79@gmail.com,,,,,,,,,,,,,,,+91 99220 04632,,,,,,,,,,,,,India,,,,,,,,,,,,,,,,,,,,,,,,,,,,,,,,,,,,,,,,,,,,,,,,,,,,,,,,,,,,http://en.gravatar.com/fdbecbdffa140413f79706d385f35b7d,,,,,,,,,,,,,,,1832035991,
