[
    {
        "policy_no": "C000001436",
        "alphaID": 10334188,
        "owner_name": "siddhesh parab",
        "insured_name": "siddhesh parab",
        "insured_dob": "1972-09-12T18:30:00.000+00:00",
        "insured_email": "siddhesh.parab@teknopoint.in",
        "insured_mobile_no": "8655525770",
        "premium_mode": "03",
        "policy_status": "20",
        "assignment_status": null,
        "insured_panNo": "ABEPJ7636C",
        "is_ulip": "N",
        "policy_issuance_date": "2001-05-09T18:30:00.000+00:00",
        "contact_no_last_updated": "2001-05-09T18:30:00.000+00:00",
        "insured_email_id_last_updated": null,
        "bank_account_no": null,
        "whatsapp_opt_in_status": "Y",
        "eia_account_number": null,
        "product_name": "ASSURE 30 YEARS SECURITY & GROWTH PLAN",
        "product_uin_number": "110N002V01",
        "is_reinvest_applicable": "N",
        "outstanding_payout": null,
        "unclaimed_amount": null,
        "is_neft_registered": "N",
        "si_registered": "Y",
        "last_premium_paid": "2020-08-09T18:30:00.000+00:00",
        "owner_email": "siddhesh.parab@teknopoint.in",
        "owner_mobile_no": "8655525770",
        "owner_gender": "F",
        "product_cd": "30ENDP1",
        "owner_panno": null,
        "email_id_last_updated": "2001-05-09T18:30:00.000+00:00",
        "sum_assured": "100000"
    },
    {
        "policy_no": "C000001685",
        "alphaID": 2123049797,
        "owner_name": "siddhesh parab",
        "insured_name": "siddhesh parab",
        "insured_dob": "1996-08-27T18:30:00.000+00:00",
        "insured_email": "siddhesh.parab@teknopoint.in",
        "insured_mobile_no": "8655525770",
        "premium_mode": "12",
        "policy_status": "20",
        "assignment_status": null,
        "insured_panNo": null,
        "is_ulip": "N",
        "policy_issuance_date": "2001-05-13T18:30:00.000+00:00",
        "contact_no_last_updated": "2001-05-13T18:30:00.000+00:00",
        "insured_email_id_last_updated": null,
        "bank_account_no": null,
        "whatsapp_opt_in_status": "Y",
        "eia_account_number": null,
        "product_name": "ASSURE 21 YEARS MONEY SAVER PLAN",
        "product_uin_number": "110N001V01",
        "is_reinvest_applicable": "N",
        "outstanding_payout": null,
        "unclaimed_amount": null,
        "is_neft_registered": "N",
        "si_registered": "N",
        "last_premium_paid": "2020-05-13T18:30:00.000+00:00",
        "owner_email": "siddhesh.parab@teknopoint.in",
        "owner_mobile_no": "8655525770",
        "owner_gender": "F",
        "product_cd": "21TMAEP1",
        "owner_panno": null,
        "email_id_last_updated": "2001-05-13T18:30:00.000+00:00",
        "sum_assured": "50000"
    },
    {
        "policy_no": "C000002613",
        "alphaID": 11172,
        "owner_name": "siddhesh parab",
        "insured_name": "siddhesh parab",
        "insured_dob": "1978-06-06T18:30:00.000+00:00",
        "insured_email": "siddhesh.parab@teknopoint.in",
        "insured_mobile_no": "8655525770",
        "premium_mode": "12",
        "policy_status": "20",
        "assignment_status": null,
        "insured_panNo": null,
        "is_ulip": "N",
        "policy_issuance_date": "2001-05-20T18:30:00.000+00:00",
        "contact_no_last_updated": "2001-05-20T18:30:00.000+00:00",
        "insured_email_id_last_updated": null,
        "bank_account_no": "700506760001853",
        "whatsapp_opt_in_status": " ",
        "eia_account_number": null,
        "product_name": "ASSURE 30 YEARS SECURITY & GROWTH PLAN",
        "product_uin_number": "110N002V01",
        "is_reinvest_applicable": "N",
        "outstanding_payout": null,
        "unclaimed_amount": null,
        "is_neft_registered": "Y",
        "si_registered": "N",
        "last_premium_paid": "2020-05-20T18:30:00.000+00:00",
        "owner_email": "siddhesh.parab@teknopoint.in",
        "owner_mobile_no": "8655525770",
        "owner_gender": "M",
        "product_cd": "30ENDP1",
        "owner_panno": null,
        "email_id_last_updated": "2001-05-20T18:30:00.000+00:00",
        "sum_assured": "100000"
    },
    {
        "policy_no": "C000102568",
        "alphaID": 1797811,
        "owner_name": "Siddhesh Parab",
        "insured_name": "Siddhesh Parab",
        "insured_dob": "2003-06-26T18:30:00.000+00:00",
        "insured_email": "siddhesh.parab@teknopoint.in",
        "insured_mobile_no": "8655525770",
        "premium_mode": "06",
        "policy_status": "20",
        "assignment_status": null,
        "insured_panNo": null,
        "is_ulip": "N",
        "policy_issuance_date": "2013-06-26T18:30:00.000+00:00",
        "contact_no_last_updated": "2021-04-21T18:30:00.000+00:00",
        "insured_email_id_last_updated": null,
        "bank_account_no": "70003407723",
        "whatsapp_opt_in_status": "Y",
        "eia_account_number": null,
        "product_name": "MAHALIFE GOLD",
        "product_uin_number": "110N029V01",
        "is_reinvest_applicable": "Y",
        "outstanding_payout": null,
        "unclaimed_amount": null,
        "is_neft_registered": "Y",
        "si_registered": "Y",
        "last_premium_paid": "2019-01-02T18:30:00.000+00:00",
        "owner_email": "siddhesh.parab@teknopoint.in",
        "owner_mobile_no": "8655525770",
        "owner_gender": "M",
        "product_cd": "15LPWLP1",
        "owner_panno": null,
        "email_id_last_updated": "2013-06-26T18:30:00.000+00:00",
        "sum_assured": "1300000"
    },
    {
        "policy_no": "C000001672",
        "alphaID": 2123049788,
        "owner_name": "siddhesh parab",
        "insured_name": "siddhesh parab",
        "insured_dob": "1994-01-14T18:30:00.000+00:00",
        "insured_email": "siddhesh.parab@teknopoint.in",
        "insured_mobile_no": "8655525770",
        "premium_mode": "12",
        "policy_status": "20",
        "assignment_status": null,
        "insured_panNo": null,
        "is_ulip": "N",
        "policy_issuance_date": "2001-05-13T18:30:00.000+00:00",
        "contact_no_last_updated": "2001-05-13T18:30:00.000+00:00",
        "insured_email_id_last_updated": null,
        "bank_account_no": null,
        "whatsapp_opt_in_status": "Y",
        "eia_account_number": null,
        "product_name": "ASSURE 21 YEARS MONEY SAVER PLAN",
        "product_uin_number": "110N001V01",
        "is_reinvest_applicable": "N",
        "outstanding_payout": null,
        "unclaimed_amount": null,
        "is_neft_registered": "N",
        "si_registered": "N",
        "last_premium_paid": "2020-05-13T18:30:00.000+00:00",
        "owner_email": "siddhesh.parab@teknopoint.in",
        "owner_mobile_no": "8655525770",
        "owner_gender": "F",
        "product_cd": "21TMAEP1",
        "owner_panno": null,
        "email_id_last_updated": "2001-05-13T18:30:00.000+00:00",
        "sum_assured": "50000"
    },
    {
        "policy_no": "C270002540",
        "alphaID": 1466537613,
        "owner_name": "siddhesh parab",
        "insured_name": "siddhesh parab",
        "insured_dob": "1990-09-02T18:30:00.000+00:00",
        "insured_email": "siddhesh.parab@teknopoint.in",
        "insured_mobile_no": "8655525770",
        "premium_mode": "01",
        "policy_status": "20",
        "assignment_status": null,
        "insured_panNo": null,
        "is_ulip": "N",
        "policy_issuance_date": "2021-05-25T18:30:00.000+00:00",
        "contact_no_last_updated": "2021-05-25T18:30:00.000+00:00",
        "insured_email_id_last_updated": null,
        "bank_account_no": "123",
        "whatsapp_opt_in_status": "Y",
        "eia_account_number": 2580258800856,
        "product_name": "SIP-OptI 10 PPT for PT 21yrs",
        "product_uin_number": "110N126V03",
        "is_reinvest_applicable": "N",
        "outstanding_payout": null,
        "unclaimed_amount": null,
        "is_neft_registered": "Y",
        "si_registered": "N",
        "last_premium_paid": null,
        "owner_email": "siddhesh.parab@teknopoint.in",
        "owner_mobile_no": "8655525770",
        "owner_gender": "M",
        "product_cd": "SIP10IV3N1",
        "owner_panno": null,
        "email_id_last_updated": "2021-05-25T18:30:00.000+00:00",
        "sum_assured": "220000"
    },
    {
        "policy_no": "U010012169",
        "alphaID": 34331389,
        "owner_name": "siddhesh parab",
        "insured_name": "siddhesh parab",
        "insured_dob": "1994-08-13T18:30:00.000+00:00",
        "insured_email": "siddhesh.parab@teknopoint.in",
        "insured_mobile_no": "8655525770",
        "premium_mode": "12",
        "policy_status": "20",
        "assignment_status": null,
        "insured_panNo": null,
        "is_ulip": "Y",
        "policy_issuance_date": "2004-05-30T18:30:00.000+00:00",
        "contact_no_last_updated": "2004-05-30T18:30:00.000+00:00",
        "insured_email_id_last_updated": null,
        "bank_account_no": null,
        "whatsapp_opt_in_status": "Y",
        "eia_account_number": null,
        "product_name": "InvestAssure",
        "product_uin_number": "110L035V01",
        "is_reinvest_applicable": "N",
        "outstanding_payout": null,
        "unclaimed_amount": null,
        "is_neft_registered": "N",
        "si_registered": "N",
        "last_premium_paid": "2010-02-25T18:30:00.000+00:00",
        "owner_email": "siddhesh.parab@teknopoint.in",
        "owner_mobile_no": "8655525770",
        "owner_gender": "F",
        "product_cd": "45AUL20LN2",
        "owner_panno": null,
        "email_id_last_updated": "2004-05-30T18:30:00.000+00:00",
        "sum_assured": "225000"
    },
    {
        "policy_no": "U010070130",
        "alphaID": 42123628,
        "owner_name": "siddhesh parab",
        "insured_name": "siddhesh parab",
        "insured_dob": "1977-11-14T18:30:00.000+00:00",
        "insured_email": "siddhesh.parab@teknopoint.in",
        "insured_mobile_no": "8655525770",
        "premium_mode": "06",
        "policy_status": "20",
        "assignment_status": null,
        "insured_panNo": null,
        "is_ulip": "Y",
        "policy_issuance_date": "2006-01-04T18:30:00.000+00:00",
        "contact_no_last_updated": "2006-01-04T18:30:00.000+00:00",
        "insured_email_id_last_updated": null,
        "bank_account_no": "274070067313384",
        "whatsapp_opt_in_status": "Y",
        "eia_account_number": null,
        "product_name": "InvestAssure",
        "product_uin_number": "110L035V01",
        "is_reinvest_applicable": "N",
        "outstanding_payout": null,
        "unclaimed_amount": null,
        "is_neft_registered": "Y",
        "si_registered": "N",
        "last_premium_paid": "2018-07-31T18:30:00.000+00:00",
        "owner_email": "siddhesh.parab@teknopoint.in",
        "owner_mobile_no": "8655525770",
        "owner_gender": "M",
        "product_cd": "45AUL30LN2",
        "owner_panno": null,
        "email_id_last_updated": "2006-01-04T18:30:00.000+00:00",
        "sum_assured": "4500000"
    },
    {
        "policy_no": "U010058453",
        "alphaID": 20057477,
        "owner_name": "siddhesh parab",
        "insured_name": "siddhesh parab",
        "insured_dob": "1964-01-24T18:30:00.000+00:00",
        "insured_email": "siddhesh.parab@teknopoint.in",
        "insured_mobile_no": "8655525770",
        "premium_mode": "03",
        "policy_status": "20",
        "assignment_status": null,
        "insured_panNo": null,
        "is_ulip": "Y",
        "policy_issuance_date": "2005-06-26T18:30:00.000+00:00",
        "contact_no_last_updated": "2005-06-26T18:30:00.000+00:00",
        "insured_email_id_last_updated": null,
        "bank_account_no": "006207407243",
        "whatsapp_opt_in_status": "Y",
        "eia_account_number": 5000000221290,
        "product_name": "InvestAssure",
        "product_uin_number": "110L035V01",
        "is_reinvest_applicable": "N",
        "outstanding_payout": null,
        "unclaimed_amount": null,
        "is_neft_registered": "Y",
        "si_registered": "Y",
        "last_premium_paid": "2019-12-27T18:30:00.000+00:00",
        "owner_email": "siddhesh.parab@teknopoint.in",
        "owner_mobile_no": "8655525770",
        "owner_gender": "M",
        "product_cd": "45AUL20LN2",
        "owner_panno": null,
        "email_id_last_updated": "2005-06-26T18:30:00.000+00:00",
        "sum_assured": "225000"
    },
    {
        "policy_no": "C284182786",
        "alphaID": 2111124383,
        "owner_name": "siddhesh",
        "insured_name": "siddhesh",
        "insured_dob": "1978-11-19T18:30:00.000+00:00",
        "insured_email": "siddhesh.parab@teknopoint.in",
        "insured_mobile_no": "8655525770",
        "premium_mode": "12",
        "policy_status": "20",
        "assignment_status": null,
        "insured_panNo": "AAHPG5051C",
        "is_ulip": "N",
        "policy_issuance_date": "2015-09-25T18:30:00.000+00:00",
        "contact_no_last_updated": "2015-09-25T18:30:00.000+00:00",
        "insured_email_id_last_updated": null,
        "bank_account_no": "9432098444",
        "whatsapp_opt_in_status": "Y",
        "eia_account_number": null,
        "product_name": "iRaksha Supreme - Limited pay 10 years",
        "product_uin_number": "110N104V02",
        "is_reinvest_applicable": "N",
        "outstanding_payout": null,
        "unclaimed_amount": null,
        "is_neft_registered": "Y",
        "si_registered": "Y",
        "last_premium_paid": "2020-09-27T18:30:00.000+00:00",
        "owner_email": "siddhesh.parab@teknopoint.in",
        "owner_mobile_no": "8655525770",
        "owner_gender": "M",
        "product_cd": "IRSL10N1V2",
        "owner_panno": null,
        "email_id_last_updated": "2015-09-25T18:30:00.000+00:00",
        "sum_assured": "100000000"
    },
    {
        "policy_no": "U000406138",
        "alphaID": 7088856,
        "owner_name": "siddhesh parab",
        "insured_name": "siddhesh parab",
        "insured_dob": "1976-02-28T18:30:00.000+00:00",
        "insured_email": "siddhesh.parab@teknopoint.in",
        "insured_mobile_no": "8655525770",
        "premium_mode": "03",
        "policy_status": "20",
        "assignment_status": null,
        "insured_panNo": null,
        "is_ulip": "Y",
        "policy_issuance_date": "2004-12-13T18:30:00.000+00:00",
        "contact_no_last_updated": "2004-12-13T18:30:00.000+00:00",
        "insured_email_id_last_updated": null,
        "bank_account_no": null,
        "whatsapp_opt_in_status": "Y",
        "eia_account_number": null,
        "product_name": "InvestAssure",
        "product_uin_number": "110L035V01",
        "is_reinvest_applicable": "N",
        "outstanding_payout": null,
        "unclaimed_amount": null,
        "is_neft_registered": "N",
        "si_registered": "N",
        "last_premium_paid": "2020-03-13T18:30:00.000+00:00",
        "owner_email": "siddhesh.parab@teknopoint.in",
        "owner_mobile_no": "8655525770",
        "owner_gender": "M",
        "product_cd": "45UL20LN1",
        "owner_panno": null,
        "email_id_last_updated": "2004-12-13T18:30:00.000+00:00",
        "sum_assured": "270000"
    },
    {
        "policy_no": "C080016166",
        "alphaID": 172915216,
        "owner_name": "siddhesh parab",
        "insured_name": "siddhesh parab",
        "insured_dob": "1971-02-14T18:30:00.000+00:00",
        "insured_email": "siddhesh.parab@teknopoint.in",
        "insured_mobile_no": "8655525770",
        "premium_mode": "12",
        "policy_status": "20",
        "assignment_status": null,
        "insured_panNo": null,
        "is_ulip": "N",
        "policy_issuance_date": "2021-02-13T18:30:00.000+00:00",
        "contact_no_last_updated": "2021-02-13T18:30:00.000+00:00",
        "insured_email_id_last_updated": null,
        "bank_account_no": null,
        "whatsapp_opt_in_status": null,
        "eia_account_number": 1000040879585,
        "product_name": "SIP-OptII 7 PPT for PT 15yrs",
        "product_uin_number": "110N126V04",
        "is_reinvest_applicable": "N",
        "outstanding_payout": null,
        "unclaimed_amount": null,
        "is_neft_registered": "N",
        "si_registered": "N",
        "last_premium_paid": null,
        "owner_email": "siddhesh.parab@teknopoint.in",
        "owner_mobile_no": "8655525770",
        "owner_gender": "M",
        "product_cd": "SIP7EV4N1",
        "owner_panno": null,
        "email_id_last_updated": "2021-02-13T18:30:00.000+00:00",
        "sum_assured": "396000"
    },
    {
        "policy_no": "U192949134",
        "alphaID": 297599742,
        "owner_name": "Siddhesh Parab",
        "insured_name": "Siddhesh Parab",
        "insured_dob": "1989-09-24T18:30:00.000+00:00",
        "insured_email": "siddhesh.parab@teknopoint.in",
        "insured_mobile_no": "8655525770",
        "premium_mode": "12",
        "policy_status": "20",
        "assignment_status": null,
        "insured_panNo": null,
        "is_ulip": "Y",
        "policy_issuance_date": "2021-05-26T18:30:00.000+00:00",
        "contact_no_last_updated": "2021-05-26T18:30:00.000+00:00",
        "insured_email_id_last_updated": null,
        "bank_account_no": null,
        "whatsapp_opt_in_status": null,
        "eia_account_number": 1000046304344,
        "product_name": "Wealth Pro 7 Pay Limited term - Age Band (31-40)",
        "product_uin_number": "110L111V03",
        "is_reinvest_applicable": "N",
        "outstanding_payout": null,
        "unclaimed_amount": null,
        "is_neft_registered": "N",
        "si_registered": "Y",
        "last_premium_paid": null,
        "owner_email": "siddhesh.parab@teknopoint.in",
        "owner_mobile_no": "8655525770",
        "owner_gender": "M",
        "product_cd": "WPR7UL3N2",
        "owner_panno": null,
        "email_id_last_updated": "2021-05-26T18:30:00.000+00:00",
        "sum_assured": "2500000"
    },
    {
        "policy_no": "U213387730",
        "alphaID": 290028364,
        "owner_name": "Siddhesh Parab",
        "insured_name": "Siddhesh Parab",
        "insured_dob": "1984-09-18T18:30:00.000+00:00",
        "insured_email": null,
        "insured_mobile_no": "8655525770",
        "premium_mode": "12",
        "policy_status": "20",
        "assignment_status": null,
        "insured_panNo": null,
        "is_ulip": "Y",
        "policy_issuance_date": "2021-02-25T18:30:00.000+00:00",
        "contact_no_last_updated": "2021-02-25T18:30:00.000+00:00",
        "insured_email_id_last_updated": null,
        "bank_account_no": null,
        "whatsapp_opt_in_status": null,
        "eia_account_number": 1000041456063,
        "product_name": "Tata AIA Life Insurance Smart Sampoorna Raksha 5 Pay",
        "product_uin_number": "110L111V03",
        "is_reinvest_applicable": "N",
        "outstanding_payout": null,
        "unclaimed_amount": null,
        "is_neft_registered": "N",
        "si_registered": "N",
        "last_premium_paid": null,
        "owner_email": null,
        "owner_mobile_no": "8655525770",
        "owner_gender": "F",
        "product_cd": "SSR5ULV1",
        "owner_panno": null,
        "email_id_last_updated": "2021-02-25T18:30:00.000+00:00",
        "sum_assured": "6500000"
    },
    {
        "policy_no": "C569683544",
        "alphaID": 1465239778,
        "owner_name": "siddhesh parab",
        "insured_name": "siddhesh parab",
        "insured_dob": "1990-12-31T18:30:00.000+00:00",
        "insured_email": "siddhesh.parab@teknopoint.in",
        "insured_mobile_no": "8655525770",
        "premium_mode": "12",
        "policy_status": "33",
        "assignment_status": null,
        "insured_panNo": "AZEPT6688Z",
        "is_ulip": "N",
        "policy_issuance_date": "2018-11-14T18:30:00.000+00:00",
        "contact_no_last_updated": "2018-11-14T18:30:00.000+00:00",
        "insured_email_id_last_updated": null,
        "bank_account_no": null,
        "whatsapp_opt_in_status": null,
        "eia_account_number": 9001465239778,
        "product_name": "Secure 7",
        "product_uin_number": "110N107V01",
        "is_reinvest_applicable": "N",
        "outstanding_payout": null,
        "unclaimed_amount": null,
        "is_neft_registered": "N",
        "si_registered": "Y",
        "last_premium_paid": "2018-11-14T18:30:00.000+00:00",
        "owner_email": "siddhesh.parab@teknopoint.in",
        "owner_mobile_no": "8655525770",
        "owner_gender": "M",
        "product_cd": "SEC7V1N1",
        "owner_panno": "AZEPT6688Z",
        "email_id_last_updated": "2018-11-14T18:30:00.000+00:00",
        "sum_assured": "571429"
    },
    {
        "policy_no": "U219095945",
        "alphaID": 291190905,
        "owner_name": "Siddhesh Parab",
        "insured_name": "Siddhesh Parab",
        "insured_dob": "1983-03-19T18:30:00.000+00:00",
        "insured_email": null,
        "insured_mobile_no": "8655525770",
        "premium_mode": "12",
        "policy_status": "20",
        "assignment_status": null,
        "insured_panNo": null,
        "is_ulip": "Y",
        "policy_issuance_date": "2021-03-09T18:30:00.000+00:00",
        "contact_no_last_updated": "2021-03-09T18:30:00.000+00:00",
        "insured_email_id_last_updated": null,
        "bank_account_no": null,
        "whatsapp_opt_in_status": null,
        "eia_account_number": 1000041584206,
        "product_name": "Tata AIA Life Insurance Smart Sampoorna Raksha 5 Pay",
        "product_uin_number": "110L111V03",
        "is_reinvest_applicable": "N",
        "outstanding_payout": null,
        "unclaimed_amount": null,
        "is_neft_registered": "N",
        "si_registered": "N",
        "last_premium_paid": null,
        "owner_email": null,
        "owner_mobile_no": "8655525770",
        "owner_gender": "M",
        "product_cd": "SSR5ULV1",
        "owner_panno": null,
        "email_id_last_updated": "2021-03-09T18:30:00.000+00:00",
        "sum_assured": "6000000"
    },
    {
        "policy_no": "C001919080",
        "alphaID": 2079796358,
        "owner_name": "siddhesh parab",
        "insured_name": "siddhesh parab",
        "insured_dob": "1993-01-26T18:30:00.000+00:00",
        "insured_email": "siddhesh.parab@teknopoint.in",
        "insured_mobile_no": "8655525770",
        "premium_mode": "12",
        "policy_status": "20",
        "assignment_status": null,
        "insured_panNo": null,
        "is_ulip": "N",
        "policy_issuance_date": "2012-12-28T18:30:00.000+00:00",
        "contact_no_last_updated": "2012-12-28T18:30:00.000+00:00",
        "insured_email_id_last_updated": null,
        "bank_account_no": null,
        "whatsapp_opt_in_status": null,
        "eia_account_number": null,
        "product_name": "MAHALIFE GOLD",
        "product_uin_number": "110N029V01",
        "is_reinvest_applicable": "Y",
        "outstanding_payout": null,
        "unclaimed_amount": null,
        "is_neft_registered": "N",
        "si_registered": "Y",
        "last_premium_paid": "2018-12-30T18:30:00.000+00:00",
        "owner_email": "siddhesh.parab@teknopoint.in",
        "owner_mobile_no": "8655525770",
        "owner_gender": "M",
        "product_cd": "15LPWLP1",
        "owner_panno": null,
        "email_id_last_updated": "2012-12-28T18:30:00.000+00:00",
        "sum_assured": "220000"
    },
    {
        "policy_no": "C195181180",
        "alphaID": 290326248,
        "owner_name": "siddhesh parab",
        "insured_name": "siddhesh parab",
        "insured_dob": "1989-09-19T18:30:00.000+00:00",
        "insured_email": "siddhesh.parab@teknopoint.in",
        "insured_mobile_no": "8655525770",
        "premium_mode": "12",
        "policy_status": "20",
        "assignment_status": null,
        "insured_panNo": "DHGPS7805R",
        "is_ulip": "N",
        "policy_issuance_date": "2021-02-27T18:30:00.000+00:00",
        "contact_no_last_updated": "2021-02-27T18:30:00.000+00:00",
        "insured_email_id_last_updated": null,
        "bank_account_no": null,
        "whatsapp_opt_in_status": null,
        "eia_account_number": 4100002964581,
        "product_name": "MRS - Limited Pay 12 without Life Stage Plus",
        "product_uin_number": "110N102V03",
        "is_reinvest_applicable": "N",
        "outstanding_payout": null,
        "unclaimed_amount": null,
        "is_neft_registered": "N",
        "si_registered": "N",
        "last_premium_paid": null,
        "owner_email": "siddhesh.parab@teknopoint.in",
        "owner_mobile_no": "8655525770",
        "owner_gender": "M",
        "product_cd": "MRSL12N2V3",
        "owner_panno": null,
        "email_id_last_updated": "2021-02-27T18:30:00.000+00:00",
        "sum_assured": "5000000"
    },
    {
        "policy_no": "C053940560",
        "alphaID": 6363800,
        "owner_name": "Siddhesh Parab",
        "insured_name": "Siddhesh Parab",
        "insured_dob": "1981-02-23T18:30:00.000+00:00",
        "insured_email": "siddhesh.parab@teknopoint.in",
        "insured_mobile_no": "8655525770",
        "premium_mode": "01",
        "policy_status": "23",
        "assignment_status": null,
        "insured_panNo": "BGZPM4457P",
        "is_ulip": "N",
        "policy_issuance_date": "2017-06-07T18:30:00.000+00:00",
        "contact_no_last_updated": "2021-04-13T18:30:00.000+00:00",
        "insured_email_id_last_updated": null,
        "bank_account_no": "007077000000151",
        "whatsapp_opt_in_status": null,
        "eia_account_number": 9000006363800,
        "product_name": "GIP -12 PPT Income Term 10",
        "product_uin_number": "110N131V01",
        "is_reinvest_applicable": "N",
        "outstanding_payout": null,
        "unclaimed_amount": null,
        "is_neft_registered": "Y",
        "si_registered": "Y",
        "last_premium_paid": "2017-06-07T18:30:00.000+00:00",
        "owner_email": "siddhesh.parab@teknopoint.in",
        "owner_mobile_no": "8655525770",
        "owner_gender": "M",
        "product_cd": "GIP12I10N1",
        "owner_panno": "FEALH9010E",
        "email_id_last_updated": "2017-06-07T18:30:00.000+00:00",
        "sum_assured": "1009200"
    },
    {
        "policy_no": "U242456933",
        "alphaID": 291128869,
        "owner_name": "Siddhesh Parab",
        "insured_name": "Siddhesh Parab",
        "insured_dob": "1991-03-08T18:30:00.000+00:00",
        "insured_email": null,
        "insured_mobile_no": "8655525770",
        "premium_mode": "12",
        "policy_status": "20",
        "assignment_status": null,
        "insured_panNo": null,
        "is_ulip": "Y",
        "policy_issuance_date": "2021-03-07T18:30:00.000+00:00",
        "contact_no_last_updated": "2021-03-07T18:30:00.000+00:00",
        "insured_email_id_last_updated": null,
        "bank_account_no": null,
        "whatsapp_opt_in_status": null,
        "eia_account_number": 1000042248698,
        "product_name": "Tata AIA Life Insurance Smart Sampoorna Raksha 5 Pay",
        "product_uin_number": "110L111V03",
        "is_reinvest_applicable": "N",
        "outstanding_payout": null,
        "unclaimed_amount": null,
        "is_neft_registered": "N",
        "si_registered": "Y",
        "last_premium_paid": null,
        "owner_email": null,
        "owner_mobile_no": "8655525770",
        "owner_gender": "M",
        "product_cd": "SSR5ULV1",
        "owner_panno": null,
        "email_id_last_updated": "2021-03-07T18:30:00.000+00:00",
        "sum_assured": "10000000"
    },
    {
        "policy_no": "C133234413",
        "alphaID": 227957899,
        "owner_name": "Siddhesh Parab",
        "insured_name": "Siddhesh Parab",
        "insured_dob": "2004-07-17T18:30:00.000+00:00",
        "insured_email": "siddhesh.parab@teknopoint.in",
        "insured_mobile_no": "8655525770",
        "premium_mode": "01",
        "policy_status": "24",
        "assignment_status": null,
        "insured_panNo": null,
        "is_ulip": "N",
        "policy_issuance_date": "2018-07-04T18:30:00.000+00:00",
        "contact_no_last_updated": "2021-04-13T18:30:00.000+00:00",
        "insured_email_id_last_updated": null,
        "bank_account_no": "700045483161",
        "whatsapp_opt_in_status": null,
        "eia_account_number": 9000227957899,
        "product_name": "Diamond Saving Plan-Pay 8 yrs for PT 18 yrs",
        "product_uin_number": "110N133V01",
        "is_reinvest_applicable": "N",
        "outstanding_payout": null,
        "unclaimed_amount": null,
        "is_neft_registered": "Y",
        "si_registered": "Y",
        "last_premium_paid": "2019-07-14T18:30:00.000+00:00",
        "owner_email": "siddhesh.parab@teknopoint.in",
        "owner_mobile_no": "8655525770",
        "owner_gender": "M",
        "product_cd": "DSP8V1P1",
        "owner_panno": "BDILO8946C",
        "email_id_last_updated": "2018-07-04T18:30:00.000+00:00",
        "sum_assured": "330000"
    },
    {
        "policy_no": "C269936067",
        "alphaID": 1465175885,
        "owner_name": "siddhesh parab",
        "insured_name": "siddhesh parab",
        "insured_dob": "1991-09-04T18:30:00.000+00:00",
        "insured_email": "siddhesh.parab@teknopoint.in",
        "insured_mobile_no": "8655525770",
        "premium_mode": "12",
        "policy_status": "33",
        "assignment_status": null,
        "insured_panNo": "APJPK9049B",
        "is_ulip": "N",
        "policy_issuance_date": "2018-09-03T18:30:00.000+00:00",
        "contact_no_last_updated": "2018-09-03T18:30:00.000+00:00",
        "insured_email_id_last_updated": null,
        "bank_account_no": null,
        "whatsapp_opt_in_status": null,
        "eia_account_number": 9001465175885,
        "product_name": "SIP-OptI 7 PPT for PT 15 yrs",
        "product_uin_number": "110N126V02",
        "is_reinvest_applicable": "N",
        "outstanding_payout": null,
        "unclaimed_amount": null,
        "is_neft_registered": "N",
        "si_registered": "Y",
        "last_premium_paid": "2018-09-25T18:30:00.000+00:00",
        "owner_email": "siddhesh.parab@teknopoint.in",
        "owner_mobile_no": "8655525770",
        "owner_gender": "M",
        "product_cd": "SIP7IV1N2",
        "owner_panno": "APJPK9049B",
        "email_id_last_updated": "2018-09-03T18:30:00.000+00:00",
        "sum_assured": "52171"
    },
    {
        "policy_no": "C221651623",
        "alphaID": 295006321,
        "owner_name": "siddhesh parab",
        "insured_name": "siddhesh parab",
        "insured_dob": "1986-09-06T18:30:00.000+00:00",
        "insured_email": "siddhesh.parab@teknopoint.in",
        "insured_mobile_no": "8655525770",
        "premium_mode": "12",
        "policy_status": "20",
        "assignment_status": null,
        "insured_panNo": null,
        "is_ulip": "N",
        "policy_issuance_date": "2021-04-13T18:30:00.000+00:00",
        "contact_no_last_updated": "2021-04-13T18:30:00.000+00:00",
        "insured_email_id_last_updated": null,
        "bank_account_no": null,
        "whatsapp_opt_in_status": null,
        "eia_account_number": 1000043292913,
        "product_name": "MRS - Limited Pay 10 without Life Stage Plus",
        "product_uin_number": "110N102V03",
        "is_reinvest_applicable": "N",
        "outstanding_payout": null,
        "unclaimed_amount": null,
        "is_neft_registered": "N",
        "si_registered": "N",
        "last_premium_paid": "2021-04-13T18:30:00.000+00:00",
        "owner_email": "siddhesh.parab@teknopoint.in",
        "owner_mobile_no": "8655525770",
        "owner_gender": "M",
        "product_cd": "MRSL10N2V3",
        "owner_panno": null,
        "email_id_last_updated": "2021-04-13T18:30:00.000+00:00",
        "sum_assured": "5000000"
    },
    {
        "policy_no": "U036861352",
        "alphaID": 289538577,
        "owner_name": "Siddhesh Parab",
        "insured_name": "Siddhesh Parab",
        "insured_dob": "1989-04-04T18:30:00.000+00:00",
        "insured_email": null,
        "insured_mobile_no": "8655525770",
        "premium_mode": "12",
        "policy_status": "20",
        "assignment_status": null,
        "insured_panNo": null,
        "is_ulip": "Y",
        "policy_issuance_date": "2021-02-20T18:30:00.000+00:00",
        "contact_no_last_updated": "2021-02-20T18:30:00.000+00:00",
        "insured_email_id_last_updated": null,
        "bank_account_no": null,
        "whatsapp_opt_in_status": null,
        "eia_account_number": 1000040860174,
        "product_name": "Tata AIA Life Insurance Smart Sampoorna Raksha 10 Pay",
        "product_uin_number": "110L111V03",
        "is_reinvest_applicable": "N",
        "outstanding_payout": null,
        "unclaimed_amount": null,
        "is_neft_registered": "N",
        "si_registered": "Y",
        "last_premium_paid": null,
        "owner_email": null,
        "owner_mobile_no": "8655525770",
        "owner_gender": "F",
        "product_cd": "SSR10ULV1",
        "owner_panno": null,
        "email_id_last_updated": "2021-02-20T18:30:00.000+00:00",
        "sum_assured": "20000000"
    },
    {
        "policy_no": "C217802321",
        "alphaID": 288340157,
        "owner_name": "siddhesh parab",
        "insured_name": "siddhesh parab",
        "insured_dob": "1982-07-14T18:30:00.000+00:00",
        "insured_email": "siddhesh.parab@teknopoint.in",
        "insured_mobile_no": "8655525770",
        "premium_mode": "12",
        "policy_status": "20",
        "assignment_status": null,
        "insured_panNo": "AOJPR2010J",
        "is_ulip": "N",
        "policy_issuance_date": "2021-05-13T18:30:00.000+00:00",
        "contact_no_last_updated": "2021-05-13T18:30:00.000+00:00",
        "insured_email_id_last_updated": null,
        "bank_account_no": null,
        "whatsapp_opt_in_status": null,
        "eia_account_number": 1000040598482,
        "product_name": "Value Income Plan - Non-ELC Option",
        "product_uin_number": "110N153V01",
        "is_reinvest_applicable": "N",
        "outstanding_payout": null,
        "unclaimed_amount": null,
        "is_neft_registered": "N",
        "si_registered": "N",
        "last_premium_paid": null,
        "owner_email": "siddhesh.parab@teknopoint.in",
        "owner_mobile_no": "8655525770",
        "owner_gender": "M",
        "product_cd": "VIPN1V1",
        "owner_panno": null,
        "email_id_last_updated": "2021-05-13T18:30:00.000+00:00",
        "sum_assured": "402685"
    },
    {
        "policy_no": "C206191784",
        "alphaID": 238444863,
        "owner_name": "siddhesh parab",
        "insured_name": "siddhesh parab",
        "insured_dob": "1963-02-12T18:30:00.000+00:00",
        "insured_email": "siddhesh.parab@teknopoint.in",
        "insured_mobile_no": "8655525770",
        "premium_mode": "12",
        "policy_status": "20",
        "assignment_status": null,
        "insured_panNo": "AZSPS3545B",
        "is_ulip": "N",
        "policy_issuance_date": "2021-05-25T18:30:00.000+00:00",
        "contact_no_last_updated": "2021-05-25T18:30:00.000+00:00",
        "insured_email_id_last_updated": null,
        "bank_account_no": null,
        "whatsapp_opt_in_status": null,
        "eia_account_number": 5000011561998,
        "product_name": "Diamond Saving Plan V2-Pay 8 yrs for PT 18 yrs",
        "product_uin_number": "110N133V02",
        "is_reinvest_applicable": "N",
        "outstanding_payout": null,
        "unclaimed_amount": null,
        "is_neft_registered": "N",
        "si_registered": "Y",
        "last_premium_paid": null,
        "owner_email": "siddhesh.parab@teknopoint.in",
        "owner_mobile_no": "8655525770",
        "owner_gender": "M",
        "product_cd": "DSP8V2P1",
        "owner_panno": null,
        "email_id_last_updated": "2021-05-25T18:30:00.000+00:00",
        "sum_assured": "275000"
    },
    {
        "policy_no": "C269935990",
        "alphaID": 1465175803,
        "owner_name": "siddhesh parab",
        "insured_name": "siddhesh parab",
        "insured_dob": "1988-11-19T18:30:00.000+00:00",
        "insured_email": "siddhesh.parab@teknopoint.in",
        "insured_mobile_no": "8655525770",
        "premium_mode": "12",
        "policy_status": "33",
        "assignment_status": null,
        "insured_panNo": "APJPK9049B",
        "is_ulip": "N",
        "policy_issuance_date": "2018-09-25T18:30:00.000+00:00",
        "contact_no_last_updated": "2018-09-25T18:30:00.000+00:00",
        "insured_email_id_last_updated": null,
        "bank_account_no": null,
        "whatsapp_opt_in_status": null,
        "eia_account_number": 9001465175803,
        "product_name": "SIP-OptI 7 PPT for PT 15 yrs",
        "product_uin_number": "110N126V02",
        "is_reinvest_applicable": "N",
        "outstanding_payout": null,
        "unclaimed_amount": null,
        "is_neft_registered": "N",
        "si_registered": "Y",
        "last_premium_paid": "2018-09-25T18:30:00.000+00:00",
        "owner_email": "siddhesh.parab@teknopoint.in",
        "owner_mobile_no": "8655525770",
        "owner_gender": "M",
        "product_cd": "SIP7IV1N2",
        "owner_panno": "APJPK9049B",
        "email_id_last_updated": "2018-09-25T18:30:00.000+00:00",
        "sum_assured": "52171"
    },
    {
        "policy_no": "C208965691",
        "alphaID": 2121111056,
        "owner_name": "siddhesh parab",
        "insured_name": "siddhesh parab",
        "insured_dob": "1981-12-31T18:30:00.000+00:00",
        "insured_email": null,
        "insured_mobile_no": "8655525770",
        "premium_mode": "12",
        "policy_status": "33",
        "assignment_status": null,
        "insured_panNo": null,
        "is_ulip": "N",
        "policy_issuance_date": "2016-03-30T18:30:00.000+00:00",
        "contact_no_last_updated": "2021-04-05T18:30:00.000+00:00",
        "insured_email_id_last_updated": null,
        "bank_account_no": "66041786709",
        "whatsapp_opt_in_status": null,
        "eia_account_number": null,
        "product_name": "Money Maxima",
        "product_uin_number": "110N109V01",
        "is_reinvest_applicable": "N",
        "outstanding_payout": null,
        "unclaimed_amount": null,
        "is_neft_registered": "Y",
        "si_registered": "Y",
        "last_premium_paid": "2021-03-30T18:30:00.000+00:00",
        "owner_email": null,
        "owner_mobile_no": "8655525770",
        "owner_gender": "M",
        "product_cd": "MMXV1N1",
        "owner_panno": null,
        "email_id_last_updated": "2016-03-30T18:30:00.000+00:00",
        "sum_assured": "67838"
    },
    {
        "policy_no": "U000546975",
        "alphaID": 29578434,
        "owner_name": "siddhesh parab",
        "insured_name": "siddhesh parab",
        "insured_dob": "1954-09-01T18:30:00.000+00:00",
        "insured_email": "siddhesh.parab@teknopoint.in",
        "insured_mobile_no": "8655525770",
        "premium_mode": "06",
        "policy_status": "20",
        "assignment_status": null,
        "insured_panNo": null,
        "is_ulip": "Y",
        "policy_issuance_date": "2007-04-23T18:30:00.000+00:00",
        "contact_no_last_updated": "2007-04-23T18:30:00.000+00:00",
        "insured_email_id_last_updated": null,
        "bank_account_no": "040400700074199",
        "whatsapp_opt_in_status": null,
        "eia_account_number": null,
        "product_name": "InvestAssureII",
        "product_uin_number": "110L048V01",
        "is_reinvest_applicable": "N",
        "outstanding_payout": null,
        "unclaimed_amount": null,
        "is_neft_registered": "Y",
        "si_registered": "N",
        "last_premium_paid": "2019-10-31T18:30:00.000+00:00",
        "owner_email": "siddhesh.parab@teknopoint.in",
        "owner_mobile_no": "8655525770",
        "owner_gender": "M",
        "product_cd": "55MUL20LN2",
        "owner_panno": null,
        "email_id_last_updated": "2007-04-23T18:30:00.000+00:00",
        "sum_assured": "240000"
    },
    {
        "policy_no": "U000541527",
        "alphaID": 18839139,
        "owner_name": "Siddhesh Parab",
        "insured_name": "Siddhesh Parab",
        "insured_dob": "1962-05-15T18:30:00.000+00:00",
        "insured_email": null,
        "insured_mobile_no": "8655525770",
        "premium_mode": "01",
        "policy_status": "20",
        "assignment_status": null,
        "insured_panNo": null,
        "is_ulip": "Y",
        "policy_issuance_date": "2006-10-02T18:30:00.000+00:00",
        "contact_no_last_updated": "2006-10-02T18:30:00.000+00:00",
        "insured_email_id_last_updated": null,
        "bank_account_no": "40779979639",
        "whatsapp_opt_in_status": null,
        "eia_account_number": null,
        "product_name": "InvestAssureII",
        "product_uin_number": "110L048V01",
        "is_reinvest_applicable": "N",
        "outstanding_payout": null,
        "unclaimed_amount": null,
        "is_neft_registered": "Y",
        "si_registered": "Y",
        "last_premium_paid": "2020-04-02T18:30:00.000+00:00",
        "owner_email": null,
        "owner_mobile_no": "8655525770",
        "owner_gender": "M",
        "product_cd": "45MUL20LN1",
        "owner_panno": null,
        "email_id_last_updated": "2006-10-02T18:30:00.000+00:00",
        "sum_assured": "270000"
    },
    {
        "policy_no": "C000053141",
        "alphaID": 1052266,
        "owner_name": "siddhesh parab",
        "insured_name": "siddhesh parab",
        "insured_dob": "1962-11-08T18:30:00.000+00:00",
        "insured_email": null,
        "insured_mobile_no": "8655525770",
        "premium_mode": "06",
        "policy_status": "20",
        "assignment_status": null,
        "insured_panNo": null,
        "is_ulip": "N",
        "policy_issuance_date": "2002-10-27T18:30:00.000+00:00",
        "contact_no_last_updated": "2002-10-27T18:30:00.000+00:00",
        "insured_email_id_last_updated": null,
        "bank_account_no": "40071537561",
        "whatsapp_opt_in_status": null,
        "eia_account_number": null,
        "product_name": "ASSURE 20 YEARS SECURITY & GROWTH PLAN",
        "product_uin_number": "110N002V01",
        "is_reinvest_applicable": "N",
        "outstanding_payout": null,
        "unclaimed_amount": null,
        "is_neft_registered": "Y",
        "si_registered": "N",
        "last_premium_paid": "2019-10-27T18:30:00.000+00:00",
        "owner_email": null,
        "owner_mobile_no": "8655525770",
        "owner_gender": null,
        "product_cd": "20ENDP1",
        "owner_panno": null,
        "email_id_last_updated": "2002-10-27T18:30:00.000+00:00",
        "sum_assured": "200000"
    },
    {
        "policy_no": "C284401399",
        "alphaID": 2122967090,
        "owner_name": "siddhesh",
        "insured_name": "siddhesh",
        "insured_dob": "1977-02-21T18:30:00.000+00:00",
        "insured_email": "siddhesh.parab@teknopoint.in",
        "insured_mobile_no": "8655525770",
        "premium_mode": "12",
        "policy_status": "33",
        "assignment_status": null,
        "insured_panNo": "ADXPN7445C",
        "is_ulip": "N",
        "policy_issuance_date": "2016-05-10T18:30:00.000+00:00",
        "contact_no_last_updated": "2016-05-10T18:30:00.000+00:00",
        "insured_email_id_last_updated": null,
        "bank_account_no": "0603708000046750",
        "whatsapp_opt_in_status": null,
        "eia_account_number": null,
        "product_name": "Fortune Guarantee",
        "product_uin_number": "110N120V01",
        "is_reinvest_applicable": "N",
        "outstanding_payout": null,
        "unclaimed_amount": null,
        "is_neft_registered": "Y",
        "si_registered": "N",
        "last_premium_paid": "2019-10-10T18:30:00.000+00:00",
        "owner_email": "siddhesh.parab@teknopoint.in",
        "owner_mobile_no": "8655525770",
        "owner_gender": "M",
        "product_cd": "FGV1N1",
        "owner_panno": null,
        "email_id_last_updated": "2016-05-10T18:30:00.000+00:00",
        "sum_assured": "338400"
    },
    {
        "policy_no": "U008084536",
        "alphaID": 8854601,
        "owner_name": "siddhesh",
        "insured_name": "siddhesh",
        "insured_dob": "1970-05-26T18:30:00.000+00:00",
        "insured_email": "xangars.sahilr@xangarsinfra.com",
        "insured_mobile_no": "8655525770",
        "premium_mode": "03",
        "policy_status": "20",
        "assignment_status": null,
        "insured_panNo": null,
        "is_ulip": "Y",
        "policy_issuance_date": "2009-08-20T18:30:00.000+00:00",
        "contact_no_last_updated": "2009-08-20T18:30:00.000+00:00",
        "insured_email_id_last_updated": null,
        "bank_account_no": "70600700625330",
        "whatsapp_opt_in_status": null,
        "eia_account_number": null,
        "product_name": "InvestAssure Flexi",
        "product_uin_number": "110L055V01",
        "is_reinvest_applicable": "N",
        "outstanding_payout": null,
        "unclaimed_amount": null,
        "is_neft_registered": "Y",
        "si_registered": "Y",
        "last_premium_paid": "2020-02-20T18:30:00.000+00:00",
        "owner_email": "xangars.sahilr@xangarsinfra.com",
        "owner_mobile_no": "8655525770",
        "owner_gender": "M",
        "product_cd": "IX2ULN1",
        "owner_panno": null,
        "email_id_last_updated": "2009-08-20T18:30:00.000+00:00",
        "sum_assured": "150000"
    },
    {
        "policy_no": "C209404614",
        "alphaID": 52291160,
        "owner_name": "siddhesh parab",
        "insured_name": "siddhesh parab",
        "insured_dob": "2010-11-06T18:30:00.000+00:00",
        "insured_email": "siddhesh.parab@teknopoint.in",
        "insured_mobile_no": "8655525770",
        "premium_mode": "12",
        "policy_status": "20",
        "assignment_status": null,
        "insured_panNo": null,
        "is_ulip": "N",
        "policy_issuance_date": "2011-11-24T18:30:00.000+00:00",
        "contact_no_last_updated": "2014-11-11T18:30:00.000+00:00",
        "insured_email_id_last_updated": null,
        "bank_account_no": null,
        "whatsapp_opt_in_status": null,
        "eia_account_number": null,
        "product_name": "ASSURE EduCare at 18",
        "product_uin_number": "110N022V01",
        "is_reinvest_applicable": "N",
        "outstanding_payout": null,
        "unclaimed_amount": null,
        "is_neft_registered": "N",
        "si_registered": "Y",
        "last_premium_paid": "2018-12-06T18:30:00.000+00:00",
        "owner_email": "siddhesh.parab@teknopoint.in",
        "owner_mobile_no": "8655525770",
        "owner_gender": "M",
        "product_cd": "END18P2",
        "owner_panno": "FCVLV1848A",
        "email_id_last_updated": "2011-11-24T18:30:00.000+00:00",
        "sum_assured": "995000"
    },
    {
        "policy_no": "C192355841",
        "alphaID": 293461962,
        "owner_name": "siddhesh parab",
        "insured_name": "siddhesh parab",
        "insured_dob": "1972-05-29T18:30:00.000+00:00",
        "insured_email": "siddhesh.parab@teknopoint.in",
        "insured_mobile_no": "8655525770",
        "premium_mode": "12",
        "policy_status": "20",
        "assignment_status": null,
        "insured_panNo": null,
        "is_ulip": "N",
        "policy_issuance_date": "2021-03-27T18:30:00.000+00:00",
        "contact_no_last_updated": "2021-03-27T18:30:00.000+00:00",
        "insured_email_id_last_updated": null,
        "bank_account_no": null,
        "whatsapp_opt_in_status": null,
        "eia_account_number": 1000043380215,
        "product_name": "SIP-OptI 10 PPT for PT 21yrs",
        "product_uin_number": "110N126V04",
        "is_reinvest_applicable": "N",
        "outstanding_payout": null,
        "unclaimed_amount": null,
        "is_neft_registered": "N",
        "si_registered": "N",
        "last_premium_paid": null,
        "owner_email": "siddhesh.parab@teknopoint.in",
        "owner_mobile_no": "8655525770",
        "owner_gender": "M",
        "product_cd": "SIP10IV4N1",
        "owner_panno": null,
        "email_id_last_updated": "2021-03-27T18:30:00.000+00:00",
        "sum_assured": "561000"
    },
    {
        "policy_no": "U203947355",
        "alphaID": 296652024,
        "owner_name": "siddhesh parab",
        "insured_name": "siddhesh parab",
        "insured_dob": "1972-05-21T18:30:00.000+00:00",
        "insured_email": "siddhesh.parab@teknopoint.in",
        "insured_mobile_no": "8655525770",
        "premium_mode": "12",
        "policy_status": "20",
        "assignment_status": null,
        "insured_panNo": null,
        "is_ulip": "Y",
        "policy_issuance_date": "2021-05-18T18:30:00.000+00:00",
        "contact_no_last_updated": "2021-05-18T18:30:00.000+00:00",
        "insured_email_id_last_updated": null,
        "bank_account_no": null,
        "whatsapp_opt_in_status": null,
        "eia_account_number": 1000045665806,
        "product_name": "Fortune Pro 5 Pay Limited term - Age Band (46-59)",
        "product_uin_number": "110L112V04",
        "is_reinvest_applicable": "N",
        "outstanding_payout": null,
        "unclaimed_amount": null,
        "is_neft_registered": "N",
        "si_registered": "N",
        "last_premium_paid": null,
        "owner_email": "siddhesh.parab@teknopoint.in",
        "owner_mobile_no": "8655525770",
        "owner_gender": "F",
        "product_cd": "FP5UL4N4",
        "owner_panno": null,
        "email_id_last_updated": "2021-05-18T18:30:00.000+00:00",
        "sum_assured": "900000"
    },
    {
        "policy_no": "U000005526",
        "alphaID": 4076898,
        "owner_name": "siddhesh parab",
        "insured_name": "siddhesh parab",
        "insured_dob": "1953-05-30T18:30:00.000+00:00",
        "insured_email": null,
        "insured_mobile_no": "8655525770",
        "premium_mode": "06",
        "policy_status": "20",
        "assignment_status": null,
        "insured_panNo": null,
        "is_ulip": "Y",
        "policy_issuance_date": "2004-03-24T18:30:00.000+00:00",
        "contact_no_last_updated": "2021-04-13T18:30:00.000+00:00",
        "insured_email_id_last_updated": null,
        "bank_account_no": "09077090042408",
        "whatsapp_opt_in_status": null,
        "eia_account_number": null,
        "product_name": "InvestAssure",
        "product_uin_number": "110L035V01",
        "is_reinvest_applicable": "N",
        "outstanding_payout": null,
        "unclaimed_amount": null,
        "is_neft_registered": "Y",
        "si_registered": "N",
        "last_premium_paid": "2011-03-27T18:30:00.000+00:00",
        "owner_email": null,
        "owner_mobile_no": "8655525770",
        "owner_gender": null,
        "product_cd": "50AUL20LN1",
        "owner_panno": null,
        "email_id_last_updated": "2004-03-24T18:30:00.000+00:00",
        "sum_assured": "210000"
    },
    {
        "policy_no": "C201935437",
        "alphaID": 40848730,
        "owner_name": "siddhesh parab",
        "insured_name": "siddhesh parab",
        "insured_dob": "1968-08-14T18:30:00.000+00:00",
        "insured_email": null,
        "insured_mobile_no": "8655525770",
        "premium_mode": "12",
        "policy_status": "20",
        "assignment_status": null,
        "insured_panNo": null,
        "is_ulip": "N",
        "policy_issuance_date": "2004-03-29T18:30:00.000+00:00",
        "contact_no_last_updated": "2021-04-12T18:30:00.000+00:00",
        "insured_email_id_last_updated": null,
        "bank_account_no": "7043070712464",
        "whatsapp_opt_in_status": null,
        "eia_account_number": null,
        "product_name": "ASSURE 21 YEARS MONEY SAVER PLAN",
        "product_uin_number": "110N001V01",
        "is_reinvest_applicable": "N",
        "outstanding_payout": null,
        "unclaimed_amount": null,
        "is_neft_registered": "Y",
        "si_registered": "N",
        "last_premium_paid": "2021-04-12T18:30:00.000+00:00",
        "owner_email": null,
        "owner_mobile_no": "8655525770",
        "owner_gender": "M",
        "product_cd": "21CATMAEP1",
        "owner_panno": null,
        "email_id_last_updated": "2004-03-29T18:30:00.000+00:00",
        "sum_assured": "30000"
    },
    {
        "policy_no": "U330039738",
        "alphaID": 8854601,
        "owner_name": "siddhesh",
        "insured_name": "siddhesh",
        "insured_dob": "1970-05-26T18:30:00.000+00:00",
        "insured_email": "siddhesh.parab@teknopoint.in",
        "insured_mobile_no": "8655525770",
        "premium_mode": "03",
        "policy_status": "20",
        "assignment_status": null,
        "insured_panNo": "CNFPB0903H",
        "is_ulip": "Y",
        "policy_issuance_date": "2005-05-22T18:30:00.000+00:00",
        "contact_no_last_updated": "2005-05-22T18:30:00.000+00:00",
        "insured_email_id_last_updated": null,
        "bank_account_no": "70600700625330",
        "whatsapp_opt_in_status": null,
        "eia_account_number": null,
        "product_name": "InvestAssure",
        "product_uin_number": "110L035V01",
        "is_reinvest_applicable": "N",
        "outstanding_payout": null,
        "unclaimed_amount": null,
        "is_neft_registered": "Y",
        "si_registered": "N",
        "last_premium_paid": "2018-02-22T18:30:00.000+00:00",
        "owner_email": "siddhesh.parab@teknopoint.in",
        "owner_mobile_no": "8655525770",
        "owner_gender": null,
        "product_cd": "45AUL20LN2",
        "owner_panno": "CNFPB0903H",
        "email_id_last_updated": "2005-05-22T18:30:00.000+00:00",
        "sum_assured": "225000"
    },
    {
        "policy_no": "C674610402",
        "alphaID": 2076843019,
        "owner_name": "siddhesh parab",
        "insured_name": "siddhesh parab",
        "insured_dob": "1978-08-10T18:30:00.000+00:00",
        "insured_email": "siddhesh.parab@teknopoint.in",
        "insured_mobile_no": "8655525770",
        "premium_mode": "12",
        "policy_status": "20",
        "assignment_status": null,
        "insured_panNo": null,
        "is_ulip": "N",
        "policy_issuance_date": "2012-10-04T18:30:00.000+00:00",
        "contact_no_last_updated": "2015-10-08T18:30:00.000+00:00",
        "insured_email_id_last_updated": null,
        "bank_account_no": null,
        "whatsapp_opt_in_status": null,
        "eia_account_number": null,
        "product_name": "MAHALIFE GOLD",
        "product_uin_number": "110N029V01",
        "is_reinvest_applicable": "Y",
        "outstanding_payout": null,
        "unclaimed_amount": null,
        "is_neft_registered": "N",
        "si_registered": "Y",
        "last_premium_paid": "2018-10-05T18:30:00.000+00:00",
        "owner_email": "siddhesh.parab@teknopoint.in",
        "owner_mobile_no": "8655525770",
        "owner_gender": "M",
        "product_cd": "15LPWLP1",
        "owner_panno": null,
        "email_id_last_updated": "2012-10-04T18:30:00.000+00:00",
        "sum_assured": "450000"
    },
    {
        "policy_no": "U000512077",
        "alphaID": 13707288,
        "owner_name": "Siddhesh Parab",
        "insured_name": "Siddhesh Parab",
        "insured_dob": "1968-06-18T18:30:00.000+00:00",
        "insured_email": null,
        "insured_mobile_no": "8655525770",
        "premium_mode": "12",
        "policy_status": "20",
        "assignment_status": null,
        "insured_panNo": null,
        "is_ulip": "Y",
        "policy_issuance_date": "2006-04-23T18:30:00.000+00:00",
        "contact_no_last_updated": "2006-04-23T18:30:00.000+00:00",
        "insured_email_id_last_updated": null,
        "bank_account_no": "0767090580800",
        "whatsapp_opt_in_status": null,
        "eia_account_number": null,
        "product_name": "InvestAssure",
        "product_uin_number": "110L035V01",
        "is_reinvest_applicable": "N",
        "outstanding_payout": null,
        "unclaimed_amount": null,
        "is_neft_registered": "Y",
        "si_registered": "N",
        "last_premium_paid": "2019-04-25T18:30:00.000+00:00",
        "owner_email": null,
        "owner_mobile_no": "8655525770",
        "owner_gender": null,
        "product_cd": "45UL20LN1",
        "owner_panno": null,
        "email_id_last_updated": "2006-04-23T18:30:00.000+00:00",
        "sum_assured": "1125000"
    },
    {
        "policy_no": "C656670295",
        "alphaID": 1467804442,
        "owner_name": "siddhesh parab",
        "insured_name": "siddhesh parab",
        "insured_dob": "1990-08-10T18:30:00.000+00:00",
        "insured_email": "siddhesh.parab@teknopoint.in",
        "insured_mobile_no": "8655525770",
        "premium_mode": "12",
        "policy_status": "20",
        "assignment_status": null,
        "insured_panNo": null,
        "is_ulip": "N",
        "policy_issuance_date": "2021-04-30T18:30:00.000+00:00",
        "contact_no_last_updated": "2021-04-30T18:30:00.000+00:00",
        "insured_email_id_last_updated": null,
        "bank_account_no": "000101557406",
        "whatsapp_opt_in_status": null,
        "eia_account_number": 9001467804442,
        "product_name": "Saat Saath",
        "product_uin_number": "110N123V02",
        "is_reinvest_applicable": "N",
        "outstanding_payout": null,
        "unclaimed_amount": null,
        "is_neft_registered": "Y",
        "si_registered": "N",
        "last_premium_paid": null,
        "owner_email": "siddhesh.parab@teknopoint.in",
        "owner_mobile_no": "8655525770",
        "owner_gender": "M",
        "product_cd": "SS7V2N1",
        "owner_panno": null,
        "email_id_last_updated": "2021-04-30T18:30:00.000+00:00",
        "sum_assured": "200000"
    },
    {
        "policy_no": "U183162519",
        "alphaID": 295238935,
        "owner_name": "siddhesh parab",
        "insured_name": "siddhesh parab",
        "insured_dob": "1988-11-07T18:30:00.000+00:00",
        "insured_email": "siddhesh.parab@teknopoint.in",
        "insured_mobile_no": "8655525770",
        "premium_mode": "01",
        "policy_status": "20",
        "assignment_status": null,
        "insured_panNo": null,
        "is_ulip": "Y",
        "policy_issuance_date": "2021-04-12T18:30:00.000+00:00",
        "contact_no_last_updated": "2021-04-12T18:30:00.000+00:00",
        "insured_email_id_last_updated": null,
        "bank_account_no": null,
        "whatsapp_opt_in_status": null,
        "eia_account_number": 1000044848266,
        "product_name": "Fortune Pro 10/15/20 Pay Limited term - Age Band (30-35)",
        "product_uin_number": "110L112V04",
        "is_reinvest_applicable": "N",
        "outstanding_payout": null,
        "unclaimed_amount": null,
        "is_neft_registered": "N",
        "si_registered": "Y",
        "last_premium_paid": null,
        "owner_email": "siddhesh.parab@teknopoint.in",
        "owner_mobile_no": "8655525770",
        "owner_gender": "M",
        "product_cd": "FP2UL4N2",
        "owner_panno": null,
        "email_id_last_updated": "2021-04-12T18:30:00.000+00:00",
        "sum_assured": "220500"
    },
    {
        "policy_no": "U204210188",
        "alphaID": 2125572280,
        "owner_name": "Siddhesh Parab",
        "insured_name": "Siddhesh Parab",
        "insured_dob": "2019-01-27T18:30:00.000+00:00",
        "insured_email": "siddhesh.parab@teknopoint.in",
        "insured_mobile_no": "8655525770",
        "premium_mode": "01",
        "policy_status": "20",
        "assignment_status": null,
        "insured_panNo": "N",
        "is_ulip": "Y",
        "policy_issuance_date": "2019-09-12T18:30:00.000+00:00",
        "contact_no_last_updated": "2019-09-12T18:30:00.000+00:00",
        "insured_email_id_last_updated": null,
        "bank_account_no": null,
        "whatsapp_opt_in_status": null,
        "eia_account_number": 9002125572280,
        "product_name": "Fortune Pro 7 Pay Limited term - Age Band (00-29)",
        "product_uin_number": "110L112V02",
        "is_reinvest_applicable": "N",
        "outstanding_payout": null,
        "unclaimed_amount": null,
        "is_neft_registered": "N",
        "si_registered": "Y",
        "last_premium_paid": "2021-01-12T18:30:00.000+00:00",
        "owner_email": "siddhesh.parab@teknopoint.in",
        "owner_mobile_no": "8655525770",
        "owner_gender": "M",
        "product_cd": "FP7UL2N1",
        "owner_panno": "CDAPK7648M",
        "email_id_last_updated": "2019-09-12T18:30:00.000+00:00",
        "sum_assured": "500000"
    },
    {
        "policy_no": "C049241561",
        "alphaID": 2108347968,
        "owner_name": "siddhesh parab",
        "insured_name": "siddhesh parab",
        "insured_dob": "1983-03-31T18:30:00.000+00:00",
        "insured_email": null,
        "insured_mobile_no": "8655525770",
        "premium_mode": "12",
        "policy_status": "20",
        "assignment_status": null,
        "insured_panNo": null,
        "is_ulip": "N",
        "policy_issuance_date": "2015-02-25T18:30:00.000+00:00",
        "contact_no_last_updated": "2021-04-12T18:30:00.000+00:00",
        "insured_email_id_last_updated": null,
        "bank_account_no": "67494078139",
        "whatsapp_opt_in_status": null,
        "eia_account_number": null,
        "product_name": "Money Maxima",
        "product_uin_number": "110N109V01",
        "is_reinvest_applicable": "N",
        "outstanding_payout": null,
        "unclaimed_amount": null,
        "is_neft_registered": "Y",
        "si_registered": "N",
        "last_premium_paid": "2021-03-31T18:30:00.000+00:00",
        "owner_email": null,
        "owner_mobile_no": "8655525770",
        "owner_gender": "F",
        "product_cd": "MMXV1N1",
        "owner_panno": null,
        "email_id_last_updated": "2015-02-25T18:30:00.000+00:00",
        "sum_assured": "287000"
    },
    {
        "policy_no": "U000610898",
        "alphaID": 2046721811,
        "owner_name": "Siddhesh Parab",
        "insured_name": "Siddhesh Parab",
        "insured_dob": "1956-09-08T18:30:00.000+00:00",
        "insured_email": "siddhesh.parab@teknopoint.in",
        "insured_mobile_no": "8655525770",
        "premium_mode": "01",
        "policy_status": "20",
        "assignment_status": null,
        "insured_panNo": null,
        "is_ulip": "Y",
        "policy_issuance_date": "2011-05-26T18:30:00.000+00:00",
        "contact_no_last_updated": "2011-05-26T18:30:00.000+00:00",
        "insured_email_id_last_updated": null,
        "bank_account_no": "003570000046",
        "whatsapp_opt_in_status": null,
        "eia_account_number": null,
        "product_name": "Tata AIA Life InvestAssure Flexi Supreme",
        "product_uin_number": "110L090V01",
        "is_reinvest_applicable": "N",
        "outstanding_payout": null,
        "unclaimed_amount": null,
        "is_neft_registered": "Y",
        "si_registered": "Y",
        "last_premium_paid": "2020-03-26T18:30:00.000+00:00",
        "owner_email": "siddhesh.parab@teknopoint.in",
        "owner_mobile_no": "8655525770",
        "owner_gender": "M",
        "product_cd": "IXS2ULN1",
        "owner_panno": null,
        "email_id_last_updated": "2011-05-26T18:30:00.000+00:00",
        "sum_assured": "168000"
    },
    {
        "policy_no": "C247564590",
        "alphaID": 2039532541,
        "owner_name": "siddhesh parab",
        "insured_name": "siddhesh parab",
        "insured_dob": "2010-11-24T18:30:00.000+00:00",
        "insured_email": "siddhesh.parab@teknopoint.in",
        "insured_mobile_no": "8655525770",
        "premium_mode": "03",
        "policy_status": "20",
        "assignment_status": null,
        "insured_panNo": null,
        "is_ulip": "N",
        "policy_issuance_date": "2011-03-13T18:30:00.000+00:00",
        "contact_no_last_updated": "2013-02-04T18:30:00.000+00:00",
        "insured_email_id_last_updated": null,
        "bank_account_no": null,
        "whatsapp_opt_in_status": null,
        "eia_account_number": null,
        "product_name": "MAHALIFE GOLD",
        "product_uin_number": "110N029V01",
        "is_reinvest_applicable": "Y",
        "outstanding_payout": null,
        "unclaimed_amount": null,
        "is_neft_registered": "N",
        "si_registered": "Y",
        "last_premium_paid": "2020-03-26T18:30:00.000+00:00",
        "owner_email": "siddhesh.parab@teknopoint.in",
        "owner_mobile_no": "8655525770",
        "owner_gender": "M",
        "product_cd": "15LPWLP1",
        "owner_panno": null,
        "email_id_last_updated": "2011-03-13T18:30:00.000+00:00",
        "sum_assured": "533000"
    },
    {
        "policy_no": "U000005092",
        "alphaID": 5905155,
        "owner_name": "siddhesh parab",
        "insured_name": "siddhesh parab",
        "insured_dob": "1961-07-11T18:30:00.000+00:00",
        "insured_email": null,
        "insured_mobile_no": "8655525770",
        "premium_mode": "06",
        "policy_status": "20",
        "assignment_status": null,
        "insured_panNo": null,
        "is_ulip": "Y",
        "policy_issuance_date": "2004-09-27T18:30:00.000+00:00",
        "contact_no_last_updated": "2021-04-13T18:30:00.000+00:00",
        "insured_email_id_last_updated": null,
        "bank_account_no": "000570700079070",
        "whatsapp_opt_in_status": null,
        "eia_account_number": null,
        "product_name": "InvestAssure",
        "product_uin_number": "110L035V01",
        "is_reinvest_applicable": "N",
        "outstanding_payout": null,
        "unclaimed_amount": null,
        "is_neft_registered": "Y",
        "si_registered": "N",
        "last_premium_paid": "2015-08-02T18:30:00.000+00:00",
        "owner_email": null,
        "owner_mobile_no": "8655525770",
        "owner_gender": null,
        "product_cd": "45AUL20LN2",
        "owner_panno": null,
        "email_id_last_updated": "2004-09-27T18:30:00.000+00:00",
        "sum_assured": "135000"
    },
    {
        "policy_no": "U000440754",
        "alphaID": 9082308,
        "owner_name": "FNCEFN OUEEID VIYFKKUHFD",
        "insured_name": "FNCEFN OUEEID VIYFKKUHFD",
        "insured_dob": "1965-08-23T18:30:00.000+00:00",
        "insured_email": "siddhesh.parab@teknopoint.in",
        "insured_mobile_no": "8655525770",
        "premium_mode": "01",
        "policy_status": "20",
        "assignment_status": null,
        "insured_panNo": null,
        "is_ulip": "Y",
        "policy_issuance_date": "2005-06-26T18:30:00.000+00:00",
        "contact_no_last_updated": "2005-06-26T18:30:00.000+00:00",
        "insured_email_id_last_updated": null,
        "bank_account_no": "08527030007996",
        "whatsapp_opt_in_status": null,
        "eia_account_number": null,
        "product_name": "InvestAssure",
        "product_uin_number": "110L035V01",
        "is_reinvest_applicable": "N",
        "outstanding_payout": null,
        "unclaimed_amount": null,
        "is_neft_registered": "Y",
        "si_registered": "N",
        "last_premium_paid": "2014-07-23T18:30:00.000+00:00",
        "owner_email": "siddhesh.parab@teknopoint.in",
        "owner_mobile_no": "8655525770",
        "owner_gender": "M",
        "product_cd": "45UL30LN1",
        "owner_panno": null,
        "email_id_last_updated": "2005-06-26T18:30:00.000+00:00",
        "sum_assured": "3000000"
    }
]