"company_name","display_name"
"Infosys","Infosys"
"Capgemini","Capgemini"
"Tata-Consultancy-Services-(tcs)","Tata Consultancy"
"IBM","IBM"
"Wipro","Wipro"
"Deloitte","Deloitte"
"Accenture","Accenture"
"Tech-Mahindra","Tech Mahindra"
"Hcl-Technologies","HCL"
"Ey","EY"
"Cognizant-Technology-Solutions","Cognizant Technology "
"Microsoft","Microsoft "
"Google","Google"
"Ust-Global","UST Global"
"Larsen-&-Toubro","Larsen & Toubro"
"Amazon.com","Amazon "
"Syntel","Syntel"
"Pwc","Pwc"
"Igate","IGATE"
"Intel","Intel"
"L&T-Technology","L&T Technology Services"
"JPMorgan-Chase","JP Morgan"
"Apple","Apple"
"Hexaware-Technologies","Hexaware Technologies"
"Dell","Dell"
"Ntt-Data-Services","NTT Data"
"Kpmg","KPMG"
"Mastech-Inc","Mastech"
"Facebook","Facebook"
"Goldman-Sachs","Goldman Sachs "
"Capital-One","Capital One"
"Birlasoft","Birlasoft "
"V--soft-Consulting-Group","V-Soft Consulting Group"
"Htc-Global-Services-Inc.","HTC Global Services"
"Oracle","Oracle"
"Bank-of-America","Bank Of America"
"Virtusa","Polaris"
"Compunnel-Software-Group","Compunnel Software Group"
"Cummins","Cumming"
"Walmart","Wal-Mart"
"Populus-Group","Populus"
"Salesforce","Salesforce"
"Ebay-Inc.","Ebay"
"Randstad","Randstad Technologies"
"Dell","Dell"
"Mindtree","Mindtree "
"Mphasis","Mphasis Corporation"
"Qualcomm","Qualcomm "
"Kpit-Technologies","KPIT"
"American-Express","American Express"
"Yahoo!-Inc.","Yahoo!"
"Cerner-Corporation","Cerner "
"Linkedin","Linkedin "
"Persistent-Systems","Persistent Systems"
"Paypal","Paypal"
"Synechron","Synechron"
"Ericsson","Ericsson"
"Fujitsu","Fujitsu "
"Cisco","Cisco "
"Cyient","Cyient"
"Gss-Infotech","GSS Infotech"
"Ipolarity-LLC","Ipolarity "
"Vedicsoft","Vedicsoft Solutions"
"Tesla-Motors","Tesla"
"Uber","Uber"
"Exilant-Technologies","Exilant"
"Diaspark","Diaspark"
"The-University-of-Michigan","University Of Michigan"
"Morgan-Stanley","Morgan Stanley"
"First-Tek","First Tek"
"Marlabs","Marlabs"
"Vmware","Vmware"
"Erp-Analysts","Erp Analysts"
"Pyramid-Consulting-Group","Pyramid Technology Solutions"
"Intone-Networks","Intone Networks"
"Credit-Suisse","Credit Suisse Securities "
"Ciber","Ciber"
"The-Mathworks","The Mathworks"
"Virtusa","Polaris"
"System-Soft-Technologies","System Soft Technologies"
"Blackrock-Inc.","Blackrock"
"Logic-Planet","Logic Planet"
"Reliable-Software-Resources-Inc","Reliable Software Resources"
"CGI","CGI Technologies And Solutions"
"Bloomberg","Bloomberg"
"Broadcom","Broadcom Corporation"
"3i-Infotech","3I Infotech"
"Kellton-Tech","Kellton Tech"
"Avco-Consulting-Inc","Avco Consulting"
"Citiustech","Citiustech"
"Barclays","Barclays"
"Headstrong","Headstrong Services"
"Collaborate-Solutions,-Inc.","Collaborate Solutions"
"Engineering-Technology-Associates","ETA"
"Sdlc-Partners","SDLC Management"
"Astir-IT-Solutions","Astir IT Solutions"
"Lead-IT-Corporation","Lead IT Corporation"
"Deutsche-Bank","Deutsche Bank"
"L&T-Technology","L&T Technology Services"
"Tavant-Technologies","Tavant Technologies"
"A2z-Development-Center,-Inc.","A2Z"
"Niche-Software-Solutions-Inc","Niche Software Solutions"
"Divensi-Inc","Divensi "
"Intuit","Intuit "
"Prokarma","Prokarma"
"Azimetry","Azimetry"
"Schlumberger","Schlumberger"
"Hitachi-Consulting","Hitachi "
"Emory-University","Emory University"
"Aricent","Aricent"
"University-of-Pennsylvania","University Of Pennsylvania"
"Brillio","Brillio"
"National-Institutes-of-Health","National Institutes Of Health, HHA"
"Globalfoundries","GlobalFoundries"
"Applabs","Applab Systems"
"People-Tech-Group","People Tech Group"
"8k-Miles-Software-Services,-Inc.","8K Miles"
"Cyberthink-Inc","Cyberthink"
"Micron-Technology,-Inc.","Micron Technology"
"CSC","CSC "
"Samsung-Semiconductor,-Inc.","Samsung"
"Computek","CompuTek Solutions"
"Hewlett-Packard-Enterprise","Hewlett Packard Enterprise Company"
"Citi","Citigroup"
"Photon-Infotech","Photon Infotech"
"T--Mobile","T-Mobile "
"Netapp","Netapp"
"AIG","AIG"
"Bank-of-America-Merrill-Lynch","Merrill Lynch"
"Iris-Software,-Inc.","Iris Software"
"Symantec","Symantec "
"Srs-Consulting-Inc.","SRS Consulting "
"Technosoft-Corporation.","Technosoft Corporation"
"Globallogic","Globallogic"
"Slk-America-Inc.","SLK America"
"Twitter","Twitter"
"Blue-Cross-Blue-Shield","Blue Cross & Blue Shield"
"Microexcel","Microexcel"
"Harvard-University","Harvard University"
"Apogee-Medical-Group","Apogee Medical Group"
"Stanford-University","Stanford University"
"SAP","SAP"
"UBS","UBS"
"Expedia,-Inc.","Expedia"
"University-of-Maryland-University-College","University Of Maryland"
"Accenz","Accenz Llc"
"Delta-System-&-Software-Inc.","Delta System"
"Nemo-IT-Solutions","Nemo It Solutions"
"Citrix-Systems-Inc.","Citrix Systems"
"Siri-Infosolutions-Inc","Siri Info Solutions"
"University-of-Colorado","University Of Colorado"
"Comcast","Comcast "
"Mayo-Clinic","Mayo Clinic"
"Citicorp-Credit-Services,-Inc.-(usa)","Citigroup"
"Genpact","Genpact"
"Collabera","Collabera"
"Experis","Experis"
"Columbia-University","Columbia University"
"Medpro-Healthcare-Staffing","Management Health Systems"
"Hewlett-Packard-Enterprise","Hewlett Packard Enterprise Company"
"Kforce","Kforce "
"University-of-Pittsburgh","University Of Pittsburgh"
"Adobe","Adobe "
"Eclinicalworks","eClinicalWorks"
"Softpath-System-LLC","Softpath System"
"Boston-Consulting-Group","The Boston Consulting Group"
"Charter-Global-Inc","Charter Global"
"Fusion-Plus-Solutions-Inc","Fusion Plus Solutions"
"General-Motors","General Motors "
"Neumeric-Technologies-Corporation","Neumeric Technologies "
"GE-Corporate","General Electric "
"Nagarro","Nagarro"
"Itc-Infotech","ITC Infotech"
"Yale-University","Yale University"
"Baylor-College-of-Medicine-(bcm)","Baylor College Of Medicine"
"Niit-Technologies","NIIT Technologies "
"Marvell-Semiconductor,-Inc","Marvell Tech"
"The-University-of-Chicago","The University Of Chicago"
"Anthem,-Inc.","Anthem"
"Massachusetts-General-Hospital","General Hospital Corporation"
"Perficient","Perficient"
"Ohio-State-University","The Ohio State University"
"Sears","Sears"
"Alcatel-Lucent","Alcatel-Lucent "
"Genesis-Rehab-Services","Genesis Rehab Services"
"Intraedge-Inc","Intraedge"
"Akvarr-Inc","Akvarr"
"Itech-Us,-Inc.","iTech "
"Washington-University-in-St.-Louis","Washington University In St Louis"
"Cyma-Systems-Inc","Cyma Systems"
"Smartworks","Smart Works"
"Mckinsey-&-Company","Mckinsey & Company"
"Aplomb-Technologies","Aplomb Technologies"
"Uc-SAN-Diego","University Of California, San Diego"
"Dallas-Independent-School-District","Dallas Independent School District"
"Michigan-State-University","Michigan State University"
"Softpath-Technologies-LLC","Softpath Technologies"
"Massachusetts-Institute-of-Technology","Massachusetts Institute Of Technology"
"Amd","AMD"
"American-Airlines","American Airline"
"Motorola-Mobility","Motorola Mobility "
"Verizon","Verizon"
"Connvertex-Technologies-Inc.","Connvertex"
"Strategic-Resources-International","Strategic Resources International"
"Sudhi-Infomatics,-Inc.","Sudhi Infomatics"
"The-University-of-Iowa","The University Of Iowa"
"CVS-Health","CVS"
"Data-Systems-Integration-Group","Data Systems Integration Group"
"Texas-Instruments,-Inc","Texas Instruments "
"Computer-Sciences-Corporation---CSC","Computer Sciences Corporation"
"Veritas-Technologies","Veritas Technologies "
"Rjt-Compuquest-Inc","RJT Compuquest"
"Adaequare-Inc","Adaequare"
"Amdocs","Amdocs"
"University-of-California---SAN-Francisco","University Of California, San Francisco"
"New-York-University-School-of-Medicine--langone-Medical-Center","New York University "
"IT-America-Inc","IT America"
"Diversant,-LLC","Diversant "
"Altimetrik","Altimetrik "
"University-of-Texas-At-Austin","The University Of Texas At Austin"
"Idexcel","Idexcel"
"Texara-Solutions","Texara Solutions"
"Damian-Consulting-Inc","Damian Consulting"
"Pearson","Pearson"
"Akamai-Technologies","Akamai Technologies"
"Epam-Systems","Epam Systems"
"Multivision","Multivision"
"University-of-Texas-At-Austin","The University Of Texas At Austin"
"Blue-Cloud-Techs-Corp","Blue"
"Coolsoft-LLC","Coolsoft"
"Exl","Exlservice.Com"
"Tasacom-Technologies,-Inc","Tasacom Technologies"
"University-of-Wisconsin--madison-Division-of-Information-Technology-2","University Of Wisconsin-Madison"
"Aspire-Systems","Aspire Systems"
"Makeurcareer-LLC","Makeurcareer"
"Nvidia","Nvidia Corporation"
"Purdue-University","Purdue University"
"Memorial-Sloan-Kettering","Memorial Sloan-Kettering Cancer Center"
"Onward-Technologies-Inc.","Onward Technologies"
"Katalyst-Technologies-Inc.","Katalyst Technologies"
"Proficient-Business-Systems-Inc","Proficient Business Systems"
"Northwestern-University","Northwestern University"
"University-of-Alabama,-Birmingham","The Univ. Of Ala. At Birmingham (Uab)"
"Ut--battelle","Ut-Battelle"
"Nisum-Technologies","Nisum Technologies"
"Slalom-LLC","Slalom"
"Sony","Sony "
"University-of-Minnesota","University Of Minnesota"
"Usm-Business-Systems-Inc","USM Business Systems"
"Aci-Infotech","ACI Infotech"
"Etouch-Systems","ETouch Systems"
"SAP","SAP"
"Brookhaven-National-Laboratory","Brookhaven National Laboratory"
"University-of-Florida","University Of Florida"
"Sogeti","Sogeti"
"Sriven-Systems-Inc.,","Sriven Systems"
"Johns-Hopkins-University","Johns Hopkins University"
"University-of-Illinois","University Of Illinois"
"Codeforce360","Adroix"
"Howard-Hughes-Medical-Institute","Howard Hughes Medical Institute"
"Sandisk","SanDisk"
"Target-Enterprise,-Inc.","Target "
"Medtronic","Medtronic"
"Johns-Hopkins-University","Johns Hopkins University"
"University-of-California-Los-Angeles","University Of California, Los Angeles"
"Fidelity-Technologies","Fidelity Technology Group"
"Prosoft-Technology","Prosoft"
"Sysintelli-Inc","Sysintelli"
"Zs-Associates","ZS Associates"
"Xoriant-Corporation","Xoriant Corporation"
"Aol","AOL"
"Icahn-School-of-Medicine-At-Mount-Sinai","Icahn School Of Medicine At Mount Sina"
"Optum","Optum Services"
"Cigniti-Inc","Cignifi"
"University-of-Utah","University Of Utah"
"California-State-University-Fullerton","California State University"
"CVS-Health","CVS"
"Dropbox","Dropbox"
"Sprint","Sprint "
"Estrada-Consulting,-Inc.","Estrada Consulting"
"Fis-Global","FIS Management"
"Matrix-Quality-Services","Quality Matrix"
"Alcatel-Lucent","Alcatel-Lucent "
"New-York-Technology-Partners","New York Technology Parnters"
"Tibco-Software","Tibco Software"
"Antra-Inc.","Antra"
"University-of-Texas-At-Austin","The University Of Texas At Austin"
"Alliance-Data","ADS Alliance Data Systems"
"Dotcom-Team,-LLC","Dotcom Team"
"Horizon-Technologies-Inc.","Horizon Technologies"
"University-of-Washington","University Of Washington"
"Citi","Citigroup"
"Miracle-Software-Systems,-Inc.","Miracle Software Sysytems"
"Groupon","Groupon"
"AECOM","Aecom"
"Gateway","Gateway Group Technologies Inc."
"Juniper-Networks","Juniper Networks"
"Netflix","Netflix"
"Zensar-Technologies","Zensar Technologies"
"Sage-IT-Inc","Sage IT"
"North-Carolina-State-University","North Carolina State University"
"Agreeya-Solutions","Agreeya Solutions"
"AT&T","AT&T"
"Global-IT","Global IT"
"Duke-University-Medical","Duke University "
"Factset-Research-Systems","Factset "
"Brigham-and-Women's-Hospital","Brigham And Women's Hospital"
"Business-Intelli-Solutions","Business Intelli"
"Client-Network-Services-Inc","Client Network Services"
"University-of-Illinois-At-Chicago","University Of Illinois At Chicago"
"Valuelabs","Valuelabs"
"Nic-Info-Tek-Inc","NICInfotek"
"Svk-Technology-Solutions","SVK Systems"
"Autodesk","Autodesk"
"Satyam-Venture","Satyam Venture Engineering Services"
"Ca-Technologies","CA Technologies"
"Quadrant-4-System-Corporation","Quadrant 4 System Corporation"
"Mufg-Union-Bank","MUFG Union Bank"
"Sunera-Technologies","Sunera Technologies"
"Frontier-Technology,-Inc.","Frontier Technologies"
"Nihaki-Systems","Nihaki"
"Singular-Analysts-Inc","Singular Analysts"
"Texas-A&M-University","Texas A&M University"
"Airwatch","Airwatch"
"Cadence-Design-Systems","Cadence Design Systems"
"Ness-USA-Inc","Ness Technologies"
"Visionet-Systems,-Inc.","Visionet Systems"
"Boston-Children's-Hospital","Children's Hospital Corporation"
"Bdo","BDO USA"
"Comtec-Consultants","Comtec Consultants"
"Pike-Solutions","Pike Solutions"
"Ait-Global-Inc","AIT Global"
"Allied-Informatics,-Inc","Allied Informatics"
"Caprus-IT-Inc","Caprus IT"
"Smartplay-Inc","Smartplay"
"Systems-Technology-Group,-Inc.-(stg)","Systems Technology Group"
"ADP","ADP Technology Services"
"FedEx","Fedex"
"Oncorre","Oncorre"
"Sabre","Sabre"
"Penn-State-University","The Pennsylvania State University"
"University-of-Arkansas-For-Medical-Sciences","University Of Arkansas For Medical Sciences"
"Alpha-Net-Consulting-LLC","Alpha Net Consulting"
"Bhrigus","Bhrigus"
"Oberon-IT","Oberon IT"
"Opus-Consulting-Solutions-Inc.","Opus"
"Ramps-International,-Inc","Ramps International"
"Scepter-Technologies,-Inc","Scepter Technologies"
"Xtglobal-6","XTGlobal"
"Novartis","Novartis"
"Anjaneyap-Global-Inc","Anjaneyap"
"Ford-Motor-Company","Ford Motor Company"
"Iupui","Indiana Univ. Purdue Univ. Indianapolis"
"University-of-Southern-California","The University Of Southern California"
"Zf-Trw-Automotive","TRW Automotive"
"C--vision-Inc","C-Vision"
"Technumen,-Inc","Technumen"
"Cardinal-Health","Cardinal Health"
"Dassault-Systemes","Dassault"
"Kla--tencor-Corporation","Kla-Tencor Corporation"
"Nike","Nike"
"Precision-Technologies","Precision"
"Innovative-Intelligent-Solutions-LLC","Innovative Intelligent Solutions"
"Nexus-IT-Group,-Inc.","Nexus IT"
"Indiana-University","Indiana University"
"Riverbed-Technology","Riverbed Technologies"
"St.-Barnabas","St. Barnabas Hospital"
"University-of-North-Carolina-At-Chapel-Hill","University Of North Carolina At Chapel Hill"
"Rutgers,-the-State-University-of-New-Jersey","Rutgers, The State University Of New Jersey"
"Airbnb","Airbnb"
"Iconsoft-Consulting-Group,-Inc","Iconsoft "
"Idhasoft","Idhasoft"
"Pro--tek-Consulting","Pro-Tek Consulting"
"University-of-Virginia","University Of Virginia"
"Amzur-Technologies,-Inc","Amzur Technologies"
"Canvas-Infotech-Inc","Canvas Infotech"
"Centraprise-Corp","Centraprise"
"Infogain-Corporation","Infogain"
"Inovalon","Inovalon"
"Sagitec-Solutions","Sagitec Solutions"
"Vanderbilt-University","Vanderbilt University"
"Vcarve-Inc","Vcarve"
"Sonata-Software","Sonata Software North America"
"Genuineit-LLC","Genuineit"
"Henry-Ford-Health-System","Henry Ford Health System"
"University-of-Arizona","The University Of Arizona"
"Altera-Corporation","Altera Corporation"
"Brocade","Brocade Communications Systems"
"Genentech","Genentech"
"Unify-Solutions,-Inc","Unify Solutions"
"Battelle","Battelle Memorial Institute"
"Dataserv-Integrations,-LLC","Dataserv"
"University-of-California-Berkeley","University Of California, Berkeley"
"Arizona-State-University","Arizona State University"
"Xavient-Information-Systems","Xavient Information Systems"
"The-University-of-Missouri","The Curators Of The University Of Missouri"
"California-Institute-of-Technology","California Institute Of Technology"
"Servicenow","Servicenow"
"Tanisha-Systems-Inc","Tanisha Systems"
"Cedent-Consulting-Inc.","Cedent Consulting"
"Latentview-Analytics","Latentview Analytics Corporation"
"New-York-University","New York University "
"Webilent-Technologies,-Inc.","Webilent Technology"
"Weill-Medical-College-of-Cornell-University","Weill Cornell Medical College"
"The-Home-Depot","Home Depot Usa"
"Palo-Alto-Networks","Palo Alto Networks"
"Pamten","Pamten"
"Standav-Corp","Standav"
"Vastika-Inc.","Vastika"
"Jnit-Technologies","Jnit Technologies"
"Megatrendz-Media-USA-Inc","Megatrendz"
"Montefiore-Medical-Center","Montefiore Medical Center"
"Alltech-Consulting-Services,-Inc.","Alltech Consulting Services"
"Applied-Materials","Applied Materials"
"Critical-River,-Inc.","Criticalriver"
"Infolob-Solutions-Inc","Infolob Solutions"
