-------------------------------------------------------------------------------
Test set: Parallel.ParallelRun
-------------------------------------------------------------------------------
Tests run: 5, Failures: 0, Errors: 0, Skipped: 1, Time elapsed: 16.946 s - in Parallel.ParallelRun
