<svg width="371" height="158" viewBox="0 0 371 158" fill="none" xmlns="http://www.w3.org/2000/svg">
<path d="M7 158L17.4754 144.206L0.292021 142.031L7 158ZM9.66782 150.201C10.021 148.274 10.4176 146.395 10.8566 144.564L7.93924 143.864C7.48735 145.75 7.07958 147.682 6.71695 149.661L9.66782 150.201ZM12.1057 139.861C12.6708 137.93 13.2862 136.055 13.9502 134.234L11.1317 133.206C10.445 135.089 9.80943 137.027 9.22646 139.019L12.1057 139.861ZM15.7106 129.794C16.4963 127.965 17.3348 126.195 18.2244 124.483L15.5621 123.1C14.6383 124.878 13.7685 126.714 12.9543 128.609L15.7106 129.794ZM20.6002 120.241C21.6043 118.576 22.6611 116.969 23.7686 115.418L21.3274 113.674C20.1746 115.288 19.0751 116.961 18.0309 118.692L20.6002 120.241ZM26.739 111.54C27.9715 110.037 29.2567 108.593 30.5927 107.204L28.4307 105.124C27.0405 106.569 25.7027 108.073 24.4196 109.637L26.739 111.54ZM34.0686 103.819C35.5041 102.509 36.99 101.253 38.5244 100.051L36.6738 97.6896C35.0816 98.9374 33.5382 100.241 32.046 101.604L34.0686 103.819ZM42.4377 97.169C44.0266 96.0696 45.6611 95.0197 47.3393 94.0173L45.801 91.4418C44.0672 92.4773 42.3764 93.5633 40.7307 94.702L42.4377 97.169ZM51.6247 91.6095C53.3237 90.7119 55.0623 89.8577 56.8388 89.0451L55.5908 86.317C53.7645 87.1524 51.9746 88.0317 50.2233 88.9569L51.6247 91.6095ZM61.343 87.1052C63.1439 86.3756 64.9797 85.6845 66.8486 85.0303L65.8575 82.1988C63.945 82.8682 62.064 83.5762 60.2165 84.3247L61.343 87.1052ZM71.4741 83.5064C73.3498 82.9254 75.2557 82.3784 77.19 81.8637L76.4186 78.9645C74.447 79.4891 72.5024 80.0473 70.5865 80.6407L71.4741 83.5064ZM81.9132 80.6835C83.8079 80.2396 85.7275 79.8243 87.6704 79.4361L87.0827 76.4942C85.1089 76.8886 83.1571 77.3108 81.2289 77.7625L81.9132 80.6835ZM92.5754 78.5215C94.4769 78.1914 96.3987 77.8853 98.3395 77.602L97.9061 74.6334C95.9398 74.9205 93.9914 75.2308 92.0623 75.5657L92.5754 78.5215ZM103.228 76.9405C105.185 76.6961 107.159 76.473 109.15 76.2702L108.846 73.2856C106.834 73.4907 104.837 73.7163 102.856 73.9637L103.228 76.9405ZM114.015 75.8166C115.973 75.6505 117.946 75.5026 119.931 75.3716L119.734 72.3781C117.73 72.5103 115.739 72.6596 113.761 72.8273L114.015 75.8166ZM124.897 75.0803C126.845 74.9798 128.804 74.8944 130.773 74.8231L130.665 71.8251C128.681 71.8969 126.706 71.9829 124.742 72.0843L124.897 75.0803ZM135.718 74.6738C137.697 74.6255 139.685 74.5903 141.681 74.5673L141.646 71.5675C139.638 71.5907 137.637 71.626 135.645 71.6746L135.718 74.6738ZM146.595 74.5345C148.567 74.5307 150.546 74.5377 152.531 74.5547L152.556 71.5548C150.561 71.5378 148.572 71.5307 146.589 71.5345L146.595 74.5345ZM157.506 74.6171C159.472 74.6494 161.444 74.6905 163.419 74.7396L163.494 71.7405C161.51 71.6913 159.53 71.65 157.555 71.6175L157.506 74.6171ZM168.364 74.878C170.345 74.9395 172.33 75.0081 174.316 75.083L174.429 72.0851C172.436 72.01 170.445 71.9412 168.457 71.8794L168.364 74.878ZM179.259 75.2811C181.236 75.365 183.214 75.4542 185.193 75.5479L185.335 72.5512C183.352 72.4574 181.368 72.3679 179.386 72.2838L179.259 75.2811ZM190.142 75.7907C192.123 75.8911 194.104 75.9953 196.085 76.1022L196.246 73.1066C194.263 72.9995 192.279 72.8952 190.294 72.7945L190.142 75.7907ZM201.035 76.3749C203.014 76.4858 204.991 76.5987 206.966 76.7127L207.139 73.7177C205.163 73.6037 203.184 73.4906 201.203 73.3796L201.035 76.3749ZM211.917 77.0007C213.907 77.1171 215.891 77.2337 217.872 77.3497L218.048 74.3548C216.068 74.2389 214.081 74.1222 212.092 74.0058L211.917 77.0007ZM222.814 77.6377C224.798 77.7527 226.776 77.8661 228.748 77.9772L228.916 74.9819C226.947 74.871 224.97 74.7576 222.987 74.6428L222.814 77.6377ZM233.728 78.2527C235.715 78.3604 237.693 78.4647 239.663 78.5647L239.816 75.5686C237.849 75.4688 235.874 75.3646 233.891 75.2571L233.728 78.2527ZM244.592 78.8061C246.604 78.9008 248.605 78.99 250.596 79.0726L250.72 76.0752C248.736 75.9928 246.74 75.9039 244.733 75.8094L244.592 78.8061ZM255.548 79.2647C257.535 79.3361 259.509 79.3999 261.47 79.4549L261.554 76.456C259.602 76.4013 257.635 76.3378 255.656 76.2666L255.548 79.2647ZM266.494 79.5765C268.491 79.6168 270.473 79.6467 272.438 79.6651L272.466 76.6652C270.513 76.647 268.542 76.6172 266.555 76.5771L266.494 79.5765ZM277.378 79.686C279.411 79.6838 281.425 79.6677 283.418 79.6361L283.371 76.6365C281.393 76.6678 279.394 76.6838 277.375 76.686L277.378 79.686ZM288.356 79.5244C290.375 79.4643 292.371 79.3867 294.342 79.2897L294.194 76.2933C292.244 76.3893 290.268 76.4662 288.267 76.5257L288.356 79.5244ZM299.354 78.9969C301.336 78.862 303.29 78.7052 305.215 78.5248L304.935 75.5379C303.037 75.7158 301.108 75.8705 299.15 76.0038L299.354 78.9969ZM310.288 77.9853C312.294 77.7453 314.264 77.4764 316.197 77.1762L315.737 74.2117C313.841 74.5062 311.905 74.7705 309.931 75.0066L310.288 77.9853ZM321.136 76.3242C323.154 75.9392 325.127 75.5154 327.051 75.0498L326.346 72.134C324.473 72.5872 322.548 73.0008 320.574 73.3773L321.136 76.3242ZM331.846 73.7718C333.845 73.1866 335.785 72.5489 337.661 71.855L336.62 69.0413C334.814 69.7093 332.941 70.3254 331.003 70.8927L331.846 73.7718ZM342.269 69.9771C344.179 69.1209 346.012 68.1946 347.762 67.1934L346.273 64.5894C344.614 65.5384 342.869 66.4205 341.042 67.2395L342.269 69.9771ZM352.019 64.491C353.72 63.2934 355.322 62.0072 356.819 60.6267L354.785 58.421C353.39 59.7081 351.89 60.9124 350.292 62.0384L352.019 64.491ZM360.358 56.9553C361.69 55.395 362.908 53.7352 364.005 51.9711L361.458 50.3867C360.441 52.0214 359.313 53.5596 358.076 55.0071L360.358 56.9553ZM366.417 47.5049C367.272 45.6644 368.012 43.7287 368.632 41.6941L365.763 40.819C365.181 42.7248 364.491 44.5304 363.696 46.2414L366.417 47.5049ZM369.842 36.8639C370.234 34.8982 370.527 32.8512 370.719 30.7203L367.731 30.4517C367.548 32.4814 367.27 34.422 366.9 36.2772L369.842 36.8639ZM370.977 25.7812C371.01 23.8247 370.965 21.8034 370.841 19.7153L367.846 19.8935C367.966 21.9098 368.009 23.8548 367.978 25.731L370.977 25.7812ZM370.393 14.5986C370.178 12.7262 369.904 10.8038 369.571 8.83008L366.613 9.32966C366.938 11.2536 367.204 13.1233 367.412 14.9403L370.393 14.5986ZM368.612 3.78797C368.395 2.75777 368.163 1.71441 367.915 0.657739L364.994 1.34228C365.237 2.37754 365.464 3.39885 365.677 4.40638L368.612 3.78797Z" fill="#009EB5"/>
</svg>
