[
    {
        "id": "1",
        "name": "Pranay",
        "day": "today",
        "profile_image": "assets/images/pi1.jpg",
        "call_time": "1.25 pm"
    },
    {
        "id": "2",
        "name": "Animesh",
        "day": "yesterday",
        "profile_image": "assets/images/pi2.jpg",
        "call_time": "5.33 pm"
    }
    ,
    {
        "id": "3",
        "name": "Pritam Da",
        "day": "yesterday",
        "profile_image": "assets/images/pi3.jpg",
        "call_time": "11.23 am"
    },
    
    {
        "id": "4",
        "name": "Deepak bhaiya",
        "day": "today",
        "profile_image": "assets/images/pi4.jpg",
        "call_time": "4.20 am"
    },
    {
        "id": "5",
        "name": "Bibek",
        "day": "today",
        "profile_image": "assets/images/pi5.jpg",
        "call_time": "12.20 pm"
    },
    {
        "id": "6",
        "name": "Samrat Da",
        "day": "yesterday",
        "profile_image": "assets/images/pi6.jpg",
        "call_time": "6.32 pm"
    },
    {
        "id": "7",
        "name": "Kausik sir",
        "day": "yesterday",
        "profile_image": "assets/images/pi7.jpg",
        "call_time": "11.40 pm"
    },
    {
        "id": "8",
        "name": "Soham",
        "day": "today",
        "profile_image": "assets/images/pi8.jpg",
        "call_time": "9.35 am"
    },
    {
        "id": "9",
        "name": "Sanjeeb",
        "day": "today",
        "profile_image": "assets/images/pi9.jpg",
        "call_time": "7.40 am"
    },
    {
        "id": "10",
        "name": "Saugata frnd",
        "day": "yesterday",
        "profile_image": "assets/images/pi10.jpg",
        "call_time": "11.45 am"
    },
    {
        "id": "11",
        "name": "Kaushik frnd",
        "day": "today",
        "profile_image": "assets/images/pi11.jpg",
        "call_time": "3.55 am"
    },
    {
        "id": "12",
        "name": "Gabinda frnd",
        "day": "yesterday",
        "profile_image": "assets/images/pi12.jpg",
        "call_time": "9.11 am"
    },
    {
        "id": "13",
        "name": "Pranab clg frnd",
        "day": "today",
        "profile_image": "assets/images/pi13.jpg",
        "call_time": "7.44 am"
    },
    {
        "id": "14",
        "name": "Sahid",
        "day": "yesterday",
        "profile_image": "assets/images/pi14.jpg",
        "call_time": "5.39 am"
    },
    {
        "id": "15",
        "name": "Bhutai",
        "day": "yesterday",
        "profile_image": "assets/images/pi15.jpg",
        "call_time": "7.41 am"
    }
]