[
    {
        "id": "1",
        "name": "Pranay",
        "last_message": "I'll call you back later",
        "message_time": "10.23 pm",
        "profile_image": "assets/images/pi1.jpg",
        "msg_time": "1.25 pm"
    },
    {
        "id": "2",
        "name": "Animesh",
        "last_message": "Today I'll not coming",
        "message_time": "4.35 pm",
        "profile_image": "assets/images/pi2.jpg",
        "msg_time": "5.33 pm"
    }
    ,
    {
        "id": "3",
        "name": "Pritam Da",
        "last_message": "Where are you ?",
        "message_time": "1.15 am",
        "profile_image": "assets/images/pi3.jpg",
        "msg_time": "11.23 am"
    },
    
    {
        "id": "4",
        "name": "Deepak bhaiya",
        "last_message": "I can't take the call right now!",
        "message_time": "5.24 pm",
        "profile_image": "assets/images/pi4.jpg",
        "msg_time": "4.20 am"
    },
    {
        "id": "5",
        "name": "Bibek",
        "last_message": "I'll call you back later",
        "message_time": "1.33 pm",
        "profile_image": "assets/images/pi5.jpg",
        "msg_time": "12.20 pm"
    },
    {
        "id": "6",
        "name": "Samrat Da",
        "last_message": "I made the whasapp UI",
        "message_time": "10.30 am",
        "profile_image": "assets/images/pi6.jpg",
        "msg_time": "6.32 pm"
    },
    {
        "id": "7",
        "name": "Kausik sir",
        "last_message": "Yes! I taken your interview.",
        "message_time": "4.23 pm",
        "profile_image": "assets/images/pi7.jpg",
        "msg_time": "11.40 pm"
    },
    {
        "id": "8",
        "name": "Soham",
        "last_message": "I'll go home early today",
        "message_time": "9.55 pm",
        "profile_image": "assets/images/pi8.jpg",
        "msg_time": "9.35 am"
    },
    {
        "id": "9",
        "name": "Sanjeeb",
        "last_message": "Ki re ki korchis bhai",
        "message_time": "5.48 pm",
        "profile_image": "assets/images/pi9.jpg",
        "msg_time": "7.40 am"
    },
    {
        "id": "10",
        "name": "Saugata frnd",
        "last_message": "Kal clg jabi to?",
        "message_time": "6.42 pm",
        "profile_image": "assets/images/pi10.jpg",
        "msg_time": "11.45 am"
    },
    {
        "id": "11",
        "name": "Kaushik frnd",
        "last_message": "Ami kal clg jabo na",
        "message_time": "3.50 pm",
        "profile_image": "assets/images/pi11.jpg",
        "msg_time": "3.55 am"
    },
    {
        "id": "12",
        "name": "Gabinda frnd",
        "last_message": "Kal clg jaoyar age call koris",
        "message_time": "8.25 pm",
        "profile_image": "assets/images/pi12.jpg",
        "msg_time": "9.11 am"
    },
    {
        "id": "13",
        "name": "Pranab clg frnd",
        "last_message": "Okay",
        "message_time": "5.23 pm",
        "profile_image": "assets/images/pi13.jpg",
        "msg_time": "7.44 am"
    },
    {
        "id": "14",
        "name": "Sahid",
        "last_message": "Ki khobor bhai",
        "message_time": "6.06 pm",
        "profile_image": "assets/images/pi14.jpg",
        "msg_time": "5.39 am"
    },
    {
        "id": "15",
        "name": "Bhutai",
        "last_message": "Amar aj mathe jete deri hobe",
        "message_time": "3.10 pm",
        "profile_image": "assets/images/pi15.jpg",
        "msg_time": "7.41 am"
    }
]