<?xml version="1.0" encoding="utf-8"?>
<!-- Generator: Adobe Illustrator 25.2.0, SVG Export Plug-In . SVG Version: 6.00 Build 0)  -->
<svg version="1.1" id="Layer_1" xmlns="http://www.w3.org/2000/svg" xmlns:xlink="http://www.w3.org/1999/xlink" x="0px" y="0px"
	 viewBox="0 0 1125 1083.9" style="enable-background:new 0 0 1125 1083.9;" xml:space="preserve">
<style type="text/css">
	.st0{fill:#0BAF68;}
</style>
<rect x="592" y="898.8" class="st0" width="144.8" height="18.7"/>
<path d="M329.3,840.2v12.6h-7.4v-35.6h13c8.4,0,13.6,3.8,13.6,11.4c0,7.5-5.2,11.7-13.6,11.7H329.3z M333.9,834.1
	c5.1,0,7.3-1.8,7.3-5.6c0-3.4-2.2-5.3-7.3-5.3h-4.6v10.8H333.9z"/>
<path d="M386.8,846.6h15.3v6.1h-22.7v-35.6h7.4V846.6z"/>
<path d="M429.5,852.7l12.7-35.6h7.1l12.7,35.6h-7.9l-2.2-6.8h-12.2l-2.2,6.8H429.5z M441.6,839.9h8.2l-4.1-12.6L441.6,839.9z"/>
<path d="M519.2,817.1v35.6H513l-14.2-22.1v22.1h-7v-35.6h6.1l14.3,22.4v-22.4H519.2z"/>
<path d="M577.1,817.1v6.1h-10v29.5h-7.4v-29.5h-10v-6.1H577.1z"/>
<path d="M615.4,852.7H608v-35.6h7.4V852.7z"/>
<path d="M676.9,817.1v35.6h-6.2l-14.2-22.1v22.1h-7v-35.6h6.1l14.3,22.4v-22.4H676.9z"/>
<path d="M736.8,834.2v3.3c0,10.9-5.2,15.8-13.4,15.8c-8.2,0-13.9-4.9-13.9-15.8v-4.5c0-11.5,5.8-16.3,13.9-16.3
	c7.7,0,12.2,4.2,13.4,11.5h-7.1c-0.6-3.3-2.6-5.4-6.3-5.4c-4.3,0-6.5,2.8-6.5,9.7v5.1c0,6.8,2.3,9.7,6.5,9.7c4.2,0,5.9-2.5,6.3-6.8
	h-6.1v-6.1H736.8z"/>
<path d="M340.8,888.3c-1.6-2.4-3.5-3.6-7.2-3.6c-3.3,0-5.1,1.5-5.1,3.9c0,2.8,2.3,4,7.2,5.2c7.6,1.9,11,4.6,11,10.9
	c0,5.8-4,10.4-12.6,10.4c-6.4,0-10.8-1.7-14-5.8l5.7-3.8c2,2.4,4.2,3.6,7.9,3.6c4.2,0,5.6-1.8,5.6-4c0-2.5-1.5-3.9-7.4-5.4
	c-7.2-1.9-10.8-5.2-10.8-11.1c0-5.6,3.8-10,12.5-10c5.8,0,10.2,1.9,12.8,5.8L340.8,888.3z"/>
<path d="M386,902.1v12.6h-7.4v-35.6h13c8.4,0,13.6,3.8,13.6,11.4c0,7.5-5.2,11.7-13.6,11.7H386z M390.6,896.1c5.1,0,7.3-1.8,7.3-5.6
	c0-3.4-2.2-5.3-7.3-5.3H386v10.8H390.6z"/>
<path d="M429.7,914.7l12.7-35.6h7.1l12.7,35.6h-7.9l-2.2-6.8h-12.2l-2.2,6.8H429.7z M441.8,901.8h8.2l-4.1-12.6L441.8,901.8z"/>
<path d="M510,890.1c-0.7-3.4-2.7-5.4-6.3-5.4c-4.3,0-6.5,2.8-6.5,9.7v5.1c0,6.6,2.3,9.7,6.5,9.7c3.7,0,5.5-1.8,6.3-5.4h7
	c-1.2,8-5.8,11.5-13.3,11.5c-8.2,0-13.9-4.9-13.9-15.8v-5.1c0-11,5.8-15.8,13.9-15.8c7.2,0,12.1,3.7,13.4,11.5H510z"/>
<path d="M571.4,879.1v6.1h-15.3v8h13.7v6.1h-13.7v9.3h15.3v6.1h-22.7v-35.6H571.4z"/>
<path d="M733.5,574.2c-2.2-38.4-18.7-78.9-36.1-121.8c-31.2-76.8-66.6-163.8-42.7-277.3c0,0,0,0,0,0c0,0,0,0,0,0c0,0,0,0,0,0
	c0,0,0,0,0,0c0,0,0-0.1,0-0.1c0,0,0,0,0-0.1c0,0,0,0,0,0c0,0,0,0,0,0c0,0,0,0,0,0c0,0,0,0,0,0c0,0,0,0,0,0c0,0,0,0,0,0c0,0,0,0,0,0
	c0,0,0,0,0-0.1c0,0,0,0,0,0c0,0,0,0,0,0c0,0,0-0.1,0-0.1c0,0,0,0,0,0c0,0,0,0,0,0c0,0,0,0,0,0c0,0,0-0.1,0-0.1c0,0,0,0,0,0
	c0,0,0,0,0,0c0,0,0,0,0,0c0,0,0,0,0,0c0,0,0,0,0,0c0,0,0,0,0,0c0,0,0,0,0,0c0,0,0,0,0,0c0,0,0,0,0,0c0,0,0,0,0-0.1c0,0,0,0,0-0.1
	c0,0,0,0,0-0.1c0,0,0,0,0,0c0,0,0,0,0,0c0,0,0-0.1,0-0.1c0,0,0,0,0,0c0,0,0,0,0-0.1c0,0,0,0,0,0c0,0,0,0,0,0c0,0,0,0,0,0
	c0,0,0,0,0,0c0,0,0,0,0-0.1c0,0,0,0,0-0.1c0,0,0,0,0,0c0,0,0-0.1,0-0.1c0,0,0,0,0,0c0,0,0,0,0-0.1c0,0,0,0,0,0c0,0,0,0,0-0.1
	c0,0,0,0,0,0c0,0,0,0,0,0c0,0,0,0,0,0c0,0,0,0,0,0c0,0,0,0,0-0.1c0,0,0,0,0-0.1c0,0,0,0,0-0.1c0,0,0,0,0-0.1c0,0,0,0,0,0
	c0,0,0-0.1,0-0.1c0,0,0-0.1,0-0.1c0,0,0,0,0,0c0,0,0,0,0,0c0,0,0,0,0,0c0,0,0,0,0-0.1c0,0,0,0,0,0c0,0,0,0,0,0c0,0,0,0,0-0.1
	c0,0,0,0,0-0.1c0,0,0,0,0,0c0,0,0,0,0,0c0,0,0,0,0-0.1c0,0,0,0,0,0c0,0,0,0,0,0c0,0,0,0,0,0c0-0.1-0.1-0.1-0.1-0.2c0,0,0,0,0,0
	c0,0,0,0,0,0c0,0,0,0,0,0c0,0,0,0,0,0c0,0,0,0,0,0c-0.1-0.1-0.1-0.3-0.2-0.4c0,0,0,0,0,0c-0.6-1.2-1.6-2.1-2.8-2.6c0,0,0,0,0,0
	c-0.1-0.1-0.2-0.1-0.4-0.1c0,0,0,0,0,0c0,0,0,0-0.1,0c0,0,0,0,0,0c0,0,0,0,0,0c0,0,0,0,0,0c0,0,0,0,0,0c0,0,0,0,0,0c0,0,0,0,0,0
	c0,0,0,0-0.1,0c-0.1,0-0.1,0-0.2-0.1c0,0,0,0,0,0c0,0,0,0,0,0c0,0,0,0,0,0c0,0,0,0,0,0c0,0,0,0-0.1,0c0,0,0,0-0.1,0c0,0,0,0,0,0
	c0,0,0,0-0.1,0c0,0,0,0-0.1,0c0,0,0,0,0,0c0,0-0.1,0-0.1,0c-51.6-11-96.1-4.2-132.3,20.2c-39.2,26.4-69.5,73.5-92.9,144
	c-20.2,61-32.7,132.2-43.7,195C361.8,638.8,344.9,735,296,736.2c0,0,0,0,0,0c0,0,0,0,0,0c0,0,0,0,0,0c0,0,0,0,0,0c0,0,0,0,0,0
	c0,0,0,0,0,0c-0.1,0-0.2,0-0.3,0c0,0,0,0,0,0c0,0,0,0,0,0c0,0,0,0,0,0c-0.1,0-0.1,0-0.2,0c0,0,0,0,0,0c0,0,0,0,0,0c0,0,0,0,0,0
	c0,0,0,0,0,0c-0.1,0-0.2,0-0.2,0c0,0-0.1,0-0.1,0c-0.1,0-0.1,0-0.2,0c0,0,0,0,0,0c0,0,0,0,0,0c0,0,0,0,0,0c0,0,0,0,0,0
	c0,0-0.1,0-0.1,0c-0.1,0-0.2,0-0.2,0.1c-0.1,0-0.1,0-0.2,0c0,0,0,0,0,0c0,0,0,0,0,0c0,0,0,0,0,0c-0.1,0-0.2,0.1-0.3,0.1
	c0,0-0.1,0-0.1,0.1c0,0,0,0,0,0c0,0,0,0,0,0c0,0,0,0,0,0c-0.1,0.1-0.3,0.1-0.4,0.2c0,0-0.1,0-0.1,0c0,0,0,0,0,0
	c-0.1,0.1-0.3,0.2-0.4,0.3c0,0,0,0-0.1,0c-0.1,0.1-0.3,0.2-0.4,0.3c0,0,0,0-0.1,0c0,0,0,0,0,0c0,0,0,0,0,0c-0.1,0.1-0.2,0.2-0.3,0.3
	c0,0,0,0-0.1,0.1c0,0,0,0,0,0c0,0-0.1,0.1-0.1,0.1c-0.1,0.1-0.1,0.2-0.2,0.2c0,0,0,0-0.1,0.1c0,0,0,0,0,0c0,0,0,0,0,0c0,0,0,0,0,0
	c0,0,0,0,0,0c0,0,0,0.1-0.1,0.1c0,0,0,0.1-0.1,0.1c0,0.1-0.1,0.1-0.1,0.2c0,0,0,0.1-0.1,0.1c0,0,0,0,0,0c0,0,0,0,0,0c0,0,0,0,0,0
	c0,0,0,0.1-0.1,0.1c0,0.1-0.1,0.2-0.1,0.2c0,0-0.1,0.1-0.1,0.1c0,0,0,0,0,0c0,0,0,0,0,0c0,0,0,0,0,0c0,0,0,0,0,0c0,0,0,0.1,0,0.1
	c0,0.1-0.1,0.2-0.1,0.2c0,0.1-0.1,0.1-0.1,0.2c0,0,0,0,0,0c0,0,0,0,0,0c0,0,0,0,0,0c0,0,0,0,0,0c0,0.1-0.1,0.2-0.1,0.3
	c0,0,0,0.1,0,0.1c0,0,0,0,0,0.1c0,0,0,0,0,0c0,0,0,0,0,0c0,0,0,0,0,0c0,0.1-0.1,0.2-0.1,0.3c0,0,0,0,0,0c0,0,0,0.1,0,0.1
	c0,0,0,0,0,0c0,0,0,0,0,0c0,0,0,0,0,0c0,0,0,0,0,0c0,0.1,0,0.2,0,0.4c0,0,0,0,0,0c0,0,0,0.1,0,0.1c0,0,0,0.1,0,0.1c0,0,0,0,0,0
	c0,0,0,0,0,0l0,0c0,0,0,0,0,0s0,0,0,0c0,0,0,0,0,0c0,0.1,0,0.3,0,0.4c0,0,0,0,0,0c0,0,0,0.1,0,0.1v0c0,0,0,0,0,0v0c0,0,0,0,0,0v0
	c0,0,0,0,0,0v0c0,0,0,0,0,0v0c0,0,0,0,0,0v0c0,0,0,0,0,0v0c0,0,0,0,0,0v0c0,0,0,0,0,0c0,0,0,0.1,0,0.1c0,0.1,0,0.2,0,0.3
	c0,0,0,0.1,0,0.1c0,0,0,0,0,0c0,0,0,0,0,0c0,0,0,0,0,0c0,0,0,0,0,0c0,0,0,0,0,0c0,0,0,0,0,0c0,0.1,0,0.1,0,0.2c0,0.1,0,0.2,0,0.3
	c0,0,0,0.1,0,0.1c0,0,0,0,0,0c0,0,0,0,0,0s0,0,0,0c0,0,0,0,0,0c0,0.1,0,0.1,0,0.2c0,0.1,0,0.2,0.1,0.2c0,0,0,0,0,0c0,0,0,0,0,0.1
	c0,0,0,0,0,0c0,0,0,0,0,0c0,0,0,0,0,0c0,0,0,0.1,0.1,0.1c0,0.1,0.1,0.1,0.1,0.2c0,0,0,0.1,0.1,0.1c0,0,0,0,0,0c0,0,0,0,0,0
	c0,0,0,0,0,0c0,0,0,0,0,0c0,0,0,0,0,0c0,0,0,0,0,0.1c0,0.1,0.1,0.1,0.1,0.2c0,0.1,0.1,0.1,0.1,0.2c0,0,0,0,0,0c0,0,0,0,0,0
	c0,0,0,0,0,0c0,0.1,0.1,0.1,0.1,0.2c0,0,0,0.1,0.1,0.1c0,0,0.1,0.1,0.1,0.1c0,0,0,0,0,0c0,0.1,0.1,0.1,0.1,0.2c0,0,0,0,0,0
	c0.1,0.1,0.1,0.2,0.2,0.2c0,0,0,0,0,0c0,0.1,0.1,0.1,0.1,0.1c0.1,0.1,0.1,0.2,0.2,0.2c0,0,0,0,0,0c0.1,0.1,0.1,0.1,0.2,0.2
	c0,0,0.1,0.1,0.1,0.1c0,0,0,0,0.1,0.1c0,0,0,0,0,0c0.1,0,0.1,0.1,0.2,0.1c0.1,0.1,0.2,0.1,0.3,0.2c0.1,0,0.1,0.1,0.2,0.1
	c0.1,0.1,0.2,0.1,0.3,0.2c0.1,0.1,0.2,0.1,0.3,0.1c0.1,0,0.1,0.1,0.2,0.1c0.1,0,0.2,0.1,0.3,0.1c0.1,0,0.2,0.1,0.3,0.1
	c0,0,0.1,0,0.1,0c0.2,0.1,0.4,0.1,0.6,0.1c0,0,0,0,0,0c0.1,0,0.2,0,0.3,0c0.1,0,0.1,0,0.2,0c0.1,0,0.1,0,0.2,0c0.1,0,0.2,0,0.3,0
	c0,0,0,0,0,0c0,0,0,0,0,0c0,0,0,0,0.1,0c0,0,0,0,0.1,0c0,0,0,0,0,0c0,0,0,0,0,0c0,0,0,0,0,0c0,0,0,0,0,0c0,0,0,0,0,0c0,0,0,0,0,0
	c0,0,0,0,0,0c0,0,0,0,0,0c0,0,0,0,0,0c0,0,0,0,0,0c13-0.3,32.9,3,55.9,7c33.7,5.7,76.5,13,122.5,13c69.2,0,145.9-16.4,210.4-79.3
	C720.6,653.6,736,617.3,733.5,574.2z M586.2,360.9c0,3.1-0.1,6.3-0.1,9.4c-0.9,65-1.7,132.1-43.4,200.7
	c-26.3,43.3-54.6,75.5-82.7,99.3c29-28,55.5-63,79.2-104.6c38.9-68.6,43.1-137.4,46.7-198.1C586,365.4,586.1,363.2,586.2,360.9z
	 M576.4,338.3c-0.7,9.5-1.3,19.1-1.9,28.7c-3.7,62.4-7.6,126.9-45.2,193.1c-25.5,44.9-52.3,78.4-78.5,103.5
	c27.1-29.5,52.3-66,75.1-109.1c34.5-65.2,41.4-130.5,47.4-188.1C574.3,356.9,575.3,347.5,576.4,338.3z M552.4,576.9
	c40.5-66.8,43.9-131.4,44.8-194c2.1,64.7,2.6,131.5-41.1,199c-25.6,39.6-54.9,71.7-87.7,96.1C497.1,653.5,525.8,620.8,552.4,576.9z
	 M562,365.3c-6.2,59.3-12.7,120.7-46.2,184c-20.8,39.4-44.2,73.4-68.9,101.3c23.2-29.7,45.2-65.5,65.6-107.2
	c30-61.1,39-122.3,47-176.2c2.6-17.6,5.1-34.6,8.2-50.9C565.5,332.1,563.8,348.5,562,365.3z M565.7,588.1
	c40.6-62.8,44.6-124.2,43.5-183.9c4.4,61.8,4,125.2-39.6,188.6c-28.7,41.8-60.1,71.2-91.3,92.1C510.9,660,540.1,627.7,565.7,588.1z
	 M548.4,365.5c-7.8,53.1-16.7,113.4-46,172.9c-20.5,41.8-42.5,77.6-65.7,106.9c21.6-31.1,42.7-69,62.6-113.1
	c25.4-56.2,35.9-112.5,45.2-162.3c5.1-27.6,9.9-53.3,16.6-76.8C555.7,315.9,552.1,340.2,548.4,365.5z M579,599.2
	c40.8-59.3,45.4-117.9,42.8-175c6.3,60.7,5.2,119.3-38.7,179.5c-30.3,41.6-63.5,70-96.7,89.4C521.2,669.5,552.3,638.1,579,599.2z
	 M533.4,367.9c-9.1,49.1-19.5,104.7-44.4,159.7c-18.9,41.7-38.6,77.6-58.9,107.5c18.8-31.5,37.5-69.5,55.9-114
	c20.9-50.3,32-101,41.8-145.8c8.3-38.1,16-72.8,28-102.7C545.8,301.5,539.7,333.7,533.4,367.9z M592.2,610.4
	c40.9-56.2,46.2-112.2,42.5-167.1c7.5,58,5.7,114.2-38.2,171.3c-32.4,42.1-67.8,69.5-103.2,87.5C530.8,679.8,564,649.2,592.2,610.4z
	 M516.8,372.8c-10.2,46.5-20.7,94.6-41.2,143.9C458.4,558.1,441,594,423.5,624c16.1-31.6,32.4-69.5,49.3-114.1
	c16.4-43.3,26.7-85.6,36.7-126.4c12.1-49.5,23-93.9,42.1-129C535.3,288.6,526.3,329.3,516.8,372.8z M605.5,621.5
	c26.4-34.3,40.6-71.6,43.4-113.9c1-14.9,0.6-29.7-0.7-44.5c8.1,55.1,5.3,108.6-38.3,162.4c-32.5,40-68.2,65.8-104,82.4
	C543.8,687.3,577.1,658.4,605.5,621.5z M543.6,245.5c-21.1,37.2-32.8,84.8-45.1,135.2c-9.9,40.5-20.2,82.4-36.3,125.1
	c-15.5,41.2-30.4,76.2-44.9,105.5c14-32.6,27.9-70.5,42.3-112.7c12-35.1,21-69.8,29.8-103.3c14.4-55,28-107,51.3-145.5
	c1.7-2.8,3.4-5.5,5.2-8.1C545.1,242.9,544.4,244.2,543.6,245.5z M618.8,632.6c41.5-51.2,48.2-101.5,43.1-152.7
	c9.2,54.1,5.9,104.6-38.4,156.5c-32.7,38.3-68.8,62.6-105,77.9C556.5,695.2,590.1,667.9,618.8,632.6z M478.3,392.4
	c-8.7,33.3-17.7,67.8-29.6,102.6c-14.1,41.4-26.5,75-38.1,102.9c11.8-33.2,23.3-70.5,35.5-110.5c7.7-25.4,14.5-50.8,21.1-75.3
	c16.5-61.8,32.1-120.1,58.6-162.4c4.9-7.8,10.1-14.9,15.6-21.3C510.4,270,495,328.8,478.3,392.4z M554.1,709.3
	c28.8-16.6,55-38.6,77.9-65.5c41.4-48.6,48.9-96.7,43.7-145.7c9.4,51.6,5.1,99.9-38.9,149.3c-32.1,35.7-67.5,58.4-103.2,72.6
	C540.6,716.7,547.4,713.1,554.1,709.3z M536.1,217.3c-7,7.8-13.6,16.5-19.8,26.4c-27.5,43.7-43.3,102.9-60,165.5
	c-6.5,24.5-13.3,49.7-21,75c-11,36.3-21.6,70.3-32.2,101c7.3-25.2,14.5-52.1,21.9-79.7c2.6-9.6,5.2-19.4,7.8-29.2
	c3.5-13.1,6.9-26.4,10.2-39.2c18.2-70.6,35.3-137.2,65.5-185.2C517,238.4,526.1,226.9,536.1,217.3z M645.3,654.9
	c31.4-35.1,46-71.7,45.9-115.1c0-9.1-0.7-18.2-1.8-27.4c10.6,51.2,6.2,97.5-39.1,145.9c-32.7,34.8-68.9,56.4-105.5,69.5
	C579.5,712.9,613.9,689.9,645.3,654.9z M529.9,207.5c-11.3,10.5-21.5,23.2-30.9,38.3c-31,49.5-48.4,117-66.8,188.4
	c-3.3,12.8-6.7,26-10.2,39.1c-2.7,9.8-5.3,19.6-7.8,29.2c-5.9,22.1-11.7,43.6-17.4,64.2c3.4-14.7,6.7-29.8,10.1-45.1
	c4.1-18.4,8.3-37.4,12.8-56.5c16.7-72.1,35.6-153.9,70.2-210.3C501.8,235.2,515.1,219.6,529.9,207.5z M658.5,666
	c32.8-35,47.7-71.6,46.8-115c-0.1-7.2-0.7-14.5-1.7-21.8c10.6,49.1,5.3,93.7-39.9,139.9c-33.1,33.7-69.8,54.3-107,66.3
	C592,721.7,626.8,699.8,658.5,666z M435.8,336c22.4-67.7,51.2-112.8,87.9-137.8c-16.2,12.9-30.7,29.7-43.5,50.6
	c-35.6,58-54.7,140.7-71.6,213.7c-4.5,19.2-8.7,38.2-12.8,56.6c-2.3,10.6-4.7,21-7,31.2c1.2-6.9,2.5-13.9,3.7-20.9
	C404,463.9,415.8,396.2,435.8,336z M677.2,680.1c-33.4,32.6-70.4,52.1-108,63.2c35.6-12.9,70.6-33.7,102.6-66.2
	c42.8-43.6,52-86.6,46.1-131.4C728.4,592.9,722.4,636,677.2,680.1z"/>
<path class="st0" d="M794.9,664.4H503.5V373h291.4V664.4z M522.2,645.7h254v-254h-254V645.7z"/>
</svg>
