865268 165848 525
690512 858572 525
815658 708446 468
492366 184784 449
136528 147905 375
108049 665443 509
249725 751662 509
590818 384124 470
625432 329678 470
405682 735107 509
615327 789123 509
323504 725939 509
459802 837444 509
140919 952298 525
293834 336653 384
695019 585660 509
169358 693626 509
828884 308168 509
628464 871635 525
138226 840115 525
161964 533561 470
962512 649774 525
607190 514375 452
43950 877007 525
772971 990359 525
72923 525686 470
345924 686781 509
448246 957391 525
236420 602943 470
942895 608252 525
690667 924756 525
401403 135951 443
43664 109446 354
401315 530789 470
744446 433440 509
577661 756009 509
261929 843656 525
115220 229060 386
743772 182235 509
452852 343098 449
662276 568880 509
358344 467809 449
597443 510545 470
617046 477807 470
324038 248796 407
344073 923215 525
580647 975298 525
87964 973408 525
385392 168416 443
562687 100354 470
522522 382300 470
596148 59501 470
567603 22797 470
601888 106348 470
778159 218315 509
852008 389422 525
147174 755604 509
276064 985652 525
817141 539314 509
545056 315481 470
264928 589452 470
283190 964817 525
398947 753517 509
919786 474000 525
369720 706497 509
259958 710092 509
560549 914716 525
903254 811331 525
314090 73228 443
330514 18961 443
213438 925650 525
676073 440600 509
867324 68551 525
152434 845088 525
112574 195018 383
902714 828378 525
72692 445826 449
182145 176814 365
489550 225386 449
243010 718122 509
409698 985036 525
193294 251216 443
194796 559608 470
335542 540806 470
184797 792028 509
990468 389120 525
450877 504584 444
608547 727935 509
230701 682356 509
56543 198724 383
535850 206665 470
634853 770981 504
198915 393663 443
638495 259177 509
588056 451222 470
371813 522951 470
219810 914999 525
828906 681422 504
101445 741396 509
238707 860152 525
896710 363996 525
985912 635160 525
620405 672006 509
587699 258061 470
549733 576812 421
406089 829018 509
186039 881009 525
190457 788383 509
521311 839245 525
965200 408725 525
5294 753543 509
535020 709317 509
14951 301036 443
581906 345362 470
979536 917125 507
632949 215435 509
784356 631243 504
231059 110981 443
501018 1191 449
544898 5613 470
933755 150732 525
901341 599232 525
277588 487267 449
655611 608312 509
639903 170854 509
258411 646686 509
419627 830696 509
708732 864225 525
728282 301977 509
990879 740120 525
906668 385227 525
477541 592562 470
436618 558240 470
149325 723973 509
312557 753181 509
639780 27597 509
828404 192480 509
31295 220971 386
978153 26434 525
44079 580872 470
305981 910689 525
878204 654478 525
575739 353867 470
268367 582524 470
835662 153353 509
234130 907528 525
766615 223810 509
22286 277265 443
645226 945790 525
475909 652273 509
653818 368992 509
657289 669895 442
757526 842530 525
540264 955981 525
438654 815520 509
577241 953778 525
243445 358375 441
746720 301858 509
98788 52446 351
664653 246342 509
813583 213503 509
874982 738528 525
356798 82097 443
204416 621302 470
190435 743508 509
11188 413464 449
725223 388123 509
886516 883436 370
70589 975999 525
142961 550435 470
256412 114966 443
220791 345737 443
384365 481650 449
159289 317823 443
820537 836035 419
962289 724224 525
97390 540368 470
199382 559839 470
314398 343180 384
440409 598078 470
134141 577069 470
591340 768481 509
500171 545806 470
534228 978035 525
147052 265576 443
476369 353581 449
656147 389215 509
103284 811468 509
981895 809475 525
489379 129926 449
190435 881686 525
900154 983793 507
209002 529302 470
128735 554395 470
496228 893049 525
893523 109122 525
319110 509442 449
712167 110372 509
155100 573335 470
847368 472576 525
117007 219393 386
603214 315034 470
311579 682048 509
477489 338521 449
171437 893367 525
601834 82129 470
243381 202119 443
879676 117350 525
815316 404897 509
943079 266239 525
300265 240344 407
479202 301065 449
101678 796182 509
65299 799330 509
191975 808584 509
178784 817433 509
81406 457934 449
431518 814772 509
914656 253237 525
399315 151425 443
143684 627305 509
793629 650403 504
98341 818743 509
317078 292068 384
668833 728730 504
493437 799898 509
242119 903474 525
744373 191869 509
533993 343995 470
618664 6641 470
614262 112169 470
172917 286121 443
7239 161684 383
535210 851999 525
880032 606183 525
199833 986347 525
569383 903723 525
288657 427259 449
124723 286142 443
744912 846917 525
698244 399086 509
543371 600943 452
113137 136477 349
25940 346527 443
49953 992118 525
497207 411743 444
570355 754517 509
641946 957557 525
286491 298625 389
948943 156442 525
