333642 591283 470
340887 87208 443
656788 934084 525
423162 427192 418
928764 533048 525
480237 825862 509
557020 784100 509
964495 9933 525
662709 958727 525
262409 313757 407
848211 410033 525
323767 70470 443
145779 853254 525
344022 70236 443
605118 976927 525
972569 861106 507
617388 880078 525
347453 668750 509
386144 261995 441
887378 142864 525
248508 447847 449
459845 313518 449
728072 390907 509
620244 505418 470
256568 651608 509
769895 949728 525
820432 773530 468
812728 596587 509
491568 105120 449
563784 317974 470
369311 244093 441
759912 474741 509
651156 390910 509
445804 604428 470
767485 188191 509
315270 539441 470
670861 933145 525
891854 805793 525
995920 777421 525
942503 3701 525
221293 393561 443
961456 127182 525
132647 593643 470
99932 640883 509
24481 294179 443
616952 21977 470
386620 440364 449
558565 168324 470
714567 717478 380
45757 330772 443
795326 250607 509
766595 892313 525
130909 454405 449
750636 660267 504
807209 704587 504
837995 348172 525
495731 18827 449
537231 514626 439
39509 478339 449
572138 202683 470
898947 868816 445
889410 530669 525
775990 215297 509
955500 447470 525
781190 642939 504
45143 253044 443
420778 338008 449
331755 721402 509
559818 308509 470
194089 463807 449
498951 299380 449
146855 432799 449
103320 982328 525
278676 960114 525
677152 934360 525
163077 56701 383
860281 150409 525
276130 363030 441
726055 944610 525
416169 660643 509
498480 785594 509
39783 57227 340
284502 950006 525
360821 153474 443
395375 270377 441
153070 996937 525
502707 941942 525
903364 933435 476
560722 471797 470
911406 602344 525
646767 767087 504
903819 909113 445
155822 46839 375
811875 956703 525
256390 600238 470
155139 494951 449
151993 499702 449
629642 1294 509
269373 539033 470
801018 417930 509
202824 546741 470
990563 214206 525
756066 55140 509
711685 470191 509
880280 879880 344
105866 877338 525
857940 393919 525
124613 294207 443
687039 817137 504
46830 583557 470
208295 502171 449
833662 237184 509
870794 599267 525
935372 238988 525
555358 198891 470
605319 791911 509
138068 271890 443
14442 71336 340
837477 20394 509
857210 536087 525
456843 700555 509
459299 966318 525
405853 417251 449
106443 640557 509
234966 199630 443
497724 311856 449
738390 898786 525
672203 95301 509
439993 518574 470
111925 645149 509
756238 269000 509
994681 874271 507
545752 986115 525
477991 707638 509
192146 424318 449
745232 246953 509
731443 566158 509
10256 954867 525
482520 233608 449
682624 199457 509
823712 282643 509
359552 24627 443
108611 176887 383
853494 858854 419
558144 243190 470
649130 568466 509
467617 612035 470
670438 774939 504
384604 362489 423
596316 404561 470
453319 446519 387
821581 255480 509
239636 302000 407
359835 792445 509
399429 28931 443
990525 384066 525
52935 131687 354
941677 299026 525
720681 165630 509
563608 218959 470
42143 414743 449
144278 990629 525
565792 17750 470
58271 2465 340
794856 901345 525
91241 166502 383
8462 263892 443
361630 353659 410
760256 108433 509
202145 780759 509
297758 352340 441
169601 658886 509
407688 803184 509
222864 948580 525
714074 397882 509
628439 529297 509
943850 428476 525
479715 345134 449
455485 74306 449
411984 83685 449
838365 723701 525
994722 780418 525
841519 21781 525
357593 88104 443
613183 611910 310
118953 973919 525
177899 616818 470
742815 411670 509
120469 915818 525
100549 418146 449
939680 889541 507
104010 112003 354
332941 368561 441
946968 859595 507
263336 615609 470
622045 894006 525
123093 644854 509
895169 390557 525
828259 196191 509
563185 694542 509
196056 345547 443
74245 143228 375
443976 887254 525
857046 789058 525
354567 907446 525
720227 275544 509
890354 852535 445
886560 791430 525
864004 367748 525
859353 877210 432
711759 450995 509
443162 140024 449
678806 365974 509
6348 766386 509
380892 563408 470
221934 339492 443
196296 916331 525
499068 894726 525
257143 723303 509
756838 816302 468
633960 680407 442
399859 412297 449
922009 174991 525
563340 200376 470
323027 545184 470
769888 364434 509
213991 585974 470
864952 432066 525
223452 155371 386
316800 593301 470
450455 534836 470
826689 42268 509
682133 45583 509
324099 634799 509
979049 837656 525
192018 825582 509
424111 763588 509
356331 769401 509
531726 102473 470
960510 21205 525
240641 914997 525
6500 781295 509
962387 89783 525
337479 747127 509
380519 935777 525
788041 948387 525
631743 444571 509
232012 620502 470
777555 225422 509
