835830 570066 509
32640 767828 509
656107 775011 504
713983 426650 509
124406 557795 470
800722 174302 509
211293 345674 443
22934 110659 354
974632 616391 525
182583 255101 443
948094 154036 525
293790 678298 509
114766 680412 509
139343 130100 344
879173 182714 525
99219 230312 386
274243 143223 443
403262 14167 443
122081 760089 509
40667 932709 525
588508 395976 470
82379 756582 509
919034 349378 525
225803 929256 525
666872 209358 509
153317 92436 375
565413 433845 470
905817 133975 525
389203 237481 441
426443 208175 449
105457 1600 351
562004 690223 509
137218 962711 525
534001 925412 525
425657 448091 400
154612 695590 509
950632 621226 525
175730 946260 525
5211 127315 354
853987 888495 445
59537 443814 449
928495 134507 525
298004 276472 389
108441 124003 349
737732 986218 525
919288 985471 507
904931 488582 525
969559 694399 525
315739 533572 470
488987 930273 525
994681 697971 525
963867 622249 525
414947 474093 444
685863 743832 504
668486 890089 525
752797 753737 424
105129 374361 443
970562 408400 525
61604 627054 509
352180 289775 441
552136 634631 509
94942 125908 354
546173 89415 470
408753 49892 443
797533 930807 525
141855 228714 386
111381 453017 449
635992 282517 509
959090 929449 507
214366 880669 525
218001 434728 449
181171 47388 383
610854 746007 509
601804 460267 470
178878 750839 509
716010 595428 509
8995 842186 525
833751 16704 509
127117 317968 443
783324 184674 509
936751 59567 525
835913 992343 525
409386 301245 441
576440 716227 509
550117 676545 509
376639 189176 443
568121 398888 470
192266 872421 525
35432 893517 525
512084 464089 470
38743 195773 383
692901 406660 509
783308 739392 468
849906 164875 525
368450 64131 443
275977 646222 509
50732 195167 383
638564 707773 504
373845 863987 525
356194 312015 441
601495 5698 470
703984 272667 509
983114 545649 525
847208 17888 525
580263 334951 470
451937 232148 449
340851 662608 509
996478 702537 525
343427 555425 470
705222 716309 411
727175 496430 509
811542 696880 504
84060 692986 509
737375 116134 509
817587 530063 509
448504 785759 509
678320 889916 525
979085 856926 507
798865 369109 509
813078 169754 509
997369 998267 440
910690 531719 525
435646 894733 525
477444 367414 449
870168 491419 525
677366 377694 509
963676 655924 525
121409 146156 375
197615 523061 470
955318 710990 525
259976 605818 470
745777 899869 525
937064 320680 525
701613 429378 509
633292 924746 525
290491 771774 509
392516 172416 443
665085 444598 509
732369 35801 509
21444 564229 470
993740 84636 525
523126 286627 470
988064 268019 525
309349 725729 509
940658 844865 507
278041 89335 443
530554 124940 470
170122 905720 525
207455 362091 443
119795 891080 525
247084 852804 525
100802 828531 509
762523 763087 331
68143 757787 509
531862 695597 509
972011 34315 525
103183 879143 525
925074 523173 525
837489 633336 504
503831 504896 364
240027 583918 470
525039 15514 470
550820 443958 470
836640 10220 509
385801 968961 525
234250 860813 525
3860 972227 525
593753 369394 470
650562 729843 504
848491 423838 525
129377 115960 336
178527 307812 443
240860 303447 407
909669 15176 525
70441 37493 340
894677 775233 525
416163 599708 470
327899 431626 449
132820 415426 449
786462 985887 525
158844 34705 383
701743 426168 509
216737 6559 386
654658 419054 509
652109 719851 504
840264 312025 525
507911 220123 449
123999 233822 443
588286 437145 470
574905 494491 470
22149 227 279
936982 247244 525
976256 566681 525
900136 345091 525
569365 260634 470
725279 569741 509
614219 662528 509
775391 28137 509
637099 488588 509
145277 293088 443
910136 120664 525
541799 583953 452
383546 486925 449
632526 369621 509
545765 941413 525
714830 869622 525
363392 943772 525
989309 945807 458
117098 38424 354
491701 314326 449
441609 777760 509
359037 816276 509
313553 694129 509
502214 174889 449
529848 999888 525
561475 549258 421
177172 265297 443
9934 356416 443
42075 221444 386
580279 327165 470
763402 895096 525
172557 986745 525
534771 514157 439
453122 516040 470
667669 513119 509
20177 221077 386
557394 63533 470
76161 708845 509
639799 228245 509
670130 607502 509
408696 513578 470
223384 63098 386
327214 746372 509
703035 549329 509
347053 127572 443
768170 530275 509
478228 405947 449
227471 479287 449
380931 31898 443
806850 280951 509
301471 519864 470
112539 342392 443
641062 415571 509
593756 189261 470
673180 798270 504
652328 873660 525
13017 765300 509
145641 454734 449
365839 914050 525
587498 683614 509
427813 241496 449
