967295 665413 525
782154 85502 509
416463 789849 509
987037 238828 525
284339 21135 443
409767 47896 443
908507 468751 525
282129 183278 443
603197 193102 470
935661 270430 525
963426 617315 525
922144 151178 525
657340 880784 525
985480 823809 525
458968 622088 470
218722 129907 386
625216 989126 525
941027 50452 525
86838 99421 333
93933 987347 525
169995 606036 470
336651 863408 525
629734 469536 509
342183 835369 509
976440 977838 334
424435 408095 449
520594 700575 509
990635 339682 525
128633 696174 509
16997 799909 509
582303 613467 434
119623 777799 509
852462 776697 525
52160 127008 354
580027 999866 525
500242 387675 449
40295 601663 470
683344 359151 509
537521 920093 525
610478 411570 470
628563 754687 504
744609 879163 525
886458 804811 525
88074 94558 333
322964 404884 441
31621 676748 509
567977 832866 509
571072 35876 470
231462 117110 443
509407 85162 449
443992 65442 449
454621 984751 525
677228 637037 442
546680 210648 470
997708 994406 365
859981 682911 525
882327 376454 525
836471 108900 509
228422 569411 470
609329 503121 470
117223 84118 354
300505 403265 441
332882 194159 443
479345 879826 525
590708 653496 509
236284 396173 441
320259 629755 509
946727 947023 308
682793 172160 509
823908 328778 509
582913 772689 509
67905 705903 509
13503 112058 354
68590 255972 443
247728 131850 443
338798 60760 443
603244 965501 525
962580 877107 507
838145 816023 525
740719 848883 525
736571 133763 509
887149 18803 525
269524 950038 525
876673 227595 525
253082 526871 470
979574 117638 525
329279 142906 443
708816 154587 509
228789 433510 449
775813 482981 509
827026 926144 525
618844 271185 470
661520 762524 504
769572 554704 509
666643 879802 525
355343 669247 509
340607 583849 470
924876 33670 525
671011 380292 509
489923 566458 470
869823 923843 476
55809 631910 509
834798 549282 509
196157 543581 470
977774 80649 525
491161 989121 525
904093 722940 525
978620 36817 525
299352 663690 509
44405 22900 324
491433 947505 525
299157 923496 525
42194 347521 443
157842 986520 525
394276 377067 436
169743 894607 525
748084 481812 509
868369 613783 525
682454 803819 504
896197 31843 525
946725 252106 525
464004 612157 470
140368 969847 525
973440 365352 525
889225 13214 525
7735 94973 351
139354 438490 449
676250 993740 525
392272 793093 509
582325 313455 470
130223 948082 525
179230 279037 443
385625 130688 443
3381 934154 525
47567 782271 509
995521 455829 525
713087 243401 509
111520 134086 349
273730 460211 449
294622 361167 441
809449 859882 525
785401 179104 509
190926 653043 509
67287 514305 470
344846 959804 525
744318 638826 504
29060 985654 525
90911 974550 525
404566 895252 525
287197 696550 509
742589 890337 525
345023 503238 449
282938 458669 449
89172 289473 443
44058 323560 443
871647 390870 525
962502 444439 525
526199 702607 509
183999 701307 509
825485 871807 525
221584 189390 386
509490 7020 449
282495 952696 525
336651 665683 509
175313 601360 470
376391 667068 509
867314 710417 525
965466 20464 525
522290 627052 509
749053 131586 509
184692 681697 509
555762 786630 509
700175 82764 509
174756 598594 470
734120 172833 509
186658 120153 383
861162 717017 525
528337 62938 470
837624 12707 509
367941 131024 443
365047 498220 449
801323 20981 509
322054 752884 509
780618 629275 504
191194 465051 449
409369 770649 509
423822 830085 509
811183 644197 504
625892 757730 509
970991 568580 525
402251 610458 470
394253 141204 443
911173 480877 525
762144 632789 504
998733 387272 525
662100 347846 509
334799 862954 525
118298 763782 509
622935 58868 470
553665 22564 470
749423 980885 525
373256 671918 509
791720 516823 509
332480 833036 509
445474 261246 449
315761 252414 407
497845 503492 426
914783 143323 525
632329 10093 509
849641 819383 525
893793 503511 525
457641 641124 509
692895 184232 509
649788 904653 525
911826 812711 525
35751 797875 509
959431 251786 525
831227 257709 509
685156 949078 525
395525 295600 441
500522 532683 470
660962 603454 509
312876 362720 441
79208 518019 470
730794 411471 509
268752 302037 407
194718 200245 360
548068 139062 470
113078 523902 470
390836 81879 443
263017 425032 449
342927 248987 407
303415 177736 443
454942 306455 449
670159 418828 509
275896 338103 389
768056 101630 509
91739 703927 509
306222 180572 443
58640 576308 470
224809 545777 470
665978 193220 509
144205 420800 449
479816 854102 525
894168 686569 525
637522 558703 509
357451 872523 525
163841 808263 509
737601 211424 509
158196 55815 383
