459868 355159 449
30677 856751 525
115341 780933 509
76099 303356 443
288742 588451 470
91355 544292 470
755556 385040 509
706324 632126 504
624910 301897 470
678207 835120 504
911965 76692 525
222262 586944 470
62941 197246 383
724869 452268 509
767019 309112 509
516348 346916 470
897805 957780 507
370242 275941 441
223638 173734 386
136240 839637 525
980280 245815 525
184953 42643 383
942108 210522 525
140786 685379 509
591340 114736 470
59255 991311 525
547130 59691 470
155844 893701 525
543767 562198 452
331953 417335 449
807209 524022 509
760648 543751 509
442716 572506 470
84216 148833 375
138677 819749 509
856134 54108 525
877390 864719 432
5362 655527 509
749313 644900 504
405682 795595 509
261073 504732 449
319139 95188 443
617087 177263 470
225621 435519 449
186932 750181 509
798899 961272 525
158617 761086 509
339081 578289 470
921534 408053 525
528514 840838 525
40800 171760 383
45255 128048 354
455146 917024 525
513457 584291 452
254173 717087 509
260591 688306 509
890152 385155 525
430109 969562 525
831607 885626 525
115269 372658 443
252383 257412 363
986138 893958 507
998580 879191 507
751802 641699 504
841723 555618 525
622542 839435 525
778282 902806 525
84885 318417 443
354943 22227 443
478955 732129 509
244290 818571 509
538604 695393 509
879753 927068 476
265230 45810 443
693550 273789 509
258665 397783 441
785297 980025 525
226147 577018 470
587644 496354 470
538393 663592 509
288460 925168 525
633970 356287 509
322807 397188 441
343658 119383 443
794320 36183 509
60994 167171 383
383398 817563 509
524544 807739 509
398530 647186 509
477649 342625 449
581130 198915 470
239297 422527 449
554134 404309 470
879954 636548 525
928192 552340 525
492577 58614 449
27790 764679 509
74183 967957 525
840284 31100 525
612597 818194 509
545177 762786 509
816155 483283 509
434469 452492 400
814337 271447 509
141439 812723 509
724912 128270 509
415263 502514 444
640444 142548 509
811852 204737 509
3686 367418 443
961041 793980 525
706106 511851 509
868272 795754 525
415644 922050 525
747505 848609 525
104055 472798 449
554196 803791 509
673690 592043 509
243628 682279 509
278515 432872 449
58175 626717 509
401660 301390 441
931047 600071 525
265857 425815 449
114767 776103 509
893792 925939 476
391296 9204 443
34442 886355 525
591275 85465 470
661943 30467 509
861543 598140 525
243139 14769 443
316605 567330 470
267596 834021 509
782192 82072 509
498609 61013 449
163830 786290 509
196391 731001 509
568581 633861 509
734975 682584 504
848341 490640 525
625618 959294 525
957200 415940 525
766455 885950 525
331847 905688 525
382713 218211 443
13218 553876 470
9665 278484 443
75615 407281 443
209055 134569 383
751484 808781 468
999690 990428 440
429454 802776 509
778807 955316 525
823884 829122 419
346592 512294 470
794468 78665 509
878154 998076 507
937859 314962 525
565344 660431 509
950316 761400 525
144098 525156 470
802659 102186 509
24597 754031 509
450150 988732 525
758261 49821 509
710209 445781 509
666420 374202 509
733555 448889 509
631422 254146 509
340616 110481 443
905626 893594 401
592976 562585 434
908888 500840 525
828076 286762 509
961238 813967 525
597024 373378 470
604312 788566 509
655625 351139 509
237149 927405 525
422082 876855 525
996091 426863 525
504313 16627 449
730099 142378 509
611742 797255 509
643173 284428 509
823402 580876 509
657084 297583 509
113692 882530 525
221077 211241 386
686283 704828 504
311139 773042 509
161281 357166 443
232005 508004 449
330181 718800 509
909608 517940 525
93650 23786 351
826281 395365 509
107568 108327 279
442281 576756 470
888767 272641 525
781656 382356 509
438898 347130 449
304662 407052 441
562012 113682 470
11126 556632 470
275938 146728 443
19851 525949 470
692779 439786 509
256923 305881 407
970090 253740 525
829971 964443 525
392837 508283 449
943366 731616 525
112965 210229 383
558715 264493 470
131087 807974 509
86624 313206 443
526470 192964 470
309006 984547 525
851245 777455 525
40213 273843 443
334382 732594 509
186576 940518 525
395196 472188 449
647025 624069 509
411965 156911 449
25275 332275 443
564210 948514 525
232636 445884 449
897968 693719 525
839642 753803 525
480404 748304 509
810776 424089 509
356340 795622 509
158865 629029 509
682797 607086 509
846834 624518 525
471120 921806 525
421397 557278 470
693624 222150 509
846579 609012 525
179760 917082 525
245686 284535 407
997352 96158 525
527744 235826 470
283725 838365 525
116373 750031 509
850083 323295 525
287007 630130 509
