%YAML 1.1
%TAG !u! tag:unity3d.com,2011:
--- !u!114 &11400000
MonoBehaviour:
  m_ObjectHideFlags: 0
  m_CorrespondingSourceObject: {fileID: 0}
  m_PrefabInstance: {fileID: 0}
  m_PrefabAsset: {fileID: 0}
  m_GameObject: {fileID: 0}
  m_Enabled: 1
  m_EditorHideFlags: 0
  m_Script: {fileID: 11500000, guid: 4fb206f6d142285449f96ed7c19832f5, type: 3}
  m_Name: Database
  m_EditorClassIdentifier: 
  ItemsObjects:
  - {fileID: 11400000, guid: 9328bbdec31c9134aab8949738be5abd, type: 2}
  - {fileID: 11400000, guid: aeb0d158230f97249827d43095a23ca5, type: 2}
  - {fileID: 11400000, guid: b0f545ea452fd664590c00ae62e60064, type: 2}
  - {fileID: 11400000, guid: cc04aed6bb465ee44b8c6a25adde2f25, type: 2}
  - {fileID: 11400000, guid: 7895d1c6ce602434980103c0309aa016, type: 2}
  - {fileID: 11400000, guid: 133493a7b358ab343a09caed7ba81cfc, type: 2}
  - {fileID: 11400000, guid: 9cf2504c657799342b6b990af27e8294, type: 2}
  - {fileID: 11400000, guid: 19ede3c003aec8d46a63009761f8206c, type: 2}
  - {fileID: 11400000, guid: e435d0db55cab1f4294fce3d0af39a03, type: 2}
  - {fileID: 11400000, guid: ef29e61f6942a8f4bb237a12c94ff50d, type: 2}
