com\prajwal\code\configuration\AppConfiguration.class
com\prajwal\code\entity\Sale.class
com\prajwal\code\repository\ItemRepository.class
com\prajwal\code\entity\Customer.class
com\prajwal\code\repository\StaffRepository.class
com\prajwal\code\controller\LoginController.class
com\prajwal\code\controller\ItemController.class
com\prajwal\code\repository\SaleRepository.class
com\prajwal\code\AppStarter.class
com\prajwal\code\controller\SiteController.class
com\prajwal\code\repository\SellingItemRepository.class
com\prajwal\code\controller\StaffController.class
com\prajwal\code\controller\SaleController.class
com\prajwal\code\controller\CRUDController.class
com\prajwal\code\entity\Supplier.class
com\prajwal\code\repository\SupplierRepository.class
com\prajwal\code\repository\CustomerRepository.class
com\prajwal\code\controller\SellingItemController.class
com\prajwal\code\configuration\SecurityConfiguration.class
com\prajwal\code\entity\Staff.class
com\prajwal\code\controller\CustomerController.class
com\prajwal\code\controller\SupplierController.class
com\prajwal\code\entity\Item.class
com\prajwal\code\controller\HomeController.class
com\prajwal\code\entity\SellingItem.class
