{
  "devices" : {
    "Stream-data-1" : {
      "CO2" : "1149.5",
      "Door_Sensor" : "0",
      "Humidity" : "33.1725",
      "HumidityRatio" : "0.005223782",
      "Light" : "466.83",
      "Light_Bedroom" : "467",
      "Light_Living" : "466.5",
      "Light_kitchen" : "467",
      "Occupancy" : "1",
      "Occupancy_Bedroom" : "0",
      "Occupancy_Kitchen" : "0",
      "Occupancy_Living" : "1",
      "Temperature" : "21.7",
      "Temperature_Bedroom" : "21.46",
      "Temperature_Kitchen" : "22.28",
      "Temperature_Living" : "21.365",
      "device_id" : "Stream-data-1",
      "timecollected" : "2019-01-25 17:23:51"
    },
    "Stream-data-10" : {
      "CO2" : "1279.25",
      "Door_Sensor" : "0",
      "Humidity" : "33.425",
      "HumidityRatio" : "0.00530797",
      "Light" : "464.33",
      "Light_Bedroom" : "465",
      "Light_Living" : "464.0",
      "Light_kitchen" : "464",
      "Occupancy" : "1",
      "Occupancy_Bedroom" : "1",
      "Occupancy_Kitchen" : "1",
      "Occupancy_Living" : "1",
      "Temperature" : "21.87",
      "Temperature_Bedroom" : "21.85",
      "Temperature_Kitchen" : "22.26",
      "Temperature_Living" : "21.5",
      "device_id" : "Stream-data-10",
      "timecollected" : "2019-01-28 09:27:37"
    },
    "Stream-data-11" : {
      "CO2" : "1279.25",
      "Door_Sensor" : "0",
      "Humidity" : "33.425",
      "HumidityRatio" : "0.00530797",
      "Light" : "464.33",
      "Light_Bedroom" : "465",
      "Light_Living" : "464.0",
      "Light_kitchen" : "464",
      "Occupancy" : "1",
      "Occupancy_Bedroom" : "1",
      "Occupancy_Kitchen" : "1",
      "Occupancy_Living" : "1",
      "Temperature" : "21.87",
      "Temperature_Bedroom" : "21.85",
      "Temperature_Kitchen" : "22.26",
      "Temperature_Living" : "21.5",
      "device_id" : "Stream-data-11",
      "timecollected" : "2019-01-28 09:28:09"
    },
    "Stream-data-12" : {
      "CO2" : "1279.25",
      "Door_Sensor" : "0",
      "Humidity" : "33.425",
      "HumidityRatio" : "0.00530797",
      "Light" : "464.33",
      "Light_Bedroom" : "465",
      "Light_Living" : "464.0",
      "Light_kitchen" : "464",
      "Occupancy" : "1",
      "Occupancy_Bedroom" : "1",
      "Occupancy_Kitchen" : "1",
      "Occupancy_Living" : "1",
      "Temperature" : "21.87",
      "Temperature_Bedroom" : "21.85",
      "Temperature_Kitchen" : "22.26",
      "Temperature_Living" : "21.5",
      "device_id" : "Stream-data-12",
      "timecollected" : "2019-01-28 09:28:21"
    },
    "Stream-data-2" : {
      "CO2" : "1229.25",
      "Door_Sensor" : "1",
      "Humidity" : "33.2675",
      "HumidityRatio" : "0.005282746",
      "Light" : "26.83",
      "Light_Bedroom" : "27",
      "Light_Living" : "26.5",
      "Light_kitchen" : "27",
      "Occupancy" : "0",
      "Occupancy_Bedroom" : "0",
      "Occupancy_Kitchen" : "0",
      "Occupancy_Living" : "0",
      "Temperature" : "21.87",
      "Temperature_Bedroom" : "22.01",
      "Temperature_Kitchen" : "22.09",
      "Temperature_Living" : "21.5",
      "device_id" : "Stream-data-2",
      "timecollected" : "2019-01-24 14:09:50"
    },
    "Stream-data-3" : {
      "CO2" : "1175.75",
      "Door_Sensor" : "0",
      "Humidity" : "33.0",
      "HumidityRatio" : "0.005172352",
      "Light" : "13.33",
      "Light_Bedroom" : "13",
      "Light_Living" : "13.0",
      "Light_kitchen" : "14",
      "Occupancy" : "1",
      "Occupancy_Bedroom" : "1",
      "Occupancy_Kitchen" : "0",
      "Occupancy_Living" : "0",
      "Temperature" : "21.44",
      "Temperature_Bedroom" : "21.63",
      "Temperature_Kitchen" : "21.41",
      "Temperature_Living" : "21.29",
      "device_id" : "Stream-data-3",
      "timecollected" : "2019-01-24 09:28:45"
    },
    "Stream-data-4" : {
      "CO2" : "1229.25",
      "Door_Sensor" : "1",
      "Humidity" : "33.2675",
      "HumidityRatio" : "0.005282746",
      "Light" : "26.83",
      "Light_Bedroom" : "27",
      "Light_Living" : "26.5",
      "Light_kitchen" : "27",
      "Occupancy" : "0",
      "Occupancy_Bedroom" : "0",
      "Occupancy_Kitchen" : "0",
      "Occupancy_Living" : "0",
      "Temperature" : "21.87",
      "Temperature_Bedroom" : "22.01",
      "Temperature_Kitchen" : "22.09",
      "Temperature_Living" : "21.5",
      "device_id" : "Stream-data-4",
      "timecollected" : "2019-01-24 11:15:26"
    },
    "Stream-data-5" : {
      "CO2" : "1279.25",
      "Door_Sensor" : "0",
      "Humidity" : "33.425",
      "HumidityRatio" : "0.00530797",
      "Light" : "464.33",
      "Light_Bedroom" : "465",
      "Light_Living" : "464.0",
      "Light_kitchen" : "464",
      "Occupancy" : "1",
      "Occupancy_Bedroom" : "1",
      "Occupancy_Kitchen" : "1",
      "Occupancy_Living" : "1",
      "Temperature" : "21.87",
      "Temperature_Bedroom" : "21.85",
      "Temperature_Kitchen" : "22.26",
      "Temperature_Living" : "21.5",
      "device_id" : "Stream-data-5",
      "timecollected" : "2019-01-28 09:25:24"
    },
    "Stream-data-6" : {
      "CO2" : "1281.5",
      "Door_Sensor" : "0",
      "Humidity" : "33.5",
      "HumidityRatio" : "0.005319982",
      "Light" : "475.42",
      "Light_Bedroom" : "476",
      "Light_Living" : "475.25",
      "Light_kitchen" : "475",
      "Occupancy" : "1",
      "Occupancy_Bedroom" : "0",
      "Occupancy_Kitchen" : "0",
      "Occupancy_Living" : "1",
      "Temperature" : "21.86",
      "Temperature_Bedroom" : "22.01",
      "Temperature_Kitchen" : "22.08",
      "Temperature_Living" : "21.5",
      "device_id" : "Stream-data-6",
      "timecollected" : "2019-01-28 09:25:53"
    },
    "Stream-data-7" : {
      "CO2" : "1279.25",
      "Door_Sensor" : "0",
      "Humidity" : "33.425",
      "HumidityRatio" : "0.00530797",
      "Light" : "464.33",
      "Light_Bedroom" : "465",
      "Light_Living" : "464.0",
      "Light_kitchen" : "464",
      "Occupancy" : "1",
      "Occupancy_Bedroom" : "1",
      "Occupancy_Kitchen" : "1",
      "Occupancy_Living" : "1",
      "Temperature" : "21.87",
      "Temperature_Bedroom" : "21.85",
      "Temperature_Kitchen" : "22.26",
      "Temperature_Living" : "21.5",
      "device_id" : "Stream-data-7",
      "timecollected" : "2019-01-28 09:26:18"
    },
    "Stream-data-8" : {
      "CO2" : "1279.25",
      "Door_Sensor" : "0",
      "Humidity" : "33.425",
      "HumidityRatio" : "0.00530797",
      "Light" : "464.33",
      "Light_Bedroom" : "465",
      "Light_Living" : "464.0",
      "Light_kitchen" : "464",
      "Occupancy" : "1",
      "Occupancy_Bedroom" : "1",
      "Occupancy_Kitchen" : "1",
      "Occupancy_Living" : "1",
      "Temperature" : "21.87",
      "Temperature_Bedroom" : "21.85",
      "Temperature_Kitchen" : "22.26",
      "Temperature_Living" : "21.5",
      "device_id" : "Stream-data-8",
      "timecollected" : "2019-01-28 09:27:08"
    },
    "Stream-data-9" : {
      "CO2" : "1279.25",
      "Door_Sensor" : "0",
      "Humidity" : "33.425",
      "HumidityRatio" : "0.00530797",
      "Light" : "464.33",
      "Light_Bedroom" : "465",
      "Light_Living" : "464.0",
      "Light_kitchen" : "464",
      "Occupancy" : "1",
      "Occupancy_Bedroom" : "1",
      "Occupancy_Kitchen" : "1",
      "Occupancy_Living" : "1",
      "Temperature" : "21.87",
      "Temperature_Bedroom" : "21.85",
      "Temperature_Kitchen" : "22.26",
      "Temperature_Living" : "21.5",
      "device_id" : "Stream-data-9",
      "timecollected" : "2019-01-28 09:27:21"
    }
  },
  "locations" : [ {
    "buildings" : [ {
      "building_id" : "Whitehorse-1788",
      "floors" : [ {
        "blocks" : [ {
          "block_id" : "USA-WH-1788-FL-1-RM-101",
          "devices" : [ {
            "device_id" : "Stream-data-1"
          } ]
        }, {
          "block_id" : "USA-WH-1788-FL-1-RM-102",
          "devices" : [ {
            "device_id" : "Stream-data-2"
          } ]
        } ],
        "floor_id" : "USA-WH-1788-FL-1"
      }, {
        "blocks" : [ {
          "block_id" : "USA-WH-1788-FL-2-RM-201",
          "devices" : [ {
            "device_id" : "Stream-data-3"
          } ]
        }, {
          "block_id" : "USA-WH-1788-FL-2-RM-202",
          "devices" : [ {
            "device_id" : "Stream-data-4"
          } ]
        } ],
        "floor_id" : "USA-WH-1788-FL-2"
      }, {
        "blocks" : [ {
          "block_id" : "USA-WH-1788-FL-3-RM-301",
          "devices" : [ {
            "device_id" : "Stream-data-5"
          } ]
        }, {
          "block_id" : "USA-WH-1788-FL-3-RM-302",
          "devices" : {
            "device_id" : "Stream-data-6"
          }
        } ],
        "floor_id" : "USA-WH-1788-FL-3"
      } ]
    } ],
    "latitude" : 36.758721,
    "location_id" : "USA-WH-1788",
    "longitude" : -95.933272
  }, {
    "buildings" : [ {
      "building_id" : "Habitat-1501",
      "floors" : [ {
        "blocks" : [ {
          "block_id" : "CAN-HAB-1501-FL-1-RM-101",
          "devices" : [ {
            "device_id" : "Stream-data-7"
          } ]
        }, {
          "block_id" : "CAN-HAB-1501-FL-1-RM-102",
          "devices" : [ {
            "device_id" : "Stream-data-8"
          } ]
        } ],
        "floor_id" : "CAN-HAB-1501-FL-1"
      }, {
        "blocks" : [ {
          "block_id" : "CAN-HAB-1501-FL-2-RM-201",
          "devices" : [ {
            "device_id" : "Stream-data-9"
          } ]
        }, {
          "block_id" : "CAN-HAB-1501-FL-2-RM-202",
          "devices" : [ {
            "device_id" : "Stream-data-10"
          } ]
        } ],
        "floor_id" : "CAN-HAB-1501-FL-2"
      }, {
        "blocks" : [ {
          "block_id" : "CAN-HAB-1501-FL-3-RM-301",
          "devices" : [ {
            "device_id" : "Stream-data-11"
          } ]
        }, {
          "block_id" : "CAN-HAB-1501-FL-3-RM-302",
          "devices" : [ {
            "device_id" : "Stream-data-12"
          } ]
        } ],
        "floor_id" : "CAN-HAB-1501-FL-3"
      } ]
    } ],
    "latitude" : 56.130367,
    "location_id" : "CAN-HAB-1501",
    "longitude" : -106.346771
  } ]
}
