<?xml version="1.0" encoding="UTF-8"?>
<svg width="62px" height="52px" viewBox="0 0 62 52" version="1.1" xmlns="http://www.w3.org/2000/svg" xmlns:xlink="http://www.w3.org/1999/xlink">
    <!-- Generator: Sketch 50.2 (55047) - http://www.bohemiancoding.com/sketch -->
    <title>icon/tiakit/empty-result</title>
    <desc>Created with Sketch.</desc>
    <defs></defs>
    <g id="Search---✅" stroke="none" stroke-width="1" fill="none" fill-rule="evenodd">
        <g id="Hasil-Pencarian---Tidak-ada-Hasil" transform="translate(-149.000000, -210.000000)">
            <g id="icon/tiakit/empty-result" transform="translate(179.787833, 240.358852) rotate(50.000000) translate(-179.787833, -240.358852) translate(158.787833, 204.858852)">
                <rect id="Rectangle-path" fill="#999999" fill-rule="nonzero" x="14.7736003" y="43.3801653" width="6.10988244" height="2.44395298" rx="1.22197649"></rect>
                <rect id="Rectangle-path" fill="#999999" fill-rule="nonzero" x="14.7736003" y="47.0460948" width="6.10988244" height="23.8285415" rx="3.05494122"></rect>
                <circle id="Oval-3" stroke="#979797" stroke-width="2" fill="#D8D8D8" cx="20.6080319" cy="21.2222979" r="19.5"></circle>
            </g>
        </g>
    </g>
</svg>