<?xml version="1.0" encoding="UTF-8"?>
<svg width="128px" height="128px" viewBox="0 0 128 128" version="1.1" xmlns="http://www.w3.org/2000/svg" xmlns:xlink="http://www.w3.org/1999/xlink">
    <!-- Generator: Sketch 50.2 (55047) - http://www.bohemiancoding.com/sketch -->
    <title>icon/tiakit/icon-chevron-right/red</title>
    <desc>Created with Sketch.</desc>
    <defs></defs>
    <g id="Icons" stroke="none" stroke-width="1" fill="none" fill-rule="evenodd">
        <g id="Icons/Essential" transform="translate(-384.000000, -1401.000000)">
            <g id="Navbar-Bottom" transform="translate(64.000000, 64.000000)">
                <g id="icon-chevron-right-copy-2" transform="translate(320.000000, 1337.000000)">
                    <g id="icon/tiakit/chevron/right/red">
                        <g id="placeholder/icon/blank">
                            <rect id="placeholder" x="0" y="0" width="128" height="128"></rect>
                        </g>
                        <path d="M71.4204107,63.991068 L71.4204107,63.991068 L41.5517297,32.889768 C40.8014398,32.1216141 40.8193039,30.853267 41.5874577,30.0672491 L46.9288068,24.6008517 C47.6969607,23.8148338 48.9474437,23.7969697 49.6977336,24.5651236 L86.1761107,62.5619445 C86.5691197,62.9549534 86.7477601,63.4908748 86.712032,64.008932 C86.7298961,64.5448533 86.5512556,65.0629106 86.1761107,65.4559196 L49.6977336,103.434876 C48.9474437,104.20303 47.6969607,104.185166 46.9288068,103.399148 L41.5874577,97.9327509 C40.8193039,97.146733 40.8014398,95.8783859 41.5517297,95.110232 L71.4204107,63.991068 L71.4204107,63.991068 Z" id="Shape" fill="#C01820" fill-rule="evenodd"></path>
                    </g>
                </g>
            </g>
        </g>
    </g>
</svg>