<?xml version="1.0" encoding="UTF-8"?>
<svg width="128px" height="128px" viewBox="0 0 128 128" version="1.1" xmlns="http://www.w3.org/2000/svg" xmlns:xlink="http://www.w3.org/1999/xlink">
    <!-- Generator: Sketch 49.3 (51167) - http://www.bohemiancoding.com/sketch -->
    <title>icon/tiakit/active-icon-display</title>
    <desc>Created with Sketch.</desc>
    <defs></defs>
    <g id="Icons" stroke="none" stroke-width="1" fill="none" fill-rule="evenodd">
        <g id="Icons/Essential" transform="translate(-1504.000000, -64.000000)">
            <g id="Navbar-Bottom" transform="translate(64.000000, 64.000000)">
                <g id="display-active" transform="translate(1440.000000, 0.000000)">
                    <g id="icon/tiakit/display/red">
                        <g id="placeholder/icon/blank">
                            <rect id="placeholder" x="0" y="0" width="128" height="128"></rect>
                        </g>
                        <g id="black" stroke-width="1" fill-rule="evenodd" transform="translate(4.000000, 24.000000)" fill="#CB0020">
                            <path d="M120,72 L120,0 L0,0 L0,72 L43.75,72 L43.75,76 L27.75,76 L27.75,80 L92,80 L92,76 L76,76 L76,72 L120,72 Z M4,4 L116,4 L116,68 L4,68 L4,4 Z" id="Shape" fill-rule="nonzero"></path>
                            <rect id="Rectangle-path" fill-rule="nonzero" x="8" y="8" width="104" height="56"></rect>
                        </g>
                    </g>
                </g>
            </g>
        </g>
    </g>
</svg>