<?xml version="1.0" encoding="UTF-8"?>
<svg width="128px" height="128px" viewBox="0 0 128 128" version="1.1" xmlns="http://www.w3.org/2000/svg" xmlns:xlink="http://www.w3.org/1999/xlink">
    <!-- Generator: Sketch 49.3 (51167) - http://www.bohemiancoding.com/sketch -->
    <title>icon/tiakit/icon-person</title>
    <desc>Created with Sketch.</desc>
    <defs></defs>
    <g id="Icons" stroke="none" stroke-width="1" fill="none" fill-rule="evenodd">
        <g id="Icons/Essential" transform="translate(-704.000000, -64.000000)">
            <g id="Navbar-Bottom" transform="translate(64.000000, 64.000000)">
                <g id="person" transform="translate(640.000000, 0.000000)">
                    <g id="icon/tiakit/person">
                        <g id="placeholder/icon/blank">
                            <rect id="placeholder" x="0" y="0" width="128" height="128"></rect>
                        </g>
                        <g id="black" stroke-width="1" fill-rule="evenodd" transform="translate(24.000000, 24.000000)" fill="#4A4A4A">
                            <path d="M40,40 C51.0010415,40 60,30.9997917 60,20 C60,9.00020835 51.0010415,0 40,0 C28.9989584,0 20,9.00020835 20,20 C20,30.9997917 28.9989584,40 40,40 Z M40,50 C26.7504167,50 0,56.7504165 0,70 L0,80 L80,80 L80,70 C80,56.7504165 53.2495835,50 40,50 Z" id="Shape" fill-rule="nonzero"></path>
                        </g>
                    </g>
                </g>
            </g>
        </g>
    </g>
</svg>