<?xml version="1.0" encoding="UTF-8"?>
<svg width="128px" height="128px" viewBox="0 0 128 128" version="1.1" xmlns="http://www.w3.org/2000/svg" xmlns:xlink="http://www.w3.org/1999/xlink">
    <!-- Generator: Sketch 49.3 (51167) - http://www.bohemiancoding.com/sketch -->
    <title>icon/tiakit/icon-logo</title>
    <desc>Created with Sketch.</desc>
    <defs></defs>
    <g id="Icons" stroke="none" stroke-width="1" fill="none" fill-rule="evenodd">
        <g id="Icons/Essential" transform="translate(-1024.000000, -64.000000)">
            <g id="Navbar-Bottom" transform="translate(64.000000, 64.000000)">
                <g id="logo" transform="translate(960.000000, 0.000000)">
                    <g id="icon/tiakit/logo">
                        <g id="placeholder/icon/blank">
                            <rect id="placeholder" x="0" y="0" width="128" height="128"></rect>
                        </g>
                        <g id="black" stroke-width="1" fill-rule="evenodd" transform="translate(6.000000, 24.000000)" fill="#4A4A4A">
                            <path d="M27.77254,37.7890378 C29.7261843,39.3964335 30.6835437,41.2471318 30.6176157,43.7925813 C30.5075018,48.0237428 30.4948773,52.2625618 30.6376045,56.4919829 C30.6888039,58.0081843 30.9942472,59.679277 31.7236638,60.9817622 C35.0428604,66.9073372 38.5419563,72.7340604 42.00388,78.5802751 C43.1372813,80.4943222 43.8870378,80.4758745 45.0404276,78.5075281 C50.3841064,69.3887416 55.7098999,60.2598609 61.0356939,51.1306322 C66.24436,42.2022411 71.4354922,33.2641037 76.6567833,24.34337 C77.747752,22.4790971 78.2821899,22.4811855 79.403668,24.3391931 C81.1739064,27.2720466 82.8901395,30.2372708 84.6119836,33.1986662 C84.7554124,33.4454491 84.7673356,33.7677636 84.9503909,34.4868801 C82.7263714,33.2143294 80.8754765,32.1380912 79.0077491,31.0914391 C77.4040845,30.1927176 76.2731381,30.4631694 75.3028035,32.0134815 C74.317039,33.5888547 73.3765122,35.1931179 72.4429991,36.8001657 C71.1626623,39.0041566 71.3828903,39.9244585 73.5718415,41.1862192 C87.1554737,49.0153995 100.74647,56.8327454 114.343428,64.6393013 C114.850513,64.9302894 115.447723,65.0674297 116.002851,65.2762726 C116.104899,65.1648896 116.206947,65.0535067 116.308996,64.9424716 C116.021086,64.3504014 115.769298,63.7381431 115.439657,63.17009 C112.701189,58.4484949 109.944134,53.7376905 107.200756,49.0192284 C98.0367576,33.2554019 88.8804742,17.4873985 79.7087608,1.72809702 C78.3768739,-0.560475461 77.7116318,-0.573006049 76.4000847,1.67310166 C71.6858787,9.74732459 66.9983246,17.8368627 62.3002499,25.9201355 C56.5227788,35.8607198 50.7512694,45.8047847 44.9531082,55.7335347 C44.5568384,56.4122748 43.9624339,56.9771954 43.4599081,57.5950229 C43.2288091,57.5288893 42.9977105,57.4627556 42.7666115,57.3962737 C42.5548,55.9437698 42.183078,54.4940507 42.1599333,53.0384141 C42.0827832,48.1678446 42.0743671,43.2941422 42.152569,38.4235728 C42.1935986,35.8913501 41.2716579,33.9696453 39.2636579,32.4252505 C37.1872753,30.8282968 35.2055764,29.1091699 33.2010833,27.4220656 C32.7448472,27.0381423 32.3643582,26.5654607 31.9144343,26.0976522 C32.2419705,25.8446039 32.3724238,25.6566451 32.5091895,25.6517721 C33.9655681,25.5995613 35.4328178,25.6743968 36.8783252,25.5285546 C43.0292717,24.9089867 48.6738345,26.1157519 53.8021947,29.6859249 C55.5012447,30.8686731 56.5859013,30.4391525 57.6856373,28.6340518 C58.6521143,27.0471922 59.5926412,25.4439732 60.5286088,23.8386658 C61.6255394,21.9573374 61.3933886,20.9127737 59.5165433,19.7972034 C56.9618313,18.2785659 54.4344729,16.6875294 51.7612308,15.4024481 C50.1814127,14.6436515 48.345597,14.0233874 46.6202461,14.0108568 C31.8954976,13.9029545 17.1700477,13.9443751 2.44459791,13.9610825 C1.79969538,13.9617787 1.15479284,14.1535663 0,14.3376963 C0.888976573,15.2482523 1.38519032,15.8535492 1.97608797,16.3467671 C10.5618132,23.5097379 19.13807,30.6841951 27.77254,37.7890378 Z" id="Page-1" fill-rule="nonzero"></path>
                        </g>
                    </g>
                </g>
            </g>
        </g>
    </g>
</svg>