<svg width="1280" height="560" viewBox="0 0 1280 560" fill="none" xmlns="http://www.w3.org/2000/svg">
<rect width="1280" height="560" fill="url(#paint0_linear_1:15)"/>
<defs>
<linearGradient id="paint0_linear_1:15" x1="1319.5" y1="-3.75305e-05" x2="-31.5" y2="560" gradientUnits="userSpaceOnUse">
<stop stop-color="#A294FF"/>
<stop offset="0.536458" stop-color="#864AFC"/>
<stop offset="1" stop-color="#646EFF"/>
</linearGradient>
</defs>
</svg>
