<?xml version="1.0" encoding="UTF-8"?>
<svg width="70px" height="70px" viewBox="0 0 70 70" version="1.1" xmlns="http://www.w3.org/2000/svg" xmlns:xlink="http://www.w3.org/1999/xlink">
    <!-- Generator: Sketch 45.1 (43504) - http://www.bohemiancoding.com/sketch -->
    <title>WUSCA/icon/white/giving back</title>
    <desc>Created with Sketch.</desc>
    <defs></defs>
    <g id="Symbols" stroke="none" stroke-width="1" fill="none" fill-rule="evenodd">
        <g id="WUSCA/icon/white/giving-back">
            <g id="Page-1" transform="translate(12.000000, 13.000000)">
                <path d="M13.2952,0.2502 C5.4752,0.2502 0.2502,7.2762 0.2502,15.0982 C0.2502,22.4352 4.0582,28.7762 8.7132,33.7812 C13.3682,38.7862 18.9252,42.4962 22.7372,44.6492 C23.0342,44.8142 23.3862,44.8142 23.6832,44.6492 C27.4952,42.4962 33.0512,38.7862 37.7072,33.7812 C42.3622,28.7762 46.1702,22.4352 46.1702,15.0982 C46.1702,7.2762 40.9442,0.2502 33.1242,0.2502 C28.5152,0.2502 25.4522,2.8222 23.2102,6.3002 C20.9682,2.8222 17.9052,0.2502 13.2952,0.2502 Z" id="Stroke-3" stroke="#FFFFFF" stroke-width="2.5"></path>
                <g id="Group-8" transform="translate(7.000000, 19.023300)">
                    <path d="M10.2522,0.7005 L0.5402,13.0875" id="Fill-5" fill="#FFFFFF"></path>
                    <path d="M10.2522,0.7005 L0.5402,13.0875" id="Stroke-7" stroke="#FFFFFF" stroke-width="2.5" stroke-linecap="round" stroke-linejoin="round"></path>
                </g>
                <g id="Group-12" transform="translate(11.000000, 26.023300)">
                    <path d="M0.8128,10.2337 C2.1028,10.2337 8.5508,0.3437 8.5508,0.3437" id="Fill-9" fill="#FFFFFF"></path>
                    <path d="M0.8128,10.2337 C2.1028,10.2337 8.5508,0.3437 8.5508,0.3437" id="Stroke-11" stroke="#FFFFFF" stroke-width="2.5" stroke-linecap="round" stroke-linejoin="round"></path>
                </g>
                <g id="Group-16" transform="translate(15.000000, 29.023300)">
                    <path d="M0.7864,10.47 C1.9414,10.274 8.4114,0.8 8.4114,0.8" id="Fill-13" fill="#FFFFFF"></path>
                    <path d="M0.7864,10.47 C1.9414,10.274 8.4114,0.8 8.4114,0.8" id="Stroke-15" stroke="#FFFFFF" stroke-width="2.5" stroke-linecap="round" stroke-linejoin="round"></path>
                </g>
                <g id="Group-20" transform="translate(19.000000, 33.023300)">
                    <path d="M0.8313,9.4915 C2.3113,9.3345 8.1923,0.0835 8.1923,0.0835" id="Fill-17" fill="#FFFFFF"></path>
                    <path d="M0.8313,9.4915 C2.3113,9.3345 8.1923,0.0835 8.1923,0.0835" id="Stroke-19" stroke="#FFFFFF" stroke-width="2.5" stroke-linecap="round" stroke-linejoin="round"></path>
                </g>
                <g id="Group-24" transform="translate(15.000000, 7.023300)">
                    <path d="M7.6712,0.1282 L0.0932,10.3172" id="Fill-21" fill="#FFFFFF"></path>
                    <path d="M7.6712,0.1282 L0.0932,10.3172" id="Stroke-23" stroke="#FFFFFF" stroke-width="2.5" stroke-linecap="round" stroke-linejoin="round"></path>
                </g>
                <g id="Group-28" transform="translate(15.000000, 11.023300)" stroke="#FFFFFF" stroke-width="2.5" stroke-linecap="round" stroke-linejoin="round">
                    <path d="M12.7669,0.8929 C12.7669,0.8929 5.8749,13.1469 0.2749,6.6159" id="Stroke-27"></path>
                </g>
            </g>
        </g>
    </g>
</svg>