<?xml version="1.0" encoding="utf-8"?>
<!-- Generator: Adobe Illustrator 19.0.0, SVG Export Plug-In . SVG Version: 6.00 Build 0)  -->
<svg version="1.1" id="Layer_1" xmlns="http://www.w3.org/2000/svg" xmlns:xlink="http://www.w3.org/1999/xlink" x="0px" y="0px"
	 viewBox="0 0 60.1 60.1" style="enable-background:new 0 0 60.1 60.1;" xml:space="preserve">
<style type="text/css">
	.st0{clip-path:url(#XMLID_39_);fill:#FFFFFF;stroke:#FFFFFF;stroke-width:0.800;}
</style>
<g id="XMLID_2_">
	<g id="XMLID_3_">
		<defs>
			<rect id="XMLID_4_" x="0.1" y="0.4" width="53.3" height="59.6"/>
		</defs>
		<clipPath id="XMLID_39_">
			<use xlink:href="#XMLID_4_"  style="overflow:visible;"/>
		</clipPath>
		<path id="XMLID_12_" class="st0" d="M20.3,3.5c0,0.2-0.2,0.2-0.4,0.2l-1.9,0c-0.2,0-0.3-0.2-0.2-0.4l0.8-2.7
			c0-0.2,0.2-0.3,0.4-0.2l1.6,1c0.2,0.1,0.3,0.2,0.2,0.4L20.3,3.5z"/>
		<path id="XMLID_11_" class="st0" d="M11.8,3.7L10,3.7c-0.2,0-0.3,0-0.4-0.2L9.1,1.8C9,1.6,9.1,1.5,9.3,1.4l1.6-1
			c0.2,0,0.3,0,0.4,0.2L12,3.3C12.1,3.4,12,3.6,11.8,3.7"/>
		<path id="XMLID_10_" class="st0" d="M2.7,4l5.6-1.8c0.2-0.1,0.5,0.2,0.6,0.6C9,3.1,9,3.5,8.7,3.6l0,0L3.2,5.3c0,0,0,0,0,0
			c0,0,0,0-0.1,0C1.9,5.7,1.2,7,1.6,8.2c0,0,0,0.1,0,0.1c0,0,0,0,0,0l6.6,21.3c0.1,0.4-0.1,0.8-0.5,0.9C7.4,30.6,7,30.4,6.9,30
			L0.2,8.7C-0.4,6.7,0.7,4.6,2.7,4"/>
		<path id="XMLID_9_" class="st0" d="M23.5,30.1c-0.1,0.4-0.5,0.6-0.9,0.5c-0.4-0.1-0.6-0.5-0.5-0.9l6.3-21.4c0,0,0,0,0,0
			c0,0,0-0.1,0-0.1c0.4-1.2-0.3-2.5-1.6-2.9c0,0,0,0-0.1,0c0,0,0,0,0,0l-5.6-1.6l0,0C21,3.5,20.9,3.2,21,2.8
			c0.1-0.4,0.4-0.6,0.6-0.6l5.7,1.7c2,0.6,3.1,2.7,2.5,4.6L23.5,30.1z"/>
		<path id="XMLID_8_" class="st0" d="M48,29c-0.9,0-1.6,0.7-1.6,1.6s0.7,1.6,1.6,1.6c0.9,0,1.6-0.7,1.6-1.6S48.9,29,48,29"/>
		<path id="XMLID_5_" class="st0" d="M48,28.2c-1.3,0-2.3,1-2.3,2.3s1,2.3,2.3,2.3s2.3-1,2.3-2.3S49.3,28.2,48,28.2 M6.7,32.1
			c0.2-0.6,0.8-0.9,1.3-0.7c0.4,0.1,0.7,0.5,0.8,0.9h0c0,0.2,0,0.5,0,0.7c0,3.6,2.9,6.5,6.5,6.5c3.6,0,6.5-2.9,6.5-6.5
			c0-0.1,0-0.2,0-0.4c0-0.1,0-0.2,0-0.3c0,0,0,0,0,0h0c0-0.1,0-0.1,0-0.2c0.2-0.6,0.8-0.9,1.3-0.7c0.4,0.1,0.7,0.5,0.8,0.9h0
			c0,0.2,0,0.5,0,0.7c0,4.5-3.5,8.2-8,8.6c0,0.2,0,0.4,0,0.6c0,9,8,16.2,17.8,16.2c9.9,0,17.8-7.3,17.8-16.2c0-2.9-0.9-5.7-2.3-8
			c-0.4,0.1-0.8,0.2-1.2,0.2c-2.1,0-3.7-1.7-3.7-3.7c0-2.1,1.7-3.7,3.7-3.7c2.1,0,3.7,1.7,3.7,3.7c0,1-0.4,1.9-1,2.6
			c1.7,2.6,2.7,5.7,2.7,9C53.4,52,44.6,60,33.7,60C22.8,60,14,52,14,42.1c0-0.2,0-0.4,0-0.7c-4.2-0.6-7.4-4.2-7.4-8.5
			c0-0.1,0-0.3,0-0.4C6.6,32.3,6.6,32.2,6.7,32.1"/>
	</g>
</g>
</svg>
