<?xml version="1.0" encoding="UTF-8"?>
<svg width="70px" height="70px" viewBox="0 0 70 70" version="1.1" xmlns="http://www.w3.org/2000/svg" xmlns:xlink="http://www.w3.org/1999/xlink">
    <!-- Generator: Sketch 45.1 (43504) - http://www.bohemiancoding.com/sketch -->
    <title>WUSCA/icon/white/uni info</title>
    <desc>Created with Sketch.</desc>
    <defs></defs>
    <g id="Symbols" stroke="none" stroke-width="1" fill="none" fill-rule="evenodd" stroke-linecap="round">
        <g id="WUSCA/icon/white/uni-info" stroke="#FFFFFF" stroke-width="2">
            <g id="Page-1-Copy" transform="translate(6.000000, 6.000000)">
                <path d="M1,50 C0.448,50 0,50.447 0,51 L0,57 C0,57.553 0.448,58 1,58 L57,58 C57.553,58 58,57.553 58,57 L58,51 C58,50.447 57.553,50 57,50 L1,50 Z" id="Stroke-1" stroke-linejoin="round"></path>
                <path d="M7,41.8799 C6.448,41.8799 6,42.3279 6,42.8799 L6,48.8799 C6,49.4329 6.448,49.8799 7,49.8799 L51,49.8799 C51.553,49.8799 52,49.4329 52,48.8799 L52,42.8799 C52,42.3279 51.553,41.8799 51,41.8799 L7,41.8799 Z" id="Stroke-3" stroke-linejoin="round"></path>
                <polygon id="Stroke-5" stroke-linejoin="round" points="6 13.0298 6 13.0298 52 13.0298 29 -0.0002"></polygon>
                <path d="M26.0098,17 L26.0098,38" id="Stroke-7"></path>
                <path d="M32,17 L32,38" id="Stroke-9"></path>
                <path d="M10,17 L10,38" id="Stroke-11"></path>
                <path d="M15.9902,17 L15.9902,38" id="Stroke-13"></path>
                <path d="M42.0195,17 L42.0195,38" id="Stroke-15"></path>
                <path d="M48.0098,17 L48.0098,38" id="Stroke-17"></path>
            </g>
        </g>
    </g>
</svg>