<?xml version="1.0" encoding="UTF-8"?>
<svg width="70px" height="70px" viewBox="0 0 70 70" version="1.1" xmlns="http://www.w3.org/2000/svg" xmlns:xlink="http://www.w3.org/1999/xlink">
    <!-- Generator: Sketch 45.1 (43504) - http://www.bohemiancoding.com/sketch -->
    <title>WUSCA/icon/white/clubs</title>
    <desc>Created with Sketch.</desc>
    <defs></defs>
    <g id="Symbols" stroke="none" stroke-width="1" fill="none" fill-rule="evenodd">
        <g id="WUSCA/icon/white/clubs">
            <g id="Page-1" transform="translate(8.000000, 7.000000)">
                <path d="M54.5913,33.7994 C52.2003,34.0314 47.8623,33.7484 41.5253,30.6694 C35.2163,27.6044 32.3473,24.3974 31.0733,22.3814 C28.4893,27.6494 25.9053,32.9174 23.3213,38.1874 C23.2593,38.2974 21.0403,42.0894 22.2303,45.5344 C23.3493,48.7764 27.4643,55.1194 28.6493,56.9114 C29.0333,56.8844 29.4183,56.8554 29.8033,56.8264 L29.7903,56.8564 C32.7323,56.5954 38.8443,55.9594 41.6853,54.9874 C45.1703,53.7944 46.7883,49.7284 46.8033,49.6874 C49.4003,44.3914 51.9953,39.0954 54.5913,33.7994 Z" id="Stroke-1" stroke="#FFFFFF" stroke-width="2"></path>
                <path d="M32.4624,23.4859 C32.4734,23.4609 32.4834,23.4349 32.4924,23.4099 C33.8224,20.0369 31.7634,16.1809 31.7414,16.1419 L31.7224,16.1079 L31.7044,16.0689 C29.3364,10.7209 26.9674,5.3749 24.6004,0.0279 C23.2334,1.9859 20.2084,5.0869 13.7424,7.8929 C7.3194,10.6829 3.0104,10.7889 0.6434,10.4559 C3.0044,15.7929 5.3674,21.1289 7.7314,26.4649 C7.7754,26.5829 9.2464,30.6989 12.6594,32.0179 C15.6374,33.1689 22.3354,34.0899 24.9934,34.4239" id="Stroke-3" stroke="#FFFFFF" stroke-width="2"></path>
                <path d="M8.1279,19.2223 C8.1279,19.2223 10.3739,13.8283 15.6609,17.4283 L8.1279,19.2223 Z" id="Fill-5" fill="#FFFFFF"></path>
                <path d="M25.372,11.7335 L18.937,16.0055 C19.845,9.7155 25.372,11.7335 25.372,11.7335" id="Fill-7" fill="#FFFFFF"></path>
                <path d="M11.6064,25.9024 C23.4144,27.9894 28.7264,17.8444 28.7264,17.8444 C24.5334,34.9854 11.6064,25.9024 11.6064,25.9024" id="Fill-9" fill="#FFFFFF"></path>
                <path d="M36.6557,35.7857 C31.2247,39.1857 29.2057,33.6787 29.2057,33.6787 L36.6557,35.7857 Z" id="Fill-11" fill="#FFFFFF"></path>
                <path d="M39.8706,37.3492 L46.1206,41.9002 C46.1206,41.9002 40.5166,43.7022 39.8706,37.3492" id="Fill-13" fill="#FFFFFF"></path>
                <path d="M24.375,44.607 C24.375,44.607 37.665,36.011 41.144,53.396 C41.144,53.396 36.256,42.993 24.375,44.607" id="Fill-15" fill="#FFFFFF"></path>
            </g>
        </g>
    </g>
</svg>