<?xml version="1.0" encoding="utf-8"?>
<!-- Generator: Adobe Illustrator 21.1.0, SVG Export Plug-In . SVG Version: 6.00 Build 0)  -->
<svg version="1.1" id="Layer_1" xmlns="http://www.w3.org/2000/svg" xmlns:xlink="http://www.w3.org/1999/xlink" x="0px" y="0px"
	 width="116px" height="133px" viewBox="0 0 116 133" style="enable-background:new 0 0 116 133;" xml:space="preserve">
<style type="text/css">
	.st0{opacity:0.5;}
	.st1{fill:none;stroke:#546E7A;stroke-width:2;stroke-linecap:round;stroke-linejoin:round;}
	.st2{fill:none;stroke:#546E7A;stroke-linecap:round;}
	.st3{fill:#AAB7BD;}
	.st4{fill:#FEFEFE;}
	.st5{fill:none;stroke:#546E7A;stroke-width:2;stroke-linecap:round;}
	.st6{fill:#879AA2;}
	.st7{fill:none;stroke:#546E7A;stroke-width:2;}
	.st8{fill:none;stroke:#CDECFA;stroke-width:2;stroke-linecap:round;}
	.st9{fill:#00B26D;}
	.st10{fill:none;stroke:#FEFEFE;stroke-width:2;stroke-linecap:round;}
	.st11{fill:none;stroke:#546E7A;}
</style>
<title>icon/notifications</title>
<desc>Created with Sketch.</desc>
<g id="_x2D_">
	<g id="icon_x2F_notifications">
		<g id="icon_x2F_bg" class="st0">
			<g id="Page-1">
				<polygon id="Stroke-1" class="st1" points="1,33.8 1,99.3 58,132 115,99.3 115,33.8 58,1 				"/>
				<path id="Stroke-3" class="st2" d="M1.8,40.2L62.6,5.1"/>
				<path id="Stroke-5" class="st2" d="M2.4,46.8L68.5,8.7"/>
				<path id="Stroke-7" class="st2" d="M2.1,53.9L74.7,12"/>
				<path id="Stroke-9" class="st2" d="M2.2,60.7L81,15.2"/>
				<path id="Stroke-11" class="st2" d="M2.1,67.8l85.3-49.2"/>
				<path id="Stroke-13" class="st2" d="M1.8,74.8L93.3,22"/>
				<path id="Stroke-15" class="st2" d="M1.8,81.8l97.1-56.1"/>
				<path id="Stroke-17" class="st2" d="M1.6,88.8L105.2,29"/>
				<path id="Stroke-19" class="st2" d="M2.1,95.5L111,32.6"/>
				<path id="Stroke-21" class="st2" d="M4.4,101.1l109.9-63.5"/>
				<path id="Stroke-23" class="st2" d="M10.6,104.4l103.8-59.9"/>
				<path id="Stroke-25" class="st2" d="M16.3,108l98-56.6"/>
				<path id="Stroke-27" class="st2" d="M22.8,111.2l91.5-52.8"/>
				<path id="Stroke-29" class="st2" d="M29,114.6l85.3-49.2"/>
				<path id="Stroke-31" class="st2" d="M35.2,117.9l78.3-45.2"/>
				<path id="Stroke-33" class="st2" d="M40.2,121.9l73.9-42.7"/>
				<path id="Stroke-35" class="st2" d="M47.3,124.8l66.9-38.6"/>
				<path id="Stroke-37" class="st2" d="M52.2,128.9l62.2-35.9"/>
			</g>
		</g>
		<g id="Page-1_1_" transform="translate(35.000000, 30.000000)">
			<g id="Group-9">
				<path id="Fill-1" class="st3" d="M2.5,0.5c0,0-2,0-2,2v68c0,0,0,2,2,2H42c0,0,2,0,2-2v-68c0,0,0-2-2-2H2.5z"/>
				<path id="Stroke-3_1_" class="st1" d="M2.5,0.5c0,0-2,0-2,2v68c0,0,0,2,2,2H42c0,0,2,0,2-2v-68c0,0,0-2-2-2H2.5z"/>
				<path id="Fill-5" class="st4" d="M7.1,7.3c0,0-2,0-2,2V58c0,0,0,2,2,2h30.4c0,0,2,0,2-2V9.3c0,0,0-2-2-2H7.1z"/>
				<path id="Stroke-7_1_" class="st1" d="M7.1,7.3c0,0-2,0-2,2V58c0,0,0,2,2,2h30.4c0,0,2,0,2-2V9.3c0,0,0-2-2-2H7.1z"/>
			</g>
			<path id="Stroke-10" class="st5" d="M16.9,3.9h10.7"/>
			<g id="Group-15" transform="translate(19.000000, 63.000000)">
				<path id="Fill-11" class="st6" d="M3.3,5.5c1.3,0,2.4-1.1,2.4-2.4S4.6,0.7,3.3,0.7S0.9,1.8,0.9,3.1S1.9,5.5,3.3,5.5"/>
				<path id="Stroke-13_1_" class="st7" d="M3.3,5.5c1.3,0,2.4-1.1,2.4-2.4S4.6,0.7,3.3,0.7S0.9,1.8,0.9,3.1S1.9,5.5,3.3,5.5z"/>
			</g>
			<path id="Stroke-16" class="st8" d="M17.2,15.3l-7.1,7.1"/>
			<path id="Stroke-17_1_" class="st8" d="M31.2,18.5l-7.1,7.1"/>
			<path id="Stroke-18" class="st8" d="M28.9,11.9L12.7,28.1"/>
			<g id="Group-23" transform="translate(18.000000, 21.000000)">
				<path id="Fill-19" class="st9" d="M3.4,0.6c0,0-2,0-2,2v20.1c0,0,0,2,2,2h39.5c0,0,2,0,2-2V2.6c0,0,0-2-2-2H3.4z"/>
				<path id="Stroke-21_1_" class="st1" d="M3.4,0.6c0,0-2,0-2,2v20.1c0,0,0,2,2,2h39.5c0,0,2,0,2-2V2.6c0,0,0-2-2-2H3.4z"/>
			</g>
			<path id="Stroke-24" class="st2" d="M20.6,30.2h41.1"/>
			<path id="Stroke-25_1_" class="st10" d="M25.6,35.4h28.7"/>
			<path id="Stroke-26" class="st10" d="M25.6,39.9H47"/>
			<path id="Stroke-27_1_" class="st11" d="M24.2,27.2c0.7,0,1.2-0.5,1.2-1.2c0-0.7-0.5-1.2-1.2-1.2c-0.7,0-1.2,0.5-1.2,1.2
				C23,26.7,23.6,27.2,24.2,27.2z"/>
		</g>
	</g>
</g>
</svg>
