<?xml version="1.0" encoding="UTF-8"?>
<svg width="96px" height="37px" viewBox="0 0 96 37" version="1.1" xmlns="http://www.w3.org/2000/svg" xmlns:xlink="http://www.w3.org/1999/xlink">
    <!-- Generator: Sketch 51.1 (57501) - http://www.bohemiancoding.com/sketch -->
    <title>Oval 2</title>
    <desc>Created with Sketch.</desc>
    <defs></defs>
    <g id="Page-1" stroke="none" stroke-width="1" fill="none" fill-rule="evenodd">
        <g id="Homepage---Chatbot---Guided-tour---Desktop" transform="translate(-1053.000000, -88.000000)" stroke="#FFFFFF">
            <path d="M1101,124 C1126.95738,124 1148,116.164983 1148,106.5 C1148,96.8350169 1126.95738,89 1101,89 C1075.04262,89 1054,96.8350169 1054,106.5 C1054,116.164983 1075.04262,124 1101,124 Z" id="Oval-2"></path>
        </g>
    </g>
</svg>