<svg fill="#707070" height="100%" viewBox="0 0 24 24" width="100%" style="stroke-width:10px;" xmlns="http://www.w3.org/2000/svg">
    <path d="M19 13h-6v6h-2v-6H5v-2h6V5h2v6h6v2z"/>
    <path d="M0 0h24v24H0z" fill="none"/>
</svg>