{
  "project_info": {
    "project_number": "169978274459",
    "project_id": "wajooba",
    "storage_bucket": "wajooba.appspot.com"
  },
  "client": [
    {
      "client_info": {
        "mobilesdk_app_id": "1:169978274459:android:d2de89c5e8643d40c59c3e",
        "android_client_info": {
          "package_name": "com.wajooba.flutterstudent"
        }
      },
      "oauth_client": [
        {
          "client_id": "169978274459-097p7u1su24jqtn0b6t5t5r2bsdnggpq.apps.googleusercontent.com",
          "client_type": 1,
          "android_info": {
            "package_name": "com.wajooba.flutterstudent",
            "certificate_hash": "afd451079b9e766e1262813147918ec81f465ac1"
          }
        },
        {
          "client_id": "169978274459-16l3e7quk73chcnld27t03d7pcffqb5t.apps.googleusercontent.com",
          "client_type": 1,
          "android_info": {
            "package_name": "com.wajooba.flutterstudent",
            "certificate_hash": "63a962cff8c356539747ca4595ae4612152fe2da"
          }
        },
        {
          "client_id": "169978274459-2ga9410n5qfm5ntlgrkf8ddobofkn9bv.apps.googleusercontent.com",
          "client_type": 1,
          "android_info": {
            "package_name": "com.wajooba.flutterstudent",
            "certificate_hash": "a062a214730a27d414906cf237c8c296bad07d3d"
          }
        },
        {
          "client_id": "169978274459-2paoi9o24orjvnqh6dbgeiko68gnu585.apps.googleusercontent.com",
          "client_type": 1,
          "android_info": {
            "package_name": "com.wajooba.flutterstudent",
            "certificate_hash": "b1cc7744138a6cc86d5a0b32a1e349a744e524da"
          }
        },
        {
          "client_id": "169978274459-4cthndrfgu5u4rggicc3r6gggnbnqqd0.apps.googleusercontent.com",
          "client_type": 1,
          "android_info": {
            "package_name": "com.wajooba.flutterstudent",
            "certificate_hash": "9df1745df243644e6459db0ff939c4ee169a4c96"
          }
        },
        {
          "client_id": "169978274459-8kl3fuuf0epos620rj3kl1drq1475k54.apps.googleusercontent.com",
          "client_type": 1,
          "android_info": {
            "package_name": "com.wajooba.flutterstudent",
            "certificate_hash": "61c4540ffdda86870a3b48c5359c8cc1a3f30df5"
          }
        },
        {
          "client_id": "169978274459-f0abghfofivqgo4n7uib8dmmp8snra6f.apps.googleusercontent.com",
          "client_type": 1,
          "android_info": {
            "package_name": "com.wajooba.flutterstudent",
            "certificate_hash": "73b507951f1ce239d9f9e494d31500527a242059"
          }
        },
        {
          "client_id": "169978274459-uoa3kfn44pfcg0e4371pl7cmd20usmnj.apps.googleusercontent.com",
          "client_type": 1,
          "android_info": {
            "package_name": "com.wajooba.flutterstudent",
            "certificate_hash": "3aa342d3534657b17ffd97ad6e0ff786c9d43194"
          }
        }
      ],
      "api_key": [
        {
          "current_key": "AIzaSyCguXyf1mwvGHYFn432yqXpH7H_A_OUDEs"
        }
      ],
      "services": {
        "appinvite_service": {
          "other_platform_oauth_client": [
            {
              "client_id": "169978274459-g7ehsvfr6f9un0c71mdn3n0bvp8tf9kg.apps.googleusercontent.com",
              "client_type": 3
            },
            {
              "client_id": "169978274459-2edf8bbgg9t0pg8vg1dgukjpm328cutk.apps.googleusercontent.com",
              "client_type": 2,
              "ios_info": {
                "bundle_id": "com.example.regtechCampApp"
              }
            }
          ]
        }
      }
    },
    {
      "client_info": {
        "mobilesdk_app_id": "1:169978274459:android:db7824175cf37ea0c59c3e",
        "android_client_info": {
          "package_name": "com.wajooba.kesrevdanda"
        }
      },
      "oauth_client": [
        {
          "client_id": "169978274459-6n0ut71agan55bc6t637k3vdlb73eepm.apps.googleusercontent.com",
          "client_type": 1,
          "android_info": {
            "package_name": "com.wajooba.kesrevdanda",
            "certificate_hash": "68ed4cbaca07018cb8ad96c4ae65e73cd6ce0592"
          }
        },
        {
          "client_id": "169978274459-dbv5vuvj7iig0mpk233akpr4n4vretg5.apps.googleusercontent.com",
          "client_type": 1,
          "android_info": {
            "package_name": "com.wajooba.kesrevdanda",
            "certificate_hash": "361024283b1ac39e7e6c9d471fb006d619e5ead9"
          }
        }
      ],
      "api_key": [
        {
          "current_key": "AIzaSyCguXyf1mwvGHYFn432yqXpH7H_A_OUDEs"
        }
      ],
      "services": {
        "appinvite_service": {
          "other_platform_oauth_client": [
            {
              "client_id": "169978274459-g7ehsvfr6f9un0c71mdn3n0bvp8tf9kg.apps.googleusercontent.com",
              "client_type": 3
            },
            {
              "client_id": "169978274459-2edf8bbgg9t0pg8vg1dgukjpm328cutk.apps.googleusercontent.com",
              "client_type": 2,
              "ios_info": {
                "bundle_id": "com.example.regtechCampApp"
              }
            }
          ]
        }
      }
    },
    {
      "client_info": {
        "mobilesdk_app_id": "1:169978274459:android:891c8e822c1c709dc59c3e",
        "android_client_info": {
          "package_name": "com.wajooba.mindsynckids"
        }
      },
      "oauth_client": [
        {
          "client_id": "169978274459-5tu7h0bj55a5u104i8e6qdsr0r3ti25s.apps.googleusercontent.com",
          "client_type": 1,
          "android_info": {
            "package_name": "com.wajooba.mindsynckids",
            "certificate_hash": "b1cc7744138a6cc86d5a0b32a1e349a744e524da"
          }
        }
      ],
      "api_key": [
        {
          "current_key": "AIzaSyCguXyf1mwvGHYFn432yqXpH7H_A_OUDEs"
        }
      ],
      "services": {
        "appinvite_service": {
          "other_platform_oauth_client": [
            {
              "client_id": "169978274459-g7ehsvfr6f9un0c71mdn3n0bvp8tf9kg.apps.googleusercontent.com",
              "client_type": 3
            },
            {
              "client_id": "169978274459-2edf8bbgg9t0pg8vg1dgukjpm328cutk.apps.googleusercontent.com",
              "client_type": 2,
              "ios_info": {
                "bundle_id": "com.example.regtechCampApp"
              }
            }
          ]
        }
      }
    },
    {
      "client_info": {
        "mobilesdk_app_id": "1:169978274459:android:a27596e6287ea923c59c3e",
        "android_client_info": {
          "package_name": "com.wajooba.regtechcamp"
        }
      },
      "oauth_client": [
        {
          "client_id": "169978274459-1a8gehsjq5ab7mgimqc1r741i262i3l8.apps.googleusercontent.com",
          "client_type": 1,
          "android_info": {
            "package_name": "com.wajooba.regtechcamp",
            "certificate_hash": "7f134c1c1104de383252dd34cbeb6a85241e905c"
          }
        },
        {
          "client_id": "169978274459-aq697nd3v7nfu9k50ko9rud4e51t1h4f.apps.googleusercontent.com",
          "client_type": 1,
          "android_info": {
            "package_name": "com.wajooba.regtechcamp",
            "certificate_hash": "493ea53e3fa6de0d7d751ca24a0de7cf03b33e0d"
          }
        },
        {
          "client_id": "169978274459-elja8qop57i3oi0n0eaa3s5v41g23emq.apps.googleusercontent.com",
          "client_type": 1,
          "android_info": {
            "package_name": "com.wajooba.regtechcamp",
            "certificate_hash": "73b507951f1ce239d9f9e494d31500527a242059"
          }
        }
      ],
      "api_key": [
        {
          "current_key": "AIzaSyCguXyf1mwvGHYFn432yqXpH7H_A_OUDEs"
        }
      ],
      "services": {
        "appinvite_service": {
          "other_platform_oauth_client": [
            {
              "client_id": "169978274459-g7ehsvfr6f9un0c71mdn3n0bvp8tf9kg.apps.googleusercontent.com",
              "client_type": 3
            },
            {
              "client_id": "169978274459-2edf8bbgg9t0pg8vg1dgukjpm328cutk.apps.googleusercontent.com",
              "client_type": 2,
              "ios_info": {
                "bundle_id": "com.example.regtechCampApp"
              }
            }
          ]
        }
      }
    },
    {
      "client_info": {
        "mobilesdk_app_id": "1:169978274459:android:17fc5fdf3229f600c59c3e",
        "android_client_info": {
          "package_name": "com.wajooba.swamiclasses"
        }
      },
      "oauth_client": [
        {
          "client_id": "169978274459-e3nr4ppqfq12q2qrajitmqbvmfn81r0t.apps.googleusercontent.com",
          "client_type": 1,
          "android_info": {
            "package_name": "com.wajooba.swamiclasses",
            "certificate_hash": "8300803bbce81ff7dfa2cef3ee86b5c16aff3848"
          }
        },
        {
          "client_id": "169978274459-n93ebvu96rok1sjj37jn59rabacg01ci.apps.googleusercontent.com",
          "client_type": 1,
          "android_info": {
            "package_name": "com.wajooba.swamiclasses",
            "certificate_hash": "a56095343bdffe65d49eb7c8b9b45c0bee4a986d"
          }
        }
      ],
      "api_key": [
        {
          "current_key": "AIzaSyCguXyf1mwvGHYFn432yqXpH7H_A_OUDEs"
        }
      ],
      "services": {
        "appinvite_service": {
          "other_platform_oauth_client": [
            {
              "client_id": "169978274459-g7ehsvfr6f9un0c71mdn3n0bvp8tf9kg.apps.googleusercontent.com",
              "client_type": 3
            },
            {
              "client_id": "169978274459-2edf8bbgg9t0pg8vg1dgukjpm328cutk.apps.googleusercontent.com",
              "client_type": 2,
              "ios_info": {
                "bundle_id": "com.example.regtechCampApp"
              }
            }
          ]
        }
      }
    }
  ],
  "configuration_version": "1"
}