<svg width="148" height="28" viewBox="0 0 148 28" fill="none" xmlns="http://www.w3.org/2000/svg">
<path d="M148 21L140.766 5.26245L130.754 19.396L148 21ZM3.16484 27.9451C3.56469 27.4522 3.98763 26.9639 4.43318 26.4802L2.22677 24.4476C1.74039 24.9755 1.27618 25.5113 0.835157 26.0549L3.16484 27.9451ZM7.26404 23.733C8.23152 22.887 9.26952 22.0595 10.3744 21.2521L8.60439 18.8299C7.43408 19.6851 6.32721 20.567 5.2892 21.4747L7.26404 23.733ZM13.6806 19.0197C14.7853 18.3287 15.9403 17.6558 17.1424 17.002L15.7092 14.3665C14.4566 15.0477 13.2489 15.7512 12.0897 16.4763L13.6806 19.0197ZM20.7268 15.1758C21.9173 14.6071 23.1451 14.0558 24.4076 13.5227L23.2406 10.759C21.9375 11.3092 20.6676 11.8793 19.4337 12.4687L20.7268 15.1758ZM28.1572 12.0308C29.3993 11.5653 30.6694 11.1166 31.9653 10.6851L31.0176 7.8387C29.6875 8.28154 28.3825 8.74266 27.1045 9.22155L28.1572 12.0308ZM35.825 9.47359C37.1054 9.09524 38.4072 8.73315 39.7286 8.38782L38.9701 5.4853C37.6187 5.83846 36.2863 6.20903 34.9748 6.59657L35.825 9.47359ZM43.6696 7.421C44.978 7.12044 46.3027 6.83592 47.6422 6.56788L47.0536 3.62619C45.6868 3.89971 44.3343 4.19017 42.998 4.49716L43.6696 7.421ZM51.6399 5.82453C52.9631 5.5969 54.2984 5.38512 55.6445 5.1896L55.2133 2.22076C53.8416 2.42 52.4804 2.63586 51.1313 2.86796L51.6399 5.82453ZM59.6701 4.65736C61.0091 4.49758 62.3569 4.35381 63.7121 4.2264L63.4313 1.23957C62.0513 1.36931 60.6786 1.51574 59.3146 1.67849L59.6701 4.65736ZM67.7661 3.89586C69.1129 3.80277 70.4655 3.72588 71.8225 3.66555L71.6892 0.668508C70.3077 0.729938 68.9305 0.808216 67.5592 0.902996L67.7661 3.89586ZM75.8828 3.53497C77.235 3.50812 78.5903 3.49787 79.9471 3.50453L79.9619 0.504571C78.5801 0.497783 77.2001 0.508226 75.8232 0.535559L75.8828 3.53497ZM84.0109 3.57531C85.3639 3.61588 86.7171 3.67355 88.0694 3.74864L88.2357 0.753258C86.8578 0.676738 85.479 0.617984 84.1008 0.576656L84.0109 3.57531ZM92.122 4.02652C93.4725 4.13691 94.8206 4.26507 96.165 4.41133L96.4895 1.42893C95.118 1.27973 93.7432 1.14903 92.3664 1.0365L92.122 4.02652ZM100.193 4.90571C101.536 5.08948 102.873 5.29185 104.204 5.51314L104.696 2.55375C103.336 2.32768 101.971 2.12102 100.6 1.93343L100.193 4.90571ZM108.197 6.23802C109.528 6.50026 110.85 6.7821 112.163 7.08388L112.835 4.16011C111.491 3.85119 110.138 3.56283 108.778 3.29467L108.197 6.23802ZM116.094 8.05507C117.403 8.40149 118.701 8.76864 119.987 9.15686L120.854 6.28495C119.535 5.88652 118.203 5.50997 116.862 5.15492L116.094 8.05507ZM123.842 10.3977C125.124 10.8364 126.391 11.2973 127.642 11.7807L128.723 8.98221C127.435 8.48453 126.131 8.01039 124.814 7.55938L123.842 10.3977ZM131.379 13.312C132.618 13.8501 133.839 14.4119 135.041 14.9975L136.355 12.3007C135.113 11.6954 133.852 11.1154 132.574 10.5602L131.379 13.312ZM138.621 16.8453C139.806 17.4927 140.969 18.1653 142.108 18.8636L143.676 16.3056C142.493 15.5807 141.287 14.8832 140.059 14.2126L138.621 16.8453Z" fill="white"/>
</svg>
