{
  "kind": "collectionType",
  "collectionName": "categorias",
  "info": {
    "name": "Categorias"
  },
  "options": {
    "increments": true,
    "timestamps": true,
    "draftAndPublish": true
  },
  "attributes": {
    "Nombre": {
      "type": "string",
      "required": true
    }
  }
}
