{
	"Hostname": "localhost",
	"Exchanges": [
		{
			"Name": "EnergyExchange"
		}
	],
	"Upstream": [
		{
			"FunctionKey": "HandleProductionData",
			"Exchange": "WeatherExchange",
			"Route": "weather.solar"
		},
		{
			"FunctionKey": "HandleWindData",
			"Exchange": "WeatherExchange",
			"Route": "weather.wind"
		}

	]
}
