{
	"Hostname": "localhost",
	"Upstream": [
		{
			"FunctionKey": "HandleTotalEnergyDataProducer",
			"Exchange": "EnergyExchange",
			"QueueName": "EnergyProducerTotalQueue",
			"Route": "energy.producers.total"
		},
		{
			"FunctionKey": "HandleSubtotalEnergyDataProducer",
			"Exchange": "EnergyExchange",
			"QueueName": "EnergyProducerSubtotalQueue",
			"Route": "energy.producers.total.*"
		},
		{
			"FunctionKey": "HandleTotalEnergyDataConsumer",
			"Exchange": "EnergyExchange",
			"QueueName": "EnergyConsumerTotalConsumptionQueue",
			"Route": "energy.consumers.total"
		},
		{
			"FunctionKey": "HandleSubtotalEnergyDataConsumer",
			"Exchange": "EnergyExchange",
			"QueueName": "EnergyConsumerSubtotalQueue",
			"Route": "energy.consumers.total.*"
		},
		{
			"FunctionKey": "HandleEnergyDataConsumer",
			"Exchange": "EnergyExchange",
			"QueueName": "EnergyConsumerQueue",
			"Route": "energy.consumer"
		}
	]
}