[2022.07.07 11:58:34] [0000m.00s.010ms] [0] WELCOME
[2022.07.07 11:58:34] [0000m.00s.011ms] [1] iCDB Server ver.2.208, iXwgOZHcFF2Rxa3bSXj9yA, build:20194967 created 2022-02-14 19:51:22, sources stamp:iXwgOZHcFF2Rxa3bSXj9yA
[2022.07.07 11:58:34] [0000m.00s.011ms] [1] Copyright Siemens 2020\r\n\r\nTHIS WORK CONTAINS TRADE SECRET AND CONFIDENTIAL\r\nINFORMATION WHICH ARE THE PROPERTY OF MENTOR\r\nGRAPHICS CORPORATION OR ITS LICENSORS AND IS\r\nSUBJECT TO LICENSE TERMS.
[2022.07.07 11:58:34] [0000m.00s.011ms] [1] Base flow version [VX.2.8]
[2022.07.07 11:58:34] [0000m.00s.011ms] [1] Install Id [2255256], Flow Id [PADS Professional VX.2.8], Full Flow Name [PADS Pro Tools VX.2.8], Exact Access Date [2020/10/01]
[2022.07.07 11:58:34] [0000m.00s.011ms] [1] UPDATE Install Info, Install Id [2459570], UPDATE Name [PADS Pro Tools VX.2.8 - Update 15]
[2022.07.07 11:58:34] [0000m.00s.016ms] [1] Machine [DESKTOP-EBMQ6TM]  IP [127.0.0.1,192.168.1.64]  User [SHINA]  PID [15564]
[2022.07.07 11:58:34] [0000m.00s.016ms] [1] Operating system [Microsoft Windows 10 Business Edition, 64-bit (build 19044)]
[2022.07.07 11:58:34] [0000m.00s.016ms] [1] Current working dir [D:\Pd-Master\Mas\Mas100n3 ACB_0001_2]
[2022.07.07 11:58:34] [0000m.00s.016ms] [1] PATH [C:\MentorGraphics\PADSProVX.2.8\SDD_HOME\common\win64\bin;C:\MentorGraphics\PADSProVX.2.8\SDD_HOME\common\win64\lib;C:\MentorGraphics\PADSProVX.2.8\SDD_HOME\common\win64\jre\default\bin;C:\MentorGraphics\PADSProVX.2.8\SDD_HOME\common\win32\lib;C:\MentorGraphics\PADSProVX.2.8\MGC_HOME.ixw\bin;C:\MentorGraphics\PADSProVX.2.8\MGC_HOME.ixw\lib;C:\MentorGraphics\PADSProVX.2.8\SDD_HOME\wg\win64\lib;C:\Windows\system32;C:\Windows;C:\Windows\System32\Wbem;C:\Windows\System32\WindowsPowerShell\v1.0\;C:\Windows\System32\OpenSSH\;C:\Program Files\Microsoft SQL Server\Client SDK\ODBC\110\Tools\Binn\;C:\Program Files (x86)\Microsoft SQL Server\120\Tools\Binn\;C:\Program Files\Microsoft SQL Server\120\Tools\Binn\;C:\Program Files\Microsoft SQL Server\120\DTS\Binn\;C:\Program Files (x86)\Windows Kits\8.1\Windows Performance Toolkit\;C:\Users\SHINA\AppData\Local\Microsoft\WindowsApps;C:\MentorGraphics\7.9.5EE\SDD_HOME\common\win32\lib;C:\Program Files (x86)\interCAD;C:\MentorGraphics\PADSProVX.2.8\SDD_HOME\common3D\win64\lib]
[2022.07.07 11:58:34] [0000m.00s.016ms] [1] SDD_HOME [C:\MentorGraphics\PADSProVX.2.8\SDD_HOME] on file system [NTFS]
[2022.07.07 11:58:34] [0000m.00s.016ms] [1] SDD_PLATFORM [win64]
[2022.07.07 11:58:34] [0000m.00s.016ms] [1] WDIR [C:\WDIR\PADSProVX.2.8;C:\MentorGraphics\PADSProVX.2.8\SDD_HOME\standard;]
[2022.07.07 11:58:34] [0000m.00s.016ms] [1] Local iCDB working dir [C:\WDIR\PADSProVX.2.8\iCDB] on file system [NTFS]
[2022.07.07 11:58:34] [0000m.00s.016ms] [1] S: Config file name [ServerWG.cfg]
[2022.07.07 11:58:34] [0000m.00s.016ms] [2] S: Loading config files
[2022.07.07 11:58:34] [0000m.00s.018ms] [1] Config file [D:\Pd-Master\Mas\Mas100n3 ACB_0001_2\keyin.icdb\cdbsvr\ServerWG.cfg] not found
[2022.07.07 11:58:34] [0000m.00s.018ms] [1] Config: Non-default value [System.SingleUserMode] = [no]
[2022.07.07 11:58:34] [0000m.00s.020ms] [3] S: Config loaded
[2022.07.07 11:58:34] [0000m.00s.025ms] [0] S: Project path [D:\Pd-Master\Mas\Mas100n3 ACB_0001_2\keyin.icdb] on file system [NTFS]
[2022.07.07 11:58:34] [0000m.00s.025ms] [0] S: Project file (.prj) path [D:\Pd-Master\Mas\Mas100n3 ACB_0001_2\Mas100n3 ACB_0001_2.prj] on file system [NTFS]
[2022.07.07 11:58:34] [0000m.00s.027ms] [1] S: WARNING: Database auto-repair support DISABLED
[2022.07.07 11:58:34] [0000m.00s.027ms] [0] S: Multi-user mode (config)
[2022.07.07 11:58:34] [0000m.00s.027ms] [0] S: Event polling mode autodetection
[2022.07.07 11:58:34] [0000m.00s.027ms] [0] S: Started up automatically by iCDB Client: DESKTOP-EBMQ6TM:SHINA:8292
[2022.07.07 11:58:34] [0000m.00s.027ms] [0] S: Auto close mode
[2022.07.07 11:58:34] [0000m.00s.027ms] [0] S: Database ID [c6ca-2959-d06f-932e-a4ea-6c20-5ea6-c260-9796-04d2-ce70-60a8]
[2022.07.07 11:58:34] [0000m.00s.027ms] [0] PathTranslator: BEGIN dumping
[2022.07.07 11:58:34] [0000m.00s.027ms] [0] PathTranslator: Local -> global path prefix list
[2022.07.07 11:58:34] [0000m.00s.027ms] [0] PathTranslator: [HP Universal Printing PCL 6,LocalsplOnly] -> [\\DESKTOP-EBMQ6TM\HP Universal Printing PCL 6]
[2022.07.07 11:58:34] [0000m.00s.027ms] [0] PathTranslator: [C:\Windows\system32\spool\drivers] -> [\\DESKTOP-EBMQ6TM\print$]
[2022.07.07 11:58:34] [0000m.00s.027ms] [0] PathTranslator: [R:\] -> [\\192.168.1.81\Software\]
[2022.07.07 11:58:34] [0000m.00s.027ms] [0] PathTranslator: [S:\] -> [\\192.168.1.81\Commesse\]
[2022.07.07 11:58:34] [0000m.00s.027ms] [0] PathTranslator: [T:\] -> [\\192.168.1.81\Librerie\]
[2022.07.07 11:58:34] [0000m.00s.027ms] [0] PathTranslator: Global -> local path prefix list
[2022.07.07 11:58:34] [0000m.00s.027ms] [0] PathTranslator: [\\DESKTOP-EBMQ6TM\HP Universal Printing PCL 6] -> [HP Universal Printing PCL 6,LocalsplOnly]
[2022.07.07 11:58:34] [0000m.00s.027ms] [0] PathTranslator: [\\192.168.1.81\Software\] -> [R:\]
[2022.07.07 11:58:34] [0000m.00s.027ms] [0] PathTranslator: [\\192.168.1.81\Commesse\] -> [S:\]
[2022.07.07 11:58:34] [0000m.00s.027ms] [0] PathTranslator: [\\192.168.1.81\Librerie\] -> [T:\]
[2022.07.07 11:58:34] [0000m.00s.027ms] [0] PathTranslator: [\\DESKTOP-EBMQ6TM\print$] -> [C:\Windows\system32\spool\drivers]
[2022.07.07 11:58:34] [0000m.00s.027ms] [0] PathTranslator: END dumping
[2022.07.07 11:58:34] [0000m.00s.027ms] [0] S: START
[2022.07.07 11:58:34] [0000m.00s.027ms] [0] S: Server startup lock file created
[2022.07.07 11:58:34] [0000m.00s.028ms] [0] S: Listening for client connections on port [10001]
[2022.07.07 11:58:34] [0000m.00s.028ms] [0] S: Server network ID [DESKTOP-EBMQ6TM:192.168.1.64,DESKTOP-EBMQ6TM:10001]
[2022.07.07 11:58:34] [0000m.00s.028ms] [0] S: Server GUID [e91e-9d7c-437a-6aa2-a4ea-6c20-5ea6-c260-1fb2-04d2-ce70-60a8]
[2022.07.07 11:58:34] [0000m.00s.028ms] [0] S: Project GUID [c6ca-2959-d06f-932e-a4ea-6c20-5ea6-c260-9796-04d2-ce70-60a8]
[2022.07.07 11:58:34] [0000m.00s.040ms] [0] S: Wrote data to server address file
[2022.07.07 11:58:34] [0000m.00s.040ms] [0] S: Server startup lock file removed
[2022.07.07 11:58:34] [0000m.00s.040ms] [1] ProjectBackupManager: Setting project file (.prj) path: [D:\Pd-Master\Mas\Mas100n3 ACB_0001_2\Mas100n3 ACB_0001_2.prj]
[2022.07.07 11:58:34] [0000m.00s.115ms] [0] S: Plugins loaded: [PIM] [ENetGen70] 
[2022.07.07 11:58:34] [0000m.00s.115ms] [1] ServerToolkit: INFO: Plugin not found in SDD_ICDB_BIN [C:\MentorGraphics\PADSProVX.2.8\SDD_HOME\iCDB\win64\bin]
[2022.07.07 11:58:34] [0000m.00s.115ms] [1] ServerToolkit: INFO: Plugin not found in SDD_COMMON_BIN [C:\MentorGraphics\PADSProVX.2.8\SDD_HOME\common\win64\bin]
[2022.07.07 11:58:34] [0000m.00s.116ms] [1] ServerToolkit: INFO: Plugin not found in PATH
[2022.07.07 11:58:34] [0000m.00s.116ms] [1] ServerToolkit: INFO: Plugin not found in CWD
[2022.07.07 11:58:34] [0000m.00s.116ms] [1] ServerToolkit: INFO: returning just plugin exe name!
[2022.07.07 11:58:34] [0000m.00s.116ms] [0] S: Local disc access time: 31 us
[2022.07.07 11:58:34] [0000m.00s.116ms] [0] S: File server access time: 63 us
[2022.07.07 11:58:34] [0000m.00s.119ms] [0] Single file [D:\Pd-Master\Mas\Mas100n3 ACB_0001_2\keyin.icdb\icdb.dat] size [164656 (160.8 kB)]
[2022.07.07 11:58:34] [0000m.00s.119ms] [1] Single file [D:\Pd-Master\Mas\Mas100n3 ACB_0001_2\keyin.icdb\icdb.dat] opened in read-write mode
[2022.07.07 11:58:34] [0000m.00s.119ms] [0] SingleFile: [0000-0000-0000-0000] SFI header version check [1009] [1009]
[2022.07.07 11:58:34] [0000m.00s.119ms] [0] Database GUARD OK: [164656]
[2022.07.07 11:58:34] [0000m.00s.120ms] [0] SingleFile: [0000-0000-0000-0000] SFI header version check [1009] [1009]
[2022.07.07 11:58:34] [0000m.00s.120ms] [0] Database GUARD OK: [164656]
[2022.07.07 11:58:34] [0000m.00s.120ms] [0] SingleFile: [0000-0000-0000-0000] SFI header version check [1009] [1009]
[2022.07.07 11:58:34] [0000m.00s.120ms] [0] Database GUARD OK: [164656]
[2022.07.07 11:58:34] [0000m.00s.120ms] [0] SingleFile: [0000-0000-0000-0000] SFI header version check [1009] [1009]
[2022.07.07 11:58:34] [0000m.00s.120ms] [0] Database GUARD OK: [164656]
[2022.07.07 11:58:34] [0000m.00s.120ms] [0] SingleFile: [0000-0000-0000-0000] SFI header version check [1009] [1009]
[2022.07.07 11:58:34] [0000m.00s.120ms] [0] Database GUARD OK: [164656]
[2022.07.07 11:58:34] [0000m.00s.120ms] [0] SingleFile: [476b-e12d-4e5e-6fdd] SFI version check [1009] [1009]
[2022.07.07 11:58:34] [0000m.00s.121ms] [0] SingleFile: [476b-e12d-4e5e-6fdd] Database SFI header has been read in [767us]
[2022.07.07 11:58:34] [0000m.00s.124ms] [0] iCDB Server PI: Server & plugin session [1511]
[2022.07.07 11:58:34] [0000m.00s.124ms] [0] iCDB Server PI: Opening database [D:\Pd-Master\Mas\Mas100n3 ACB_0001_2\keyin.icdb]
[2022.07.07 11:58:34] [0000m.00s.124ms] [0] iCDB Server PI: Database [D:\Pd-Master\Mas\Mas100n3 ACB_0001_2\keyin.icdb] opened
[2022.07.07 11:58:34] [0000m.00s.139ms] [0] iCDB Database: Checking existence of constraint definitions
[2022.07.07 11:58:34] [0000m.00s.139ms] [0] iCDB Database: Checking constraint definitions version
[2022.07.07 11:58:34] [0000m.00s.156ms] [1] iCDB Database: Constraint definitions version [ce_ee.cns=7.10.75] up to date
[2022.07.07 11:58:34] [0000m.00s.218ms] [0] iCDB Server PI: Initializing plugins
[2022.07.07 11:58:34] [0000m.00s.218ms] [0] iCDB Server PI: Plugins initialized
[2022.07.07 11:58:34] [0000m.00s.218ms] [0] S: iCDB database loaded
[2022.07.07 11:58:34] [0000m.00s.219ms] [0] S: Starting threads
[2022.07.07 11:58:34] [0000m.00s.219ms] [0] BT: Listening for broadcast messages on port [10000]
[2022.07.07 11:58:34] [0000m.00s.219ms] [1] CMT: There are no clients - waiting [10 seconds]
[2022.07.07 11:58:34] [0000m.00s.220ms] [0] IT: Session [1512] for host [DESKTOP-EBMQ6TM] user [SHINA] client type[0] clsvrPluginID[0] with process ID [8292] created
[2022.07.07 11:58:34] [0000m.00s.222ms] [1] SC[1512]: Registered sub-client [Expedition PE_272188359] with ID [1] for session ID [1512] host [DESKTOP-EBMQ6TM] user [SHINA] process ID [8292]
[2022.07.07 11:58:34] [0000m.00s.224ms] [0] MWT: WindowProc: WM_NCCREATE
[2022.07.07 11:58:34] [0000m.00s.227ms] [0] IT: iCDB Server Monitor session [1] for host [DESKTOP-EBMQ6TM] user [SHINA] with process ID [3952] created
[2022.07.07 11:58:34] [0000m.00s.227ms] [1] DMT: There are [1] iCDB Server Monitor connected now
[2022.07.07 11:58:34] [0000m.00s.266ms] [1] SC[1512]: Registered sub-client [EEVM_EEVM_1163022272] with ID [2] for session ID [1512] host [DESKTOP-EBMQ6TM] user [SHINA] process ID [8292]
[2022.07.07 11:58:34] [0000m.00s.267ms] [1] SC[1512]: UnRegistered sub-client [EEVM_EEVM_1163022272] with ID [2] for session ID [1512] host [DESKTOP-EBMQ6TM] user [SHINA] process ID [8292]
[2022.07.07 11:58:34] [0000m.00s.321ms] [1] CMT: There are [1] clients now: 1512
[2022.07.07 11:58:35] [0000m.01s.001ms] [1] SC[1512]: Registered sub-client [JobPrefsDBPI_272189421] with ID [3] for session ID [1512] host [DESKTOP-EBMQ6TM] user [SHINA] process ID [8292]
[2022.07.07 11:58:35] [0000m.01s.006ms] [1] SC[1512]: UnRegistered sub-client [JobPrefsDBPI_272189421] with ID [3] for session ID [1512] host [DESKTOP-EBMQ6TM] user [SHINA] process ID [8292]
[2022.07.07 11:58:37] [0000m.03s.732ms] [1] SC[1512]: Registered sub-client [JobPrefsDBPI_272192156] with ID [4] for session ID [1512] host [DESKTOP-EBMQ6TM] user [SHINA] process ID [8292]
[2022.07.07 11:58:37] [0000m.03s.746ms] [1] SC[1512]: UnRegistered sub-client [JobPrefsDBPI_272192156] with ID [4] for session ID [1512] host [DESKTOP-EBMQ6TM] user [SHINA] process ID [8292]
[2022.07.07 11:58:38] [0000m.04s.294ms] [1] SC[1512]: Registered sub-client [JobPrefsDBPI_272192718] with ID [5] for session ID [1512] host [DESKTOP-EBMQ6TM] user [SHINA] process ID [8292]
[2022.07.07 11:58:38] [0000m.04s.308ms] [1] SC[1512]: UnRegistered sub-client [JobPrefsDBPI_272192718] with ID [5] for session ID [1512] host [DESKTOP-EBMQ6TM] user [SHINA] process ID [8292]
[2022.07.07 11:58:38] [0000m.04s.484ms] [1] SC[1512]: Registered sub-client [ExpeditionCrossProber] with ID [6] for session ID [1512] host [DESKTOP-EBMQ6TM] user [SHINA] process ID [8292]
[2022.07.07 11:58:38] [0000m.04s.486ms] [1] SC[1512]: Registered sub-client [StartServerClient482c] with ID [7] for session ID [1512] host [DESKTOP-EBMQ6TM] user [SHINA] process ID [8292]
[2022.07.07 11:58:38] [0000m.04s.486ms] [1] SC[1512]: UnRegistered sub-client [StartServerClient482c] with ID [7] for session ID [1512] host [DESKTOP-EBMQ6TM] user [SHINA] process ID [8292]
[2022.07.07 11:59:04] [0000m.30s.053ms] [0] DFAMT: File server access time: 116 us
[2022.07.07 12:03:11] [0004m.37s.667ms] [1] SC[1512]: Registered sub-client [JobPrefsDBPI_272466093] with ID [8] for session ID [1512] host [DESKTOP-EBMQ6TM] user [SHINA] process ID [8292]
[2022.07.07 12:03:11] [0004m.37s.670ms] [1] SC[1512]: UnRegistered sub-client [JobPrefsDBPI_272466093] with ID [8] for session ID [1512] host [DESKTOP-EBMQ6TM] user [SHINA] process ID [8292]
[2022.07.07 12:03:12] [0004m.38s.114ms] [1] SC[1512]: Registered sub-client [JobPrefsDBPI_272466531] with ID [9] for session ID [1512] host [DESKTOP-EBMQ6TM] user [SHINA] process ID [8292]
[2022.07.07 12:04:26] [0005m.52s.795ms] [1] SC[1512]: UnRegistered sub-client [JobPrefsDBPI_272466531] with ID [9] for session ID [1512] host [DESKTOP-EBMQ6TM] user [SHINA] process ID [8292]
[2022.07.07 12:04:28] [0005m.54s.551ms] [1] SC[1512]: Registered sub-client [JobPrefsDBPI_272542968] with ID [10] for session ID [1512] host [DESKTOP-EBMQ6TM] user [SHINA] process ID [8292]
[2022.07.07 12:04:28] [0005m.54s.553ms] [1] SC[1512]: UnRegistered sub-client [JobPrefsDBPI_272542968] with ID [10] for session ID [1512] host [DESKTOP-EBMQ6TM] user [SHINA] process ID [8292]
[2022.07.07 12:04:29] [0005m.54s.983ms] [1] SC[1512]: Registered sub-client [JobPrefsDBPI_272543406] with ID [11] for session ID [1512] host [DESKTOP-EBMQ6TM] user [SHINA] process ID [8292]
[2022.07.07 12:05:32] [0006m.58s.567ms] [1] SC[1512]: UnRegistered sub-client [JobPrefsDBPI_272543406] with ID [11] for session ID [1512] host [DESKTOP-EBMQ6TM] user [SHINA] process ID [8292]
[2022.07.07 12:05:36] [0007m.01s.824ms] [1] SC[1512]: Registered sub-client [JobPrefsDBPI_272610250] with ID [12] for session ID [1512] host [DESKTOP-EBMQ6TM] user [SHINA] process ID [8292]
[2022.07.07 12:05:36] [0007m.01s.887ms] [1] SC[1512]: Registered sub-client [JobPrefsDBPI_272610312] with ID [13] for session ID [1512] host [DESKTOP-EBMQ6TM] user [SHINA] process ID [8292]
[2022.07.07 12:05:36] [0007m.01s.936ms] [1] SC[1512]: Registered sub-client [JobPrefsDBPI_272610359] with ID [14] for session ID [1512] host [DESKTOP-EBMQ6TM] user [SHINA] process ID [8292]
[2022.07.07 12:05:36] [0007m.01s.938ms] [1] SC[1512]: UnRegistered sub-client [JobPrefsDBPI_272610359] with ID [14] for session ID [1512] host [DESKTOP-EBMQ6TM] user [SHINA] process ID [8292]
[2022.07.07 12:05:36] [0007m.02s.319ms] [1] SC[1512]: UnRegistered sub-client [JobPrefsDBPI_272610250] with ID [12] for session ID [1512] host [DESKTOP-EBMQ6TM] user [SHINA] process ID [8292]
[2022.07.07 12:05:36] [0007m.02s.333ms] [1] SC[1512]: UnRegistered sub-client [JobPrefsDBPI_272610312] with ID [13] for session ID [1512] host [DESKTOP-EBMQ6TM] user [SHINA] process ID [8292]
[2022.07.07 12:05:36] [0007m.02s.439ms] [1] SC[1512]: Registered sub-client [JobPrefsDBPI_272610859] with ID [15] for session ID [1512] host [DESKTOP-EBMQ6TM] user [SHINA] process ID [8292]
[2022.07.07 12:05:36] [0007m.02s.442ms] [1] SC[1512]: UnRegistered sub-client [JobPrefsDBPI_272610859] with ID [15] for session ID [1512] host [DESKTOP-EBMQ6TM] user [SHINA] process ID [8292]
[2022.07.07 12:06:13] [0007m.39s.276ms] [1] SC[1512]: Registered sub-client [JobPrefsDBPI_272647703] with ID [16] for session ID [1512] host [DESKTOP-EBMQ6TM] user [SHINA] process ID [8292]
[2022.07.07 12:06:13] [0007m.39s.278ms] [1] SC[1512]: UnRegistered sub-client [JobPrefsDBPI_272647703] with ID [16] for session ID [1512] host [DESKTOP-EBMQ6TM] user [SHINA] process ID [8292]
[2022.07.07 12:06:13] [0007m.39s.340ms] [1] SC[1512]: Registered sub-client [JobPrefsDBPI_272647765] with ID [17] for session ID [1512] host [DESKTOP-EBMQ6TM] user [SHINA] process ID [8292]
[2022.07.07 12:06:13] [0007m.39s.354ms] [1] SC[1512]: UnRegistered sub-client [JobPrefsDBPI_272647765] with ID [17] for session ID [1512] host [DESKTOP-EBMQ6TM] user [SHINA] process ID [8292]
[2022.07.07 12:06:17] [0007m.43s.752ms] [1] SC[1512]: Registered sub-client [JobPrefsDBPI_272652171] with ID [18] for session ID [1512] host [DESKTOP-EBMQ6TM] user [SHINA] process ID [8292]
[2022.07.07 12:06:17] [0007m.43s.755ms] [1] SC[1512]: UnRegistered sub-client [JobPrefsDBPI_272652171] with ID [18] for session ID [1512] host [DESKTOP-EBMQ6TM] user [SHINA] process ID [8292]
[2022.07.07 12:06:17] [0007m.43s.813ms] [1] SC[1512]: Registered sub-client [JobPrefsDBPI_272652234] with ID [19] for session ID [1512] host [DESKTOP-EBMQ6TM] user [SHINA] process ID [8292]
[2022.07.07 12:06:18] [0007m.43s.828ms] [1] SC[1512]: UnRegistered sub-client [JobPrefsDBPI_272652234] with ID [19] for session ID [1512] host [DESKTOP-EBMQ6TM] user [SHINA] process ID [8292]
[2022.07.07 12:06:21] [0007m.46s.937ms] [1] SC[1512]: Registered sub-client [JobPrefsDBPI_272655359] with ID [20] for session ID [1512] host [DESKTOP-EBMQ6TM] user [SHINA] process ID [8292]
[2022.07.07 12:06:21] [0007m.46s.939ms] [1] SC[1512]: UnRegistered sub-client [JobPrefsDBPI_272655359] with ID [20] for session ID [1512] host [DESKTOP-EBMQ6TM] user [SHINA] process ID [8292]
[2022.07.07 12:06:21] [0007m.47s.006ms] [1] SC[1512]: Registered sub-client [JobPrefsDBPI_272655421] with ID [21] for session ID [1512] host [DESKTOP-EBMQ6TM] user [SHINA] process ID [8292]
[2022.07.07 12:06:21] [0007m.47s.022ms] [1] SC[1512]: UnRegistered sub-client [JobPrefsDBPI_272655421] with ID [21] for session ID [1512] host [DESKTOP-EBMQ6TM] user [SHINA] process ID [8292]
[2022.07.07 12:06:21] [0007m.47s.047ms] [1] SC[1512]: Registered sub-client [JobPrefsDBPI_272655468] with ID [22] for session ID [1512] host [DESKTOP-EBMQ6TM] user [SHINA] process ID [8292]
[2022.07.07 12:06:21] [0007m.47s.050ms] [1] SC[1512]: UnRegistered sub-client [JobPrefsDBPI_272655468] with ID [22] for session ID [1512] host [DESKTOP-EBMQ6TM] user [SHINA] process ID [8292]
[2022.07.07 12:06:21] [0007m.47s.113ms] [1] SC[1512]: Registered sub-client [JobPrefsDBPI_272655531] with ID [23] for session ID [1512] host [DESKTOP-EBMQ6TM] user [SHINA] process ID [8292]
[2022.07.07 12:06:21] [0007m.47s.166ms] [1] SC[1512]: UnRegistered sub-client [JobPrefsDBPI_272655531] with ID [23] for session ID [1512] host [DESKTOP-EBMQ6TM] user [SHINA] process ID [8292]
[2022.07.07 12:06:21] [0007m.47s.218ms] [1] SC[1512]: Registered sub-client [JobPrefsDBPI_272655640] with ID [24] for session ID [1512] host [DESKTOP-EBMQ6TM] user [SHINA] process ID [8292]
[2022.07.07 12:06:21] [0007m.47s.250ms] [1] SC[1512]: UnRegistered sub-client [JobPrefsDBPI_272655640] with ID [24] for session ID [1512] host [DESKTOP-EBMQ6TM] user [SHINA] process ID [8292]
[2022.07.07 12:06:21] [0007m.47s.282ms] [1] SC[1512]: Registered sub-client [JobPrefsDBPI_272655703] with ID [25] for session ID [1512] host [DESKTOP-EBMQ6TM] user [SHINA] process ID [8292]
[2022.07.07 12:06:21] [0007m.47s.316ms] [1] SC[1512]: UnRegistered sub-client [JobPrefsDBPI_272655703] with ID [25] for session ID [1512] host [DESKTOP-EBMQ6TM] user [SHINA] process ID [8292]
[2022.07.07 12:06:21] [0007m.47s.371ms] [1] SC[1512]: Registered sub-client [JobPrefsDBPI_272655796] with ID [26] for session ID [1512] host [DESKTOP-EBMQ6TM] user [SHINA] process ID [8292]
[2022.07.07 12:06:21] [0007m.47s.385ms] [1] SC[1512]: UnRegistered sub-client [JobPrefsDBPI_272655796] with ID [26] for session ID [1512] host [DESKTOP-EBMQ6TM] user [SHINA] process ID [8292]
[2022.07.07 12:06:59] [0008m.25s.535ms] [1] SC[1512]: Registered sub-client [JobPrefsDBPI_272693953] with ID [27] for session ID [1512] host [DESKTOP-EBMQ6TM] user [SHINA] process ID [8292]
[2022.07.07 12:06:59] [0008m.25s.594ms] [1] SC[1512]: Registered sub-client [JobPrefsDBPI_272694015] with ID [28] for session ID [1512] host [DESKTOP-EBMQ6TM] user [SHINA] process ID [8292]
[2022.07.07 12:07:44] [0009m.10s.293ms] [1] SC[1512]: UnRegistered sub-client [JobPrefsDBPI_272693953] with ID [27] for session ID [1512] host [DESKTOP-EBMQ6TM] user [SHINA] process ID [8292]
[2022.07.07 12:07:44] [0009m.10s.302ms] [1] SC[1512]: UnRegistered sub-client [JobPrefsDBPI_272694015] with ID [28] for session ID [1512] host [DESKTOP-EBMQ6TM] user [SHINA] process ID [8292]
[2022.07.07 12:08:26] [0009m.52s.514ms] [0] IT: Session [1513] for host [DESKTOP-EBMQ6TM] user [SHINA] client type[0] clsvrPluginID[0] with process ID [14248] created
[2022.07.07 12:08:26] [0009m.52s.515ms] [1] SC[1513]: Registered sub-client [JobPrefsDBPI_272780890] with ID [1] for session ID [1513] host [DESKTOP-EBMQ6TM] user [SHINA] process ID [14248]
[2022.07.07 12:08:26] [0009m.52s.543ms] [1] SC[1513]: UnRegistered sub-client [JobPrefsDBPI_272780890] with ID [1] for session ID [1513] host [DESKTOP-EBMQ6TM] user [SHINA] process ID [14248]
[2022.07.07 12:08:26] [0009m.52s.590ms] [1] CMT: There are [2] clients now: 1512, 1513
[2022.07.07 12:08:26] [0009m.52s.590ms] [1] CMT: Removed client [1513]
[2022.07.07 12:08:26] [0009m.52s.590ms] [1] CMT: There are [1] clients now: 1512
[2022.07.07 12:08:27] [0009m.53s.095ms] [0] IT: Session [1514] for host [DESKTOP-EBMQ6TM] user [SHINA] client type[0] clsvrPluginID[0] with process ID [14248] created
[2022.07.07 12:08:27] [0009m.53s.096ms] [1] SC[1514]: Registered sub-client [JobPrefsDBPI_272781500] with ID [1] for session ID [1514] host [DESKTOP-EBMQ6TM] user [SHINA] process ID [14248]
[2022.07.07 12:08:27] [0009m.53s.143ms] [1] CMT: There are [2] clients now: 1512, 1514
[2022.07.07 12:08:27] [0009m.53s.253ms] [1] SC[1514]: UnRegistered sub-client [JobPrefsDBPI_272781500] with ID [1] for session ID [1514] host [DESKTOP-EBMQ6TM] user [SHINA] process ID [14248]
[2022.07.07 12:08:27] [0009m.53s.255ms] [1] CMT: Removed client [1514]
[2022.07.07 12:08:27] [0009m.53s.255ms] [1] CMT: There are [1] clients now: 1512
[2022.07.07 12:08:28] [0009m.53s.933ms] [1] SC[1512]: Registered sub-client [JobPrefsDBPI_272782359] with ID [29] for session ID [1512] host [DESKTOP-EBMQ6TM] user [SHINA] process ID [8292]
[2022.07.07 12:08:28] [0009m.53s.960ms] [1] SC[1512]: UnRegistered sub-client [JobPrefsDBPI_272782359] with ID [29] for session ID [1512] host [DESKTOP-EBMQ6TM] user [SHINA] process ID [8292]
[2022.07.07 12:08:28] [0009m.54s.010ms] [1] SC[1512]: Registered sub-client [JobPrefsDBPI_272782437] with ID [30] for session ID [1512] host [DESKTOP-EBMQ6TM] user [SHINA] process ID [8292]
[2022.07.07 12:08:28] [0009m.54s.034ms] [1] SC[1512]: UnRegistered sub-client [JobPrefsDBPI_272782437] with ID [30] for session ID [1512] host [DESKTOP-EBMQ6TM] user [SHINA] process ID [8292]
[2022.07.07 12:08:29] [0009m.55s.012ms] [1] SC[1512]: Registered sub-client [JobPrefsDBPI_272783437] with ID [31] for session ID [1512] host [DESKTOP-EBMQ6TM] user [SHINA] process ID [8292]
[2022.07.07 12:08:29] [0009m.55s.069ms] [1] SC[1512]: Registered sub-client [JobPrefsDBPI_272783484] with ID [32] for session ID [1512] host [DESKTOP-EBMQ6TM] user [SHINA] process ID [8292]
[2022.07.07 12:08:29] [0009m.55s.398ms] [1] SC[1512]: UnRegistered sub-client [JobPrefsDBPI_272783437] with ID [31] for session ID [1512] host [DESKTOP-EBMQ6TM] user [SHINA] process ID [8292]
[2022.07.07 12:08:29] [0009m.55s.410ms] [1] SC[1512]: UnRegistered sub-client [JobPrefsDBPI_272783484] with ID [32] for session ID [1512] host [DESKTOP-EBMQ6TM] user [SHINA] process ID [8292]
[2022.07.07 12:08:29] [0009m.55s.453ms] [1] SC[1512]: Registered sub-client [JobPrefsDBPI_272783875] with ID [33] for session ID [1512] host [DESKTOP-EBMQ6TM] user [SHINA] process ID [8292]
[2022.07.07 12:08:29] [0009m.55s.516ms] [1] SC[1512]: Registered sub-client [JobPrefsDBPI_272783937] with ID [34] for session ID [1512] host [DESKTOP-EBMQ6TM] user [SHINA] process ID [8292]
[2022.07.07 12:08:29] [0009m.55s.524ms] [1] SC[1512]: UnRegistered sub-client [JobPrefsDBPI_272783875] with ID [33] for session ID [1512] host [DESKTOP-EBMQ6TM] user [SHINA] process ID [8292]
[2022.07.07 12:08:29] [0009m.55s.532ms] [1] SC[1512]: UnRegistered sub-client [JobPrefsDBPI_272783937] with ID [34] for session ID [1512] host [DESKTOP-EBMQ6TM] user [SHINA] process ID [8292]
[2022.07.07 12:08:29] [0009m.55s.634ms] [0] IT: Session [1515] for host [DESKTOP-EBMQ6TM] user [SHINA] client type[0] clsvrPluginID[0] with process ID [13528] created
[2022.07.07 12:08:29] [0009m.55s.635ms] [1] SC[1515]: Registered sub-client [JobPrefsDBPI_272784015] with ID [1] for session ID [1515] host [DESKTOP-EBMQ6TM] user [SHINA] process ID [13528]
[2022.07.07 12:08:29] [0009m.55s.652ms] [1] SC[1515]: UnRegistered sub-client [JobPrefsDBPI_272784015] with ID [1] for session ID [1515] host [DESKTOP-EBMQ6TM] user [SHINA] process ID [13528]
[2022.07.07 12:08:29] [0009m.55s.687ms] [1] CMT: There are [2] clients now: 1512, 1515
[2022.07.07 12:08:29] [0009m.55s.687ms] [1] CMT: Removed client [1515]
[2022.07.07 12:08:29] [0009m.55s.687ms] [1] CMT: There are [1] clients now: 1512
[2022.07.07 12:08:30] [0009m.56s.294ms] [0] IT: Session [1516] for host [DESKTOP-EBMQ6TM] user [SHINA] client type[0] clsvrPluginID[0] with process ID [13528] created
[2022.07.07 12:08:30] [0009m.56s.294ms] [1] SC[1516]: Registered sub-client [JobPrefsDBPI_272784703] with ID [1] for session ID [1516] host [DESKTOP-EBMQ6TM] user [SHINA] process ID [13528]
[2022.07.07 12:08:30] [0009m.56s.340ms] [1] SC[1516]: Registered sub-client [JobPrefsDBPI_272784765] with ID [2] for session ID [1516] host [DESKTOP-EBMQ6TM] user [SHINA] process ID [13528]
[2022.07.07 12:08:30] [0009m.56s.352ms] [1] SC[1516]: UnRegistered sub-client [JobPrefsDBPI_272784703] with ID [1] for session ID [1516] host [DESKTOP-EBMQ6TM] user [SHINA] process ID [13528]
[2022.07.07 12:08:30] [0009m.56s.352ms] [1] CMT: There are [2] clients now: 1512, 1516
[2022.07.07 12:08:30] [0009m.56s.354ms] [1] SC[1516]: UnRegistered sub-client [JobPrefsDBPI_272784765] with ID [2] for session ID [1516] host [DESKTOP-EBMQ6TM] user [SHINA] process ID [13528]
[2022.07.07 12:08:30] [0009m.56s.463ms] [1] CMT: Removed client [1516]
[2022.07.07 12:08:30] [0009m.56s.463ms] [1] CMT: There are [1] clients now: 1512
[2022.07.07 12:08:31] [0009m.56s.856ms] [0] IT: Session [1517] for host [DESKTOP-EBMQ6TM] user [SHINA] client type[0] clsvrPluginID[0] with process ID [13528] created
[2022.07.07 12:08:31] [0009m.56s.856ms] [1] SC[1517]: Registered sub-client [JobPrefsDBPI_272785265] with ID [1] for session ID [1517] host [DESKTOP-EBMQ6TM] user [SHINA] process ID [13528]
[2022.07.07 12:08:31] [0009m.56s.902ms] [1] CMT: There are [2] clients now: 1512, 1517
[2022.07.07 12:08:31] [0009m.56s.923ms] [1] SC[1517]: Registered sub-client [JobPrefsDBPI_272785343] with ID [2] for session ID [1517] host [DESKTOP-EBMQ6TM] user [SHINA] process ID [13528]
[2022.07.07 12:08:37] [0010m.03s.687ms] [1] SC[1517]: UnRegistered sub-client [JobPrefsDBPI_272785343] with ID [2] for session ID [1517] host [DESKTOP-EBMQ6TM] user [SHINA] process ID [13528]
[2022.07.07 12:08:37] [0010m.03s.690ms] [1] SC[1517]: UnRegistered sub-client [JobPrefsDBPI_272785265] with ID [1] for session ID [1517] host [DESKTOP-EBMQ6TM] user [SHINA] process ID [13528]
[2022.07.07 12:08:37] [0010m.03s.766ms] [1] CMT: Removed client [1517]
[2022.07.07 12:08:37] [0010m.03s.766ms] [1] CMT: There are [1] clients now: 1512
[2022.07.07 12:08:38] [0010m.03s.992ms] [1] SC[1512]: Registered sub-client [JobPrefsDBPI_272792406] with ID [35] for session ID [1512] host [DESKTOP-EBMQ6TM] user [SHINA] process ID [8292]
[2022.07.07 12:08:38] [0010m.03s.995ms] [1] SC[1512]: UnRegistered sub-client [JobPrefsDBPI_272792406] with ID [35] for session ID [1512] host [DESKTOP-EBMQ6TM] user [SHINA] process ID [8292]
[2022.07.07 12:08:39] [0010m.04s.842ms] [0] IT: Session [1518] for host [DESKTOP-EBMQ6TM] user [SHINA] client type[0] clsvrPluginID[0] with process ID [13996] created
[2022.07.07 12:08:39] [0010m.04s.843ms] [1] SC[1518]: Registered sub-client [JobPrefsDBPI_272793218] with ID [1] for session ID [1518] host [DESKTOP-EBMQ6TM] user [SHINA] process ID [13996]
[2022.07.07 12:08:39] [0010m.04s.873ms] [1] SC[1518]: UnRegistered sub-client [JobPrefsDBPI_272793218] with ID [1] for session ID [1518] host [DESKTOP-EBMQ6TM] user [SHINA] process ID [13996]
[2022.07.07 12:08:39] [0010m.04s.874ms] [1] CMT: There are [2] clients now: 1512, 1518
[2022.07.07 12:08:39] [0010m.04s.874ms] [1] CMT: Removed client [1518]
[2022.07.07 12:08:39] [0010m.04s.874ms] [1] CMT: There are [1] clients now: 1512
[2022.07.07 12:08:39] [0010m.05s.407ms] [0] IT: Session [1519] for host [DESKTOP-EBMQ6TM] user [SHINA] client type[0] clsvrPluginID[0] with process ID [13996] created
[2022.07.07 12:08:39] [0010m.05s.407ms] [1] SC[1519]: Registered sub-client [JobPrefsDBPI_272793812] with ID [1] for session ID [1519] host [DESKTOP-EBMQ6TM] user [SHINA] process ID [13996]
[2022.07.07 12:08:39] [0010m.05s.420ms] [1] CMT: There are [2] clients now: 1512, 1519
[2022.07.07 12:08:39] [0010m.05s.423ms] [1] SC[1519]: UnRegistered sub-client [JobPrefsDBPI_272793812] with ID [1] for session ID [1519] host [DESKTOP-EBMQ6TM] user [SHINA] process ID [13996]
[2022.07.07 12:08:39] [0010m.05s.532ms] [1] CMT: Removed client [1519]
[2022.07.07 12:08:39] [0010m.05s.532ms] [1] CMT: There are [1] clients now: 1512
[2022.07.07 12:08:40] [0010m.06s.190ms] [0] IT: Session [1520] for host [DESKTOP-EBMQ6TM] user [SHINA] client type[0] clsvrPluginID[0] with process ID [13996] created
[2022.07.07 12:08:40] [0010m.06s.191ms] [1] SC[1520]: Registered sub-client [JobPrefsDBPI_272794390] with ID [1] for session ID [1520] host [DESKTOP-EBMQ6TM] user [SHINA] process ID [13996]
[2022.07.07 12:08:40] [0010m.06s.219ms] [1] SC[1520]: UnRegistered sub-client [JobPrefsDBPI_272794390] with ID [1] for session ID [1520] host [DESKTOP-EBMQ6TM] user [SHINA] process ID [13996]
[2022.07.07 12:08:40] [0010m.06s.295ms] [1] CMT: There are [2] clients now: 1512, 1520
[2022.07.07 12:08:40] [0010m.06s.295ms] [1] CMT: Removed client [1520]
[2022.07.07 12:08:40] [0010m.06s.295ms] [1] CMT: There are [1] clients now: 1512
[2022.07.07 12:08:40] [0010m.06s.748ms] [0] IT: Session [1521] for host [DESKTOP-EBMQ6TM] user [SHINA] client type[0] clsvrPluginID[0] with process ID [13996] created
[2022.07.07 12:08:40] [0010m.06s.748ms] [1] SC[1521]: Registered sub-client [JobPrefsDBPI_272795156] with ID [1] for session ID [1521] host [DESKTOP-EBMQ6TM] user [SHINA] process ID [13996]
[2022.07.07 12:08:40] [0010m.06s.764ms] [1] SC[1521]: UnRegistered sub-client [JobPrefsDBPI_272795156] with ID [1] for session ID [1521] host [DESKTOP-EBMQ6TM] user [SHINA] process ID [13996]
[2022.07.07 12:08:41] [0010m.06s.843ms] [1] CMT: There are [2] clients now: 1512, 1521
[2022.07.07 12:08:41] [0010m.06s.843ms] [1] CMT: Removed client [1521]
[2022.07.07 12:08:41] [0010m.06s.843ms] [1] CMT: There are [1] clients now: 1512
[2022.07.07 12:08:41] [0010m.07s.299ms] [0] IT: Session [1522] for host [DESKTOP-EBMQ6TM] user [SHINA] client type[0] clsvrPluginID[0] with process ID [13996] created
[2022.07.07 12:08:41] [0010m.07s.300ms] [1] SC[1522]: Registered sub-client [JobPrefsDBPI_272795703] with ID [1] for session ID [1522] host [DESKTOP-EBMQ6TM] user [SHINA] process ID [13996]
[2022.07.07 12:08:41] [0010m.07s.319ms] [1] SC[1522]: UnRegistered sub-client [JobPrefsDBPI_272795703] with ID [1] for session ID [1522] host [DESKTOP-EBMQ6TM] user [SHINA] process ID [13996]
[2022.07.07 12:08:41] [0010m.07s.388ms] [1] CMT: There are [2] clients now: 1512, 1522
[2022.07.07 12:08:41] [0010m.07s.388ms] [1] CMT: Removed client [1522]
[2022.07.07 12:08:41] [0010m.07s.388ms] [1] CMT: There are [1] clients now: 1512
[2022.07.07 12:08:42] [0010m.07s.897ms] [0] IT: Session [1523] for host [DESKTOP-EBMQ6TM] user [SHINA] client type[0] clsvrPluginID[0] with process ID [13996] created
[2022.07.07 12:08:42] [0010m.07s.897ms] [1] SC[1523]: Registered sub-client [JobPrefsDBPI_272796296] with ID [1] for session ID [1523] host [DESKTOP-EBMQ6TM] user [SHINA] process ID [13996]
[2022.07.07 12:08:42] [0010m.07s.943ms] [1] CMT: There are [2] clients now: 1512, 1523
[2022.07.07 12:08:42] [0010m.07s.946ms] [1] SC[1523]: Registered sub-client [JobPrefsDBPI_272796359] with ID [2] for session ID [1523] host [DESKTOP-EBMQ6TM] user [SHINA] process ID [13996]
[2022.07.07 12:08:42] [0010m.07s.948ms] [1] SC[1523]: UnRegistered sub-client [JobPrefsDBPI_272796359] with ID [2] for session ID [1523] host [DESKTOP-EBMQ6TM] user [SHINA] process ID [13996]
[2022.07.07 12:08:42] [0010m.07s.978ms] [1] SC[1523]: Registered sub-client [JobPrefsDBPI_272796390] with ID [3] for session ID [1523] host [DESKTOP-EBMQ6TM] user [SHINA] process ID [13996]
[2022.07.07 12:08:42] [0010m.08s.149ms] [1] SC[1523]: Registered sub-client [NetPropsDBPI_272796562] with ID [4] for session ID [1523] host [DESKTOP-EBMQ6TM] user [SHINA] process ID [13996]
[2022.07.07 12:08:42] [0010m.08s.152ms] [1] SC[1523]: Registered sub-client [ODB++_272796578] with ID [5] for session ID [1523] host [DESKTOP-EBMQ6TM] user [SHINA] process ID [13996]
[2022.07.07 12:08:42] [0010m.08s.156ms] [1] SC[1523]: UnRegistered sub-client [ODB++_272796578] with ID [5] for session ID [1523] host [DESKTOP-EBMQ6TM] user [SHINA] process ID [13996]
[2022.07.07 12:08:42] [0010m.08s.350ms] [1] SC[1523]: UnRegistered sub-client [NetPropsDBPI_272796562] with ID [4] for session ID [1523] host [DESKTOP-EBMQ6TM] user [SHINA] process ID [13996]
[2022.07.07 12:08:48] [0010m.14s.099ms] [1] SC[1523]: UnRegistered sub-client [JobPrefsDBPI_272796390] with ID [3] for session ID [1523] host [DESKTOP-EBMQ6TM] user [SHINA] process ID [13996]
[2022.07.07 12:08:48] [0010m.14s.115ms] [1] SC[1523]: UnRegistered sub-client [JobPrefsDBPI_272796296] with ID [1] for session ID [1523] host [DESKTOP-EBMQ6TM] user [SHINA] process ID [13996]
[2022.07.07 12:08:48] [0010m.14s.176ms] [1] CMT: Removed client [1523]
[2022.07.07 12:08:48] [0010m.14s.176ms] [1] CMT: There are [1] clients now: 1512
[2022.07.07 12:08:49] [0010m.15s.621ms] [0] IT: Session [1524] for host [DESKTOP-EBMQ6TM] user [SHINA] client type[0] clsvrPluginID[0] with process ID [21344] created
[2022.07.07 12:08:49] [0010m.15s.621ms] [1] SC[1524]: Registered sub-client [JobPrefsDBPI_272804000] with ID [1] for session ID [1524] host [DESKTOP-EBMQ6TM] user [SHINA] process ID [21344]
[2022.07.07 12:08:49] [0010m.15s.639ms] [1] SC[1524]: UnRegistered sub-client [JobPrefsDBPI_272804000] with ID [1] for session ID [1524] host [DESKTOP-EBMQ6TM] user [SHINA] process ID [21344]
[2022.07.07 12:08:49] [0010m.15s.723ms] [1] CMT: There are [2] clients now: 1512, 1524
[2022.07.07 12:08:49] [0010m.15s.723ms] [1] CMT: Removed client [1524]
[2022.07.07 12:08:49] [0010m.15s.723ms] [1] CMT: There are [1] clients now: 1512
[2022.07.07 12:08:50] [0010m.16s.170ms] [0] IT: Session [1525] for host [DESKTOP-EBMQ6TM] user [SHINA] client type[0] clsvrPluginID[0] with process ID [21344] created
[2022.07.07 12:08:50] [0010m.16s.170ms] [1] SC[1525]: Registered sub-client [EZP_272804578] with ID [1] for session ID [1525] host [DESKTOP-EBMQ6TM] user [SHINA] process ID [21344]
[2022.07.07 12:08:50] [0010m.16s.207ms] [1] SC[1525]: UnRegistered sub-client [EZP_272804578] with ID [1] for session ID [1525] host [DESKTOP-EBMQ6TM] user [SHINA] process ID [21344]
[2022.07.07 12:08:50] [0010m.16s.276ms] [1] CMT: There are [2] clients now: 1512, 1525
[2022.07.07 12:08:50] [0010m.16s.276ms] [1] CMT: Removed client [1525]
[2022.07.07 12:08:50] [0010m.16s.276ms] [1] CMT: There are [1] clients now: 1512
[2022.07.07 12:08:51] [0010m.16s.830ms] [0] IT: Session [1526] for host [DESKTOP-EBMQ6TM] user [SHINA] client type[0] clsvrPluginID[0] with process ID [21344] created
[2022.07.07 12:08:51] [0010m.16s.831ms] [1] SC[1526]: Registered sub-client [JobPrefsDBPI_272805234] with ID [1] for session ID [1526] host [DESKTOP-EBMQ6TM] user [SHINA] process ID [21344]
[2022.07.07 12:08:51] [0010m.16s.877ms] [1] SC[1526]: Registered sub-client [JobPrefsDBPI_272805296] with ID [2] for session ID [1526] host [DESKTOP-EBMQ6TM] user [SHINA] process ID [21344]
[2022.07.07 12:08:51] [0010m.16s.937ms] [1] CMT: There are [2] clients now: 1512, 1526
[2022.07.07 12:08:52] [0010m.17s.913ms] [1] SC[1526]: Registered sub-client [JobPrefsDBPI_272806328] with ID [3] for session ID [1526] host [DESKTOP-EBMQ6TM] user [SHINA] process ID [21344]
[2022.07.07 12:08:52] [0010m.17s.975ms] [1] SC[1526]: Registered sub-client [JobPrefsDBPI_272806390] with ID [4] for session ID [1526] host [DESKTOP-EBMQ6TM] user [SHINA] process ID [21344]
[2022.07.07 12:08:52] [0010m.17s.980ms] [1] SC[1526]: UnRegistered sub-client [JobPrefsDBPI_272806328] with ID [3] for session ID [1526] host [DESKTOP-EBMQ6TM] user [SHINA] process ID [21344]
[2022.07.07 12:08:52] [0010m.17s.990ms] [1] SC[1526]: UnRegistered sub-client [JobPrefsDBPI_272806390] with ID [4] for session ID [1526] host [DESKTOP-EBMQ6TM] user [SHINA] process ID [21344]
[2022.07.07 12:08:52] [0010m.18s.004ms] [1] SC[1526]: UnRegistered sub-client [JobPrefsDBPI_272805234] with ID [1] for session ID [1526] host [DESKTOP-EBMQ6TM] user [SHINA] process ID [21344]
[2022.07.07 12:08:52] [0010m.18s.007ms] [1] SC[1526]: UnRegistered sub-client [JobPrefsDBPI_272805296] with ID [2] for session ID [1526] host [DESKTOP-EBMQ6TM] user [SHINA] process ID [21344]
[2022.07.07 12:08:52] [0010m.18s.047ms] [1] CMT: Removed client [1526]
[2022.07.07 12:08:52] [0010m.18s.047ms] [1] CMT: There are [1] clients now: 1512
[2022.07.07 12:08:55] [0010m.20s.967ms] [1] SC[1512]: Registered sub-client [JobPrefsDBPI_272809390] with ID [36] for session ID [1512] host [DESKTOP-EBMQ6TM] user [SHINA] process ID [8292]
[2022.07.07 12:08:55] [0010m.20s.972ms] [1] SC[1512]: Registered sub-client [NetClassDBPI_272809390] with ID [37] for session ID [1512] host [DESKTOP-EBMQ6TM] user [SHINA] process ID [8292]
[2022.07.07 12:08:55] [0010m.20s.990ms] [1] SC[1512]: UnRegistered sub-client [JobPrefsDBPI_272809390] with ID [36] for session ID [1512] host [DESKTOP-EBMQ6TM] user [SHINA] process ID [8292]
[2022.07.07 12:08:55] [0010m.20s.991ms] [1] SC[1512]: UnRegistered sub-client [NetClassDBPI_272809390] with ID [37] for session ID [1512] host [DESKTOP-EBMQ6TM] user [SHINA] process ID [8292]
[2022.07.07 12:08:58] [0010m.24s.579ms] [1] SC[1512]: Registered sub-client [JobPrefsDBPI_272813000] with ID [38] for session ID [1512] host [DESKTOP-EBMQ6TM] user [SHINA] process ID [8292]
[2022.07.07 12:08:58] [0010m.24s.581ms] [1] SC[1512]: UnRegistered sub-client [JobPrefsDBPI_272813000] with ID [38] for session ID [1512] host [DESKTOP-EBMQ6TM] user [SHINA] process ID [8292]
[2022.07.07 12:09:57] [0011m.23s.763ms] [1] SC[1512]: Registered sub-client [JobPrefsDBPI_272872187] with ID [39] for session ID [1512] host [DESKTOP-EBMQ6TM] user [SHINA] process ID [8292]
[2022.07.07 12:09:57] [0011m.23s.766ms] [1] SC[1512]: UnRegistered sub-client [JobPrefsDBPI_272872187] with ID [39] for session ID [1512] host [DESKTOP-EBMQ6TM] user [SHINA] process ID [8292]
[2022.07.07 12:09:58] [0011m.24s.201ms] [1] SC[1512]: Registered sub-client [JobPrefsDBPI_272872625] with ID [40] for session ID [1512] host [DESKTOP-EBMQ6TM] user [SHINA] process ID [8292]
[2022.07.07 12:10:41] [0012m.07s.572ms] [1] SC[1512]: UnRegistered sub-client [JobPrefsDBPI_272872625] with ID [40] for session ID [1512] host [DESKTOP-EBMQ6TM] user [SHINA] process ID [8292]
[2022.07.07 12:10:51] [0012m.17s.557ms] [0] IT: Session [1527] for host [DESKTOP-EBMQ6TM] user [SHINA] client type[0] clsvrPluginID[0] with process ID [5324] created
[2022.07.07 12:10:51] [0012m.17s.557ms] [1] SC[1527]: Registered sub-client [JobPrefsDBPI_272925937] with ID [1] for session ID [1527] host [DESKTOP-EBMQ6TM] user [SHINA] process ID [5324]
[2022.07.07 12:10:51] [0012m.17s.588ms] [1] SC[1527]: UnRegistered sub-client [JobPrefsDBPI_272925937] with ID [1] for session ID [1527] host [DESKTOP-EBMQ6TM] user [SHINA] process ID [5324]
[2022.07.07 12:10:51] [0012m.17s.669ms] [1] CMT: There are [2] clients now: 1512, 1527
[2022.07.07 12:10:51] [0012m.17s.669ms] [1] CMT: Removed client [1527]
[2022.07.07 12:10:51] [0012m.17s.669ms] [1] CMT: There are [1] clients now: 1512
[2022.07.07 12:10:52] [0012m.18s.151ms] [0] IT: Session [1528] for host [DESKTOP-EBMQ6TM] user [SHINA] client type[0] clsvrPluginID[0] with process ID [5324] created
[2022.07.07 12:10:52] [0012m.18s.152ms] [1] SC[1528]: Registered sub-client [JobPrefsDBPI_272926562] with ID [1] for session ID [1528] host [DESKTOP-EBMQ6TM] user [SHINA] process ID [5324]
[2022.07.07 12:10:52] [0012m.18s.211ms] [1] CMT: There are [2] clients now: 1512, 1528
[2022.07.07 12:10:52] [0012m.18s.309ms] [1] SC[1528]: UnRegistered sub-client [JobPrefsDBPI_272926562] with ID [1] for session ID [1528] host [DESKTOP-EBMQ6TM] user [SHINA] process ID [5324]
[2022.07.07 12:10:52] [0012m.18s.323ms] [1] CMT: Removed client [1528]
[2022.07.07 12:10:52] [0012m.18s.323ms] [1] CMT: There are [1] clients now: 1512
[2022.07.07 12:10:53] [0012m.19s.007ms] [1] SC[1512]: Registered sub-client [JobPrefsDBPI_272927421] with ID [41] for session ID [1512] host [DESKTOP-EBMQ6TM] user [SHINA] process ID [8292]
[2022.07.07 12:10:53] [0012m.19s.033ms] [1] SC[1512]: UnRegistered sub-client [JobPrefsDBPI_272927421] with ID [41] for session ID [1512] host [DESKTOP-EBMQ6TM] user [SHINA] process ID [8292]
[2022.07.07 12:10:53] [0012m.19s.086ms] [1] SC[1512]: Registered sub-client [JobPrefsDBPI_272927500] with ID [42] for session ID [1512] host [DESKTOP-EBMQ6TM] user [SHINA] process ID [8292]
[2022.07.07 12:10:53] [0012m.19s.110ms] [1] SC[1512]: UnRegistered sub-client [JobPrefsDBPI_272927500] with ID [42] for session ID [1512] host [DESKTOP-EBMQ6TM] user [SHINA] process ID [8292]
[2022.07.07 12:10:54] [0012m.20s.081ms] [1] SC[1512]: Registered sub-client [JobPrefsDBPI_272928500] with ID [43] for session ID [1512] host [DESKTOP-EBMQ6TM] user [SHINA] process ID [8292]
[2022.07.07 12:10:54] [0012m.20s.139ms] [1] SC[1512]: Registered sub-client [JobPrefsDBPI_272928562] with ID [44] for session ID [1512] host [DESKTOP-EBMQ6TM] user [SHINA] process ID [8292]
[2022.07.07 12:10:54] [0012m.20s.472ms] [1] SC[1512]: UnRegistered sub-client [JobPrefsDBPI_272928500] with ID [43] for session ID [1512] host [DESKTOP-EBMQ6TM] user [SHINA] process ID [8292]
[2022.07.07 12:10:54] [0012m.20s.485ms] [1] SC[1512]: UnRegistered sub-client [JobPrefsDBPI_272928562] with ID [44] for session ID [1512] host [DESKTOP-EBMQ6TM] user [SHINA] process ID [8292]
[2022.07.07 12:10:54] [0012m.20s.524ms] [1] SC[1512]: Registered sub-client [JobPrefsDBPI_272928937] with ID [45] for session ID [1512] host [DESKTOP-EBMQ6TM] user [SHINA] process ID [8292]
[2022.07.07 12:10:54] [0012m.20s.586ms] [1] SC[1512]: Registered sub-client [JobPrefsDBPI_272929000] with ID [46] for session ID [1512] host [DESKTOP-EBMQ6TM] user [SHINA] process ID [8292]
[2022.07.07 12:10:54] [0012m.20s.594ms] [1] SC[1512]: UnRegistered sub-client [JobPrefsDBPI_272928937] with ID [45] for session ID [1512] host [DESKTOP-EBMQ6TM] user [SHINA] process ID [8292]
[2022.07.07 12:10:54] [0012m.20s.602ms] [1] SC[1512]: UnRegistered sub-client [JobPrefsDBPI_272929000] with ID [46] for session ID [1512] host [DESKTOP-EBMQ6TM] user [SHINA] process ID [8292]
[2022.07.07 12:10:54] [0012m.20s.691ms] [0] IT: Session [1529] for host [DESKTOP-EBMQ6TM] user [SHINA] client type[0] clsvrPluginID[0] with process ID [18396] created
[2022.07.07 12:10:54] [0012m.20s.691ms] [1] SC[1529]: Registered sub-client [JobPrefsDBPI_272929078] with ID [1] for session ID [1529] host [DESKTOP-EBMQ6TM] user [SHINA] process ID [18396]
[2022.07.07 12:10:54] [0012m.20s.710ms] [1] SC[1529]: UnRegistered sub-client [JobPrefsDBPI_272929078] with ID [1] for session ID [1529] host [DESKTOP-EBMQ6TM] user [SHINA] process ID [18396]
[2022.07.07 12:10:54] [0012m.20s.739ms] [1] CMT: There are [2] clients now: 1512, 1529
[2022.07.07 12:10:54] [0012m.20s.739ms] [1] CMT: Removed client [1529]
[2022.07.07 12:10:54] [0012m.20s.739ms] [1] CMT: There are [1] clients now: 1512
[2022.07.07 12:10:55] [0012m.21s.341ms] [0] IT: Session [1530] for host [DESKTOP-EBMQ6TM] user [SHINA] client type[0] clsvrPluginID[0] with process ID [18396] created
[2022.07.07 12:10:55] [0012m.21s.341ms] [1] SC[1530]: Registered sub-client [JobPrefsDBPI_272929750] with ID [1] for session ID [1530] host [DESKTOP-EBMQ6TM] user [SHINA] process ID [18396]
[2022.07.07 12:10:55] [0012m.21s.383ms] [1] SC[1530]: Registered sub-client [JobPrefsDBPI_272929796] with ID [2] for session ID [1530] host [DESKTOP-EBMQ6TM] user [SHINA] process ID [18396]
[2022.07.07 12:10:55] [0012m.21s.395ms] [1] SC[1530]: UnRegistered sub-client [JobPrefsDBPI_272929750] with ID [1] for session ID [1530] host [DESKTOP-EBMQ6TM] user [SHINA] process ID [18396]
[2022.07.07 12:10:55] [0012m.21s.395ms] [1] CMT: There are [2] clients now: 1512, 1530
[2022.07.07 12:10:55] [0012m.21s.398ms] [1] SC[1530]: UnRegistered sub-client [JobPrefsDBPI_272929796] with ID [2] for session ID [1530] host [DESKTOP-EBMQ6TM] user [SHINA] process ID [18396]
[2022.07.07 12:10:55] [0012m.21s.504ms] [1] CMT: Removed client [1530]
[2022.07.07 12:10:55] [0012m.21s.505ms] [1] CMT: There are [1] clients now: 1512
[2022.07.07 12:10:56] [0012m.21s.901ms] [0] IT: Session [1531] for host [DESKTOP-EBMQ6TM] user [SHINA] client type[0] clsvrPluginID[0] with process ID [18396] created
[2022.07.07 12:10:56] [0012m.21s.902ms] [1] SC[1531]: Registered sub-client [JobPrefsDBPI_272930312] with ID [1] for session ID [1531] host [DESKTOP-EBMQ6TM] user [SHINA] process ID [18396]
[2022.07.07 12:10:56] [0012m.21s.945ms] [1] CMT: There are [2] clients now: 1512, 1531
[2022.07.07 12:10:56] [0012m.21s.966ms] [1] SC[1531]: Registered sub-client [JobPrefsDBPI_272930390] with ID [2] for session ID [1531] host [DESKTOP-EBMQ6TM] user [SHINA] process ID [18396]
[2022.07.07 12:11:02] [0012m.28s.696ms] [1] SC[1531]: UnRegistered sub-client [JobPrefsDBPI_272930390] with ID [2] for session ID [1531] host [DESKTOP-EBMQ6TM] user [SHINA] process ID [18396]
[2022.07.07 12:11:02] [0012m.28s.699ms] [1] SC[1531]: UnRegistered sub-client [JobPrefsDBPI_272930312] with ID [1] for session ID [1531] host [DESKTOP-EBMQ6TM] user [SHINA] process ID [18396]
[2022.07.07 12:11:02] [0012m.28s.712ms] [1] CMT: Removed client [1531]
[2022.07.07 12:11:02] [0012m.28s.712ms] [1] CMT: There are [1] clients now: 1512
[2022.07.07 12:11:03] [0012m.29s.044ms] [1] SC[1512]: Registered sub-client [JobPrefsDBPI_272937468] with ID [47] for session ID [1512] host [DESKTOP-EBMQ6TM] user [SHINA] process ID [8292]
[2022.07.07 12:11:03] [0012m.29s.047ms] [1] SC[1512]: UnRegistered sub-client [JobPrefsDBPI_272937468] with ID [47] for session ID [1512] host [DESKTOP-EBMQ6TM] user [SHINA] process ID [8292]
[2022.07.07 12:11:04] [0012m.29s.863ms] [0] IT: Session [1532] for host [DESKTOP-EBMQ6TM] user [SHINA] client type[0] clsvrPluginID[0] with process ID [6948] created
[2022.07.07 12:11:04] [0012m.29s.863ms] [1] SC[1532]: Registered sub-client [JobPrefsDBPI_272938250] with ID [1] for session ID [1532] host [DESKTOP-EBMQ6TM] user [SHINA] process ID [6948]
[2022.07.07 12:11:04] [0012m.29s.894ms] [1] SC[1532]: UnRegistered sub-client [JobPrefsDBPI_272938250] with ID [1] for session ID [1532] host [DESKTOP-EBMQ6TM] user [SHINA] process ID [6948]
[2022.07.07 12:11:04] [0012m.29s.923ms] [1] CMT: There are [2] clients now: 1512, 1532
[2022.07.07 12:11:04] [0012m.29s.923ms] [1] CMT: Removed client [1532]
[2022.07.07 12:11:04] [0012m.29s.923ms] [1] CMT: There are [1] clients now: 1512
[2022.07.07 12:11:04] [0012m.30s.424ms] [0] IT: Session [1533] for host [DESKTOP-EBMQ6TM] user [SHINA] client type[0] clsvrPluginID[0] with process ID [6948] created
[2022.07.07 12:11:04] [0012m.30s.424ms] [1] SC[1533]: Registered sub-client [JobPrefsDBPI_272938828] with ID [1] for session ID [1533] host [DESKTOP-EBMQ6TM] user [SHINA] process ID [6948]
[2022.07.07 12:11:04] [0012m.30s.440ms] [1] SC[1533]: UnRegistered sub-client [JobPrefsDBPI_272938828] with ID [1] for session ID [1533] host [DESKTOP-EBMQ6TM] user [SHINA] process ID [6948]
[2022.07.07 12:11:04] [0012m.30s.471ms] [1] CMT: There are [2] clients now: 1512, 1533
[2022.07.07 12:11:04] [0012m.30s.471ms] [1] CMT: Removed client [1533]
[2022.07.07 12:11:04] [0012m.30s.471ms] [1] CMT: There are [1] clients now: 1512
[2022.07.07 12:11:05] [0012m.31s.011ms] [0] IT: Session [1534] for host [DESKTOP-EBMQ6TM] user [SHINA] client type[0] clsvrPluginID[0] with process ID [6948] created
[2022.07.07 12:11:05] [0012m.31s.012ms] [1] SC[1534]: Registered sub-client [JobPrefsDBPI_272939421] with ID [1] for session ID [1534] host [DESKTOP-EBMQ6TM] user [SHINA] process ID [6948]
[2022.07.07 12:11:05] [0012m.31s.025ms] [1] CMT: There are [2] clients now: 1512, 1534
[2022.07.07 12:11:05] [0012m.31s.040ms] [1] SC[1534]: UnRegistered sub-client [JobPrefsDBPI_272939421] with ID [1] for session ID [1534] host [DESKTOP-EBMQ6TM] user [SHINA] process ID [6948]
[2022.07.07 12:11:05] [0012m.31s.132ms] [1] CMT: Removed client [1534]
[2022.07.07 12:11:05] [0012m.31s.132ms] [1] CMT: There are [1] clients now: 1512
[2022.07.07 12:11:05] [0012m.31s.569ms] [0] IT: Session [1535] for host [DESKTOP-EBMQ6TM] user [SHINA] client type[0] clsvrPluginID[0] with process ID [6948] created
[2022.07.07 12:11:05] [0012m.31s.570ms] [1] SC[1535]: Registered sub-client [JobPrefsDBPI_272939984] with ID [1] for session ID [1535] host [DESKTOP-EBMQ6TM] user [SHINA] process ID [6948]
[2022.07.07 12:11:05] [0012m.31s.586ms] [1] SC[1535]: UnRegistered sub-client [JobPrefsDBPI_272939984] with ID [1] for session ID [1535] host [DESKTOP-EBMQ6TM] user [SHINA] process ID [6948]
[2022.07.07 12:11:05] [0012m.31s.678ms] [1] CMT: There are [2] clients now: 1512, 1535
[2022.07.07 12:11:05] [0012m.31s.678ms] [1] CMT: Removed client [1535]
[2022.07.07 12:11:05] [0012m.31s.678ms] [1] CMT: There are [1] clients now: 1512
[2022.07.07 12:11:06] [0012m.32s.122ms] [0] IT: Session [1536] for host [DESKTOP-EBMQ6TM] user [SHINA] client type[0] clsvrPluginID[0] with process ID [6948] created
[2022.07.07 12:11:06] [0012m.32s.123ms] [1] SC[1536]: Registered sub-client [JobPrefsDBPI_272940531] with ID [1] for session ID [1536] host [DESKTOP-EBMQ6TM] user [SHINA] process ID [6948]
[2022.07.07 12:11:06] [0012m.32s.140ms] [1] SC[1536]: UnRegistered sub-client [JobPrefsDBPI_272940531] with ID [1] for session ID [1536] host [DESKTOP-EBMQ6TM] user [SHINA] process ID [6948]
[2022.07.07 12:11:06] [0012m.32s.227ms] [1] CMT: There are [2] clients now: 1512, 1536
[2022.07.07 12:11:06] [0012m.32s.228ms] [1] CMT: Removed client [1536]
[2022.07.07 12:11:06] [0012m.32s.228ms] [1] CMT: There are [1] clients now: 1512
[2022.07.07 12:11:06] [0012m.32s.733ms] [0] IT: Session [1537] for host [DESKTOP-EBMQ6TM] user [SHINA] client type[0] clsvrPluginID[0] with process ID [6948] created
[2022.07.07 12:11:06] [0012m.32s.733ms] [1] SC[1537]: Registered sub-client [JobPrefsDBPI_272941140] with ID [1] for session ID [1537] host [DESKTOP-EBMQ6TM] user [SHINA] process ID [6948]
[2022.07.07 12:11:06] [0012m.32s.775ms] [1] CMT: There are [2] clients now: 1512, 1537
[2022.07.07 12:11:07] [0012m.33s.484ms] [1] SC[1537]: Registered sub-client [JobPrefsDBPI_272941906] with ID [2] for session ID [1537] host [DESKTOP-EBMQ6TM] user [SHINA] process ID [6948]
[2022.07.07 12:11:07] [0012m.33s.486ms] [1] SC[1537]: UnRegistered sub-client [JobPrefsDBPI_272941906] with ID [2] for session ID [1537] host [DESKTOP-EBMQ6TM] user [SHINA] process ID [6948]
[2022.07.07 12:11:07] [0012m.33s.515ms] [1] SC[1537]: Registered sub-client [JobPrefsDBPI_272941937] with ID [3] for session ID [1537] host [DESKTOP-EBMQ6TM] user [SHINA] process ID [6948]
[2022.07.07 12:11:07] [0012m.33s.685ms] [1] SC[1537]: Registered sub-client [NetPropsDBPI_272942109] with ID [4] for session ID [1537] host [DESKTOP-EBMQ6TM] user [SHINA] process ID [6948]
[2022.07.07 12:11:07] [0012m.33s.688ms] [1] SC[1537]: Registered sub-client [ODB++_272942109] with ID [5] for session ID [1537] host [DESKTOP-EBMQ6TM] user [SHINA] process ID [6948]
[2022.07.07 12:11:07] [0012m.33s.692ms] [1] SC[1537]: UnRegistered sub-client [ODB++_272942109] with ID [5] for session ID [1537] host [DESKTOP-EBMQ6TM] user [SHINA] process ID [6948]
[2022.07.07 12:11:08] [0012m.33s.885ms] [1] SC[1537]: UnRegistered sub-client [NetPropsDBPI_272942109] with ID [4] for session ID [1537] host [DESKTOP-EBMQ6TM] user [SHINA] process ID [6948]
[2022.07.07 12:11:13] [0012m.39s.606ms] [1] SC[1537]: UnRegistered sub-client [JobPrefsDBPI_272941937] with ID [3] for session ID [1537] host [DESKTOP-EBMQ6TM] user [SHINA] process ID [6948]
[2022.07.07 12:11:13] [0012m.39s.623ms] [1] SC[1537]: UnRegistered sub-client [JobPrefsDBPI_272941140] with ID [1] for session ID [1537] host [DESKTOP-EBMQ6TM] user [SHINA] process ID [6948]
[2022.07.07 12:11:13] [0012m.39s.647ms] [1] CMT: Removed client [1537]
[2022.07.07 12:11:13] [0012m.39s.647ms] [1] CMT: There are [1] clients now: 1512
[2022.07.07 12:11:14] [0012m.40s.716ms] [0] IT: Session [1538] for host [DESKTOP-EBMQ6TM] user [SHINA] client type[0] clsvrPluginID[0] with process ID [18644] created
[2022.07.07 12:11:14] [0012m.40s.716ms] [1] SC[1538]: Registered sub-client [JobPrefsDBPI_272949093] with ID [1] for session ID [1538] host [DESKTOP-EBMQ6TM] user [SHINA] process ID [18644]
[2022.07.07 12:11:14] [0012m.40s.735ms] [1] SC[1538]: UnRegistered sub-client [JobPrefsDBPI_272949093] with ID [1] for session ID [1538] host [DESKTOP-EBMQ6TM] user [SHINA] process ID [18644]
[2022.07.07 12:11:14] [0012m.40s.752ms] [1] CMT: There are [2] clients now: 1512, 1538
[2022.07.07 12:11:14] [0012m.40s.752ms] [1] CMT: Removed client [1538]
[2022.07.07 12:11:14] [0012m.40s.752ms] [1] CMT: There are [1] clients now: 1512
[2022.07.07 12:11:15] [0012m.41s.257ms] [0] IT: Session [1539] for host [DESKTOP-EBMQ6TM] user [SHINA] client type[0] clsvrPluginID[0] with process ID [18644] created
[2022.07.07 12:11:15] [0012m.41s.257ms] [1] SC[1539]: Registered sub-client [EZP_272949656] with ID [1] for session ID [1539] host [DESKTOP-EBMQ6TM] user [SHINA] process ID [18644]
[2022.07.07 12:11:15] [0012m.41s.294ms] [1] SC[1539]: UnRegistered sub-client [EZP_272949656] with ID [1] for session ID [1539] host [DESKTOP-EBMQ6TM] user [SHINA] process ID [18644]
[2022.07.07 12:11:15] [0012m.41s.301ms] [1] CMT: There are [2] clients now: 1512, 1539
[2022.07.07 12:11:15] [0012m.41s.301ms] [1] CMT: Removed client [1539]
[2022.07.07 12:11:15] [0012m.41s.301ms] [1] CMT: There are [1] clients now: 1512
[2022.07.07 12:11:16] [0012m.41s.915ms] [0] IT: Session [1540] for host [DESKTOP-EBMQ6TM] user [SHINA] client type[0] clsvrPluginID[0] with process ID [18644] created
[2022.07.07 12:11:16] [0012m.41s.915ms] [1] SC[1540]: Registered sub-client [JobPrefsDBPI_272950328] with ID [1] for session ID [1540] host [DESKTOP-EBMQ6TM] user [SHINA] process ID [18644]
[2022.07.07 12:11:16] [0012m.41s.957ms] [1] CMT: There are [2] clients now: 1512, 1540
[2022.07.07 12:11:16] [0012m.41s.961ms] [1] SC[1540]: Registered sub-client [JobPrefsDBPI_272950375] with ID [2] for session ID [1540] host [DESKTOP-EBMQ6TM] user [SHINA] process ID [18644]
[2022.07.07 12:11:17] [0012m.42s.958ms] [1] SC[1540]: Registered sub-client [JobPrefsDBPI_272951375] with ID [3] for session ID [1540] host [DESKTOP-EBMQ6TM] user [SHINA] process ID [18644]
[2022.07.07 12:11:17] [0012m.43s.022ms] [1] SC[1540]: Registered sub-client [JobPrefsDBPI_272951437] with ID [4] for session ID [1540] host [DESKTOP-EBMQ6TM] user [SHINA] process ID [18644]
[2022.07.07 12:11:17] [0012m.43s.028ms] [1] SC[1540]: UnRegistered sub-client [JobPrefsDBPI_272951375] with ID [3] for session ID [1540] host [DESKTOP-EBMQ6TM] user [SHINA] process ID [18644]
[2022.07.07 12:11:17] [0012m.43s.039ms] [1] SC[1540]: UnRegistered sub-client [JobPrefsDBPI_272951437] with ID [4] for session ID [1540] host [DESKTOP-EBMQ6TM] user [SHINA] process ID [18644]
[2022.07.07 12:11:17] [0012m.43s.055ms] [1] SC[1540]: UnRegistered sub-client [JobPrefsDBPI_272950328] with ID [1] for session ID [1540] host [DESKTOP-EBMQ6TM] user [SHINA] process ID [18644]
[2022.07.07 12:11:17] [0012m.43s.057ms] [1] SC[1540]: UnRegistered sub-client [JobPrefsDBPI_272950375] with ID [2] for session ID [1540] host [DESKTOP-EBMQ6TM] user [SHINA] process ID [18644]
[2022.07.07 12:11:17] [0012m.43s.066ms] [1] CMT: Removed client [1540]
[2022.07.07 12:11:17] [0012m.43s.066ms] [1] CMT: There are [1] clients now: 1512
[2022.07.07 12:11:19] [0012m.45s.786ms] [1] SC[1512]: Registered sub-client [JobPrefsDBPI_272954203] with ID [48] for session ID [1512] host [DESKTOP-EBMQ6TM] user [SHINA] process ID [8292]
[2022.07.07 12:11:19] [0012m.45s.791ms] [1] SC[1512]: Registered sub-client [NetClassDBPI_272954203] with ID [49] for session ID [1512] host [DESKTOP-EBMQ6TM] user [SHINA] process ID [8292]
[2022.07.07 12:11:19] [0012m.45s.809ms] [1] SC[1512]: UnRegistered sub-client [JobPrefsDBPI_272954203] with ID [48] for session ID [1512] host [DESKTOP-EBMQ6TM] user [SHINA] process ID [8292]
[2022.07.07 12:11:19] [0012m.45s.810ms] [1] SC[1512]: UnRegistered sub-client [NetClassDBPI_272954203] with ID [49] for session ID [1512] host [DESKTOP-EBMQ6TM] user [SHINA] process ID [8292]
[2022.07.07 12:11:23] [0012m.49s.576ms] [1] SC[1512]: Registered sub-client [JobPrefsDBPI_272958000] with ID [50] for session ID [1512] host [DESKTOP-EBMQ6TM] user [SHINA] process ID [8292]
[2022.07.07 12:11:23] [0012m.49s.578ms] [1] SC[1512]: UnRegistered sub-client [JobPrefsDBPI_272958000] with ID [50] for session ID [1512] host [DESKTOP-EBMQ6TM] user [SHINA] process ID [8292]
[2022.07.07 15:16:19] [0197m.45s.811ms] [1] PrjBackupMgr: Successfully created Project Backup [D:\Pd-Master\Mas\Mas100n3 ACB_0001_2\ProjectBackup\backups\2022-07-07 15.16.13 - auto.zip] with GUID [f2f5-11cb-4c60-e28c-d9cd-6c23-acd6-c260-d343-04d2-ce70-60a8]
[2022.07.07 15:16:19] [0197m.45s.811ms] [0] PrjBackupMgr: Removing excessive backup:  BackupGUID[08c4-d469-4d50-fb37-6991-a31c-991a-3160-f148-9423-dedf-cf98] CreationTime[Thursday, September 09, 2021 14:26:30] Type[Autosave] Creator[iCDB Server (2021-09-09 16.26.30-8044)] ApplicationName[iCDB Server (2021-09-09 16.26.30-8044)] UserName[Shina] MachineName[DESKTOP-CUVV7JD] Description[Autosave] FullFlowName[PADS Pro Tools VX.2.7; PADS Pro Tools VX.2.7 - Update 12; PADS Pro Tools VX.2.7 - Update 13] FlowId[PADSProVX.2.7] GBSInstallId[2125238; 2310352; 2345434] GBSBuildId[17860529] IcdbVersion[3800] ReferenceLogFilePath[] BackupFilePath[D:\Pd-Master\Mas\Mas100n3 ACB_0001_2\ProjectBackup\backups\2021-09-09 16.26.30 - auto.zip] BackupFileSize[106902593] Persistent[FALSE]
[2022.07.07 15:16:19] [0197m.45s.817ms] [0] PrjBackupMgr: Project Backup file [D:\Pd-Master\Mas\Mas100n3 ACB_0001_2\ProjectBackup\backups\2021-09-09 16.26.30 - auto.zip] with GUID [08c4-d469-4d50-fb37-6991-a31c-991a-3160-f148-9423-dedf-cf98] removed
[2022.07.07 15:16:19] [0197m.45s.817ms] [0] PrjBackupEngine: Successfully created backup:  BackupGUID[f2f5-11cb-4c60-e28c-d9cd-6c23-acd6-c260-d343-04d2-ce70-60a8] CreationTime[Thursday, July 07, 2022 13:16:13] Type[Autosave] Creator[iCDB Server (2022-07-07 11.58.34-15564)] ApplicationName[iCDB Server (2022-07-07 11.58.34-15564)] UserName[SHINA] MachineName[DESKTOP-EBMQ6TM] Description[Autosave] FullFlowName[PADS Pro Tools VX.2.8; PADS Pro Tools VX.2.8 - Update 15] FlowId[PADSProVX.2.8] GBSInstallId[2255256; 2459570] GBSBuildId[20194967] IcdbVersion[3900] ReferenceLogFilePath[] BackupFilePath[D:\Pd-Master\Mas\Mas100n3 ACB_0001_2\ProjectBackup\backups\2022-07-07 15.16.13 - auto.zip] BackupFileSize[136628784] Persistent[FALSE]
