(DEVICE FILE: )PACKAGE  SO-16
CLASS IC
PINCOUNT 16

PINORDER SO-16 9 8 7 6 5 4 3 2 16 15 14 13 12 11 10 1 
PINUSE SO-16 IN IN IN IN IN IN IN IN IN IN IN IN IN IN IN IN 
FUNCTION G1 SO-16 9 8 7 6 5 4 3 2 16 15 14 13 12 11 10 1 
END
