(DEVICE FILE: )PACKAGE  TE-2013022-1
CLASS IC
PINCOUNT 206

PINORDER TE-2013022-1 SHIELD2 SHIELD1 99 98 97 96 95 94 93 92 91 90 9 89 88 87 86 85 84 83 82 81 80 8 79 78 77 76 75 74 73 72 71,
    70 7 69 68 67 66 65 64 63 62 61 60 6 59 58 57 56 55 54 53 52 51 50 5 49 48 47 46 45 44 43 42 41,
    40 4 39 38 37 36 35 34 33 32 31 30 3 29 28 27 26 25 24 23 22 21 204 203 202 201 200 20 2 199 198 197 196,
    195 194 193 192 191 190 19 189 188 187 186 185 184 183 182 181 180 18 179 178 177 176 175 174 173 172 171 170 17 169 168 167 166,
    165 164 163 162 161 160 16 159 158 157 156 155 154 153 152 151 150 15 149 148 147 146 145 144 143 142 141 140 14 139 138 137 136,
    135 134 133 132 131 130 13 129 128 127 126 125 124 123 122 121 120 12 119 118 117 116 115 114 113 112 111 110 11 109 108 107 106,
    105 104 103 102 101 100 10 1 
PINUSE TE-2013022-1 IN IN IN IN IN IN IN IN IN IN IN IN IN IN IN IN IN IN IN IN IN IN IN IN IN IN IN IN IN IN IN IN IN,
    IN IN IN IN IN IN IN IN IN IN IN IN IN IN IN IN IN IN IN IN IN IN IN IN IN IN IN IN IN IN IN IN IN,
    IN IN IN IN IN IN IN IN IN IN IN IN IN IN IN IN IN IN IN IN IN IN IN IN IN IN IN IN IN IN IN IN IN,
    IN IN IN IN IN IN IN IN IN IN IN IN IN IN IN IN IN IN IN IN IN IN IN IN IN IN IN IN IN IN IN IN IN,
    IN IN IN IN IN IN IN IN IN IN IN IN IN IN IN IN IN IN IN IN IN IN IN IN IN IN IN IN IN IN IN IN IN,
    IN IN IN IN IN IN IN IN IN IN IN IN IN IN IN IN IN IN IN IN IN IN IN IN IN IN IN IN IN IN IN IN IN,
    IN IN IN IN IN IN IN IN 
FUNCTION G1 TE-2013022-1 SHIELD2 SHIELD1 99 98 97 96 95 94 93 92 91 90 9 89 88 87 86 85 84 83 82 81 80 8 79 78 77 76 75 74 73 72 71,
    70 7 69 68 67 66 65 64 63 62 61 60 6 59 58 57 56 55 54 53 52 51 50 5 49 48 47 46 45 44 43 42 41,
    40 4 39 38 37 36 35 34 33 32 31 30 3 29 28 27 26 25 24 23 22 21 204 203 202 201 200 20 2 199 198 197 196,
    195 194 193 192 191 190 19 189 188 187 186 185 184 183 182 181 180 18 179 178 177 176 175 174 173 172 171 170 17 169 168 167 166,
    165 164 163 162 161 160 16 159 158 157 156 155 154 153 152 151 150 15 149 148 147 146 145 144 143 142 141 140 14 139 138 137 136,
    135 134 133 132 131 130 13 129 128 127 126 125 124 123 122 121 120 12 119 118 117 116 115 114 113 112 111 110 11 109 108 107 106,
    105 104 103 102 101 100 10 1 
END
