(DEVICE FILE: )PACKAGE  TE-HDMI-571-2041481-1
CLASS IC
PINCOUNT 23

PINORDER TE-HDMI-571-2041481-1 9 8 7 6 5 4 3 23 22 21 20 2 19 18 17 16 15 14 13 12 11 10 1 
PINUSE TE-HDMI-571-2041481-1 IN IN IN IN IN IN IN IN IN IN IN IN IN IN IN IN IN IN IN IN IN IN IN 
FUNCTION G1 TE-HDMI-571-2041481-1 9 8 7 6 5 4 3 23 22 21 20 2 19 18 17 16 15 14 13 12 11 10 1 
END
