
Copyright (C) 1994-2023 Synopsys, Inc.
This Synopsys software and all associated documentation are proprietary to Synopsys, Inc.
and may only be used pursuant to the terms and conditions of a written license agreement
with Synopsys, Inc. All other use, reproduction, modification, or distribution of the
Synopsys software or the associated documentation is strictly prohibited.
Tool: Synplify Pro (R)
Build: U-2023.03L-SP1
Install: D:\diamond\diamond\3.13\diamond\3.13\synpbase
OS: Windows 10 or later
Hostname: PC-SANDRO-W10

Implementation : impl1
Synopsys HDL compiler and linker, Version comp202303synp1, Build 173R, Built Aug 31 2023 03:59:48, @

Modified Files: 1
FID:  path (prevtimestamp, timestamp)
25       E:\Dropbox\Dropbox\Personale\progetti\Acube\cpld\CPLD_PORTATILE_TOP.vhd (2024-10-15 20:38:39, 2024-10-15 20:40:56)

*******************************************************************
Modules that may have changed as a result of file changes: 1
MID:  lib.cell.view
0        work.cpld_portatile_top.rtl may have changed because the following files changed:
                        E:\Dropbox\Dropbox\Personale\progetti\Acube\cpld\CPLD_PORTATILE_TOP.vhd (2024-10-15 20:38:39, 2024-10-15 20:40:56) <-- (architecture and entity definition)

*******************************************************************
Unmodified files: 11
FID:  path (timestamp)
26       D:\diamond\diamond\3.13\diamond\3.13\cae_library\synthesis\vhdl\machxo.vhd (2021-02-24 23:38:16)
27       D:\diamond\diamond\3.13\diamond\3.13\synpbase\lib\lucent\machxo.vhd (2023-08-10 11:56:42)
28       D:\diamond\diamond\3.13\diamond\3.13\synpbase\lib\vhd\arith.vhd (2023-08-10 09:32:12)
29       D:\diamond\diamond\3.13\diamond\3.13\synpbase\lib\vhd\hyperents.vhd (2023-08-10 09:32:12)
30       D:\diamond\diamond\3.13\diamond\3.13\synpbase\lib\vhd\location.map (2023-08-30 15:59:46)
31       D:\diamond\diamond\3.13\diamond\3.13\synpbase\lib\vhd\numeric.vhd (2023-08-10 09:32:12)
32       D:\diamond\diamond\3.13\diamond\3.13\synpbase\lib\vhd\snps_haps_pkg.vhd (2023-08-10 09:32:12)
33       D:\diamond\diamond\3.13\diamond\3.13\synpbase\lib\vhd\std.vhd (2023-08-10 09:32:12)
34       D:\diamond\diamond\3.13\diamond\3.13\synpbase\lib\vhd\std1164.vhd (2023-08-10 09:32:12)
35       D:\diamond\diamond\3.13\diamond\3.13\synpbase\lib\vhd\umr_capim.vhd (2023-08-10 09:32:12)
36       D:\diamond\diamond\3.13\diamond\3.13\synpbase\lib\vhd\unsigned.vhd (2023-08-10 09:32:12)

*******************************************************************
Unchanged modules: 0
MID:  lib.cell.view
