*
G04 Job   : D:\PD-Master\Mas\Mas100n1 ACB_0001_0\Mas100n1 PPC_PORTABILE R_0.pcb*
G04 User  : SHINA:Administrator*
G04 Layer : 7-Internal6.gbr*
G04 Date  : Thu Feb 04 15:45:05 2021*
G04 RSM MASTER DESIGN srl*
%ICAS*%
%MOMM*%
%FSLAX24Y24*%
%OFA0.0000B0.0000*%
G90*
G74*
%ADD12C,0.08000*%
%ADD13C,0.08001*%
%ADD10C,0.15000*%
%ADD15C,0.35000*%
%ADD11C,0.50000*%
%ADD14C,0.50800*%
%ADD16C,1.52400*%
G01*
G36*
X817500Y571750D02*
G02X818250Y572500I750D01*
G01X838500*
Y477500*
G03X840960Y473808I4000*
G01Y427200*
G03X841260Y425672I4040*
G01Y403200*
G03X845300Y399160I4040*
X849340Y403200J4040*
X845300Y407240I4040*
X841260Y403200J4040*
G01Y425672*
G03X845000Y423160I3740J1528*
X849040Y427200J4040*
X845000Y431240I4040*
X840960Y427200J4040*
G01Y473808*
G03X842500Y473500I1540J3692*
X846500Y477500J4000*
X842500Y481500I4000*
X838500Y477500J4000*
G01Y497500*
G03X842500Y493500I4000*
X846500Y497500J4000*
X842500Y501500I4000*
X838500Y497500J4000*
G01Y517500*
G03X842500Y513500I4000*
X846500Y517500J4000*
X842500Y521500I4000*
X838500Y517500J4000*
G01Y537500*
G03X842500Y533500I4000*
X846500Y537500J4000*
X842500Y541500I4000*
X838500Y537500J4000*
G01Y572500*
X850379*
G02X851129Y571750J750*
X850714Y571079I750*
G03X848500Y567500I1786J3579*
G01Y457500*
G03X852500Y453500I4000*
X856500Y457500J4000*
X852500Y461500I4000*
X848500Y457500J4000*
G01Y467500*
G03X852500Y463500I4000*
X856500Y467500J4000*
X852500Y471500I4000*
X848500Y467500J4000*
G01Y477500*
G03X852500Y473500I4000*
X856500Y477500J4000*
X852500Y481500I4000*
X848500Y477500J4000*
G01Y487500*
G03X852500Y483500I4000*
X856500Y487500J4000*
X852500Y491500I4000*
X848500Y487500J4000*
G01Y507500*
G03X852500Y503500I4000*
X856500Y507500J4000*
X852500Y511500I4000*
X848500Y507500J4000*
G01Y517500*
G03X852500Y513500I4000*
X856500Y517500J4000*
X852500Y521500I4000*
X848500Y517500J4000*
G01Y537500*
G03X852500Y533500I4000*
X856500Y537500J4000*
X852500Y541500I4000*
X848500Y537500J4000*
G01Y547500*
G03X852500Y543500I4000*
X856500Y547500J4000*
X852500Y551500I4000*
X848500Y547500J4000*
G01Y557500*
G03X852500Y553500I4000*
X856500Y557500J4000*
X852500Y561500I4000*
X848500Y557500J4000*
G01Y567500*
G03X852500Y563500I4000*
X856500Y567500J4000*
X854286Y571079I4000*
G02X853871Y571750I335J671*
X854621Y572500I750*
G01X858260*
Y426700*
G03X862300Y422660I4040*
X866340Y426700J4040*
X862300Y430740I4040*
X858260Y426700J4040*
G01Y572500*
X860379*
G02X861129Y571750J750*
X860714Y571079I750*
G03X858500Y567500I1786J3579*
G01Y457500*
G03X862500Y453500I4000*
X866500Y457500J4000*
X862500Y461500I4000*
X858500Y457500J4000*
G01Y467500*
G03X862500Y463500I4000*
X866500Y467500J4000*
X862500Y471500I4000*
X858500Y467500J4000*
G01Y477500*
G03X862500Y473500I4000*
X866500Y477500J4000*
X862500Y481500I4000*
X858500Y477500J4000*
G01Y487500*
G03X862500Y483500I4000*
X866500Y487500J4000*
X862500Y491500I4000*
X858500Y487500J4000*
G01Y497500*
G03X862500Y493500I4000*
X866500Y497500J4000*
X862500Y501500I4000*
X858500Y497500J4000*
G01Y507500*
G03X862500Y503500I4000*
X866500Y507500J4000*
X862500Y511500I4000*
X858500Y507500J4000*
G01Y517500*
G03X862500Y513500I4000*
X866500Y517500J4000*
X862500Y521500I4000*
X858500Y517500J4000*
G01Y537500*
G03X862500Y533500I4000*
X866500Y537500J4000*
X862500Y541500I4000*
X858500Y537500J4000*
G01Y547500*
G03X862500Y543500I4000*
X866500Y547500J4000*
X862500Y551500I4000*
X858500Y547500J4000*
G01Y557500*
G03X862500Y553500I4000*
X862566Y553501J4000*
G02X862579I13J750*
X862581J750*
G01X868500Y553564*
Y457500*
G03X870760Y453898I4000*
G01Y426700*
G03X874800Y422660I4040*
X878840Y426700J4040*
X874800Y430740I4040*
X870760Y426700J4040*
G01Y453898*
G03X872500Y453500I1740J3602*
X876500Y457500J4000*
X872500Y461500I4000*
X868500Y457500J4000*
G01Y467500*
G03X872500Y463500I4000*
X876500Y467500J4000*
X872500Y471500I4000*
X868500Y467500J4000*
G01Y477500*
G03X872500Y473500I4000*
X876500Y477500J4000*
X872500Y481500I4000*
X868500Y477500J4000*
G01Y487500*
G03X872500Y483500I4000*
X876500Y487500J4000*
X872500Y491500I4000*
X868500Y487500J4000*
G01Y497500*
G03X872500Y493500I4000*
X876500Y497500J4000*
X872500Y501500I4000*
X868500Y497500J4000*
G01Y553564*
X871905Y553600*
G02X871919I18J750*
G03X875900Y557600I19J4000*
X871900Y561600I4000*
X871834Y561599J4000*
G02X871821I13J750*
X871819J750*
G01X862495Y561500*
G02X862481I18J750*
G03X858500Y557500I19J4000*
G01Y567500*
G03X862500Y563500I4000*
X866500Y567500J4000*
X864286Y571079I4000*
G02X863871Y571750I335J671*
X864621Y572500I750*
G01X870379*
G02X871129Y571750J750*
X870714Y571079I750*
G03X868500Y567500I1786J3579*
X872500Y563500I4000*
X876500Y567500J4000*
X874286Y571079I4000*
G02X873871Y571750I335J671*
X874621Y572500I750*
G01X880379*
G02X881129Y571750J750*
X880714Y571079I750*
G03X878500Y567500I1786J3579*
X881868Y563550I4000*
G02X882500Y562810I118J740*
G01Y562190*
G02X881868Y561450I750*
G03X878500Y557500I632J3950*
X881868Y553550I4000*
G02X882500Y552810I118J740*
G01Y551190*
G02X881868Y550450I750*
G03X878500Y546500I632J3950*
G01Y546472*
G02Y546461I750*
G01Y537539*
G02Y537528I750J11*
G01Y537500*
G03X881868Y533550I4000*
G02X882500Y532810I118J740*
G01Y522190*
G02X881868Y521450I750*
G03X878500Y517500I632J3950*
X881868Y513550I4000*
G02X882500Y512810I118J740*
G01Y512190*
G02X881868Y511450I750*
G03X878500Y507500I632J3950*
X881868Y503550I4000*
G02X882500Y502810I118J740*
G01Y502190*
G02X881868Y501450I750*
G03X878500Y497500I632J3950*
X881868Y493550I4000*
G02X882500Y492810I118J740*
G01Y492190*
G02X881868Y491450I750*
G03X878500Y487500I632J3950*
X881868Y483550I4000*
G02X882500Y482810I118J740*
G01Y482190*
G02X881868Y481450I750*
G03X878500Y477500I632J3950*
X881868Y473550I4000*
G02X882500Y472810I118J740*
G01Y472190*
G02X881868Y471450I750*
G03X878500Y467500I632J3950*
X881868Y463550I4000*
G02X882500Y462810I118J740*
G01Y462190*
G02X881868Y461450I750*
G03X878500Y457500I632J3950*
X881868Y453550I4000*
G02X882500Y452810I118J740*
G01Y385750*
G02X881750Y385000I750*
G01X877510*
G02X876760Y385750J750*
X877085Y386368I750*
G03X878840Y389700I2285J3332*
X874800Y393740I4040*
X870760Y389700J4040*
X872515Y386368I4040*
G02X872840Y385750I425J618*
X872090Y385000I750*
G01X828250*
G02X827500Y385750J750*
G01Y396010*
G02X828250Y396760I750*
X828258J750*
G03X828300I42J4040*
X832340Y400800J4040*
X828300Y404840I4040*
X828258J4040*
G02X828250I8J750*
X827500Y405590J750*
G01Y426212*
G02X828250Y426962I750*
X828273J750*
G03X828400Y426960I127J4038*
X832440Y431000J4040*
X828400Y435040I4040*
X828273Y435038J4040*
G02X828250I23J750*
X827500Y435788J750*
G01Y547500*
X818250*
G02X817500Y548250J750*
G01Y555379*
G02X818250Y556129I750*
X818921Y555714J750*
G03X822500Y553500I3579J1786*
X826500Y557500J4000*
X822500Y561500I4000*
X818921Y559286J4000*
G02X818250Y558871I671J335*
X817500Y559621J750*
G01Y571750*
G37*
G54D10*
X25550Y699540D02*
Y699560D01*
Y700840*
X25410Y701750*
X24760Y702720*
X24020Y703130*
X23000Y703350*
X21970Y703120*
X21230Y702720*
X20570Y701730*
X20470Y700840*
Y699540*
X20570Y698640*
X21240Y697630*
X22170Y697030*
X22730*
X22750*
X24000Y697200*
X24810Y697660*
X25410Y698640*
X25550Y699540*
X30060Y700890D02*
Y700840D01*
Y699530*
Y699490*
Y699470*
X29930Y698540*
X29920Y698520*
X29900Y698470*
X29200Y697400*
X29170Y697360*
X29120Y697330*
X28250Y696870*
X28220Y696860*
X28170Y696850*
X25790Y696620*
X25760*
X25750*
X22800*
X22750*
X22130*
X22070Y696630*
X22020Y696660*
X21000Y697330*
X20950Y697350*
X20900Y697400*
X20220Y698470*
X20190Y698520*
Y698530*
Y698540*
X20060Y699470*
Y699490*
Y699530*
Y700870*
Y700890*
X20190Y701830*
Y701850*
X20200Y701870*
X20220Y701920*
X20900Y702970*
X20930Y703000*
X20990Y703030*
X21830Y703490*
X21860Y703500*
X21890Y703520*
X22960Y703760*
X23010*
X23050*
X24120Y703530*
X24150Y703520*
X24180Y703500*
X24190Y703490*
X25020Y703030*
X25070Y703000*
X25110Y702970*
X25790Y701930*
X25810Y701860*
X25820Y701850*
X25950Y700890*
Y700840*
Y699520*
Y699470*
X25820Y698540*
X25810Y698520*
X25790Y698470*
X25140Y697400*
X25090Y697340*
X25080Y697330*
X25060*
X24520Y697030*
X25740*
X28110Y697240*
X28880Y697640*
X29540Y698640*
X29650Y699540*
Y699560*
Y700840*
X29540Y701760*
X28890Y702670*
X28050Y703190*
X28000Y703240*
X27980Y703300*
X27990Y703380*
X28020Y703450*
X28070Y703510*
X28130Y703550*
X28190Y703560*
X28260Y703530*
X29140Y703020*
X29170Y702990*
X29210Y702930*
X29890Y701930*
X29910Y701900*
X29930Y701830*
X30060Y700890*
X530724Y1384826D02*
X530568Y1384670D01*
Y1214268*
X489000Y1172700*
X533568Y1383427D02*
Y1077994D01*
X514310Y1058736*
Y391773*
X541350Y364733*
X587748*
X643621Y308860*
Y271411*
X642200Y269990*
Y265200*
X538200Y460200D02*
X547061Y451339D01*
Y422239*
X566390Y402910*
Y398416*
X564200Y396226*
Y390000*
X540012Y1381386D02*
Y1148935D01*
X539568Y1148491*
Y1003232*
X544200Y998600*
X561600Y400400D02*
X542990Y419010D01*
Y446921*
X530810Y459101*
Y536010*
X535600Y540800*
X561600Y423800D02*
Y468000D01*
X546410Y483190*
Y576010*
X561800Y591400*
X656400Y261600D02*
X646621Y271379D01*
Y310103*
X588991Y367733*
X542593*
X517310Y393016*
Y1057493*
X536568Y1076751*
Y1382185*
X667500Y438600D02*
X660800Y445300D01*
Y487100*
X672224Y1409628D02*
X691600Y1390252D01*
Y1380600*
X672224Y1409628D02*
X568254D01*
X540012Y1381386*
X694000Y260400D02*
X661974D01*
X649174Y247600*
X620200*
X606833Y234233*
X582157*
X582090Y234300*
X577300*
X732800Y351600D02*
Y373250D01*
X767000Y407450*
Y438600*
X769600Y631800D02*
X764310Y626510D01*
Y598972*
X770782Y592500*
X774218*
X777500Y589218*
Y572500*
X782500Y567500*
X772500Y477500D02*
X777500Y472500D01*
Y448328*
X800750Y425078*
Y401476*
X817426Y384800*
X823174*
X838650Y369324*
Y369176*
X851476Y356350*
X892024*
X904200Y344174*
Y316100*
X782500Y557500D02*
X777500Y562500D01*
X770782*
X767500Y565782*
Y591540*
X761310Y597730*
Y636510*
X777400Y652600*
X822410Y606880D02*
Y606416D01*
X825896Y602930*
X883788*
X887500Y599218*
Y444528*
X893550Y438478*
Y389100*
X908990Y373660*
Y314116*
X906184Y311310*
X899990*
X895000Y316300*
X822410Y606880D02*
Y636410D01*
X829600Y643600*
X822410Y606880D02*
X781880D01*
X772500Y597500*
X911500Y793500D02*
X907130Y789130D01*
Y666528*
X913250Y660408*
Y580700*
X925090Y568860*
Y515316*
X920624Y510850*
X912276*
X907530Y506104*
Y502530*
X902500Y497500*
X944546Y1412628D02*
X567011D01*
X536568Y1382185*
X954700Y969900D02*
X917900D01*
X897000Y949000*
X964600Y1154400D02*
X979174D01*
X986064Y1147510*
X1002500*
X982800Y1406500D02*
X950674D01*
X944546Y1412628*
X984072Y1415628D02*
X565769D01*
X533568Y1383427*
X992262Y1418628D02*
X564526D01*
X530724Y1384826*
X993200Y1406500D02*
X984072Y1415628D01*
X1000900Y1405200D02*
Y1409990D01*
X992262Y1418628*
X1002500Y1147510D02*
X1015119D01*
X1019609Y1152000*
X1031450*
X1034500Y1155050*
Y1156950*
X1037050Y1159500*
X1215950*
X1218500Y1156950*
Y1155050*
X1221550Y1152000*
X1223450*
X1226500Y1148950*
Y1147050*
X1229050Y1144500*
X1247950*
X1250000Y1146550*
Y1147000*
X1251000Y1148000*
X1254500*
X1002500Y1160500D02*
X983595D01*
X974095Y1170000*
X964600*
X1002500Y1169590D02*
X978748D01*
X973548Y1174790*
X962616*
X958100Y1170274*
Y1167126*
X944074Y1153100*
X921700*
X907400Y1138800*
X1069600Y954300D02*
X1088165Y935735D01*
Y859036*
X1090290Y856911*
Y760832*
X1073985Y744526*
Y594016*
X1039410Y559442*
Y281390*
X1079000Y241800*
X1072157Y1176000D02*
X1036843D01*
X1034500Y1173657*
Y1170343*
X1032157Y1168000*
X1016609*
X1015019Y1169590*
X1002500*
X1072157Y1176000D02*
X1223729D01*
X1226556Y1173173*
Y1170994*
X1230500Y1167050*
Y1164000*
X1086300Y504800D02*
Y543926D01*
X1086390Y544016*
Y549410*
X1081910Y553890*
Y586164*
X1102700Y606954*
Y699946*
X1113044Y710290*
X1135464*
X1211490Y786316*
Y799184*
X1202210Y808464*
Y846477*
X1209510Y853777*
Y875136*
X1219790Y885416*
Y924849*
X1223990Y929049*
Y933284*
X1203810Y953464*
Y969908*
X1217710Y983808*
Y992093*
X1230610Y1004993*
Y1009855*
X1239900Y1019145*
Y1040000*
X1099800D02*
Y1023200D01*
X1102290Y1020710*
Y1006716*
X1083344Y987770*
Y981994*
X1064810Y963460*
Y948190*
X1085165Y927835*
Y857793*
X1087290Y855668*
Y763590*
X1070800Y747100*
Y595074*
X1036410Y560684*
Y257516*
X1114500Y179426*
Y130700*
X1109790Y1040000D02*
Y1008069D01*
X1091610Y989889*
Y859833*
X1122290Y829153*
Y815490*
X1113100Y806300*
Y795700*
X1114500Y1040000D02*
Y1008536D01*
X1094610Y988646*
Y861076*
X1126587Y829099*
Y811987*
X1123200Y808600*
X1122500Y1040000D02*
Y1036209D01*
X1120210Y1033919*
Y1009476*
X1097610Y986876*
Y918540*
X1108090Y908060*
Y877990*
X1107710Y877610*
Y856186*
X1131410Y832486*
Y818690*
X1136200Y813900*
X1122500Y1040000D02*
Y1101657D01*
X1124843Y1104000*
X1146500*
X1150500Y1100000*
X1140990Y1040000D02*
Y1055368D01*
X1140500Y1055858*
Y1087657*
X1148843Y1096000*
X1152157*
X1154500Y1098343*
Y1104000*
X1158500Y1108000*
X1143990Y1040000D02*
Y1013227D01*
X1144790Y1012427*
Y1005910*
X1151390Y999310*
Y986429*
X1144410Y979449*
Y939927*
X1141910Y937427*
Y930973*
X1144510Y928373*
Y836864*
X1156990Y824384*
Y796636*
X1157787Y795839*
Y791187*
X1154400Y787800*
X1146600Y460200D02*
Y466474D01*
X1230390Y550264*
Y771519*
X1220490Y781419*
Y805343*
X1211210Y814623*
Y837641*
X1227290Y853721*
Y868407*
X1235390Y876507*
Y901469*
X1229210Y907649*
Y912384*
X1233326Y916500*
X1233474*
X1237590Y920616*
Y952908*
X1234210Y956288*
Y991623*
X1242610Y1000023*
Y1004884*
X1259190Y1021464*
Y1040000*
X1146600Y795700D02*
X1141290Y801010D01*
Y920560*
X1131410Y930440*
Y961110*
X1141410Y971110*
Y997627*
X1141790Y998007*
Y1011184*
X1140990Y1011984*
Y1040000*
X1149200Y751400D02*
X1145210Y755390D01*
Y786460*
X1153990Y795240*
Y809810*
X1149600Y814200*
X1150500Y1108000D02*
X1146500Y1112000D01*
X1116843*
X1114500Y1109657*
Y1040000*
X1150500Y1124000D02*
X1146500Y1120000D01*
X1108843*
X1106500Y1117657*
Y1049209*
X1109790Y1045919*
Y1040000*
X1155290D02*
Y980749D01*
X1153990Y979449*
Y945264*
X1144910Y936184*
Y932216*
X1149610Y927516*
Y910790*
X1154500Y905900*
Y831117*
X1160310Y825307*
Y812716*
X1162200Y810826*
Y798200*
X1158500Y1084000D02*
X1154500Y1080000D01*
X1148843*
X1146500Y1077657*
Y1058343*
X1155290Y1049553*
Y1040000*
X1158500Y1100000D02*
Y1096000D01*
X1156843*
X1154500Y1093657*
Y1090343*
X1152157Y1088000*
X1148843*
X1143500Y1082657*
Y1057100*
X1143990Y1056610*
Y1040000*
X1162500D02*
Y1072000D01*
X1166500Y1076000*
X1162600Y883000D02*
Y877374D01*
X1164390Y875584*
Y871440*
X1162710Y869760*
Y865616*
X1164800Y863526*
Y832000*
Y891800D02*
Y898226D01*
X1163710Y899316*
Y908490*
X1154400Y917800*
X1170000Y933500D02*
Y944857D01*
X1167410Y947447*
Y954927*
X1174410Y961927*
Y967836*
X1182810Y976236*
Y987912*
X1185210Y990312*
Y1025116*
X1188190Y1028096*
Y1040000*
X1174090D02*
Y1042160D01*
X1170500Y1045750*
Y1080000*
X1166500Y1084000*
X1175200Y790400D02*
Y832000D01*
X1173010Y834190*
Y874010*
X1174790Y875790*
Y904686*
X1157010Y922466*
Y978227*
X1162500Y983717*
Y1040000*
X1175200Y951700D02*
X1180410Y956910D01*
Y965227*
X1188810Y973627*
Y985427*
X1191210Y987827*
Y1022631*
X1200790Y1032211*
Y1040000*
X1177800Y941300D02*
X1170410Y948690D01*
Y953684*
X1177410Y960684*
Y966469*
X1185810Y974869*
Y986669*
X1188210Y989069*
Y1023874*
X1191190Y1026854*
Y1040000*
X1177800Y1349400D02*
X1238950D01*
X1267550Y1320800*
X1323400*
X1180400Y821500D02*
Y771374D01*
X1122316Y713290*
X1111801*
X1091165Y692654*
Y606954*
X1042410Y558199*
Y287328*
X1088000Y241738*
Y212700*
X1180400Y1310400D02*
X1177013Y1307013D01*
X1160563*
X1154500Y1300950*
Y1232000*
X1150500Y1228000*
X1185190Y1040000D02*
Y1046884D01*
X1178500Y1053574*
Y1125657*
X1180843Y1128000*
X1250500*
X1254500Y1124000*
X1186400Y789100D02*
X1191190D01*
X1193810Y791720*
Y793460*
X1194190Y793840*
Y832460*
X1190550Y836100*
Y898276*
X1160010Y928816*
Y976984*
X1171510Y988484*
Y1017660*
X1174090Y1020240*
Y1040000*
X1188190D02*
Y1048127D01*
X1186500Y1049817*
Y1088000*
X1182500Y1092000*
X1191190Y1040000D02*
Y1052384D01*
X1194500Y1055694*
Y1080000*
X1190500Y1084000*
X1193400Y915200D02*
Y920926D01*
X1192710Y921616*
Y928250*
X1183410Y937550*
Y963984*
X1191810Y972384*
Y984184*
X1201200Y993574*
Y1027001*
X1206410Y1032211*
Y1040000*
X1200790D02*
Y1040410D01*
X1196410Y1044790*
Y1052384*
X1199621Y1055595*
X1199752*
X1202500Y1058343*
Y1093657*
X1200157Y1096000*
X1186500*
X1182500Y1100000*
X1203100Y910300D02*
X1191526D01*
X1188200Y913626*
Y924574*
X1184524Y928250*
X1168476*
X1164410Y932316*
Y956169*
X1169700Y961459*
Y982431*
X1182210Y994941*
Y1026359*
X1185190Y1029339*
Y1040000*
X1206410D02*
Y1053627D01*
X1210500Y1057717*
Y1117657*
X1212843Y1120000*
X1216157*
X1218500Y1122343*
Y1124000*
X1222500*
X1209000Y915200D02*
X1204210D01*
X1202450Y916960*
Y925424*
X1194810Y933064*
Y973636*
X1205590Y984416*
Y1027148*
X1209410Y1030968*
Y1040000*
Y1052384*
X1212621Y1055595*
X1215752*
X1218500Y1058343*
Y1117657*
X1220843Y1120000*
X1234500*
X1238500Y1116000*
X1211600Y899600D02*
Y911026D01*
X1213790Y913216*
Y922984*
X1197810Y938964*
Y972393*
X1208590Y983173*
Y993036*
X1216900Y1001346*
Y1027700*
X1219400Y1030200*
Y1040000*
X1218500Y1320000D02*
Y1288000D01*
X1214500Y1284000*
X1219400Y1040000D02*
Y1050309D01*
X1226500Y1057409*
Y1109657*
X1228843Y1112000*
X1242500*
X1246500Y1116000*
X1222000Y1339000D02*
X1218500Y1335500D01*
Y1320000*
X1222500Y1188000D02*
X1226500Y1184000D01*
X1264157*
X1278347Y1198190*
X1282500*
X1229500Y1040000D02*
Y1012987D01*
X1226990Y1010477*
Y1005616*
X1214410Y993036*
Y984751*
X1200810Y971151*
Y940207*
X1216790Y924227*
Y889190*
X1209000Y881400*
X1230500Y1140000D02*
X1226500D01*
Y1141657*
X1224157Y1144000*
X1100843*
X1098500Y1141657*
Y1048009*
X1099800Y1046709*
Y1040000*
X1230500Y1156000D02*
X1226500Y1160000D01*
Y1164950*
X1223950Y1167500*
X1037050*
X1034500Y1164950*
Y1163050*
X1031950Y1160500*
X1002500*
X1230500Y1172000D02*
X1238227Y1179727D01*
X1264510*
X1275173Y1190390*
X1282500*
X1239900Y1040000D02*
Y1052409D01*
X1242500Y1055009*
Y1072000*
X1238500Y1076000*
X1245400Y1047800D02*
X1250190Y1043010D01*
Y1040000*
X1246500Y1060000D02*
Y1052767D01*
X1250190Y1049077*
Y1047253*
X1253190Y1044253*
Y1040000*
X1246500Y1124000D02*
X1250500Y1120000D01*
X1256157*
X1258500Y1122343*
Y1125657*
X1260843Y1128000*
X1266743*
X1271933Y1133190*
X1282500*
X1246500Y1260000D02*
X1250500Y1264000D01*
Y1272000*
X1246500Y1276000*
X1246700Y497500D02*
X1257024Y507824D01*
Y793653*
X1272290Y808919*
Y877084*
X1258410Y890964*
Y901184*
X1265676Y908450*
X1270624*
X1281390Y919216*
Y974210*
X1276600Y979000*
X1250190Y1040000D02*
Y1025192D01*
X1233610Y1008612*
Y1003751*
X1222500Y992641*
Y961200*
X1253190Y1040000D02*
Y1023949D01*
X1236610Y1007369*
Y1002508*
X1227290Y993188*
Y959216*
X1222410Y954336*
Y939107*
X1226990Y934527*
Y927807*
X1223210Y924027*
Y905164*
X1229390Y898984*
Y890773*
X1212510Y873893*
Y852534*
X1205210Y845234*
Y809707*
X1214490Y800427*
Y785073*
X1136707Y707290*
X1135616*
X1113950Y685624*
Y518550*
X1097200Y501800*
X1254500Y1100000D02*
X1258500Y1104000D01*
Y1109657*
X1260843Y1112000*
X1269026*
X1274616Y1117590*
X1282500*
X1254500Y1108000D02*
X1250500Y1104000D01*
X1236843*
X1234500Y1101657*
Y1056209*
X1229500Y1051209*
Y1040000*
X1254500Y1156000D02*
X1258500D01*
X1259216Y1155284*
X1269242*
X1272316Y1152210*
X1282500*
X1255800Y1315600D02*
X1247505Y1307305D01*
X1240148*
X1234500Y1301657*
Y1242343*
X1232157Y1240000*
X1226500*
X1222500Y1236000*
X1256190Y1040000D02*
Y1044788D01*
X1253190Y1047788*
Y1050320*
X1251000Y1052510*
Y1080500*
X1254500Y1084000*
X1256190Y1040000D02*
Y1022707D01*
X1239610Y1006127*
Y1001265*
X1230290Y991945*
Y957973*
X1226710Y954393*
Y949340*
X1231990Y944060*
Y928564*
X1226210Y922784*
Y906407*
X1232390Y900227*
Y889531*
X1215510Y872651*
Y846184*
X1208210Y838884*
Y813381*
X1217490Y804101*
Y721360*
X1226790Y712060*
Y550975*
X1139402Y463587*
X1136987*
X1133600Y460200*
X1259190Y1040000D02*
Y1045324D01*
X1258500Y1046014*
Y1084950*
X1255950Y1087500*
X1250000*
X1246500Y1084000*
X1261900Y351200D02*
X1256110Y356990D01*
Y442184*
X1264436Y450510*
X1265727*
X1270290Y455073*
Y498702*
X1278790Y507202*
Y605108*
X1275210Y608688*
Y782584*
X1305490Y812864*
Y890269*
X1297310Y898449*
Y941110*
X1302600Y946400*
Y1005583*
X1312961Y1015944*
Y1058635*
X1324326Y1070000*
X1326374*
X1330790Y1074416*
Y1079410*
X1326000Y1084200*
X1262500Y1124000D02*
Y1120000D01*
X1264090Y1118410*
X1271193*
X1273373Y1120590*
X1282500*
X1266200Y894400D02*
X1269587Y897787D01*
X1277387*
X1289190Y885984*
Y809639*
X1263024Y783472*
Y465598*
X1203600Y406174*
Y385556*
X1134390Y316346*
Y47690*
X1126700Y40000*
X1266200Y902200D02*
X1261410Y897410D01*
Y892416*
X1264216Y889610*
X1268310*
X1270390Y891690*
X1274484*
X1277290Y888884*
Y807089*
X1260024Y789822*
Y474650*
X1200584Y415210*
Y387806*
X1131390Y318612*
Y53016*
X1128584Y50210*
X1106390*
X1088100Y68500*
X1266200Y975000D02*
Y937700D01*
X1263590Y935090*
Y911973*
X1255410Y903793*
Y880416*
X1258790Y877036*
Y807669*
X1248390Y797269*
Y542808*
X1239850Y534268*
Y470300*
X1185140Y415590*
Y377490*
X1126600Y318950*
Y55000*
X1273590Y1040000D02*
Y1025292D01*
X1262810Y1014512*
Y1011536*
X1237210Y985936*
Y957531*
X1240590Y954151*
Y910564*
X1238790Y908764*
Y875664*
X1230290Y867164*
Y852479*
X1214210Y836399*
Y815866*
X1223490Y806586*
Y782661*
X1233390Y772761*
Y549021*
X1159600Y475231*
Y472700*
X1155200Y468300*
X1274000Y1102400D02*
Y1095467D01*
X1275690Y1093777*
Y1081990*
X1274910Y1081210*
Y1067390*
X1276590Y1065710*
Y1040000*
Y1024049*
X1265810Y1013269*
Y1010293*
X1240210Y984693*
Y958773*
X1243590Y955393*
Y909321*
X1241790Y907521*
Y874421*
X1234650Y867281*
Y852596*
X1217210Y835156*
Y818586*
X1229210Y806586*
Y781431*
X1236390Y774251*
Y547779*
X1162600Y473989*
Y468100*
X1276600Y1112800D02*
X1267110Y1103310D01*
Y1061023*
X1273590Y1054543*
Y1040000*
X1279200Y1071200D02*
X1282500Y1067900D01*
X1286590Y1063810*
Y1029807*
X1268810Y1012027*
Y1009051*
X1243210Y983451*
Y960016*
X1246590Y956636*
Y907701*
X1246410Y907521*
Y876688*
X1247590Y875508*
Y861293*
X1234650Y848353*
Y803802*
X1232210Y801362*
Y782673*
X1239390Y775493*
Y546536*
X1206400Y513546*
Y460200*
X1282500Y1117590D02*
X1290951D01*
X1295859Y1112682*
X1307702*
X1333790Y1086593*
Y1065449*
X1331210Y1062869*
Y1030360*
X1323810Y1022960*
Y995640*
X1335990Y983460*
Y973516*
X1328600Y966126*
Y956800*
X1282500Y1120590D02*
X1292193D01*
X1297102Y1115682*
X1308944*
X1336790Y1087836*
Y1064207*
X1334210Y1061627*
Y1026240*
X1346390Y1014060*
Y969390*
X1339000Y962000*
X1282500Y1133190D02*
X1283836D01*
X1298344Y1118682*
X1315294*
X1329186Y1104790*
X1333384*
X1339543Y1098631*
Y1095619*
X1341090Y1094072*
Y1063910*
X1349400Y1055600*
Y959400*
X1282500Y1136190D02*
X1270690D01*
X1266500Y1132000*
X1262500*
X1282500Y1146190D02*
X1269416D01*
X1266555Y1143329*
Y1138398*
X1264157Y1136000*
X1252843*
X1250500Y1133657*
Y1132000*
X1246500*
X1282500Y1149210D02*
X1271073D01*
X1268283Y1152000*
X1260843*
X1258500Y1149657*
Y1146343*
X1256157Y1144000*
X1252843*
X1250500Y1141657*
Y1138343*
X1248157Y1136000*
X1172843*
X1170500Y1133657*
Y1122343*
X1168157Y1120000*
X1162500*
X1158500Y1116000*
X1282500Y1152210D02*
X1286384D01*
X1288574Y1154400*
X1294800*
X1282500Y1158900D02*
X1274000Y1167400D01*
X1267291*
X1266691Y1168000*
X1260843*
X1258500Y1165657*
Y1162343*
X1256157Y1160000*
X1236843*
X1234500Y1157657*
Y1154343*
X1232157Y1152000*
X1228843*
X1226500Y1154343*
Y1156000*
X1222500*
X1282500Y1177390D02*
X1266416D01*
X1265753Y1176727*
X1251227*
X1246500Y1172000*
X1282500Y1190390D02*
X1283784D01*
X1290900Y1183274*
Y1176500*
X1300000Y1167400*
X1282500Y1198190D02*
X1295210D01*
X1300000Y1193400*
X1282500Y1203610D02*
X1277581D01*
X1273191Y1208000*
X1260843*
X1258500Y1205657*
Y1192000*
X1254500Y1188000*
X1282500Y1214900D02*
X1265257D01*
X1264157Y1216000*
X1244843*
X1242500Y1213657*
Y1200000*
X1238500Y1196000*
X1282500Y1227000D02*
X1267157D01*
X1264157Y1224000*
X1228843*
X1226500Y1221657*
Y1200000*
X1222500Y1196000*
X1284400Y1089400D02*
X1294390Y1079410D01*
Y1062648*
X1292590Y1060848*
Y1018016*
X1270024Y995450*
X1263776*
X1252410Y984084*
Y974390*
X1255790Y971010*
Y939910*
X1260590Y935110*
Y913216*
X1252410Y905036*
Y879173*
X1255790Y875793*
Y814019*
X1245390Y803619*
Y544051*
X1227413Y526074*
Y471687*
X1230800Y468300*
X1284400Y1157000D02*
X1282500Y1158900D01*
X1289600Y1076400D02*
Y1062648D01*
X1289590Y1062638*
Y1028564*
X1271810Y1010784*
Y1007808*
X1249410Y985408*
Y973147*
X1252790Y969767*
Y939490*
X1249590Y936290*
Y906459*
X1249410Y906279*
Y877931*
X1250590Y876751*
Y860051*
X1245250Y854711*
Y810159*
X1235210Y800119*
Y783916*
X1242390Y776736*
Y545293*
X1220300Y523203*
Y468300*
X1291800Y991600D02*
Y957017D01*
X1289610Y954827*
Y897664*
X1299290Y887984*
Y880040*
X1292190Y872940*
Y808049*
X1267613Y783472*
Y604787*
X1271000Y601400*
X1298200Y1204800D02*
X1291774D01*
X1290584Y1203610*
X1282500*
X1300800Y1214900D02*
X1282500D01*
X1300800Y1227000D02*
X1282500D01*
X1324200Y1138600D02*
X1327587Y1135213D01*
X1328639*
X1329626Y1136200*
X1332774*
X1351390Y1154816*
Y1291484*
X1346174Y1296700*
X1336500*
X1324400Y1183700D02*
X1318310Y1189790D01*
Y1275684*
X1329100Y1286474*
Y1296500*
X1326000Y1076400D02*
X1309961Y1060361D01*
Y1017187*
X1296590Y1003816*
Y957564*
X1292610Y953584*
Y898907*
X1302490Y889027*
Y814107*
X1272210Y783827*
Y607445*
X1275790Y603865*
Y513552*
X1267290Y505052*
Y456316*
X1264484Y453510*
X1263193*
X1250813Y441130*
Y354287*
X1254200Y350900*
X1326000Y1154400D02*
X1306226D01*
X1283236Y1177390*
X1282500*
X1335300Y871700D02*
Y878326D01*
X1318610Y895016*
Y902610*
X1354190Y938190*
Y1003941*
X1352410Y1005721*
Y1068190*
X1344210Y1076390*
Y1095195*
X1342543Y1096862*
Y1099874*
X1334627Y1107790*
X1330510*
X1302110Y1136190*
X1282500*
X1336400Y1250600D02*
Y1240454D01*
X1338395Y1238459*
Y1234395*
X1340580Y1232210*
Y1186297*
X1337210Y1182927*
Y1176473*
X1338590Y1175093*
Y1152416*
X1335384Y1149210*
X1282500*
X1344600Y1291500D02*
X1348390Y1287710D01*
Y1235116*
X1346533Y1233258*
Y1188007*
X1340210Y1181684*
Y1177716*
X1341590Y1176336*
Y1151173*
X1336627Y1146210*
X1336010*
X1331200Y1141400*
X1348000Y286500D02*
X1339019Y295481D01*
Y455081*
X1327500Y466600*
Y659900*
X1321800Y665600*
Y887583*
X1315610Y893773*
Y910010*
X1328600Y923000*
X1359200Y959900D02*
Y964690D01*
X1358383Y965507*
Y1003991*
X1357110Y1005263*
Y1036060*
X1363290Y1042240*
Y1072910*
X1349633Y1086567*
Y1094015*
X1345543Y1098105*
Y1106831*
X1332584Y1119790*
X1328540*
X1328260Y1119510*
X1324216*
X1297536Y1146190*
X1282500*
X1361400Y286600D02*
Y366131D01*
X1349410Y378121*
Y517310*
X1383950Y551850*
Y558177*
X1414600Y588827*
Y813300*
X1417390Y816090*
Y853810*
X1412910Y858290*
Y875910*
X1425689Y888690*
Y911111*
X1414100Y922700*
X1365800Y922200D02*
X1362413Y918813D01*
X1361839*
X1342010Y898984*
Y890364*
X1362410Y869964*
Y812319*
X1368967Y805763*
Y772327*
X1375790Y765504*
Y743616*
X1364274Y732100*
X1344426*
X1332910Y720584*
Y549240*
X1342390Y539760*
Y378121*
X1354600Y365911*
Y280800*
X1368600Y277400D02*
Y366131D01*
X1360550Y374181*
Y468800*
X1355910Y473440*
Y510960*
X1424790Y579840*
Y868800*
X1428689Y872699*
Y912353*
X1427400Y913643*
Y923000*
X1385800Y1177800D02*
X1391690Y1171910D01*
Y1154716*
X1388400Y1151426*
Y1107600*
X1403800Y922200D02*
X1400413Y918813D01*
Y884437*
X1403590Y881260*
Y858090*
X1400310Y854810*
Y808116*
X1410890Y797536*
Y705940*
X1409358Y704408*
Y603885*
X1356200Y550727*
Y537100*
X1424800Y985400D02*
X1420010Y990190D01*
Y1078310*
X1455590Y1113890*
Y1163060*
X1448610Y1170040*
Y1247384*
X1453210Y1251984*
Y1346284*
X1469790Y1362864*
Y1382069*
X1455669Y1396190*
X1443400*
X1437800Y1390590*
Y1385800*
X1439900Y1266200D02*
Y1308800D01*
X1441000Y1411600D02*
X1433010Y1403610D01*
Y1383816*
X1435816Y1381010*
X1439784*
X1443000Y1384226*
Y1389974*
X1446216Y1393190*
X1454427*
X1466790Y1380827*
Y1364107*
X1449710Y1347027*
Y1252727*
X1445610Y1248627*
Y1228860*
X1429990Y1213240*
Y1117373*
X1416213Y1103596*
Y983587*
X1419600Y980200*
X1448200Y1047800D02*
X1482590Y1013410D01*
Y994716*
X1482000Y994126*
Y941200*
X1448200Y1388400D02*
X1454974D01*
X1458190Y1385184*
Y1380540*
X1444690Y1367040*
Y1251949*
X1442610Y1249869*
Y1230102*
X1426990Y1214482*
Y1118616*
X1411200Y1102826*
Y987100*
X1458600Y969800D02*
Y995800D01*
X1424800Y1029600*
X1464800Y1334900D02*
X1482510Y1352610D01*
Y1365584*
X1486339Y1369413*
X1489013*
X1492400Y1372800*
X1469000Y943800D02*
Y1019200D01*
X1437800Y1050400*
X1482000Y1297400D02*
X1488710Y1304110D01*
X1489784*
X1499300Y1313626*
Y1367900*
X1502500Y815300D02*
X1506090Y811710D01*
Y627390*
X1490800Y612100*
Y397250*
X1459500Y365950*
Y102000*
X1510600Y1141400D02*
Y1205500D01*
X1524900Y1219800*
X1518800Y943400D02*
Y931974D01*
X1527290Y923484*
Y881840*
X1522500Y877050*
Y849400*
X1515000Y841900*
X1522400Y842300D02*
X1532500Y852400D01*
Y877500*
X1537500Y882500*
Y905900*
X1539590Y907990*
Y923684*
X1539113Y924161*
Y940313*
X1542500Y943700*
X1524100Y1193800D02*
X1531800Y1186100D01*
Y1101500*
X1528800Y1045200D02*
X1543190Y1030810D01*
Y988390*
X1531390Y976590*
Y966573*
X1527710Y962893*
Y928790*
X1534800Y921700*
X1535200Y1219800D02*
X1542590Y1227190D01*
X1573627*
X1585808Y1215009*
Y1174558*
X1632679Y1127687*
X1635613*
X1639000Y1124300*
X1538400Y997600D02*
X1528390Y987590D01*
Y967816*
X1514010Y953436*
Y932890*
X1515013Y931887*
Y900387*
X1518400Y897000*
X1549190Y908690D02*
X1547610Y907110D01*
Y882590*
X1552290Y877910*
Y865716*
X1535700Y849126*
Y841300*
X1549190Y908690D02*
X1552925Y912425D01*
Y927475*
X1549190Y931210*
X1559700Y969000D02*
X1547410Y956710D01*
Y932990*
X1549190Y931210*
X1560000Y922900D02*
Y937026D01*
X1557710Y939316*
Y948210*
X1583400Y973900*
Y999426*
X1590790Y1006816*
Y1022210*
X1586000Y1027000*
X1562500Y941300D02*
X1565887Y937913D01*
Y860913*
X1541484Y836510*
X1509100*
X1508000Y837610*
Y842400*
X1562600Y1211600D02*
Y1109174D01*
X1575190Y1096584*
Y1029807*
X1570410Y1025027*
Y1014090*
X1572000Y1012500*
X1570400Y1219400D02*
X1575190Y1214610D01*
Y1117590*
X1570810Y1113210*
Y1108216*
X1586290Y1092736*
Y1036664*
X1573410Y1023784*
Y1018840*
X1576790Y1015460*
Y1010516*
X1562600Y996326*
Y988000*
X1574750Y322550D02*
X1589300Y337100D01*
X1586200Y843900D02*
X1582813Y847287D01*
Y891313*
X1585590Y894090*
Y919784*
X1583400Y921974*
Y962000*
X1601600Y1055600D02*
X1596950Y1050950D01*
Y1006816*
X1590610Y1000476*
Y979190*
X1591200Y978600*
Y921700*
X1598590Y914310*
Y886590*
X1593900Y881900*
Y842400*
X1601800Y1174200D02*
Y1217010D01*
X1601600Y1217210*
Y1222000*
X1602700Y1041300D02*
X1607490Y1036510D01*
Y993890*
X1599000Y985400*
X1628640Y1113100D02*
X1580743Y1160997D01*
Y1215831*
X1572384Y1224190*
X1549290*
X1544900Y1219800*
X1630766Y484466D02*
Y739509D01*
X1634790Y743533*
X1630766Y484466D02*
Y447340D01*
X1589300Y405874*
Y337100*
X1634790Y823210D02*
X1638714Y819286D01*
Y747456*
X1634790Y743533*
Y823210D02*
X1627910Y830090D01*
Y871310*
X1638000Y881400*
Y1227200D02*
Y1160560D01*
X1628640Y1151200*
X1677100Y1229000D02*
Y1202974D01*
X1678090Y1201984*
Y955040*
X1673940Y950890*
Y904366*
X1671000Y901426*
Y775500*
X1634950Y739450*
Y444750*
X1595900Y405700*
X1699300Y352100D02*
Y514826D01*
X1711000Y526526*
Y822950*
X1737400Y849350*
Y901900*
X1751700Y916200*
Y1020100*
X1762500Y1030900*
X1714200Y1056200D02*
Y1016074D01*
X1715690Y1014584*
Y969490*
X1708200Y962000*
X1732900Y1393300D02*
X1773200Y1433600D01*
Y1448200*
X1742000Y1105000D02*
Y1117542D01*
X1742370Y1117912*
Y1151972*
X1737210Y1157132*
Y1162568*
X1742640Y1167998*
Y1199240*
X1752400Y1209000*
X1747200Y1073800D02*
X1767490Y1094090D01*
Y1175684*
X1757600Y1185574*
Y1196000*
X1749700Y1067400D02*
X1743460Y1061160D01*
X1702686*
X1685910Y1044384*
Y855740*
X1687000Y854650*
Y481800*
X1761400Y941200D02*
Y969626D01*
X1760610Y970416*
Y1015960*
X1787000Y1042350*
Y1059400*
X1761800Y1242700D02*
Y1209300D01*
X1752810Y1200310*
Y1185574*
X1757190Y1181194*
Y1104790*
X1747300Y1094900*
X1774800Y1245300D02*
X1785274D01*
X1791713Y1238861*
Y1190187*
X1795100Y1186800*
X1775800Y1094600D02*
X1771010Y1099390D01*
Y1168836*
X1777990Y1175816*
Y1179784*
X1772624Y1185150*
X1769176*
X1762800Y1191526*
Y1201200*
X1775800Y1102400D02*
X1780590Y1107190D01*
Y1135584*
X1779210Y1136964*
Y1172621*
X1780990Y1174401*
Y1192233*
X1776973Y1196250*
X1773976*
X1771010Y1199216*
Y1206810*
X1773000Y1208800*
Y1236700*
X1780200Y1072500D02*
X1783590Y1075890D01*
Y1136827*
X1782210Y1138207*
Y1171379*
X1783990Y1173159*
Y1197800*
X1780590Y1201200*
X1775800*
X1800500Y980600D02*
Y988857D01*
X1799261Y990096*
Y1024871*
X1801800Y1027410*
Y1032200*
X1807000Y1125800D02*
X1810387Y1122413D01*
Y1106987*
X1806910Y1103510*
Y1083390*
X1815000Y1075300*
Y1030426*
X1823700Y1021726*
Y989850*
X1842590Y970960*
Y946564*
X1813850Y917824*
Y886094*
X1799610Y871854*
Y847807*
X1804390Y843027*
Y813790*
X1799200Y808600*
X1814800Y1196000D02*
X1818187Y1192613D01*
Y1183573*
X1815110Y1180496*
Y1136490*
X1841100Y1110500*
X1822600Y1326000D02*
Y1253550D01*
X1805500Y1236450*
Y1216236*
X1799900Y1210636*
Y1184826*
X1785210Y1170136*
Y1139449*
X1786590Y1138069*
Y1066584*
X1806590Y1046584*
Y1027410*
X1802261Y1023081*
Y991339*
X1813000Y980600*
X1825500D02*
Y968674D01*
X1827490Y966684*
Y954116*
X1801990Y928616*
Y892444*
X1793610Y884064*
Y856310*
X1791410Y854110*
Y805373*
X1804669Y792114*
Y700336*
X1855933Y649073*
Y371767*
X1906400Y321300*
X1829900Y1163300D02*
Y1155074D01*
X1828310Y1153484*
Y1133390*
X1848190Y1113510*
Y1087340*
X1840013Y1079163*
Y1035587*
X1843400Y1032200*
X1833900Y1152300D02*
Y1160526D01*
X1834690Y1161316*
Y1165284*
X1833200Y1166774*
Y1186800*
X1846000Y975000D02*
Y873100D01*
X1829600Y856700*
X1846000Y1125800D02*
X1850690Y1130490D01*
Y1154484*
X1849900Y1155274*
Y1163300*
X1846500Y1372500D02*
X1851290Y1377290D01*
X1855284*
X1858090Y1374484*
Y1337890*
X1836000Y1315800*
Y1236974*
X1807410Y1208384*
Y1196616*
X1812490Y1191536*
Y1183573*
X1805110Y1176193*
Y1134464*
X1835600Y1103974*
Y1026200*
X1850413Y1011387*
Y978387*
X1853800Y975000*
X1853300Y1372500D02*
X1833000Y1352200D01*
Y1239226*
X1804410Y1210636*
Y1195373*
X1809490Y1190293*
Y1184816*
X1795076Y1170402*
Y1062341*
X1809590Y1047827*
Y1030426*
X1812226Y1027790*
Y996374*
X1820000Y988600*
Y972400*
X1861600Y1188200D02*
X1855610Y1182210D01*
Y1082710*
X1845400Y1072500*
X1862900Y934000D02*
Y951650D01*
X1874600Y963350*
Y988000*
X1881990Y995390*
Y1033567*
X1879810Y1035747*
Y1152910*
X1890000Y1163100*
X1887600Y1040000D02*
Y1115900D01*
X1900800Y1129100*
X1889400Y1188200D02*
X1910590Y1167010D01*
Y1092990*
X1897213Y1079613*
Y1006987*
X1900600Y1003600*
X1895400Y385000D02*
Y397526D01*
X1897590Y399716*
Y431984*
X1874810Y454764*
Y571436*
X1920010Y616636*
Y867327*
X1988693Y936010*
X2033071*
X2051321Y954260*
X2108676*
X2259598Y1105181*
Y1220881*
X2278010Y1239293*
Y1279360*
X2287300Y1288650*
Y1296500*
X2320500Y1329700*
Y1410200*
X2335200Y1424900*
X1905800Y1144000D02*
X1899926D01*
X1882810Y1126884*
Y1036990*
X1887600Y1032200*
X1910600Y614000D02*
X1915790Y619190D01*
Y867349*
X1987451Y939010*
X2031828*
X2050078Y957260*
X2107434*
X2187387Y1037213*
Y1327613*
X2184000Y1331000*
X1913200Y321300D02*
X1858933Y375567D01*
Y656893*
X1809140Y706686*
Y791886*
X1794410Y806616*
Y820710*
X1801390Y827690*
Y841784*
X1796610Y846564*
Y878204*
X1804990Y886584*
Y924174*
X1833000Y952184*
Y972400*
X1929200Y1146600D02*
X1922383Y1139783D01*
Y1061783*
X1905800Y1045200*
X1944800Y1344200D02*
X1948187Y1340813D01*
Y1169161*
X1947410Y1168384*
Y1117290*
X1947890Y1116810*
Y1022690*
X1947810Y1022610*
Y925190*
X1955200Y917800*
X1960400Y1006200D02*
X1970800Y1016600D01*
Y1172600*
X1960600Y1142500D02*
X1955610Y1137510D01*
Y1039590*
X1960400Y1034800*
X1965600Y975000D02*
X1983390Y992790D01*
Y1096460*
X1977810Y1102040*
Y1165684*
X1980790Y1168664*
Y1211310*
X1960150Y1231950*
Y1287950*
X1954900Y1293200*
X1978600Y1019200D02*
X1973810Y1023990D01*
Y1165927*
X1976000Y1168117*
Y1198200*
X1983800Y1292200D02*
Y1298926D01*
X1986187Y1301313*
Y1323613*
X1982800Y1327000*
X1998500Y1054900D02*
Y1289110D01*
X1999400Y1290010*
Y1294800*
X2005000Y1010000D02*
X2016140Y1021140D01*
Y1057004*
X2009000Y1064144*
Y1176900*
X2015000Y1271400D02*
Y1064144D01*
X2022800Y1056344*
Y943800*
X2210000Y1068600D02*
X2256134Y1114734D01*
Y1226063*
X2265000Y1234929*
Y1350200*
X2277400Y1362600*
X2340500Y1352500D02*
Y1343674D01*
X2303600Y1306774*
Y1292500*
X2287650Y1276550*
Y1233581*
X2262598Y1208529*
Y1103939*
X2109919Y951260*
X2064021*
X2045771Y933010*
X1989936*
X1923010Y866084*
Y600884*
X1877810Y555684*
Y456007*
X1900590Y433227*
Y375390*
X1895200Y370000*
X2347500Y1433800D02*
Y1401174D01*
X2350213Y1398461*
Y1370087*
X2353600Y1366700*
X2584400Y1076000D02*
X2601709Y1093309D01*
X2652283*
X2666511Y1107537*
Y1147164*
X2687990Y1168643*
Y1210890*
X2729100Y1252000*
X2592200Y1076400D02*
X2606109Y1090309D01*
X2653526*
X2669511Y1106294*
Y1145922*
X2690990Y1167400*
Y1203380*
X2733010Y1245400*
X2737800*
X2729000Y1057700D02*
X2721883Y1064817D01*
X2584557*
X2582587Y1066787*
X2577387*
X2574000Y1063400*
X2930000Y1337000D02*
X2895000D01*
Y984000*
X2930000*
Y316000*
G02X2905000Y291000I25000*
G01X2792719*
G02X2782812Y299638J10000*
G01X2773000Y371000*
X2761000Y478000*
X2737000Y614000*
X2746000Y622000*
X2739000Y674000*
X2731000Y702000*
X2715000Y751000*
X2697000Y786000*
X2663000Y836000*
X2623000Y881000*
X2610000Y894000*
X2602000Y900000*
X2609000Y924000*
X2615000Y945000*
X2616000Y950000*
Y956000*
X2615000Y969000*
X2614000Y974000*
X2611000Y983000*
X2608000Y989000*
X2601000Y998000*
X2588000Y1007000*
X2583000Y1010000*
X2569000Y1014000*
X2550000*
X2544000Y1012000*
X2528000Y1004000*
X2491000Y964000*
X2441000Y979000*
X2423000Y983000*
X2375000Y989000*
X2354000Y990000*
X2332000*
X2289000Y986000*
X2261000Y981000*
X2233000Y973000*
X2184000Y955000*
X2142000Y932000*
X2112000Y911000*
X2090000Y893000*
X2080000Y884000*
X2066000Y870000*
X2044000Y843000*
X2027000Y822000*
X2007000Y787000*
X1975000Y725000*
X1962000Y692000*
X1955000Y647000*
X1953000Y623000*
Y591000*
X1954000Y571000*
X1955000Y563000*
X1963000Y491000*
X1982000Y329000*
X1987000Y285000*
X1990000Y261000*
X2001575Y185994*
G02X2001663Y184850I7412J1144*
X1996833Y177841I7500*
G01X1934619Y177597*
G03X1909719Y152883I98J25000*
G01X1909282Y114714*
G02X1884284Y90000I24998J286*
G01X1785000*
G03X1760000Y65000J25000*
G01Y25000*
G02X1735000Y0I25000*
G01X1230000*
Y10000*
X345000*
G02X320000Y35000J25000*
G01Y65000*
G03X295000Y90000I25000*
G01X255000*
G02X230000Y115000J25000*
G01Y275000*
G03X205000Y300000I25000*
G01X25000*
G02X0Y325000J25000*
G01Y1475000*
G02X25000Y1500000I25000*
G01X1609000*
Y1490000*
X1784000*
G02X1809000Y1465000J25000*
G01Y1451000*
G03X1840000Y1420000I31000*
X1871000Y1451000J31000*
G01Y1463000*
G02X1881000Y1473000I10000*
G01X2339000*
G02X2349000Y1463000J10000*
G01Y1462000*
G03X2380000Y1431000I31000*
X2411000Y1462000J31000*
G01Y1463000*
G02X2421000Y1473000I10000*
G01X2670000*
X2697500Y1500000*
X2905000*
G02X2930000Y1475000J25000*
G01Y1337000*
G54D11*
X420960Y1326377D02*
X517961Y1423378D01*
X984807*
X1001729Y1440300*
X420960Y1326377D02*
Y818288D01*
X484940Y754308*
Y616214D02*
X497000Y628274D01*
Y742248*
X484940Y754308*
Y616214D02*
X479420Y610694D01*
Y360258*
X514500Y325178*
Y298500*
X762500Y517500D03*
X772500Y477500D03*
Y517500D03*
Y597500D03*
X782500Y557500D03*
Y567500D03*
X822500D03*
X842500D03*
X843000Y487900D03*
X872200Y518300D03*
X872500Y537500D03*
X892500Y517500D03*
X902500Y497500D03*
Y517500D03*
X1001729Y1440300D02*
X1004429Y1443000D01*
X1006200*
X1019200*
X1024700Y508200D02*
Y572560D01*
X1026100Y573960*
Y580500*
X1032200Y1443000D02*
X1019200D01*
X1040000D02*
X1032200D01*
X1645000Y785600D02*
Y794951D01*
X1644860Y795091*
Y800509*
X1647700Y803349*
Y867700*
X2280200Y1415000D02*
X2294650Y1400550D01*
Y1375850*
X2310700Y1359800*
X2301900Y1351000*
Y1319200*
G54D12*
X203500Y1490600D02*
X210179D01*
X213183Y1487597*
X208400Y1486100D02*
Y1485680D01*
X213183*
X339615*
X369665Y1455630*
X578365*
X601976Y1432019*
X662309*
X710243Y1479952*
X1371273*
X1373860Y1482540*
X1380584*
X1381753Y1481371*
Y1480708*
X1381284Y1480240*
X213183Y1487597D02*
X340409D01*
X370458Y1457547*
X579158*
X602770Y1433935*
X661515*
X709449Y1481869*
X1370479*
X1373067Y1484456*
X1381378*
X1383670Y1482165*
Y1479914*
X1382640Y1478884*
X222721Y1358184D02*
X221691Y1359214D01*
Y1407246*
X233240Y1418795*
Y1436348*
X226628Y1442960*
X223300Y1352500D02*
Y1357605D01*
X222721Y1358184*
X224076Y1359540D02*
X223608Y1360008D01*
Y1406452*
X235157Y1418001*
Y1437142*
X227983Y1444316*
X226628Y1442960D02*
X222494Y1447094D01*
X223600Y1448200*
X227983Y1444316D02*
Y1446304D01*
X228040Y1446361*
Y1470020*
X227900Y1470160*
Y1474600*
X228700Y1356400D02*
X225560Y1359540D01*
X224076*
X236600Y1476800D02*
X240792Y1472608D01*
Y1471152*
X242570Y1469373*
Y1451542*
X240532Y1449503*
Y1420985*
X248592Y1412925*
Y1410969*
X242708Y1472608D02*
Y1471946D01*
X244487Y1470167*
Y1450748*
X242448Y1448709*
Y1421779*
X250508Y1413719*
Y1410969*
X246900Y1476800D02*
X242708Y1472608D01*
X248592Y1410969D02*
X248123Y1410500D01*
X242900*
X239200Y1414200*
X250508Y1410969D02*
X250977Y1410500D01*
X256200*
X259900Y1406800*
X550600Y1053100D02*
X555040D01*
X557598Y1055658*
X557940*
X550700Y1060000D02*
X555140D01*
X557940Y1057200*
Y1055658D02*
X558261D01*
X558730Y1055190*
Y1053419*
X545818Y1040508*
Y1011642*
X553679Y1003781*
Y759031*
X731046Y581664*
Y546395*
X749001Y528439*
X760682*
X766729Y522392*
Y521729*
X557940Y1057200D02*
X558900D01*
X560272Y1055828*
Y1052781*
X547360Y1039869*
Y1012280*
X555221Y1004419*
Y759669*
X732587Y582303*
Y547033*
X749640Y529981*
X761320*
X768271Y523031*
Y521729*
X640510Y1204210D02*
X644650Y1208350D01*
Y1211794*
X645216Y1212360*
X646384*
X646950Y1211794*
Y1208609*
X647516Y1208043*
X648684*
X649250Y1208609*
Y1211794*
X649816Y1212360*
X650984*
X651550Y1211794*
Y1208609*
X652116Y1208043*
X653284*
X653850Y1208609*
Y1211794*
X654416Y1212360*
X655584*
X656150Y1211794*
Y1208609*
X656716Y1208043*
X657884*
X658450Y1208609*
Y1211794*
X659016Y1212360*
X660184*
X660750Y1211794*
Y1208609*
X661316Y1208043*
X662484*
X663050Y1208609*
Y1211794*
X663616Y1212360*
X664784*
X665350Y1211794*
Y1208609*
X665916Y1208043*
X667084*
X667650Y1208609*
Y1211794*
X668216Y1212360*
X669384*
X669950Y1211794*
Y1208609*
X670516Y1208043*
X671684*
X672250Y1208609*
Y1211794*
X672816Y1212360*
X673984*
X674550Y1211794*
Y1208609*
X675116Y1208043*
X676284*
X676850Y1208609*
Y1211794*
X677416Y1212360*
X678584*
X679150Y1211794*
Y1208609*
X679716Y1208043*
X680884*
X681450Y1208609*
Y1211794*
X682016Y1212360*
X683184*
X683750Y1211794*
Y1208609*
X684316Y1208043*
X685484*
X686050Y1208609*
Y1211374*
X686616Y1211940*
X690756*
X640510Y1204210D02*
X608610D01*
X584900Y1180500*
X666900Y1201500D02*
X707450D01*
X728791Y1180159*
X695100Y1003500D02*
X739821D01*
X747261Y1010940*
X780039*
X785979Y1005000*
X809774*
X695800Y1195500D02*
X717145Y1174155D01*
X709250Y504929D02*
X712379Y501800D01*
X712400*
X709250Y506471D02*
X712379Y509600D01*
X712400*
X717145Y1174155D02*
X720073Y1171227D01*
X720873*
X722678Y1173032*
X723478*
X724304Y1172206*
Y1171406*
X719894Y1166996*
Y1166196*
X720720Y1165370*
X721520*
X725930Y1169780*
X726730*
X727557Y1168953*
Y1168153*
X723147Y1163743*
Y1162943*
X723973Y1162117*
X724773*
X729183Y1166527*
X729983*
X730809Y1165701*
Y1164901*
X726399Y1160491*
Y1159691*
X727226Y1158864*
X728026*
X732436Y1163274*
X733236*
X734062Y1162448*
Y1161648*
X729652Y1157238*
Y1156438*
X730478Y1155612*
X731278*
X733083Y1157417*
X733883*
X736811Y1154489*
X728791Y1180159D02*
X731718Y1177232D01*
X732518*
X734319Y1179033*
X735119*
X735946Y1178206*
Y1177406*
X731544Y1173004*
Y1172204*
X732370Y1171378*
X733170*
X737572Y1175780*
X738372*
X739198Y1174954*
Y1174154*
X737397Y1172353*
Y1171553*
X740325Y1168625*
X736811Y1154489D02*
X758800Y1132500D01*
X791500*
X813440Y1110560*
X881639*
X902960Y1131881*
Y1140639*
X935881Y1173560*
X956592*
X960472Y1177440*
X974645*
X976885Y1175200*
X990600*
X766729Y521729D02*
X762500Y517500D01*
X768271Y521729D02*
X772500Y517500D01*
X778200Y1234500D02*
X854350D01*
X857350Y1231500*
X870800*
X876800Y1225500*
X895348*
X899408Y1221440*
X904039*
X904239Y1221240*
X916641*
X808600Y1188200D02*
Y1176721D01*
X815340Y1169981*
X808600Y1188200D02*
X781079D01*
X779239Y1186360*
X733030*
X707450Y1211940*
X690756*
X808600Y1200200D02*
X812941Y1195859D01*
X809774Y1005000D02*
X810740D01*
X811306Y1005566*
Y1008312*
X811871Y1008877*
X813040*
X813606Y1008312*
Y997980*
X814171Y997414*
X815340*
X815906Y997980*
Y1008312*
X816471Y1008877*
X817640*
X818206Y1008312*
Y997980*
X818771Y997414*
X819940*
X820506Y997980*
Y1008312*
X821071Y1008877*
X822240*
X822806Y1008312*
Y997980*
X823371Y997414*
X824540*
X825106Y997980*
Y1008312*
X825671Y1008877*
X826840*
X827406Y1008312*
Y997980*
X827971Y997414*
X829140*
X829706Y997980*
Y1008312*
X830271Y1008877*
X831440*
X832006Y1008312*
Y997980*
X832571Y997414*
X833740*
X834306Y997980*
Y1008312*
X834871Y1008877*
X836040*
X836606Y1008312*
Y997980*
X837171Y997414*
X838340*
X838906Y997980*
Y1008312*
X839471Y1008877*
X840640*
X841206Y1008312*
Y997980*
X841771Y997414*
X842940*
X843506Y997980*
Y1008312*
X844071Y1008877*
X845240*
X845806Y1008312*
Y997980*
X846371Y997414*
X847540*
X848106Y997980*
Y1008312*
X848671Y1008877*
X849840*
X850406Y1008312*
Y997980*
X850971Y997414*
X852140*
X852706Y997980*
Y1004434*
X853271Y1005000*
X854237*
X811200Y1120600D02*
X820840Y1130240D01*
X841639*
X844960Y1126919*
Y1126140*
X848100Y1123000*
X812941Y1195859D02*
X815868Y1192932D01*
Y1192132*
X813840Y1190103*
Y1189303*
X814666Y1188477*
X815466*
X820323Y1193334*
X821123*
X821950Y1192507*
Y1191707*
X817093Y1186850*
Y1186050*
X817919Y1185224*
X818719*
X823576Y1190081*
X824376*
X825202Y1189255*
Y1188455*
X820345Y1183598*
Y1182798*
X821172Y1181971*
X821972*
X826829Y1186828*
X827629*
X828455Y1186002*
Y1185202*
X823598Y1180345*
Y1179545*
X824424Y1178719*
X825224*
X830081Y1183576*
X830881*
X831708Y1182749*
Y1181949*
X826851Y1177092*
Y1176292*
X827677Y1175466*
X828477*
X833334Y1180323*
X834134*
X834960Y1179497*
Y1178697*
X830103Y1173840*
Y1173040*
X830930Y1172213*
X831730*
X833758Y1174242*
X834558*
X837486Y1171314*
X815340Y1169981D02*
X818267Y1167054D01*
X819067*
X821330Y1169316*
X822130*
X822956Y1168490*
Y1167690*
X817966Y1162700*
Y1161900*
X818793Y1161074*
X819593*
X824583Y1166064*
X825383*
X826209Y1165237*
Y1164437*
X821219Y1159447*
Y1158647*
X822045Y1157821*
X822845*
X827835Y1162811*
X828635*
X829462Y1161985*
Y1161185*
X824472Y1156195*
Y1155395*
X825298Y1154568*
X826098*
X831088Y1159558*
X831888*
X832714Y1158732*
Y1157932*
X827724Y1152942*
Y1152142*
X828551Y1151316*
X829351*
X834341Y1156306*
X835141*
X835967Y1155479*
Y1154679*
X830977Y1149689*
Y1148889*
X831803Y1148063*
X832603*
X837593Y1153053*
X838393*
X839220Y1152227*
Y1151427*
X834230Y1146437*
Y1145637*
X835056Y1144810*
X835856*
X837783Y1146738*
X838583*
X841511Y1143810*
X821400Y1218500D02*
X850821D01*
X850961Y1218640*
X867506*
X871086Y1215060*
X896739*
X899439Y1212360*
X958428*
X967308Y1221240*
X1002500*
X837486Y1171314D02*
X840640Y1168160D01*
X853560*
X854640Y1169240*
X868360*
X881400Y1156200*
X898600*
X841511Y1143810D02*
X856161Y1129160D01*
X859839*
X872179Y1141500*
X897315*
X940555Y1184740*
X959966*
X964566Y1189340*
X997499*
X1002500Y1184339*
X854237Y1005000D02*
X874800D01*
X891800Y988000*
X858000Y1245400D02*
X880121D01*
X888021Y1237500*
X890821*
X900361Y1227960*
X915860*
X920550Y1232650*
X952798*
X956608Y1236460*
X977634*
X985034Y1243860*
X1002500*
X877516Y677906D02*
Y677951D01*
X885926Y695100D02*
X885563Y688915D01*
X878229Y682392*
X877752Y681968*
X877516Y677951*
X888300Y1231500D02*
X893568D01*
X899408Y1225660*
X919701*
X922401Y1222960*
X951481*
X957561Y1229040*
X976719*
X978439Y1230760*
X892500Y517500D02*
X896729Y521729D01*
X892773Y687400D02*
X886588Y687763D01*
X879253Y681240*
X879058Y677906*
X896729Y521729D02*
Y524269D01*
X906900Y534439*
Y626110*
X877516Y655494*
Y677906*
X898271Y521729D02*
Y523630D01*
X908442Y533801*
Y626748*
X879058Y656132*
Y677906*
X902200Y1239000D02*
X905540Y1242340D01*
X906640*
X907206Y1241774*
Y1235516*
X907771Y1234950*
X908940*
X909506Y1235516*
Y1241774*
X910071Y1242340*
X911240*
X911806Y1241774*
Y1235516*
X912371Y1234950*
X913540*
X914106Y1235516*
Y1241774*
X914671Y1242340*
X915840*
X916406Y1241774*
Y1235516*
X916971Y1234950*
X918140*
X918706Y1235516*
Y1241774*
X919271Y1242340*
X920440*
X921006Y1241774*
Y1235516*
X921571Y1234950*
X922740*
X923306Y1235516*
Y1241774*
X923871Y1242340*
X928011*
X902500Y517500D02*
X898271Y521729D01*
X905019Y1197840D02*
X884679Y1177500D01*
X860200*
X905019Y1197840D02*
X908469D01*
X909035Y1197274*
Y1195906*
X909600Y1195340*
X910769*
X911335Y1195906*
Y1201174*
X911900Y1201740*
X913069*
X913635Y1201174*
Y1195906*
X914200Y1195340*
X915369*
X915935Y1195906*
Y1201174*
X916500Y1201740*
X917669*
X918235Y1201174*
Y1195906*
X918800Y1195340*
X919969*
X920535Y1195906*
Y1201174*
X921100Y1201740*
X922269*
X922835Y1201174*
Y1195906*
X923400Y1195340*
X924569*
X925135Y1195906*
Y1201174*
X925700Y1201740*
X926869*
X927435Y1201174*
Y1195906*
X928000Y1195340*
X929169*
X929735Y1195906*
Y1201174*
X930300Y1201740*
X931469*
X932035Y1201174*
Y1195906*
X932600Y1195340*
X933769*
X934335Y1195906*
Y1201174*
X934900Y1201740*
X936069*
X936635Y1201174*
Y1198406*
X937200Y1197840*
X941340*
X905100Y1244640D02*
X909240D01*
X909806Y1245206*
Y1252074*
X910371Y1252640*
X911540*
X912106Y1252074*
Y1245206*
X912671Y1244640*
X916811*
X905100D02*
X904587D01*
X903507Y1243560*
X894840*
X888900Y1249500*
X875300*
X830300Y1294500*
X916641Y1221240D02*
X919701D01*
X920781Y1220160*
Y1215226*
X921347Y1214660*
X922516*
X923081Y1215226*
Y1220094*
X923647Y1220660*
X924816*
X925381Y1220094*
Y1215226*
X925947Y1214660*
X927116*
X927681Y1215226*
Y1220094*
X928247Y1220660*
X929416*
X929981Y1220094*
Y1215226*
X930547Y1214660*
X931716*
X932281Y1215226*
Y1220094*
X932847Y1220660*
X934016*
X934581Y1220094*
Y1215226*
X935147Y1214660*
X936316*
X936881Y1215226*
Y1220094*
X937447Y1220660*
X938616*
X939181Y1220094*
Y1215226*
X939747Y1214660*
X940916*
X941481Y1215226*
Y1220094*
X942047Y1220660*
X943216*
X943781Y1220094*
Y1215226*
X944347Y1214660*
X945516*
X946081Y1215226*
Y1220094*
X946647Y1220660*
X947816*
X948381Y1220094*
Y1215226*
X948947Y1214660*
X950116*
X950681Y1215226*
Y1220094*
X951247Y1220660*
X952416*
X952981Y1220094*
Y1215226*
X953547Y1214660*
X954716*
X955281Y1215226*
Y1219594*
X955847Y1220160*
X959987*
X919314Y1256049D02*
X918305Y1255040D01*
X904040*
X897000Y1248000*
X920669Y1254694D02*
Y1254031D01*
X925000Y1249700*
X937819Y1187040D02*
X941269D01*
X941835Y1187606*
Y1194474*
X942400Y1195040*
X943569*
X944135Y1194474*
Y1187606*
X944700Y1187040*
X945869*
X946435Y1187606*
Y1194474*
X947000Y1195040*
X948169*
X948735Y1194474*
Y1187606*
X949300Y1187040*
X953440*
X937819D02*
X902539Y1151760D01*
X893540*
X893360Y1151940*
X876340*
X858000Y1133600*
X953440Y1187040D02*
X959014D01*
X963614Y1191640*
X998689*
X1002500Y1187829*
X954740Y1253740D02*
X951600Y1250600D01*
X956656Y1253740D02*
Y1249377D01*
X953439Y1246160*
X949761*
X948560Y1247360*
X944340*
X941200Y1250500*
X959987Y1220160D02*
X962975D01*
X966655Y1223840*
X1002500*
X970100Y1218640D02*
X974240D01*
X974806Y1218074*
Y1211206*
X975371Y1210640*
X976540*
X977106Y1211206*
Y1218074*
X977671Y1218640*
X978840*
X979406Y1218074*
Y1211206*
X979971Y1210640*
X981140*
X981706Y1211206*
Y1218074*
X982271Y1218640*
X986160*
X986411Y1218389*
X970100Y1218640D02*
X967961D01*
X959381Y1210060*
X898486*
X895786Y1212760*
X868946*
X867506Y1214200*
X852800*
X978439Y1230760D02*
X981919Y1234240D01*
X982579*
X983145Y1233674*
Y1227466*
X983710Y1226900*
X984879*
X985445Y1227466*
Y1234500*
X986010Y1235066*
X987179*
X987745Y1234500*
Y1227466*
X988310Y1226900*
X989479*
X990045Y1227466*
Y1234500*
X990610Y1235066*
X991779*
X992345Y1234500*
Y1227466*
X992910Y1226900*
X994079*
X994645Y1227466*
Y1234500*
X995210Y1235066*
X996379*
X996945Y1234500*
Y1227466*
X997510Y1226900*
X998679*
X999245Y1227466*
Y1233674*
X999810Y1234240*
X1002500*
X988760Y1046603D02*
Y1050743D01*
X989326Y1051309*
X990334*
X990900Y1051875*
Y1053043*
X990334Y1053609*
X986105*
X985540Y1054175*
Y1055343*
X986105Y1055909*
X990334*
X990900Y1056475*
Y1057643*
X990334Y1058209*
X986105*
X985540Y1058775*
Y1059943*
X986105Y1060509*
X990334*
X990900Y1061075*
Y1062243*
X990334Y1062809*
X986105*
X985540Y1063375*
Y1064543*
X986105Y1065109*
X990334*
X990900Y1065675*
Y1066843*
X990334Y1067409*
X986105*
X985540Y1067975*
Y1069143*
X986105Y1069709*
X990334*
X990900Y1070275*
Y1071443*
X990334Y1072009*
X986105*
X985540Y1072575*
Y1073743*
X986105Y1074309*
X988194*
X988760Y1074875*
Y1079015*
Y1120492*
X1002500Y1134232*
X993200Y1003600D02*
Y1030310D01*
Y1031275*
X993766Y1031841*
X995994*
X996560Y1032406*
Y1033575*
X995994Y1034141*
X993766*
X993200Y1034706*
Y1035875*
X993766Y1036441*
X995994*
X996560Y1037006*
Y1038175*
X995994Y1038741*
X993766*
X993200Y1039306*
Y1040475*
X993766Y1041041*
X995994*
X996560Y1041606*
Y1042775*
X995994Y1043341*
X993766*
X993200Y1043906*
Y1045075*
X993766Y1045641*
X995994*
X996560Y1046206*
Y1047375*
X995994Y1047941*
X993766*
X993200Y1048506*
Y1049675*
X993766Y1050241*
X995994*
X996560Y1050806*
Y1051975*
X995994Y1052541*
X993766*
X993200Y1053106*
Y1054275*
X993766Y1054841*
X995994*
X996560Y1055406*
Y1056575*
X995994Y1057141*
X993766*
X993200Y1057706*
Y1058875*
X993766Y1059441*
X995994*
X996560Y1060006*
Y1061175*
X995994Y1061741*
X993766*
X993200Y1062306*
Y1063475*
X993766Y1064041*
X995994*
X996560Y1064606*
Y1065775*
X995994Y1066341*
X993766*
X993200Y1066906*
Y1068075*
X993766Y1068641*
X995994*
X996560Y1069206*
Y1070375*
X995994Y1070941*
X993766*
X993200Y1071506*
Y1072675*
X993766Y1073241*
X995994*
X996560Y1073806*
Y1074975*
X995994Y1075541*
X993766*
X993200Y1076106*
Y1077275*
X993766Y1077841*
X995994*
X996560Y1078406*
Y1079575*
X995994Y1080141*
X993766*
X993200Y1080706*
Y1081875*
X993766Y1082441*
X995994*
X996560Y1083006*
Y1084175*
X995994Y1084741*
X993766*
X993200Y1085306*
Y1086475*
X993766Y1087041*
X995994*
X996560Y1087606*
Y1088775*
X995994Y1089341*
X993766*
X993200Y1089906*
Y1090872*
Y1121679*
X1002500Y1130979*
X993800Y987400D02*
X988760Y992440D01*
Y1046603*
X998160Y997511D02*
Y1029566D01*
X1001000Y1032406*
Y1055500*
X998240Y954290D02*
Y957740D01*
X998806Y958306*
X1003635*
X1004201Y958871*
Y960040*
X1003635Y960606*
X998806*
X998240Y961171*
Y962340*
X998806Y962906*
X1003635*
X1004201Y963471*
Y964640*
X1003635Y965206*
X998806*
X998240Y965771*
Y966940*
X998806Y967506*
X1003635*
X1004201Y968071*
Y969240*
X1003635Y969806*
X998806*
X998240Y970371*
Y971540*
X998806Y972106*
X1003635*
X1004201Y972671*
Y973840*
X1003635Y974406*
X998806*
X998240Y974971*
Y976140*
X998806Y976706*
X1003635*
X1004201Y977271*
Y978440*
X1003635Y979006*
X998806*
X998240Y979571*
Y980740*
X998806Y981306*
X1003635*
X1004201Y981871*
Y983040*
X1003635Y983606*
X998806*
X998240Y984171*
Y985340*
X998806Y985906*
X1003635*
X1004201Y986471*
Y987640*
X1003635Y988206*
X998806*
X998240Y988771*
Y989940*
X998806Y990506*
X1003635*
X1004201Y991071*
Y992240*
X1003635Y992806*
X998806*
X998240Y993371*
Y995710*
X998160Y995790*
Y997511*
X998240Y954290D02*
Y923019D01*
X985550Y910329*
Y892971*
X961839Y869260*
X868161*
X855760Y881661*
Y969160*
X860200Y973600*
X1002500Y1068350D02*
X1005740Y1065110D01*
Y1052911*
X1002500Y1115379D02*
X1001060Y1113939D01*
Y1069790*
X1002500Y1068350*
Y1130979D02*
X1012161Y1140640D01*
X1016269*
X1020559Y1136350*
X1032012*
X1034500Y1138838*
Y1141162*
X1036988Y1143650*
X1037800*
X1038500Y1144350*
Y1148000*
X1002500Y1134232D02*
X1012268Y1144000D01*
X1031662*
X1034500Y1146838*
Y1149162*
X1036988Y1151650*
X1066850*
X1070500Y1148000*
X1002500Y1175200D02*
X996879D01*
X992339Y1179740*
X959519*
X955639Y1175860*
X934928*
X900660Y1141592*
Y1141581*
X888579Y1129500*
X863432*
X860792Y1126860*
X855208*
X849528Y1132540*
X822410*
X810450Y1144500*
X764450*
X740325Y1168625*
X1002500Y1184339D02*
X1007199Y1179640D01*
X1010639*
X1012829Y1177450*
X1026870*
X1028154Y1178734*
X1066396*
X1074500Y1186838*
Y1192000*
X1078500Y1196000*
X1002500Y1187829D02*
X1008389Y1181940D01*
X1011592*
X1013782Y1179750*
X1025917*
X1027286Y1181118*
X1043268*
X1046500Y1184350*
Y1188000*
X1002500Y1193940D02*
X960160D01*
X956260Y1197840*
X941340*
X1002500Y1200660D02*
X1001506D01*
X1000940Y1200094*
Y1196806*
X1000374Y1196240*
X999206*
X998640Y1196806*
Y1200094*
X998074Y1200660*
X996906*
X996340Y1200094*
Y1196806*
X995774Y1196240*
X994606*
X994040Y1196806*
Y1200094*
X993474Y1200660*
X992306*
X991740Y1200094*
Y1196806*
X991174Y1196240*
X990006*
X989440Y1196806*
Y1200094*
X988874Y1200660*
X987706*
X987140Y1200094*
Y1196806*
X986574Y1196240*
X985406*
X984840Y1196806*
Y1200094*
X984274Y1200660*
X983106*
X982540Y1200094*
Y1196806*
X981974Y1196240*
X980806*
X980240Y1196806*
Y1200094*
X979674Y1200660*
X978506*
X977940Y1200094*
Y1196806*
X977374Y1196240*
X976206*
X975640Y1196806*
Y1200094*
X975074Y1200660*
X973906*
X973340Y1200094*
Y1196806*
X972774Y1196240*
X971606*
X971040Y1196806*
Y1200094*
X970474Y1200660*
X969306*
X968740Y1200094*
Y1196806*
X968174Y1196240*
X967006*
X966440Y1196806*
Y1200439*
X962839Y1204040*
X894372*
X891092Y1200760*
X877279*
X872099Y1205940*
X847540*
X846160Y1204560*
X831661*
X830721Y1205500*
X821500*
X1002500Y1200660D02*
X1002674D01*
X1003240Y1200094*
Y1199586*
X1003806Y1199020*
X1007512*
X1018850Y1187682*
Y1186488*
X1020988Y1184350*
X1024012*
X1026500Y1186838*
Y1189162*
X1029338Y1192000*
X1039662*
X1042500Y1194838*
Y1197162*
X1045338Y1200000*
X1066500*
X1070500Y1204000*
X1002500Y1208240D02*
X992690D01*
X987410Y1202960*
X967172*
X963792Y1206340*
X893419*
X890139Y1203060*
X878232*
X871532Y1209760*
X844990*
X841310Y1213440*
X819640*
X812400Y1206200*
X797200*
X790360Y1199360*
X770360*
X767000Y1196000*
X1002500Y1212360D02*
X992440D01*
X986411Y1218389*
X1002500Y1221240D02*
X1012210D01*
X1014700Y1218750*
X1016729*
X1018060Y1217419*
X1019919*
X1022500Y1220000*
X1002500Y1223840D02*
X1010490D01*
X1014590Y1227940*
X1022519*
X1026459Y1224000*
X1055662*
X1058500Y1221162*
Y1218838*
X1061338Y1216000*
X1074500*
X1078500Y1212000*
X1002500Y1234240D02*
X1003950D01*
X1002500Y1239650D02*
X984076D01*
X975766Y1231340*
X956608*
X952668Y1227400*
X933400*
X1002500Y1243860D02*
X1011592D01*
X1015382Y1247650*
X1026850*
X1030500Y1244000*
X1002500Y1246160D02*
X982692D01*
X981872Y1245340*
X960114*
X956334Y1241560*
X947855*
X947075Y1242340*
X928011*
X1002500Y1269221D02*
X980919Y1247640D01*
X959162*
X955382Y1243860*
X948808*
X948028Y1244640*
X916811*
X1002600Y1004100D02*
X1005740Y1007240D01*
Y1008540*
X1006305Y1009106*
X1010273*
X1010839Y1009671*
Y1010840*
X1010273Y1011406*
X1003866*
X1003300Y1011971*
Y1013140*
X1003866Y1013706*
X1010273*
X1010839Y1014271*
Y1015440*
X1010273Y1016006*
X1003866*
X1003300Y1016571*
Y1017740*
X1003866Y1018306*
X1010273*
X1010839Y1018871*
Y1020040*
X1010273Y1020606*
X1003866*
X1003300Y1021171*
Y1022340*
X1003866Y1022906*
X1010273*
X1010839Y1023471*
Y1024640*
X1010273Y1025206*
X1003866*
X1003300Y1025771*
Y1026940*
X1003866Y1027506*
X1010273*
X1010839Y1028071*
Y1029240*
X1010273Y1029806*
X1003866*
X1003300Y1030371*
Y1031540*
X1003866Y1032106*
X1010273*
X1010839Y1032671*
Y1033840*
X1010273Y1034406*
X1003866*
X1003300Y1034971*
Y1036140*
X1003866Y1036706*
X1010273*
X1010839Y1037271*
Y1038440*
X1010273Y1039006*
X1003866*
X1003300Y1039571*
Y1040000*
Y1040740*
X1003866Y1041306*
X1010273*
X1010839Y1041871*
Y1043040*
X1010273Y1043606*
X1003866*
X1003300Y1044171*
Y1045340*
X1003866Y1045906*
X1010273*
X1010839Y1046471*
Y1047640*
X1010273Y1048206*
X1006305*
X1005740Y1048771*
Y1052911*
X1003950Y1234240D02*
X1010860D01*
X1014540Y1230560*
X1023169*
X1024259Y1231650*
X1056012*
X1058500Y1229162*
Y1226838*
X1061338Y1224000*
X1066500*
X1070500Y1220000*
X1008800Y1175200D02*
X1002500D01*
X1015060Y1023301D02*
Y1027441D01*
X1015626Y1028006*
X1017576*
X1018142Y1028572*
Y1029741*
X1017576Y1030306*
X1013911*
X1013345Y1030872*
Y1032041*
X1013911Y1032606*
X1017576*
X1018142Y1033172*
Y1034341*
X1017576Y1034906*
X1013911*
X1013345Y1035472*
Y1036641*
X1013911Y1037206*
X1017576*
X1018142Y1037772*
Y1038941*
X1017576Y1039506*
X1015626*
X1015132Y1040000*
X1015060Y1040072*
Y1044212*
X1019900Y1001300D02*
X1015060Y1006140D01*
Y1023301*
X1027692Y1335069D02*
X1027223Y1334600D01*
X1022400*
X1034900D02*
X1030077D01*
X1029608Y1335069*
X1038500Y1132000D02*
Y1128350D01*
X1037800Y1127650*
X1036988*
X1034500Y1125162*
Y1122838*
X1032012Y1120350*
X1028988*
X1026500Y1122838*
Y1125162*
X1024012Y1127650*
X1020988*
X1018645Y1125307*
Y1095566*
X1015060Y1091981*
Y1044212*
X1038500Y1268000D02*
X1034500Y1272000D01*
X1017309*
X1016769Y1272540*
X1005819*
X1002500Y1269221*
X1040000Y977600D02*
X1036860Y980740D01*
Y998940*
X1042371Y1004450*
X1042729*
X1047040Y1008761*
Y1029708*
X1049340Y1032008*
Y1037592*
X1046932Y1040000*
X1042000Y985100D02*
Y991079D01*
X1054871Y1003950*
X1056229*
X1059940Y1007661*
Y1009472*
X1066150Y1015682*
Y1040000*
X1042600Y998400D02*
X1050150Y1005950D01*
Y1029565*
X1051640Y1031055*
Y1038545*
X1050850Y1039335*
Y1040000*
X1043679D02*
X1047040Y1036639D01*
Y1032961*
X1029600Y1015521*
Y988000*
X1044900Y1334600D02*
X1048181Y1337881D01*
Y1339403*
X1046500Y1092000D02*
X1042500Y1088000D01*
Y1066838*
X1039662Y1064000*
X1037338*
X1034850Y1061512*
Y1048829*
X1043679Y1040000*
X1046500Y1132000D02*
X1042850Y1135650D01*
X1036988*
X1034500Y1133162*
Y1130838*
X1032012Y1128350*
X1026565*
X1024965Y1129950*
X1020035*
X1011985Y1121900*
X1009021*
X1002500Y1115379*
X1046500Y1204000D02*
X1042850D01*
X1042150Y1203300*
Y1202488*
X1039662Y1200000*
X1029338*
X1026500Y1197162*
Y1194838*
X1024012Y1192350*
X1020750*
X1015900Y1197200*
X1046932Y1040000D02*
X1042850Y1044082D01*
Y1061512*
X1044988Y1063650*
X1045800*
X1046500Y1064350*
Y1068000*
X1048181Y1339403D02*
Y1404708D01*
X1077229Y1433757*
X1188082*
X1190850Y1430989*
X1226999*
X1229767Y1433757*
X1339828*
X1369309Y1404275*
Y1272739*
X1379157Y1262891*
Y1234409*
X1374420Y1229673*
Y1209657*
X1381360Y1202717*
Y1010346*
X1385957Y1005749*
Y912362*
X1381962Y908367*
Y892237*
X1384357Y889842*
Y878059*
X1383260Y876962*
Y813510*
X1397828Y798942*
Y768116*
X1403189Y762755*
X1050097Y1339403D02*
Y1403914D01*
X1078023Y1431840*
X1187288*
X1190056Y1429072*
X1227793*
X1230561Y1431840*
X1339034*
X1367392Y1403481*
Y1271945*
X1377240Y1262097*
Y1235203*
X1372504Y1230466*
Y1208863*
X1379443Y1201923*
Y1009552*
X1384040Y1004955*
Y913155*
X1380046Y909161*
Y891443*
X1382440Y889048*
Y878853*
X1381343Y877756*
Y812716*
X1395912Y798148*
Y767322*
X1401834Y761399*
X1050850Y1040000D02*
Y1104350D01*
X1054500Y1108000*
X1054900Y1334600D02*
X1050097Y1339403D01*
X1060343Y1248500D02*
X1060493Y1248350D01*
X1066850*
X1070500Y1252000*
X1062500Y1124000D02*
X1066500Y1120000D01*
X1071662*
X1074500Y1117162*
Y1051359*
X1076940Y1048919*
Y1040000*
X1062500Y1196000D02*
X1058500Y1192000D01*
X1045338*
X1042500Y1189162*
Y1186838*
X1039546Y1183884*
X1026799*
X1024965Y1182050*
X1020035*
X1016550Y1185535*
Y1186729*
X1009339Y1193940*
X1002500*
X1062500Y1212000D02*
X1058850D01*
X1058150Y1212700*
Y1213512*
X1056012Y1215650*
X1028988*
X1026500Y1213162*
Y1210838*
X1024012Y1208350*
X1014571*
X1010561Y1212360*
X1002500*
X1062500Y1228000D02*
Y1231650D01*
X1061800Y1232350*
X1060988*
X1058500Y1234838*
Y1237162*
X1056012Y1239650*
X1002500*
X1066150Y1040000D02*
Y1085512D01*
X1063662Y1088000*
X1058500*
X1054500Y1092000*
X1068942Y1338642D02*
X1064900Y1334600D01*
X1070500Y1236000D02*
X1066500Y1240000D01*
X1061338*
X1058500Y1242838*
Y1245162*
X1055662Y1248000*
X1045338*
X1042500Y1250838*
Y1253162*
X1040012Y1255650*
X1020129*
X1010639Y1246160*
X1002500*
X1070858Y1338642D02*
X1074900Y1334600D01*
X1076940Y1040000D02*
Y1023219D01*
X1062240Y1008519*
Y1005040*
X1055600Y998400*
X1078500Y1220000D02*
X1082150Y1216350D01*
Y1210488*
X1079662Y1208000*
X1029338*
X1026500Y1205162*
Y1202838*
X1024012Y1200350*
X1019029*
X1011139Y1208240*
X1002500*
X1085100Y1315400D02*
X1098150Y1302350D01*
Y1255650*
X1094500Y1252000*
X1088942Y1338642D02*
X1084900Y1334600D01*
X1090858Y1338642D02*
X1094900Y1334600D01*
X1095100Y1315400D02*
X1106150Y1304350D01*
Y1255650*
X1102500Y1252000*
X1129530Y1320040D02*
X994924D01*
X969357Y1294473*
Y1281080*
X956656Y1268380*
Y1253740*
X1129530Y1321957D02*
X994130D01*
X967440Y1295266*
Y1281874*
X954740Y1269174*
Y1253740*
X1129570Y1320000D02*
X1129530Y1320040D01*
X1139590Y1320000D02*
X1137633Y1321957D01*
X1129530*
X1150500Y1292000D02*
X1146312D01*
X1138360Y1299952*
Y1306173*
X1131260Y1313273*
Y1318310*
X1129570Y1320000*
X1150500Y1300000D02*
X1147458Y1296958D01*
X1146796*
X1142208Y1301546*
Y1317381*
X1139590Y1320000*
X1177757Y1319322D02*
X1172823Y1324257D01*
X990232*
X920669Y1254694*
X1179112Y1320678D02*
X1173616Y1326173D01*
X989438*
X919314Y1256049*
X1179791Y1320000D02*
X1187858Y1311932D01*
Y1311137*
X1179791Y1320000D02*
X1179790D01*
X1179112Y1320678*
X1185942Y1311137D02*
Y1308869D01*
X1190402Y1304408*
X1185942Y1311137D02*
X1177757Y1319322D01*
X1187858Y1311137D02*
Y1309663D01*
X1191758Y1305763*
X1190402Y1304408D02*
X1191312Y1303498D01*
X1191456*
X1194500Y1300455*
Y1259545*
X1199570Y1254475*
Y1248326*
X1207046Y1240850*
X1223805*
X1226500Y1243545*
Y1248000*
X1230500Y1252000*
X1191758Y1305763D02*
X1194633D01*
X1202150Y1298247*
Y1251188*
X1204488Y1248850*
X1219350*
X1222500Y1252000*
X1207411Y54018D02*
X1203417D01*
X1203395Y54040*
X1181580*
X1161558Y34018*
X972210*
X715079Y291149*
Y417781*
X689018Y443842*
Y471208*
X695929Y478119*
Y494451*
X707949Y506471*
X709250*
X1207411Y55560D02*
X1204055D01*
X1204033Y55582*
X1180942*
X1160920Y35560*
X972849*
X716621Y291788*
Y418419*
X690560Y444480*
Y470570*
X697471Y477481*
Y493813*
X708587Y504929*
X709250*
X1238500Y1244000D02*
X1241650D01*
X1242652Y1245002*
Y1248936*
X1243350Y1249634*
Y1253305*
X1245195Y1255150*
X1247805*
X1250100Y1252855*
X1250900*
X1253195Y1255150*
X1270341*
X1273993Y1251498*
X1282500*
Y1247650D02*
X1250150D01*
X1246500Y1244000*
X1282500Y1247650D02*
X1282640D01*
X1285132Y1250143*
X1282500Y1251498D02*
X1283777D01*
X1288692Y1256413*
Y1301888*
X1297662Y1310858*
X1299118*
X1285132Y1250143D02*
X1290608Y1255619D01*
Y1301094*
X1298456Y1308942*
X1299118*
X1301460Y1306600*
X1305900*
X1299118Y1310858D02*
X1301460Y1313200D01*
X1305900*
X1364400Y745600D02*
Y750040D01*
X1366742Y752382*
Y755399*
X1364400Y757741*
Y761836*
X1351296Y774940*
Y826356*
X1348243Y829409*
Y872895*
X1330043Y891095*
Y908481*
X1359677Y938115*
Y949946*
X1363640Y953908*
Y965842*
X1362643Y966839*
Y1002791*
X1367520Y1007668*
Y1101656*
X1350843Y1118333*
Y1148707*
X1354040Y1151903*
Y1302808*
X1331148Y1325700*
X1319162*
X1306633Y1338229*
Y1355706*
X1292120Y1370219*
X1143268*
X1137247Y1376240*
X1124953*
X1117296Y1368583*
X1099251*
X1090858Y1360191*
Y1338642*
X1368658Y752382D02*
Y756193D01*
X1366317Y758535*
Y762630*
X1353213Y775734*
Y827150*
X1350160Y830203*
Y873689*
X1331960Y891889*
Y907687*
X1361594Y937321*
Y949152*
X1365557Y953114*
Y966636*
X1364560Y967633*
Y1001997*
X1369437Y1006874*
Y1102450*
X1352760Y1119127*
Y1147913*
X1355957Y1151109*
Y1303602*
X1331942Y1327617*
X1319956*
X1308550Y1339023*
Y1356499*
X1292913Y1372136*
X1144062*
X1138041Y1378157*
X1124159*
X1116502Y1370500*
X1098457*
X1088942Y1360985*
Y1338642*
X1371000Y745600D02*
X1368658Y747942D01*
Y752382*
X1381284Y1480240D02*
X1377840D01*
X1374700Y1477100*
X1382100Y744900D02*
Y749340D01*
X1384442Y751682*
X1382640Y1478884D02*
Y1475440D01*
X1379500Y1472300*
X1384442Y751682D02*
Y767257D01*
X1381542Y770157*
Y797121*
X1366343Y812319*
Y869778*
X1360043Y876078*
Y887133*
X1364619Y891708*
X1368587*
X1372040Y895161*
Y909155*
X1371643Y909551*
Y964449*
X1373540Y966345*
Y1196339*
X1360142Y1209737*
Y1326737*
X1343637Y1343242*
X1336003*
X1289253Y1389992*
X1163153*
X1146205Y1406940*
X1097561*
X1087858Y1397237*
Y1374269*
X1070858Y1357269*
Y1338642*
X1386358Y751682D02*
Y768050D01*
X1383458Y770950*
Y797915*
X1368260Y813113*
Y870572*
X1361960Y876872*
Y886339*
X1365413Y889792*
X1369381*
X1373957Y894367*
Y909949*
X1373560Y910345*
Y963655*
X1375457Y965551*
Y1197133*
X1362058Y1210531*
Y1327531*
X1344431Y1345158*
X1336797*
X1290047Y1391908*
X1163947*
X1146999Y1408857*
X1096767*
X1085942Y1398031*
Y1375063*
X1068942Y1358063*
Y1338642*
X1388700Y744900D02*
Y749340D01*
X1386358Y751682*
X1401834Y761399D02*
Y760349D01*
X1399500Y758015*
Y753300*
X1403189Y762755D02*
X1406100Y759844D01*
Y753300*
X1431840Y925470D02*
X1402936Y954374D01*
Y1111634*
X1418840Y1127538*
Y1214879*
X1426540Y1222579*
Y1291739*
X1409270Y1309010*
X1386962*
X1373479Y1322493*
Y1407439*
X1343578Y1437340*
X1226468*
X1225184Y1436057*
X1190850*
X1189567Y1437340*
X1075745*
X1029728Y1391323*
Y1338639*
X1029608Y1338519*
Y1335069*
X1432605Y829088D02*
X1431840Y829853D01*
Y925470*
X1433195Y926826D02*
X1404853Y955168D01*
Y1110840*
X1420757Y1126744*
Y1214085*
X1428457Y1221785*
Y1292533*
X1410063Y1310926*
X1387756*
X1375396Y1323286*
Y1408233*
X1344372Y1439257*
X1225674*
X1224390Y1437973*
X1191644*
X1190360Y1439257*
X1074951*
X1027812Y1392117*
Y1339433*
X1027692Y1339313*
Y1335069*
X1433960Y830443D02*
Y926061D01*
X1433195Y926826*
X1434200Y759100D02*
X1437340Y762240D01*
Y765100*
X1435423D02*
X1434723Y764400D01*
X1430000*
X1435423Y765100D02*
Y765763D01*
X1432463Y768723*
Y802344*
X1441840Y811721*
Y819853*
X1432605Y829088*
X1437340Y765100D02*
Y766557D01*
X1434379Y769517*
Y801550*
X1443757Y810928*
Y820647*
X1433960Y830443*
X1856455Y258276D02*
X1820871D01*
X1618155Y55560*
X1207411*
X1857094Y256734D02*
X1821509D01*
X1618793Y54018*
X1207411*
X1924000Y1006200D02*
X1898000Y980200D01*
X1890200*
X1934059Y335879D02*
X1856455Y258276D01*
X1934059Y750273D02*
Y335879D01*
X1935600Y335241D02*
X1857094Y256734D01*
X1935600Y750273D02*
Y335241D01*
X2191011Y1007544D02*
X2124862Y941396D01*
X2061336*
X2033429Y913489*
Y851882*
X1934059Y752512*
Y750273*
X2191649Y1006003D02*
X2125501Y939854D01*
X2061975*
X2034971Y912850*
Y851244*
X1935600Y751873*
Y750273*
X2464517Y1108837D02*
X2363223Y1007544D01*
X2191011*
X2464517Y1113463D02*
Y1108837D01*
Y1114137D02*
Y1113463D01*
Y1114137D02*
X2497897Y1144970D01*
X2517551Y1144190*
X2523300Y1149500*
X2466058Y1108199D02*
X2363862Y1006003D01*
X2191649*
X2466058Y1113463D02*
Y1108199D01*
Y1113463D02*
X2498474Y1143404D01*
X2517490Y1142649*
X2522800Y1136900*
G54D13*
X1019200Y1315600D02*
X1030800Y1304000D01*
X1032157*
X1034500Y1301657*
Y1282343*
X1036843Y1280000*
X1040157*
X1042500Y1277657*
Y1274343*
X1044843Y1272000*
X1048157*
X1050500Y1269657*
Y1266343*
X1052843Y1264000*
X1056157*
X1058500Y1261657*
Y1250343*
X1060343Y1248500*
X1040000Y1313000D02*
X1050500Y1302500D01*
Y1282343*
X1052843Y1280000*
X1056157*
X1058500Y1277657*
Y1274343*
X1060843Y1272000*
X1064157*
X1066500Y1269657*
Y1266343*
X1068843Y1264000*
X1074500*
X1078500Y1260000*
X1050400Y1315600D02*
X1059000Y1307000D01*
Y1281843*
X1060843Y1280000*
X1064157*
X1066500Y1277657*
Y1274343*
X1068843Y1272000*
X1071450*
X1074000Y1269450*
Y1269000*
X1074500Y1268500*
Y1268000*
X1078500*
X1065100Y1315400D02*
X1073195Y1307305D01*
X1076852*
X1082500Y1301657*
Y1275050*
X1085550Y1272000*
X1087450*
X1090500Y1268950*
Y1264000*
X1094500Y1260000*
X1075100Y1315400D02*
X1086500Y1304000D01*
X1088157*
X1090500Y1301657*
Y1275050*
X1093050Y1272500*
X1093500*
X1094000Y1272000*
X1094500*
Y1268000*
X1078500Y1252000D02*
X1074500Y1256000D01*
X1068843*
X1066500Y1258343*
Y1261657*
X1064157Y1264000*
X1060843*
X1058500Y1266343*
Y1269657*
X1056157Y1272000*
X1052843*
X1050500Y1274343*
Y1277657*
X1048157Y1280000*
X1044843*
X1042500Y1282343*
Y1302700*
X1029600Y1315600*
G54D14*
X203500Y1490600D03*
X208400Y1486100D03*
X223300Y1352500D03*
X223600Y1448200D03*
X227900Y1474600D03*
X228700Y1356400D03*
X236600Y1476800D03*
X239200Y1414200D03*
X246900Y1476800D03*
X259900Y1406800D03*
X489000Y1172700D03*
X514500Y298500D03*
X535600Y540800D03*
X538200Y460200D03*
X544200Y998600D03*
X550600Y1053100D03*
X550700Y1060000D03*
X561600Y400400D03*
Y423800D03*
X561800Y591400D03*
X564200Y390000D03*
X577300Y234300D03*
X584900Y1180500D03*
X642200Y265200D03*
X656400Y261600D03*
X660800Y487100D03*
X666900Y1201500D03*
X667500Y438600D03*
X691600Y1380600D03*
X694000Y260400D03*
X695100Y1003500D03*
X695800Y1195500D03*
X712400Y501800D03*
Y509600D03*
X732800Y351600D03*
X767000Y438600D03*
Y1196000D03*
X769600Y631800D03*
X777400Y652600D03*
X778200Y1234500D03*
X808600Y1188200D03*
Y1200200D03*
X811200Y1120600D03*
X821400Y1218500D03*
X821500Y1205500D03*
X829600Y643600D03*
X830300Y1294500D03*
X848100Y1123000D03*
X852800Y1214200D03*
X853400Y392500D03*
X858000Y1133600D03*
Y1245400D03*
X860200Y973600D03*
Y1177500D03*
X885926Y695100D03*
X888300Y1231500D03*
X891800Y988000D03*
X892773Y687400D03*
X895000Y316300D03*
X897000Y949000D03*
Y1248000D03*
X898600Y1156200D03*
X902200Y1239000D03*
X904200Y316100D03*
X907400Y1138800D03*
X911500Y793500D03*
X925000Y1249700D03*
X933400Y1227400D03*
X941200Y1250500D03*
X951600Y1250600D03*
X954700Y969900D03*
X964600Y1154400D03*
Y1170000D03*
X982800Y1406500D03*
X990600Y1175200D03*
X993200Y1003600D03*
Y1406500D03*
X993800Y987400D03*
X1000900Y1405200D03*
X1001000Y1055500D03*
X1002600Y1004100D03*
X1006200Y1443000D03*
X1008800Y1175200D03*
X1015900Y1197200D03*
X1019200Y1315600D03*
Y1443000D03*
X1019900Y1001300D03*
X1022400Y1334600D03*
X1024700Y508200D03*
X1026100Y580500D03*
X1029600Y988000D03*
Y1315600D03*
X1032200Y1443000D03*
X1034900Y1334600D03*
X1040000Y977600D03*
Y1313000D03*
Y1443000D03*
X1042000Y985100D03*
X1042600Y998400D03*
X1044900Y1334600D03*
X1050400Y1315600D03*
X1054900Y1334600D03*
X1055600Y998400D03*
X1064900Y1334600D03*
X1065100Y1315400D03*
X1069600Y954300D03*
X1074900Y1334600D03*
X1075100Y1315400D03*
X1079000Y241800D03*
X1084900Y1334600D03*
X1085100Y1315400D03*
X1086300Y504800D03*
X1088000Y212700D03*
X1088100Y68500D03*
X1094900Y1334600D03*
X1095100Y1315400D03*
X1097200Y501800D03*
X1113100Y795700D03*
X1114500Y130700D03*
X1123200Y808600D03*
X1126600Y55000D03*
X1126700Y40000D03*
X1133600Y460200D03*
X1136200Y813900D03*
X1146600Y460200D03*
Y795700D03*
X1149200Y751400D03*
X1149600Y814200D03*
X1154400Y787800D03*
Y917800D03*
X1155200Y468300D03*
X1162200Y798200D03*
X1162600Y468100D03*
Y883000D03*
X1164800Y832000D03*
Y891800D03*
X1170000Y933500D03*
X1175200Y790400D03*
Y951700D03*
X1177800Y941300D03*
Y1349400D03*
X1180400Y821500D03*
Y1310400D03*
X1186400Y789100D03*
X1193400Y915200D03*
X1203100Y910300D03*
X1206400Y460200D03*
X1209000Y881400D03*
Y915200D03*
X1211600Y899600D03*
X1220300Y468300D03*
X1222000Y1339000D03*
X1222500Y961200D03*
X1230800Y468300D03*
X1245400Y1047800D03*
X1246700Y497500D03*
X1254200Y350900D03*
X1255800Y1315600D03*
X1261900Y351200D03*
X1266200Y894400D03*
Y902200D03*
Y975000D03*
X1271000Y601400D03*
X1274000Y1102400D03*
X1276600Y979000D03*
Y1112800D03*
X1279200Y1071200D03*
X1284400Y1089400D03*
Y1157000D03*
X1289600Y1076400D03*
X1291800Y991600D03*
X1294800Y1154400D03*
X1298200Y1204800D03*
X1300000Y1167400D03*
Y1193400D03*
X1300800Y1214900D03*
Y1227000D03*
X1305900Y1306600D03*
Y1313200D03*
X1323400Y1320800D03*
X1324200Y1138600D03*
X1324400Y1183700D03*
X1326000Y1076400D03*
Y1084200D03*
Y1154400D03*
X1328600Y923000D03*
Y956800D03*
X1329100Y1296500D03*
X1331200Y1141400D03*
X1335300Y871700D03*
X1336400Y1250600D03*
X1336500Y1296700D03*
X1339000Y962000D03*
X1344600Y1291500D03*
X1348000Y286500D03*
X1349400Y959400D03*
X1354600Y280800D03*
X1356200Y537100D03*
X1359200Y959900D03*
X1361400Y286600D03*
X1364400Y745600D03*
X1365800Y922200D03*
X1368600Y277400D03*
X1371000Y745600D03*
X1374700Y1477100D03*
X1379500Y1472300D03*
X1382100Y744900D03*
X1385800Y1177800D03*
X1388400Y1107600D03*
X1388700Y744900D03*
X1399500Y753300D03*
X1403800Y922200D03*
X1406100Y753300D03*
X1411200Y987100D03*
X1414100Y922700D03*
X1419600Y980200D03*
X1424800Y985400D03*
Y1029600D03*
X1427400Y923000D03*
X1430000Y764400D03*
X1434200Y759100D03*
X1437800Y1050400D03*
Y1385800D03*
X1439900Y1266200D03*
Y1308800D03*
X1441000Y1411600D03*
X1448200Y1047800D03*
Y1388400D03*
X1458600Y969800D03*
X1459500Y102000D03*
X1464800Y1334900D03*
X1469000Y943800D03*
X1482000Y941200D03*
Y1297400D03*
X1492400Y1372800D03*
X1499300Y1367900D03*
X1502500Y815300D03*
X1508000Y842400D03*
X1510600Y1141400D03*
X1515000Y841900D03*
X1518400Y897000D03*
X1518800Y943400D03*
X1522400Y842300D03*
X1524100Y1193800D03*
X1524900Y1219800D03*
X1528800Y1045200D03*
X1531800Y1101500D03*
X1534800Y921700D03*
X1535200Y1219800D03*
X1535700Y841300D03*
X1538400Y997600D03*
X1542500Y943700D03*
X1544900Y1219800D03*
X1559700Y969000D03*
X1560000Y922900D03*
X1562500Y941300D03*
X1562600Y988000D03*
Y1211600D03*
X1570400Y1219400D03*
X1572000Y1012500D03*
X1574750Y322550D03*
X1583400Y962000D03*
X1586000Y1027000D03*
X1586200Y843900D03*
X1593900Y842400D03*
X1595900Y405700D03*
X1599000Y985400D03*
X1601600Y1055600D03*
Y1222000D03*
X1601800Y1174200D03*
X1602700Y1041300D03*
X1628640Y1113100D03*
Y1151200D03*
X1638000Y881400D03*
Y1227200D03*
X1639000Y1124300D03*
X1645000Y785600D03*
X1647700Y867700D03*
X1677100Y1229000D03*
X1687000Y481800D03*
X1699300Y352100D03*
X1708200Y962000D03*
X1714200Y1056200D03*
X1732900Y1393300D03*
X1742000Y1105000D03*
X1747200Y1073800D03*
X1747300Y1094900D03*
X1749700Y1067400D03*
X1752400Y1209000D03*
X1757600Y1196000D03*
X1761400Y941200D03*
X1761800Y1242700D03*
X1762500Y1030900D03*
X1762800Y1201200D03*
X1773000Y1236700D03*
X1773200Y1448200D03*
X1774800Y1245300D03*
X1775800Y1094600D03*
Y1102400D03*
Y1201200D03*
X1780200Y1072500D03*
X1787000Y1059400D03*
X1795100Y1186800D03*
X1799200Y808600D03*
X1800500Y980600D03*
X1801800Y1032200D03*
X1807000Y1125800D03*
X1813000Y980600D03*
X1814800Y1196000D03*
X1820000Y972400D03*
X1822600Y1326000D03*
X1825500Y980600D03*
X1829600Y856700D03*
X1829900Y1163300D03*
X1833000Y972400D03*
X1833200Y1186800D03*
X1833900Y1152300D03*
X1841100Y1110500D03*
X1843400Y1032200D03*
X1845400Y1072500D03*
X1846000Y975000D03*
Y1125800D03*
X1846500Y1372500D03*
X1849900Y1163300D03*
X1853300Y1372500D03*
X1853800Y975000D03*
X1861600Y1188200D03*
X1862900Y934000D03*
X1887600Y1032200D03*
Y1040000D03*
X1889400Y1188200D03*
X1890000Y1163100D03*
X1890200Y980200D03*
X1895200Y370000D03*
X1895400Y385000D03*
X1900600Y1003600D03*
X1900800Y1129100D03*
X1905800Y1045200D03*
Y1144000D03*
X1906400Y321300D03*
X1910600Y614000D03*
X1913200Y321300D03*
X1924000Y1006200D03*
X1929200Y1146600D03*
X1944800Y1344200D03*
X1954900Y1293200D03*
X1955200Y917800D03*
X1960400Y1006200D03*
Y1034800D03*
X1960600Y1142500D03*
X1965600Y975000D03*
X1970800Y1172600D03*
X1976000Y1198200D03*
X1978600Y1019200D03*
X1982800Y1327000D03*
X1983800Y1292200D03*
X1998500Y1054900D03*
X1999400Y1294800D03*
X2009000Y1176900D03*
X2015000Y1271400D03*
X2022800Y943800D03*
X2184000Y1331000D03*
X2210000Y1068600D03*
X2277400Y1362600D03*
X2280200Y1415000D03*
X2301900Y1319200D03*
X2310700Y1359800D03*
X2335200Y1424900D03*
X2340500Y1352500D03*
X2347500Y1433800D03*
X2353600Y1366700D03*
X2522800Y1136900D03*
X2523300Y1149500D03*
X2574000Y1063400D03*
X2584400Y1076000D03*
X2592200Y1076400D03*
X2729000Y1057700D03*
X2729100Y1252000D03*
X2737800Y1245400D03*
G54D15*
X1022500Y1220000D03*
X1030500Y1244000D03*
X1038500Y1132000D03*
Y1148000D03*
Y1268000D03*
X1046500Y1068000D03*
Y1092000D03*
Y1132000D03*
Y1188000D03*
Y1204000D03*
X1054500Y1092000D03*
Y1108000D03*
X1062500Y1124000D03*
Y1196000D03*
Y1212000D03*
Y1228000D03*
X1070500Y1148000D03*
Y1204000D03*
Y1220000D03*
Y1236000D03*
Y1252000D03*
X1078500Y1196000D03*
Y1212000D03*
Y1220000D03*
Y1252000D03*
Y1260000D03*
Y1268000D03*
X1094500Y1252000D03*
Y1260000D03*
Y1268000D03*
X1102500Y1252000D03*
X1150500Y1100000D03*
Y1108000D03*
Y1124000D03*
Y1228000D03*
Y1292000D03*
Y1300000D03*
X1158500Y1084000D03*
Y1100000D03*
Y1108000D03*
Y1116000D03*
X1166500Y1076000D03*
Y1084000D03*
X1182500Y1092000D03*
Y1100000D03*
X1190500Y1084000D03*
X1214500Y1284000D03*
X1222500Y1124000D03*
Y1156000D03*
Y1188000D03*
Y1196000D03*
Y1236000D03*
Y1252000D03*
X1230500Y1140000D03*
Y1156000D03*
Y1164000D03*
Y1172000D03*
Y1252000D03*
X1238500Y1076000D03*
Y1116000D03*
Y1196000D03*
Y1244000D03*
X1246500Y1060000D03*
Y1084000D03*
Y1116000D03*
Y1124000D03*
Y1132000D03*
Y1172000D03*
Y1244000D03*
Y1260000D03*
Y1276000D03*
X1254500Y1084000D03*
Y1100000D03*
Y1108000D03*
Y1124000D03*
Y1148000D03*
Y1156000D03*
Y1188000D03*
X1262500Y1124000D03*
Y1132000D03*
G54D16*
X2005000Y1010000D03*
G04 LATO COMPONENTI*
M02*
