[2021.05.25 15:23:41] [0000m.00s.011ms] [0] WELCOME
[2021.05.25 15:23:41] [0000m.00s.012ms] [1] iCDB Server ver.2.207, olbaZynB9GXMryBlrkMTsg, build:17860529 created 2021-01-16 07:22:02, sources stamp:olbaZynB9GXMryBlrkMTsg
[2021.05.25 15:23:41] [0000m.00s.012ms] [1] Restricted Copyright Siemens 2020. All Rights Reserved.
[2021.05.25 15:23:41] [0000m.00s.012ms] [1] Base flow version [VX.2.7]
[2021.05.25 15:23:41] [0000m.00s.012ms] [1] Install Id [2125238], Flow Id [PADS Professional VX.2.7], Full Flow Name [PADS Pro Tools VX.2.7], Exact Access Date [2020/02/01]
[2021.05.25 15:23:41] [0000m.00s.012ms] [1] UPDATE Install Info, Install Id [2310352], UPDATE Name [PADS Pro Tools VX.2.7 - Update 12]
[2021.05.25 15:23:41] [0000m.00s.016ms] [1] Machine [DESKTOP-CUVV7JD]  IP [127.0.0.1,192.168.1.64]  User [Shina]  PID [11676]
[2021.05.25 15:23:41] [0000m.00s.017ms] [1] Operating system [Microsoft Windows 10 Business Edition, 64-bit (build 19041)]
[2021.05.25 15:23:41] [0000m.00s.017ms] [1] Current working dir [D:\Pd-Master\Mas\Mas100n1 ACB_0001_0]
[2021.05.25 15:23:41] [0000m.00s.017ms] [1] PATH [C:\MentorGraphics64\PADSProVX.2.7\SDD_HOME\common\win64\bin;C:\MentorGraphics64\PADSProVX.2.7\SDD_HOME\common\win64\lib;C:\MentorGraphics64\PADSProVX.2.7\SDD_HOME\common\win64\jre\default\bin;C:\MentorGraphics64\PADSProVX.2.7\SDD_HOME\common\win32\lib;C:\MentorGraphics64\PADSProVX.2.7\MGC_HOME.ixw\bin;C:\MentorGraphics64\PADSProVX.2.7\MGC_HOME.ixw\lib;C:\MentorGraphics64\PADSProVX.2.7\SDD_HOME\wg\win64\lib;%MGC_HOME%\bin;C:\Program Files (x86)\NVIDIA Corporation\PhysX\Common;C:\Windows\system32;C:\Windows\System32\Wbem;C:\Windows\System32\WindowsPowerShell\v1.0\;C:\Windows\System32\OpenSSH\;C:\Cadence\SPB_16.6\tools\pcb\bin;C:\Cadence\SPB_16.6\tools\bin;C:\Cadence\SPB_16.6\tools\libutil\bin;C:\Cadence\SPB_16.6\tools\fet\bin;C:\Cadence\SPB_16.6\tools\specctra\bin;C:\Cadence\SPB_16.6\tools\pspice;C:\Cadence\SPB_16.6\tools\capture;C:\Cadence\SPB_16.6\openaccess\bin\win32\opt;C:\Program Files\Microsoft SQL Server\120\Tools\Binn\;C:\Program Files\Microsoft SQL Server\Client SDK\ODBC\110\Tools\Binn\;C:\Program Files (x86)\Microsoft SQL Server\120\Tools\Binn\;C:\Program Files\Microsoft SQL Server\120\DTS\Binn\;C:\Program Files (x86)\Windows Kits\8.1\Windows Performance Toolkit\;C:\Program Files (x86)\PuTTY\;C:\Program Files\Microsoft SQL Server\110\Tools\Binn\;C:\Windows;C:\Users\Shina\AppData\Local\Microsoft\WindowsApps;C:\MentorGraphics\7.9.5EE\SDD_HOME\common\win32\lib;C:\Program Files (x86)\interCAD;C:\MentorGraphics64\PADSProVX.2.7\SDD_HOME\common3D\win64\lib]
[2021.05.25 15:23:41] [0000m.00s.017ms] [1] SDD_HOME [C:\MentorGraphics64\PADSProVX.2.7\SDD_HOME] on file system [NTFS]
[2021.05.25 15:23:41] [0000m.00s.017ms] [1] SDD_PLATFORM [win64]
[2021.05.25 15:23:41] [0000m.00s.017ms] [1] WDIR [C:\WDIR\PADSProVX.2.7;C:\MentorGraphics64\PADSProVX.2.7\SDD_HOME\standard;]
[2021.05.25 15:23:41] [0000m.00s.017ms] [1] Local iCDB working dir [C:\WDIR\PADSProVX.2.7\iCDB] on file system [NTFS]
[2021.05.25 15:23:41] [0000m.00s.017ms] [1] S: Config file name [ServerWG.cfg]
[2021.05.25 15:23:41] [0000m.00s.017ms] [2] S: Loading config files
[2021.05.25 15:23:41] [0000m.00s.019ms] [1] Config file [D:\Pd-Master\Mas\Mas100n1 ACB_0001_0\keyin.icdb\cdbsvr\ServerWG.cfg] not found
[2021.05.25 15:23:41] [0000m.00s.019ms] [1] Config: Non-default value [System.SingleUserMode] = [no]
[2021.05.25 15:23:41] [0000m.00s.019ms] [3] S: Config loaded
[2021.05.25 15:23:41] [0000m.00s.024ms] [0] S: Project path [D:\Pd-Master\Mas\Mas100n1 ACB_0001_0\keyin.icdb] on file system [NTFS]
[2021.05.25 15:23:41] [0000m.00s.024ms] [0] S: Project file (.prj) path [D:\Pd-Master\Mas\Mas100n1 ACB_0001_0\Mas100n1 ACUBE_PORTABILE R_0.prj] on file system [NTFS]
[2021.05.25 15:23:41] [0000m.00s.024ms] [1] S: WARNING: Database auto-repair support DISABLED
[2021.05.25 15:23:41] [0000m.00s.024ms] [0] S: Multi-user mode (config)
[2021.05.25 15:23:41] [0000m.00s.024ms] [0] S: Event polling mode autodetection
[2021.05.25 15:23:41] [0000m.00s.025ms] [0] S: Started up automatically by iCDB Client: DESKTOP-CUVV7JD:Shina:11332
[2021.05.25 15:23:41] [0000m.00s.025ms] [0] S: Auto close mode
[2021.05.25 15:23:41] [0000m.00s.025ms] [0] S: Database ID [07c1-1924-1568-c6b8-97bb-150f-7bb1-5060-f173-9423-dedf-cf98]
[2021.05.25 15:23:41] [0000m.00s.025ms] [0] PathTranslator: BEGIN dumping
[2021.05.25 15:23:41] [0000m.00s.025ms] [0] PathTranslator: Local -> global path prefix list
[2021.05.25 15:23:41] [0000m.00s.025ms] [0] PathTranslator: [HP Universal Printing PCL 6,LocalsplOnly] -> [\\DESKTOP-CUVV7JD\HP Universal Printing PCL 6]
[2021.05.25 15:23:41] [0000m.00s.025ms] [0] PathTranslator: [C:\Windows\system32\spool\drivers] -> [\\DESKTOP-CUVV7JD\print$]
[2021.05.25 15:23:41] [0000m.00s.025ms] [0] PathTranslator: [G:\] -> [\\qnap-ts420\Librerie\]
[2021.05.25 15:23:41] [0000m.00s.025ms] [0] PathTranslator: [H:\] -> [\\qnap-ts420\Commesse\]
[2021.05.25 15:23:41] [0000m.00s.025ms] [0] PathTranslator: [Z:\] -> [\\qnap-ts420\Software\]
[2021.05.25 15:23:41] [0000m.00s.025ms] [0] PathTranslator: Global -> local path prefix list
[2021.05.25 15:23:41] [0000m.00s.025ms] [0] PathTranslator: [\\DESKTOP-CUVV7JD\HP Universal Printing PCL 6] -> [HP Universal Printing PCL 6,LocalsplOnly]
[2021.05.25 15:23:41] [0000m.00s.025ms] [0] PathTranslator: [\\DESKTOP-CUVV7JD\print$] -> [C:\Windows\system32\spool\drivers]
[2021.05.25 15:23:41] [0000m.00s.025ms] [0] PathTranslator: [\\qnap-ts420\Librerie\] -> [G:\]
[2021.05.25 15:23:41] [0000m.00s.025ms] [0] PathTranslator: [\\qnap-ts420\Commesse\] -> [H:\]
[2021.05.25 15:23:41] [0000m.00s.025ms] [0] PathTranslator: [\\qnap-ts420\Software\] -> [Z:\]
[2021.05.25 15:23:41] [0000m.00s.025ms] [0] PathTranslator: END dumping
[2021.05.25 15:23:41] [0000m.00s.025ms] [0] S: START
[2021.05.25 15:23:41] [0000m.00s.025ms] [0] S: Server startup lock file created
[2021.05.25 15:23:41] [0000m.00s.025ms] [0] S: Listening for client connections on port [10003]
[2021.05.25 15:23:41] [0000m.00s.026ms] [0] S: Server network ID [DESKTOP-CUVV7JD:192.168.1.64,DESKTOP-CUVV7JD:10003]
[2021.05.25 15:23:41] [0000m.00s.026ms] [0] S: Server GUID [3fd2-8375-61ae-f44d-d5af-ca03-6afc-a060-3339-9423-dedf-cf98]
[2021.05.25 15:23:41] [0000m.00s.026ms] [0] S: Project GUID [07c1-1924-1568-c6b8-97bb-150f-7bb1-5060-f173-9423-dedf-cf98]
[2021.05.25 15:23:41] [0000m.00s.027ms] [0] S: Wrote data to server address file
[2021.05.25 15:23:41] [0000m.00s.027ms] [0] S: Server startup lock file removed
[2021.05.25 15:23:41] [0000m.00s.027ms] [1] ProjectBackupManager: Setting project file (.prj) path: [D:\Pd-Master\Mas\Mas100n1 ACB_0001_0\Mas100n1 ACUBE_PORTABILE R_0.prj]
[2021.05.25 15:23:41] [0000m.00s.167ms] [0] S: Plugins loaded: [PIM] [ENetGen70] 
[2021.05.25 15:23:41] [0000m.00s.167ms] [1] ServerToolkit: INFO: Plugin not found in SDD_ICDB_BIN [C:\MentorGraphics64\PADSProVX.2.7\SDD_HOME\iCDB\win64\bin]
[2021.05.25 15:23:41] [0000m.00s.167ms] [1] ServerToolkit: INFO: Plugin not found in SDD_COMMON_BIN [C:\MentorGraphics64\PADSProVX.2.7\SDD_HOME\common\win64\bin]
[2021.05.25 15:23:41] [0000m.00s.168ms] [1] ServerToolkit: INFO: Plugin not found in PATH
[2021.05.25 15:23:41] [0000m.00s.168ms] [1] ServerToolkit: INFO: Plugin not found in CWD
[2021.05.25 15:23:41] [0000m.00s.168ms] [1] ServerToolkit: INFO: returning just plugin exe name!
[2021.05.25 15:23:41] [0000m.00s.168ms] [0] S: Local disc access time: 21 us
[2021.05.25 15:23:41] [0000m.00s.168ms] [0] S: File server access time: 53 us
[2021.05.25 15:23:41] [0000m.00s.180ms] [0] Single file [D:\Pd-Master\Mas\Mas100n1 ACB_0001_0\keyin.icdb\icdb.dat] size [161200 (157.4 kB)]
[2021.05.25 15:23:41] [0000m.00s.181ms] [1] Single file [D:\Pd-Master\Mas\Mas100n1 ACB_0001_0\keyin.icdb\icdb.dat] opened in read-write mode
[2021.05.25 15:23:41] [0000m.00s.181ms] [0] SingleFile: [0000-0000-0000-0000] SFI header version check [1009] [1009]
[2021.05.25 15:23:41] [0000m.00s.181ms] [0] Database GUARD OK: [161200]
[2021.05.25 15:23:41] [0000m.00s.181ms] [0] SingleFile: [0000-0000-0000-0000] SFI header version check [1009] [1009]
[2021.05.25 15:23:41] [0000m.00s.181ms] [0] Database GUARD OK: [161200]
[2021.05.25 15:23:41] [0000m.00s.181ms] [0] SingleFile: [0000-0000-0000-0000] SFI header version check [1009] [1009]
[2021.05.25 15:23:41] [0000m.00s.181ms] [0] Database GUARD OK: [161200]
[2021.05.25 15:23:41] [0000m.00s.182ms] [0] SingleFile: [0000-0000-0000-0000] SFI header version check [1009] [1009]
[2021.05.25 15:23:41] [0000m.00s.182ms] [0] Database GUARD OK: [161200]
[2021.05.25 15:23:41] [0000m.00s.182ms] [0] SingleFile: [0000-0000-0000-0000] SFI header version check [1009] [1009]
[2021.05.25 15:23:41] [0000m.00s.182ms] [0] Database GUARD OK: [161200]
[2021.05.25 15:23:41] [0000m.00s.182ms] [0] SingleFile: [80f0-c256-6ff9-e6b1] SFI version check [1009] [1009]
[2021.05.25 15:23:41] [0000m.00s.182ms] [0] SingleFile: [80f0-c256-6ff9-e6b1] Database SFI header has been read in [713us]
[2021.05.25 15:23:41] [0000m.00s.185ms] [0] iCDB Server PI: Server & plugin session [1326]
[2021.05.25 15:23:41] [0000m.00s.185ms] [0] iCDB Server PI: Opening database [D:\Pd-Master\Mas\Mas100n1 ACB_0001_0\keyin.icdb]
[2021.05.25 15:23:41] [0000m.00s.185ms] [0] iCDB Server PI: Database [D:\Pd-Master\Mas\Mas100n1 ACB_0001_0\keyin.icdb] opened
[2021.05.25 15:23:42] [0000m.00s.201ms] [0] iCDB Database: Checking existence of constraint definitions
[2021.05.25 15:23:42] [0000m.00s.201ms] [0] iCDB Database: Checking constraint definitions version
[2021.05.25 15:23:42] [0000m.00s.217ms] [1] iCDB Database: Constraint definitions version [ce_ee.cns=7.10.69] up to date
[2021.05.25 15:23:42] [0000m.00s.220ms] [0] iCDB Server PI: Initializing plugins
[2021.05.25 15:23:42] [0000m.00s.220ms] [0] iCDB Server PI: Plugins initialized
[2021.05.25 15:23:42] [0000m.00s.220ms] [0] S: iCDB database loaded
[2021.05.25 15:23:42] [0000m.00s.221ms] [0] S: Starting threads
[2021.05.25 15:23:42] [0000m.00s.221ms] [0] BT: Listening for broadcast messages on port [10000]
[2021.05.25 15:23:42] [0000m.00s.221ms] [1] CMT: There are no clients - waiting [10 seconds]
[2021.05.25 15:23:42] [0000m.00s.222ms] [0] IT: Session [1327] for host [DESKTOP-CUVV7JD] user [Shina] client type[0] clsvrPluginID[0] with process ID [11332] created
[2021.05.25 15:23:42] [0000m.00s.224ms] [1] SC[1327]: Registered sub-client [Expedition PE_635365562] with ID [1] for session ID [1327] host [DESKTOP-CUVV7JD] user [Shina] process ID [11332]
[2021.05.25 15:23:42] [0000m.00s.225ms] [0] MWT: WindowProc: WM_NCCREATE
[2021.05.25 15:23:42] [0000m.00s.229ms] [0] IT: iCDB Server Monitor session [1] for host [DESKTOP-CUVV7JD] user [Shina] with process ID [23560] created
[2021.05.25 15:23:42] [0000m.00s.229ms] [1] DMT: There are [1] iCDB Server Monitor connected now
[2021.05.25 15:23:42] [0000m.00s.261ms] [1] SC[1327]: Registered sub-client [EEVM_EEVM_398745520] with ID [2] for session ID [1327] host [DESKTOP-CUVV7JD] user [Shina] process ID [11332]
[2021.05.25 15:23:42] [0000m.00s.262ms] [1] SC[1327]: UnRegistered sub-client [EEVM_EEVM_398745520] with ID [2] for session ID [1327] host [DESKTOP-CUVV7JD] user [Shina] process ID [11332]
[2021.05.25 15:23:42] [0000m.00s.336ms] [1] CMT: There are [1] clients now: 1327
[2021.05.25 15:23:43] [0000m.01s.851ms] [1] SC[1327]: Registered sub-client [JobPrefsDBPI_635367500] with ID [3] for session ID [1327] host [DESKTOP-CUVV7JD] user [Shina] process ID [11332]
[2021.05.25 15:23:43] [0000m.01s.856ms] [1] SC[1327]: UnRegistered sub-client [JobPrefsDBPI_635367500] with ID [3] for session ID [1327] host [DESKTOP-CUVV7JD] user [Shina] process ID [11332]
[2021.05.25 15:23:45] [0000m.04s.029ms] [1] SC[1327]: Registered sub-client [JobPrefsDBPI_635369687] with ID [4] for session ID [1327] host [DESKTOP-CUVV7JD] user [Shina] process ID [11332]
[2021.05.25 15:23:45] [0000m.04s.031ms] [1] SC[1327]: UnRegistered sub-client [JobPrefsDBPI_635369687] with ID [4] for session ID [1327] host [DESKTOP-CUVV7JD] user [Shina] process ID [11332]
[2021.05.25 15:23:51] [0000m.09s.977ms] [1] PrjBackupMgr: Successfully created Project Backup [D:\Pd-Master\Mas\Mas100n1 ACB_0001_0\ProjectBackup\backups\2021-05-25 15.23.42 - auto.zip] with GUID [2274-1afb-554d-4a54-e5af-ca04-6afc-a060-b356-9423-dedf-cf98]
[2021.05.25 15:23:51] [0000m.09s.977ms] [0] PrjBackupMgr: Removing excessive backup:  BackupGUID[b24f-7e3c-aa9c-004f-eea1-d904-fa1d-9060-7c96-9423-dedf-cf98] CreationTime[Thursday, May 13, 2021 12:26:22] Type[Autosave] Creator[iCDB Server (2021-05-13 10.26.22-2384)] ApplicationName[iCDB Server (2021-05-13 10.26.22-2384)] UserName[Shina] MachineName[DESKTOP-CUVV7JD] Description[Autosave] FullFlowName[PADS Pro Tools VX.2.7; PADS Pro Tools VX.2.7 - Update 12] FlowId[PADSProVX.2.7] GBSInstallId[2125238; 2310352] GBSBuildId[17860529] IcdbVersion[3800] ReferenceLogFilePath[] BackupFilePath[D:\Pd-Master\Mas\Mas100n1 ACB_0001_0\ProjectBackup\backups\2021-05-13 14.26.22 - auto.zip] BackupFileSize[116733516] Persistent[FALSE]
[2021.05.25 15:23:51] [0000m.09s.977ms] [0] PrjBackupMgr: Project Backup file [D:\Pd-Master\Mas\Mas100n1 ACB_0001_0\ProjectBackup\backups\2021-05-13 14.26.22 - auto.zip] with GUID [b24f-7e3c-aa9c-004f-eea1-d904-fa1d-9060-7c96-9423-dedf-cf98] removed
[2021.05.25 15:23:51] [0000m.09s.978ms] [0] PrjBackupEngine: Successfully created backup:  BackupGUID[2274-1afb-554d-4a54-e5af-ca04-6afc-a060-b356-9423-dedf-cf98] CreationTime[Tuesday, May 25, 2021 13:23:42] Type[Autosave] Creator[iCDB Server (2021-05-25 15.23.41-11676)] ApplicationName[iCDB Server (2021-05-25 15.23.41-11676)] UserName[Shina] MachineName[DESKTOP-CUVV7JD] Description[Autosave] FullFlowName[PADS Pro Tools VX.2.7; PADS Pro Tools VX.2.7 - Update 12] FlowId[PADSProVX.2.7] GBSInstallId[2125238; 2310352] GBSBuildId[17860529] IcdbVersion[3800] ReferenceLogFilePath[] BackupFilePath[D:\Pd-Master\Mas\Mas100n1 ACB_0001_0\ProjectBackup\backups\2021-05-25 15.23.42 - auto.zip] BackupFileSize[115529916] Persistent[FALSE]
[2021.05.25 15:23:57] [0000m.15s.835ms] [1] SC[1327]: Registered sub-client [JobPrefsDBPI_635381484] with ID [5] for session ID [1327] host [DESKTOP-CUVV7JD] user [Shina] process ID [11332]
[2021.05.25 15:23:57] [0000m.15s.849ms] [1] SC[1327]: UnRegistered sub-client [JobPrefsDBPI_635381484] with ID [5] for session ID [1327] host [DESKTOP-CUVV7JD] user [Shina] process ID [11332]
[2021.05.25 15:23:57] [0000m.16s.030ms] [1] SC[1327]: Registered sub-client [JobPrefsDBPI_635381687] with ID [6] for session ID [1327] host [DESKTOP-CUVV7JD] user [Shina] process ID [11332]
[2021.05.25 15:23:57] [0000m.16s.044ms] [1] SC[1327]: UnRegistered sub-client [JobPrefsDBPI_635381687] with ID [6] for session ID [1327] host [DESKTOP-CUVV7JD] user [Shina] process ID [11332]
[2021.05.25 15:23:58] [0000m.16s.283ms] [1] SC[1327]: Registered sub-client [ExpeditionCrossProber] with ID [7] for session ID [1327] host [DESKTOP-CUVV7JD] user [Shina] process ID [11332]
[2021.05.25 15:23:58] [0000m.16s.285ms] [1] SC[1327]: Registered sub-client [StartServerClient2abc] with ID [8] for session ID [1327] host [DESKTOP-CUVV7JD] user [Shina] process ID [11332]
[2021.05.25 15:23:58] [0000m.16s.286ms] [1] SC[1327]: UnRegistered sub-client [StartServerClient2abc] with ID [8] for session ID [1327] host [DESKTOP-CUVV7JD] user [Shina] process ID [11332]
[2021.05.25 15:24:11] [0000m.29s.507ms] [0] DFAMT: File server access time: 97 us
[2021.05.25 16:27:35] [0063m.53s.217ms] [1] SC[1327]: Registered sub-client [JobPrefsDBPI_639198875] with ID [9] for session ID [1327] host [DESKTOP-CUVV7JD] user [Shina] process ID [11332]
[2021.05.25 16:27:38] [0063m.56s.287ms] [1] SC[1327]: UnRegistered sub-client [JobPrefsDBPI_639198875] with ID [9] for session ID [1327] host [DESKTOP-CUVV7JD] user [Shina] process ID [11332]
[2021.05.25 16:47:03] [0083m.22s.048ms] [1] SC[1327]: Registered sub-client [JobPrefsDBPI_640367703] with ID [10] for session ID [1327] host [DESKTOP-CUVV7JD] user [Shina] process ID [11332]
[2021.05.25 16:47:03] [0083m.22s.051ms] [1] SC[1327]: UnRegistered sub-client [JobPrefsDBPI_640367703] with ID [10] for session ID [1327] host [DESKTOP-CUVV7JD] user [Shina] process ID [11332]
[2021.05.25 16:47:03] [0083m.22s.135ms] [1] SC[1327]: Registered sub-client [NetClassDBPI_640367781] with ID [11] for session ID [1327] host [DESKTOP-CUVV7JD] user [Shina] process ID [11332]
[2021.05.25 16:47:03] [0083m.22s.144ms] [1] SC[1327]: UnRegistered sub-client [NetClassDBPI_640367781] with ID [11] for session ID [1327] host [DESKTOP-CUVV7JD] user [Shina] process ID [11332]
[2021.05.25 16:47:03] [0083m.22s.147ms] [1] SC[1327]: Registered sub-client [JobPrefsDBPI_640367796] with ID [12] for session ID [1327] host [DESKTOP-CUVV7JD] user [Shina] process ID [11332]
[2021.05.25 16:47:03] [0083m.22s.150ms] [1] SC[1327]: UnRegistered sub-client [JobPrefsDBPI_640367796] with ID [12] for session ID [1327] host [DESKTOP-CUVV7JD] user [Shina] process ID [11332]
[2021.05.25 16:47:06] [0083m.24s.511ms] [1] SC[1327]: Registered sub-client [JobPrefsDBPI_640370156] with ID [13] for session ID [1327] host [DESKTOP-CUVV7JD] user [Shina] process ID [11332]
[2021.05.25 16:47:06] [0083m.24s.558ms] [1] SC[1327]: UnRegistered sub-client [JobPrefsDBPI_640370156] with ID [13] for session ID [1327] host [DESKTOP-CUVV7JD] user [Shina] process ID [11332]
[2021.05.25 16:47:06] [0083m.24s.696ms] [0] IT: Session [1328] for host [DESKTOP-CUVV7JD] user [Shina] client type[0] clsvrPluginID[0] with process ID [12708] created
[2021.05.25 16:47:06] [0083m.24s.696ms] [1] SC[1328]: Registered sub-client [JobPrefsDBPI_640370312] with ID [1] for session ID [1328] host [DESKTOP-CUVV7JD] user [Shina] process ID [12708]
[2021.05.25 16:47:06] [0083m.24s.700ms] [0] IT: Session [1329] for host [DESKTOP-CUVV7JD] user [Shina] client type[0] clsvrPluginID[0] with process ID [21172] created
[2021.05.25 16:47:06] [0083m.24s.701ms] [1] SC[1329]: Registered sub-client [JobPrefsDBPI_640370312] with ID [1] for session ID [1329] host [DESKTOP-CUVV7JD] user [Shina] process ID [21172]
[2021.05.25 16:47:06] [0083m.24s.708ms] [1] CMT: There are [3] clients now: 1327, 1328, 1329
[2021.05.25 16:47:06] [0083m.24s.745ms] [1] SC[1328]: Registered sub-client [JobPrefsDBPI_640370390] with ID [2] for session ID [1328] host [DESKTOP-CUVV7JD] user [Shina] process ID [12708]
[2021.05.25 16:47:06] [0083m.24s.750ms] [1] SC[1329]: Registered sub-client [JobPrefsDBPI_640370406] with ID [2] for session ID [1329] host [DESKTOP-CUVV7JD] user [Shina] process ID [21172]
[2021.05.25 16:47:06] [0083m.24s.752ms] [1] SC[1328]: Registered sub-client [NetClassDBPI_640370406] with ID [3] for session ID [1328] host [DESKTOP-CUVV7JD] user [Shina] process ID [12708]
[2021.05.25 16:47:06] [0083m.24s.757ms] [1] SC[1329]: Registered sub-client [NetClassDBPI_640370406] with ID [3] for session ID [1329] host [DESKTOP-CUVV7JD] user [Shina] process ID [21172]
[2021.05.25 16:47:06] [0083m.24s.782ms] [0] IT: Session [1330] for host [DESKTOP-CUVV7JD] user [Shina] client type[0] clsvrPluginID[0] with process ID [23460] created
[2021.05.25 16:47:06] [0083m.24s.782ms] [1] SC[1330]: Registered sub-client [JobPrefsDBPI_640370390] with ID [1] for session ID [1330] host [DESKTOP-CUVV7JD] user [Shina] process ID [23460]
[2021.05.25 16:47:06] [0083m.24s.800ms] [1] SC[1330]: Registered sub-client [NetClassDBPI_640370453] with ID [2] for session ID [1330] host [DESKTOP-CUVV7JD] user [Shina] process ID [23460]
[2021.05.25 16:47:06] [0083m.24s.817ms] [1] CMT: There are [4] clients now: 1327, 1328, 1329, 1330
[2021.05.25 16:47:06] [0083m.24s.842ms] [1] SC[1330]: Registered sub-client [JobPrefsDBPI_640370500] with ID [3] for session ID [1330] host [DESKTOP-CUVV7JD] user [Shina] process ID [23460]
[2021.05.25 16:47:06] [0083m.24s.950ms] [1] SC[1329]: UnRegistered sub-client [JobPrefsDBPI_640370406] with ID [2] for session ID [1329] host [DESKTOP-CUVV7JD] user [Shina] process ID [21172]
[2021.05.25 16:47:06] [0083m.24s.950ms] [1] SC[1329]: UnRegistered sub-client [JobPrefsDBPI_640370312] with ID [1] for session ID [1329] host [DESKTOP-CUVV7JD] user [Shina] process ID [21172]
[2021.05.25 16:47:06] [0083m.24s.953ms] [1] SC[1329]: UnRegistered sub-client [NetClassDBPI_640370406] with ID [3] for session ID [1329] host [DESKTOP-CUVV7JD] user [Shina] process ID [21172]
[2021.05.25 16:47:06] [0083m.25s.034ms] [1] CMT: Removed client [1329]
[2021.05.25 16:47:06] [0083m.25s.034ms] [1] CMT: There are [3] clients now: 1327, 1328, 1330
[2021.05.25 16:47:06] [0083m.25s.130ms] [1] SC[1328]: UnRegistered sub-client [JobPrefsDBPI_640370390] with ID [2] for session ID [1328] host [DESKTOP-CUVV7JD] user [Shina] process ID [12708]
[2021.05.25 16:47:06] [0083m.25s.131ms] [1] SC[1328]: UnRegistered sub-client [JobPrefsDBPI_640370312] with ID [1] for session ID [1328] host [DESKTOP-CUVV7JD] user [Shina] process ID [12708]
[2021.05.25 16:47:06] [0083m.25s.134ms] [1] SC[1328]: UnRegistered sub-client [NetClassDBPI_640370406] with ID [3] for session ID [1328] host [DESKTOP-CUVV7JD] user [Shina] process ID [12708]
[2021.05.25 16:47:06] [0083m.25s.143ms] [1] CMT: Removed client [1328]
[2021.05.25 16:47:06] [0083m.25s.143ms] [1] CMT: There are [2] clients now: 1327, 1330
[2021.05.25 16:47:07] [0083m.25s.708ms] [0] IT: Session [1331] for host [DESKTOP-CUVV7JD] user [Shina] client type[0] clsvrPluginID[0] with process ID [17048] created
[2021.05.25 16:47:07] [0083m.25s.708ms] [1] SC[1331]: Registered sub-client [JobPrefsDBPI_640371328] with ID [1] for session ID [1331] host [DESKTOP-CUVV7JD] user [Shina] process ID [17048]
[2021.05.25 16:47:07] [0083m.25s.756ms] [1] SC[1331]: Registered sub-client [JobPrefsDBPI_640371406] with ID [2] for session ID [1331] host [DESKTOP-CUVV7JD] user [Shina] process ID [17048]
[2021.05.25 16:47:07] [0083m.25s.763ms] [1] SC[1331]: Registered sub-client [NetClassDBPI_640371421] with ID [3] for session ID [1331] host [DESKTOP-CUVV7JD] user [Shina] process ID [17048]
[2021.05.25 16:47:07] [0083m.25s.775ms] [1] SC[1331]: Registered sub-client [Expedition_640371421] with ID [4] for session ID [1331] host [DESKTOP-CUVV7JD] user [Shina] process ID [17048]
[2021.05.25 16:47:07] [0083m.25s.779ms] [1] SC[1331]: UnRegistered sub-client [Expedition_640371421] with ID [4] for session ID [1331] host [DESKTOP-CUVV7JD] user [Shina] process ID [17048]
[2021.05.25 16:47:07] [0083m.25s.794ms] [1] CMT: There are [3] clients now: 1327, 1330, 1331
[2021.05.25 16:47:09] [0083m.27s.424ms] [1] SC[1330]: UnRegistered sub-client [JobPrefsDBPI_640370500] with ID [3] for session ID [1330] host [DESKTOP-CUVV7JD] user [Shina] process ID [23460]
[2021.05.25 16:47:09] [0083m.27s.425ms] [1] SC[1330]: UnRegistered sub-client [JobPrefsDBPI_640370390] with ID [1] for session ID [1330] host [DESKTOP-CUVV7JD] user [Shina] process ID [23460]
[2021.05.25 16:47:09] [0083m.27s.428ms] [1] SC[1330]: UnRegistered sub-client [NetClassDBPI_640370453] with ID [2] for session ID [1330] host [DESKTOP-CUVV7JD] user [Shina] process ID [23460]
[2021.05.25 16:47:09] [0083m.27s.530ms] [1] CMT: Removed client [1330]
[2021.05.25 16:47:09] [0083m.27s.530ms] [1] CMT: There are [2] clients now: 1327, 1331
[2021.05.25 16:47:14] [0083m.32s.235ms] [1] SC[1331]: UnRegistered sub-client [JobPrefsDBPI_640371406] with ID [2] for session ID [1331] host [DESKTOP-CUVV7JD] user [Shina] process ID [17048]
[2021.05.25 16:47:14] [0083m.32s.236ms] [1] SC[1331]: UnRegistered sub-client [JobPrefsDBPI_640371328] with ID [1] for session ID [1331] host [DESKTOP-CUVV7JD] user [Shina] process ID [17048]
[2021.05.25 16:47:14] [0083m.32s.239ms] [1] SC[1331]: UnRegistered sub-client [NetClassDBPI_640371421] with ID [3] for session ID [1331] host [DESKTOP-CUVV7JD] user [Shina] process ID [17048]
[2021.05.25 16:47:14] [0083m.32s.304ms] [1] CMT: Removed client [1331]
[2021.05.25 16:47:14] [0083m.32s.304ms] [1] CMT: There are [1] clients now: 1327
[2021.05.25 16:59:50] [0096m.09s.093ms] [1] SC[1327]: UnRegistered sub-client [ExpeditionCrossProber] with ID [7] for session ID [1327] host [DESKTOP-CUVV7JD] user [Shina] process ID [11332]
[2021.05.25 16:59:52] [0096m.10s.462ms] [1] SC[1327]: UnRegistered sub-client [Expedition PE_635365562] with ID [1] for session ID [1327] host [DESKTOP-CUVV7JD] user [Shina] process ID [11332]
[2021.05.25 16:59:52] [0096m.10s.563ms] [1] CMT: Removed client [1327]
[2021.05.25 16:59:52] [0096m.10s.563ms] [1] CMT: There are no clients left - waiting [1 seconds]
[2021.05.25 16:59:52] [0096m.10s.686ms] [1] SDL: The last connected iCDB Server Monitor [1] is waiting for server close
[2021.05.25 16:59:54] [0096m.12s.284ms] [0] CMT: Starting server auto-close
[2021.05.25 16:59:54] [0096m.12s.377ms] [0] S: Closing server
[2021.05.25 16:59:54] [0096m.12s.547ms] [0] iCDB Server PI: Closing plugins
[2021.05.25 16:59:54] [0096m.12s.547ms] [0] iCDB Server PI: Plugins closed
[2021.05.25 16:59:54] [0096m.12s.547ms] [0] iCDB Server PI: Unloading database
[2021.05.25 16:59:54] [0096m.12s.547ms] [0] iCDB Server PI: Saving storage
[2021.05.25 16:59:54] [0096m.12s.547ms] [0] iCDB Server PI: Closing database
[2021.05.25 16:59:54] [0096m.12s.562ms] [1] iCDB Server PI: Stats: Database defragmentation: max[3] avg[1] holes[0%] data[99%]
[2021.05.25 16:59:54] [0096m.12s.562ms] [1] iCDB Server PI: Stats: Database file size [163328 (159.5 kB)]
[2021.05.25 16:59:54] [0096m.12s.594ms] [0] iCDB Server PI: Database closed
[2021.05.25 16:59:54] [0096m.12s.594ms] [1] iCDB Server PI: Stats: Total iCDB execution time: [45107] ticks
[2021.05.25 16:59:54] [0096m.12s.594ms] [1] iCDB Server PI: Stats: Total iCDB execution time: [4510] microseconds
[2021.05.25 16:59:54] [0096m.12s.594ms] [1] iCDB Server PI: Stats: Total iCDB commands count: [314]
[2021.05.25 16:59:54] [0096m.12s.594ms] [1] iCDB Server PI: Stats: Average iCDB speed:        [69612] commands per second
[2021.05.25 16:59:54] [0096m.12s.594ms] [1] iCDB Server PI: Stats: Mem[14426112]
[2021.05.25 16:59:54] [0096m.12s.594ms] [1] iCDB Server PI: Stats: MemPeak[35217408]
[2021.05.25 16:59:54] [0096m.12s.594ms] [0] Single file [D:\Pd-Master\Mas\Mas100n1 ACB_0001_0\keyin.icdb\icdb.dat] closed with size [163328 (159.5 kB)]
[2021.05.25 16:59:54] [0096m.12s.639ms] [1] SD[1]: Removing the last connected iCDB Server Monitor [1]
[2021.05.25 16:59:54] [0096m.12s.731ms] [0] MWT: Destroy the shutdown block reason.
[2021.05.25 16:59:54] [0096m.12s.732ms] [0] MWT: STOP
[2021.05.25 16:59:54] [0096m.12s.733ms] [0] S: STOP
