(DEVICE FILE: )PACKAGE  TSSOP-38
CLASS IC
PINCOUNT 38

PINORDER TSSOP-38 9 8 7 6 5 4 38 37 36 35 34 33 32 31 30 3 29 28 27 26 25 24 23 22 21 20 2 19 18 17 16 15 14,
    13 12 11 10 1 
PINUSE TSSOP-38 IN IN IN IN IN IN IN IN IN IN IN IN IN IN IN IN IN IN IN IN IN IN IN IN IN IN IN IN IN IN IN IN IN,
    IN IN IN IN IN 
FUNCTION G1 TSSOP-38 9 8 7 6 5 4 38 37 36 35 34 33 32 31 30 3 29 28 27 26 25 24 23 22 21 20 2 19 18 17 16 15 14,
    13 12 11 10 1 
END
