(DEVICE FILE: )PACKAGE  HIROSE-DM3-AT
CLASS IC
PINCOUNT 13

PINORDER HIROSE-DM3-AT SWB SWA FIX_2 FIX_1 FIX 8 7 6 5 4 3 2 1 
PINUSE HIROSE-DM3-AT IN IN IN IN IN IN IN IN IN IN IN IN IN 
FUNCTION G1 HIROSE-DM3-AT SWB SWA FIX_2 FIX_1 FIX 8 7 6 5 4 3 2 1 
END
