[2021.01.10 20:51:07] [0000m.00s.014ms] [0] WELCOME
[2021.01.10 20:51:07] [0000m.00s.015ms] [1] iCDB Server ver.2.207, qgLvIY/Eg4ge+fhn3Vi3jQ, build:17235852 created 2020-09-21 12:40:31, sources stamp:qgLvIY/Eg4ge+fhn3Vi3jQ
[2021.01.10 20:51:07] [0000m.00s.015ms] [1] Restricted Copyright Siemens 2020. All Rights Reserved.
[2021.01.10 20:51:07] [0000m.00s.015ms] [1] Base flow version [VX.2.7]
[2021.01.10 20:51:07] [0000m.00s.015ms] [1] Install Id [2125238], Flow Id [PADS Professional VX.2.7], Full Flow Name [PADS Pro Tools VX.2.7], Exact Access Date [2020/02/01]
[2021.01.10 20:51:07] [0000m.00s.015ms] [1] UPDATE Install Info, Install Id [2239435], UPDATE Name [PADS Pro Tools VX.2.7 - Update 7]
[2021.01.10 20:51:07] [0000m.00s.021ms] [1] Machine [SHINA]  IP [10.111.0.30,127.0.0.1,192.168.1.148]  User [Administrator]  PID [14004]
[2021.01.10 20:51:07] [0000m.00s.022ms] [1] Operating system [Microsoft Windows 10 Home Premium Edition, 64-bit (build 19041)]
[2021.01.10 20:51:07] [0000m.00s.022ms] [1] Current working dir [D:\PD-Master\Mas\Mas100n1 ACB_0001_0]
[2021.01.10 20:51:07] [0000m.00s.022ms] [1] PATH [C:\MentorGraphics\PADSProVX.2.7\SDD_HOME\common\win64\bin;C:\MentorGraphics\PADSProVX.2.7\SDD_HOME\common\win64\lib;C:\MentorGraphics\PADSProVX.2.7\SDD_HOME\common\win64\jre\default\bin;C:\MentorGraphics\PADSProVX.2.7\SDD_HOME\common\win32\lib;C:\MentorGraphics\PADSProVX.2.7\MGC_HOME.ixw\bin;C:\MentorGraphics\PADSProVX.2.7\MGC_HOME.ixw\lib;C:\MentorGraphics\PADSProVX.2.7\SDD_HOME\wg\win64\lib;C:\WINDOWS;%MGC_HOME%\bin;C:\Program Files (x86)\Common Files\Oracle\Java\javapath;C:\Program Files (x86)\Intel\iCLS Client\;C:\Program Files\Intel\iCLS Client\;C:\Windows\system32;C:\Windows;C:\Windows\System32\Wbem;C:\Windows\System32\WindowsPowerShell\v1.0\;C:\Program Files (x86)\Intel\Intel(R) Management Engine Components\DAL;C:\Program Files\Intel\Intel(R) Management Engine Components\DAL;C:\Program Files (x86)\Intel\Intel(R) Management Engine Components\IPT;C:\Program Files\Intel\Intel(R) Management Engine Components\IPT;C:\Cadence\SPB_16.6\tools\pcb\bin;C:\Cadence\SPB_16.6\tools\bin;C:\Cadence\SPB_16.6\tools\libutil\bin;C:\Cadence\SPB_16.6\tools\fet\bin;C:\Cadence\SPB_16.6\tools\specctra\bin;C:\Cadence\SPB_16.6\tools\pspice;C:\Cadence\SPB_16.6\tools\capture;C:\Cadence\SPB_16.6\openaccess\bin\win32\opt;C:\WINDOWS\system32;C:\WINDOWS;C:\WINDOWS\System32\Wbem;C:\WINDOWS\System32\WindowsPowerShell\v1.0\;C:\WINDOWS\System32\OpenSSH\;C:\Program Files (x86)\Windows Kits\8.1\Windows Performance Toolkit\;C:\Users\Administrator\AppData\Local\Microsoft\WindowsApps;C:\MentorGraphics\7.9.5EE\SDD_HOME\common\win32\lib;C:\Users\Administrator\AppData\Roaming\Dashlane\6.2021.0.35401\bin\Firefox_Extension\{442718d9-475e-452a-b3e1-fb1ee16b8e9f}\components;C:\Users\Administrator\AppData\Roaming\Dashlane\6.2021.0.35401\ucrt;C:\Users\Administrator\AppData\Roaming\Dashlane\6.2021.0.35401\bin\Qt;C:\Users\Administrator\AppData\Roaming\Dashlane\6.2021.0.35401\bin\Ssl;C:\Program Files (x86)\interCAD;C:\MentorGraphics\PADSProVX.2.7\SDD_HOME\common3D\win64\lib]
[2021.01.10 20:51:07] [0000m.00s.022ms] [1] SDD_HOME [C:\MentorGraphics\PADSProVX.2.7\SDD_HOME] on file system [NTFS]
[2021.01.10 20:51:07] [0000m.00s.022ms] [1] SDD_PLATFORM [win64]
[2021.01.10 20:51:07] [0000m.00s.022ms] [1] WDIR [C:\WDIR\PADSProVX.2.7;C:\MentorGraphics\PADSProVX.2.7\SDD_HOME\standard;]
[2021.01.10 20:51:07] [0000m.00s.022ms] [1] Local iCDB working dir [C:\WDIR\PADSProVX.2.7\iCDB] on file system [NTFS]
[2021.01.10 20:51:07] [0000m.00s.022ms] [1] S: Config file name [ServerWG.cfg]
[2021.01.10 20:51:07] [0000m.00s.022ms] [2] S: Loading config files
[2021.01.10 20:51:07] [0000m.00s.024ms] [1] Config file [D:\PD-Master\Mas\Mas100n1 ACB_0001_0\keyin.icdb\cdbsvr\ServerWG.cfg] not found
[2021.01.10 20:51:07] [0000m.00s.024ms] [1] Config: Non-default value [System.SingleUserMode] = [no]
[2021.01.10 20:51:07] [0000m.00s.025ms] [3] S: Config loaded
[2021.01.10 20:51:07] [0000m.00s.026ms] [0] S: Project path [D:\PD-Master\Mas\Mas100n1 ACB_0001_0\keyin.icdb] on file system [NTFS]
[2021.01.10 20:51:07] [0000m.00s.026ms] [0] S: Project file (.prj) path [D:\PD-Master\Mas\Mas100n1 ACB_0001_0\Mas100n1 ACUBE_PORTABILE R_0.prj] on file system [NTFS]
[2021.01.10 20:51:07] [0000m.00s.027ms] [1] S: WARNING: Database auto-repair support DISABLED
[2021.01.10 20:51:07] [0000m.00s.027ms] [0] S: Multi-user mode (config)
[2021.01.10 20:51:07] [0000m.00s.027ms] [0] S: Event polling mode autodetection
[2021.01.10 20:51:07] [0000m.00s.027ms] [0] S: Started up automatically by iCDB Client: SHINA:Administrator:10060
[2021.01.10 20:51:07] [0000m.00s.027ms] [0] S: Auto close mode
[2021.01.10 20:51:07] [0000m.00s.027ms] [0] S: Database ID [16a6-9b0b-793d-f128-6f2b-9ffb-f2b9-ff50-616a-4603-c269-69c8]
[2021.01.10 20:51:07] [0000m.00s.027ms] [0] PathTranslator: BEGIN dumping
[2021.01.10 20:51:07] [0000m.00s.027ms] [0] PathTranslator: Local -> global path prefix list
[2021.01.10 20:51:07] [0000m.00s.027ms] [0] PathTranslator: [HP LaserJet 5200 PCL6 Class Driver,LocalsplOnly] -> [\\SHINA\HP LaserJet 5200 PCL6 Class Driver]
[2021.01.10 20:51:07] [0000m.00s.027ms] [0] PathTranslator: [C:\WINDOWS\system32\spool\drivers] -> [\\SHINA\print$]
[2021.01.10 20:51:07] [0000m.00s.027ms] [0] PathTranslator: Global -> local path prefix list
[2021.01.10 20:51:07] [0000m.00s.027ms] [0] PathTranslator: [\\SHINA\HP LaserJet 5200 PCL6 Class Driver] -> [HP LaserJet 5200 PCL6 Class Driver,LocalsplOnly]
[2021.01.10 20:51:07] [0000m.00s.027ms] [0] PathTranslator: [\\SHINA\print$] -> [C:\WINDOWS\system32\spool\drivers]
[2021.01.10 20:51:07] [0000m.00s.027ms] [0] PathTranslator: END dumping
[2021.01.10 20:51:07] [0000m.00s.027ms] [0] S: START
[2021.01.10 20:51:07] [0000m.00s.027ms] [0] S: Server startup lock file created
[2021.01.10 20:51:07] [0000m.00s.027ms] [0] S: Listening for client connections on port [10002]
[2021.01.10 20:51:07] [0000m.00s.028ms] [0] S: Server network ID [Shina:10.111.0.30,192.168.1.148,Shina:10002]
[2021.01.10 20:51:07] [0000m.00s.028ms] [0] S: Server GUID [5987-5d11-ab8d-2b36-baa5-bff0-ba5b-ff50-a44a-2603-c269-69c8]
[2021.01.10 20:51:07] [0000m.00s.028ms] [0] S: Project GUID [16a6-9b0b-793d-f128-6f2b-9ffb-f2b9-ff50-616a-4603-c269-69c8]
[2021.01.10 20:51:07] [0000m.00s.029ms] [0] S: Wrote data to server address file
[2021.01.10 20:51:07] [0000m.00s.029ms] [0] S: Server startup lock file removed
[2021.01.10 20:51:07] [0000m.00s.029ms] [1] ProjectBackupManager: Setting project file (.prj) path: [D:\PD-Master\Mas\Mas100n1 ACB_0001_0\Mas100n1 ACUBE_PORTABILE R_0.prj]
[2021.01.10 20:51:07] [0000m.00s.069ms] [0] S: Plugins loaded: [PIM] [ENetGen70] 
[2021.01.10 20:51:07] [0000m.00s.069ms] [1] ServerToolkit: INFO: Plugin not found in SDD_ICDB_BIN [C:\MentorGraphics\PADSProVX.2.7\SDD_HOME\iCDB\win64\bin]
[2021.01.10 20:51:07] [0000m.00s.069ms] [1] ServerToolkit: INFO: Plugin not found in SDD_COMMON_BIN [C:\MentorGraphics\PADSProVX.2.7\SDD_HOME\common\win64\bin]
[2021.01.10 20:51:07] [0000m.00s.070ms] [1] ServerToolkit: INFO: Plugin not found in PATH
[2021.01.10 20:51:07] [0000m.00s.070ms] [1] ServerToolkit: INFO: Plugin not found in CWD
[2021.01.10 20:51:07] [0000m.00s.070ms] [1] ServerToolkit: INFO: returning just plugin exe name!
[2021.01.10 20:51:07] [0000m.00s.070ms] [0] S: Local disc access time: 98 us
[2021.01.10 20:51:07] [0000m.00s.070ms] [0] S: File server access time: 49 us
[2021.01.10 20:51:07] [0000m.00s.071ms] [0] Single file [D:\PD-Master\Mas\Mas100n1 ACB_0001_0\keyin.icdb\icdb.dat] size [156032 (152.4 kB)]
[2021.01.10 20:51:07] [0000m.00s.071ms] [1] Single file [D:\PD-Master\Mas\Mas100n1 ACB_0001_0\keyin.icdb\icdb.dat] opened in read-write mode
[2021.01.10 20:51:07] [0000m.00s.071ms] [0] SingleFile: [0000-0000-0000-0000] SFI header version check [1009] [1009]
[2021.01.10 20:51:07] [0000m.00s.071ms] [0] Database GUARD OK: [156032]
[2021.01.10 20:51:07] [0000m.00s.071ms] [0] SingleFile: [0000-0000-0000-0000] SFI header version check [1009] [1009]
[2021.01.10 20:51:07] [0000m.00s.071ms] [0] Database GUARD OK: [156032]
[2021.01.10 20:51:07] [0000m.00s.071ms] [0] SingleFile: [0000-0000-0000-0000] SFI header version check [1009] [1009]
[2021.01.10 20:51:07] [0000m.00s.071ms] [0] Database GUARD OK: [156032]
[2021.01.10 20:51:07] [0000m.00s.071ms] [0] SingleFile: [0000-0000-0000-0000] SFI header version check [1009] [1009]
[2021.01.10 20:51:07] [0000m.00s.071ms] [0] Database GUARD OK: [156032]
[2021.01.10 20:51:07] [0000m.00s.072ms] [0] SingleFile: [0000-0000-0000-0000] SFI header version check [1009] [1009]
[2021.01.10 20:51:07] [0000m.00s.072ms] [0] Database GUARD OK: [156032]
[2021.01.10 20:51:07] [0000m.00s.072ms] [0] SingleFile: [d63c-711a-3f40-6b41] SFI version check [1009] [1009]
[2021.01.10 20:51:07] [0000m.00s.073ms] [0] SingleFile: [d63c-711a-3f40-6b41] Database SFI header has been read in [1ms 151us]
[2021.01.10 20:51:07] [0000m.00s.076ms] [0] iCDB Server PI: Server & plugin session [420]
[2021.01.10 20:51:07] [0000m.00s.076ms] [0] iCDB Server PI: Opening database [D:\PD-Master\Mas\Mas100n1 ACB_0001_0\keyin.icdb]
[2021.01.10 20:51:07] [0000m.00s.076ms] [0] iCDB Server PI: Database [D:\PD-Master\Mas\Mas100n1 ACB_0001_0\keyin.icdb] opened
[2021.01.10 20:51:07] [0000m.00s.129ms] [0] iCDB Database: Checking existence of constraint definitions
[2021.01.10 20:51:07] [0000m.00s.129ms] [0] iCDB Database: Checking constraint definitions version
[2021.01.10 20:51:07] [0000m.00s.156ms] [1] iCDB Database: Constraint definitions version [ce_ee.cns=7.10.69] up to date
[2021.01.10 20:51:07] [0000m.00s.160ms] [0] iCDB Server PI: Initializing plugins
[2021.01.10 20:51:07] [0000m.00s.160ms] [0] iCDB Server PI: Plugins initialized
[2021.01.10 20:51:07] [0000m.00s.160ms] [0] S: iCDB database loaded
[2021.01.10 20:51:07] [0000m.00s.161ms] [0] S: Starting threads
[2021.01.10 20:51:07] [0000m.00s.161ms] [0] BT: Listening for broadcast messages on port [10000]
[2021.01.10 20:51:07] [0000m.00s.161ms] [1] CMT: There are no clients - waiting [10 seconds]
[2021.01.10 20:51:07] [0000m.00s.162ms] [0] IT: Session [421] for host [Shina] user [Administrator] client type[0] clsvrPluginID[0] with process ID [10060] created
[2021.01.10 20:51:07] [0000m.00s.165ms] [0] IT: iCDB Server Monitor session [1] for host [Shina] user [Administrator] with process ID [1460] created
[2021.01.10 20:51:07] [0000m.00s.165ms] [1] DMT: There are [1] iCDB Server Monitor connected now
[2021.01.10 20:51:07] [0000m.00s.166ms] [1] SC[421]: Registered sub-client [Expedition PE_802734] with ID [1] for session ID [421] host [Shina] user [Administrator] process ID [10060]
[2021.01.10 20:51:07] [0000m.00s.168ms] [0] MWT: WindowProc: WM_NCCREATE
[2021.01.10 20:51:07] [0000m.00s.273ms] [1] CMT: There are [1] clients now: 421
[2021.01.10 20:51:08] [0000m.00s.289ms] [1] SC[421]: Registered sub-client [EEVM_EEVM_952374144] with ID [2] for session ID [421] host [Shina] user [Administrator] process ID [10060]
[2021.01.10 20:51:08] [0000m.00s.289ms] [1] SC[421]: UnRegistered sub-client [EEVM_EEVM_952374144] with ID [2] for session ID [421] host [Shina] user [Administrator] process ID [10060]
[2021.01.10 20:51:09] [0000m.01s.672ms] [1] SC[421]: Registered sub-client [JobPrefsDBPI_804531] with ID [3] for session ID [421] host [Shina] user [Administrator] process ID [10060]
[2021.01.10 20:51:09] [0000m.01s.679ms] [1] SC[421]: UnRegistered sub-client [JobPrefsDBPI_804531] with ID [3] for session ID [421] host [Shina] user [Administrator] process ID [10060]
[2021.01.10 20:51:12] [0000m.04s.514ms] [1] PrjBackupMgr: Successfully created Project Backup [D:\PD-Master\Mas\Mas100n1 ACB_0001_0\ProjectBackup\backups\2021-01-10 20.51.07 - auto.zip] with GUID [06e6-650d-0ff8-7237-baa5-bff0-ba5b-ff50-65d7-2603-c269-69c8]
[2021.01.10 20:51:12] [0000m.04s.514ms] [0] PrjBackupEngine: Successfully created backup:  BackupGUID[06e6-650d-0ff8-7237-baa5-bff0-ba5b-ff50-65d7-2603-c269-69c8] CreationTime[Sunday, January 10, 2021 19:51:07] Type[Autosave] Creator[iCDB Server (2021-01-10 20.51.07-14004)] ApplicationName[iCDB Server (2021-01-10 20.51.07-14004)] UserName[Administrator] MachineName[SHINA] Description[Autosave] FullFlowName[PADS Pro Tools VX.2.7; PADS Pro Tools VX.2.7 - Update 7] FlowId[PADSProVX.2.7] GBSInstallId[2125238; 2239435] GBSBuildId[17235852] IcdbVersion[3800] ReferenceLogFilePath[] BackupFilePath[D:\PD-Master\Mas\Mas100n1 ACB_0001_0\ProjectBackup\backups\2021-01-10 20.51.07 - auto.zip] BackupFileSize[81803961] Persistent[FALSE]
[2021.01.10 20:51:12] [0000m.05s.081ms] [1] SC[421]: Registered sub-client [JobPrefsDBPI_807937] with ID [4] for session ID [421] host [Shina] user [Administrator] process ID [10060]
[2021.01.10 20:51:12] [0000m.05s.086ms] [1] SC[421]: UnRegistered sub-client [JobPrefsDBPI_807937] with ID [4] for session ID [421] host [Shina] user [Administrator] process ID [10060]
[2021.01.10 20:51:39] [0000m.31s.840ms] [0] DFAMT: File server access time: 70 us
[2021.01.10 20:54:53] [0003m.45s.624ms] [1] SC[421]: Registered sub-client [JobPrefsDBPI_1028484] with ID [5] for session ID [421] host [Shina] user [Administrator] process ID [10060]
[2021.01.10 20:54:53] [0003m.45s.655ms] [1] SC[421]: UnRegistered sub-client [JobPrefsDBPI_1028484] with ID [5] for session ID [421] host [Shina] user [Administrator] process ID [10060]
[2021.01.10 20:55:39] [0004m.31s.481ms] [1] SC[421]: Registered sub-client [JobPrefsDBPI_1074343] with ID [6] for session ID [421] host [Shina] user [Administrator] process ID [10060]
[2021.01.10 20:55:39] [0004m.31s.513ms] [1] SC[421]: UnRegistered sub-client [JobPrefsDBPI_1074343] with ID [6] for session ID [421] host [Shina] user [Administrator] process ID [10060]
[2021.01.10 20:55:39] [0004m.31s.600ms] [1] SC[421]: Registered sub-client [ExpeditionCrossProber] with ID [7] for session ID [421] host [Shina] user [Administrator] process ID [10060]
[2021.01.10 20:55:39] [0004m.31s.603ms] [1] SC[421]: Registered sub-client [StartServerClient3858] with ID [8] for session ID [421] host [Shina] user [Administrator] process ID [10060]
[2021.01.10 20:55:39] [0004m.31s.603ms] [1] SC[421]: UnRegistered sub-client [StartServerClient3858] with ID [8] for session ID [421] host [Shina] user [Administrator] process ID [10060]
[2021.01.10 21:14:05] [0022m.57s.826ms] [0] MWT: PBT_APMSTANDBY || PBT_APMSUSPEND
[2021.01.10 21:14:05] [0022m.57s.826ms] [0] MWT: Requesting emergency server stop: System goes to SLEEP
[2021.01.10 21:14:05] [0022m.57s.826ms] [0] Removing server address file.
[2021.01.10 21:14:05] [0022m.57s.884ms] [0] S: Closing server
[2021.01.10 21:14:05] [0022m.57s.884ms] [4] SMCL: Distributing notify to registered [General] iCDB Server Manager clients [NotifyServerStatus @ Version[1] # Id[Sender GUID[5987-5d11-ab8d-2b36-baa5-bff0-ba5b-ff50-a44a-2603-c269-69c8] Command number[86]] # Proxy[EMPTY] # RequestId[Sender GUID[0000-0000-0000-0000-0000-0000-0000-0000-0000-0000-0000-0000] Command number[0]] # ReplyPort[10002] # Status [Closing]]
[2021.01.10 21:14:05] [0022m.57s.884ms] [3] IT: FREE
[2021.01.10 21:14:05] [0022m.57s.884ms] [4] IT: Waiting for finish
[2021.01.10 21:14:05] [0022m.57s.884ms] [4] IT: Empty client connection popped from the waiting queue
[2021.01.10 21:14:05] [0022m.57s.884ms] [2] IT: STOP
[2021.01.10 21:14:05] [0022m.57s.884ms] [3] ET: Suspend request
[2021.01.10 21:14:05] [0022m.57s.884ms] [3] ET: Suspend request finished
[2021.01.10 21:14:05] [0022m.57s.884ms] [2] ET: SUSPENDED
[2021.01.10 21:14:05] [0022m.57s.884ms] [2] SCL: Removing all clients
[2021.01.10 21:14:05] [0022m.57s.884ms] [3] SC[421]: FREE
[2021.01.10 21:14:05] [0022m.57s.884ms] [4] SMCL: Distributing notify to registered [ClientList] iCDB Server Manager clients [NotifyServerClientRemove @ Version[1] # Id[Sender GUID[5987-5d11-ab8d-2b36-baa5-bff0-ba5b-ff50-a44a-2603-c269-69c8] Command number[87]] # Proxy[EMPTY] # RequestId[Sender GUID[0000-0000-0000-0000-0000-0000-0000-0000-0000-0000-0000-0000] Command number[0]] # ReplyPort[10002] # Client [Address[Shina] User[Administrator] PID[10060] Session[421] Status[Active] Dead elapsed time sec[0] Version[2.207] Sub-clients[ ( Sub-client[Name[Expedition PE_802734] Id[1]], Sub-client[Name[ExpeditionCrossProber] Id[7]])]]]
[2021.01.10 21:14:05] [0022m.57s.885ms] [3] CRT[421]: FREE
[2021.01.10 21:14:05] [0022m.57s.885ms] [4] CRT[421]: Waiting for finish
[2021.01.10 21:14:05] [0022m.58s.004ms] [2] CRT[421]: STOP
[2021.01.10 21:14:05] [0022m.58s.004ms] [3] CST[421]: FREE
[2021.01.10 21:14:05] [0022m.58s.004ms] [4] CST[421]: Waiting for finish
[2021.01.10 21:14:05] [0022m.58s.004ms] [2] CST[421]: STOP
[2021.01.10 21:14:05] [0022m.58s.005ms] [1] SC[421]: WARNING: Session is still active while destroying
[2021.01.10 21:14:05] [0022m.58s.005ms] [2] SC[421]: Disconnecting from peer
[2021.01.10 21:14:05] [0022m.58s.005ms] [6] iCDB Server PI: ReleaseOpenSnapshotRefCount [2]: 0
[2021.01.10 21:14:05] [0022m.58s.005ms] [3] iCDB Server PI: No one is using snapshot [2] - removing from cache
[2021.01.10 21:14:05] [0022m.58s.005ms] [6] iCDB Storage Server: Checking existence of file [D:\PD-Master\Mas\Mas100n1 ACB_0001_0\keyin.icdb\s2\cdbblks\2000000010000050.blk\rbcatl.v]
[2021.01.10 21:14:05] [0022m.58s.005ms] [6] iCDB Storage Server: File [D:\PD-Master\Mas\Mas100n1 ACB_0001_0\keyin.icdb\s2\cdbblks\2000000010000050.blk\rbcatl.v] doesn't exist
[2021.01.10 21:14:05] [0022m.58s.008ms] [6] iCDB Storage Server: Checking existence of file [D:\PD-Master\Mas\Mas100n1 ACB_0001_0\keyin.icdb\s2\uids]
[2021.01.10 21:14:05] [0022m.58s.008ms] [6] iCDB Storage Server: File [D:\PD-Master\Mas\Mas100n1 ACB_0001_0\keyin.icdb\s2\uids] exists
[2021.01.10 21:14:05] [0022m.58s.009ms] [6] iCDB Storage Server: Unloading directory [D:\PD-Master\Mas\Mas100n1 ACB_0001_0\keyin.icdb\s2]
[2021.01.10 21:14:05] [0022m.58s.009ms] [6] iCDB Storage Server: Unloading file [D:\PD-Master\Mas\Mas100n1 ACB_0001_0\keyin.icdb\s2\cdbblks\2000000010000050.blk\blkatl.v]
[2021.01.10 21:14:05] [0022m.58s.009ms] [6] iCDB Storage Server: Unloading file [D:\PD-Master\Mas\Mas100n1 ACB_0001_0\keyin.icdb\s2\cdbcatlg\catlgatl.v]
[2021.01.10 21:14:05] [0022m.58s.009ms] [6] iCDB Storage Server: Unloading file [D:\PD-Master\Mas\Mas100n1 ACB_0001_0\keyin.icdb\s2\cdbcatlg\grpatl.v]
[2021.01.10 21:14:05] [0022m.58s.009ms] [6] iCDB Storage Server: Unloading file [D:\PD-Master\Mas\Mas100n1 ACB_0001_0\keyin.icdb\s2\cdbcatlg\grpobj]
[2021.01.10 21:14:05] [0022m.58s.009ms] [6] iCDB Storage Server: Unloading file [D:\PD-Master\Mas\Mas100n1 ACB_0001_0\keyin.icdb\s2\cdbcmpcache\cmpatl.v]
[2021.01.10 21:14:05] [0022m.58s.009ms] [6] iCDB Storage Server: Unloading file [D:\PD-Master\Mas\Mas100n1 ACB_0001_0\keyin.icdb\s2\cdbcmps\cmpatl.v]
[2021.01.10 21:14:05] [0022m.58s.009ms] [6] iCDB Storage Server: Unloading file [D:\PD-Master\Mas\Mas100n1 ACB_0001_0\keyin.icdb\s2\cdbcnfgs\2000000010000050.blk\cesatl.v]
[2021.01.10 21:14:05] [0022m.58s.009ms] [6] iCDB Storage Server: Unloading file [D:\PD-Master\Mas\Mas100n1 ACB_0001_0\keyin.icdb\s2\cdbcnfgs\2000000010000050.blk\cnfgatl.v]
[2021.01.10 21:14:05] [0022m.58s.009ms] [6] iCDB Storage Server: Unloading file [D:\PD-Master\Mas\Mas100n1 ACB_0001_0\keyin.icdb\s2\cdbcnfgs\2000000010000050.blk\varatl.v]
[2021.01.10 21:14:05] [0022m.58s.009ms] [6] iCDB Storage Server: Unloading file [D:\PD-Master\Mas\Mas100n1 ACB_0001_0\keyin.icdb\s2\oryg]
[2021.01.10 21:14:05] [0022m.58s.009ms] [6] iCDB Storage Server: Unloading file [D:\PD-Master\Mas\Mas100n1 ACB_0001_0\keyin.icdb\s2\uids]
[2021.01.10 21:14:05] [0022m.58s.009ms] [5] iCDB Server PI: Snapshot [2] removed from cache
[2021.01.10 21:14:05] [0022m.58s.009ms] [3] ET: Discarding pending commands
[2021.01.10 21:14:05] [0022m.58s.009ms] [3] ET: Resume request
[2021.01.10 21:14:05] [0022m.58s.009ms] [3] ET: Resume request finished
[2021.01.10 21:14:05] [0022m.58s.009ms] [2] ET: RESUMED
[2021.01.10 21:14:05] [0022m.58s.020ms] [2] PrjBackupEngine: STOP
[2021.01.10 21:14:05] [0022m.58s.020ms] [3] PrjBackupEngine: FREE
[2021.01.10 21:14:05] [0022m.58s.020ms] [4] PrjBackupEngine: Waiting for finish
[2021.01.10 21:14:05] [0022m.58s.020ms] [3] ET: FREE
[2021.01.10 21:14:05] [0022m.58s.020ms] [4] ET: Waiting for finish
[2021.01.10 21:14:05] [0022m.58s.020ms] [2] ET: STOP
[2021.01.10 21:14:05] [0022m.58s.020ms] [2] SCL: Stopping all send threads
[2021.01.10 21:14:05] [0022m.58s.020ms] [3] CMT: FREE
[2021.01.10 21:14:05] [0022m.58s.020ms] [4] CMT: Waiting for finish
[2021.01.10 21:14:05] [0022m.58s.058ms] [0] SD[1]: ERROR: Receiving command: Socket Exception: Category[Socket] Error[ConnectionClosed] Description[Connection closed] Message[]
[2021.01.10 21:14:05] [0022m.58s.058ms] [2] SD[1]: Setting status to FINISHED
[2021.01.10 21:14:05] [0022m.58s.058ms] [7] SD[1]: Sending logout notify: SvrNotifyLogout @ Version[VX.2.7.0] # Id[1100]
[2021.01.10 21:14:05] [0022m.58s.058ms] [2] SD[1]: Disconnecting from peer
[2021.01.10 21:14:05] [0022m.58s.058ms] [2] DRT[1]: STOP
[2021.01.10 21:14:05] [0022m.58s.058ms] [4] DMT: Dispatching command [DiagFinished # Diag Id [1]]
[2021.01.10 21:14:05] [0022m.58s.058ms] [5] DMT: Trying to remove iCDB Server Monitor [1]
[2021.01.10 21:14:05] [0022m.58s.058ms] [4] SDL: Removing iCDB Server Monitor [1]
[2021.01.10 21:14:05] [0022m.58s.058ms] [3] SD[1]: FREE
[2021.01.10 21:14:05] [0022m.58s.058ms] [3] DRT[1]: FREE
[2021.01.10 21:14:05] [0022m.58s.058ms] [4] DRT[1]: Waiting for finish
[2021.01.10 21:14:05] [0022m.58s.058ms] [3] DST[1]: FREE
[2021.01.10 21:14:05] [0022m.58s.058ms] [4] DST[1]: Waiting for finish
[2021.01.10 21:14:05] [0022m.58s.058ms] [2] DST[1]: EXIT graceful
[2021.01.10 21:14:05] [0022m.58s.058ms] [2] DST[1]: STOP
[2021.01.10 21:14:05] [0022m.58s.058ms] [4] SDL: iCDB Server Monitor [1] removed
[2021.01.10 21:14:05] [0022m.58s.058ms] [1] DMT: Removed iCDB Server Monitor [1]
[2021.01.10 21:14:05] [0022m.58s.109ms] [2] CMT: STOP
[2021.01.10 21:14:05] [0022m.58s.109ms] [3] DMT: FREE
[2021.01.10 21:14:05] [0022m.58s.109ms] [4] DMT: Waiting for finish
[2021.01.10 21:14:05] [0022m.58s.109ms] [2] DMT: STOP
[2021.01.10 21:14:05] [0022m.58s.110ms] [3] DFAMT: FREE
[2021.01.10 21:14:05] [0022m.58s.110ms] [4] DFAMT: Waiting for finish
[2021.01.10 21:14:05] [0022m.58s.125ms] [2] DFAMT: Filer project path [D:\PD-Master\Mas\Mas100n1 ACB_0001_0\keyin.icdb] access monitoring ended
[2021.01.10 21:14:05] [0022m.58s.125ms] [2] DFAMT: STOP
[2021.01.10 21:14:05] [0022m.58s.125ms] [4] DFAMT: FINISHED
[2021.01.10 21:14:05] [0022m.58s.125ms] [3] DiagSystemMemoryMonitorThread: FREE
[2021.01.10 21:14:05] [0022m.58s.125ms] [4] DiagSystemMemoryMonitorThread: Waiting for finish
[2021.01.10 21:14:05] [0022m.58s.140ms] [2] DiagSystemMemoryMonitorThread: System memory usage monitoring ended
[2021.01.10 21:14:05] [0022m.58s.140ms] [2] DiagSystemMemoryMonitorThread: STOP
[2021.01.10 21:14:05] [0022m.58s.140ms] [4] DiagSystemMemoryMonitorThread: FINISHED
[2021.01.10 21:14:05] [0022m.58s.140ms] [4] DMT: FINISHED
[2021.01.10 21:14:05] [0022m.58s.141ms] [2] SCL: Removing all clients
[2021.01.10 21:14:05] [0022m.58s.141ms] [2] iCDB Server PI: Unloading observers
[2021.01.10 21:14:05] [0022m.58s.141ms] [2] iCDB Server PI: Observers unloaded
[2021.01.10 21:14:05] [0022m.58s.141ms] [0] iCDB Server PI: Closing plugins
[2021.01.10 21:14:05] [0022m.58s.141ms] [2] iCDB Server PI: Closing PIM plugin
[2021.01.10 21:14:05] [0022m.58s.141ms] [5] iCDB PIM Wrapper: FREE
[2021.01.10 21:14:05] [0022m.58s.141ms] [2] iCDB Server PI: Closing ENetGen plugin
[2021.01.10 21:14:05] [0022m.58s.141ms] [5] iCDB ENetGen Wrapper: FREE
[2021.01.10 21:14:05] [0022m.58s.141ms] [0] iCDB Server PI: Plugins closed
[2021.01.10 21:14:05] [0022m.58s.141ms] [0] iCDB Server PI: Unloading database
[2021.01.10 21:14:05] [0022m.58s.141ms] [7] DCM: CDBCesDefConstraintManager::LoadVersionInfo(force[0] cumulativesaveVersion[0000000000000000] transporter[0000000000000000]) -- isModified[0] upgradeFlag[0]
[2021.01.10 21:14:05] [0022m.58s.141ms] [6] iCDB Storage Server: Saving all modified files
[2021.01.10 21:14:05] [0022m.58s.141ms] [7] SingleFile: [d63c-711a-3f40-6b41] RTS: switched to: [1]
[2021.01.10 21:14:05] [0022m.58s.141ms] [0] iCDB Server PI: Saving storage
[2021.01.10 21:14:05] [0022m.58s.141ms] [6] iCDB Storage Server: Saving all modified files
[2021.01.10 21:14:05] [0022m.58s.141ms] [7] SingleFile: [d63c-711a-3f40-6b41] RTS: switched to: [1]
[2021.01.10 21:14:05] [0022m.58s.141ms] [0] iCDB Server PI: Closing database
[2021.01.10 21:14:05] [0022m.58s.141ms] [7] Holes::writing holes [1] prev [0] from [156140] 
[2021.01.10 21:14:05] [0022m.58s.141ms] [7] Holes::write <155692,156011>
[2021.01.10 21:14:06] [0022m.58s.511ms] [7] Holes have been successfully saved 1 CRC [2592208393]
[2021.01.10 21:14:06] [0022m.58s.511ms] [1] iCDB Server PI: Stats: Database defragmentation: max[1] avg[1] holes[0%] data[99%]
[2021.01.10 21:14:06] [0022m.58s.511ms] [1] iCDB Server PI: Stats: Database file size [156152 (152.5 kB)]
[2021.01.10 21:14:06] [0022m.58s.511ms] [7] Holes::writing holes [1] prev [1] from [156148] 
[2021.01.10 21:14:06] [0022m.58s.511ms] [7] Holes::write <155692,156011>
[2021.01.10 21:14:06] [0022m.58s.539ms] [7] Holes have been successfully saved 1 CRC [2592208393]
[2021.01.10 21:14:06] [0022m.58s.539ms] [7] DCM: CDBCesDefConstraintManager::LoadVersionInfo(force[0] cumulativesaveVersion[0000000000000000] transporter[0000000000000000]) -- isModified[0] upgradeFlag[0]
[2021.01.10 21:14:06] [0022m.58s.539ms] [7] DCM: CDBCesDefConstraintManager::UnLoad()
[2021.01.10 21:14:06] [0022m.58s.541ms] [3] iCDB Storage Server: FREE
[2021.01.10 21:14:06] [0022m.58s.541ms] [3] iCDB Storage Server Save Thread: FREE
[2021.01.10 21:14:06] [0022m.58s.541ms] [4] iCDB Storage Server Save Thread: Waiting for finish
[2021.01.10 21:14:06] [0022m.58s.541ms] [2] iCDB Storage Server Save Thread: STOP
[2021.01.10 21:14:06] [0022m.58s.543ms] [3] iCDB Storage Server Backup Thread: FREE
[2021.01.10 21:14:06] [0022m.58s.543ms] [2] iCDB Storage Server Backup Thread: STOP
[2021.01.10 21:14:06] [0022m.58s.543ms] [4] iCDB Storage Server Backup Thread: Waiting for finish
[2021.01.10 21:14:06] [0022m.58s.580ms] [3] SingleFile: [0000-0000-0000-0000] Modification time updated for file [D:\PD-Master\Mas\Mas100n1 ACB_0001_0\keyin.icdb\icdb.dat]
[2021.01.10 21:14:06] [0022m.58s.580ms] [3] SingleFile: [0000-0000-0000-0000] Closing file [D:\PD-Master\Mas\Mas100n1 ACB_0001_0\keyin.icdb\icdb.dat] restrained
[2021.01.10 21:14:06] [0022m.58s.580ms] [0] iCDB Server PI: Database closed
[2021.01.10 21:14:06] [0022m.58s.580ms] [1] iCDB Server PI: Stats: Total iCDB execution time: [45877] ticks
[2021.01.10 21:14:06] [0022m.58s.580ms] [1] iCDB Server PI: Stats: Total iCDB execution time: [4587] microseconds
[2021.01.10 21:14:06] [0022m.58s.580ms] [1] iCDB Server PI: Stats: Total iCDB commands count: [5]
[2021.01.10 21:14:06] [0022m.58s.580ms] [1] iCDB Server PI: Stats: Average iCDB speed:        [1089] commands per second
[2021.01.10 21:14:06] [0022m.58s.581ms] [1] iCDB Server PI: Stats: Mem[14548992]
[2021.01.10 21:14:06] [0022m.58s.581ms] [1] iCDB Server PI: Stats: MemPeak[30543872]
[2021.01.10 21:14:06] [0022m.58s.590ms] [0] Single file [D:\PD-Master\Mas\Mas100n1 ACB_0001_0\keyin.icdb\icdb.dat] closed with size [156152 (152.5 kB)]
[2021.01.10 21:14:06] [0022m.58s.590ms] [2] SDL: Removing all connected iCDB Server Monitor
[2021.01.10 21:14:06] [0022m.58s.590ms] [2] S: Unloading ENetGen plugin from file [C:\MentorGraphics\PADSProVX.2.7\SDD_HOME\common\win64\bin\..\lib\ENetGen70.dll]
[2021.01.10 21:14:06] [0022m.58s.593ms] [2] S: Unloading PIM plugin from file [C:\MentorGraphics\PADSProVX.2.7\SDD_HOME\common\win64\bin\..\lib\PIM.dll]
[2021.01.10 21:14:06] [0022m.58s.596ms] [3] ST: FREE
[2021.01.10 21:14:06] [0022m.58s.596ms] [4] ST: Waiting for finish
[2021.01.10 21:14:06] [0022m.58s.596ms] [2] ST: STOP
[2021.01.10 21:14:06] [0022m.58s.601ms] [3] MET: FREE
[2021.01.10 21:14:06] [0022m.58s.601ms] [4] MET: Waiting for finish
[2021.01.10 21:14:06] [0022m.58s.601ms] [2] MET: STOP
[2021.01.10 21:14:06] [0022m.58s.608ms] [3] MCE: FREE
[2021.01.10 21:14:06] [0022m.58s.608ms] [3] ELMT: FREE
[2021.01.10 21:14:06] [0022m.58s.608ms] [4] ELMT: Waiting for finish
[2021.01.10 21:14:06] [0022m.58s.608ms] [2] ELMT: STOP
[2021.01.10 21:14:06] [0022m.58s.613ms] [3] EventLogDataFile: EventLog data file [D:\PD-Master\Mas\Mas100n1 ACB_0001_0\keyin.icdb\cdbsvr\events\events.dat] closed
[2021.01.10 21:14:06] [0022m.58s.613ms] [3] EventLogIndexFile: EventLog index file [D:\PD-Master\Mas\Mas100n1 ACB_0001_0\keyin.icdb\cdbsvr\events\events.idx] closed
[2021.01.10 21:14:06] [0022m.58s.613ms] [4] ELMT: FINISHED
[2021.01.10 21:14:06] [0022m.58s.613ms] [3] AT: FREE
[2021.01.10 21:14:06] [0022m.58s.613ms] [4] AT: Waiting for finish
[2021.01.10 21:14:06] [0022m.58s.655ms] [2] AT: Removing server address file [D:\PD-Master\Mas\Mas100n1 ACB_0001_0\keyin.icdb\cdbsvr\sAddress.adr]
[2021.01.10 21:14:06] [0022m.58s.656ms] [0] AT: ERROR: Could not remove server address file [D:\PD-Master\Mas\Mas100n1 ACB_0001_0\keyin.icdb\cdbsvr\sAddress.adr]
[2021.01.10 21:14:06] [0022m.58s.656ms] [2] AT: STOP
[2021.01.10 21:14:06] [0022m.58s.658ms] [3] BT: FREE
[2021.01.10 21:14:06] [0022m.58s.659ms] [4] BT: Waiting for finish
[2021.01.10 21:14:06] [0022m.58s.745ms] [4] BT: Sending broadcast on port [10000]: NotifyProjectGlobalStatus @ Version[1] # Id[Sender GUID[5987-5d11-ab8d-2b36-baa5-bff0-ba5b-ff50-a44a-2603-c269-69c8] Command number[89]] # Proxy[EMPTY] # RequestId[Sender GUID[0000-0000-0000-0000-0000-0000-0000-0000-0000-0000-0000-0000] Command number[0]] # ReplyPort[0] # ProjectId [GUID[16a6-9b0b-793d-f128-6f2b-9ffb-f2b9-ff50-616a-4603-c269-69c8] Address[Host[Shina] Port[10002]] IsLauncher[FALSE] Launcher[GUID[0000-0000-0000-0000-0000-0000-0000-0000-0000-0000-0000-0000] Address[Host[] Port[0]]] Path[D:\PD-Master\Mas\Mas100n1 ACB_0001_0\keyin.icdb] ReadOnly[FALSE] Server GUID[5987-5d11-ab8d-2b36-baa5-bff0-ba5b-ff50-a44a-2603-c269-69c8]] # Status [Shutdown]
[2021.01.10 21:14:06] [0022m.58s.745ms] [2] BT: STOP
[2021.01.10 21:14:06] [0022m.58s.746ms] [3] MWT: FREE
[2021.01.10 21:14:06] [0022m.58s.746ms] [4] MWT: Waiting for finish
[2021.01.10 21:14:06] [0022m.58s.746ms] [0] MWT: Destroy the shutdown block reason.
[2021.01.10 21:14:06] [0022m.58s.747ms] [0] MWT: STOP
[2021.01.10 21:14:06] [0022m.58s.747ms] [0] S: STOP
[2021.01.10 21:14:06] [0022m.58s.747ms] [3] S: FREE
[2021.01.10 21:14:06] [0022m.58s.747ms] [3] S: FREE: Server implementation
[2021.01.10 21:14:06] [0022m.58s.747ms] [3] CLSVRM: FREE
[2021.01.10 21:14:06] [0022m.58s.748ms] [3] SDSM: FREE
[2021.01.10 21:14:06] [0022m.58s.748ms] [3] SDL: FREE
[2021.01.10 21:14:06] [0022m.58s.748ms] [3] SCL: FREE
[2021.01.10 21:14:06] [0022m.58s.748ms] [6] SSM: FREE
[2021.01.10 21:14:06] [0022m.58s.748ms] [3] SMCL: FREE
[2021.01.10 21:14:06] [0022m.58s.748ms] [3] SS: FREE
[2021.01.10 21:14:06] [0022m.58s.748ms] [3] SM: FREE
[2021.01.10 21:14:06] [0022m.58s.748ms] [3] SingleMessageSender: Send thread: FREE
[2021.01.10 21:14:06] [0022m.58s.748ms] [4] SingleMessageSender: Send thread: Waiting for finish
[2021.01.10 21:14:06] [0022m.58s.748ms] [2] SingleMessageSender: Send thread: STOP
[2021.01.10 21:14:06] [0022m.58s.748ms] [4] SingleMessageSender: Send thread: FINISHED
[2021.01.10 21:14:06] [0022m.58s.748ms] [3] SCQ: FREE
[2021.01.10 21:14:06] [0022m.58s.748ms] [3] MCQ: FREE
