(DEVICE FILE: )PACKAGE  QFN-76-EP_9x9
CLASS IC
PINCOUNT 77

PINORDER QFN-76-EP_9X9 9 8 77 76 75 74 73 72 71 70 7 69 68 67 66 65 64 63 62 61 60 6 59 58 57 56 55 54 53 52 51 50 5,
    49 48 47 46 45 44 43 42 41 40 4 39 38 37 36 35 34 33 32 31 30 3 29 28 27 26 25 24 23 22 21 20 2,
    19 18 17 16 15 14 13 12 11 10 1 
PINUSE QFN-76-EP_9X9 IN IN IN IN IN IN IN IN IN IN IN IN IN IN IN IN IN IN IN IN IN IN IN IN IN IN IN IN IN IN IN IN IN,
    IN IN IN IN IN IN IN IN IN IN IN IN IN IN IN IN IN IN IN IN IN IN IN IN IN IN IN IN IN IN IN IN IN,
    IN IN IN IN IN IN IN IN IN IN IN 
FUNCTION G1 QFN-76-EP_9X9 9 8 77 76 75 74 73 72 71 70 7 69 68 67 66 65 64 63 62 61 60 6 59 58 57 56 55 54 53 52 51 50 5,
    49 48 47 46 45 44 43 42 41 40 4 39 38 37 36 35 34 33 32 31 30 3 29 28 27 26 25 24 23 22 21 20 2,
    19 18 17 16 15 14 13 12 11 10 1 
END
