Running in Lattice mode

                               Synplify Pro (R) 

                Version U-2023.03L-SP1 for win64 - Aug 10, 2023 

                    Copyright (c) 1988 - 2023 Synopsys, Inc.
   This software and the associated documentation are proprietary to Synopsys,
 Inc. This software may only be used in accordance with the terms and conditions
 of a written license agreement with Synopsys, Inc. All other use, reproduction,
   or distribution of this software is strictly prohibited.  Licensed Products
     communicate with Synopsys servers for the purpose of providing software
    updates, detecting software piracy and verifying that customers are using
    Licensed Products in conformity with the applicable License Key for such
  Licensed Products. Synopsys will use information gathered in connection with
    this process to deliver software updates and pursue software pirates and
                                   infringers.

 Inclusivity & Diversity - Visit SolvNetPlus to read the "Synopsys Statement on
            Inclusivity and Diversity" (Refer to article 000036315 at
                        https://solvnetplus.synopsys.com)

Starting:    D:\diamond\diamond\3.13\diamond\3.13\synpbase\bin64\mbin\synbatch.exe
Install:     D:\diamond\diamond\3.13\diamond\3.13\synpbase
Hostname:    PC-SANDRO-W10
Date:        Tue Oct 15 20:40:59 2024
Version:     U-2023.03L-SP1

Arguments:   -product synplify_base -batch CPLD_PORTATILE_impl1_synplify.tcl
ProductType: synplify_pro




log file: "E:\Dropbox\Dropbox\Personale\progetti\Acube\cpld\impl1\CPLD_PORTATILE_impl1.srr"
Running: hdl_info_gen in foreground

Generating HDL info...
Copied E:\Dropbox\Dropbox\Personale\progetti\Acube\cpld\impl1\CPLD_PORTATILE_impl1.srr to E:\Dropbox\Dropbox\Personale\progetti\Acube\cpld\impl1\CPLD_PORTATILE_impl1.srf

hdl_info_gen completed
# Tue Oct 15 20:41:00 2024

Return Code: 0
Run Time:00h:00m:01s
log file: "E:\Dropbox\Dropbox\Personale\progetti\Acube\cpld\impl1\CPLD_PORTATILE_impl1.srr"
Running: impl1 in foreground

Running proj_1|impl1

Running Flow: compile (Compile) on proj_1|impl1
# Tue Oct 15 20:41:00 2024

Running Flow: compile_flow (Compile Process) on proj_1|impl1
# Tue Oct 15 20:41:00 2024

Running: compiler (Compile Input) on proj_1|impl1
# Tue Oct 15 20:41:00 2024
Copied E:\Dropbox\Dropbox\Personale\progetti\Acube\cpld\impl1\synwork\CPLD_PORTATILE_impl1_comp.srs to E:\Dropbox\Dropbox\Personale\progetti\Acube\cpld\impl1\CPLD_PORTATILE_impl1.srs

compiler completed
# Tue Oct 15 20:41:05 2024

Return Code: 0
Run Time:00h:00m:04s

Running: multi_srs_gen (Multi-srs Generator) on proj_1|impl1
# Tue Oct 15 20:41:05 2024

multi_srs_gen completed
# Tue Oct 15 20:41:06 2024

Return Code: 0
Run Time:00h:00m:01s
Copied E:\Dropbox\Dropbox\Personale\progetti\Acube\cpld\impl1\synwork\CPLD_PORTATILE_impl1_mult.srs to E:\Dropbox\Dropbox\Personale\progetti\Acube\cpld\impl1\CPLD_PORTATILE_impl1.srs
Copied E:\Dropbox\Dropbox\Personale\progetti\Acube\cpld\impl1\CPLD_PORTATILE_impl1.srr to E:\Dropbox\Dropbox\Personale\progetti\Acube\cpld\impl1\CPLD_PORTATILE_impl1.srf
Complete: Compile Process on proj_1|impl1

Running: premap (Premap) on proj_1|impl1
# Tue Oct 15 20:41:06 2024

premap completed with warnings
# Tue Oct 15 20:41:17 2024

Return Code: 1
Run Time:00h:00m:11s
Complete: Compile on proj_1|impl1

Running Flow: map (Map) on proj_1|impl1
# Tue Oct 15 20:41:17 2024
License granted for 4 parallel jobs

Running: fpga_mapper (Map & Optimize) on proj_1|impl1
# Tue Oct 15 20:41:17 2024
Copied E:\Dropbox\Dropbox\Personale\progetti\Acube\cpld\impl1\synwork\CPLD_PORTATILE_impl1_m.srm to E:\Dropbox\Dropbox\Personale\progetti\Acube\cpld\impl1\CPLD_PORTATILE_impl1.srm

fpga_mapper completed with warnings
# Tue Oct 15 20:41:33 2024

Return Code: 1
Run Time:00h:00m:15s
Complete: Map on proj_1|impl1
Copied E:\Dropbox\Dropbox\Personale\progetti\Acube\cpld\impl1\CPLD_PORTATILE_impl1.srr to E:\Dropbox\Dropbox\Personale\progetti\Acube\cpld\impl1\CPLD_PORTATILE_impl1.srf
Complete: Logic Synthesis on proj_1|impl1
TCL script complete: "CPLD_PORTATILE_impl1_synplify.tcl"
exit status=0
exit status=0
Save changes for project:
E:\Dropbox\Dropbox\Personale\progetti\Acube\cpld\impl1\proj_1.prj
batch mode default:no
